##TITLE=1H_ACP15-pH9
 D2O, 8 sc, 
 5.6.2019
##JCAMPDX= 6.0         $$ Bruker NMR JCAMP-DX V2.0
##DATA TYPE= NMR FID
##DATA CLASS= NTUPLES
##ORIGIN= UXNMR, Bruker Analytische Messtechnik GmbH
##OWNER= root
$$ XWIN-NMR		Version 3.5
$$ Wed Jun  5 15:40:19 2019 Russian Standard Time (UT+4h)  she@DPX200
##.OBSERVE FREQUENCY= 200.13155
##.OBSERVE NUCLEUS= ^1H
##.DELAY= (6, 6)
##.ACQUISITION MODE= SIMULTANEOUS
##.ACQUISITION SCHEME= undefined
##.AVERAGES= 8
##.DIGITISER RES= 18
##SPECTROMETER/DATA SYSTEM= spect
##.PULSE SEQUENCE= zg30
##.SOLVENT NAME= CDCl3
##.SHIFT REFERENCE= (INTERNAL, CDCl3, 0, 15.7039)
##AUDIT TRAIL= $$ (NUMBER, WHEN, WHO, WHERE, WHAT)
$$ ##TITLE= Audit trail, XWIN-NMR		Version 3.5
$$ ##JCAMPDX= 5.01
$$ ##ORIGIN= Bruker BioSpin GmbH
$$ ##OWNER= she
$$ F:/spectra/data/she/nmr/H-F/1/audita.txt
$$ ##AUDIT TRAIL=  $$ (NUMBER, WHEN, WHO, WHERE, WHAT)
(   1,<2019-06-05 15:39:18.81 +0400>,<she>,<DPX200>,
      <created by zg, POWCHK disabled, PULCHK disabled
       configuration hash MD5:
       00 E9 B6 7A A2 85 ED C7 34 08 36 98 17 FE 4E 26
       data hash MD5: 16K
       D3 70 6C 5A F9 6B 1F 01 D8 54 92 79 30 FC 59 75>)
$$ ##END=
$$ 
$$ hash MD5
$$ BA 3A B9 26 FE E8 64 DB B0 1A 51 AE 4F A3 E3 EA
##$RELAX= 
##$RELAX= 
##$RELAX= 
##$RELAX= 
##$RELAX= 
##$RELAX= 
$$ Bruker specific parameters
$$ --------------------------
##$DU= <F:/spectra>
##$EXPNO= 1
##$NAME= <H-F>
##$PROCNO= 1
##$TYPE= <nmr>
##$USER= <she>
##$AMP= (0..31)
100 100 100 100 100 100 100 100 100 100 100 100 100 100 100 100 100 100 
100 100 100 100 100 100 100 100 100 100 100 100 100 100 
##$AQSEQ= 0
##$AQ_mod= 1
##$AUNM= <au_zg>
##$AUTOPOS= <>
##$BF1= 200.13
##$BF2= 200.13
##$BF3= 200.13
##$BF4= 200.13
##$BF5= 200.13
##$BF6= 200.13
##$BF7= 200.13
##$BF8= 200.13
##$BYTORDA= 1
##$CFDGTYP= 0
##$CFRGTYP= 5
##$CHEMSTR= <none>
##$CNST= (0..31)
1 1 145 1 1 1 1 1 1 1 1 1 1 1 1 1 1 1 1 1 1 1 1 1 1 1 1 1 1 1 1 1 
##$CPDPRG= <>
##$CPDPRG1= <>
##$CPDPRG2= <>
##$CPDPRG3= <>
##$CPDPRG4= <mlev>
##$CPDPRG5= <mlev>
##$CPDPRG6= <mlev>
##$CPDPRG7= <mlev>
##$CPDPRG8= <mlev>
##$CPDPRGB= <>
##$CPDPRGT= <>
##$D= (0..31)
0 1.2 0 0 0 0 0 0 0 0 0 0.03 0 0 0 0 0 0 0 0 0 0 0 0 0 0 0 0 0 0 0 0 
##$DATE= 1559734758
##$DBL= (0..7)
120 120 120 120 120 120 120 120 
##$DBP= (0..7)
150 150 150 150 150 150 150 150 
##$DBP07= 0
##$DBPNAM0= <>
##$DBPNAM1= <>
##$DBPNAM2= <>
##$DBPNAM3= <>
##$DBPNAM4= <>
##$DBPNAM5= <>
##$DBPNAM6= <>
##$DBPNAM7= <>
##$DBPOAL= (0..7)
0.5 0.5 0.5 0.5 0.5 0.5 0.5 0.5 
##$DBPOFFS= (0..7)
0 0 0 0 0 0 0 0 
##$DE= 6
##$DECBNUC= <off>
##$DECIM= 24
##$DECNUC= <off>
##$DECSTAT= 4
##$DIGMOD= 1
##$DIGTYP= 9
##$DL= (0..7)
0 120 120 120 120 120 120 120 
##$DP= (0..7)
150 150 150 150 150 150 150 150 
##$DP07= 0
##$DPNAME0= <>
##$DPNAME1= <>
##$DPNAME2= <>
##$DPNAME3= <>
##$DPNAME4= <>
##$DPNAME5= <>
##$DPNAME6= <>
##$DPNAME7= <>
##$DPOAL= (0..7)
0.5 0.5 0.5 0.5 0.5 0.5 0.5 0.5 
##$DPOFFS= (0..7)
0 0 0 0 0 0 0 0 
##$DQDMODE= 0
##$DR= 18
##$DS= 0
##$DSLIST= <SSSSSSSSSSSSSSS>
##$DSPFIRM= 0
$$ [...]
##$SUBNAM2= <"">
##$SUBNAM3= <"">
##$SUBNAM4= <"">
##$SUBNAM5= <"">
##$SUBNAM6= <"">
##$SUBNAM7= <"">
##$SUBNAM8= <"">
##$SUBNAM9= <"">
##$SW= 24.9336996594482
##$SWIBOX= (0..15)
0 0 2 0 0 0 0 0 0 0 0 0 0 0 0 0 
##$SW_h= 4990.01996007984
##$TD= 16384
##$TD0= 1
##$TE= 0
##$TE2= 300
##$TE3= 300
##$TEG= 300
##$TL= (0..7)
0 120 120 120 120 120 120 120 
##$TP= (0..7)
150 150 150 150 150 150 150 150 
##$TP07= 0
##$TPNAME0= <>
##$TPNAME1= <>
##$TPNAME2= <>
##$TPNAME3= <>
##$TPNAME4= <>
##$TPNAME5= <>
##$TPNAME6= <>
##$TPNAME7= <>
##$TPOAL= (0..7)
0.5 0.5 0.5 0.5 0.5 0.5 0.5 0.5 
##$TPOFFS= (0..7)
0 0 0 0 0 0 0 0 
##$TUNHIN= 0
##$TUNHOUT= 0
##$TUNXOUT= 0
##$USERA1= <user>
##$USERA2= <user>
##$USERA3= <user>
##$USERA4= <user>
##$USERA5= <user>
##$V9= 5
##$VALIST= <valist>
##$VCLIST= <CCCCCCCCCCCCCCC>
##$VD= 0
##$VDLIST= <DDDDDDDDDDDDDDD>
##$VPLIST= <PPPPPPPPPPPPPPP>
##$VTLIST= <TTTTTTTTTTTTTTT>
##$WBST= 1024
##$WBSW= 4
##$XGAIN= (0..3)
0 0 0 0 
##$XL= 0
##$YL= 0
##$YMAX_a= 67258
##$YMIN_a= -74370
##$ZGOPTNS= <>
##$ZL1= 120
##$ZL2= 120
##$ZL3= 120
##$ZL4= 120
##$ABSF1= 10
##$ABSF2= 0
##$ABSG= 5
##$ABSL= 3
##$ALPHA= 0
##$AQORDER= 0
##$ASSFAC= 0
##$ASSFACI= 0
##$ASSFACX= 0
##$ASSWID= 0
##$AUNMP= <proc_1d>
##$AZFE= 0.1
##$AZFW= 0.1
##$BCFW= 1
##$BC_mod= 2
##$BYTORDP= 1
##$COROFFS= 0
##$CY= 11.3945322036743
##$DATMOD= 1
##$DC= 2
##$DFILT= <>
##$DTYPP= 0
##$F1P= 18.9103706918063
##$F2P= -1.10871071338519
##$FCOR= 0.5
##$FTSIZE= 0
##$FT_mod= 4
##$GAMMA= 1
##$GB= 0.15
##$INTBC= 1
##$INTSCL= 1
##$ISEN= 128
##$LB= 0.24
##$LEV0= 0
##$LPBIN= 0
##$MAXI= 10000
##$MC2= 0
##$MEAN= 0
##$ME_mod= 0
##$MI= 1.114404
##$NCOEF= 0
##$NC_proc= 0
##$NLEV= 6
##$NOISF1= 3.799351
##$NOISF2= 2.8
##$NSP= 1
##$NTH_PI= 0
##$NZP= 0
##$OFFSET= 15.70392
##$PC= 1
##$PHC0= -8534.711
##$PHC1= 68.80018
##$PH_mod= 1
##$PKNL= yes
##$PPARMOD= 0
##$PSCAL= 0
##$PSIGN= 0
##$REVERSE= no
##$SF= 200.130013532006
##$SI= 16384
##$SIGF1= 3
##$SIGF2= 2
##$SINO= 400
##$SIOLD= 16384
##$SREGLST= <1H.CDCl3>
##$SSB= 0
##$STSI= 0
##$STSR= 0
##$SW_p= 3612.71676300578
##$SYMM= 0
##$S_DEV= 0
##$TDeff= 0
##$TDoff= 0
##$TI= <>
##$TILT= no
##$TM1= 0
##$TM2= 0
##$TOPLEV= 0
##$USERP1= <user>
##$USERP2= <user>
##$USERP3= <user>
##$USERP4= <user>
##$USERP5= <user>
##$WDW= 1
##$XDIM= 8192
##$YMAX_p= 0
##$YMIN_p= 0
$$ End of Bruker specific parameters
$$ ---------------------------------
##NTUPLES= NMR FID
##VAR_NAME=  TIME,          FID/REAL,        FID/IMAG
##SYMBOL=    X,             R,               I
##VAR_TYPE=  INDEPENDENT,   DEPENDENT,       DEPENDENT
##VAR_FORM=  AFFN,          ASDF,            ASDF
##VAR_DIM=   8192,          8192,            8192
##UNITS=     SECONDS,       ARBITRARY UNITS, ARBITRARY UNITS
##FACTOR=    0.0002004,     1,               1
##FIRST=     0,             0,               0
##LAST=      1.6414764,     0,               0
##MIN=       0,             -74370,          0
##MAX=       1.6414764,     67258,           0
$$ Real data points
##PAGE= N=1
##DATA TABLE= (X++(R..R)), XYDATA
$$ [...]
$$ plain form
2772 547 -3631 -5587 -4632 -702 2932 5558 4548 1336 -2665 -5292 -4794 -2051 2306 4983 5064 2220
2788 2220 -1668 -4834 -5161 -2935 1048 4624 5363 3185 -607 -4293 -5485 -3523 490 4051 5523
2803 5523 3962 442 -3716 -5325 -4184 -557 3095 5354 4452 1153 -2668 -5355 -4853 -1728 2592
2818 2592 5055 5072 2168 -1717 -4850 -4986 -2449 1270 4863 4977 3091 -1156 -4498 -5242 -3469 440
2834 440 4103 5408 3715 -125 -3966 -5319 -3947 -473 3556 5271 4085 985 -2995 -5309 -4649
2849 -4649 -1388 2453 5118 4825 1846 -2200 -4918 -4676 -2297 1974 4792 4968 2534 -1451 -4496 -5001
2865 -5001 -3037 914 4118 5172 3506 -550 -3847 -5380 -3633 65 3607 4909 4073 552 -3125
2880 -3125 -5205 -4218 -1128 2938 5189 4454 1736 -2382 -4620 -4915 -1856 1861 4824 4926 2264 -1157
$$ packed form
2772E47m178j956R55L930L634K626j010l212m001k627M98K743M357K677Q1k844
2788B220l888l166l27K226L983L576P39k178l792l686j192J962M013L561J472
2803E523j561l520m158j609J141L627L652K259r02l299l821k687N02L125M320
2818B592K463J7k904l885l133j36K537L719L593J14j886m247l342p44J773L909
2834D40L663J305j693l840l841j353J372L474M029J715j186l100l980k314O60
2849d649L261L841K665k93k979m046k718K42K379M271K818J76k434l985l045n05
2865e001J964L951L204J054j666m056l297j533J747L698L542J302q36l521l677
2880c125k080R87L090M066K251p35k718m118k238k95L059L717K963J02k662l421
$$ plain form
2896 -1157 -4454 -4884 -2829 890 4113 4986 3129 -565 -4098 -4999 -3435 -48 3680 4923 3849 -19
2912 -19 -3377 -5270 -3906 -595 2715 5013 4273 1215 -2424 -4625 -4137 -1643 2346 4334 4679 2331
2928 2331 -1568 -4410 -4670 -2489 1401 4547 4874 2761 -861 -3854 -4974 -3199 307 3768 5205
2943 5205 3445 87 -3219 -4952 -3559 -735 3052 4805 4145 1091 -2719 -5000 -4508 -1607 2092
2958 2092 4674 4648 1905 -1971 -4432 -4695 -2511 1319 4585 4821 2600 -1027 -4188 -4700 -3086 601
2974 601 3521 4935 3472 -211 -3232 -4786 -3634 -439 3022 4687 3848 656 -2665 -4644 -4227 -1387
2990 -1387 2375 4268 4473 1925 -1895 -4405 -4382 -2348 1596 4474 4684 2326 -877 -4052 -4632 -2385
3006 -2385 706 3637 4793 3105 -644 -3613 -4868 -3876 -726 3236 4480 4004 594 -3006 -4722
$$ packed form
2896a157l297m30K055L719L223Q73j857l694l533r01J564L387L728J243j074l868
2912a9l358j893J364L311L310K298p40l058l639k201M88K494L989J988L45k348
2928B331l899k842k60K181L890L146L27k113l622k993j120J775L506L461J437
2943E205j760l358l306j733J393K824L787J753o60l054l810k281M92K901L699
2958B092K582k6k743l876k461k63K184L830L266K36k221l627l161n12J614L687
2974F01K920J414j463l683l021j554J152L195L461J665q39l192l321j979M17K840
2990a387L762J893K05k548l820k510K3K034L944K878K10k358l203l175n80K247
3006b385L091K931J156j688l749k969j255R92L150L962J244m76l410l600j716
$$ plain form
3021 -4722 -3824 -969 2360 4721 3736 1247 -1850 -4562 -4483 -1761 1929 4288 4501 2174 -1270 -4112
3037 -4112 -4487 -2385 580 3614 4833 2639 -403 -3387 -4599 -3179 28 3472 4368 3498 377 -3143
3053 -3143 -4587 -3770 -1056 2661 4430 4029 1240 -2457 -4244 -4048 -1276 2137 4120 4351 2134 -1565
3069 -1565 -4073 -4529 -2304 1182 3711 4686 2829 -529 -3626 -4574 -3135 462 3557 4456 3299 303
3085 303 -3233 -4695 -3526 -487 2950 4050 3903 944 -2434 -4406 -3891 -1231 1935 4150 4142 1517
3101 1517 -1877 -3947 -4211 -2159 1509 4160 4481 2243 -711 -3863 -4518 -2910 367 3605 4521 3053
3117 3053 6 -3091 -4429 -3500 -474 2716 4529 3467 637 -2611 -4433 -3760 -1383 1941 4275
3132 4275 4040 1581 -1670 -3723 -3985 -2004 1341 4024 4242 2353 -1275 -3900 -4529 -2623 815 3337
$$ packed form
3021d722Q98K855L329K361r85k489l097k712P9K722L690K359K13k327l444k842
3037d112l75K102K965L034J219k194l042k984j212J420L207L444Q96q70l121l520
3053c143j444Q17K714L717J769m01k789l697j787J96K772L413J983K31k217l699
3069a565k508m56K225L486K529R75j857l358l097r48J439L597L095Q99j157k996
3085C03l536j462J169L039L437J100j47k959l378j972N15K660L166K215qk625
3101A517l394k070k64K052L668K651L21k238k954l152o55J608L277L238R16j468
3117C053l047l097j338R29L026L190J813j062k830l248j822O73K377L324K334
3132D275k35k459l251k053k62J981L345K683K18j889l628k625o29J906L438K522
$$ plain form
3148 3337 4511 2800 -516 -3004 -4534 -3190 -83 2947 4456 3414 561 -2681 -4165 -3708 -838
3163 -838 2438 4380 3614 1113 -1931 -4212 -3606 -1461 1369 4088 3895 2037 -1330 -3660 -4335 -2051
3179 -2051 1210 3761 4235 2374 -415 -3007 -4207 -3014 409 2937 4144 3092 300 -2509 -4117
3194 -4117 -3209 -929 2430 4228 3572 1217 -2192 -3837 -3778 -1481 1662 4214 4155 1924 -1442 -3821
3210 -3821 -3525 -2195 905 3636 3920 1976 -864 -3275 -4060 -2612 450 2903 4333 2707 322 -3202
3226 -3202 -3970 -3317 -540 2812 3995 3400 798 -2390 -4140 -3661 -1247 1804 4035 3519 1323 -1672
3242 -1672 -3842 -3611 -1700 1320 3546 4103 2073 -790 -3224 -4217 -2341 690 3064 4132 2572 -46
3258 -46 -3116 -4099 -2954 -13 2711 4030 3242 374 -2418 -3885 -3260 -777 2186 3937 3626 1211
$$ packed form
3148C337J174j711l316k488j530J344L107L030J509j042k853l242j484M57K870
3163h38L276J942p66k501l044k281O06K145K830K719j93j858l367k330o75K284
3179b051L261K551M74j861k789k592j200J193L423K528J207j052k792k809j608
3194d117R08K280L359J798o56k355l409j645N9K297L143K552n9k231l366k379
3210c821K96J330L100K731K84j944k840k411p85J448L062K453J430j626k385l524
3226c202p68O53K777L352J183n95k602l188j750M79K414L051K231n16k196k995
3242a672k170K31J911L020K226N57k030k863k434r93J876L031K374J068j560k618
3258d6l070r83J145K941K724J319p88k868k792j467O25K483K963J751l11k415
$$ plain form
3274 1211 -1504 -3875 -3445 -1658 1364 3294 3901 1986 -1267 -3268 -3859 -2378 984 3276 3965 2636
3290 2636 -572 -3165 -4114 -2606 130 2739 3987 2871 392 -2272 -4052 -3303 -1063 2014 3834
3305 3834 3388 1083 -2197 -3663 -3446 -1116 1508 3722 3470 1647 -1228 -3408 -3715 -1819 699 3118
3321 3118 3673 2414 -499 -3031 -3980 -2484 232 2739 3685 2941 154 -2544 -4209 -2832 -424 2285
3337 2285 3721 3257 946 -2316 -3671 -3225 -903 1799 3492 3844 1159 -1110 -3672 -3648 -1624 1124
3353 1124 3460 3696 1841 -791 -3163 -3717 -2226 341 3000 3935 2565 -275 -2728 -4123 -2665 -362
3369 -362 2464 3780 2978 405 -2055 -3471 -2773 -787 1812 3591 3578 1293 -1557 -3403 -3481 -1707 1340
3386 1340 3441 3582 1966 -766 -3110 -3673 -2001 739 2986 3881 2186 -388 -2762 -3519 -2644 -233
$$ packed form
3274A211k715k371M30J787L022J930O07j915l253k001n91J481L362K292O89j329
3290B636l208k593r49J508K736K609J248j116k479k664j780P49K240L077J820
3305C834m46k305l280j466K17K330K624K214k52j823k875k180l07J896K518K419
3321C118N55j259k913k532r49J496K716K507R46p44k787k698j665J377K408K709
3337B285J436m64k311l262j355M46K322K702J693L52k685k269k562K4K024K748
3353A124K336K36j855k632k372n54J491K567K659R35j370k840k453j395J458K303
3369c62K826J316q02k573k460j416O98J986K599J779j3k285k850j846p8J774L047
3386A340K101J41j616k732k344n63J672K740K247Q95j695k574k374p57Q75K411
$$ plain form
3402 -233 2207 3640 2760 196 -2203 -4053 -3063 -637 1880 3575 3283 1012 -1711 -3409 -3044 -1130
3418 -1130 1029 3335 3472 1266 -1063 -3393 -3644 -2141 899 3018 3655 1942 -395 -2875 -3548 -2020
3434 -2020 132 2531 3911 2809 287 -2227 -3696 -2652 -627 1881 3240 2912 538 -1840 -3280
3449 -3280 -3225 -785 1694 3470 3136 1194 -1055 -3150 -3154 -1659 1020 2887 3504 1906 -439 -2913 -3480
3466 -3480 -2062 409 2480 3468 2576 -143 -2608 -3390 -2452 -282 2210 3572 2641 569 -1869 -3613
3482 -3613 -2825 -724 1593 3294 2860 1122 -1415 -3135 -2932 -1538 1123 3279 3244 1704 -804 -2754
3498 -2754 -3397 -1986 709 2880 3753 2398 -82 -2068 -3577 -2082 -303 2457 3206 2533 369 -2141
3514 -2141 -3528 -2891 -613 1776 3407 2937 962 -1526 -3052 -3094 -1551 1259 3102 3297 1548 -877
$$ packed form
3402b33K440J433q80k564k399j850R90K426K517J695k92k271k723j698L65J914
3418a130K159K306J37k206k329k330k51J503L040K119O37j713k337k480o73J528
3434b020K152K399J380j102k522k514j469J044K025K508J359l28k374k378j440
3449c280N5K440K479J776l34j942k249k095mJ495K679J867O17j598k345k474n67
3466c480J418K471K071R88q92k719k465p82R38K170K492J362r31k072k438j744
3482c613P88K101K317J701m34j738k537j720K03J394K661K156l5j540k508j950
3498b754o43J411K695K171Q73j355k480j986j509J495J779K760P49o73k164k510
3514b141j387O37K278K389J631m70j975k488j526m2J543K810J843J95j749k425
$$ plain form
3530 -877 -2641 -3123 -1657 357 3065 3338 2366 -221 -2419 -3168 -2193 158 2516 3414 2413 52 -2243
3547 -2243 -3200 -2678 -761 1902 3293 2804 903 -1614 -3252 -3062 -1110 1325 2984 3009 1441 -1110
3563 -1110 -2930 -3115 -1694 805 2789 3537 1659 -277 -2662 -3375 -2002 76 2352 3498 2402 162
3579 162 -2159 -3067 -2671 -184 1991 3261 2748 578 -1767 -3121 -2739 -1194 1654 2880 2796 1332 -1152
3596 -1152 -2843 -2901 -1782 1092 2792 2764 1775 -825 -2711 -2964 -2065 474 2389 2942 2310 7 -2228
3613 -2228 -3155 -2085 -451 1766 2990 2654 579 -1870 -2894 -2757 -795 1656 2916 2723 1091 -1184
3629 -1184 -2856 -2992 -1636 835 2917 3010 1576 -859 -2578 -3028 -1641 207 2364 3076 2223 -210
3645 -210 -2109 -3187 -2349 -332 1968 3135 2615 629 -1851 -3162 -2461 -576 1691 2852 2555 1166
$$ packed form
3530h77j764m82J466K014K708K73r72k587k198p49R75K351K358Q98j001k361k295
3547b243r57N22J917K663J391m89j901k517j638J90J952K435J659K5j568k551
3563a110j820j85J421K499J984P48j878j936k385p13J373K078K276J146j096k240
3579A62k321r08L96K487K175J270n13k170k345j354L82J545K848J226q4j464k484
3596a152j691n8J119K874J700k8r89k600j886k53Q99K539J915N53o32k303k235
3613b228r27J070J634K217J224l36k075k449j024J37J962K451J260j93j632k275
3629a184j672j36J356K471K082R3j434k435j719m50J387J848K157P12q53k433
3645b10j899j078Q38K017K300J167n20j986k480j311P01J885K267J161k97j389
$$ plain form
3661 1166 -1423 -2884 -2854 -1326 1032 2928 2763 1276 -852 -2315 -2720 -1549 441 2493 3013 2007
3677 2007 -282 -2089 -3138 -2295 65 2046 2970 2115 120 -1852 -3114 -2239 -360 1970 3023 2663
3693 2663 747 -1494 -2677 -2976 -1001 1205 2625 2862 1135 -994 -2581 -2928 -1495 478 2416 3010
3709 3010 1616 -480 -1967 -2853 -2056 41 2056 2958 2204 154 -1778 -3234 -2459 -80 1909 2676
3725 2676 2282 646 -1242 -3064 -2566 -842 1329 2574 2666 1246 -1095 -2383 -3071 -1587 1044 2494
3741 2494 2868 1548 -665 -2250 -3187 -1757 109 1990 2913 2009 -37 -1867 -2864 -2067 -346 1876
3757 1876 3091 2408 588 -1557 -3036 -2530 -1007 1042 2523 2419 897 -1174 -2408 -2778 -1090 848
3773 848 2341 2912 1450 -498 -2303 -2615 -1732 296 2022 2796 1695 -107 -1959 -3046 -2249 -425
$$ packed form
3661A166k589j461L0J528K358J896j65j487k128j463m05J171J990K052N20j006
3677B007k289j807j049Q43K360J981R24q55j995j972j262Q75J879K330J053l60
3693B663j916k241j183k99J975K206J420K37j727k129j587l47J433J973J938N94
3709C010j394k096j487q86P97K097K015R02p54k050j932j456P75K379J989P67
3725B676l94j636j888j822M98J724K171J245R2j420k341j288o88J484K631J450
3741B494L74j320k213j585r37J430J866J881R23r04k046j830r97P97J721K222
3757A876J215o83j820k145j479N06J523K049J481j04j522k071j234l70J688J938
3773H48J493N71j462j948j805l12Q83K028J726P74j101j802j852j087P97J824
$$ plain form
3789 -425 1987 2878 2103 119 -1878 -2522 -2221 -549 1439 2552 2256 855 -901 -2495 -2507 -1334 1151
3806 1151 2294 2566 1359 -496 -2198 -2754 -1586 484 1968 2505 1737 -291 -1884 -2780 -2138 -134
3822 -134 1813 2777 1975 373 -1895 -2819 -2022 -439 1223 2730 2292 699 -1126 -2449 -2465 -1177 980
3839 980 2387 2418 881 -959 -2618 -2452 -1212 709 2194 2494 1905 -110 -2059 -2754 -1638 32 1621
3856 1621 2911 2007 -17 -1880 -2581 -2192 -315 1657 2533 2010 681 -1321 -2642 -2409 -796 1083
3872 1083 2518 2588 1208 -595 -2323 -2812 -1366 999 2028 2302 1434 -531 -1748 -2550 -1404 191
3888 191 1822 2518 1847 29 -1473 -2640 -1928 -283 1770 2842 2050 461 -1185 -2542 -2251 -741
3904 -741 964 2428 2297 781 -1024 -2378 -2442 -1156 880 2153 2876 1444 -676 -2245 -2335 -1550 391
$$ packed form
3789d25K412Q91p75j984j997o44L01J672J988J113k96j401j756j594j2J173K485
3806A151J143K72j207j855j702n56J168K070J484N37p68k028j593q96O42K004
3822a34J947R64q02j602k268r24P97J583J662J507m38j593j825j323j6J288K157
3839I80J407L1j537j840j659J66J240J921J485L00n89k015j949o95J116J670J589
3856A621J290r04k024j863p01L89J877J972Q76n23j329k002j321K33J613J879
3872A083J435P0j380j803j728m89J446K365J029K74q68j965j217q02J146J595
3888A91J631O96o71j818j502j167P12J645K053J072p92j589j646j357K91J510
3904g41J705J464j31j516j805j354o4J286K036J273P23j432k120j569r0P85J941
$$ plain form
3921 391 2012 2447 1802 158 -1856 -2471 -1756 25 1800 2562 2101 276 -1625 -2462 -2165 -800 1580
3938 1580 2428 2184 670 -1304 -2343 -2099 -778 882 2274 2295 1363 -816 -2208 -2159 -1541 481 2098
3955 2098 2363 1913 -579 -1934 -2600 -1841 14 1765 2409 1912 100 -1629 -2646 -1955 -439 1329 2309
3972 2309 2248 420 -1369 -2591 -2128 -620 1025 2173 2392 1040 -924 -2351 -2281 -1112 443 2126
3988 2126 2500 1380 -320 -1728 -2514 -1745 180 1643 2325 1680 -142 -1898 -2205 -1892 -147 1536 2461
4005 2461 1841 581 -1238 -2483 -2326 -988 1106 1990 2017 795 -907 -2273 -2274 -893 565 2239 2131
4022 2131 1424 -252 -1784 -2384 -1416 58 1749 2168 1733 -43 -1956 -2416 -1693 63 1424 2535 1960
4039 1960 539 -1588 -2130 -2180 -836 966 2336 1959 801 -926 -2142 -2367 -861 623 2006 2467
$$ packed form
3921C91J621M35o45j644k014o15P15J781J775P62m61j825j901q37K97J365K380
3938A580Q48k44j514j974j039K44J321J660J392K1r32k179j392M9O18K022J617
3955B098K65m50k492j355o66P59J855J751O44m97j812j729j017O91J516J768R80
3972B309o1j828j789j222M63J508J645J148K19j352j964j427P0J169J555J683
3988B126L74j120j700j408p86P69J925J463O82o45j822j756l07L13J745J683R25
4005B461o20j260j819j245J57J338K094Q84K7j222j702j366jJ381J458J674j08
4022B131p07j676j532o00R68J474J691M19m35j776j913m60P23J756J361J111n75
4039A960j421k127n42n0J344J802J370l77j158j727j216k25J506J484J383M61
$$ plain form
4055 2467 1277 -777 -1863 -2213 -1073 457 1961 2557 1334 -160 -1677 -2306 -1840 -117 1539 2121
4071 2121 1831 -160 -1564 -2222 -1371 -445 1633 2316 1973 979 -980 -2473 -2128 -770 828 1927 2320
4088 2320 1138 -660 -2189 -2311 -1134 347 1715 2292 1144 -270 -1714 -2158 -948 -172 1634 2462
4104 2462 1699 297 -1614 -2315 -1687 -165 1325 2359 1919 457 -1221 -2239 -1849 -763 1065 2184
4120 2184 2026 939 -1023 -2020 -2260 -769 769 1872 2338 1083 -492 -1714 -2583 -1465 144 1675
4136 1675 2423 1583 123 -1399 -2246 -1687 -78 1428 1947 1779 381 -1272 -2063 -1856 -348 823 2233
4153 2233 2013 790 -934 -1920 -2017 -982 541 2097 1754 993 -554 -2053 -1787 -1242 131 1785 2231
4170 2231 1428 -365 -1577 -2271 -1501 -77 1460 2273 1524 432 -1494 -2311 -1656 -649 1507 1809 1772
$$ packed form
4055B467j190k054j086l50J140J530J504N96j223j494j517o29M66J723J656N82
4071B121k90j991j404o58Q51R26K078O83l43r94j959j493L45J358J598J099L93
4088B320j182j798j529j22J177J481J368N77j148j414j444m44J210P76J806Q28
4104B462p63j402j911p01O28J522J490J034m40j462j678j018L90J086J828J119
4120B184j58j087j962r97k40J491J538J103M66j255j575j222q69J118J609J531
4136A675P48q40j460j522q47N59J609J506N19j68j398j653p91K07J508J171J410
4153B233k20j223j724r86r7J035J523J556l43p61j547j499K66N45J373J654M46
4170B231q03j793j212o94P70J424J537Q13p49j092j926q17O55J007K156L02l7
$$ plain form
4187 1772 491 -1166 -1882 -1881 -620 465 2025 2090 1059 -649 -1827 -2081 -1079 487 1731 1874 1209
4204 1209 -193 -1732 -2127 -1362 -298 1387 2307 1418 301 -1095 -2122 -1831 -156 1167 2032 1817 492
4221 492 -1154 -2096 -1887 -805 998 2410 1835 700 -390 -1805 -1921 -1029 256 1900 2001 857 -695
4238 -695 -1794 -2195 -1298 366 1656 2062 1533 -71 -1290 -2032 -1812 168 1294 2352 1729 422 -1459
4255 -1459 -2081 -1874 -484 838 1797 1773 884 -859 -2000 -2034 -1002 751 2138 1856 1141 -620 -1876
4272 -1876 -1983 -1381 525 1541 1893 1300 -110 -1791 -1840 -1552 90 1503 1821 1714 31 -1242 -1967
4289 -1967 -1937 -675 1040 1992 1821 506 -1030 -1906 -1925 -876 789 1795 1917 882 -238 -1585 -1986
4306 -1986 -858 392 1786 1962 1399 -494 -1622 -1796 -1420 69 1399 1663 1508 155 -1449 -1839 -1607
$$ packed form
4187A772j281j657p16JJ261J085J560O5j031j708j178k54J002J566J244J43o65
4204A209j402j539l95P65J064J685R20q89j117j396j027K91J675J323Q65k15j325
4221D92j646r42K09J082J803J412n75j135j090j415j16Q92J285J644J01j144j552
4238f95j099m01Q97J664J290M06n29j604j219p42K20J980J126J058o23j307j881
4255a459o22K07J390J322R59k4q89j743j141l4J032J753J387k82p15j761j256
4272a876j07O02J906J016L52n93j410j681m9K88J642J413L18j07j683j273p25
4289a967L0J262J715R52j71j315j536q76j9J049J665J006J22j035j120j347m01
4306a986J128J250J394J76n63j893j128j74L76J489J330K64j55j353j604l90K32
$$ plain form
4323 -1607 -437 1046 1918 1753 785 -1022 -2074 -1647 -605 661 1852 1877 686 -1156 -1755 -1779 -999
4340 -999 457 1544 1827 1101 -215 -1483 -1944 -1505 -143 1273 1732 1778 230 -1119 -2073 -1495 -120
4357 -120 1399 1863 1385 630 -909 -1828 -1694 -366 946 2003 1977 654 -618 -1435 -1738 -862 327 1621
4375 1621 1608 1167 -413 -1779 -1875 -1167 353 1648 1834 1140 183 -1446 -2225 -1449 -269 1179 2072 1436
4393 1436 580 -990 -1839 -1501 -533 796 1765 2045 1074 -548 -1640 -1474 -629 318 1367 1789 593 -470
4411 -470 -1366 -1669 -1285 -19 1302 1690 1221 -134 -1429 -1904 -1534 -228 1242 1796 1564 48 -1017
4428 -1017 -1820 -1530 -385 1244 1662 1367 474 -741 -1685 -1426 -687 500 1731 1761 1017 -362 -1612 -1762
4446 -1762 -1277 80 1523 1857 1105 -316 -884 -1869 -1800 143 1284 1878 1448 41 -870 -1871 -1916 -234
$$ packed form
4323a607J170J483Q72j65r68j807j052M27J042J266J191K5j191j842n99k4P80
4340i99J456J087K83p26j316j268m61M39J362J416M59M6j548j349r54N78J375
4357a20J519M64m78p55j539r19J34J328J312J057k6j323j272q17l03Q76J189J294
4375A621j3m41j580j366r6P08J520J295J86o94r57j629p79P76J180J448Q93o36
4393A436q56j570q49L38R68J329R69K80r71j622j092J66Q45R47J049M22j196j063
4411d70q96l03L84J266J321L88m69j355j295m75L70J306J470N54k32j516j065
4428a017q03K90J145J629M18k95q93j215r44K59P39J187J231L0p44j379j250j50
4446a762M85J357J443L34p52j421n68r85O9J943J141N94m30j407r11j001m5J682
$$ plain form
4464 -234 942 1765 1557 362 -1000 -1747 -1521 -518 581 1636 1529 563 -594 -1717 -1835 -1027 741
4481 741 1810 1895 1066 -292 -1815 -1909 -1341 130 1523 1566 1331 53 -1046 -1947 -1313 15 972 1955
4499 1955 1359 43 -1142 -1837 -1602 -440 822 1540 1520 785 -572 -1618 -1642 -711 552 1398 1749 938
4517 938 -434 -1209 -1565 -639 58 1177 1461 1130 144 -1248 -1696 -1366 17 1295 1719 1290 370 -544
4535 -544 -1681 -1612 -723 577 1355 1731 453 -714 -1608 -1687 -696 445 1545 1382 867 -659 -1331 -1624
4553 -1624 -1019 547 1380 1597 995 -356 -1114 -1664 -1259 15 1083 1874 1396 188 -810 -1649 -1059 -101
4571 -101 742 1751 1242 696 -941 -1905 -1500 -395 629 1538 1512 653 -309 -1085 -1895 -1058 489 1263 1693
4590 1693 1252 -56 -1366 -1496 -1214 -88 1117 1654 1097 153 -1038 -1547 -1112 -194 1040 1264 1439 389
$$ packed form
4464b34J176Q23k08j195j362p47K26J003J099J055j07r66j157j123j18Q08J768
4481G41J069Q5q29j358j523r4N68J471J393M3k35j278j099r01O34J328R57R83
4499A955n96j316j185o95K35J162J262P18k0p35j357j046k4R31J263Q46L51q11
4517I38j372p75l56R26O97J119K84l31r86j392m48L30J383J278M24m29r20r14
4535e44j137O9Q89J300P78L76j278j167q94p9R91J141J100j63n15j526o72k93
4553a624O05J566Q33K17o02j351p58n50M05J274J068P91m78j208r98q39N90R58
4571a01Q43J009n09n46j637r64M05J105J024R09k6q59r62p76q10Q37J547P74M30
4590A693m41j308j310j30K82J126J205N37n57r44j191n09M35R18J234K24J75j050
$$ plain form
4608 389 -502 -1536 -1417 -350 464 1649 1617 591 -304 -1695 -1646 -583 367 1242 1540 840 32 -1238
4626 -1238 -1668 -1130 -157 1111 1700 1252 -16 -882 -1603 -1173 -296 883 1515 1443 337 -916 -1680 -1522
4644 -1522 -440 908 1517 1239 473 -851 -1369 -1556 -708 416 1355 1485 713 -212 -1415 -1549 -1088 243
4662 243 1132 1829 1324 -158 -1115 -1665 -1050 92 776 1481 1343 -65 -1046 -1489 -1231 -56 790 1523 1607
4681 1607 497 -319 -1374 -1179 -444 763 1585 1595 976 -413 -1431 -1682 -682 475 1499 1914 1215
4698 1215 -129 -1276 -1404 -980 2 1260 1638 1264 89 -895 -1468 -1061 -424 661 1386 1049 389 -803
4716 -803 -1700 -1534 -704 853 1732 1335 510 -530 -1362 -1589 -737 451 1161 1319 764 -418 -1303 -1641 -1003
4735 -1003 163 936 1595 1458 -129 -978 -1504 -1407 -248 1118 1624 1381 106 -879 -1239 -1182 -470 599
$$ packed form
4608C89q91j034J19J067Q14J185l2j026q95j391M9J063R50Q75K98p00q08j270
4626a238m30N38R73J268N89m48j268q66p21M30Q77J179O32p2j106j253p64J58
4644a522J082J348O09k78p66j324n18j87Q48J124R39J30p72r25j203j34M61J331
4662B43Q89O97n05j482r57n50O15J142O84P05j38j408r81m43K58J175Q46P33Q4
4681A607j110q16j055J95P35J207Q22J0o19j389j018k51J000J157J024M15o99
4698A215j344j147j28M24R82J258L78l74j175r84n73M07O37J085P25l37o60j192
4716h03q97J66Q30J557Q79l97q25j040q32k27Q52J188P10J58n55j182q85l38O38
4735a003J166P73O59j37j587q49n26R7J159J366N06k43j275r85l60N7P12J069
$$ plain form
4753 599 1546 1601 450 -437 -1669 -1316 -691 718 1360 1576 780 -400 -1392 -1783 -839 188 952 1620 760
4772 760 48 -1044 -1139 -1032 -185 1091 1471 668 50 -1010 -1240 -901 -116 643 1490 1250 207 -639 -1317
4791 -1317 -1579 -529 467 1182 1182 713 -651 -1325 -1298 -1192 320 1167 1321 736 -215 -1067 -1435 -883 -201 1004
4811 1004 1830 877 54 -680 -1366 -1156 -253 897 1184 1382 299 -561 -1599 -1363 -706 446 1399 1218
4829 1218 629 -431 -1294 -1207 -648 252 1114 1270 971 48 -1134 -1455 -869 -80 1202 1199 685 239 -891
4848 -891 -1369 -1197 -441 662 1506 1066 247 -680 -1417 -1183 -636 524 1140 1354 355 -397 -1311 -1212 -563 322
4868 322 881 1353 1068 -310 -951 -1251 -1061 148 872 1433 877 127 -857 -1729 -1051 -60 808 1286 1119
4887 1119 62 -793 -1210 -1145 -338 618 1539 1101 349 -515 -1291 -1166 -439 305 888 1311 519 -337 -1151 -1409
$$ packed form
4753E99R47N5j151q87j232L53O25J409O42K16p96j180r92l91R44J027P64O68q60
4772G60p12j092r5J07Q47J276L80q03o18j060k30L39P85P59Q47k40j043q46o78
4791a317k62J050R96P15%m69j364o74K7J06J512Q47J54n85r51q52l68N52O82J205
4811A004Q26r53q23p34o86K10R03J150K87J98j083q60j038K36O57J152R53j81
4829A218n89j060q63Q7N59R00Q62J56k99r23j182l21N86P89J282ln14m46j130
4848h91m78J72P56J103Q44m40q19r27p37K34N47J160O16K14r99p52r14R9O49Q85
4868C22N59M72k85j378o41l00J90J209P24N61n56p50r84q72O78R91Q68M78j67
4887A119j057q55m17O5Q07R56R21m38p52q64p76J25P27P44N83M23p92q56q14k58
$$ plain form
4907 -1409 -601 292 854 1272 502 140 -1019 -1415 -1132 -171 871 1242 1006 -54 -893 -1529 -1379 -481 676
4926 676 1271 1395 104 -720 -1254 -1349 -728 621 1407 1100 597 -378 -1290 -1041 -798 112 1208 1700 770
4945 770 62 -977 -1444 -1341 -96 853 1105 1065 -39 -924 -1307 -1070 -234 813 1479 1341 615 -243 -1389
4964 -1389 -1191 -568 516 1438 1333 728 -558 -1425 -1122 -753 331 1125 1175 799 -15 -688 -1417 -1106 144
4983 144 936 1319 1033 44 -837 -1296 -964 -386 697 1403 1160 460 -368 -1295 -893 -629 259 1203 1363 428
5003 428 -453 -1018 -1472 -824 392 1381 1355 727 -180 -1192 -1222 -866 286 833 998 901 168 -859 -1375 -933
5023 -933 -258 690 1236 1166 126 -658 -1133 -994 -594 779 1011 1128 406 -246 -1531 -1359 -755 291 1245
5042 1245 1088 603 -362 -1098 -1152 -1108 173 1039 1211 806 -277 -845 -1188 -1074 -91 700 1084 1092 565 -809
$$ packed form
4907a409Q08Q93N62M18p70l62j159l96K83R61J042L71k36j060q39o36J50Q98J157
4926F76N95J24j291q24n34r5O21J349P86l07n03r75r12K49K43R10J096M92r30
4945G70p08j039m67J03J245R49K52m0j104q85l83K37Q36J047O66j38p26q58j146
4964a389J98O23J084R22j05o05j286q67L03L69J084P94N0l76q14o73p29L11J250
4983A44P92L83k86r89q81m59L32N78J083P06k43p00q28r27M02K64Q88R44J60r35
5003D28q81n65m54O48J216R89k6o28r07j012l0L56J152N47J65r7p33j027n16M42
5023i33O75R48N46p0j040p84m75J39M00J373K32J17p22o52j285J72O04J046R54
5042A245j57m85r65p36n4M4J281Q66J72m05j083n68l43J14R83P91L84Qn27j374
$$ plain form
5062 -809 -1190 -986 -267 624 995 1154 156 -259 -1095 -1094 -494 720 1229 1423 594 -40 -880 -1319 -593 313
5082 313 896 1177 1000 -100 -578 -1075 -813 3 810 1289 877 85 -1012 -1003 -1273 -358 821 1303 888 58
5102 58 -408 -846 -1083 -465 341 1087 1191 619 -249 -732 -915 -892 258 1073 1377 784 139 -941 -864 -706
5122 -706 -20 806 1128 1034 126 -844 -1091 -890 32 242 1062 1000 455 -157 -1219 -1221 -672 463 1091 934 647
5143 647 -727 -1187 -1184 -578 390 1206 1096 745 -87 -807 -1245 -673 181 719 1289 688 -45 -499 -1171 -951
5163 -951 -73 386 1271 848 226 -289 -1141 -1036 -498 905 1017 907 357 -265 -929 -1051 -569 378 1046 1047
5183 1047 772 -297 -883 -1118 -736 259 1071 1052 689 41 -651 -945 -844 -138 701 1494 1003 35 -667 -862
5203 -862 -1154 -501 864 985 1133 292 -283 -1233 -1188 -317 76 845 1365 769 47 -1098 -1263 -681 -46 1042
$$ packed form
5062h09l81K04P19Q91L71J59r98m15q36JO00J214N09J94q29o34q40m39P26R06
5082C13N83K81j77j100m78m97K62Q16Q07M79m12p92j097Rk70R15J179M82m15q30
5102E8m66m38k37O18Q06P46J04n72q68m83j83K3J150Q15L04n93o45j080P7J58
5122g06O86Q26L22r4r08r70k47K01R22K10Q20o2n45o12j062kN49J135O28j57k87
5143F47j374m60LO06R68Q16j10l51q32p20m38N72Q54N38N70o01p33m54o72K20
5163i51Q78M59Q85m23o22n15q52J05N38J403J12j10n50o22o64j22M82R47O68J
5183A047k75j069n86k35L82R95Q12j9l63o48o92k94J01P06Q39P93m91r68p02j95
5203h62k92O53J365J21J48q41n75r50M5Q71L93P69N20n96p22j145j65N82O35J088
$$ plain form
5223 1042 1369 899 170 -704 -867 -791 129 849 1174 958 233 -698 -1132 -962 -487 583 965 1042 329 -894
5243 -894 -1223 -990 -541 437 781 875 509 -323 -853 -1130 -535 89 652 972 923 98 -835 -1088 -794 44 825
5264 825 1326 759 336 -783 -824 -1019 -422 554 815 771 274 -497 -1112 -976 -302 653 863 1164 740 -200
5284 -200 -960 -1067 -618 140 1035 1179 597 -87 -875 -758 -700 194 676 1431 1007 440 -775 -1096 -525 -133
5304 -133 694 975 801 388 -390 -751 -1077 -577 56 968 831 513 -292 -1072 -1006 -352 352 894 1163 687
5324 687 -571 -959 -847 -891 382 905 1163 366 -55 -758 -1184 -883 38 885 999 914 563 -687 -1001 -678
5344 -678 -272 489 1001 1052 239 -121 -1009 -1091 -441 320 1069 726 519 -420 -762 -891 -691 -17 727 1087 594
5365 594 37 -475 -1014 -546 -295 808 1014 744 211 -730 -656 -814 -224 375 848 993 300 -445 -928 -963
$$ packed form
5223A042L27m70p29q74j63P6R20P20L25k16p25r31m34J70M75J070L82P7p13j223
5243h94l29K33M49R78L44R4l66q32n30k77N95O24N63L20m9q25r33k53K94Q38P81
5264H25N01n67m23j119m1j95N97R76K61m4m97p71o15J36O74R55K10L01m24r40
5284b00p60j07M49P58Q95J44n82o84p88J17N8Q94M82P55m24n67j215l21N71L92
5304a33Q27K81j74m13p78l61l26N00O33R12j37l18q05p80O6O54P04N42K69m76
5324F87j258l88J12m4J273N23K58p97m21p03m26L01R21Q47J14q5l51j250l14L23
5344f78M06P61N12N1q13l60q88q2O50P61P49l43k07r39l42j29K00O74P44L60m93
5365E94n57n12n39M68K51J103K06k70n33r41P4j58N90N99M73J45o93p45m83l5
$$ plain form
5385 -963 -68 325 1193 1029 615 -508 -843 -1105 -862 344 907 848 443 -253 -911 -698 -714 312 880 789
5405 789 972 240 -886 -990 -677 -162 452 833 581 606 -362 -1134 -619 -17 311 870 762 213 -166 -931
5425 -931 -1289 -627 226 996 620 450 -147 -757 -1032 -642 242 659 815 766 15 -937 -962 -677 -86 602 1030
5446 1030 922 321 -485 -931 -707 -486 399 728 1014 125 -326 -664 -1337 -114 114 1101 1034 395 -188 -624
5466 -624 -844 -609 125 788 972 831 165 -521 -754 -767 -24 695 909 570 176 -431 -757 -947 -439 662
5486 662 798 920 238 -286 -723 -901 -414 244 799 1202 421 -276 -620 -948 -682 200 820 820 765 48 -485
5507 -485 -1144 -597 205 313 933 648 -23 -578 -782 -815 99 694 894 639 359 -343 -578 -1023 -237 -107
5527 -107 678 823 388 -162 -712 -658 -649 346 694 794 533 133 -619 -1018 -767 -9 652 1054 647 135 -618
$$ packed form
5385i63Q95L93Q68j64m14j123l35k62K43J206N63n9m05o96o58K13j6J026N68r1
5405G89J83p32j126j04L13N15O14L81k52K5r68p72N15O02L28N59j08n49l79p65
5425i31l58O62Q53P70l76j70n97o10k75L90Q84M17J56m9p51r52k5K85N91O88M28
5446A030j08o01q06m46K24K21Q85L29K86q89m51l38o73J223K28R87o7o39n83m36
5466f24k20K35P34O63J84j41o66o86k33j3P43P19K14l39l94o07l26j90N08J101
5486F62J36J22o82n24m37j78M87O58N55M03p81o97l44l28K66Q82O20%n5p17n33
5507d85o59N47Q02J08O20k85o71n55k04l3R14N95K00k55k80p02k35m45P86J30
5527a07P85J45m35n50n50N4RR95L48J00k61m00p52l99K51P58O61M02m07n12p53
$$ plain form
5548 -618 -850 -591 -63 519 938 841 371 -208 -655 -914 -389 473 893 761 586 -530 -985 -682 -422 166
5568 166 647 862 427 -92 -565 -868 -648 -24 737 908 848 94 -578 -723 -722 52 555 1206 737 146 -690
5589 -690 -719 -526 -533 388 800 677 344 -499 -1018 -759 -454 369 755 1178 516 -160 -869 -797 -757 58 802 998
5611 998 558 117 -475 -1211 -669 51 642 727 722 4 -430 -773 -638 -328 460 976 951 157 -83 -939 -757
5632 -757 -495 257 669 1002 265 -187 -897 -891 -448 107 598 593 386 -312 -624 -925 -498 -32 625 677 505 -38
5654 -38 -231 -796 -731 -228 552 698 645 341 -477 -819 -451 148 453 566 768 340 -224 -528 -686 -302 50
5675 50 651 978 357 -188 -731 -657 -576 176 836 861 699 -49 -644 -764 -494 -147 359 618 445 347 -391 -734
5697 -734 -526 -159 356 841 836 421 -313 -703 -571 -314 261 821 786 176 -233 -475 -747 -647 52 787 542
$$ packed form
5548f18k32K59N28N82M19r7m70n79m47k59N25Q62M20j32j75j116m55L03K60N88
5568A66M81K15m35n19m73l03K20O24P61J71o0p54o72j45JP74N03O51m69n91q36
5589f90k9J93pR21M12j23l33q43n19K59L05Q23L86M23o62o76p09P2M0Q15P44J96
5611I98m40m41n92p36N42P20N91Q5np18m34l43J35L10P88N16k5p94k40q56J82
5632g57K62P52M12L33p37m52p10OM43N55M91nk07o98l12l01M27M66O57N2j72n43
5654c8j93n65O5N03P80J46n3l04q18l42L68N99L05J13K02m28n64l04j58L84L52
5675E0O01L27o21n45n43P4Q1P52O60K5j62p48n95j20K70L47N06K59j73r8p38l43
5697g34K08L67N15M85nm15p34l90J32K57N75N60l5o10m09k42k72J00O99P35k45
$$ plain form
5718 542 683 162 -830 -759 -534 49 540 459 872 -27 -341 -444 -458 52 458 1012 639 420 -323 -678 -765
5739 -765 -167 333 737 639 200 -104 -500 -342 -355 446 705 543 550 -340 -586 -660 -715 20 260 881 766 -147
5761 -147 -279 -632 -774 -446 464 748 573 144 -269 -765 -652 -387 437 723 445 367 -160 -420 -729 -490
5781 -490 102 342 1101 261 -227 -266 -871 -328 297 1100 666 478 314 -364 -713 -465 -186 473 747 429
5801 429 87 -105 -666 -665 -322 254 600 608 288 -182 -523 -768 -417 289 711 824 600 -21 -571 -623 -389 -31
5823 -31 526 916 494 -124 -445 -693 -894 -71 221 637 727 159 -239 -542 -494 -364 727 706 888 204 -464
5844 -464 -812 -576 -201 -30 784 1058 274 -286 -406 -677 -79 294 435 526 505 -327 -254 -920 -700 -148 380
5865 380 616 708 152 -243 -717 -404 -13 431 659 593 146 -520 -750 -344 -39 -114 478 713 192 105 -583
$$ packed form
5718E42J41n21r92P1K25N83M91q1M13q99l14j03j4N10M06N54l73k19p43l55q7
5739g65N98N00M04r8m39l04l96J58j3Q01K59j62Pq90k46p4n5P35K40O21j15r13
5761a47j32l53j42L28R10K84j75m29m13m96J13K65Q24K86k78p8n27k60l09K39
5781d90N92K40P59q40m88l9o05N43O25Q03m34j88j64o78l49K48K79O59K74l18
5801D29l42j92n61JL43N76L46Ql20m70l41k45L51P06M22J13k24o21n50n2K34L58
5823c1N57L90m22o18l21k48k01Q23K92M16R0n68l98l03M8J30J091k1J82o84o68
5844d64l48K36L75J71Q14K74p84n60j20k71N98L73J41R1k1q32P3o66K20N52N28
5865C80K36R2n56l95m74L13L91M44K28o6m47o66k30M06L05p5N92K35n21q7o88
$$ plain form
5886 -583 -453 -266 134 732 503 233 167 -362 -720 -625 -21 403 407 728 102 -209 -527 -387 -231 258 768
5907 768 610 593 -162 -548 -328 -100 135 651 445 459 -313 -279 -761 -206 156 544 717 -50 -41 -489 -637 -73
5929 -73 66 358 375 562 28 -429 -288 -175 -103 346 624 642 229 -462 -1018 -625 -145 195 439 378 190 -136
5951 -136 -386 -467 -249 -182 237 437 506 -2 -480 -527 -434 -61 358 813 322 -173 -257 -831 -555 -39 385 447
5973 447 587 163 -196 -440 -556 -71 414 369 342 485 -233 -337 -496 2 184 636 704 523 -115 -424 -421 -460
5995 -460 284 287 474 576 -83 -418 -700 -405 36 200 538 285 344 -559 -741 -503 181 626 523 487 244
6016 244 -72 -795 -461 -50 157 478 648 353 -247 -436 -766 -478 338 676 671 347 -604 -615 -492 -653 -74
6037 -74 336 574 534 232 -525 -719 -532 -37 647 826 640 414 -340 -696 -436 -207 356 522 646 211 -142
$$ packed form
5886e83J30J87M00N98k29k70o6n29l58R5O04M24ML21o26l11l18J40J56M89N10
5907G68j58j7p55l86K20K28K35N16k06J4p72L4m82N55L62L88J73p67Rm48j48N64
5929g3J39K92J7J87n34m57J41J13P2M49K78J8m13o91n56L93M80L40K44o1j88l26
5951a36k50q1K18O7M19K00O9n08m78m7R3L73M19M55m91m95q4n74K76N16M24O2
5973D47J40m24l59k44j16M85M85m5k7J43p18j04j59M98J82M52O8j81o38l09Ll9
5995d60P44LJ87J02o59l35k82K95M41J64L38k53N9r03j82K38O84M45j03l6k43
6016B44l16p23L34M11K07L21J70k95o00j89l30K88Q16L38nl24r51j1J23j61N79
6037g4M10K38m0l02p57j94J87M95O84J79j86k26p54l56K60K29N63J66J24m35l53
$$ plain form
6058 -142 -489 -587 -349 95 789 438 632 -39 -491 -619 -142 121 390 623 511 -59 -422 -561 -264 -201 247
6079 247 729 642 -218 -368 -521 -451 -322 84 561 280 192 -362 -310 -681 -133 -132 226 445 -188 -176 -561 -485 -173
6102 -173 -154 306 489 427 -90 -362 -522 -138 -197 311 408 389 -76 -89 -647 -338 87 206 454 477 8 -492
6124 -492 -608 -450 -560 191 649 486 322 32 -445 -603 -361 117 678 712 325 -294 -341 -507 -190 67 200
6145 200 693 420 -91 -235 -829 -313 -117 440 688 438 -147 -170 -560 -781 -112 245 450 708 -8 -171
6165 -171 -532 -580 10 -276 274 419 286 241 -447 -444 -384 118 444 540 388 -44 -204 -548 -131 -23 293 251
6187 251 458 -133 -173 -541 -431 -364 252 552 383 469 17 -373 -620 -487 133 619 545 358 161 -456 -344
6208 -344 -380 192 480 422 370 -174 -602 -544 -315 -19 219 560 465 -40 -50 -751 -349 121 303 508 394 51
$$ packed form
6058a42l47r8K38M44O94l51J94o71m52j28M77K63K69K33j12n70l63j39K97O3M48
6079B47M82q7q60j50j53P0J29M06M77k81q8n54N2l71N48JL58K19o33J2l85P6L12
6102a73J9M60J83o2n17k72j60L84n9N08R7j9m65j3n58L09M25J19K48K3m69n00
6124d92j16J58j10P51M58j63j64k90m77j58K42M78N61L4l87o19m7j66L17K57J33
6145B00M93k73n11j44n94N16J96N57K48k50n85k3l90k21O69L57K05K58p16j63
6165a71l61m8N90k86N50J45j33m5o88LO0N02L26R6j52m32j60l44M17J08L16m2
6187B51K07n91m0l68J10O7O16L00j69Q6m52l90k47J33O20M86p4j87j97o17J12
6208c44l6N72K88n8n2n44m28N8K29K96K38L41r5n05j0p01M02M70J82K05j14l43
$$ plain form
6230 51 -445 -619 -436 -84 233 495 210 131 15 -374 -231 -491 -29 487 497 574 146 -185 -411 -398 -104 326
6252 326 449 431 301 -467 -524 -459 -194 436 531 356 -149 -108 -604 -423 -94 -36 373 626 72 -148 -227 -616
6274 -616 -139 125 385 497 426 -268 -341 -315 -149 -136 293 477 307 114 53 -238 -443 -490 298 389 103 193 -228
6297 -228 -166 -283 -121 81 357 568 336 -234 -468 -113 -353 295 362 278 576 -218 -127 -370 -354 49 102 439
6319 439 424 -175 -299 -497 -451 -13 195 214 250 92 1 -278 -248 -283 -104 507 419 325 -387 -408 -470 -135 24 250
6343 250 362 508 -45 -428 -513 -228 223 230 442 -85 98 -90 -312 -88 -119 282 484 378 -8 -316 -402 -474
6365 -474 -203 81 401 84 -43 32 -434 -342 -157 199 503 529 98 156 -478 -590 -378 -60 330 354 587 -246
6387 -246 -467 -567 -124 -267 418 674 140 122 -380 -464 -699 -212 329 185 532 111 -37 -359 -532 -226 443
$$ packed form
6230E1m96j74J83L52L17K62k85p9j16l89J43k60M62N16J0P7m28l31k26J3K94M30
6252C26J23j8j30p68n7O5K65O30R5j75n05M1m96J81L29N8M09K53n54k20p9l89
6274f16M77K64K60J12p1o94p3K6J66J3M29J84j70j93o1k91k05m7P88R1k86R0m21
6297b28O2j17J62K02K76K11k32n70k34L55k40O48O7q4K98p94R1k43J6M03N3L37
6319D39j5n99j24j98M6M38K08J9L6j58r1k79L0l5J79O11q8r4p12k1o2L35J59K26
6343B50J12J46n53l83q5K85M51PK12n27J83j88k22K24l1M01K02j06l86l08q6p2
6365d74K71K84L20l17j27P5m66R2J85L56L04K6m31N8o34j12K12L18L90K4K33q33
6387b46k21j00M43j43O85K56n34j8n02q4k35M87N41j44L47m21j48l22j73L06O69
$$ plain form
6408 443 265 72 473 -315 -622 -305 -162 318 207 82 285 147 -193 -318 -419 54 225 393 147 97
6428 97 -424 -372 -534 27 29 272 590 50 -38 -477 -543 -195 146 442 462 -18 167 -546 -455 -301 141 206 369
6451 369 205 -175 -500 -378 -277 24 291 361 36 104 -264 -250 -380 6 225 559 542 208 -412 -648 -393
6472 -393 -407 441 295 258 18 -99 -434 -214 -72 28 321 601 195 -145 -550 -281 -619 26 274 387 355
6493 355 40 82 -473 -91 -198 127 299 435 -14 -146 -307 -348 -128 225 213 370 28 10 -538 -301 -168
6514 -168 320 203 158 413 -212 45 -441 -284 160 349 441 151 -118 -479 -621 -247 46 -205 138 410 62
6535 62 -10 -100 -315 -158 -39 407 509 354 -11 -129 -270 71 135 484 356 267 -89 -137 -57 -225 -39 364
6557 364 312 366 -72 24 -390 -486 269 184 255 321 298 -346 -477 -618 17 109 407 600 142 93 -415 -261 -435
$$ packed form
6408D43j78j93M01p88l07L17J43M80j11j25K03j38l40j25j01M73J71J68k46n0
6428I7n21N2j62N61KK43L18n40q8m39o6L48L41K96K0m80J85p13R1J54M42O5J63
6451C69j64l80l25J22J01L01K67P0l25O8l68J4j30L86K19L34j7l34o20k36K55
6472c93j4Q48j46l7k40j17l35K20J42J00K93K80m06l40m05K69l38O45K48J13l2
6493C55l15M2n55L82j07L25J72J36m49j32j61m1K20L53j2J57l42j8n48K37J33
6514a68M88j17m5K55o25K57m86J57M44J89R2k90k69l61j42L74K93k51L43K72l48
6535F2p2r0k15J57J19M46J02j55l65j18j41L41O4L49j28q9l56m8Q0j68J86M03
6557C64n2N4m38R6m14r6P55q5P1O6k3o44j31j41O35R2K98J93m58m9n08J54j74
$$ plain form
6580 -435 98 374 552 190 -217 -347 -337 -187 265 117 525 603 12 -49 -408 -219 233 310 413 401 -76 228
6602 228 -368 -424 -116 255 477 379 31 -68 -455 -53 -187 313 40 193 48 -118 -237 -448 -632 447 57
6623 57 140 286 9 -135 -92 -337 162 65 135 127 31 -292 -374 -126 25 326 179 683 215 -16 -530 -139 12
6646 12 251 235 417 146 -43 -336 -269 -79 -90 503 558 50 -166 4 -285 -52 -132 306 405 111 153 -209 -348
6669 -348 -258 -184 113 279 331 226 29 -354 -325 198 74 400 206 11 -116 -476 -165 -416 155 -17 180
6690 180 -65 17 -258 -243 -103 103 348 159 334 27 -323 -383 -229 149 301 484 303 30 -485 -443 -350 52
6712 52 36 535 416 294 -165 -48 -132 -209 187 267 -284 186 -116 -579 -526 12 -9 95 423 -140 88 -58
6734 -58 -197 -111 -151 46 23 254 19 -108 -164 -24 201 -61 546 213 140 55 -421 -383 -9 -64 270 284 84
$$ packed form
6580d35N33K76J78l62m07j30J0J50M52j48M08P8n91o1l59J89M52P7J03j2m77L04
6602B28n96n6L08L71K22r8l48r9l87M02j34N00k73J53j45j66j19k11j84J079l90
6623E7Q3J46k77j44M3k45M99r7P0qr6l23q2K48J51L01j47N04m68k31n14L91J51
6646A2K39j6J82k71j89k93O7J90j1N93N5n08k16J70k89K33q0M38R9k94M2l62j39
6669c48R0P4K97J66N2j05j97l83K9N23j24L26j94j95j27l60L11k51N71j72J97
6690A80k45Q2k75J5J40K06K45j89J75l07l50o0J54L78J52J83j81k73n15M2R3M02
6712E2j6M99j19j22m59J17q4p7L96Q0n51M70l02m63N3N38k1J04L28n63K28j46
6734e8j39Q6m0J97k3K31k35j27n6J40K25k62O07l33p3q5m76L8L74n5L34J4k00
$$ plain form
6757 84 10 -285 -50 -98 163 280 266 366 -114 -178 -200 -132 44 403 -86 227 305 -298 22 190 -30 22 457
6780 457 261 173 -179 -60 -103 202 288 375 204 146 -58 -313 -288 -331 73 137 301 217 -38 36 -146 -77 -110 -73
6804 -73 230 150 58 -140 -513 -288 197 -19 349 160 6 -82 -106 -270 -16 82 156 230 98 -332 -357 -596 -120
6827 -120 336 160 169 -86 -136 -118 34 -154 153 273 517 23 172 -218 -514 -84 138 345 317 -36 17 -64
6849 -64 25 0 -227 420 212 65 137 -25 -240 -237 -61 -29 167 174 253 -90 -81 -178 -246 65 152 273 399 101 3
6874 3 -309 -232 28 183 132 227 -57 -229 -297 -321 -114 589 315 157 98 -214 -30 -115 -226 -51 225 -2 235
6897 235 -118 -343 -59 -117 -39 70 189 113 -184 -46 -304 -195 12 239 250 295 -31 32 -152 3 70 264
6919 264 439 247 42 -60 -336 -140 31 242 123 -34 -14 -317 -149 -76 -180 252 229 122 88 -162 -187 43
$$ packed form
6757H4p4k95K35m8K61J17j4J00m80o4k2O8J76L59m89L13P8o03L20J68k20N2M35
6780D57j96q8l52J19m3L05Q6Q7j71n8k04k55K5m3M04O4J64q4k55P4j82O9l3L7
6804g3L03q0r2j98l73K25M85k16L68j89j54q8k4j64K54R8P4P4j32m30k5k39M76
6827a20M56j76Rk55n0J8J52j88L07J20K44m94J49l90k96M30K22K07k8l53N3q1
6849f4Q9k5k27O47k08j47P2j62k15LJ76L2J96PP9l43Rr7o8L11Q7J21J26k98r8
6874Cl12P7K60J55n1R5k84j72o8k4K07P03k74j58n9l12J84q5j11J75K76k27K37
6897B35l53k25K84n8P8J09J19p6k97J38k58J09K07K27J1M5l26O3j84J55O7J94
6919B64J75j92k05j02k76J96J71K11j19j57K0l03J68P3j04M32k3j07l4k50k5K30
$$ plain form
6941 43 -117 130 -45 318 25 -131 -374 -305 86 140 -90 118 302 105 -40 -67 -141 114 94 268 318 48
6963 48 -247 -352 -154 61 47 45 456 -30 -248 -316 -217 203 71 378 209 15 -86 96 -291 -112 258 38
6985 38 7 368 3 2 -147 -462 -152 -81 279 183 -115 171 -36 -146 -38 265 133 132 -40 -71 -111 -258 -281 187
7009 187 323 90 209 -102 -250 -208 -291 101 -44 178 235 57 -4 27 -84 -269 49 -24 194 -210 -227 -132 -163
7032 -163 -23 344 214 -165 143 -43 -706 -290 35 370 178 257 149 40 -205 -153 63 -67 -185 239 64
7053 64 -36 -138 -249 21 69 307 266 202 302 -193 -251 -38 350 314 58 328 -131 2 -200 -100 -159 -14
7075 -14 394 54 20 -73 -115 -166 -317 -73 441 44 366 -34 -244 -293 -452 -73 -132 29 107 108 -159 -471 -28
7098 -28 -35 179 -15 329 -22 -159 -51 -122 123 -82 12 57 -42 55 -55 -130 164 -224 420 436 67 -4 -77 -68 158
$$ packed form
6941D3j60K47j75L63k93j56k43O9L91N4k30K08J84j97j45k7p4K55k0J74N0k70
6963D8k95j05J98K15j4kM11m86k18o8R9M20j32L07j69j94j01J82l87J79L70k20
6985C8l1L61l65jj49l15L10P1L60r6k98K86k07j10J08L03j32jj72l1m0j47k3M68
7009A87J36k33J19l11j48M2q3L92j45K22N7j78o1L1j11j85L18p3K18m04j7R5l1
7032a63J40L67j30l79L08j86o63M16L25L35j92P9j08j09k45N2K16j30j18M24j75
7053F4j00j02j11K70M8K38m1o4J00m95n8K13L88l6k56K70m59J33k02J00n9J45
7075a4M08l40l4r3m2n1j51K44N14l97L22m00k10m9j59L79n9J61P8Jk67l12M43
7098b8pK14j94L44l51j37J08p1K45k05R4M5r9R7j10p5K94l88O44J6l69p1p3RK26
$$ plain form
7123 158 9 155 314 -90 -265 -192 -13 -250 -322 -120 115 94 257 -405 -244 -492 -75 -331 38 45 163 -197
7145 -197 -368 -148 35 299 236 257 -204 82 -135 -288 -101 -59 138 117 121 42 185 -89 -246 80 162 -72 92
7168 92 -4 -148 -176 -302 -132 53 194 -36 -36 -140 148 -30 -25 -206 72 130 333 461 -252 -263 -129 -102 83
7191 83 199 -60 166 -102 -374 -71 106 -12 401 50 -242 93 -47 -293 -90 140 34 -219 -27 -112 -281
7212 -281 -138 102 -2 108 274 167 -156 -4 -15 -16 45 -5 102 -425 -187 -163 89 194 146 -48 361 127
7234 127 314 -170 11 -158 108 -46 111 298 -25 -175 5 -292 116 362 227 244 -218 -270 105 -32 -68
7255 -68 -123 -33 -61 90 -278 -61 -181 -187 -7 244 -31 136 -56 -270 95 -308 -104 87 300 90 108 -269
7277 -269 -94 -100 12 450 17 27 -79 -32 11 108 -6 139 74 246 30 7 -1 153 -89 371 187 260 20 201
$$ packed form
7123A58j49J46J59m04j75P3J79k37p2K02K35k1J63o62J61k48M17k56L69PJ18l60
7145a97j71K20J83K64o3K1m61K86k17j53J87M2J97k1Mp9J43k74j57L26Q2k34J64
7168I2r6j44k8j26J70J85J41k30%j04K88j78Nj81K78N8K03J28p13j1J34K7J85
7191H3J16k59K26k68k72L03J77j18M13l51k92L35j40k46K03K30j06k53J92q5j69
7212b81J43K40j04J10J66j07l23J52j1jO1n0J07n27K38K4K52J05m8j94M09k34
7234A27J87m84J81j69K66j54J57J87l23j50J80k97M08K46j35J7m62n2L75j37l6
7255f8n5R0k8J51l68K17j20oJ80K51k75J67j92k14L65m03K04J91K13k10J8l77
7277b69J75oJ12M38m33J0j06M7M3R7j14J45o5J72k16k3qJ54k42M60j84P3k40J81
$$ plain form
7301 201 -77 -336 -340 128 425 81 126 -241 -307 -53 -396 73 94 199 300 94 -107 -125 -215 154 236 83 137
7324 137 285 114 190 133 -44 197 116 66 -134 -67 31 -34 -272 261 -5 197 -106 -174 69 -84 -236 -9 112
7347 112 136 78 -104 -177 -343 -224 97 39 42 53 141 153 -351 -67 228 171 -29 44 -98 -69 85 -116 -178 -89 -44
7372 -44 -32 -27 158 -134 -167 -418 -31 171 346 -3 11 166 -98 -91 4 102 448 79 -68 -124 -83 -128 -110 -163 -96
7397 -96 113 65 70 43 -301 74 66 201 156 509 258 63 -92 22 -95 234 134 -60 12 -8 56 68 -269 -208
7421 -208 248 93 -45 -326 51 139 58 3 141 -149 -66 157 -148 -76 189 53 385 15 -3 93 -189 57
7443 57 -152 -81 182 120 -65 -62 -42 -23 -268 -149 -79 318 -32 -125 103 87 -202 78 155 299 158 342 82 -24
7467 -24 -219 -143 84 -4 104 -91 37 -59 -93 -25 180 131 261 -124 -153 54 -13 83 -132 225 121 -224 16
$$ packed form
7301B01k78k59mM68K97l44M5l67o6K54l43M69K1J05J01k06k01j8r0L69Q2j53N4
7324A37J48j71P6n7j77K41q1n0k00O7R8o5k38N33k66K02l03o8K43j53j52K27J21
7347A12K4n8j82p3j66J19L21n8LJ1Q8J2n04K84K95n7k00P3j42K9J54k01o2Q9M5
7372d4J2NJ85k92l3k51L87K02J75l49J4J55k64PR5R8L46l69j47n6M1m5J8n3O7
7397i6K09m8Nk7l44L75qJ35m5L53k51j95j55J14j17L29j00j94P2k0O4J2l37O1
7421b08M56j55j38k81L77Q8q1n5J38k90Q3K23l05P2K65j36L32l70j8R6k82K46
7443E7k09P1K63o2j85LK0J9k45J19P0L97l50r3K28j6k89K80P7J44j41J84k60j06
7467b4j95P6K27q8J08j95J28r6l4O8K05m9J30l85k9K07o7R6k15L57j04l45K40
$$ plain form
7490 16 110 353 -160 152 -131 337 73 -11 35 81 -135 90 65 25 317 46 -38 260 248 -175 -12 -308 203
7513 203 249 -85 69 -359 -244 -243 -26 48 -122 218 -211 -18 6 121 -197 -160 -57 -157 -125 -84 78 -16 188
7536 188 -141 -59 107 -23 -202 -21 -8 -97 68 -170 -38 -81 -80 -38 -222 -13 217 88 -173 -101 79 34 22
7559 22 17 242 28 -57 136 -95 -411 155 154 -187 49 -28 38 -99 18 -136 42 -320 -220 196 -33 -98 -173
7582 -173 -113 45 -52 62 268 -5 -111 14 -39 -63 213 313 174 137 351 -137 -83 -98 -427 -182 -163 -26 -283
7605 -283 -1 -31 -83 422 57 230 -24 -51 97 -358 412 381 -1 111 136 -78 -23 -158 -12 -275 66 6
7627 6 207 62 17 -229 114 -73 157 101 273 38 -115 -137 -77 -44 65 84 149 -35 35 126 -72 -179 -174 501
7651 501 -249 53 -39 -103 8 -163 -126 194 75 -144 -154 -21 -68 74 187 228 290 -17 51 16 -212 -98 38
$$ packed form
7490A6R4K43n13L12k83M68k64q4M6M6k16K25k5m0K92k71q4K98j2m23J63k96N11
7513B03M6l34J54m28J15JK17P4j70L40m29J93K4J15l18L7J03j00L2M1J62r4K04
7536A88l29Q2J66j30j79J81J3q9J65k38J32m3JM2j84K09K30j29k61P2J80m5j2
7559B2nK25k14q5J93k31l16N66jl41K36p7O6j37J17j54J78l62J00M16k29o5p5
7582a73O0J58r7J14K06k73j06J25n3k4K76J00j39l7K14m88N4j5l29K45J9J37k57
7605b83K82l0n2N05l65J73k54k7J48m55P70l1l82J12K5k14N5j35J46k63L41o0
7627FK01j45m5k46L43j87K30n6J72k35j53k2O0L3J09J9O5j84P0R1j98j07NO75
7651E01p50L02r2o4J11j71L7L20j19k19j0J33m7J42J13M1O2l07O8l5k28J14J36
$$ plain form
7674 38 -86 142 14 -198 -103 -80 -133 152 -344 -52 -9 91 73 -120 -159 -187 98 327 186 193 95 135 -233 -226 78
7699 78 0 109 110 -244 353 33 -30 -96 83 -112 -359 183 -7 336 -42 -247 -159 208 72 112 -79 -125 -244
7722 -244 -96 65 -71 -83 42 -130 -29 -41 129 -136 -11 138 22 -34 -380 -17 91 -78 -177 104 -2
7743 -2 -266 -231 -60 15 -56 -8 -215 11 316 -64 128 -38 -174 -109 160 -295 141 45 -107 -135 97 446 -104
7766 -104 39 396 -142 -148 57 -103 -259 218 41 207 29 -38 -209 14 -231 249 -5 -13 35 -24 263 63
7788 63 -212 -125 -12 131 -69 -18 13 -260 55 -15 -25 106 73 -54 129 -189 -17 -212 -195 72 -125 -33 -201
7811 -201 130 -143 -332 -1 11 -196 -187 -122 -257 -35 -221 -98 26 153 -65 -259 -278 -200 -139 -236 -106 -22 71
7834 71 -19 -257 -28 -100 79 -104 -214 162 -105 -262 -158 -113 -132 -242 -389 265 -184 232 -182 -92 29 -42
$$ packed form
7674C8j24K28j28k12R5K3n3K85m96K92M3J00j8j93l9k8K85K29j41Pr8M0l68PL04
7699G8p8J09Jl54N97l20o3o6J79j95k47N42j90L43l78k05Q8L67j36M0j91m6j19
7722b44J48J61j36j2J25j72J01j2J70k65J25J49j16n6l46L63J08j69r9K81j06
7743bk64L5J71P5p1M8k07K26L05l80J92j66j36O5K69m55M36r6j52k8K32L49n50
7766a04J43L57n38oK05j60j56M77j77J66j78o7j71K23k45M80k54qM8n9K87k00
7788F3k75Q7J13J43k00N1L1k73L15p0j0J31l3j27J83l18J72j95J7K67j97R2j68
7811b01L31k73j89L31J2k07RO5j35K22j86J23J24J27k18j94j9P8O1r7J30Q4R3
7834G1r0k38K29p2J79j83j10L76k67j57J04M5j9j10j47O54m49M16m14R0J21p1
$$ plain form
7856 -42 24 10 -209 93 8 -11 -226 170 43 -160 -82 5 242 -104 -348 -331 243 59 103 -52 -323 203 4
7879 4 -87 604 37 64 125 -258 -18 -91 -57 28 -142 46 296 -282 -263 -234 -122 121 51 -51 52 29 -38 -161
7903 -161 -74 -265 212 -30 2 66 -253 283 -5 140 168 -32 41 -241 -66 70 -272 184 -328 270 5 211
7925 211 -177 -287 -135 -341 147 137 161 -104 -213 41 -219 -120 140 -47 -92 -162 -126 -81 -167 -45 -249 235 -30
7948 -30 -116 -290 236 262 -39 -11 -34 282 -166 96 -17 26 -39 274 172 -292 51 6 -246 53 415 3 -137
7971 -137 27 -117 45 -106 -33 -319 -377 96 279 -74 -12 129 149 -253 353 -47 176 43 27 -109 -133 -246
7993 -246 159 -327 210 -154 93 -266 -57 -34 -27 152 -184 137 149 28 -167 -55 155 -160 0 44 -22 -63
8015 -63 -100 -35 210 75 94 43 -414 -84 -73 -228 -128 4 62 35 -104 236 -66 -136 11 60 203 80 16 8
$$ packed form
7856d2O6j4k19L02q5j9k15L96j27k03P8Q7K37l46k44J7N74j84M4j55k71N26j99
7879Dr1O91n67K7O1l83K40p3L4Q5j70J88K50n78J9K9J12K43p0j02J03k3o7j23
7903a61Q7j91M77k42L2O4l19N36k88J45K8k00P3k82J75J36l42M56n12N98k65K06
7925B11l88j10J52k06M88j0K4k65j09K54k60R9K60j87m5p0L6M5q6J22k04M84k65
7948c0q6j74N26K6l01K8k3L16m48K62j13M3o5L13j02m64L43m5k52K99L62m12j40
7971a37J64j44J62j51P3k86n8M73J83l53O2J41K0m02O06m00K23j33j6j36k4j13
7993b46M05m86N37l64K47l59K09K3PJ79l36L21J2j21j95J12K10l15J60M4o6m1
8015f3l7O5K45j35J9n1m57L30J1j55J00J32N8k7j39L40l02p0J47M9J43j23o4q
$$ plain form
8039 8 -112 -190 80 114 267 -84 98 -273 19 136 7 35 -79 16 218 -187 -111 -146 173 -181 -251 124 -18
8062 -18 12 -9 -174 144 229 -60 -193 200 120 -150 39 -98 -216 -7 119 98 262 -89 33 -133 20 258
8084 258 -77 -5 122 -80 -184 290 -3 -87 -290 -15 -40 138 71 -109 -108 -235 162 -8 213 242 38 16 207
8107 207 -154 -239 42 191 -21 -66 -268 -109 249 -12 101 -4 20 127 131 -30 160 -334 -176 -81 57 43
8129 43 -233 -207 -1 123 -173 396 -93 -216 -78 -160 -56 115 -102 92 -75 28 163 -215 122 -275 -2
8150 -2 -108 32 113 -185 -160 154 -68 -223 -36 258 -10 42 -138 -54 -108 47 2 183 -47 -36 152 -111 103
8173 103 -139 -70 -130 87 -125 -44 84 -149 -25 -56 71 -126 -164 -42 97 -11 85 257
$$ packed form
8039Hj20p8K70L4J53l51J82l71K92J17j29K8j14R5K02m05P6l5L19l54p0L75j42
8062a8L0k1j65L18Q5k89j33L93q0k70J89j37j18K09J26k1J64l51J22j66J53K38
8084B58l35P2J27k02j04M74k93q4k03K75k5J78o7j80Jj27L97j70K21K9k04k2J91
8107B07l61q5K81J49k12m5k02J59L58k61J13j05K4J07Mj61J90m94J58R5J38j4
8129D3k76K6K06J24k96N69m89j23J38q2J04J71k17J94j67J03J35l78L37l97K73
8150bj06J40Q1k98K5L14k22j55J87K94k68N2j80Q4n4J55m5J81k30J1J88k63K14
8173A03k42O9o0K17k12Q1J28k33J24l1J27j97l8J22J39j08R6J72
8191B57
$$ Imaginary data points
##PAGE= N=2
##DATA TABLE= (X++(I..I)), XYDATA
$$ plain form
0 0 0 0 0 0 0 0 0 0 0 0 0 0 0 2 -8 8 -8 8 -8 11 -16 16 -18 20 -24 27 -32 36 -41 44 -52 59 -67 74 -81 92 -101
37 -101 112 -125 136 -152 169 -188 208 -228 255 -285 315 -353 396 -449 510 -588 686 -811 990
56 990 -1254 1688 -2534 4810 -25858 -74370 -59719 -24151 27260 59863 64826 30144 -20241 -59622
70 -59622 -63054 -34710 12513 53074 66698 41656 -6516 -51325 -65917 -46072 231 46436
82 46436 67258 49528 4924 -42355 -65581 -52500 -10956 36744 63327 55518 17022 -30948
94 -30948 -61940 -58256 -21938 25308 58607 59915 28391 -19705 -56623 -61263 -31903 13790 51959
107 51959 62360 37936 -8194 -49085 -62011 -41284 1694 43977 62719 45796 2921 -40552
119 -40552 -61093 -48458 -9535 35988 60311 51108 13242 -30678 -57590 -53309 -19951 25528
$$ packed form
0@%%%%%%%%%%%%%Kj0J6j6J6j6J9k7L2l4L8m4N1n9O8p7Q5r6J11j26J41j55J73j93
37a01K13k37K61k88L21l57L96m36M83n40O00o68P49q45R59j098J274j497J801
56I90k244K942m222P344l0668m8512J4651L5568N1411L2603M963l4682n0385l9381
70e9622l432K8344M7223M0561J3624k5042m8172m4809j4592J9845M6303M6205
82D6436K0822j7730m4604m7279k3226J3081M1544M7700K6583p809l8496m7970
94c0948l0992L684L6318M7246L3299J308l1524m8096l6918m640K9360M5693L8169
107E1959J0401k4424m6130m0891j2926K0727M2978M2283J8742j6923m2875m3473
119d0552k0541J2635L8923M5523K4323r203l7866m3920k6912M281L3358M5479
$$ plain form
131 25528 56181 54916 23907 -19541 -52958 -57766 -29394 15268 50732 57875 33499 -9325 -47397
144 -47397 -58861 -37062 4687 43679 58086 40796 669 -39460 -57516 -43772 -6215 34776
156 34776 56646 46920 11021 -30485 -55034 -49622 -16446 26402 54222 51794 20057 -21658 -51335
169 -51335 -52874 -25094 17225 49187 53540 28099 -11699 -45155 -54673 -33053 7290 43399 54640
182 54640 35775 -2249 -39270 -54750 -39500 -2011 35958 53445 41930 7284 -31599 -52688
194 -52688 -44865 -11898 26867 51194 46995 16658 -23089 -49384 -48437 -21307 17753 47258 50229
207 50229 24405 -13761 -44157 -50187 -29091 8214 41349 51456 32515 -3702 -37825 -51178
219 -51178 -36495 -1050 34634 50838 38787 5737 -30490 -50026 -41915 -10375 26627 48458
$$ packed form
131B5528L0653j265l1009m3448l3417m808K8372M4662L5464P143k4376m2824l8072
144d7397j1464K1799M1749L8992J4407j7290m0127m0129j8056J3744L7557M0991
156C4776K1870r726l5899m1506k4549N412L3176M2848K7820k428l1737m1715k9677
169e1335j539K7780M2319L1962M353k5441l9798l3456r518K1620M0343L6109J1241
182E4640j8865l8024l7021j5480J5250L7489L7969J7487j1515l4646l8883k1089
194e2688P823L2967L8765K4327m199l0337l9747k6295R47K7130L9060K9505K971
207E0229k5824l8166l0396o030K1096L7305L3135J0107j8941l6217l4123j3353
219e1178J4683L5445L5684J6204j2051l3050l6227j9536Q111L1540L7002K1831
$$ plain form
231 48458 43748 14855 -21858 -46650 -45123 -18830 17480 44271 47101 23339 -13250 -42391 -47657
244 -47657 -26567 8740 39365 48364 30077 -4736 -36505 -48156 -32960 14 33077 48048
256 48048 35955 4226 -29640 -46810 -38196 -8789 25615 46179 40768 12666 -22290 -44838
268 -44838 -42284 -16317 18414 42850 43903 20442 -14384 -41006 -44303 -23761 9910 38127 45255
281 45255 27752 -6069 -35966 -45645 -30177 2102 32728 45299 33349 2346 -30090 -45270
293 -45270 -35506 -6099 26236 44401 37916 9989 -22776 -43068 -39191 -13951 18982 41893 41015
306 41015 17902 -15412 -39709 -42446 -20842 11467 37565 43094 24360 -7480 -35267 -43363 -27522
319 -27522 3614 32464 43519 29895 257 -29621 -43170 -32372 -4177 26872 42864 35214
$$ packed form
231D8458m710k8893l6713k4792J527K6293L6310K6791K830k3762l6589k9141n266
244d7657K1090L5307L0625Q999j8287l4813l1769j1651J5196L2974L3063J4971
256D8048j2093l1729l3866j7170Q614K9407L4404K0564n411k8102l4956k2548
268d4838K554K5967L4731K4436J053k3461l4826k6622l297K0542L3671K8217P128
281D5255j7503l3821k9897r679J5468L2279L0626J2571j1950l1003l2436j5180
293d5270R764K9407L2335J8165o485k7927l2765k0292L877K5240L2933K2911q78
306D1015k3113l3314k4297k737K1604L2309K6098N529j8734l1840k7787q096J5841
319b7522L1136K8850J1055j3624k9638k9878j3549J0798K8195L1049J5992p650
$$ plain form
331 35214 7986 -23515 -41777 -36558 -11564 19856 40266 38245 15071 -16685 -38889 -39587 -18403
344 -18403 13081 37351 40328 21334 -9330 -34914 -41224 -24552 5867 32863 41193 27190 -1732
357 -1732 -29674 -41527 -30227 -1849 27212 40920 32151 5922 -23740 -40296 -34546 -9536 20987
370 20987 39090 35993 12888 -16892 -37571 -37544 -16578 13732 35791 38430 19421 -9831 -33976
383 -33976 -39281 -22485 6458 31945 39647 25020 -2969 -29427 -39784 -28031 -695 26902
395 26902 39294 29814 3913 -23578 -38853 -32407 -7551 21051 37629 33711 11392 -17298 -36738
408 -36738 -35688 -14424 14472 35379 36342 17748 -11041 -33264 -37426 -20726 7606 31720 37654
421 37654 23444 -4061 -28895 -38119 -25754 500 26175 38219 28027 2899 -23909 -37170
$$ packed form
331C5214k7228l1501j8262N219K4994L1420K0410k021k3174l1756k2204o98K1184
344a8403L1484K4270K977j8994l0664k5584o310J6672L0419K6996Q330j4003k8922
357a732k7942j1853J1300K8378K9061J3708q769k6229k9662j6556N750K5010L0523
370B0987J8103l097k3105k9780k0679K7K0966L0310K2059K639j9009k9252k4145
383c3976n305J6796K8943K5487P702j4627k7989k6458j0357J1753K7336K7597
395B6902J2392r480k5901k7491j5275O446K4856K8602J6578l918k2319k8690j9440
408c6738J050K1264K8896K0907R63j8594k8789k2223m162J6700K8332K4114N934
421C7654j4210k7505k4834r224J2365K6254K5675J2044j0192k5128k6808j3261
$$ plain form
433 -37170 -30100 -6373 21297 36723 31747 9557 -18223 -35808 -32992 -12397 14943 34337 34342
446 34342 15625 -11793 -32803 -35458 -18439 8566 31182 36235 21505 -5297 -28676 -36169 -23721
459 -23721 1621 26512 36642 26292 1151 -24295 -36051 -28082 -4692 21619 35543 29694
471 29694 7020 -18901 -34852 -30961 -10139 16370 33970 32305 13136 -13811 -32333 -33000 -15717
484 -15717 10210 30992 34461 18652 -7387 -28862 -34339 -21511 3740 27066 35315 23905 -654
497 -654 -24747 -34650 -25390 -2610 21839 34319 27633 5398 -19532 -33742 -29169 -8603 16598
510 16598 32534 30931 11484 -14092 -31622 -31566 -14710 10955 30287 32226 17153 -8267 -28213
523 -28213 -33184 -19831 4974 26590 33448 22144 -1540 -24348 -33356 -23768 -1464 22217 33217
$$ packed form
433c7170P070K3727K7670J5426m976k2190k7780j7585K816K0595K7340J9394N
446C4342j8717k7418k1010k655J7019K7005K2616N053j4730k6802k3379p493J2448
459b3721K5342K4891J0130j0350k5141k5446j1756P969K3390K6311J3924n849
471B9694k2674k5921j5951L891K0822K6509J7600j665j9169k6947j8522o67J7283
484a5717K5927K0782L469j5809k6039k1475n477J2828K5251K3326Q249j1410k4559
497f54k4093r903R260K2780K4449J2480o686k2235k4930j4210M573K0566K5201
510A6598J5936j603j9447k5576j7530N6J6856K5665J9332J939j5073k5420j9946
523b8213m971J3353K4805K1616O858j1304k3684k2808r008R588K2304K3681J1000
$$ plain form
536 33217 26149 4239 -19426 -32514 -27660 -7172 17245 31949 28944 10404 -13982 -30787 -30166
549 -30166 -12976 11392 29331 31005 15444 -8488 -27906 -31619 -18280 5592 25444 31886 20507
562 20507 -2721 -23982 -32475 -22912 -214 21898 31904 24425 3346 -19672 -31634 -26199 -6091
575 -6091 17222 31048 27278 8724 -14453 -30095 -28814 -10993 12254 29282 29277 13659 -9356
588 -9356 -27691 -30331 -15979 6945 25751 30638 18360 -3727 -24400 -31023 -20009 1463 22316
601 22316 30865 22435 1314 -20238 -30664 -24343 -4165 17956 29958 25822 6623 -15750 -29228
614 -29228 -26828 -9419 13285 28822 27735 11613 -10799 -27279 -28632 -14033 8269 26227 29200
627 29200 16316 -5501 -24463 -30134 -18753 3172 22824 29647 20468 51 -20770 -29779 -22292
$$ packed form
536C3217p068k1910k3665j3088M854K0488K4417J4704l005j8540k4386j6805O21
549c0166J7190K4368J7939J674j5561k3932j9418l713J3339K3872J9852O442j1379
562B0507k3228k1261q493R563K2698K2112J0006p479k1079k3018j1962N435K0108
575f091K3313J3826l770j8554k3177j5642J281J7821K3247J7028nj5618k3015
588i356j8335k640J4352K2924J8806M887j2278k2087k0673o623J1014K1472K0853
601B2316Q549q430k1121k1552j0426O321K0178K2121J2002m136j9199k2373j3478
614b9228K400J7409K2704J5537j087j6122k2412j6480j353J4599K2302J7958K973
627B9200j2884k1817j8962n671J1381K1925J9652O823r179k0417k0821r009P487
$$ plain form
640 -22292 -2398 18479 29454 24236 5499 -16333 -28706 -25098 -7850 13865 28199 26516 10361
653 10361 -11548 -26637 -27175 -13051 8818 25805 28357 14894 -6282 -23821 -28459 -17265 3482
666 3482 22725 28799 19129 -898 -20327 -28853 -21099 -1602 18652 28808 22855 4293 -16657
679 -16657 -28324 -24275 -6678 14290 27258 25221 9012 -11867 -26226 -25696 -11448 9657 25067
692 25067 27097 14330 -6984 -23528 -27250 -15972 4000 22268 28074 18125 -2231 -20564 -27656
705 -27656 -19776 -786 19020 27909 21239 3288 -16596 -27108 -22687 -5946 14506 26513 23958
718 23958 8364 -12018 -25795 -25302 -10611 9202 24339 26100 12904 -7188 -23261 -26558 -15192
731 -15192 4495 21799 26969 17391 -2016 -20414 -26845 -18644 -305 18467 26959 20738 2439
$$ packed form
640b2292J9894K0877J0975n218j8737k1832j2373L608J7248K1715J4334j683j6155
653A0361k1909j5089n38J4124K1869J6987K552j3463k1176j7539m638J1194K0747
666C482J9243O074r670k0027j9429q526P754J9497K0254J0156n953j8562k0950
679a6657j1667M049J7597K0968J2968k037j6209k0879j4359N30J4248K1105J5410
692B5067K030j2767k1314j6544l722J1278J9972J8268N806r949k0356j8333p092
705b7656P880J8990J9806Q889o670j7951j9884j0512M421J6741K0452J2007k555
718B3958j5594k0382j3777M93J4691J9813J5137J761j3196k0092j6073l297J1366
731a5192J9687J7304N170r578j9407j8398o431Q201J8339J8772Q492o221j8299
$$ plain form
744 2439 -16152 -26448 -21237 -5449 14059 25964 23074 7462 -12349 -25300 -24193 -9679 10257
757 10257 24318 25088 11734 -7701 -23283 -25913 -13835 5854 21816 25675 15594 -3272 -20418
770 -20418 -26208 -17284 725 18365 25980 19675 1833 -16789 -25982 -20616 -4233 14537 25530
783 25530 22258 6747 -13079 -24821 -22737 -8732 10240 23705 24061 10796 -8562 -22484 -24402
796 -24402 -13080 5991 21505 25026 14597 -3775 -20009 -25676 -16449 1350 18621 25192 18416
809 18416 1360 -16858 -25474 -19582 -2831 14920 24575 21105 5669 -13025 -24471 -21859 -7224
822 -7224 11081 23239 22656 9652 -8985 -22539 -23284 -11263 6569 21200 24250 13201 -4597
835 -4597 -19647 -24291 -15726 2320 18857 24736 16490 -130 -17099 -24598 -18415 -2053 15588
$$ packed form
744B439j8591j0296N211J5788J9508J1905k890j5612j9811j2951J107J4514J9936
757A0257J4061P70j3354j9435j5582k630J2078J9689J5962L859j0081j8866j7146
770b0418n790Q924J8009J7640P615o305j7842j8622r193N366J6383J8770J0993
783B5530l272j5511j9826j1742K084J4005J8972J3465L56j3265j9358j3922j918
796b4402J1322J9071J5514L521j0429j8372j6234n667R227J7799J7271O571o776
809A8416j7056j8218q616N892J6751J7751R655l470j5436j8694j1446K612J4635
822g224J8305J2158n83j3004j8637j3554p45J2021J7832J4631L050j1049j7798
835d597j5050m644Q565J8046J6537N879q246j6620j6969p499O183J6362J7641
$$ plain form
848 15588 23969 19168 4304 -13066 -23586 -20895 -6067 11259 22688 21658 8333 -9167 -22218
861 -22218 -22875 -10315 7507 21403 23145 12346 -5475 -19834 -23466 -14092 3238 18650 23627
874 23627 15778 -1419 -17048 -23169 -17149 -1211 15447 23576 18377 3008 -13186 -23100 -19696
887 -19696 -5169 12290 22595 20138 7071 -9934 -21625 -21565 -9150 8454 21023 21953 10638
900 10638 -5985 -19712 -22660 -12593 4203 18253 22350 14456 -2079 -17310 -22977 -15915 84
913 84 15589 22535 17401 2398 -13994 -22384 -18524 -4832 12367 22052 19389 6052 -10067 -21079
927 -21079 -20542 -8308 8479 20696 20781 9997 -6487 -19716 -21586 -11999 4208 18388 21874 13396
941 13396 -2524 -16927 -22464 -15023 719 15701 22006 16232 1485 -14252 -21912 -17353 -3643
$$ packed form
848A5588Q381m801j4864j7370j0520K691J4828J7326J1429j030j3325j7500j3051
861b2218o57J2560J7822J3896J742j0799j7821j4359l632R374J7330J5412M977
874B3627p849j7197j5629o121O020J5938J6658Q129n199j5369j6194r914L404
887a9696J4527J7459J0305k457j3067j7005j1691O0J2415J7604J2569R30j1315
900A0638j6623j3727k948J0067J6796J4050M097p894j6535j5231n667P062J5999
913H4J5505O946n134j5003j6392q390L860J3692J7199R685k663j3337j6119j1012
927b1079N37J2234J6787J2217Q5j0784j6484j3229j870R587J6207J4180L486q478
941A3396j5920j4403n537P441J5742J4982O305n774j4747j5737p660M559J3710
$$ plain form
954 -3643 12475 21487 18525 5369 -10635 -20843 -19324 -7256 8935 20203 20255 9083 -7286
967 -7286 -19423 -20892 -10499 5131 18167 21203 12174 -3257 -16713 -21440 -14052 1326 15693
980 15693 21478 15117 506 -14107 -21290 -16306 -2609 12489 20938 17578 4921 -10878 -20597
993 -20597 -18589 -6528 8871 19475 19569 8545 -7071 -18788 -19908 -9864 4903 17907 20546
1006 20546 11644 -3254 -16888 -20588 -13235 1637 15259 20907 14446 -40 -13884 -20682 -15453
1019 -15453 -2068 12669 20550 16936 4048 -11109 -20096 -17262 -5509 9426 19423 18638 7551
1032 7551 -7634 -18679 -19032 -9074 5848 17366 19662 10636 -3917 -16826 -20131 -11958 2351
1045 2351 15780 20087 13414 -499 -14360 -19851 -14234 -815 12891 19620 15917 3104 -11378
$$ packed form
954c643J6118R012k962j3156j6004j0208J519J2068J6191J1268N2j1172j6369
967g286j2137j469J0393J5630J3036L036r029j5431j3456m727P388J5378J4367
980A5693N785o361j4611j4613p183M984J3697J5098Q449l360j2657j5799r719
993b0597K008J2061J5399J0604R4j1024j5616j1717j120J0044J4767J3004K639
1006B0546q902j4898j3634l700P353J4872J3622N648o461j4486j3844o798N229
1019a5453J3385J4737P881l614j2888j5157q987K834J1753J4935R997p85j1087
1032G551j5185j1045l53R958J4922J1518K296r026j4553j2909l305Q173J4309
1045B351J3429M307o673j3913j3861n491N617J3419J3706O729l703j2813j4482
$$ plain form
1058 -11378 -19628 -16769 -4496 10172 19127 17536 6146 -8525 -18290 -18099 -7652 6907 17657
1071 17657 18809 9452 -5075 -16780 -19129 -10857 3222 15778 19230 12339 -1742 -14368 -19355
1084 -19355 -13530 28 13300 19324 14621 1646 -12103 -19490 -15321 -3451 11095 18788 16253
1097 16253 4776 -9381 -18454 -17152 -6374 7628 17563 17696 8173 -6124 -16955 -18502 -9203
1110 -9203 4495 15781 18544 10954 -2546 -14678 -18741 -12167 961 14041 18715 13221 790
1123 790 -12660 -19005 -14592 -2169 11208 18502 15493 3793 -9586 -18099 -16391 -5781 8022
1136 8022 17465 16776 7047 -6688 -16885 -17384 -8247 5142 15816 17830 9898 -3740 -14603 -17876
1150 -17876 -11456 1666 13671 18062 12346 -97 -12928 -17924 -13531 -1583 11308 17976 14357
$$ packed form
1058a1378q250K859J2273J4668Q955j591j1390j4671r765J91J0447J4559J0750
1071A7657J152r357j4527j1705k349Q272J4079J2556L452o891j4081j2626m987
1084a9355N825J3558J3272O024m703j2975j3749p387M169J1870J4546P693k535
1097A6253j1477j4157r073J302J0778J4002R935J33r523j4297j0831j547R299
1110i203J3698J1286K763p590j3500j2132m063O574J3128J3080M674n494j2431
1123G90j3450o345M413J2423J3377P294l009j1700j3379q513J708J0610J3803
1136H022R443o89r729j3735j0197m99R137J3389J0674K014p932j3638j0863l273
1150a7876O420J3122J2005M391n716j2443j2831m996M393J1948J2891O668l619
$$ plain form
1163 14357 2786 -10431 -17478 -15261 -4368 8919 17258 15884 6196 -7331 -16256 -16408 -7722 5735
1177 5735 15659 17041 8882 -4286 -14950 -17242 -10066 2802 14099 17405 10952 -1410 -13047
1190 -13047 -17602 -12132 -303 12031 17465 13609 1846 -10955 -17303 -14602 -3215 9112 16996
1203 16996 15204 4923 -8166 -16516 -15428 -6406 6571 15843 16189 7635 -5181 -15102 -16550 -8520
1217 -8520 4068 14320 16886 10340 -2437 -13556 -16809 -11159 745 12471 17194 12288 812
1230 812 -11410 -16844 -13061 -2165 10126 16528 14042 3201 -8993 -16101 -14568 -5001 7461 16168
1244 16168 15493 5995 -5884 -15300 -15708 -7704 4665 14381 15843 8895 -3253 -13973 -16348 -9772
1258 -9772 2195 12449 16391 11190 -325 -11892 -16983 -11947 -1018 10574 16270 13022 2613
$$ packed form
1163A4357j1571j3217p047K217J0893J3287Q339j374r688j3527q925j52Q686J3457
1177E735R924J382q159j3168j0664k292P176J2868J1297L306o453j2362j1637
1190a3047m555N470J1829J2334N434l856j1763j2801o348K701J1387J2327P884
1203A6996j792j0281j3089q350J088R022J2977R272L46q554j2816r921j448Q030
1217h520J2588J0252K566o546j2777j1119l253N650J1904J1726M723m906j1476
1230H12j2222n434L783J0896J2291O402k486j0841j2194p108J533R567J2462Q707
1244A6168o75r498j1879r416m08Q004J2369R716J462o948j2148j0720k375O576
1258i772J1967J0254L942n201j1515j1567n091N036J0929J1592N696l248j0409
$$ plain form
1271 2613 -9690 -16284 -13649 -3591 8157 15850 14652 5449 -6956 -15041 -15000 -6554 5627 14631
1285 14631 15731 7971 -4291 -13880 -16202 -9381 2661 12936 15769 10297 -1143 -11724 -16221
1298 -16221 -11427 -100 10974 16006 12328 1523 -9656 -16021 -13377 -2762 8550 15516 13869
1311 13869 4728 -7596 -15080 -14514 -5801 6135 14625 14748 7102 -4649 -14094 -15460 -8563 3051
1325 3051 13038 15825 9593 -1784 -12211 -15943 -10569 513 11091 15754 11220 980 -9867
1338 -9867 -15382 -12621 -2386 8896 15339 12882 4088 -7575 -15175 -13875 -5137 6695 14414 14223
1352 14223 6375 -5048 -13677 -15058 -7234 4041 12732 14976 8698 -2662 -12157 -15287 -9692 969
1366 969 11370 15358 11005 157 -10192 -15150 -12018 -1706 9178 15442 12660 3136 -8067 -14761
$$ packed form
1271B613j2303o594K635J0058J1748P693j198r203j2405q085M1Q446J2181R004
1285A4631J100p760j2262r589k322O821J2042J0275K833n472j1440j0581m497
1298a6221M794J1327J1074N032l678j0805j1179o365K644J0615J1312O966j647
1311A3869r141j2324p484N66Q713J1936Q490J23p646j1751r445j366O897J1614
1325C051R987K787o232j1377j0427l732N374J1082J0578M663m534j0240j0847
1338i867n515K761J0235J1282O443k457q794j1663p600J300Q738J1832P719j91
1352A4223p848j1423q629j381P824J1275Q691K244o278j1360r495l130N595J0661
1366I69J0401L988m353j0848j0349m958L132J0312J0884O264k782r524j1203o694
$$ plain form
1380 -14761 -13153 -4368 6862 14216 13631 5487 -5601 -13798 -14293 -6713 4461 13096 14374 7667
1394 7667 -2844 -12289 -14785 -9129 1514 11242 14713 10116 -577 -10993 -14947 -10839 -977 9740
1408 9740 14848 11898 2111 -8723 -14328 -12409 -3462 7739 14433 12780 4868 -6298 -13773 -13328
1422 -13328 -5746 5313 13512 14000 7101 -3889 -12663 -14351 -8255 2727 11829 14537 8922 -1378
1436 -1378 -10956 -14418 -9998 -143 10112 14447 10842 1559 -8730 -14369 -11807 -2361 7895 14148
1450 14148 12635 4103 -6733 -13779 -12735 -5068 5359 13299 13509 6080 -4433 -12777 -14055 -7254
1464 -7254 2891 11827 14043 8142 -1950 -11039 -14162 -9450 345 10013 14412 10138 582 -9072
1478 -9072 -14133 -11170 -2260 8272 13833 12164 3355 -7091 -13574 -12561 -4669 6038 12976 13266
$$ packed form
1380a4761J608Q785J1230P354n85q144j1088q197m95P580J1174Q635J278o707
1394G667j0511r445k496N656J0643R728L471m597j0693j0416l954M108R862J0717
1408I740N108k950r787j0834n605J919Q947J1201O694j653p912j1166p475M45
1422a3328P582J1059Q199M88o899j0990q774j688O096J0982R102K708n615j0300
1436a378r578l462M420R855J0255M335l605r283j0289n639K562R446J0256O253
1450A4148j513q532j0836p046J044P667J0427P940K10p429j0513q344j278O801
1464g254J0145Q936K216n901j0092r089l123M712R795R668M399m274r556r654
1478i072n061K963Q910J0532N561j669q809j0446o483J013P892J0707O938K90
$$ plain form
1492 13266 5950 -4715 -12607 -13170 -6836 3272 12051 13779 8155 -2013 -11242 -13738 -8992 962
1506 962 10483 14147 9876 396 -9060 -13898 -10696 -1665 8570 13877 11580 2653 -7310 -13459 -11889
1521 -11889 -3927 6035 12917 12613 5338 -4959 -12283 -13017 -5983 3597 11854 13314 7398 -2782 -11508
1536 -11508 -13597 -8688 1279 10456 13817 9206 -511 -9608 -13489 -10017 -997 8747 13144 10787 2019
1551 2019 -7343 -12899 -11641 -3553 6723 12774 12169 4507 -5366 -12420 -12307 -5467 4538 11959 12575
1566 12575 6657 -3245 -11203 -13046 -7519 2195 10703 13375 8496 -623 -9785 -13009 -9432 -561 8855
1581 8855 13126 10127 1370 -8123 -12965 -11039 -2568 7018 12576 11372 3496 -5710 -12535 -11703 -4919
1596 -4919 4820 11842 12395 5708 -3779 -11271 -12670 -6813 2686 10832 12569 7510 -1414 -9764 -12900
$$ packed form
1492A3266p316j0665p892n63O334J0108Q779J728n624j0168r229k496M746R954
1506I62R521L664m271r480r456m838L202R031J0235N307k297q927r963o149J570
1521a1889P962R962O882l04p275j0297p324p34P034R580Q257J460n916j0180q726
1536a1508k089M909R967R177L361m611r717r097l881L472R020R744M397k357q768
1551B019r362n556J258Q088J0276O051o05p662r873p054J13O840J0005P421O16
1566A2575n918r902p958j843N527R714Q508K672m879r119r162l224L577Q871R416
1581H855M271k999q757r493m842J926Q471R586N558j204p876r206o825Q32O784
1596d919R739P022N53o687r487p492j399N857R499Q146J737n059q924q350l136
$$ plain form
1611 -12900 -8792 481 9587 13177 9440 619 -7954 -12861 -10140 -2012 7409 12699 11027 3096 -6277
1626 -6277 -12408 -11228 -4113 5304 11928 11658 5308 -4247 -11216 -12131 -6405 2820 11045 12320 7301
1641 7301 -1950 -10064 -12473 -8527 575 9206 12605 9036 286 -8528 -12444 -9890 -1374 7399 12352
1656 12352 10366 2783 -6714 -12067 -11101 -3683 5656 11588 11613 4861 -4653 -11529 -11578 -5760 3383 11133
1672 11133 12134 6661 -2188 -10160 -12199 -7547 1219 9428 12188 8226 106 -8633 -12458 -9151 -1150
1687 -1150 7918 12236 9582 1925 -6642 -11607 -10394 -3251 5641 11636 10956 3911 -4776 -11394 -11462 -5196
1703 -5196 3683 10671 11594 5936 -2785 -10208 -11990 -6744 1811 9400 12071 7470 -896 -8706 -12081
1718 -12081 -8548 -518 8103 11960 9570 1466 -7136 -11484 -9700 -2368 6217 11577 10409 3407 -5109
$$ packed form
1611a2900M108R273R106L590l737q821q573m907K721Q128R421N290j672p931r373
1626f277o131J180P115R417O624k70o350r555o969r15N726R225Q225J275n019
1641G301r251q114k409L946R102Q631L399l569q750q814l916K554Q516Q773M953
1656A2352j986p583r497n353R66P418R339N932K5o752r514o876m9N818R143P750
1672A1133J001n473q849p972k039M652Q766Q209K760l962q120q739l825L307Q001
1687a150R068M318k654p657q567m965J213P143Q892N995o80p045q687o618o8O266
1703e196Q879O988R23n658q721p423j782N246Q555P589K671m601q366p810l375
1718a2081L533Q030Q621L857k390q104q602m348J784P332Q585N360j168p002q516
$$ plain form
1733 -5109 -11020 -10951 -4274 4333 10832 11094 5491 -3210 -10368 -11313 -6569 2484 9747 11623 6966 -1011
1749 -1011 -8935 -11791 -7907 -47 8184 11497 8851 1164 -7273 -11513 -9353 -2215 6416 11306 9937
1764 9937 3043 -5579 -11152 -10854 -3976 4608 10794 10807 4944 -3695 -10044 -10870 -6019 2391 9786 11423
1780 11423 6736 -1526 -9144 -11795 -7821 367 8329 11489 8509 867 -7193 -11371 -8928 -1595 6427
1795 6427 11046 9687 2583 -5711 -10678 -10011 -3809 4836 10807 10370 4461 -3637 -10141 -10670 -5476 2903
1811 2903 9401 10761 6337 -1751 -8977 -11021 -7241 991 8235 11127 7743 99 -7882 -10816 -8566
1826 -8566 -1185 7010 11124 9159 1923 -5981 -10675 -9498 -2925 5210 10417 10108 3874 -4256 -10053
1841 -10053 -10385 -4948 3093 9431 10454 5628 -2460 -9003 -11156 -6589 1376 8342 10904 7004 -568
$$ packed form
1733e109n911O9O677Q607O499K62n603q701p158r45M744R053P263J876m657p977
1749a011p924k856L884P860Q231L313k646p687q437m240K160P138Q631M890j369
1764I937o894q622n573K98O878Q584O186J3n863q639o349q26M851Q410P395J637
1780A1423m687q262p618k651L974Q188P962L160k980p642q060m178K443P333Q022
1795F427M619j359p104q294m967O67O202Q645N971m37n909q098o504n29N194Q379
1811B903O498J360m424q088p226k044L780Q232P244K892l384p644p981k934K250
1826h566P381Q195M114j965p236p904m694J177O573Q135N207l09o234q130n797
1841a0053l32N437Q041O338J023m826q088o543k153M567P965O966K562l900p572
$$ plain form
1856 -568 -7972 -10731 -7989 -324 7084 10896 8399 1345 -6415 -10892 -8816 -2466 5642 10933 9313
1871 9313 3113 -4718 -9884 -9718 -4100 3553 9684 10236 4907 -2957 -9164 -10348 -5761 1858 8734
1886 8734 10612 6670 -1141 -7902 -10326 -7262 343 7491 10584 7590 829 -6806 -10325 -8525 -1768
1901 -1768 5783 10365 9127 2614 -4979 -9972 -9149 -3457 4391 9595 9621 4015 -3503 -9167 -10136 -4987
1917 -4987 2655 8534 10081 6080 -1279 -8140 -10382 -6465 548 7550 10308 7170 401 -6711 -10103
1932 -10103 -8032 -1475 5934 10121 8369 2129 -5303 -9675 -8773 -3052 4233 9502 9290 3739 -3945
1947 -3945 -8949 -9690 -4622 2923 8458 10124 5082 -1990 -8293 -10002 -6305 993 7804 9851 6993
1962 6993 134 -7040 -10112 -7206 -675 6455 9735 7607 1485 -5671 -9555 -8462 -2241 4997 9233
$$ packed form
1856e68p404k759K742P665P408L812k497p054p760m477K076O350Q108N291j620
1871I313o200p831n166J66N618P653O131N52n329p864o207j184M587P619O876
1886H734J878l942p811o761k424L064P605P148L093k994o761p635l519J800O757
1901a768P551M582j238o513p593m993Q23N692P848N204K6n606p518n664r69N149
1917d987P642N879J547m001p359o861k242L917P013P002K758l138o769p112l392
1932a0103K071O557P409M187j752o240p432m372R02N721P285N269k12n551p684
1947c945n004p41N068P545N535J666n042p072o303j709L697P298O811K047k858
1962F993o859p174l072K906O531P130L280k128o122p156l884J093O221P238M236
$$ plain form
1977 9233 8792 3044 -4166 -8730 -8817 -3979 3508 8746 9148 4493 -2566 -8514 -9411 -5284 1590 8000
1993 8000 9723 6046 -861 -7508 -9668 -6742 67 6876 9868 7242 937 -6072 -9194 -7742 -1515
2008 -1515 5270 9208 8137 2674 -4379 -9373 -8591 -3341 3680 8732 8765 4465 -3036 -8773 -9112 -4719
2024 -4719 2364 8048 9233 5581 -1292 -7341 -9509 -6384 656 6950 9308 6806 379 -6273 -9335
2039 -9335 -7234 -1162 5660 9144 7925 1971 -4817 -8809 -8457 -3001 3781 8775 8557 3627 -3245
2054 -3245 -8330 -8572 -4369 2325 8387 9185 5016 -1625 -7417 -9085 -5720 814 7386 9136 6609
2069 6609 -294 -6292 -9076 -6920 -691 5797 9079 7459 1663 -5052 -8798 -7785 -2519 3808 8946
2084 8946 8196 3218 -3315 -8275 -8616 -4043 2833 7877 8828 4661 -1997 -7152 -8811 -5650 1232 7144
$$ packed form
1977I233m41n748p210m564q7M838P487N238M02m655p059n948q97M127O874O410
1993H000J723l677o907o647k160K926O809O809K992k626o305p009l122J452O227
2008a515O785L938j071n463p053m994P82N250P021N052L3m300p501n737l39M393
2024d719P083N684J185l652o873o049k168L125P040O294K358k502o427o652l062
2039i335K101O072O822L484j219n954o788l992L52N456O782M994k18m930o872
2054c245n085k42M203O694O062P98m169o641n792j668L365O534O572J750k527
2069F609o903n998k784K156O229O488L282j620n796o715l746J013N266O327N138
2084H946p50m978o533m960l41M573O876N044R51m167o658n155j659L161O882N912
$$ plain form
2100 7144 8857 5682 -190 -6292 -9038 -6578 -515 5878 8760 7137 1539 -5073 -8937 -7531 -2139
2115 -2139 4548 8327 7923 2826 -3657 -8389 -8281 -3448 3006 8288 8368 4370 -2278 -7578 -8690 -5106
2131 -5106 1212 7249 8866 5589 -591 -6418 -8701 -5986 -130 5791 8755 6486 1077 -5168 -8722
2146 -8722 -7359 -1936 4364 8445 7544 2613 -3744 -8225 -8288 -3329 3161 7962 8217 4079 -2556 -7613
2162 -7613 -8641 -4880 1822 6943 8306 5255 -995 -6702 -8646 -5953 -104 5820 8557 6397 256
2177 256 -5570 -8485 -6657 -1240 4662 8565 7062 1881 -4458 -8352 -7563 -2835 3494 7745 7719 3434
2193 3434 -2906 -7456 -7993 -4261 2016 7079 8302 4850 -1088 -6740 -8355 -5447 530 6128 8316
2208 8316 5986 162 -5987 -8623 -6238 -1132 4725 8270 6852 1690 -4154 -8270 -7005 -2431 3753
$$ packed form
2100G144J713l175n872o102k746K460O063O393K882j623n598o612l864J406N392
2115b139O687L779m04n097o483m732J08M833O454N282Q0l998o648n300j112L584
2131e106O318O037J617l277o180n827k283K715N856N921K964k269n409o245l554
2146h722J363N423O300M081r01m931o357m481o3M959O490M801K55m138o635n057
2162g613j028L761O702N121J363l051o250n707j944K693N849N924K737k160o141
2177B56n826k915J828N417N902L903j503n181o339l894P89M728O329M251k6m285
2193C434o340m550n37L732O277N063J223l452n938n652j615K908N977N598K188
2208H316k330n824o149k636K385N106N857L545j418n162n844m116J265M574O184
$$ plain form
2223 3753 7696 7508 3076 -3124 -7585 -7938 -4118 2229 7288 8091 4482 -1655 -6493 -8142 -4970 740
2239 740 6147 8006 5392 -52 -5619 -8512 -6298 -492 4933 8021 6350 1328 -4610 -7962 -7088
2254 -7088 -2002 3931 7823 7250 2650 -3245 -7320 -7495 -3507 2589 7116 7677 4395 -1883 -6888 -7814
2270 -7814 -4366 1091 6180 7792 5173 -177 -5943 -8190 -6000 -485 5217 7754 6471 1224 -4671
2285 -4671 -7979 -6922 -1624 3990 7285 7054 2634 -3259 -7442 -7516 -3086 2548 6773 7536 4216 -1622
2301 -1622 -6735 -7658 -4385 1068 6119 7929 5117 -59 -5629 -7859 -5566 -682 5318 7558 6147
2316 6147 1034 -4280 -7479 -6464 -1516 4030 7541 6717 2086 -3352 -7087 -7206 -3227 2718 6818
2331 6818 7406 3622 -2327 -6620 -7512 -4510 1385 6331 7688 4818 -498 -5847 -7821 -5261 -32
$$ packed form
2223C753L943j88m432o200m461l53L820O347N059Q03l609o137m838j649L172N710
2239G40N407J859k614n444n567k893K214N806N425L088j671n022n938l352Q74
2254g088N086N933L892n73m600n895m075j75L988O096M527N61l282o278n005r26
2270g814L448N457N089J612k619n350n766k247K190N515N702K537j283n247n895
2285d671l308J057N298N614L295k31m420n893m183p4M430N634M225P63l320n838
2301a622n113r23L273N453N051J810k812n176n570k230K293M884O000K240j411
2316F147n113n314l199J015M948N546L511q24m631n438l735j19L979N945M100
2331F818N88l784n949m293q92L002N895M946J357k870n316n349j974K560N229
$$ plain form
2346 -32 5266 7361 5921 828 -4764 -7342 -6107 -1367 4103 7540 6820 1968 -3717 -6955 -6698 -2566
2362 -2566 3158 6919 7218 3025 -2240 -6619 -7090 -3764 1547 6351 7516 4476 -1028 -5944 -7511
2377 -7511 -4884 313 5020 7393 5376 268 -5186 -7313 -5830 -947 4355 7272 6503 1733 -3585
2392 -3585 -7179 -6219 -2319 2917 6974 6964 2732 -2747 -6677 -7027 -3418 1724 6097 7277 4152 -724
2408 -724 -5912 -6994 -4812 660 5560 7266 4994 -65 -4955 -7103 -5573 -662 4914 7169 5849
2423 5849 1132 -3902 -6979 -5855 -2237 3464 6988 6377 2521 -2889 -6640 -6488 -2926 2052 6108
2438 6108 6738 3593 -1469 -5939 -6787 -4212 853 5541 6668 4733 -514 -5229 -7210 -4895 -178
2453 -178 4651 7009 5483 859 -4340 -7020 -5830 -1148 3521 6976 6174 1890 -3100 -6503 -6128 -2602
$$ packed form
2346c2N298K095j440n093n592k578J235M740N470L437p20m852n685l238K57M132
2362b566N724L761K99m193n265m379m71L326N311M804J165l040n504m916j567
2377g511K627N197M707K373k017n108n454k127J483M883N302K917p69m770n318
2392c585l594R60L900N236M057j0m232n479l930l50L609N142M373J180l125m876
2408g24n188j082K182N472M900J706k272n059m890k148J530M911N576K255j320
2423E849m717n034l077J124L618N701L524o11l856n410l751J52L562M978M056
2438F108O30l145n062m470q48K575N065M688J127j935n247m715j981K315M717
2453a78M829K358j526m624n199k680J190M682M669L455q02m284m990l403L75L526
$$ plain form
2469 -2602 2685 6093 6412 3032 -2061 -6012 -6670 -3407 1537 5972 6702 4271 -725 -5646 -6783 -4421
2485 -4421 507 4724 6919 5059 530 -4429 -6799 -5662 -1004 3983 6659 5797 1591 -3390 -6504
2500 -6504 -5716 -2142 2444 6270 6233 2797 -2600 -6100 -6514 -3210 1648 5783 6768 3748 -1075 -5283
2516 -5283 -6820 -4365 479 5053 6578 4815 -33 -4881 -6666 -5082 -551 3849 6757 5625 1478
2531 1478 -3611 -6486 -5909 -1806 2998 6253 6148 2460 -2459 -6085 -6345 -2874 1876 5546 6490 3437
2547 3437 -1384 -5138 -6609 -4171 850 5179 6493 4445 -125 -4665 -6452 -4678 -396 4233 6391
2562 6391 5046 906 -3825 -6302 -5391 -1677 2911 6113 5601 2160 -2671 -5918 -5991 -2706 2119 5784
2578 5784 6514 3321 -1537 -5644 -6394 -3721 1142 4866 6371 4473 -162 -4675 -6188 -4838 -150
$$ packed form
2469b602N287L408L19l380n093l951o58L263M944M435P30k431m996m921j137K362
2485d421M928M217K195j860m529m959k370J137M658M987K676q62m206m981l114
2500f504P88L574M586L826l7l436n397l500m14L304M858M135R85l020m823m208
2516e283j537K455M844M574J525j763m848m848j785J584M531M400K908j132m147
2531A478n089k875N77M103M804L255j05l688m919l626k60L471M750L670R44l053
2547C437m821l754j471K438N021M329J314k048m570m540j787J774M282M629K158
2562F391j345m140m731k477R11L714M588L202n12l441m831l247p3L285M825L665
2578E784P30l193m858m107p50K673M863L724J505j898m635m513j513J350M688
$$ plain form
2593 -150 4489 6555 4830 755 -3910 -5968 -5236 -1140 3523 6142 5461 1648 -2958 -5853 -5604 -2564
2609 -2564 2343 6073 6009 2849 -1929 -5413 -5990 -3290 1452 5091 5799 3912 -862 -4828 -6215 -4200
2625 -4200 110 4358 6076 4628 661 -3935 -6272 -4781 -741 3571 6255 5379 1599 -3038 -5991
2640 -5991 -5656 -1932 2471 5821 5649 2458 -2172 -5473 -5578 -3033 1101 4998 5994 3607 -1160 -4846
2656 -4846 -6002 -3988 353 4535 6042 4449 210 -3979 -5908 -4491 -715 3715 5933 4949 1177
2671 1177 -3483 -5801 -5285 -1713 2865 5383 5494 2056 -1943 -5162 -5838 -2691 1606 5131 5628 3137
2687 3137 -1225 -4869 -5809 -3390 444 4687 6118 3878 -315 -4216 -6171 -4157 -279 3683 5828
2702 5828 4592 774 -3701 -5801 -4879 -1432 2898 5498 5214 1958 -2400 -5517 -5509 -2821 1605 5068
$$ packed form
2593a50M639K066j725m075m665k058P32M096M663K619o81l813m606k895K49L040
2609b564M907L730o4l160m778l484n77K700M742L639P08j887m774l966j387K015
2625d200M310M248J718j448l967m596k337J491M040M312K684q76l780m637k953
2640e991L35L724M403L350j72l191m630l301j05K545M134L897R96k387m767l686
2656d846j156K014M341M182J507j593m239m189j929J417L776M430K218r84l772
2671A177m660k318N16L572M578K518J11l438l999l219o76L147M297L525M97k491
2687C137m362l644r40K419L834M243J431k240m193l901j955K014L878L962K145
2702E828j236l818m475k100R22L447M330K600k84l256m358l117QK688M426L463
$$ plain form
2718 5068 5632 2809 -1749 -4857 -5480 -3048 816 4878 5582 3731 -257 -4291 -5753 -3983 136 4047
2734 4047 5583 4079 587 -3568 -5723 -4753 -1289 3109 5432 5009 1651 -2766 -5334 -5181 -1818 2152
2750 2152 5326 5416 2475 -1799 -4802 -5589 -2884 1335 4814 5563 3632 -995 -4352 -5648 -3725 272
2766 272 4107 5702 4131 202 -3699 -5797 -4516 -581 3276 5068 4589 1123 -2765 -5425 -5011 -1683
2782 -1683 2658 5215 4778 2193 -1852 -5185 -5177 -2779 1338 4571 5382 2934 -1058 -4158 -5432 -3325
2798 -3325 378 4066 5462 3742 -335 -3828 -5564 -4407 -434 3712 5320 4226 698 -3245 -5252
2813 -5252 -4825 -1351 2647 5001 5033 1684 -1984 -5090 -5072 -2546 1651 4622 4965 2890 -1195 -4326
2829 -4326 -5561 -2991 655 4060 4990 3444 -180 -4074 -5232 -3844 85 3568 5254 3948 578
$$ packed form
2718E068N64k823m558l108o23K432L864M062P04j851l988m034j462J770M119L911
2734D047J536j504l492m155k155R70L464M398K323m23l358m417k568J53L363L970
2750B152L174R0k941m274l003p87K705M219L479P49j931m627l357j296J923L997
2766B72L835J595j571l929l901k098J281L935L857J792m79l466l888k660M14L328
2782a683M341K557m37k585m045l333QK398M117L233Q11k448l992l100j274K107
2798c325L703L688J396j720m077l493j736J157L973M146J608j094l528l943k007
2813e252M27L474L998K354L2l349l668l106J8K526M197K971L43k075m085l131
2829d326j235K570L646L405R30j546l624l894j158J388L929L483J686j306l370
$$ plain form
2844 578 -3250 -5276 -4453 -1087 2893 5267 4416 1746 -2457 -5185 -4755 -1754 2055 4612 5172 2381
2860 2381 -1576 -4829 -5308 -2652 1125 4607 5107 3187 -603 -3877 -5209 -3872 -38 3825 5287
2875 5287 3924 278 -3155 -5249 -4078 -873 2777 4970 4715 1330 -2613 -4836 -4622 -1844 2307
2890 2307 4758 4948 2147 -1723 -4330 -4976 -2312 1175 4547 4890 3171 -890 -4155 -4962 -3250 550
2906 550 3621 5191 3682 -29 -3602 -4817 -4002 -683 3134 4958 4208 1093 -2803 -5027 -4388 -1515
2922 -1515 2156 4466 4736 1625 -1692 -4598 -4762 -2215 1428 4164 4816 2594 -1159 -4330 -4958 -2897
2938 -2897 315 3809 5133 3196 -8 -3086 -4640 -3638 -353 3476 4724 4054 935 -2578 -5200
2953 -5200 -4106 -1441 2372 4735 4698 1671 -2308 -4782 -4952 -2050 1419 4009 4717 2478 -1328 -4263
$$ packed form
2844E78l828k026Q23L366L980K374q51k670m203k728M30L001L809K557N60k791
2860B381l957l253m79K656L777L482N00j920l790l274j332J337L834L863J462
2875E287j363l646l433k094J171L205L650K193k55l385l943k223K14K778M151
2890B307K451J90k801l870k607o46K664L487L372L43j719m061l265q07J712L800
2906E50L071J570j509l711l573j215Q15L319L817J824p50l115l896k224O39K873
2922a515L671K310K70l111l317k906j64K547L643K736O52k222l753l171o28K061
2938b897L212L494J324j937l204l078j554J002L285L829J248o70l119l513k622
2953e200J094K665L813K363l7l027l979k474j70K902L469K590P08k239l806k935
$$ plain form
2969 -4263 -4880 -2665 399 3934 4845 3157 -241 -3767 -4817 -3518 -324 3396 4773 3759 741
2984 741 -2754 -5011 -4193 -1099 2570 4754 4129 1310 -2323 -4498 -4433 -1789 1978 4360 4675 2611
3000 2611 -1272 -4085 -4805 -2530 937 3901 4583 2901 -512 -3708 -4522 -3149 -50 3309 4931 3401
3016 3401 502 -3025 -5000 -3820 -820 2587 4417 4138 951 -2356 -4571 -4247 -1490 2049 4308
3031 4308 4496 1927 -1327 -4236 -4545 -2231 1168 4077 4491 2611 -728 -3597 -4894 -3225 450 3593
3047 3593 4495 3264 226 -2961 -4380 -3595 -655 2830 4701 3965 774 -2346 -4530 -4061 -1169 2152
3063 2152 4078 4207 1951 -1877 -4326 -4548 -2090 1193 4190 4701 2572 -1216 -3866 -4514 -3033 262
3079 262 3184 4640 2917 -288 -3360 -4661 -3398 -326 3222 4619 3379 796 -2645 -4428 -3726
$$ packed form
2969d263o17K215L064L535R11j688l398l526j050J299L194L720J377j014l018
2984G41l495k257Q18L094L669K184o25k819l633k175O5K644L767K382L15k064
3000B611l883k813p20K275L467K964O82j682l413l196q14J373L099L359J622j530
3016C401k899l527j975J180L000L407J830k79l187l307k215L24K757L539K259
3031D308J88k569l254k909l09K314L399K909M14j880l339k869j297J669L675L143
3047C593R02j231l038l187j419P85K940L485J871p36l191l120k184M69K892L321
3063B152J926J29k256l828k449k22K458L283K997N11k129l788k650o48J481L295
3079B62K922J456j723l205l072j301J263L072L548J397j240k583l441j783P02
$$ plain form
3094 -3726 -1110 2451 4458 3958 1522 -2010 -4046 -4220 -1815 1476 4062 4076 2138 -1012 -3988 -4336
3110 -4336 -2227 781 3583 4430 2777 -358 -3376 -4325 -2962 -260 2978 4565 3459 677 -2833
3125 -2833 -4412 -3733 -900 2671 4084 4188 1334 -2202 -3940 -3876 -1570 1421 4130 3933 1951 -1285
3141 -1285 -3880 -4315 -2582 1016 3556 4258 2517 -288 -3354 -4524 -2776 99 3223 4401 3589 35
3157 35 -3111 -4345 -3113 -899 2570 4252 3405 849 -2054 -4072 -3649 -1504 1874 3998 4214 1716
3173 1716 -1591 -3787 -4253 -2439 1125 3655 4161 2419 -692 -3635 -3996 -2941 116 3316 4155 3023
3189 3023 117 -2738 -4445 -3049 -238 2371 3942 3666 1063 -2195 -4188 -3935 -1263 2100 3958
3204 3958 3923 1807 -1804 -3926 -3728 -1951 1420 3663 4129 2172 -839 -3435 -3971 -2562 692 3408
$$ packed form
3094c726K616L561K007n00k436l532k036j74K405L291K586J4j938l150k976l48
3110d336K109L008K802Q47j653l135l018r49J363K702L238J587j106k782l510
3125b833j579O79K833L571J413J04k854l536j738O4K306K991K709j97j982l236
3141a285k595m35J733L598K540P02j741k805l066j170J748K875L124J178q12l554
3157C5l146j234J232K214L469J682q47k556k903k018M23K145L378K124K16k498
3173A716l307k196m66J814L564K530N06j742l111k943l61J055L057L200Q39j132
3189C023k906k855j707J396K811K609J571k76k603l258j993K53K672L363J858
3204C958l5k116l611k122J98J777L371K243M66j957l011k596n36J409L254K716
$$ plain form
3220 3408 4077 2766 -387 -3301 -4067 -3018 86 2686 4116 3345 386 -2445 -4213 -3452 -800 2280
3236 2280 3834 3934 1044 -1941 -3805 -3701 -1624 1472 3750 3958 1968 -860 -3748 -4185 -2230 739
3252 739 3407 4141 2552 -417 -2994 -4226 -3047 29 2877 4232 3218 312 -2595 -3826 -3122 -563
3268 -563 2192 3601 3511 1170 -1889 -3869 -3378 -1518 2023 3517 3786 1808 -1414 -3483 -3814 -2109
3284 -2109 1029 3507 3960 2260 -663 -2849 -3884 -2474 125 2913 3943 2668 367 -2277 -4024
3299 -4024 -3010 -286 2495 3806 3220 842 -1900 -3692 -3471 -991 1947 3648 3702 1664 -1341 -3706
3315 -3706 -3549 -1838 1121 3282 3616 1755 -785 -3327 -3890 -2450 140 2815 3774 2567 -140 -2803
3331 -2803 -3794 -2849 -193 2559 3421 3057 636 -2210 -3745 -3282 -810 1762 3757 3394 1383 -1588
$$ packed form
3220C408O69j311l153k914p66J049L104K600J430p71k959k831j768P61K652L080
3236B280J554J00k890k985j864J04K077L096K278K08j990k828k888m37J955K969
3252G39K668P34j589k969k577j232J179L076K848J355j014k906k907j231P04K559
3268e63K755J409r0k341l059j980M91J860L541J494K69j978l222k069l31J705
3284b109L138K478M53j700k923k186j035J410K599K788J030j275k301k644j747
3299d024J014K724K781J311n86k378k742j792K21K480K938J701N4k038l005k365
3315c706J57J711K959K161L34j861k540k542n63J440K590K675R59j207k707k663
3331b803r91R45K656K752Q62l64k421k846j535M63K472K572J995l63k011k971
$$ plain form
3347 -1588 -3541 -3627 -1423 1581 3352 3632 1754 -916 -3012 -3665 -2163 835 2960 3853 2203 -358
3363 -358 -2819 -3581 -2507 111 2892 3694 2795 562 -2185 -3928 -2659 -702 1854 3596 3169 725
3379 725 -1810 -3411 -3406 -1343 1402 3331 3465 1782 -1457 -3157 -3715 -1812 618 2927 3701 2198 -784
3396 -784 -2624 -3818 -2467 -16 2689 4111 2723 385 -2409 -3743 -2875 -495 2123 3730 3130 685
3412 685 -2032 -3503 -3154 -1270 1480 3235 3487 1472 -1129 -3271 -3503 -1897 679 3021 3433 2307
3428 2307 -910 -3317 -3518 -2443 517 2584 3653 2562 -46 -2525 -3672 -2762 -238 1991 3419
3443 3419 2874 484 -1891 -3462 -2816 -697 1755 3370 2911 943 -1458 -3109 -3188 -1511 1100 3153
3459 3153 3441 1837 -883 -3217 -3403 -1682 324 2706 3615 2186 -385 -2625 -3584 -2364 -73 2277
$$ packed form
3347a588j953q6K204L004J771K80j878k670k096o53J502K998K125Q93j650k561
3363c58k461p62J074K618K781Q02q99k233k747j743J269J957K556J742m27k444
3379G25k535j601NK063K745J929J34j683l239j700n58J903K430K309P74j503k982
3396g84j840j194J351K451K705J422j388k338k794j334Q68K380K618J607o00k445
3412F85k717j471L49J884K750J755K52k015k601k142k32J606K576K342M12j126
3428B307l217k407k01J075K960K067J069j091k608k479j147R10K524K229J428
3443C419n45k390k375j571O46K119K452J615m59j968k401j651p9J677K611K053
3459C153K88j604k720k334j86J721K006K382R09j429k571k240r59J220K291K350
$$ plain form
3475 2277 3572 2678 410 -2197 -3516 -2759 -728 2138 3262 2933 1377 -1471 -3476 -3253 -1474 1146
3491 1146 3213 3121 1563 -1329 -2960 -3245 -1557 897 2712 3201 1849 -457 -2700 -3610 -2277 54
3507 54 2228 3648 2741 483 -2091 -3215 -2892 -563 2265 3121 2828 866 -1591 -3393 -2816 -1430 1564
3524 1564 3220 2929 1160 -1227 -2686 -2946 -1414 710 2906 3299 2066 -841 -2483 -3275 -2197 407
3540 407 2658 3532 2290 146 -2173 -3089 -2537 -406 1927 3547 2775 688 -1674 -3264 -2797 -900
3556 -900 1560 2957 3068 1077 -1401 -3053 -3316 -1628 1055 2874 3181 1693 -540 -2717 -3289 -1811
3572 -1811 244 2526 3118 2100 -74 -2063 -3253 -2151 -105 2219 3124 2473 772 -1857 -3064 -3051
3588 -3051 -778 1640 2830 2646 1180 -1277 -2849 -2788 -1265 1040 3056 2955 1554 -842 -2654 -3065
$$ packed form
3475B277J295q94k268k607j319P57K031K866J124l29j556k848k005K23J779K620
3491A146K067r2j558k892j631k85J688K454J815M89j352k306k243r10J333K331
3507E4K174J420r07k258k574j124L23K329K828Q56k93j962k457j802N77J386K994
3524A564J656k91j769k387j459k60J532K124K196L93j233k907j642p92J078K604
3540D07K251Q74j242k144k319r16N52K131K333J620p72k087k362j590M67J897
3556i00K460J397J11j991k478j652k63J688K683J819L07j488k233k177n72J478
3572a811K055K282N92j018k174j989j190J102K046K324R05o51j701k629j207J3
3588c051K273K418J190j84j466k457j572O1J523K305K016j01j401k396j812m11
$$ plain form
3604 -3065 -1647 635 2602 3173 1974 -248 -2387 -2956 -2426 -315 1744 3179 2822 653 -1879 -2793
3620 -2793 -2778 -615 1489 2732 2559 957 -1477 -2931 -2733 -1489 1201 2780 3092 1541 -789 -2670
3636 -2670 -3052 -1650 354 2558 3084 1796 -323 -2461 -3276 -1966 -106 2152 3051 2358 245 -2267
3652 -2267 -3014 -2710 -434 1855 3163 2647 892 -1193 -3135 -2814 -837 1245 2726 3017 1313 -1088
3668 -1088 -2671 -2949 -1472 796 2609 2973 1770 -71 -2424 -2960 -1994 249 2239 2869 2033 47
3684 47 -1935 -3156 -2452 -410 1769 2761 2459 440 -1283 -2728 -2473 -834 1340 2778 3037 1031 -1051
3701 -1051 -2621 -2941 -1412 698 2575 2873 1568 -689 -2497 -2605 -1846 22 2020 3179 2191 -62
3717 -62 -2176 -2985 -2103 -500 1625 3197 2461 323 -1511 -2991 -2546 -640 1459 2822 2883 1205 -1120
$$ packed form
3604c065J418K282J967N71j199k222k139n69N30K111K059J435l57k169k532r14
3620b793J5K163K104J243j73j602k434j454J98J244K690J579L12j551k330j881
3636b670l82J402K004K204N26j288k119k138q15J310J860K258Q99o93k113k512
3652b267p47L04K276K289J308n16j755k085j942L21J977K082J481K91j704k401
3668a088j583k78J477K268J813L64j203j841k353n36R66K243J990O30q36j986
3684D7j982j221P04K042K179R92l02k019j723j445K55J639K174J438K59k006k082
3701a051j570l20J529K110J877K98j305k257j808j08P59J868J998J159r88k253
3717f2k114q09Q82J603K125J572p36k138j834j480M45J906K099J363O1j678k325
$$ plain form
3734 -1120 -2524 -2816 -1121 645 2627 2780 1682 -689 -2685 -2638 -1717 654 2215 2895 1981 -76 -2233
3751 -2233 -2832 -2246 194 1907 2966 2385 407 -1492 -3045 -2512 -490 1346 2736 2632 1013 -1012
3767 -1012 -2747 -2633 -1055 1035 2606 2838 1533 -735 -2474 -2860 -1395 457 2144 2900 1908 -131
3783 -131 -1903 -2555 -2024 94 1870 2818 2221 249 -1780 -2651 -2406 -718 1591 2670 2600 816 -1288
3800 -1288 -2676 -2377 -958 962 2509 2687 1228 -579 -2514 -2602 -1434 581 2458 2543 1621 -356 -2036
3817 -2036 -2621 -1894 42 2129 2891 2009 397 -1870 -2824 -1761 -181 1385 2518 2492 771 -1532 -3026
3834 -3026 -2544 -888 910 2661 2506 803 -1166 -2507 -2679 -1457 534 2345 2951 1462 -214 -2210
3850 -2210 -2632 -1565 484 2069 2677 1807 -16 -1615 -2613 -2020 -334 1762 2848 2319 369 -1379
$$ packed form
3734a120j404k92J695J766J982J53j098k371j996M7R21K371J561O80r14k057k157
3751b233n99N86K440J713J059n81j978j899j553N33K022J836J390j04j619k025
3767a012j735J14J578K090J571K32j305k268j739l86J465J852J687P56r92k039
3783a31j772o52N31K118J776R48n97j972k029q71K45J688K309J079p0j784k104
3800a288j388K99J419J920J547J78j459j807j935q8J168K015J877Q5r22j977j680
3817b036n85P27J936K087P62q82j612k267r54J063J580J566J133k6j721k303j494
3834c026M82J656J798J751j55j703j969j341j72J222J991J811O06j489j676j996
3850b210m22J067K049J585O08q70j823j599r98N93J686K096J086n29j950j748
$$ plain form
3866 -1379 -2580 -2056 -650 1405 2727 2221 820 -1140 -2159 -2522 -1265 733 2261 2597 1304 -497
3882 -497 -2294 -2629 -1807 302 2150 2911 1601 -59 -1735 -2693 -1986 -333 1612 2759 2070 273 -1386
3899 -1386 -2541 -2011 -1025 1113 2487 2064 731 -1127 -2483 -1948 -1279 908 2010 2395 1430 -710 -2222
3916 -2222 -2738 -1256 550 1991 2549 1739 -316 -2037 -2811 -2028 -151 1652 2493 2098 102 -1667 -2272
3933 -2272 -1977 -303 1474 2209 2033 885 -1097 -2221 -2116 -812 1232 2323 2202 1039 -936 -2433
3949 -2433 -2538 -1103 492 1847 2495 1536 -152 -2055 -2569 -1579 134 1994 2603 1659 19 -1248 -2504
3966 -2504 -2125 -185 1639 2517 2024 754 -1414 -2510 -2311 -1058 820 2162 2332 720 -864 -2088
3982 -2088 -2291 -1063 605 1901 2262 1228 -307 -2005 -2514 -1566 121 1736 2623 1880 -146 -1804
$$ packed form
3866a379j201N24J406K055J322n06j401j960j019l63J257J998J528L36j293j801
3882d97j797l35Q22K109J848P61j310j660j676r58P07J653J945J147o89j797j659
3899a386j155N30R86K138J374m23j333j858j356N35O69K187J102L85r65k140j512
3916b222n16J482J806J441N58q10k055j721p74P83J877J803Q41l95j996j769o05
3933b272K95J674J777P35j76j148j982j124J05J304K044J091j21j163j975j497
3949b433j05J435J595J355O48r59j688j903n14R90J713J860O09r44j640j267j256
3966b504L79J940J824Q78m93j270k168j096J99J253J878J342J70j612j584j224
3982b088k03J228J668J296L61j034j535j698n09R48J687J615Q87p43k026j658
$$ plain form
3998 -1804 -2452 -2043 -400 1308 2168 1871 524 -1429 -2388 -1755 -483 1039 2212 2397 851 -985 -2182
4015 -2182 -2393 -969 569 2272 2601 1463 -531 -2140 -2191 -1302 248 1729 2470 1519 -1 -1419 -2470
4032 -2470 -1438 -91 1446 2384 1929 152 -1254 -2292 -2140 -666 1376 2409 1980 722 -1266 -2264
4048 -2264 -2357 -978 784 1982 2281 1045 -299 -2055 -2316 -1147 500 2168 2208 1385 -192 -1791 -2224
4065 -2224 -1637 64 1577 2244 1961 -156 -1551 -2365 -2018 -249 1364 2273 2094 488 -1315 -2377 -1979
4082 -1979 -549 779 2403 2216 802 -879 -2190 -2092 -1367 437 1956 2375 1093 -271 -2138 -2397
4098 -2397 -1465 -17 1743 2245 1702 97 -1720 -1867 -1596 -335 1339 2231 1723 308 -1604 -2092 -1786
4115 -1786 -626 869 2101 2110 685 -800 -2069 -1934 -1146 705 2096 2307 1226 -579 -2191 -2371 -1219
$$ packed form
3998a804o48M09J643J708Q60k97j347j953r59O33J272J522J173J85j546j836j197
4015b182k11J424J538J703L29j138j994j609n1Q89J550J481P41r51j520j418j051
4032b470J032J347J537R38m55j777j406j038J52J474K042J033m29j258j988r98
4048b264r3J379J762J198K99j236j344j756k61J169J647J668M0q23j577j599m33
4065b224N87J701J513O67k83k117j395q14L47J769J613R09j79j606j803j062L98
4082a979J430J328J624j87j414j681j311R8P25J804J519M19j282j364j867k59
4098b397R32J448J760N02n43j605j817j47K71J261J674Q92n08j415j912m88L06
4115a786J160J495J232Rj425j485j269J35P88J851J391K11j081j805j612j80J152
$$ plain form
4132 -1219 423 1843 2020 1505 364 -1575 -2105 -1466 53 1396 2284 1677 258 -1208 -1841 -2044 -293
4149 -293 966 2379 2098 733 -864 -2293 -1944 -958 844 1840 2041 880 -513 -1933 -2193 -949 216
4166 216 1946 2478 1185 -212 -1585 -2218 -1609 21 1558 2495 1188 15 -1308 -2193 -1917 -314 1224
4183 1224 2428 1527 388 -1303 -2301 -1853 -552 857 1950 1905 1286 -522 -1810 -1783 -1074 446 1714
4200 1714 2100 944 -304 -1920 -1646 -1317 173 1509 1970 1773 157 -1316 -2014 -1742 -359 1578 2191
4217 2191 1926 380 -1398 -2118 -1668 -576 1303 1804 1681 814 -839 -2042 -1952 -839 634 1782 2181
4234 2181 1184 -363 -1780 -1912 -1036 223 1787 2125 1273 51 -1733 -2226 -1192 -211 1267 2003 1511
4251 1511 25 -1163 -1916 -1432 -591 1087 1903 1752 674 -945 -1828 -2128 -907 545 1823 1996 778
$$ packed form
4132a219J642J420J77n15j141j939n30O39J519J343Q88o07j419j466o33k03J751
4149b93J259J413k81j365j597j429L49R86J802R96K01j161j393j420k60J244J165
4166B16J730N32j293j397j373o33O09J630J537R37j307j173j323q85K76J603J538
4183A224J204r01j139j691r98M48J301J409J093m5o19j808j288K7P09J520J268
4200A714L86j156j248j616K74L29J490J336M61j97j616j473o98K72J383J937O13
4217B191k65j546j778p20M50J092J879N01j23q67j653j203R0J113J473J148L99
4234B181r97j547j417j32Q76J259J564L38q52j222j784m93J034R81J478P36m92
4251A511j486j188p53M84Q41J678Q16j51j078j619q83l00J221J452J278J73j218
$$ plain form
4268 778 -385 -1521 -1979 -798 460 1420 2398 1063 -247 -1179 -2123 -1536 12 1686 1924 1840 367
4285 367 -1007 -1924 -1816 -473 1086 1854 2075 487 -910 -1847 -1595 -720 925 1666 2022 1027 -541 -1695
$$ packed form
4268G78j163j136m58J181J258R60R78j335j310r32r44N87J548J674K38q4j473
4285C67j374r17J08J343J559P68K21j588j397r37K52Q75J645P41L56r95j568j154
$$ [...]
8191g4
##END NTUPLES=NMR FID
##END=
