##TITLE=1H_ABnBC-2-1H
 CDCl3
 8 sc, 
 20.2.2024
##JCAMPDX= 6.0         $$ Bruker NMR JCAMP-DX V2.0
##DATA TYPE= NMR FID
##DATA CLASS= NTUPLES
##ORIGIN= UXNMR, Bruker Analytische Messtechnik GmbH
##OWNER= root
$$ XWIN-NMR		Version 3.5
$$ Tue Feb 20 14:55:47 2024 Russian Standard Time (UT+4h)  she@DPX200
##.OBSERVE FREQUENCY= 200.1313
##.OBSERVE NUCLEUS= ^1H
##.DELAY= (6, 6)
##.ACQUISITION MODE= SIMULTANEOUS
##.ACQUISITION SCHEME= undefined
##.AVERAGES= 8
##.DIGITISER RES= 18
##SPECTROMETER/DATA SYSTEM= spect
##.PULSE SEQUENCE= zg30
##.SOLVENT NAME= CDCl3
##.SHIFT REFERENCE= (INTERNAL, CDCl3, 0, 15.7039)
##AUDIT TRAIL= $$ (NUMBER, WHEN, WHO, WHERE, WHAT)
$$ ##TITLE= Audit trail, XWIN-NMR		Version 3.5
$$ ##JCAMPDX= 5.01
$$ ##ORIGIN= Bruker BioSpin GmbH
$$ ##OWNER= she
$$ F:/spectra/data/she/nmr/H-F/1/audita.txt
$$ ##AUDIT TRAIL=  $$ (NUMBER, WHEN, WHO, WHERE, WHAT)
(   1,<2024-02-20 14:54:36.12 +0400>,<she>,<DPX200>,
      <created by zg, POWCHK disabled, PULCHK disabled
       configuration hash MD5:
       00 E9 B6 7A A2 85 ED C7 34 08 36 98 17 FE 4E 26
       data hash MD5: 16K
       CD 0C 71 FA 58 43 DD 8F CE A3 A6 B6 62 DD BE 37>)
$$ ##END=
$$ 
$$ hash MD5
$$ 96 16 F5 1F 5F 64 8E A2 72 69 71 43 12 70 19 94
##$RELAX= 
##$RELAX= 
##$RELAX= 
##$RELAX= 
##$RELAX= 
##$RELAX= 
$$ Bruker specific parameters
$$ --------------------------
##$DU= <F:/spectra>
##$EXPNO= 1
##$NAME= <H-F>
##$PROCNO= 1
##$TYPE= <nmr>
##$USER= <she>
##$AMP= (0..31)
100 100 100 100 100 100 100 100 100 100 100 100 100 100 100 100 100 100 
100 100 100 100 100 100 100 100 100 100 100 100 100 100 
##$AQSEQ= 0
##$AQ_mod= 1
##$AUNM= <au_zg>
##$AUTOPOS= <>
##$BF1= 200.13
##$BF2= 200.13
##$BF3= 200.13
##$BF4= 200.13
##$BF5= 200.13
##$BF6= 200.13
##$BF7= 200.13
##$BF8= 200.13
##$BYTORDA= 1
##$CFDGTYP= 0
##$CFRGTYP= 5
##$CHEMSTR= <none>
##$CNST= (0..31)
1 1 145 1 1 1 1 1 1 1 1 1 1 1 1 1 1 1 1 1 1 1 1 1 1 1 1 1 1 1 1 1 
##$CPDPRG= <>
##$CPDPRG1= <>
##$CPDPRG2= <>
##$CPDPRG3= <>
##$CPDPRG4= <mlev>
##$CPDPRG5= <mlev>
##$CPDPRG6= <mlev>
##$CPDPRG7= <mlev>
##$CPDPRG8= <mlev>
##$CPDPRGB= <>
##$CPDPRGT= <>
##$D= (0..31)
0 1.2 0 0 0 0 0 0 0 0.06 0 0.03 0 0 0 0 0.0002 0 0 0 0 0 0 0 0 0 0 0 0 
0 0 0 
##$DATE= 1708426475
##$DBL= (0..7)
120 120 120 120 120 120 120 120 
##$DBP= (0..7)
150 150 150 150 150 150 150 150 
##$DBP07= 0
##$DBPNAM0= <>
##$DBPNAM1= <>
##$DBPNAM2= <>
##$DBPNAM3= <>
##$DBPNAM4= <>
##$DBPNAM5= <>
##$DBPNAM6= <>
##$DBPNAM7= <>
##$DBPOAL= (0..7)
0.5 0.5 0.5 0.5 0.5 0.5 0.5 0.5 
##$DBPOFFS= (0..7)
0 0 0 0 0 0 0 0 
##$DE= 6
##$DECBNUC= <off>
##$DECIM= 32
##$DECNUC= <off>
##$DECSTAT= 4
##$DIGMOD= 1
##$DIGTYP= 9
##$DL= (0..7)
0 120 120 120 120 120 120 120 
##$DP= (0..7)
150 150 150 150 150 150 150 150 
##$DP07= 0
##$DPNAME0= <>
##$DPNAME1= <>
##$DPNAME2= <>
##$DPNAME3= <>
##$DPNAME4= <>
##$DPNAME5= <>
##$DPNAME6= <>
##$DPNAME7= <>
##$DPOAL= (0..7)
0.5 0.5 0.5 0.5 0.5 0.5 0.5 0.5 
##$DPOFFS= (0..7)
0 0 0 0 0 0 0 0 
##$DQDMODE= 0
##$DR= 18
##$DS= 0
##$DSLIST= <SSSSSSSSSSSSSSS>
$$ [...]
##$SUBNAM2= <"">
##$SUBNAM3= <"">
##$SUBNAM4= <"">
##$SUBNAM5= <"">
##$SUBNAM6= <"">
##$SUBNAM7= <"">
##$SUBNAM8= <"">
##$SUBNAM9= <"">
##$SW= 18.0517328524113
##$SWIBOX= (0..15)
0 0 2 0 0 0 0 0 0 0 0 0 0 0 0 0 
##$SW_h= 3612.71676300578
##$TD= 16384
##$TD0= 1
##$TE= 0
##$TE2= 300
##$TE3= 300
##$TEG= 300
##$TL= (0..7)
0 120 120 120 120 120 120 120 
##$TP= (0..7)
150 150 150 150 150 150 150 150 
##$TP07= 0
##$TPNAME0= <>
##$TPNAME1= <>
##$TPNAME2= <>
##$TPNAME3= <>
##$TPNAME4= <>
##$TPNAME5= <>
##$TPNAME6= <>
##$TPNAME7= <>
##$TPOAL= (0..7)
0.5 0.5 0.5 0.5 0.5 0.5 0.5 0.5 
##$TPOFFS= (0..7)
0 0 0 0 0 0 0 0 
##$TUNHIN= 0
##$TUNHOUT= 0
##$TUNXOUT= 0
##$USERA1= <user>
##$USERA2= <user>
##$USERA3= <user>
##$USERA4= <user>
##$USERA5= <user>
##$V9= 5
##$VALIST= <valist>
##$VCLIST= <CCCCCCCCCCCCCCC>
##$VD= 0
##$VDLIST= <DDDDDDDDDDDDDDD>
##$VPLIST= <PPPPPPPPPPPPPPP>
##$VTLIST= <TTTTTTTTTTTTTTT>
##$WBST= 1024
##$WBSW= 4
##$XGAIN= (0..3)
0 0 0 0 
##$XL= 0
##$YL= 0
##$YMAX_a= 37626
##$YMIN_a= -43617
##$ZGOPTNS= <>
##$ZL1= 120
##$ZL2= 120
##$ZL3= 120
##$ZL4= 120
##$ABSF1= 10
##$ABSF2= 0
##$ABSG= 5
##$ABSL= 3
##$ALPHA= 0
##$AQORDER= 0
##$ASSFAC= 0
##$ASSFACI= 0
##$ASSFACX= 0
##$ASSWID= 0
##$AUNMP= <proc_1d>
##$AZFE= 0.1
##$AZFW= 0.1
##$BCFW= 1
##$BC_mod= 2
##$BYTORDP= 1
##$COROFFS= 0
##$CY= 11.3945322036743
##$DATMOD= 1
##$DC= 2
##$DFILT= <>
##$DTYPP= 0
##$F1P= 15.7292609196834
##$F2P= 12.9074282941183
##$FCOR= 0.5
##$FTSIZE= 0
##$FT_mod= 4
##$GAMMA= 1
##$GB= 0.15
##$INTBC= 1
##$INTSCL= 1
##$ISEN= 128
##$LB= 0.24
##$LEV0= 0
##$LPBIN= 0
##$MAXI= 10000
##$MC2= 0
##$MEAN= 0
##$ME_mod= 0
##$MI= 1.114404
##$NCOEF= 0
##$NC_proc= 0
##$NLEV= 6
##$NOISF1= 3.799351
##$NOISF2= 2.8
##$NSP= 1
##$NTH_PI= 0
##$NZP= 0
##$OFFSET= 15.70392
##$PC= 1
##$PHC0= -24959.22
##$PHC1= 12.45264
##$PH_mod= 1
##$PKNL= yes
##$PPARMOD= 0
##$PSCAL= 0
##$PSIGN= 0
##$REVERSE= no
##$SF= 200.130013532006
##$SI= 16384
##$SIGF1= 3
##$SIGF2= 2
##$SINO= 400
##$SIOLD= 16384
##$SREGLST= <1H.CDCl3>
##$SSB= 0
##$STSI= 0
##$STSR= 0
##$SW_p= 3612.71676300578
##$SYMM= 0
##$S_DEV= 0
##$TDeff= 0
##$TDoff= 0
##$TI= <>
##$TILT= no
##$TM1= 0
##$TM2= 0
##$TOPLEV= 0
##$USERP1= <user>
##$USERP2= <user>
##$USERP3= <user>
##$USERP4= <user>
##$USERP5= <user>
##$WDW= 1
##$XDIM= 8192
##$YMAX_p= 0
##$YMIN_p= 0
$$ End of Bruker specific parameters
$$ ---------------------------------
##NTUPLES= NMR FID
##VAR_NAME=  TIME,          FID/REAL,        FID/IMAG
##SYMBOL=    X,             R,               I
##VAR_TYPE=  INDEPENDENT,   DEPENDENT,       DEPENDENT
##VAR_FORM=  AFFN,          ASDF,            ASDF
##VAR_DIM=   8192,          8192,            8192
##UNITS=     SECONDS,       ARBITRARY UNITS, ARBITRARY UNITS
##FACTOR=    0.0002768,     1,               1
##FIRST=     0,             0,               0
##LAST=      2.2672688,     0,               0
##MIN=       0,             -43617,          0
##MAX=       2.2672688,     37626,           0
$$ Real data points
##PAGE= N=1
##DATA TABLE= (X++(R..R)), XYDATA
$$ [...]
1538G33j83j80K33k02l90Q3n96J53j26m04N57o3k99M94mJ22M56k38J74M19l51
1559C88L68k16l98J89k39k55O3l74k70L87l93K53Q6j07N88J55O7M65j9l52N12
1580H98m76j19K85p17j2l03l07J75p2j88M93k8j33N81k7K35M74m07L13J83m14
1601D34K32l79k22J39n51j72N7l60j2K38k58L54L91j2N50M8k8N50k59l5L0m54
1623B81j17J20o77L4Kn21K60n4j72M28O1J12N43j46L99K84k02J91Ll42p6j44m41
1646a74L2m11l28J94l10K07L98nJ28L73j39N50J37l6L49j36j89P4n35j29N3o78
1668e75n0J48l61L10j0k61N42J01J19L61l1M07J11j96N5J07n60J29j89m52Q9l42
1690e48m25L63j87j06O71k83M94M85j25L17ko0J82l06l7l8n26K63j47o11J21m3
$$ plain form
1538 733 550 370 603 401 11 94 -502 -349 -475 -879 -322 -385 -684 -190 -194 -72 384 146 320 739 388
1559 388 756 540 142 331 92 -163 -100 -474 -744 -357 -750 -497 -411 -518 70 225 292 757 738 386 898
1580 898 422 303 588 -129 -141 -444 -751 -576 -648 -836 -343 -371 -504 77 50 285 759 352 665 848 434
1601 434 666 287 65 204 -347 -519 -462 -822 -834 -596 -854 -500 -109 -121 429 477 449 999 740 705 735 281
1623 281 164 284 -393 -359 -357 -878 -618 -672 -844 -416 -355 -243 300 154 553 837 635 826 829 487 411 267 -174
1646 -174 -142 -553 -881 -687 -997 -790 -392 -397 -269 104 -35 515 652 616 965 829 640 714 179 50 103 -575
1668 -575 -625 -477 -838 -528 -538 -799 -257 -156 -37 324 293 700 811 615 670 777 217 346 157 -295 -206 -548
1690 -548 -973 -610 -797 -903 -232 -515 -21 464 339 656 654 594 776 470 433 395 -131 132 -15 -626 -505 -548
1712e48j79K54L9P5M02j28K61L88j10J17K94m35O9m0m77N3k05l17J86l62m7L93
1734c17j95L26K24n0K11J85j73M31q0k52J78k98j14J21l43k71j7m1j95K85j23
1755e08L37Q5j22M73r1J91K91j33j29J36m34m7P6n41L9%k52K88j49R8K71j47L22
1778E4L08k03K70M1k31K08o2k24n7j40n9N9m57K0J63k60J21K23r7L87J33PL37
1801E41j40R4K51m77p7L4l50J09j18n02K33K8k15L83o9Q0L42J00P8J20q3J58k7
1824D93j16j7k50k76K52n21j76M08m82J77r7Q5L59J14j49N36PR3L17l40J78p1
1846E24k72r6J39o01L8r6l13J64jm7M07r0L59J49j12L65K74k04R4o1k67J08m99
1869c8k30m3k08r7K02k98J85L13l01M34K02j52O00p4K9J69l29O3ql63N2j01l94
$$ plain form
1712 -548 -727 -473 -434 -359 43 -85 176 564 454 571 865 430 499 459 -18 35 -170 -487 -301 -663 -710 -317
1734 -317 -512 -186 38 -12 199 384 211 642 562 310 488 190 76 197 -146 -417 -434 -475 -670 -385 -508
1755 -508 -171 -86 -208 265 174 365 656 523 394 530 96 49 125 -416 -377 -377 -629 -341 -490 -392 -121 -268 54
1778 54 362 159 429 470 239 447 385 161 104 -36 -95 -36 -493 -473 -310 -570 -449 -226 -323 64 197 204 541
1801 541 401 495 746 269 192 226 -124 -15 -133 -635 -402 -374 -589 -206 -275 -195 147 247 325 445 362 520 493
1824 493 377 360 110 -166 86 -435 -611 -203 -685 -508 -605 -520 -161 -47 -196 340 347 440 757 417 595 524
1846 524 252 156 295 -306 -268 -364 -677 -513 -514 -561 -154 -244 115 264 152 517 791 587 681 620 353 461 -38
1869 -38 -268 -311 -519 -616 -414 -712 -527 -214 -515 -81 121 -31 569 495 524 693 364 427 419 56 108 7 -387
1892c87N6r0l62K92k60J24L53K6K13L58j21K45L97l83O5L0m17J13l87j55J10k10
1914c90q5O8l58L45J40l8M83l6K4L05N8q5K09l44M9L6l74LLm54J2j0k61M37k33
1939d96L2O41j63K50J36q0K91j10j38J99j37l65nk59M1k5k91J3J81l28L40K61
1961a2k37L91J43p5J51M4j85K68j86j99P0n39J92Kl49K71P3j85J40J82P8P8n1
1984F5L24P1l86K37n5j38J9l7j70P1k25k22J19o9J95J73m00M84L21j78L13l45
2006A67J24J66m45L1K04l11l9J20m68J46n6k2P3J20j6K23J0Q4L16k34P6L13n27
2029E5K87j55m70L57j57l32J81j80k8K52k19K43K91l8K23P7k35M01j25p4n0j87
2051A17p9j08j75j47K00l04J19k4J71j3J53M2M21k21nM80l12R1O2m03j1O7k21
$$ plain form
1892 -387 -331 -421 -783 -491 -751 -627 -274 -248 -35 323 202 447 844 461 526 556 139 252 -135 -290 -180 -390
1914 -390 -475 -407 -765 -420 -280 -318 165 129 153 458 516 431 640 296 345 381 7 10 13 -441 -429 -439 -700 -263 -496
1939 -496 -464 177 14 264 400 320 611 501 363 562 425 60 55 -204 -163 -188 -479 -466 -285 -613 -273 -12
1961 -12 -249 142 285 210 361 405 220 488 302 103 173 -366 -174 -172 -521 -250 -177 -362 -222 -40 38 116 65
1984 65 389 460 74 311 256 118 137 100 -70 1 -224 -446 -327 -396 -201 -28 -428 56 377 199 512 167
2006 167 291 457 12 43 247 -64 -103 17 -451 -305 -361 -383 -310 -190 -206 17 27 111 427 193 269 582 55
2029 55 342 187 -283 74 -83 -415 -234 -414 -442 -190 -409 -166 125 87 310 387 152 553 428 354 304 117
2051 117 38 -70 -245 -392 -192 -496 -377 -401 -230 -243 -90 -48 373 152 147 627 315 406 468 65 54 121 -100
2074a00n3j77j75K47k26J65K33j87M61O7r7K76Ok24L57j79k73J22l21KJ73n94
2096d97O9J17m00K29L00k07N15j71J01K94P1L5K26l23P4M6m61J22k91l05J50k59
2118e65j82L16j9K63R5j18L82J50J3L5J92k13J13l42OJ26l63j28L2k67k3J52j87
2141e32J49J59J4L50j51J75L91k95J00J97l35J1j2k92J06j26r1j08j80L5L31j86
2163b90L3J24P5K85N6j69J13M1J91p8k39k12J15j82l19M92o19K40J64k41K32N8
2185a30j72M29n2J44L33k53JJ08j77j67j02k11K11j76k14L66k25m5K77j71J88
2206c8K96k43J04J32j37J87r6k99M25l47j67K04l27N9R9j83J12J91k43K45M1L5
2228E0J37n7Q6J95l92K0L32n03Q3N6k84K4j9N2J40K9j65M42r7k3K71j48K4kk17
$$ plain form
2074 -100 -153 -330 -505 -258 -484 -319 -86 -273 188 255 158 434 440 216 573 394 121 243 -78 -76 97 -497
2096 -497 -428 -311 -711 -482 -182 -389 126 -45 56 350 421 456 682 359 433 479 18 140 -151 -456 -306 -565
2118 -565 -747 -431 -450 -187 -92 -210 172 322 335 370 562 349 462 120 126 252 -111 -239 -207 -474 -497 -345 -532
2141 -532 -383 -224 -210 140 -11 164 555 260 360 557 222 233 221 -71 35 -91 -182 -290 -470 -435 -104 -290
2163 -290 -257 -133 -58 227 283 114 227 268 459 381 142 -70 45 -137 -456 36 -583 -343 -179 -420 -188 -130
2185 -130 -302 127 75 219 552 299 300 408 231 64 -38 -249 -38 -214 -428 -62 -287 -332 -55 -226 -38
2206 -38 258 15 119 251 114 301 205 -94 331 -16 -183 21 -306 -247 -148 -331 -219 -28 -271 -26 15 50
2228 50 187 130 216 411 19 39 371 -132 -49 7 -277 -253 -272 -220 -80 -51 -216 226 129 106 377 229 253 251 34
2253C4R6m2j77J66l49n1J58k92J06K03j21J28J63m2J62M1J37P9k15m8Q6j94J63
2276A91l26j85J68l5j78J66j78O2L93n7Q2J05k5J20L4k64K62p5k65J74k87N4J7
2299d7k10M6P0k79J67L67l89K71K00k18M60N1r8J11m79Q2O0m09K58j46k51J21
2321b62j73j6L92n6j15L64j80K51kQ7P0N1n6j29l3j65J71j94l81K09k29R5J90
2344a11l61K03J98j55M27K3j18L30j80J15o6j27N5n7k42j14J11k65lJ05j41K90
2366h3r7p4L70j39O2L49l58K66M8k00%J12m08L7j51j02J96k40P4J27r1P4L63l09
2390a74L06l1R5K14l08Q8R3j05o9J69l92j46K29j70J0p8P0J29J2k29N03k44K38
2413B10P1j55K97k05o8p5J07l04R6r4j51l8J14K2R6k3L02j51rO7k0j8R5m7j13
$$ plain form
2253 34 130 88 -89 77 -272 -323 -165 -457 -351 -148 -269 -141 22 -20 142 183 320 399 184 136 222 28 191
2276 191 -135 -320 -152 -187 -365 -199 -377 -315 78 21 103 208 183 303 337 73 335 260 -5 169 -118 -64 -47
2299 -47 -257 -211 -141 -420 -253 114 -275 -4 196 -22 438 489 391 502 23 105 165 -244 14 -132 -383 -262
2321 -262 -435 -451 -59 -115 -230 134 -46 205 203 290 360 411 355 226 193 28 199 5 -376 -167 -396 -301 -111
2344 -111 -472 -269 -71 -226 201 224 106 436 256 371 305 178 233 176 -66 -180 -69 -334 -337 -232 -373 -83
2366 -83 -180 -254 116 -23 39 388 30 296 344 144 144 256 -152 -115 -266 -368 -172 -412 -338 -211 -302 -228 135 -174
2390 -174 132 101 196 410 102 190 283 178 109 278 -114 -260 -31 -201 -191 -269 -199 -70 -58 -287 216 -28 210
2413 210 281 126 423 218 150 75 182 -122 -26 -120 -271 -309 -195 -173 -77 -100 202 51 42 109 89 71 166 119 6
2438FQ0r9J5J04j99R4o4k43L67l06K80K06k89k6K61L8k9n9j67K41j41M6K9j74
2462b9M4J4k49J50Q6j66R4J18n9J89j4j20J41l9j80P6l1p0Q9nk57K31j92J25q1
2487a35m9K36j42O5J83M5o5J79k43J31j54j29J50r0n8k9r4J1Q2j85J86K16k47
2510a36p4K81M2J81j92j8J21j41M6J05k61q9K47j90m4J85l24m3K47j37K36M0j27
2533d5L40k11K2K84m32K30kj08K8j61j63K5P7j02J26j97J08J97p7J84J46q5JJ91
2557C76k33J54k24r6J46r3j17L5j89J08pk12K76m5P9M7J9J67J94j46j23J79k19
2580G6j72K04j83J31q5j98Q6q6j20L38Mk17J09J25l7K64L3p6O5j04n4N0r2o3n7
2605e9j45J67j99M0Lj89J57K66j83K30j5J56j52Q8K8N7n7p3N9l58J64k23k6J92
$$ plain form
2438 6 86 -13 2 106 -93 1 -63 -306 61 -245 35 241 -48 -74 187 225 196 137 -30 211 70 116 145 -29
2462 -29 15 29 -220 -70 16 -150 -56 62 3 192 178 58 199 160 -20 56 25 -45 44 39 -218 13 -179 -54 -135
2487 -135 -184 52 -90 -25 158 203 138 317 74 205 51 -78 72 -18 -76 -105 -199 -188 -106 -291 -105 111 -136
2510 -136 -210 71 113 294 102 84 205 64 110 215 -46 -135 112 -78 -122 63 -261 -304 -57 -194 42 82 -45
2533 -45 295 84 106 390 -42 188 186 78 106 -55 -218 -193 -116 -218 -92 -289 -181 16 -61 123 269 184 185 376
2557 376 143 297 73 -23 123 30 -87 -52 -241 -133 -140 -352 -76 -121 -42 5 24 191 385 239 116 295 76
2580 76 -96 108 -75 56 -29 -227 -141 -227 -347 -9 -5 -222 -113 12 -25 239 272 196 261 157 103 153 61 -2 -59
2605 -59 -204 -37 -236 -196 -193 -382 -225 41 -142 88 73 229 77 165 193 250 193 120 179 -179 -15 -238 -264 -72
2629g2P1j54P9j18p2L00j36L36q0j08R5J15k57J08j43R2M2j99M4qn1l3J26j23
2653a46R1j09K0L60n8k26J64M3j2L5q9m0J3j81O9J63k02J75j09j38K75k26M8J43
2677F3l8J95p2k11R0l5J27j72j1L9j32Q7j63J03J8J45o5P2P4J25m44K09j26J51
2701B9p6j29J06J58j91J45J14l04J26j19MJ78j69n9J99K2J13j10L8j5L8l6Oj54
2725h6L9J67k41J4M6r5J44J0L0J49j7j78J24j76J18J22j75MJ90m06K22n5j93J85
2749e8k3o0J43j40J43J4J85j62K21j38m6K50j43L8j81k24L51k01j47J41l77K02
2771b12J62Q4j62K47j88J20K06j84K42r8j97K56k44p0J0%oJ73l06K1J17k78K71
2794c6L5j7J72l9oK48r0j23K39l00N6o8j79j0k5n4J29r5p7L9l2L7J84q4Q6J27
$$ plain form
2629 -72 -1 -155 -76 -194 -266 34 -102 234 154 46 141 256 -1 107 -36 56 98 -101 -57 -65 -116 -149 -23 -146
2653 -146 -55 -164 -144 216 158 -68 96 139 127 162 73 33 46 -135 -66 97 -105 70 -39 -177 98 -128 -80 63
2677 63 25 220 148 -63 27 -8 119 -53 -64 -25 -157 -70 -233 -130 -112 33 -32 40 114 239 -205 4 -122 29
2701 29 -47 -176 -70 88 -103 42 156 -148 -22 -141 -137 41 -128 -187 12 34 147 37 75 60 98 62 68 -86
2725 -86 -47 120 -121 -107 -61 -156 -12 -2 28 177 160 -18 106 -70 48 170 -5 -1 189 -217 5 -50 -243 -58
2749 -58 -81 -141 2 -138 5 19 204 42 263 125 79 329 186 224 43 -181 170 -31 -178 -37 -414 -212
2771 -212 -50 34 -128 119 -69 51 257 73 315 217 20 276 32 -38 -28 -28 -34 139 -167 -146 -29 -307 -36
2794 -36 -1 -18 154 115 109 357 267 144 383 83 139 71 -108 -118 -143 -197 -68 -163 -240 -201 -233 -196 -12 -96 -10 117
2820A17l4J34j78r7J65r3R1k08J40j05J25l66K15q9kJ57m5j18L71j41J01J2j20
2843C2J74j7j16j6N5k08K28n0j91N9n2Q7o8j5R0m7J1P8K4J09k9J1j4m2j1o3N7
2870G6k01P5n7nJ4p9J1kJ78L8L1K4o7J55j77J1M7j66K44j11j28J96l51K98q3j30
2896a59Q9J92l08R2J78o3J24n7j29K13k01J79k9k26j51L55j78Q2rqRR5j37J84
2920A37j94l2L39k35K7mj10K19K4k38R4k2j25J26j30M7J06l5j84K57J6j69qO6
2944b8K15L0k79J09j57q2K32k85J38R9j00k6J43r3K20L3qN7k18K8J71j59K9J35
2968B04l37R3N3m8P7Oj12K9j28J51R5n0K35j03n7L8J16l13J88j93r5J81j46K5
2992i1P7k97P7K25j76L04j06kJ73j58M7J80k65J64j89j7p8K19j16L1j05l6o1o5
$$ plain form
2820 117 83 217 39 -58 107 14 105 -103 37 -68 57 -309 -94 -183 -185 -28 -73 -191 180 39 140 152 32
2843 32 206 189 73 57 112 -96 132 82 -109 -50 -102 -15 -83 -98 -8 -55 -44 34 58 167 138 149 135 93 82 19 76
2870 76 -125 -50 -107 -112 -98 -177 -166 -168 10 48 79 103 36 191 14 25 72 -94 150 39 -89 107 -244 54 -29 -159
2896 -159 -70 122 -186 -94 84 21 145 88 -41 172 -29 150 121 -105 -256 99 -79 3 -6 -14 -5 90 -47 137
2920 137 -57 -89 250 15 42 38 -72 147 171 -67 27 5 -120 6 -124 -77 29 -6 -190 67 83 -86 -94 -28
2944 -28 187 217 -62 47 -110 -192 40 -245 -107 -8 -108 -134 9 -84 136 169 161 218 0 28 199 40 69 204
2968 204 -133 -40 13 -35 42 48 -64 -35 -163 -12 83 33 268 165 108 146 262 -51 137 -56 -151 30 -116 -91
2992 -91 -14 -311 -234 -9 -185 119 13 11 184 26 73 253 -12 152 -37 -54 -132 87 -29 2 -103 -139 -200 -265
3016b65K2J55J11j57K23j37J52J99k46O5J09q8p9qj48L26n9l53K56j73j0L5j17
3039a87K02k0k24M36j1j20Q0pN1L8k01P0L5k58P0J9KJ08j46j22J84j54L1K50r1
3064C5O9n7n4J16p4M3J00j17j50J56l4k33%J26j05P7l3O8M0J33N8j65l1K92l98
3089a38K01K01j89J61j74j18j3J64l40K26j45J3O8J06k25K24Q2J41Ql16J28m3
3111B2q9J53j81p8K00o7P7j93J12r7J47j64P8J65j28N9P3K2K01r6k09J82k63N5
3135a9nj09J05RM5nK4j44K15p4m5M1j06J96j03Q6k3k22K4K34j33k32K00j00J84
3160D3N9k29P1L64m27R3R1NlQ1k07M3N2m6P2j36O3l7j24J07K14j18J33k0o6J49
3186B27k58J6K09q1q0L9j30op5k35M19Q2k01K28n9j83J37j94K59J1j23J85j68
$$ plain form
3016 -265 -243 -88 23 -134 89 -48 104 303 57 122 231 143 64 56 -92 234 175 -178 78 -95 -105 -70 -187
3039 -187 15 -5 -229 207 196 76 156 149 200 238 37 107 142 -116 -46 -27 -25 83 -63 -185 -1 -155 -124 126 35
3064 35 104 47 -7 109 35 78 178 61 -89 67 33 -200 -200 -74 -179 -102 -135 -67 -27 106 164 -1 -32 260 -138
3089 -138 63 264 75 236 62 -56 -69 95 -245 -19 -164 -151 -83 23 -202 22 104 245 253 -63 65 22
3111 22 -67 86 -95 -173 27 -40 37 -156 -44 -141 6 -158 -80 85 -43 16 89 111 312 216 7 189 -74 -19
3135 -19 -24 -133 -28 -19 26 21 45 -99 116 42 -3 38 -68 128 25 111 88 -134 -110 124 -9 -241 -41 -141 43
3160 43 102 -127 -56 308 -119 -26 65 70 67 148 -59 -16 36 -10 62 -74 -11 -48 -172 -65 149 31 164 144 78 227
3186 227 -31 -15 194 113 33 72 -58 -64 -139 -374 45 127 -74 154 95 -88 49 -145 114 125 2 187 19
3209A9j06P5o5O6J69l23N0L8j09K00q0o3J78j26M6K13j02R1J37l63K41j53j88
3232a55K24j34RQ3p2n7K0Qk2L4P5L4M2j49K98j33m4R2n6o5ro8m6K95l83R1J40
3259E2k67K40l1j27J61P7j39K23r8J12k7o0l9p5N1j02O0j52M2K8j83K77j56O5
3283f8p3kK86j97M0O3J72j04N3k15kJ52k35J7O4j05j7K58m10K53o1M6J35j63l2
3308a45L60k25rK43k72R6j36O0j28N8M1N0j77l9J59q3O8J50j31J50l0j04P3l5
3332fN2J01j74N7j74N1M1K78m04j2J44J07P6j3k23K35j55k7J28l2J0K5m8p6K17
3357A78k16K4P9k40P1J7K5Q6j28J56n9j55K64L4k00J11J01l00J32j2k3J26k33
3380a62J2K74j83J54j6m1J26p1K7q1P7q6J47k72J88K6k02K8K9j67J77j36O8P0
$$ plain form
3209 19 -87 -12 -77 -11 158 -165 -115 -77 -186 14 -66 -129 49 -77 -31 182 80 171 308 -55 186 33 -155
3232 -155 69 -65 -56 27 -45 -102 -82 -74 -96 -62 13 47 89 -60 238 105 61 153 97 32 23 -45 -91 204 -179 -88 52
3259 52 -215 25 -6 -133 28 105 -34 189 91 203 176 116 77 2 53 -49 11 -141 -99 -71 -254 23 -133 -68
3283 -68 -141 -143 143 -54 -14 49 221 117 170 -45 -47 105 -130 -113 -49 -154 -171 87 -323 -70 -131 -85 50 -113 -145
3308 -145 215 -10 -19 224 -48 48 -88 -28 -156 -98 -57 -7 -184 -223 -64 -147 -79 71 -60 90 60 -44 29 -6
3332 -6 46 147 -27 30 -144 -93 -52 226 -178 -190 -46 61 137 124 -99 136 -19 -46 82 50 60 85 37 -39 178
3357 178 -38 -14 65 -175 -104 -87 -62 24 -104 52 -7 -162 102 136 -64 47 148 -152 -20 -32 -55 71 -162
3380 -162 -150 124 -59 95 79 38 164 93 120 39 116 30 177 -95 93 119 -83 -55 -26 -193 -16 -152 -84 -14
3404a4L8J44k15l8P6J88j70J5R3j74J4J52j08q3qNJ37k20j7K27k14J44K6Q8K6
3429A12p0J7L2j08p4L57k91n4O9q8J06j06mNJ64q7Q2j59J07R7k6Q7j47J33p5N0
3455A29k98J34r8m1Q4j1NJ34j36j8J78L5j10J8J10L6Oj30N7J49j81L7k25O6m2
3480a12r3J8J68kJ2J3l2q8J25M9Q2p4J10Rj45P6j09n1O1k29O8P0o5J11o6J8l6
3507a12K53j83J66q2j30K15M4j48J30k03J15Jq4p2R8k4n1%j18K79j81j14K09J48
3531A56n7p0N0J29j72P9j21Q5k31K49r5q1j8o8j4J76J4j8O7j66J00J86k07o5J37
3556D5n4J69j87O3R3lj03%k78K38O1Ll0o0n7J08r4J75J37k90KK20j50n7M4j92
3582a97K36j72M6R0p1O2j4j06J35n9N9Q9K6j17J43r3q9J36k9j90P5p6J35j66K6
$$ plain form
3404 -14 24 168 -47 -85 -9 179 9 24 117 -57 -43 109 1 -82 -90 -85 52 -168 -185 42 -172 -28 -2 86 112
3429 112 42 59 91 -17 -91 266 -25 -79 -10 -98 8 -98 -102 -97 67 -20 62 -97 10 107 81 168 21 154 79 129
3455 129 -169 -35 -133 -174 -90 -101 -96 38 -98 -116 62 97 -13 5 115 151 157 27 84 233 52 89 -136 -70 -112
3480 -112 -205 -187 -19 -21 -9 4 -28 -116 9 58 140 66 176 185 40 116 7 -44 17 -212 -144 -74 -139 -28 -94 -76 -112
3507 -112 141 -42 124 42 -88 127 171 23 153 -50 65 66 -18 -90 8 -16 -67 -67 -185 94 -87 -201 8 156
3531 156 99 29 79 208 36 115 -6 79 -152 97 2 -79 -97 -165 -179 -3 11 -7 60 -106 -6 180 -27 -92 45
3556 45 -9 160 -27 36 129 126 23 23 -255 -17 44 47 17 -43 -100 8 -86 89 226 -64 -62 158 8 -49 -5 -197
3582 -197 39 -133 -87 3 -68 -6 -20 -126 9 -50 9 98 124 7 150 57 -32 104 75 -115 -40 -116 19 -147 -121
3607a21O6Q7j85K24j10J43j5L4J0j9k13j92J06o0L15k08O6J86r5j7J42P5j85J66
3631B00j24J47j01k41J06P8r2J3K5o9Q8j11j03K65j77K7P2j3M3J43j86O7j3l5
3655IJ22j43pJ47k17k2K23m30L18o9MJ34j41L0J82n5l3P3k1j85J12k1R4o2j90
3680a48J15k0j5l8%K20N2k90J41J38j21K02j01j55R4j19RJ56j21j9m5Q6j31m3
3704a53NJ09J21j03j16J45j66J30kR9Q6j4r8M2n9p4m3J00mj86l7J95N2m6j02r7
3730b16J89P8Ro8J65m6j80J34JK8p9j8K2j90O8M6J15L1j75K5J81j67K13j95K0
3755iK1j2l2J83k20m0K11j83N8M9j17Nj2j7j25K86l11K01R4J91j41J1k04J65m0
3780A2L3N4p3j39J82j98M3K02j46J06J7k02J89J25k09Nm4J10o2J66k89J13q1N1
$$ plain form
3607 -121 -55 32 -153 71 -39 104 89 123 133 114 -99 -291 -185 -245 70 -138 -72 114 19 2 144 219 34 200
3631 200 76 223 122 -119 -13 65 -27 -14 11 -58 30 -81 -184 81 -96 -69 3 -10 33 176 -10 57 44 9
3655 9 131 -12 -19 128 -89 -111 112 -318 0 -69 -65 69 -72 -42 140 85 52 125 104 -81 31 10 104 42 -148
3680 -148 -33 -53 -68 -106 -106 114 166 -124 17 155 34 236 135 -20 74 -45 -36 120 -1 -20 -65 21 -110 -153
3704 -153 -148 -39 82 -21 -137 8 -158 -28 -30 69 155 141 43 85 26 -48 -91 9 5 -181 -218 -23 29 -17 -119 -216
3730 -216 -27 51 60 -8 157 111 -69 65 66 94 15 -3 19 -171 -103 -57 58 89 -86 -61 120 -47 166 -29 -9
3755 -9 12 0 -32 151 -69 -109 102 -81 -23 26 -91 -86 -98 -115 -240 46 -265 -64 30 221 80 91 -113 52 12
3780 12 45 99 26 -113 69 -129 -86 116 -30 76 93 -109 80 205 -4 1 -43 67 5 171 -118 -5 -86 -35
3804c5m4Q0J19j87J26Mk70K14P6k2oJ77j85k07J45j14L65l28N9k8J5j5J32j87
3828a16K52j95J67j01J6J64j08o5J14%k03j9J87j66rl6M0N1J04o0m5j58Q9K38
3852A41j28K0j0K4J65k31j51K21r2j6K33k76m5J16j97K01mj38J67j5J83k5j63
3875b0J01M2j93J36j4R3p7j27P8j22P7k00L23r5M2J57j82K1J4N7k17K76j74N2
3899D8m0j1j1o3L9J71q6O4j56j18j3K51r7OJ31k28K52j6j85J38j7N3k26J23P2
3924H1j43J1p5R8j5Jk64K19K20j79M5J72j69j15K88j18j7K02k93J48mj14j8j34
3948a73P5J40j51Q3L8j8Q3p9Q8J14k27J15M9j48R2M3k19K4P7q3K23l86J32P8m
3973c4r8R1O8j15J37N9r2J08j48J23r8j17K13j54k3J12l13L08K7j1k15K17Q6j58
$$ plain form
3804 -35 -79 1 120 -67 59 63 -207 7 83 61 55 232 47 -160 -15 -129 236 -92 -33 -61 -46 -61 71 -116
3828 -116 136 -59 108 7 23 187 79 14 128 128 -75 -94 93 -73 -82 -118 -78 -27 77 17 -28 -186 -97 141
3852 141 13 33 23 47 212 -19 -170 51 -41 -57 176 -100 -145 -29 -226 -25 -29 -167 0 -15 168 143 -20
3875 -20 81 123 -70 66 52 145 68 -59 19 -103 -26 -226 97 2 44 201 19 40 54 111 -106 170 -4 48
3899 48 8 -3 -14 -77 -38 133 47 111 -45 -163 -176 75 -22 -16 115 -113 139 123 -62 76 59 112 -114 9 81
3924 81 -62 -51 -126 -28 -43 -42 -306 -87 133 -46 -1 171 2 -113 175 57 40 242 -51 97 93 -21 -39 -173
3948 -173 -98 42 -109 -26 12 -6 77 -2 86 200 -27 88 137 -11 81 124 -95 -71 6 -77 146 -240 -108 -30 -34
3973 -34 -132 -41 27 -88 49 108 16 124 -24 99 1 -116 97 -57 -80 32 -281 27 54 43 -172 45 131 -27
3997b7K7q5J12Q0k17J03J40n8M7j74OM6o2j6R2l6M3r3J37j77K36m9M1j11NJ6k0
4024Fj7J8l20K65n2K8Q9q6N0m6K7M6J30k95L15j16J20k36J28l8j1l9l3o3J47l0
4050a3j35q8L98j08l6J31P6j54K9j83J23P5k38J58qj45J13rj54jQ4J24j0n4k3
4075d8J07j67L2K12j26j42K13n5J03k11M5K6j66M7Q7n5J8J19P1j36Q7MK2M5k30
4100i8J99o5J09M4k50jJ05j58K03p5l9J83j75p4J00l1K7M0k17L95k94l1J59k7
4124B9m0OJ15r1j02Q1j96K61j37J92K6L4j18k7%K63l06m8J35n4r9L8p0j49K26
4149c1p2J74j94j03K55m2l2J55j93p9J31J35Q8o4n9r8nP2O2j54J5jL9j25R4L3
4175AJ58j5j55O5l7j6M0nj9J29j87J04j10O7j2l6n6R6j91j57L91j47J53m4O9j07
$$ plain form
3997 -27 0 -85 27 107 -110 -7 133 75 122 -52 -46 0 -62 -78 14 -22 21 -72 65 -112 124 75 116 5 10 26 6
4024 6 -11 7 -313 -48 -100 -72 17 -69 -19 -65 -38 8 138 -157 158 42 162 -74 54 16 5 -34 -67 -130 17 -13
4050 -13 -148 -236 162 54 18 149 225 71 100 -83 40 115 -123 35 27 -118 -5 -14 -168 -169 -85 39 29 -25 -48
4075 -48 59 -108 -76 136 10 -132 81 26 129 -82 -37 -11 -177 -130 -43 -98 -80 39 110 -26 61 65 87 132 -98
4100 -98 101 36 145 189 -61 -62 43 -115 88 13 -26 157 -18 -92 8 -23 4 44 -173 222 -72 -103 56 29
4124 29 -11 -5 110 19 -83 -2 -198 63 -74 118 144 178 60 33 33 296 -10 -58 77 23 -76 -38 -108 -257 -31
4149 -31 -103 71 -123 -226 29 -13 -45 110 -83 -162 -31 104 192 128 69 -29 -34 38 100 -54 -39 -40 -1 -126 -32 1
4175 1 159 144 -11 54 17 1 41 36 17 146 -41 63 -47 20 8 -28 -84 12 -179 -336 55 -92 61 17 86 -21
4201b1K13k98L08j88J2J1r8J2P6p5r7J63o2Oj52J94r1K22j25m4kN2J23j49M8J33
4227A71k44qJ33p2jj14J61J37j27j74J71o7oJ22J3o4J9K3j1nj34K15k41N3J29
4252G9k88J51J67k32k3L0O3J44m3o1%K7j03J70j02m6R7k66J00K95j53p0K10q5
4276F1L0J08j63r4n8mJ68r4N7o4P0l1k6k14J64J25n3j2n0j8K12l15K04O7j89R8
4302b1m3J55J26j83j08n0N2l3P3j5m0P9l1J32m0j04K86l9j79J42j8Mn6j26k4J76
4328A15j19J6K0j45J27J3j23J00r0PP1O5n5J58j27L3O1k30R1j28J2J40o1P9K5
4353E5r6K1lJ1J60Qk63K06m7j9K27j12q6k9KJ06k03lK6R2q5N2ol3K2j71K71k15
4381a12q3K51J60k06M2n6J56J2j68j30J75j07J21j33K1K7M7r2m7J08j23J84J33
$$ plain form
4201 -21 192 -106 202 14 26 37 -61 -49 27 -48 -145 18 -44 -38 -190 4 -87 135 10 -34 -36 16 139 -10 38 171
4227 171 -73 -81 52 -20 -21 -135 26 163 36 -138 33 -34 -40 82 95 31 50 73 62 57 -77 138 -103 -50 79
4252 79 -209 -58 109 -123 -146 -116 -53 91 48 -13 -13 14 -89 81 -21 -67 30 -236 -136 159 6 -64 146 61
4276 61 91 199 36 -58 -116 -120 48 -46 11 -53 17 -14 -40 -254 -90 35 -18 -30 -80 -98 114 -201 3 70 -119 -21
4302 -21 -64 91 217 34 -74 -124 -72 -105 -32 -47 -87 -8 -39 93 53 -51 235 196 17 159 141 145 89 -37 -61 115
4328 115 -4 12 32 -113 14 27 -96 4 -86 -79 -8 57 2 160 33 66 127 -103 -12 -140 -128 12 -49 30 55
4353 55 -41 -20 -23 -12 148 156 -107 99 52 33 260 148 62 33 35 141 -62 -65 -39 53 -32 20 14 -19 3 -168 103 -112
4381 -112 -195 56 216 10 52 -4 152 164 -4 -134 41 -66 55 -78 -57 -30 17 -75 -122 -14 -137 47 180
4404A80l45K19q5j3J68o4q7J80j83n9J61l8m0J1j43J20M3oR1k63J89kK8M2m0J16
4430A80k5j50j74K84K2k00O9Rr0Q3Nj19J74J2J29l70L31o8j19J34J1j49j1k6O8
4455A0j03J11j37J09l2J28L6j19lrj02K68q1j07J20k9r9l2o4J63J28k79J24J22
4479A23k8j17L7n4L6J04j88J51j76N2J91n5o9M3l8l3p9J71j8j98K40k1q2K8Q7
4504A07j19J39j65j2N3n2q2J0K49j94J43j69J4L9k1k4J23lR1j58j27Q8J47p3R9
4529A03j18k43J79J31q6R5j23O1P3o6k4n1R4M7J37k03J62j83r5K67k78J33j40
4552a28q5K20m8q0J76j21L9n0k2J32J40k12P3M7k97L56k40k5J43k0J57p5k17J06
4576c1J33j8l8L1k21J50o4J21J28j15j62K02j73N5J00k25J17m0Jj2O4q7J51p9
$$ plain form
4404 180 -165 54 -31 -44 124 60 -27 153 -30 -89 72 34 -6 5 -138 -18 25 19 110 -153 36 34 62 104 64 180
4430 180 155 5 -169 115 137 -63 6 15 -75 8 13 -106 68 80 209 -161 170 102 -17 117 128 -21 -32 -58 10
4455 10 -93 18 -119 -10 -42 86 122 3 0 -9 -111 157 76 -31 89 60 -39 -71 -135 28 156 -123 1 123
4479 123 95 -22 15 -39 -3 101 -87 64 -112 -60 131 76 7 50 12 -21 -100 71 53 -145 95 74 -8 20 107
4504 107 -12 127 -38 -50 3 -49 -131 -121 128 -66 77 -92 -78 -39 -60 -84 39 36 127 -31 -158 -70 77 4 103
4529 103 -15 -258 -79 52 -34 61 -62 -1 72 6 -18 -69 25 72 209 6 168 -15 -110 157 -121 12 -128
4552 -128 -213 7 -41 -121 55 -66 -27 -77 -99 33 173 -39 34 81 -216 140 -100 -125 18 -2 155 80 -137 -31
4576 -31 102 84 46 77 -144 6 -58 63 191 76 -86 116 -57 -2 98 -127 -10 -50 -49 -61 3 -84 67 -12
4600a2JK3M8j0n0J08j29K19k43k1K47k30O4j8L8j82m8J78o5j13K46K0j91j7J56
4625A9P6j02J51r8K9k29J37k5j48J60J4J5p8Q8m7mJ21j50R5l5L4pJ09j36J04M0
4651A33J1p3j14N3j4j37J07M5J8k0q8K15k50K77p4Oj20n9O7j33K67j9j01k3P5
4676D9j0o3m7N5Nn6O5k7j68J36L8O9l1n9J26J10m75J98l2K19p2j42K99k15J12
4701H4k9j65J86l0J21k40M4o9J27kl0j7J5j18P4K71l88K33m6oj67K48l9K3J2j02
4727a0J22j62Q9j10q3L31k57O0O6r7J80j29j77J90M3n7L1J62j94J53j1r9Ro7n0
4752f7J97j27j30J5J94j33j8jQ9k3l4J97p9o6j0M9j04R2q6J72r7j32K38j85m9
4777i8J26K3k0q0j0J02J7j65J91L2Qr3j26n2K81r5p0qj5N0j5l4J2J51j68O4o3
$$ plain form
4600 -12 -11 12 60 50 0 108 -21 198 -45 -66 181 -49 15 -3 35 -147 -195 -17 -82 -195 51 71 -120 -137 19
4625 19 95 -7 144 46 75 -154 -17 -42 -190 -30 -16 -1 -79 9 -38 -42 79 -71 24 -11 23 16 125 -11 93 133
4651 133 144 71 -43 10 -4 -141 -34 11 29 9 -79 136 -114 163 89 95 -25 -84 -17 -150 117 98 -3 -26 49
4676 49 39 -24 -71 -16 -11 -67 -2 -29 -197 -61 -23 46 15 -44 82 192 -283 -85 -117 102 30 -112 187 -28 84
4701 84 55 -110 76 46 167 -73 -29 -98 29 27 -3 -20 -5 -123 -49 222 -166 67 21 15 -152 96 57 80 92 -10
4727 -10 112 -50 39 -71 -154 177 -80 -20 46 -51 129 0 -177 13 56 -1 30 192 -2 151 140 41 50 -17 -67
4752 -67 130 3 -127 -112 82 -51 -69 -70 19 -4 -38 159 80 14 4 53 -51 41 -45 127 30 -102 136 -49 -98
4777 -98 28 51 31 -49 -59 43 60 -105 86 118 126 33 -93 -145 136 41 -29 -37 -52 -2 -17 -51 -39 112 -56 8 -55
4804e5R3j41J99j38L0J08l09K85n2L1J05l39Q0N1j30J62O6k2p4o2O7M7K7PNNJ32
4831A78k6k02M9l9R1K3O5l16J5J10J14R1j69M9j47R4K9j00J52J9Nj36M0P1r8J04
4857F6j8P3j19j66J31n0J26L8m7n2j73Q1N2Q6j9k9n8J43mN8k3m5r1m9M3NrJ30
4885H0m6N0Oj6l0j08K0J4P4k07L2O3N8J39j68J1k0L0Q9qp9J02j8q7M8j54J15O0
4913E0j1km7K5M6p0Q8L9j45Q3Q9j76l2L3Q8n4p4K2P6P7j19n0L0q8J81m3j08J88
4941I6j64K09k07n4P2q0J19R6K3k82J01L5J15j11O9Kj85J09M5O2l7j03O8Qm4P6
4967C8k8k3M3l2j45N4P0l1k7p4K4K87j99J8lJ99j62K7P6j12L0q3Q5j38K05k69
4993a70K16M7r4OK0R4l8M2j01q9J49m4j17P6Q2j55L06k08j08Q3J22k27K08K1k34
$$ plain form
4804 -55 38 -103 96 -42 -12 96 -213 72 20 51 156 -183 -103 -52 -182 -20 46 24 -50 -112 -45 2 29 36 41 46 178
4831 178 152 -50 -1 -40 51 74 139 -177 -162 -52 62 153 -16 33 -114 -20 9 -91 61 80 85 -51 -11 60 -38 66
4857 66 48 121 2 -164 -33 -83 43 81 34 -18 -191 -110 -58 28 9 -20 -78 65 61 119 96 51 -40 -89 -46 -41 -50 80
4885 80 34 84 90 74 44 -64 -44 -30 44 -163 -131 -68 -10 129 -39 -28 -48 -18 71 63 -16 86 68 -19 29 -125 -10 50
4913 50 39 37 -10 15 61 -9 79 118 -27 56 145 -31 -63 -30 58 4 -70 -48 28 105 -14 -64 -34 -122 59 16 -92 96
4941 96 -68 141 -66 -120 -48 -128 -9 87 110 -172 -71 -36 79 -32 37 39 -146 -37 8 70 33 -70 -2 6 -38 38
4967 38 10 -13 30 -2 -147 -93 -23 -54 -81 -155 -131 156 -43 -25 -28 171 9 36 112 0 30 -53 32 -106 99 -170
4993 -170 46 93 -1 5 25 119 81 123 22 -67 82 38 -79 -3 79 -76 230 22 -86 -3 119 -108 100 121 -113
5018a13J73j56M6j30Q6O6lJ7n9j36L54j80QJ07l8j6L6m3k00K64k36J37L1r9Q9
5043EJ5%N2K8j22N4j16J49k5n8K09j18j0%pj59J2J48j51O7j4j4j0O6P2l7kJ49
5071A83j41o2m3OJ19j09J82j07J2j06R8k5M0Q3j79K05k52J74o0j48J90m8R9j16
5095eJ06mk24J50P5k70J06J34q7RL1Mj31K5l8P2R3k53J42M9j53J62m1rJ5Q9L0
5122G7RpQ1k43J25o1O1j31J14j33J13n1p0K12l9m8j6L2j78L38k09j05K31kJ1q3
5148B8r5K40j38j91J53K0Jo8J14o2R9j31N3N8j67J47K7j6r9O6j02J93j13J3mj55
5174a29J8K19k31J28N4j76R6m7O3l9q6J07Q4j3R7j13l7L0O2n3j6J35j64J60j11
5199C8K5j43J72J1k54J03l3Q6j96K65r9J4J54j36p3R0pLO0j78P0l2R0k6j03O9
$$ plain form
5018 -113 60 -96 -50 -180 -94 -28 -31 -14 -73 -209 145 -35 -27 80 42 26 62 19 -181 83 -153 -16 15 -84 5
5043 5 20 20 72 100 -22 32 -84 65 40 -18 191 73 63 63 56 -103 -91 57 -94 -27 -41 -55 -65 1 73 36 34 183
5071 183 42 -20 -63 -57 62 -47 135 28 40 -66 32 7 47 130 -49 156 -96 78 18 -130 60 12 111 -5
5095 -5 101 97 -127 23 98 -172 -66 68 -19 -10 21 25 -106 -81 -119 -47 46 -207 -65 -16 -169 -7 -48 -57 -42 47 77
5122 77 86 79 160 -83 42 -19 42 -89 25 -108 5 -46 -116 96 57 9 -7 25 -153 185 -24 -129 102 100 111 28
5148 28 -67 173 35 -156 -3 17 18 -50 64 2 101 -30 23 81 -86 61 88 72 -27 39 -63 130 17 30 26 -129
5174 -129 -111 108 -123 5 59 -117 -21 -68 -5 -44 -130 -23 61 48 145 32 -5 25 87 34 18 153 -11 149 38
5199 38 63 -80 92 103 -151 -48 -81 5 -191 74 -25 -11 143 7 -66 24 17 20 80 -98 -28 -60 30 4 -99 -30
5225c0nl2J20j09J29j51L6NO3J22j26j20J28k7O5m5N7j91l4L2m2R2J45q4j21J89
5251F6n8P9k8j41M4N7m6J37k4j20J0M2n1J9L9j3r3oO6J65j67p0R0l8O5P4k77J95
5279A6l3N0MJ3O0o1j31JJ09n9P6L2j53J39J07j29O6k8j29J87j14R9j20J31j54
5304b1M6j49R3q6J07j67J77m8J14j91J09M5o4J38j03J01j88R6j48R9K39k0j20
5327E9K9m7o9%R6j43lL22k13q8K01j40l6J68o9m1o5J23j94J63j90K74r7P8K9k80
5353a33J90N3k48O0K8j54K94j22K7Q8q7Q6r9j54J50k1j8k6Q5j07J21j5p7J78k55
5378a56R1J27o5o7Q9j35K42J8m6n3q2Q4q0j43J89J49j21j02n8oJ29L4j17j30J46
5403f3K1j1J01j97Q7L4J01j14R1q2N3Q8j36l9L5m2N4n7J13R7k13J22k2R4k55J46
$$ plain form
5225 -30 -35 -67 53 -56 73 -78 -42 -37 26 148 22 -98 30 3 68 23 80 -111 -145 -113 -155 -63 82 -2 -123 66
5251 66 8 87 59 -82 -38 19 -27 110 86 -34 -24 18 -33 -14 25 12 -81 -87 -21 144 -23 -93 -3 -41 24 98 -179 16
5279 16 -17 33 37 50 110 49 -82 -81 28 -31 45 77 -76 63 170 41 107 79 -50 137 23 122 2 133 -21
5304 -21 25 -124 -31 -117 -10 -177 0 -48 66 -125 -16 29 -35 103 0 101 -87 9 -139 -40 199 179 59
5327 59 88 41 -28 -28 68 -75 -78 244 31 -57 144 4 -32 136 67 26 -39 84 -110 53 -137 137 40 118 147 -133
5353 -133 57 110 -138 -78 -50 -204 90 -32 -5 83 -4 82 -17 -171 -21 -42 -60 -86 -1 -108 13 -2 -79 99 -156
5378 -156 -65 62 -3 -70 19 -116 126 144 98 45 -37 47 -33 -176 13 162 41 -61 -119 -125 4 38 -79 -209 -63
5403 -63 -42 -53 48 -149 -62 -28 73 -41 50 -32 21 109 -27 -66 -31 -73 -19 -76 37 134 -79 43 21 115 -140 6
5429FJ21k53K04L9n0k40J96O3Km1j12P0m0J80j06K3k0j08j7N4J04j40MM0J03P2
5455A54o6q8P1l6Q5j26q8O2m7m3K35k89Q5J01J4j15L10j01j68O0J26o2O7o9n0
5480B2j9J71q2J5k26J00m1pJ64k05qK25j04j04k8Oq1J53O8M1k1k3K00l74K52Q
5506A02k6K2j50J48k39P8M6O5K1p0j1N8k8j9N7Jq7OO2n2O2p6O3j1J18l4j86J70
5534I0j97J34J6l0J0K8r6J01O4j74k7P1J06p9q0rJ60j59M1J00O3j32R1o5l3Q2
5560G6j17O6Q0j79J3Q9q2R1K2N5k42J59q9o1n2Q6jJ31J06j69J64l3j06j2k4L5
5586FL1J04k60J40q0J63R4j64L6q1j12K52k44K23j51n5K33k11L1k2O8m6K8k6J40
5611I7j0l6J3j46J45n2j14M5J71k69K48j19n5O8r7J52j72K09j26J62p0%q1N0l2
$$ plain form
5429 6 127 -126 78 117 67 -173 23 86 88 47 -65 5 -35 145 39 62 42 -66 -83 -29 75 -65 -61 -21 82 154
5455 154 88 0 71 35 120 -6 -94 -32 -79 -122 113 -176 -91 10 24 -91 219 118 -50 10 136 74 141 72 22
5480 22 3 174 92 107 -119 -19 -60 -67 97 -108 -116 109 5 -99 -127 -121 -202 -49 19 60 39 16 216 -158 94 102
5506 102 76 98 -52 96 -143 -65 -19 46 67 -3 -14 44 16 -3 54 55 -32 -26 36 -16 46 -30 33 22 140 106 -80 90
5534 90 -107 27 43 13 23 51 -45 56 120 -54 -81 -10 96 17 -63 -72 88 -71 -30 70 133 1 92 27 -6 76
5560 76 -41 25 105 -74 -61 28 -54 37 59 114 -128 31 -58 -119 -171 -85 -86 45 151 -18 146 113 7 -5 -29 6
5586 6 37 141 -119 21 -59 104 198 34 70 -11 -123 129 -115 108 -43 -98 135 -76 -45 -67 1 -45 -17 -43 97
5611 97 87 51 64 -82 63 11 -103 -58 113 -156 92 -27 -82 -14 -111 41 -131 78 -48 114 44 44 -37 13 -19
5636a9K2O3q5L8J3R0p8j27J78k14K35j61k5P5k0P8j04K2l1P9J71j61j34K4k40
5661c11K78o0J48M5j36K60k43J3o9K6P3Po0J73P2k43P7J00p6m7r2JK72l26J22
5686Dm5j50K66j53M0L2J73k86n1J73O8j2j73L65j18l01J13K35j28K7j8j22j8M4
5710c5o3R9j14J46j0m1m0Q8M2Lj2J30j56J2qm8N4l2J00p8q8J89Pj39P4q4K56k96
5738d4M4RJ02q2r2M9K35k09n8K8N5j4j18J4N4L0o9m2R6O7o8j7oJ71j61O3K1k3
5766C5k22J54Q0m2K3N5qj16R3Jm5P6k50K15q5J24o2l3J76l3k68P4J08r2M9R6p8
5793B5k25K86j7o7M2k4j0np5J2J85L4l23l4K13QN2j17J59L1p9r6o8O8p0J31p2
5820c6R4j20J44o0K2j77K20j28J17m2mq5K4M0J04Q6l74J51o5j46K86j88P4K43
$$ plain form
5636 -19 3 66 -19 19 32 122 44 -83 95 -119 116 -45 -70 5 -15 63 -41 -19 -50 29 200 39 -95 -71 -311
5661 -311 -33 -93 55 100 -36 224 -19 -6 -75 -49 24 31 -29 144 216 -27 50 150 74 27 -65 -64 208 -118 4
5686 4 -41 -191 75 -78 -38 -6 167 -119 -170 3 71 59 -114 251 133 -168 -55 180 52 79 61 -61 -79 -35
5710 -35 -98 1 -113 33 23 -18 -58 30 72 75 63 193 37 49 41 -7 47 15 115 37 -51 138 145 6 80 -4 252 -44
5738 -44 0 9 111 29 -63 -14 221 12 -46 -18 37 23 -95 -81 -27 3 -66 -108 -12 55 -13 -30 -36 135 -26 37 58 35
5766 35 -187 -33 47 5 28 83 75 -41 52 53 8 84 -166 49 -36 88 26 -7 169 136 -132 -58 50 -42 7 103 25
5793 25 -200 86 69 2 44 20 10 5 -70 -58 127 161 -162 -196 17 25 77 -40 119 150 71 -25 -93 -25 -95 36 -36
5820 -36 58 -62 82 22 44 -133 87 -41 76 34 30 -55 -31 9 113 199 -175 -24 -89 -235 51 -137 -63 180
5844A80q3p0p8J24k1j45l5L4J36j90R7j15K78k52J87m2KP2o7J11p2j45N0O3j33
5869a14Q7J31j13m7Q4LJk01J91l3kQ3j35MJ41q2L2j5m9Q0jj33k2Q0j18Q6o8J64
5897C4j54L4oP3m2j9J5L41k47r7J89k31P6J47j93K48j73Pj64K02j36J30k8R1p9
5922A8k2o4j6Q1L2J35j7r4J3K1j20J7Kj01N7m5N1O0j38R6l6PJ71k60J33j3L8n0
5950d4K4OJ0J9J6o1j67K95r2q5L1l3J58j08O0k11K95q3J6K4j5m8Q8Q2j98QO4o2
5978a1n3r1J96%j12Q1m6q4J87N6k01o2K27k09%k0J06OJ84k23NJ87j70j7J60O9
6004A65j59j8m2L0K3J05j24N3J9PJm7m1m8K23j15J5j41L6J03j29Q6q6N0J3j84
6030b05K17R2K9j67J18k63L22o0r3J81k23N2j01J32J35l5j67j04J00M8J15Mp3
$$ plain form
5844 180 97 27 -51 73 52 -93 -128 -94 42 -148 -51 -166 112 -140 47 5 7 79 12 123 51 -94 -44 19 -114
5869 -114 -27 104 -9 -56 28 31 32 -169 22 -11 -13 70 -65 -61 80 -2 30 15 -34 46 45 -88 -110 -30 -148 -62 -130 34
5897 34 -120 -86 -92 -19 -61 -80 -65 276 29 -68 121 -110 -34 113 -80 168 -5 2 -162 40 -96 34 6 97 18
5922 18 -4 -68 -84 -3 29 164 147 53 66 87 -33 -16 -14 -115 -58 -103 -52 8 -130 -34 -70 -63 108 -152 -19 -32 6 -44
5950 -44 -20 -14 -4 15 31 -30 -197 98 6 -79 -48 -81 77 -31 29 -182 113 30 46 70 55 7 95 177 -21 -13 51 -11
5978 -11 -64 -155 41 41 -71 10 -36 -120 67 123 -78 -140 87 -122 -122 -142 -36 -30 154 -69 -64 123 -47 -64 96 165
6004 165 6 -12 -54 -24 -1 104 -20 33 52 59 60 13 -28 -76 147 32 47 -94 -58 45 -84 2 -84 -34 -21 -205
6030 -205 12 104 133 -34 84 -179 143 83 -10 171 -52 0 -101 31 166 131 -36 -140 -40 8 123 127 54
6053E4j07O7K01k13J01j54J07mJ11p2n3J06q0j88J69L1r7J07j64Q4P1n5k4o1R3
6078C0j14J4J49n6K5p2L2mJ00j06P5p3lm8O7k7J28k83J15j04O5M1J24K1q0J07
6104A23p4L2K7q1P0j75O6P1l8NL7k50K44M5q0KJl6r0kK36n2r3m3J29j79JJ87o
6133G7j5k6j03k8J78J35k52K6K17p5l1j44q2J73n8k4Q6Q2q2j36J39L4j44J73j18
6158BQ2r9P6m0M6p5O1L9m9j42J04R9M8r2j75j42K30Q1J8L7j15j93L0J47L3k0j3
6185b2K9m0L45l08J92l13J76j7o6r7L6J39o7j2J2j5r0N3J12M0p4n6Q4o1k9MqN5
6213BO6r6J40j93J32j11P9J6l9J62k5M7j46o6J47j73O2M3j5Q3n2o4k2P5r7L9J01
6240I5k21L0O9m5l7K16k00J24o2O5k76L04m3k31QK85j4r6k6K5J1Q4j81O6J8O5
$$ plain form
6053 54 -53 14 215 2 103 -51 56 52 163 91 38 144 64 -124 45 76 -21 86 -78 6 77 22 -2 -63 30
6078 30 -84 -70 79 23 48 -24 8 4 104 -2 73 0 -3 -51 16 -11 117 -166 -51 -155 -90 -49 75 96 16 123
6104 123 49 81 108 27 97 -78 -12 59 21 26 63 -187 57 102 22 24 25 -11 -101 -103 133 81 -12 -55 74 -105 -104 83 77
6133 77 62 36 -67 -95 83 218 -34 -8 209 134 103 -41 -123 50 -8 -32 54 136 54 -82 57 91 -53 120 2
6158 2 84 -15 61 21 67 -8 53 92 43 -99 5 104 152 60 -115 -257 -27 54 72 109 -6 -199 -169 -22 11 -9 -22
6185 -22 7 -33 312 4 196 -117 59 42 -24 -121 -85 54 -13 -25 -13 -28 -118 -65 47 87 13 -43 41 -20 -49 -45 -53 2
6213 2 68 -28 112 -81 51 -60 19 35 -4 158 133 180 34 -32 115 -58 4 47 32 115 63 -1 -23 52 -45 -6 95
6240 95 -126 -96 -27 -72 -109 107 -93 31 -31 34 -242 62 19 -212 -204 81 67 -29 -55 -30 -19 65 -116 -50 -32 33
6266C3N1Jj23O7L2M2j6O6j00j01m3L1Q8j91J67P0k1M5j60P4Q2j16K9nJ42j44K5
6293B5L0k11K68j41jK73j67j07j38J85L5k9M9q7m4O4k4j23M7K1Q9PL9J2N2j36
6319a2J24k37K50j35J25j24L7j10Q7RM4j33J36O4k53J44N1j0j53N1K8J67j35j14
6343i9J21k5MP7r1K7L5Nj55O5N0p7Q5j4j65K14q1j22K12O2j87N2O2m9q6LJ66k10
6371a21J5N3j1J57p3n9m6P9ML5j16j26K84jn2J9j59M3J49L2%k4j24Q8rq3J71j89
6399f4L3p1J59q5O7O9j96Q4P9j07k2P1K8Jl3j67L35j60p1n7J94l0J2k8P3j86J80
6426A08j26L6L2o5j33J67P4kj16M4N3P2j90J71q2j7J35k27J75j89K76k75N1m2
6450g0n9K58j20L7k1m8M3j21J3J94k38J97o8j04J82j24L7Oj85R2J17q8J21J29
$$ plain form
6266 33 84 85 -38 29 61 103 87 153 53 -48 -91 -60 28 -163 4 74 53 98 -62 12 94 -22 7 2 144 0 25
6293 25 55 -156 112 -29 -30 243 76 -31 -169 16 51 22 71 -16 -60 4 -20 -143 -96 -75 14 21 60 72 124 -12
6319 -12 112 -125 125 -10 115 -9 28 -82 5 14 58 -75 61 125 -128 16 67 57 -96 -45 -17 150 15 -99
6343 -99 22 -3 1 78 -13 14 49 54 -101 -36 14 -63 22 8 -157 57 -24 -146 66 128 -59 -7 55 6 -80 -77 89 -121
6371 -121 -106 -53 -64 93 20 -39 -85 -6 -2 33 -83 -209 75 74 22 41 -118 -75 74 106 106 82 -42 46 37 -46 125 -64
6399 -64 -31 -102 57 -28 39 108 -88 -4 75 -32 -54 17 45 46 13 -154 181 21 -50 -107 87 57 69 41 114 -72 108
6426 108 -18 18 50 -15 -148 19 93 91 -25 19 72 144 -46 125 43 26 161 -66 109 -80 196 -79 -28 -70
6450 -70 -129 129 9 46 25 -23 20 -101 -88 106 -132 65 -3 -107 75 -49 -12 -6 -191 -99 18 -70 51 180
6474A80q5m2R8j58K6J5mm0Q5n4M2L5l1o7q2lJ46M1j06l5JP1k05J54mm8q4K58k08
6503a04R6o1o8J94p3m5J11q6l6KJ60K6j81r4K44j47P8N1j1j41r9J66K3Q7m7KN2
6530I9J9l5j03j51J75k47J92J8J42r5J64j71rMn6N6Jj4O1q7O9p2q3J74J2j8k29
6557a84J93k07P1J52j26Q0p7J54r1q6P7J38q4R9n3L2l04J88M5M5Po3kJ37k11p
6583g7o4O2J33j59J99j63p7J48q3K85l82K20J6nj14K5K87k77P6j50Q4K13j36n5
6607FJ32j15j04J35n8l1mJ87kj49RJ7Nj72J32m5N3jj4l9Kj9Q3RJ71j80Q5j34p0
6636a11K42n8j07O7k09J76J23p9lQ8p2o8P8j74Q3k3J61q2r8M9j0J49r7j2PQ4j72
6663f8k2K03pj91N8j4lJ03k0j23Q4m0P2QOM6o3q0mL1q7J63p1r9K20p0j37J28n4
$$ plain form
6474 180 95 53 151 -7 19 34 30 -10 75 21 63 98 67 0 -82 -85 61 102 -4 -39 -38 33 -172 -18 -22 -70 -154 104 -104
6503 -104 -8 -69 -137 57 -16 -61 50 -36 -72 -70 90 116 -65 -159 85 -62 16 67 56 -85 -184 -18 5 92 45 47 99
6530 99 118 83 -20 -171 4 -243 -51 -33 109 14 178 7 -2 2 -54 2 3 -11 50 -37 32 -40 -123 51 63 45 -184
6557 -184 9 -198 -127 25 -101 -21 -98 56 -35 -121 -44 94 10 109 56 88 -216 -28 17 62 69 6 4 141 -70 -77
6583 -77 -141 -79 54 -105 94 -69 -146 2 -81 204 -178 42 58 53 -61 -36 251 -26 50 -100 -16 197 61 6
6607 6 138 23 -81 54 -4 -35 -39 148 146 -3 6 23 28 -144 -12 -57 -4 -5 -19 -58 -56 -75 8 17 188 8 93 -41 -111
6636 -111 131 73 -34 33 -176 0 123 44 41 129 57 -11 67 -107 -24 -47 114 32 -66 -17 -27 122 25 13 20 104 -68
6663 -68 -90 113 106 -85 -27 -41 -44 59 39 -84 0 -40 32 40 46 92 29 -51 -55 -24 -111 52 -19 -118 102 32 -105 23 -31
6692c1k4o8J59J16j29o5N4oO0n8J46j46J3j4R3j07q0J64j13K03j05j6q3j06K55
6717A12j07j7P9j67P1r5O7J06j77R0J8nO5P0J2j27j6M0M4k5J30l79L06r5N3k41
6743a88K24N1r0J43l1j99L4l0Q6J5n1J91j84P7k44L14q7J9k21J44k2o7J6M3rn
6769g1N2M1p0m4J57J6M6q6M7j96J58l1K0j4L2j00L6O0J09l53K00J9R0j01p8J53
6795I2j76J44Mq3K4j5o2J8l0Q2q8q4J92o8J33P3L4k51j18L17j73J15k39K19J6
6820G6l2K2k2n9J01p8n7P1k8J78j64jk01R9K47j62j32L12l06J39J14j03n2L6k9
6845c1N3K2j9Lj06L1j26R8J48m0j34J91q9M5j43j8L16k08m0J45m8m8R8K6r5r5
6871f4J7m4mJ61M6o3p0K12l41J88J15L8k03j35L5J57JjK3j07J13O2j75P8j90J86
$$ plain form
6692 -31 -55 -123 36 152 23 -42 12 6 66 8 154 8 21 7 100 -7 -87 77 -36 167 62 46 -37 -143 112
6717 112 5 -12 67 -100 -29 -124 -57 49 -128 -38 -20 -25 40 110 122 -5 -21 19 63 38 168 -211 95 0 53 -188
6743 -188 36 87 -3 140 109 -90 -56 -86 0 15 -36 155 -29 48 -196 118 31 50 -171 -27 -49 -116 -100 -57 -66 -71
6769 -71 -19 22 -48 -92 65 81 127 41 88 -108 50 19 39 25 57 -43 -7 53 162 -191 9 28 118 17 -61 92
6795 92 -84 60 64 -19 5 -10 -72 -54 -84 -2 -90 -174 18 -50 83 156 190 -61 -179 138 -35 80 -159 60 76
6820 76 44 66 44 -15 86 8 -49 22 -6 172 8 7 -194 -95 152 -10 -142 170 -136 3 117 14 -38 -2 -31
6845 -31 22 44 25 28 -78 -47 -173 -75 73 33 -101 90 1 46 -97 -115 201 -7 -47 98 50 2 100 126 31 -64
6871 -64 -47 -91 -95 66 112 49 -21 191 -150 38 153 191 -12 -147 -112 45 46 45 68 -39 74 136 -39 39 -151 35
6897C5pk57L25m1j48JK11j79O2j7JO2l9L9J8o2P3r6J8L3j93K28r7L5m0PM1P9j53
6926f1n2J51oPk6J78k23K2m8M9o8N1M9Q7k16M3K7j42J68k8j13J41k6J15p0j3m3
6953d7n8J10r5J41k02J33M9M0J75j89j02q0K26q2p3J11j91K79l7j46J39j69O8
6976@J19j23j21P7J15j18M7O6o5O9J05j10k27J64j34K00M7q0N5K2j27J00j5r0
7000b4N5K8K9j49K28j73j10J59j61K97q1p0m0k3n2J48J8j12J08j03Q8M8M4j71
7024a9k3n5L2J63p4m1O3J50j83J21j86J28o0p0R6o3R0pk28K36n8%lL4n3o4L2R5
7052E3j32N9R8j09J52j87l6M1QJ16K8j00L7Kk7j86K83j36m5K57k03l2J41k2o2
7077bjk4K21Nj22N8pj58R6N1j4or9o9J61j92j0J60j51R2J2m4M2M2j07J1N2M7L4
$$ plain form
6897 35 28 -229 96 55 -93 -92 119 -60 2 -15 -14 48 9 48 66 4 77 -19 -1 32 -161 67 -30 5 -35 -28 13 92 -61
6926 -61 -113 38 32 39 13 191 -32 -10 -58 -9 -77 -26 23 110 -106 -63 -36 -178 -10 -38 -151 -10 -36 79 9 -4 -47
6953 -47 -105 5 -90 51 -151 -18 31 71 246 57 -45 -125 101 19 -54 57 -134 145 108 -38 101 -68 0
6976 0 119 -4 -125 -48 67 -51 -4 62 -3 66 171 61 -166 -2 -136 64 111 31 86 108 -19 81 66 -24
7000 -24 31 59 88 -61 167 -6 -116 43 -118 179 98 28 -12 -35 -87 61 79 -33 75 -28 60 108 152 -19
7024 -19 -42 -97 -65 98 24 -17 46 196 13 134 -52 76 16 -54 42 -21 69 62 -166 70 12 12 9 43 -10 -74 -42 53
7052 53 -79 -20 78 -31 121 -66 -102 -61 -53 63 91 -9 28 30 3 -183 100 -36 -81 176 -27 -59 82 60 -2
7077 -2 -3 -27 194 199 77 135 128 -30 66 117 103 97 -2 -71 90 -102 -112 48 -103 -11 1 -43 -1 41 -66 -55 -3 44 78
7106G8j67J6Q0ml2nM5l5NJ45q9K6m2m6k0J28j61Q8Q9r3R3k1p9L7j2j46o0K19o7
7135c0k2K1J81k18j5J45l9q0M0mN4L5m9K7p2M0p5M4m5o6R4j35K01O9N8k28J05
7162C6j8j28J99k92J81K2Q9j35J11q2j9k55L07m8J30r3j11R4k7J68l03J35J19
7185H0j7j65N2P6k36J41L6o3J32Q9j08J1j12K06j65J05L6j49q5K80k57q3M4J70
7209A8k3K50k30j6j4J59q0r8J56j51j1r7P9L1k7J05j00M8M6j45J52J2oo5J7o3
7235e3J30j76n1R9l6M2J55J0k5N3j13k23K87o5n6o7K7J18m2m8P1Pj2j51L39k43
7261b3l1J46j74n9R1Q5j6L0q2O1O1j67N8m6p7K02O0p4N8k21J86j88K22n1r5J85
7287A41q1j22j8K73k89OJ75k3l7Qq8j7j23j2J80k6J05qk6q9n4J6L5RJ28o1j70
$$ plain form
7106 78 -89 -73 7 3 -29 -34 11 -24 -19 126 37 63 21 -25 -45 83 -78 10 99 6 99 78 -1 36 24 -122 -182 37 -30
7135 -30 -52 -31 150 -68 -83 62 23 -57 -17 -21 33 68 19 46 -26 14 -61 -17 -62 -128 -34 -169 32 101 159 -69 36
7162 36 18 -110 89 -203 -22 0 89 -46 65 -17 -36 -291 16 -32 98 5 -106 -12 -39 129 -174 -39 80
7185 80 63 -102 -50 26 -210 -69 -33 -96 36 125 17 28 -84 122 -43 62 98 -51 -136 144 -113 -196 -152 18
7209 18 -5 245 15 -1 -15 144 64 -34 122 -29 -40 -137 -58 -27 -54 51 -49 -1 45 -100 52 64 58 -7 10 -53
7235 -53 77 -99 -150 -51 -87 -45 110 120 95 148 35 -188 99 34 -22 -89 -62 56 14 -34 37 44 32 -119 220 -23
7261 -23 -54 92 -82 -141 -50 35 19 49 -33 28 89 -78 -20 -66 -143 59 119 45 103 -118 68 -120 102 51 -44 141
7287 141 60 -62 -80 193 -96 -90 85 62 25 33 -55 -72 -195 -207 -27 -53 52 44 18 -71 -125 -109 -74 -65 63 2 -168
7314a68P3p5K85n0j35J17j75J66r5K24j59q8J75k6k8o1Q7k5j29J33n1J45k26K18
7338A32%Q2j74Q4k33J40Q4m8K9j07J24j31K9kJ82k82O6l4N4j06M4K15j25Oj11
7363h2n5J51kj25R7k7o3Q1J91n4j19K22k5k78J46R9k28K74k61k7R1R3q3J2j90
7388a62J82p3J28q3R3k10J84j36J36j17P7r2J05l7j6J38j05J9j37J18K9q7Pm7
7412h6R9P7k07J67Lq0R3p6L9q8q6K04j31Q6j21J21N7J02j76j9J53m6j24P2j1K1
7438D3K1p3J26j65P8O2J4j49K0M3j05R9j35J04n8Q6J6k7j53K74j86qL8Q0J95k17
7464B3L3pq8J03o8j7J00L0p8Kn5j2p7M5P1l7Q9q9j37K72j87K1P7Q4k0j01L0n0
7492d3L2Q2p1M0J15j10j62O3n9J03M4KJ1J42m1j69M2MJ07k35K01k34K07q8o1m1
$$ plain form
7314 -168 -95 -170 115 65 -70 47 -128 38 -57 167 8 -80 95 69 41 -20 67 42 -87 46 -5 140 -86 132
7338 132 132 214 40 124 -109 31 115 67 96 -11 113 -18 11 9 191 -91 -25 -59 -5 -111 -67 148 23 29 -82
7363 -82 -137 14 12 -113 -16 -43 -106 -25 166 112 -7 215 190 -88 58 157 -71 203 -58 -85 6 99 16 28 -162
7388 -162 20 -53 75 -8 85 -125 59 -77 59 -58 19 -73 32 -5 -21 117 12 31 -106 12 41 -46 -39 -86
7412 -86 13 90 -117 50 53 -27 66 -10 29 -59 -145 59 -72 14 -107 14 71 173 -3 -22 131 85 -39 33 22 43
7438 43 64 -9 117 -48 30 92 106 -43 -23 20 -85 14 -121 -17 -75 11 27 0 -153 121 -65 -73 -35 45 240 23
7464 23 56 49 -39 64 -4 -21 79 109 31 33 -22 -34 -111 -66 5 -32 57 -32 -169 103 -84 -63 14 98 78 -23 7 -43
7492 -43 -11 71 0 40 155 45 -117 -54 -113 -10 34 36 47 189 148 -21 21 25 132 -103 98 -136 71 -17 -78 -119
7518a19%J44jr4j6J25j02J24n7J44k36J6J05n1n2j05K63j08N0j51J47P8k37R1
7542d2J17L3j1j13K04k64N8J95k25Q3j16L9K6J%M9j04K1O1N0o5J50J14k73j17
7567a29nJ39j24L19j77J09k74J73q3LK68m03K00M8j10m6K21j25J49k63LR9R2j40
7591e6QL60m58Q0J52k3l9J42q3j24M8on1J37J0j37Q3j72J65n3J12o7j23J61j07
7616d1l7L9J59j78L0k9O0RK3n6K5L8J34Lj35l8l3j6m4M3O7N1J41m7j96J36r4j87
7644a73J14K2N9pK3qJ06p6j23J14j48K07j31K4o6k3J99j59K6j01J68N7k60L82
7668B26j85q2J84j18Q0k57J77m9N5m7O3l3k5L9N3m4j44K00k24J86j31r2L17k36
7692h7J40j93J87M8K2j31M5k0M1j9l1P4j54L9m5R6p5J04o1M7J74k16p8J60m7r8
$$ plain form
7518 -119 -119 25 24 -70 -86 39 -63 61 4 148 -88 -72 33 -18 -70 -175 88 -20 30 -121 26 104 -133 -42
7542 -42 75 108 97 -16 188 -76 -18 177 -48 35 -81 -42 -16 -15 -15 34 -70 -49 12 62 -3 147 261 -12 -129
7567 -129 -134 5 -119 200 23 132 -142 31 -52 -49 219 -184 16 64 -46 -92 129 4 153 -110 -107 -8 84 -56
7591 -56 -48 312 -146 -66 86 63 24 166 83 -41 7 1 -50 87 97 -40 43 -129 36 -17 95 28 -95 66 -41
7616 -41 -78 -39 120 -58 -28 -57 3 12 35 -21 4 42 176 179 44 6 -27 -43 -87 -44 23 74 215 168 -28 108 14 -173
7644 -173 -59 -37 22 15 38 30 136 60 -63 51 -97 110 -21 3 -63 -86 113 -46 -20 -121 47 104 -156 226
7668 226 41 -41 143 25 105 -152 25 -24 31 -16 47 14 -11 28 81 37 -107 93 -131 55 -76 -168 149 -87
7692 -87 53 -140 47 95 117 -14 31 11 52 33 2 76 -78 -39 -84 12 -63 41 -20 27 201 -15 -93 67 20 -78
7718g8J04n0m4K5M7n9J40J17j45o8K11j56M1j6p7q7J80m5n8o9J52l4l0o8J11k1
7744B3q0Q7j18O2N5m1o5n8K21L2J27j68k0Jj12O3o2on8J36l6J9j0j07M4k8n7R8
7772e8N4j55K43l1O7q4j36J32O6l7l0j48J33o5P0j20J06j97K90o3r3J18jO5o9
7797E7l7j03J35q3kK11j77p0j08J37P0J4j06p3m7J58m7p1J05j09J59m0j2J51j80
7822f8J07j2k8R6j42P1mJ3o0j07M6O8n3J37j41M3l3R3k28K14m2J02p0q9Q8n1J1
7849c9K9j8jJ21k31N6L0J08Q5j52No9N6Lm7P1L9kj35J60p0Q3J0n6j15P6j9n6L5
7878d3m8Q7q2J62p2J32n3K8r2m6p7m3J09N5J27k03L1l5K42j57J0MK0K2n3Kj13
7905h6MK91j92J9l6p6J29Qj25J56M0k7m7L3k9K3j12Kp1J18P2k28J86j10J49j6
$$ plain form
7718 -78 26 -24 -68 -43 4 -55 85 202 57 -11 200 44 85 69 -8 -95 85 40 -18 -87 65 31 1 -67 44 23
7744 23 -57 30 -88 -26 29 -12 -77 -135 86 118 245 77 57 58 -54 9 -53 -59 -117 19 -17 2 -8 -115 -71 -99 -156 -58
7772 -58 -4 -159 84 53 120 36 -100 32 98 61 31 -117 16 -49 21 -99 7 -190 100 37 -56 62 61 126 57
7797 57 20 -83 52 -31 -33 178 1 -69 -177 -40 30 44 -62 -135 -182 -24 -71 -142 -37 -146 13 -27 -39 112 -68
7822 -68 39 27 -1 95 -47 24 20 33 -27 -134 -88 -20 -73 64 -77 -34 -67 26 -202 12 -30 72 2 -87 1 -50 -39
7849 -39 -10 -28 -29 92 -139 -83 -53 55 140 -12 -7 -76 -20 -17 -64 7 46 44 -91 69 -1 82 92 36 -79 -3 -22 -78 -43
7878 -43 -91 -4 -86 76 4 136 83 111 19 -27 -104 -147 -38 17 144 -59 -28 -63 179 22 32 36 56 78 25 27 -86
7905 -86 -82 209 17 36 0 -76 53 61 -64 92 132 105 58 91 62 85 -27 -25 -96 22 94 -134 52 -58 91 75
7931G5l7o5Q3j44o5K38R0k16O0k8jR9n4j07K17l08O2r3J70j35L22k85J82j22K1
7956d1R0j15P0J2j47Q7J19j82K35j77p8K28k24j5J63k04K46l3j63K26q0l7J33
7979A13j66j04L14j84k9mM3l3o1N1Q4m6l3j18K73j90p1J91M5J4q0m4Jm9Q1N4j13
8006f1l5k1J86j84J59L0r5J10k53J27O7j46Q7kK2q2m0K43o7q3j09J26J29n9oo0
8032a7l5K1q6j3K22o9q0J10o5j1O2R8J3j26j6J41j39K35k40j9lq6K5O9L5J8N5
8059I9J1j07Q0j31j54K37r%Q2j11r3r9K96j02j4L0q8J48j07J05k44K25j41L4J5
8084c8j5J28m5O6r4j46K39l41J94j5m4K38j78J08R9j43j19J60o6M6m9p8K01r7
8108A1j13RJ63K5r2m7K13k50n2K51p0J1p7j22K37j92J06J41j97m1J3J03m5k5l2
$$ plain form
7931 75 38 -27 56 -88 -153 85 175 -41 19 -9 -10 89 35 -72 145 -163 -101 -194 -24 -159 163 -122 60 -62 -41
7956 -41 49 -66 4 16 -131 -44 75 -107 128 -49 -127 101 -123 -138 25 -179 67 34 -129 97 17 -20 113
7979 113 -53 -157 157 -27 -56 -60 -17 -50 -111 -60 24 -22 -55 -173 100 -90 -161 30 75 89 9 -35 -34 -83 -2 52 -61
8006 -61 -96 -117 69 -115 44 74 -21 89 -164 -37 30 -116 -29 -31 -9 -91 -131 112 45 -38 -147 -21 108 49 43 -17
8032 -17 -52 -31 -117 -130 92 23 -57 53 -12 -23 39 137 150 24 8 149 10 245 5 -14 -17 -103 -78 -9 26 44 99
8059 99 110 3 83 -48 -202 35 26 26 108 -3 -96 -195 101 -1 -15 15 -73 75 -32 73 -171 54 -87 -53 -38
8084 -38 -53 75 30 96 2 -144 95 -246 -52 -67 -111 127 -51 57 156 13 -106 54 -12 34 -15 -93 108 11
8108 11 -102 -93 70 95 3 -44 169 -81 -133 118 48 59 -18 -140 97 -95 11 152 -45 -86 -73 30 -15 -40 -72
8133g2l0R4lRN3P5j36Qj19J25J1Mk8J4j21K02J49k44M9J07q5J4q7M7n7o1K46j47
8161A7j46J55p6n6J73n9l9Pq3J13J7q7l1J1O5P4Pj15L8N4j8j39P3j9J34J18j55
8188C3jK8k30
$$ plain form
8133 -72 -102 -8 -11 -2 51 126 -10 -2 -121 4 15 19 -9 5 -116 86 235 -9 40 147 62 76 -11 36 -21 -82 164 17
8161 17 -129 26 -50 -106 67 8 -31 -24 -107 6 23 -64 -95 -84 -19 55 62 -53 -15 39 21 -118 -45 -64 70 188 33
8188 33 32 60 -170
8191a70
$$ Imaginary data points
##PAGE= N=2
##DATA TABLE= (X++(I..I)), XYDATA
0@%%%%%%%%%%%%%%%%%%Qj6J6j6J6j6K4l2L2l6M4m8N6o5P3q4R4j06J20j36J52j70
40i0J89k08K31k57K84l14L47l81M21m66N12n63O20o84P56q37R29j032J151j293
60f85J460j662J917k242K679l302M257n948R844l8343j1592K3006j2963K1842
74a1732K2507R683n753J0354J2444j1022j8324J2145j995k0323m82R132q226j0604
88a2196n96P070j0612j4014J0234O283j2382Q687J9683N222L624J2863J3282j322
102C5826j1123K824l632k4938j1539K58j3668r898M392Q488L696K201J5084J4266
116A2237m825L724J2655o046p507L645J43o042n851K726K212j1898m014O129r903
131a2615r383N116P80k725L405J0001J0606J463O768J4231k159p139L998n338
$$ plain form
0 0 0 0 0 0 0 0 0 0 0 0 0 0 0 0 0 0 0 0 8 -8 8 -8 8 -8 16 -16 16 -20 24 -24 32 -33 40 -44 50 -56 64 -72 80 -90
40 -90 99 -109 122 -135 149 -165 182 -199 222 -244 268 -295 325 -359 397 -440 489 -543 608 -685
60 -685 775 -887 1030 -1212 1467 -1835 2422 -3526 6318 -32025 -43617 -20611 -33574 -11732
74 -11732 10775 20458 14705 25059 37503 26481 8157 20302 18307 -2016 -2498 6634 -1592 -12196
88 -12196 -12792 -5722 -16334 -30348 -20114 -13831 -26213 -17526 2157 7379 11003 23866 37148 35826
102 35826 24703 27527 23895 -1043 -12582 -12324 -25992 -35890 -31498 -23010 -19314 -17113 -2029 12237
116 12237 7412 11136 23791 17745 10238 13883 14026 7984 2133 4859 7071 -4827 -8841 -2712 -12615
131 -12615 -21998 -16882 -16102 -18827 -15422 -5421 5185 6648 13416 27647 25488 18349 22347 17009
145A7009j3873p647m457m667q336j399R837l62j592J3257O101l155M935N276L3
160A0960l317l18O055l347o653N953J54j0662j388J84o956o637k087L984p96k286
176a7157J1675R535j220Q185R787j048k883j548j599p650j1242p61q98j0116N37
191a6403P056j440Q00N364N017J402k274M752M989n649R59P176k898k344K396
206H903j6l653o542k287j006r356l683M980k124k60Q485O598M458M337N327N035
222A9196l735l718J580p140q654r18l297m272p63J017L361k38M7O609M65k280
238b740M843J843q86K408J950K392K21k329K508k485p471j328l789p104k115j121
254a5203L46K516K328P691O207J491O798L929k987j0j784n071l798m626k235j178
$$ plain form
145 17009 3136 -4511 -8968 -13635 -21971 -23370 -13533 -13895 -15487 -2230 3871 716 5651 10927 10960
160 10960 7643 7325 13380 10033 3380 9333 9487 -1175 -2563 -2379 -9335 -15972 -18059 -14075 -14871 -17157
176 -17157 -5482 4053 2833 11018 20805 19757 16874 15326 13727 6077 -5165 -5926 -6824 -16940 -16403
191 -16403 -9347 -10787 -9987 -4623 394 1796 -478 4274 9263 3614 4573 11749 8851 6507 8903
206 8903 8887 5234 -1308 -3595 -4601 -13957 -17640 -12660 -14784 -15044 -6559 39 4497 8834 14161 19196
222 19196 15461 11743 13323 6183 -2471 -3389 -6686 -10958 -11721 -10704 -7343 -7581 -7534 -925 -460 -2740
238 -2740 2103 3946 3060 5468 7418 9810 10031 7702 10210 7725 254 -1074 -4863 -11967 -14082 -15203
254 -15203 -14857 -12341 -10013 -2322 3885 5376 12174 16103 13116 13106 11322 6251 2453 -2173 -4408 -5586
270e586m248J483K573k597J831K886j079J749J321J512L085K26L201M732j691
285I398R68J673m522l270l330n373l567m870j800J823o78L293O977K968M270N612
301I572J239J364o35k580j089m198m059J24l324k021J264j619l48J051j086J175
317e170N1m07L612J291J362N137K153J241K653j214j112k591n576k742m186n510
333a1008j76j094k97M062K558L986M956J593L153J821j968K79j227l409j12k014
349A103k297P54j898j132O26k407k62Q9k094J952R63O15M489K643J990M239N91
366I964L5J50l886k332l424n631j624k139k442K230J375J588M491K115K514K852
382E836p95J124L2k688M92n55k336J86n48j280M1k217n10l61l306J62J443j035
$$ plain form
270 -5586 -9834 -8351 -5778 -8375 -6544 -3658 -4737 -2988 -1667 -155 2930 3156 6357 11089 9398
285 9398 10366 12039 7517 4247 917 -4456 -8023 -12893 -14693 -12870 -13548 -10255 -3278 -310 3960 9572
301 9572 10811 12175 11540 8960 7871 3673 -386 -262 -3586 -5607 -4343 -5962 -6310 -5259 -6345 -5170
317 -5170 -5119 -5526 -1914 -623 739 5876 8029 9270 11923 10709 9597 7006 1430 -1312 -5498 -11008
333 -11008 -11184 -12278 -12575 -8513 -5955 -1969 2987 4580 7733 9554 7586 7865 6638 3229 3117 1103
349 1103 -1194 -440 -2338 -3470 -2844 -5251 -5513 -5424 -7518 -5566 -4603 -3988 501 3144 5134 9373 9964
366 9964 9999 10149 6263 3931 507 -5124 -6748 -8887 -11329 -9099 -7724 -6136 -1645 470 2984 5836
382 5836 5041 6165 6197 3509 4001 3446 1110 1296 748 -532 -491 -2708 -3218 -3579 -6885 -6723 -5280 -6315
400f315K608L276K001L591J928J607J733k702j622j344n301k907j593l101m69
415h610M60Q59L487Q95K322M030j63L16K046j468l67q2j221L63j207j400J456
432A716k393k280R16k489j778K81l46J175J659J325M837J838P37L922k3k180n2
449F865k696l415k903l210o62j150j515L086J632j52L673K000L42J560k5Q63L9
466D332j843J663P9k564O89j85k727q09j543j793q04k246Q62K153o18L336M189
483B171O81K797K318M51j8k375j609j501m803k017J78l131k91J663K02J545J377
500b362J346K428p86R85K727j213j62K397p30n31k11j127n20k892k571J81l095
517f136k144J820k5N92L062K161L472J903J046K925j064k347O27k262l931r95
$$ plain form
400 -6315 -3707 -431 1570 5161 7089 8696 10429 7727 6105 4761 -540 -3447 -5040 -8141 -8610
415 -8610 -8150 -7291 -3804 -2909 -587 3443 3280 3596 5642 4174 3807 3725 2504 2867 1660 260 1716
432 1716 -677 -2957 -2041 -4530 -6308 -6027 -6373 -5198 -3539 -2214 2623 4461 5198 9120 9097 6917 6865
449 6865 4169 754 -2149 -5359 -6021 -7171 -8686 -5600 -3968 -4120 -447 1553 1895 3455 3430 4293 4332
466 4332 2489 4152 4231 1667 2356 2171 -556 -1365 -2908 -4701 -5505 -7751 -6889 -4736 -5354 -2018 2171
483 2171 2852 5649 7967 8418 8400 6025 4416 2915 -1888 -3905 -3727 -6858 -7149 -5486 -5284 -3739 -2362
500 -2362 -1016 1412 626 1611 4338 3125 2963 5360 4630 4099 3888 2761 2241 -651 -3222 -3041 -6136
517 -6136 -8280 -6460 -6485 -5893 -2831 -670 2802 4705 5751 8676 7612 5265 5892 3630 -301 -1296
533a296j731j273n58o43J727K12j084L075Q22j152K322J180J79J508M59J566N73
550E886j891J049p50m024j101j566l197j126o31M94J606K45L575L524o2K835K131
567F997j359j01q02j600j010l105n55L36k597K15J679j497p6J108n4M59k7J150
585h39K146m39J252L185q05l1J291j590j606j969k533r17k877j365K096o01M09
602e193L740J553J516K068N78J071o77j632P16k153k365R28j184j326P91l32l29
619b230M3p12J105r6j428K565R79l43K261J333O81O66q46J02r22l473l37j353
637b005k984q5K40k53J538J189K229K074j21J871J084k032J43L67k228m95o43
654a11o84L50j612L71P84j844M5J105j264M56J154N56J563O77J201K006q14j76
$$ plain form
533 -1296 -3027 -4300 -4858 -5501 -3774 -3562 -4646 -1571 -749 -1901 421 1601 1780 3288 3747 5313 5886
550 5886 3995 5044 4294 270 -831 -2397 -5594 -6720 -7351 -6857 -5251 -5006 -1431 2093 2031 4866 6997
567 6997 5638 5537 4735 3135 2125 -980 -1535 -1199 -3796 -3581 -1902 -3399 -3475 -2367 -2421 -1962 -1989 -839
585 -839 1307 868 2120 5305 4500 4469 5760 4170 2564 595 -1938 -2855 -5732 -7097 -5001 -5602 -5193
602 -5193 -1453 100 1616 3684 4262 5333 4656 3024 3740 1587 -778 150 -1034 -2360 -1569 -1901 -2230
619 -2230 -2187 -2899 -1794 -1890 -3318 -753 226 -117 2144 3477 4158 4824 3978 4080 3158 -315 -652 -2005
637 -2005 -4989 -5074 -4834 -5087 -3549 -2360 -131 1943 1822 3693 4777 2745 2888 3255 1027 532 -111
654 -111 -795 -445 -2057 -1686 -902 -2746 -2701 -1596 -2860 -2404 -1250 -694 869 1546 2747 4753 3939 3763
672C763Q08k470j569q54k415j050r76l56J411J55J010L009L52O48K184k73j72
689C205j11j102J64r50j448J152j307j343R83q57j079J28q37N48M68k95K359J179
707H57J98K600P59l28Q91j228j034j137k495p71j124k378J072L09k27J735J372
724i29N32J533N06P10J017j374O04M51j735L90k2j302m3j158p84j44j797r1O35
743c001j061J117J928K51K017J399O25J422j36p62K93k437j665k75k339o18K5
760c217q36R03L38K74K305j37M21J708m17L82Q85m88K86J54j032O84r89j577M13
779F0j598j515J74p67l57J144P8J675J357P26K224O11n11J020r37j372n10j646
797a44r39n80j429M86M06r92J561M16k35J629K4Q5J101l48O59R95q44N96O6j396
$$ plain form
672 3763 4571 2101 532 -322 -2737 -3787 -4763 -5119 -3708 -3553 -2543 466 818 1466 3650 3377 3205
689 3205 3094 1992 2156 1206 -242 910 -397 -1740 -757 -1614 -2693 -2565 -3402 -2854 -2386 -2681 -322 857
707 857 1055 3655 4414 4086 4977 3749 2715 1578 -917 -1688 -2812 -5190 -4118 -3809 -4036 -2301 -929
724 -929 -397 1136 1642 2352 3369 1995 2599 3050 1315 1705 1683 381 338 -820 -1604 -1748 -3545 -3636 -3001
743 -3001 -4062 -2945 -1017 -766 1251 2650 3275 4697 4561 3799 4092 1655 -10 -285 -2624 -3242 -3217
760 -3217 -4053 -3150 -2812 -2538 -233 -370 51 1759 1342 1724 2609 2121 2407 2561 1529 2213 1224 -353 60
779 60 -1538 -3053 -2879 -3646 -4003 -2859 -2781 -1106 251 977 3201 3812 3301 4321 3384 2012 1502 -144
797 -144 -1083 -1663 -3092 -2606 -2200 -3192 -1631 -1215 -1450 179 203 288 1389 1041 1700 2695 1851 2447 2513 1117
817A117J01p32j917j04j250n50N90p33P66J855J28J625J516l48J332o3j075L47
835B605j459j221M1j468m89P29j018M51N17l75J054Oj85J395l96J72J452l32L27
854A806O19q37L12l82j538p4j270j385M19p71k5J357J2J247J728k0J191M46p07
873B128M67q20j198j5r79p46L01r26p0Q13o21O98L35n44J080Q0n1J165j28L29
893A298J142o85K24K17j527j47r04j465Q3q36o38R97j02P19J759RJ195J322o81
912A980N98K0j213J03r62j117K94q26m69N21p96K19O85r29R69L22m85J253O34
931H01NJ247m1J96O82j254k60k90j836l67o81j369N13j87Q3J500K99P58J685k17
951A267P41R97j025M7j70j160L1q03o61M06j041k64M84j060M17L76n44P12Q54
$$ plain form
817 1117 1218 486 -1431 -1535 -2785 -3335 -2745 -3478 -2712 -857 -729 896 2412 2064 3396 3333 2258 2605
835 2605 1146 -75 -34 -1502 -1991 -1262 -2280 -1829 -1312 -1687 -633 -627 -812 583 187 359 1811 1479 1806
854 1806 2425 1588 1900 1518 -20 -94 -1364 -2749 -2330 -3101 -3126 -1769 -1757 -510 1218 1198 2389 2835 2128
873 2128 2595 1775 577 562 -417 -1163 -862 -1788 -1858 -1045 -1666 -968 -633 -1177 -97 -17 -68 1097 969 1298
893 1298 2440 1755 1979 2196 669 522 -382 -1847 -1764 -2600 -3238 -2241 -2343 -1624 135 144 1339 2661 1980
912 1980 2578 2598 1385 1488 526 -591 -297 -1123 -1592 -1071 -1867 -1648 -963 -1892 -923 -601 -1086 167 801
931 801 806 2053 2012 2208 2890 1636 1376 1086 -750 -1117 -1798 -3167 -2654 -2841 -2758 -1258 -959 -201 1484 1267
951 1267 2008 3005 1980 2027 1857 697 728 -75 -736 -330 -1371 -1635 -1151 -2211 -1794 -1418 -1962 -1250 -396
970c96N9J395O37K75R97m55j70M8j481p32m25j509k85m27p66Q73L55K17J492K10
990h8O38J194l69N53K99p67K86k44j041L42n99r80K58q33m72L71j026O49M67m83
1010a845J331R46O2J255O51j90Q63r21n95l58j413n11l27j426N53k9m09J111L68
1029h84J37J310k62L46Q50o69O51J04p91N74m56p04L44q57n86L65j173k25O86
1048a240q07N59P71J62J160N11J17J276o39l24N23j446m44M7j255j25J1p57O75
1067a225J17j80J199l32K01J003l84L50O06n54K57J78q06N70m70q82L92q49r31
1086a740O42m54M5N86j92R14R34k63J167J34o99Q97o61n85j97r72l76O7r10K89
1106a374M47n89J003K23j96R64j32K33N23m37J83L21n78K69J95j035J48l83r71
$$ plain form
970 -396 -337 1058 1695 1970 2967 2512 2342 2390 909 177 -248 -1757 -2042 -2469 -3235 -2362 -2007 -1790 -298 -88
990 -88 550 1744 1375 1928 2227 1460 1746 1502 461 803 204 -776 -518 -1351 -1823 -1452 -2478 -1829 -1362 -1845
1010 -1845 -514 432 494 1749 2400 2210 3073 2152 1557 1199 -214 -725 -1052 -2478 -1925 -1954 -2363 -1252 -884
1029 -884 -747 563 301 647 1497 828 1479 1583 792 1366 910 206 550 -307 -893 -528 -1701 -1926 -1240
1048 -1240 -2047 -1488 -717 -555 605 1116 1233 2509 1870 1546 2069 623 179 226 -1029 -1154 -1143 -1900 -1225
1067 -1225 -1108 -1288 -89 -421 -220 783 399 749 1355 801 1058 1236 430 1000 530 -352 40 -809 -1740
1086 -1740 -1098 -1552 -1507 -921 -1113 -199 735 472 1639 1773 1074 1971 1310 725 528 -444 -820 -753 -1663 -1374
1106 -1374 -927 -1516 -513 -290 -486 478 346 579 1102 665 848 1169 591 860 1055 20 168 -215 -1186
1125a186L54o08l73P07m11O73J080k34Q76O67k33O32l41p23L97j072o20K93j096
1144a218j02M10o90M57L08j90J087n4k40J107l23K45P34l89j75N10q74N3l12r05
1164e61J65q87o06O07m96J28R04j7Q11Q47k13P62N93o99L94m88q83L32r68m89
1184g64R3p08J15L19m56N50L00l60Q01K45o5Q50RK08O94n05j8N3r89j67l75j152
1206a322P2l36l08N79m10N46R71j73R68P29l09M99K07o51K24l96p61L05p34m37
1226g37M73r89K7L56m52N51J68k79J093j1P8J164l39m4P50p46l5j57j148L6m68
1247g09p88M37n31j62J027n2L50Q53m5M27M73m58N22l75n77M91n10o61L49n32
1267d71k52K28o15K54J02m58O64K54k43Q19K80O4P68l93J64Q5r97Nm9r58ol9n29
$$ plain form
1125 -1186 -832 -1440 -1813 -1106 -1517 -844 236 2 878 1545 1312 1944 1603 880 1277 205 -415 -122 -1218
1144 -1218 -1320 -910 -1600 -1143 -835 -1025 62 8 -232 875 552 797 1531 1142 967 1477 603 656 344 -561
1164 -561 -396 -1283 -1889 -1282 -1778 -1650 -746 -763 48 895 682 1444 2037 1338 1732 1244 361 693 -275 -764
1184 -764 -671 -1379 -1264 -945 -1401 -851 -551 -911 -110 135 70 920 929 1137 1831 1326 1308 1361 372 205 -170 -1322
1206 -1322 -1250 -1586 -1894 -1315 -1725 -1179 -208 -381 587 1316 1007 1506 1713 1062 1286 890 129 434 -300 -737
1226 -737 -264 -1253 -1226 -870 -1322 -771 -603 -882 211 200 278 1442 1103 1059 1809 1063 1028 871 -277 -241 -709
1247 -709 -1497 -1060 -1591 -1753 -726 -778 -428 425 380 807 1280 822 1344 969 392 883 373 -288 61 -471
1267 -471 -723 -495 -1110 -856 -754 -1212 -548 -294 -537 282 562 626 1394 1001 1165 1250 253 258 209 -749 -755 -794 -1323
1290a323M75j26K52O43k62M56L86j68L12L58o72L66j66n78M46n31o5N1p23N3K63
1311e53m51J45N11l64P96J48n7Q63j54j88O86p25l59J06o86Mm3r23O68k02k64
1332a042P75j68N3R40k99L06M92o70M18K2o25K60k42o07L49m67k19L06l71k9L73
1353d45m90P68J93j38R62k7n5N51n16k98M12q76o4j00p76J98n9m16L84k7J11R20
1375B12k20K83O82k50J02K59l75J53j74o23P3j47o52K20m54k89M83j79J7O09j27
1396c97N10N09j94P14J70l50J81k20m87r4p11p0k5o38P5L5k04N78K18j20R36k66
1418A50K18P28n11K23L80n55K4o1o47J52m64n80M20n79j83L74j59O64L68k53P85
1439D94N64l56N21j56l02O6l73m28K97j037qK06o05K46R9k75O70J22K6P86j94
$$ plain form
1290 -1323 -848 -974 -722 -79 -341 115 501 333 645 1003 331 697 531 -47 399 -132 -197 -146 -869 -816 -553
1311 -553 -1004 -859 -348 -712 84 232 175 1038 884 696 1382 657 298 404 -282 -278 -321 -1244 -576 -778 -1042
1332 -1042 -267 -435 -382 558 259 565 1057 387 805 827 202 462 220 -387 -38 -505 -724 -418 -789 -818 -445
1353 -445 -935 -167 26 -112 850 823 768 1319 803 505 917 41 -23 -123 -899 -701 -760 -1176 -792 -819 -708 212
1375 212 -8 275 957 707 809 1068 693 846 672 49 122 -25 -677 -457 -911 -1200 -717 -896 -879 -270 -397
1396 -397 113 622 428 1142 1312 962 1143 923 436 342 -369 -439 -464 -1102 -1027 -992 -1196 -618 -400 -520 416 150
1418 150 368 1096 585 808 1188 633 657 596 -51 101 -363 -943 -523 -1102 -1285 -911 -1070 -406 -38 -291 494
1439 494 1058 702 1223 1067 765 831 458 30 327 -710 -718 -512 -1117 -871 -772 -1047 -377 -255 -229 557 363
1460C63K10M45m55L59K02o15J56k27p46J57m78m59N53n04P0N78j87M64L59j81
1480F4O08K08k44L00j31m78K41n61k26K17o88R0l8l02L61J26k28P00Km8M42j5
1502D00K09L90k78n5Om73j32l46k84J52q6l90M65l07K25M64l35M54N39k84L98
1523G32j8m77L85l86l17L05m60k56K93m67J86J62l39L73J61k71N53R7k3L25q0
1544D78L5K48m43p4J5o25K09j57n66M76k22MM48j13J69N59k61M30K61m91L91j16
1566F55n45J96m13k61K04n40J45L36m61K90J76k96M76L18k26N82j98o6M31k98
1586E05j03J73o70r4K8n51l0J05l22M31L4PO21j24L70L63l12L36K78m40J04l17
1608C92n03K01m19l17L02n59k7K38q7L24M48j03M81J8j12N22q2l8K70n07k20J20
$$ plain form
1460 363 573 1018 563 922 1124 509 665 438 -308 -151 -629 -1088 -535 -1039 -969 -391 -578 -114 245 64
1480 64 672 880 636 936 805 327 568 7 -219 -2 -690 -600 -638 -940 -579 -453 -681 19 21 -27 415 400
1502 400 609 999 721 666 672 199 67 -279 -563 -411 -497 -887 -422 -729 -504 -40 -375 79 618 334 732
1523 732 714 237 622 236 -81 224 -236 -492 -199 -666 -480 -318 -657 -284 -123 -394 159 256 233 558 478
1544 478 513 761 318 244 259 -366 -157 -314 -880 -404 -626 -622 -174 -287 -118 441 180 610 871 380 771 655
1566 655 110 306 -107 -368 -164 -704 -559 -223 -684 -394 -218 -514 -38 280 54 636 438 372 803 505
1586 505 402 575 -95 -189 -161 -712 -742 -637 -959 -528 -494 -487 134 10 380 743 431 767 1045 605 709 392
1608 392 -111 90 -329 -646 -344 -903 -930 -692 -779 -455 -7 -110 371 389 277 799 717 679 949 442 222 342
1630C42p03j00j9n16K93m1k1L32L8J21L98L2L16M86m16K95P7l70q7k46k84r1l57
1653e21j85J30l75J16L59j94L35M57k37N25K13M8L15j34l36J18m60k4j29m45q8
1674e12j01l23K79R4j17M79LJ08P02l7K9L02k31J26j74m83Q2j12m94J52l11j81
1696g20J22j49l8L55K9K50M12j68N25l4n6L82m24j33N8l77j78J8n01P4N7j78R0
1719e84J13J41M09j01K35L98j76K18J1l60K17j30l81K35m36j44J26l78j7K48j85
1740e41L28Q0j60M73L68l08K88j16qJ83m71mj8l11Kj14m04L54J4o0L63n8j2L79
1764B47k1J68O6j26J16M1l97K48l32l11K18j57k12K03k05r0M62k42L37L02j18
1785A97K65K03l86M34l19k97K05m31j5L5k54j55J72k02J93K18j51N40j16q7N28
$$ plain form
1630 342 -361 -461 -480 -996 -703 -744 -765 -433 -395 -274 124 156 472 958 542 837 914 544 457 211 -73 -164 -521
1653 -521 -706 -576 -951 -835 -476 -670 -335 122 -115 410 623 671 986 852 516 634 174 150 21 -424 -512
1674 -512 -613 -936 -657 -563 -680 -201 -198 -90 612 575 604 906 675 801 627 144 226 114 -380 -228 -539 -720
1696 -720 -598 -747 -785 -430 -401 -151 261 93 618 584 528 910 486 353 411 34 -144 -126 -627 -553 -496 -674 -584
1719 -584 -471 -330 79 -22 213 611 435 653 664 304 521 391 10 245 -191 -335 -209 -587 -604 -356 -541
1740 -541 -213 -133 -293 180 548 240 528 412 404 587 116 112 94 -217 -215 -329 -733 -379 -365 -425 -62 -120 -132 247
1764 247 226 394 460 334 450 491 94 342 10 -301 -83 -240 -452 -249 -454 -544 -82 -324 13 315 197
1785 197 462 665 279 713 394 97 302 -129 -144 -109 -363 -518 -346 -548 -355 -137 -288 252 136 49 577
1806E77o9o2L39n03j55K09l45K7l48l62K86j25j09L71j81J33L15p9M41J00j06
1827C54L77j46l36L46k37k78J9n37l3K04m95K83j9j32M05J46N8J68K17K8L48l87
1849C53J86O2m34j22K05n58L7j89j70Q1j97J68L46RN0M28k29L78L60l40K43K3
1871F90m29R3j81m16J54m89NQ0J7J9Q5k48N39Q0j19P65j04j04L25j49k6K3n10
1894A00Rj72l43q5k0k67M54k93K1M28j45L72K52j52L77Kj52J14p0j57J17m83j75
1917b68J46l69qN5o1J18O7m9N76j92p9O37j43j79N54k76k74J07m08P1j01l66K54
1940a88k30k14K77j14L23J04j18J73M00j27K30j54j24R8M9l88P5k80o2p4K2J24
1962a98r3k27L95J4o7L56j1j5K52r0l4P0l12J45q5l54P8k7l02M12l97J40K62o8
$$ plain form
1806 577 508 446 785 282 127 336 -9 18 -330 -692 -406 -531 -640 -269 -450 -317 -2 -81 360 460 354
1827 354 731 585 249 595 358 80 99 -438 -471 -267 -762 -479 -498 -630 -225 -79 -21 147 364 392 740 353
1849 353 539 601 167 45 250 -308 -271 -460 -630 -549 -746 -578 -232 -223 -173 255 26 404 764 424 667 690
1871 690 261 354 173 -243 -89 -578 -573 -493 -476 -457 -372 -620 -81 -1 -120 645 541 437 762 613 587 610 100
1894 100 109 -63 -406 -491 -511 -778 -324 -617 -596 -168 -313 59 311 159 536 538 386 500 430 273 390 -93 -268
1917 -268 -122 -491 -499 -444 -505 -387 -320 -369 207 15 -64 573 430 251 805 529 255 362 -46 25 -76 -442 -188
1940 -188 -418 -632 -355 -469 -146 -42 -160 13 413 286 516 362 238 336 385 -3 72 -208 -270 -344 -322 -198
1962 -198 -291 -518 -123 -109 -176 180 169 154 406 316 282 352 40 185 100 -254 -176 -203 -505 -93 -490 -350 -88 -156
1986a56J75J79l6Q1J37j22K43j15k63P7k05j65O9m04l7M93m28L21J04l07M10K6
2008G7j30N30k08L6K58m26K19o3n13J08J2m62M74k87L9Q2p3J89L41J8j04K49j03
2031B63K73j55k16Q1Qk94p6j81j47J28k04N7L0K02J81R2j88M63J2j04L35j05j17
2054C38K6q3p8j92k98j9l8k06J58P6k31M29J42j35M14j72L06J33j05p8J87l28
2076B46O5k16n11K68j22k52J00j16J9K71j12J48L29m7M48j51j42L81q5k46J72
2097D47m45j31J16l49k5M5k33J91O8j97N57l5R7L42k17o4M26k13J13j00l37J83
2119B39r0m15mj89O9J3m1L9J42k04N33J49j22L02j8Q8J04k18j77J16m21O3k5n07
2143e74K31p0j60K62J80j73K26J11R8K37o0J56n0j40P7l5k25j17j0j16j01k46
$$ plain form
1986 -156 19 198 162 243 380 258 501 386 123 200 -5 -170 -101 -505 -542 -49 -477 -156 -52 -359 51 77
2008 77 -53 477 269 305 563 137 356 293 -220 -112 -100 -562 -88 -375 -336 -254 -327 -138 203 221 117 366 263
2031 263 536 381 165 246 254 -40 -116 -297 -444 -316 -520 -463 -433 -231 -50 42 -146 317 329 225 560 455 338
2054 338 364 281 203 11 -287 -306 -344 -550 -392 -316 -547 -118 24 -111 303 131 437 570 465 387 574 246
2076 246 311 95 -416 -148 -270 -522 -422 -538 -519 -248 -360 -212 117 70 518 367 225 606 521 275 447
2097 447 2 -129 -13 -362 -387 -342 -575 -384 -316 -513 44 9 106 448 231 167 593 380 493 393 56 239
2119 239 149 -266 -270 -459 -390 -377 -418 -379 -237 -441 92 241 119 421 403 491 595 377 200 316 -105 -42 -67 -574
2143 -574 -343 -413 -573 -311 -131 -304 -78 33 131 368 308 464 414 274 351 316 91 -26 -36 -152 -253 -499
2165d99j6K56j40J74K45m7K45R7j88L54n0j33J26l34pJ58l74j36K02m33K54J13
2187a33l29L90J4n0K61P6j72K62n7J49j08k25Q0j31k07n8k8j79K53k60J53J38
2209a61r2L46J44j60J40m1k32M40k76j13J79j95qQ2j57j18J39l24K76K32j52R8
2231D7n9K1L73j09j14K44k39R4l9k42J44j84l11L47j62Kl3k06L66J37j85J08K86
2254B86%M1l0j99Qj37J5j1q7k18J61j38M3K54l67M12j31L3K78Kk8L8k0j3L20o11
2280i9K05q9k36J11k14p3K20j15K5K21mj70L69j11K40K18l22K99k29j88K52m32
2302a22j3M8k49J27M8l37K53J24N8N8J17N2K08k9p2J70l51J98K1k91Nr1k23K3
2326b68l6p8J46M1mK26mJ71K00k60K54mk55K07l8l57K78k95l24K59j70J06P6l10
$$ plain form
2165 -499 -515 -259 -399 -225 20 -27 218 315 127 481 431 298 424 90 83 241 -133 -269 -67 -500 -246 -133
2187 -133 -462 -72 -58 -108 153 229 57 319 262 411 303 78 158 27 -180 -238 -266 -445 -192 -452 -299 -161
2209 -161 -253 93 237 77 217 176 -56 384 108 -5 174 -21 -29 53 -104 -222 -83 -407 -131 101 -51 47
2231 47 -12 9 382 273 159 403 164 258 219 -23 121 -63 -374 -27 -189 -187 -220 -426 -60 77 -108 0 286
2254 286 286 327 297 98 106 -31 -16 -27 -114 -332 -171 -309 -266 -12 -379 33 -98 -65 213 215 187 225 205 192 512 -99
2280 -99 106 17 -219 -108 -322 -395 -175 -290 -265 -44 -48 -218 151 40 280 498 176 475 246 58 310 -122
2302 -122 -135 -87 -336 -209 -161 -498 -245 -121 -63 -5 112 164 372 343 271 441 90 288 309 18 23 -68 -291 -268
2326 -268 -304 -382 -236 -195 -199 27 23 194 394 134 388 384 129 336 298 -59 219 -76 -400 -141 -311 -205 -129 -439
2350d39J49J20KK47j37J03L83n1j86J70j19j35K52l13o1k07j25J70j14Q8L4n8
2372b27K4L60k64O2K61j84K16j8k67M23k90j01J06l05K1K59l88k4J04p2J33J54
2394a7j0J03N4m4O8J2O4P5l27L9K58l41l3J31j70M1Nq4rL11k45M5N5J21Q0j79
2420CJ70j41o8L65j51k36J21j52q5n4j8l9K66j63K34o4j36L41l2k8J84l03M3R6
2444A53j48j90L04k39L1r6P1J1j04J86l6J08p6J65j47J50O0j36M8L6j83J08K2
2467I8l83J50j86O6J40r5K23M1j63K21JP8rMj16N7K1k73J19j94K03k23j51L37
2491c4Or1J20Jp8K87j84J6J61j51J44J13k38O1Nk19K5j40j09M7J52m9M5L1J63
2516H4q1j4K29R5j86J66k60P7J86k66k25J39k87J28O4m0P2P0j49L68r2j57M19
$$ plain form
2350 -439 -290 -170 -168 79 -58 45 428 377 191 361 242 107 359 46 -15 -222 -347 -177 -291 -203 -169 -227
2372 -227 -203 157 -107 -45 216 32 248 230 -37 386 96 -5 101 -204 -183 76 -312 -336 -232 -304 -171 -17
2394 -17 -27 76 130 86 154 166 230 305 -22 17 275 -66 -99 32 -138 -97 -92 -176 -185 126 -119 -74 -19 102 182 3
2420 3 173 32 -36 329 178 -58 63 -89 -174 -228 -246 -285 -19 -182 52 -12 -148 193 161 133 317 14 57 153
2444 153 5 -185 119 -120 -89 -185 -114 -103 -207 -21 -57 51 -25 140 -7 143 203 67 115 151 -32 76 98
2467 98 -285 -135 -321 -255 -115 -210 13 54 -109 112 113 191 182 186 70 127 148 -125 -6 -200 3 -220 -371 -34
2491 -34 -28 -119 1 2 -76 211 27 43 204 53 197 310 72 133 138 -81 -56 -196 -305 -258 -106 -155 -110 -79 84
2516 84 3 -11 218 313 127 293 33 110 296 30 -195 -56 -343 -215 -151 -191 -119 -49 -198 170 78 -79 340
2539C40k79J23K41m69K16j19mK8j49m7O3j52n2J79p5K43m0q4J83J22o3Q8p2j0
2563B11j16J4J4N6k31M1M4l11J25J73m10J40J85r4J36P2o6K05j10J97k9k07J14
2586A53m8m5P3l07n1Q7Qj56J46j78L36l3r9K58L9l3m6J76k74L10l34J64o7k76
2610a97N0j24r1L72r5j47J34P9k92M45j65J0L17q8P5j06j35O9J43l28o7l7j1P
2634a82O1j35K36j44J30k1q7L55j0M1k43R8n3J73k85J74J1k41M4R6k26J84l1q6
2658a41N6J24j44K50j5k8J58l10J81R1l34J81N2k60OQ2K6M3N0l2J30m58M56j33
2682C1m1J64k3j04j39R0k3P1k0k70K81m2r2K23l84K05N1j10J70L3n6J32m9j9P1
2707A50k35J53k7j08K2k2r6J42l7K4N1j07nJ60k35L48p0j95K83n3j53oR8j35K6
$$ plain form
2539 340 61 184 425 -44 172 53 49 77 -72 -119 -56 -208 -260 -81 -156 87 47 -37 146 268 205 293 221 211
2563 211 95 109 123 179 -52 -11 33 -278 -153 20 -390 -250 -65 -159 -23 49 -17 188 78 275 246 39 153
2586 153 105 60 133 -174 -225 -138 -130 -286 -140 -318 18 -15 -114 144 183 150 104 280 6 316 -18 146 79 -197
2610 -197 -147 -271 -362 10 -85 -232 -98 -19 -311 134 -31 -21 296 208 283 177 42 111 254 -74 -141 -178 -189 -182
2634 -182 -121 -256 -20 -164 -34 -55 -142 213 203 244 1 99 46 219 -66 108 119 -122 -78 18 -208 -24 -55 -141
2658 -141 -85 39 -105 145 130 102 260 -50 131 222 -112 69 121 -139 -133 -51 -25 18 68 36 166 -292 164 31
2682 31 -10 154 131 27 -112 -22 -45 26 6 -264 17 -25 -117 106 -278 -73 -22 -132 38 71 15 147 98 79 150
2707 150 -85 68 41 -67 -45 -67 -163 -21 -58 -34 17 -90 -95 65 -170 178 108 -87 196 143 -10 -16 82 -53 -27
2732b7k00J05J33k62L25j19n1K00n1l1P0p6o4K95j11j79J54r6O8j89j16K11o0
2755g1r0l0J71M4%M7l1J37r4N3l3j35L01n0k17jnl7J4j78M1L6P1l8J09k01J65
2782b2J11J68K4j73j58M04l33M6J01k50L7P9j56o4M7r3O2O5m3J69j03J10N6k42
2806a58J93J11M6j1r3j4j42J28k04K3j23o0K07k02K47K3J62l9j7m4K53k16j29
2829e9L15l0j15J3k58J47Qk18Q9r4J62J52k68J57j04K05n5J89l68L29L2k86K70
2852B13j39j04K21k84L3J55k54j31K89j38J6R0o4J90N4j6N7n6q1J66m8q2R6l23
2876a40o1R4j40J74j8j05J16j79K43J55m4j56N6J32k11J85J5n8L8k08K10k85j43
2899c30L82l54J45P7n9J66R1k77K52j72K93j99m8N0J77l39P1M2j01J67j04j7J28
$$ plain form
2732 -27 -227 -122 11 -251 74 -45 -96 104 53 22 92 16 -48 247 136 -43 111 15 83 -106 -222 -11 -71
2755 -71 -161 -191 -20 24 24 71 40 177 83 136 103 -32 269 219 2 1 -4 -41 -27 -205 -164 -128 -57 -95 14 -187 -22
2782 -22 89 257 281 108 -50 354 21 67 168 -82 -45 34 -122 -186 -139 -232 -170 -105 -148 21 -82 28 84 -158
2806 -158 35 146 192 181 88 74 -68 60 -144 -121 -244 -304 -97 -299 -52 -29 133 94 77 33 286 70 -59
2829 -59 256 226 111 124 -134 13 21 -197 -108 -202 -40 112 -156 1 -103 102 47 236 -132 197 229 -57 213
2852 213 74 -30 191 -93 -60 95 -159 -290 -1 -139 -123 -33 -97 93 147 131 188 132 51 217 169 87 183 -140
2876 -140 -201 -107 -247 -73 -91 -196 -80 -259 -16 139 95 -61 -5 127 -84 101 116 58 96 -112 98 -187 -330
2899 -330 52 -302 -157 -80 -139 27 118 -159 93 -79 214 15 -33 17 194 -145 -74 -32 -133 34 -70 -87 41
2922D1p4J00j02j10J78Q1q6L1kr9K08k1r3Mn7m6j4R3p1J04lm5Q9m9Q7k40J08J32
2950A44j14J6R7j76n0P1j31R7o0q2K21j78NJ38j9M1O0o5M0J32j9ok9k89Q9L1j96
2977b32K11O3p7M5j18m9L75l24J83m6O5OM4m1J43j66j42N6q3J11j14j12n3K08
3001d7j67J30P8j56J52K9Q7K17k13r4K34j33k4j8k08n3K01k41k6J18j42M07j08
3024B3m3M9j57K44O7p2O7j13q5J17j21N8J22j41j76R8J13k91J09J51lj81J71K09
3048B15j90J93L6k54J05j2k4J03m12Q1Q6m4R7L1j25L0N6k0l2J13l5O6O8j70J63
3073A25P9l09J98m5n3Q8j77L5P3l22K56%n3K82k71k9J31Q2Q0n7j5L1l7j69J61
3098H4l6j41K16k50l3J04n9J4l9P1J00J17p9J11j99L4M9l9J01k25pj2q9N8n9K22
$$ plain form
2922 41 -33 67 -35 -145 33 114 28 59 57 -42 166 145 52 56 -1 -47 -61 32 -39 65 62 17 106 57 144 -96 12 144
2950 144 30 46 143 -33 -83 -12 -143 -46 -106 -188 33 -145 -140 -2 -21 20 80 15 55 187 168 162 133 -156 -67 -36 -232
2977 -232 -21 42 -35 10 -108 -157 218 -106 77 31 96 102 146 105 248 82 -60 -4 -87 24 -90 -202 -255 -47
3001 -47 -214 -84 -6 -162 -10 19 106 323 110 16 250 117 93 75 -133 -186 15 -226 -252 -134 -276 131 23
3024 23 -20 29 -128 116 183 111 178 65 -20 97 -24 34 156 15 -161 -63 50 -241 -132 19 16 -165 6 215
3048 215 25 218 254 0 105 93 69 172 -240 -159 -73 -117 -20 11 -114 -84 -28 -48 -80 33 -2 64 132 -38 125
3073 125 204 -105 93 48 -5 83 -94 -59 14 -308 -52 -52 -105 177 -94 -123 8 90 170 113 98 129 92 -77 84
3098 84 48 -93 123 -127 -160 -56 -115 -101 -140 -69 31 148 69 180 -19 15 64 25 126 -99 -106 -118 -207 -149 -208 14
3124A4l18K97L7j88N7J07P8J83j47l8Lj53J00k6q5Q7L4j84J66P8j82J69l5j46
3148i2J19r5N5K39k12r4K04j59J14Rp4J17j47l4N7j19J11q8k8J79J24k92K80P5
3172B49l47K15o8p3N5j38n8R4j39R7R8j03K02m5k5l8l4K27J9j00Q0j08q6J36p5
3197C5j12J10J7k65L8R1Q1j9j02K0J91k10L50m7j29J2J5n1P1j92J45N4k91qK75
3222G9k35Mp3J48P3j17K44K5k4K1N7k51K72J27r1k36j00K7m6j43R7K48k40j91
3246c25K03MJ90k4j83J21J61j84K86j44j28K86l46l9N1K5J07j01l25L70J7r8J99
3269A23k40J50P3j55L25J3l60O5J68k50J41j41k4J67j15j7K60l36N9L7j2J42k0
3292E3j47L70l07R8K5%j00N9q4J5N0k19J14K29m33L17r1q9J60L0jP1j22L01o3
$$ plain form
3124 14 -304 -7 30 -158 -101 6 84 267 120 82 85 -68 32 6 -79 8 42 -142 24 102 -80 89 54 -92
3148 -92 27 -68 -13 226 14 -80 124 -35 79 88 14 131 -16 -50 7 -112 -1 -89 -117 62 186 -106 174 249
3172 249 -98 117 49 -24 31 -107 -165 -71 -210 -113 -15 -118 84 39 14 -24 -58 169 188 88 168 60 -26 110 35
3197 35 -77 33 50 -215 -177 -86 -5 -24 -126 -106 85 -125 225 178 49 61 76 25 96 -96 49 103 -188 -196 79
3222 79 -156 -152 -225 -77 -4 -121 123 148 124 145 202 -49 223 350 259 23 -77 -50 -96 -239 -142 106 -134 -325
3246 -325 -122 -118 72 48 -135 -14 147 -37 249 105 -23 263 -83 -122 -71 -46 61 -40 -365 5 22 -76 123
3269 123 -117 33 106 -49 276 289 -71 -6 162 -88 53 -88 -112 55 -60 -77 183 -153 -94 -57 -69 73 53
3292 53 -94 276 -31 67 92 92 -8 51 -33 -18 32 -187 -73 156 -277 40 -51 -140 20 50 49 120 -2 299 236
3317B36j51j03K72l01P0M9k69M51k86P9L6k15K20J90k68q7J17K2L3j36j5J43k7
3340F0J6j7k31J74J18k23o9J24p9K61j59K7M4J19m3Q9k06J27l5q3J16j26o1J81
3364A24J3k73J09j31J11J36n9r5O1p2N9P1k06L42pj86P9n5k2NJ0Qp3k7R7j9j44
3391a44L65k64J13m5l6J25r2k5K8R4k55J86j38P6o7K46m67L92j30Q2J6j32K62
3414A90p9j81J06J44k24J93k36L2j6j86J61J17k00Q6J28j04J94j09M7M8mM1j7
3437A31j63K1L17l52j9p3J50j44m5Q5L4j0o6L03k47J3J32j27J51Q2j71J64k03
3460c7n5J02P7n5k75J23P6j15M5q0L93j47k0J8r2L65k68j07J15l2q4O7r2j9k1
3485a18L6J36j30k7J86j26j95J99j12L04M6k68P4J96q4Q7k23j6J47m9j76R1j54
$$ plain form
3317 236 85 -18 254 -47 23 72 -197 254 -32 47 83 -132 88 278 10 -77 40 62 95 -41 -56 87 60
3340 60 76 59 -172 2 120 -103 -172 -48 -127 134 -25 2 46 165 122 211 5 132 97 14 130 4 -57 124
3364 124 137 -136 -27 -158 -47 89 30 -65 -4 -76 -17 54 -152 190 183 -3 76 21 -1 4 14 22 -51 -78 19 0 -144
3391 -144 221 -43 70 25 -11 114 22 -3 25 119 -136 50 -88 -12 -79 167 -300 92 -38 44 60 -72 190
3414 190 111 -70 36 180 -44 149 -87 -55 -71 -257 -96 21 -179 -93 35 -69 125 16 63 111 107 148 131
3437 131 -32 -11 306 -46 -65 -138 12 -132 -177 -92 -58 -68 -134 169 -78 -65 67 -60 91 173 2 166 -37
3460 -37 -92 10 87 32 -243 -120 -44 -159 -114 -194 199 52 32 50 -42 323 55 -52 63 31 -53 14 -78 -97 -118
3485 -118 -82 54 -76 -103 83 -43 -238 -39 -151 153 199 -69 5 201 117 204 -19 -35 112 63 -113 -22 -176
3508a76M5J87o7N0q2K2J28j0n3L1l9M3k4m4M1J36j62r8jJ24q5jn0K80k69J7K20
3535A63j59j3J80j62J04o1r0J27q2k23K36j48P3Lk10K85l0J34k22L17k70K01o9
3558H4J4O4k78J96p6m0M5On9J26j75mj6K18j74R5j58J14J05j64J76l3P8j61J79
3583A62k39NQ2pk8q4rJ11K6j63J13J12j98K81k59P1NJ25j55J21j4m0j48N0j12
3608a92K3K96r0j11J58np3Q6jk3J6J16j36J48k45j99J09Q8L9r3L7n4J0m6K52q9
3634B1J94p3j21J36lk16Q7j5l5k3l6o3J02k01Q5K07k95K23l2jK26N7j41J77j78
3659H2m7J30k24j4J93j95N8k1j65J73P0l8R3k07J46j2K8q1K71j29q0K71k56o5
3683a9j16J64p5q9k1J11N3j9j54qO3J83j90K11j2j70K79k75J01O0j64k0J95k00
$$ plain form
3508 -176 -131 56 -11 39 -43 -21 107 97 44 75 36 79 55 11 52 188 26 -72 -73 51 -34 -35 -85 195 -74 -57 163
3535 163 4 -9 171 9 113 52 -38 89 7 -216 20 -128 -55 -52 -262 23 -7 127 -95 222 -48 153 84
3558 84 98 162 -116 80 4 -36 9 15 -44 82 -93 -97 -113 105 -69 26 -132 -18 87 -77 99 66 144 -17 162
3583 162 -77 -72 10 3 -25 -109 -118 -7 19 -144 -31 81 -117 164 -95 -24 -19 106 -49 72 58 18 -130 -80 -192
3608 -192 -169 127 37 -74 84 79 6 92 91 68 84 200 64 212 -33 -232 -123 -35 4 -89 -52 -106 -96 -142 110 21
3634 21 215 142 21 157 154 -62 25 10 -25 -48 -84 -147 -45 -246 -161 46 -249 -26 -58 -59 167 224 83 260 82
3659 82 35 165 -59 -73 120 -75 -17 -38 -203 -30 40 2 95 -112 34 22 50 -31 240 111 31 302 46 -19
3683 -19 -135 29 -46 -135 -156 -45 8 -11 -165 -173 -110 73 -117 94 82 -88 191 -84 17 77 -87 -107 88 -112
3707a12k3J05j75J89n1K46j58j55K05J03j42J05jj74J23j1j80J52l1k9J63j69
3729b0j82N7P2K2P7J9J2N0j45J55j7k15J06o2m9KJ37p6j7j60J25O2j09J58o9n5
3755a22M6P8j57J41j7J85q6oM8q3q4J39r9q5J24j2k10J25K4J1K6q3O9l6J33K1
3781I0o4k9K26k33MJ36j90J4Q8n5j2K2o5J95k11p1L32j60n6J79k29M09j87k80
3805a47J10R2j77J07k9lJ41q1q3K23j37K8J08j52J56k60J38m3o2M5J04j12j13
3828a47K36k5k41J34j14J97o7L8M5j51J08J36k13J39l6j04lJ25n7L6p7j24Q7r2
3852a70R3P4q8J54M5j99Q6L4q2K45j01qo3j12N5J07j68L7P3q0j5N9k3J15k6K1
3878F3J06j95K0J22k02J51J30j22l4M5j96RJ88l5n9k49P5J13P1n8K85r1j86R8
$$ plain form
3707 -112 -135 -30 -205 -16 -67 179 21 -134 71 174 32 137 136 -38 85 74 -106 46 15 -14 149 -20
3729 -20 -202 -145 -73 -51 26 45 57 107 -38 117 100 -115 -9 -71 -120 -118 19 -57 -74 -234 -109 -47 -156 2 -67 -122
3755 -122 -76 2 -155 -14 -31 154 68 62 110 27 -57 82 -17 -102 22 10 -200 -75 -51 -40 -14 -97 -28 -64 69 90
3781 90 26 -3 223 -10 -6 130 -60 -46 42 -13 -25 -3 -68 127 -84 -155 177 17 -39 140 -89 320 133 -147
3805 -147 -37 55 -122 -15 -44 -47 94 13 -70 153 16 44 152 0 156 -104 34 -9 -71 -26 78 -34 -147
3828 -147 89 64 -177 -43 -157 40 -27 11 56 -95 13 149 -64 75 39 -65 -68 57 0 36 -41 -165 -78 -170
3852 -170 -77 -3 -91 63 108 -91 -5 29 -53 192 91 83 20 -92 -37 70 -98 -61 12 -68 -83 -24 -47 68 42 63
3878 63 169 -26 -6 116 -86 65 195 73 39 84 -112 -103 85 50 -9 -258 -183 -70 1 -57 228 137 -49 49
3902D9J09n1O3k66K76m3k75R5l2j94K74j60Q2J43r6L13l01j1K36k78N0J36o2N0
3926A07k8r5N3Nk69K29j59p7K94k13K01p6k0K03N4j69O0p0r7J04J9j55J37o3p3
3951i8j6NJ9R9j67J77q4l3J34q2j65L95q5m9M4k05J79l9l9K5p2oq1R1M2J42j16
3978A5R9R2k06L5q8M5J28P4k19O4n5J2j0k2QR9j33j92J38q9J63J44k13J43o4p1
4004a03J37pN5J22o2j99R4n6Q6p4j86K06k70J26J05M6k33K49j0n7Q1k3j40P4j9
4029e8J22k84J20L7N8j37J30N6j01K08j12J12k07j2J15P4o1k2j72j1J66j49Q8
4052d0qoK56l07mJ5K9Q5L3k8m2Oo8J55l9k12L06j40o9J66r2j82O7P3M4J16j85
4079g1J40O3k14J76n2q6K63j44r9l4j9l5J63j81M8O8r6J49N0j98K23j70K7Q0J39
$$ plain form
3902 49 158 107 170 -96 180 137 -138 -43 -75 -269 5 -155 -73 70 -26 287 -14 -25 211 -67 -17 119 57 107
3926 107 79 -16 37 42 -227 2 -157 -234 60 -153 48 -28 -48 155 209 40 100 30 -67 37 56 -99 38 -25 -98
3951 -98 -114 -109 -90 9 -158 19 -65 -98 36 -46 -211 184 99 50 94 -111 68 29 -10 15 -57 -63 -144 -53 -11 131 15
3978 15 114 206 0 35 -53 -8 120 194 -25 39 -16 -4 -14 -36 -28 71 -62 -254 -116 -205 -42 102 -111 32 -32 -103
4004 -103 34 27 82 204 142 -57 37 -19 67 -7 -193 13 -257 -131 -26 20 -213 36 26 -31 50 27 -113 -39 -58
4029 -58 64 -220 -100 -63 -5 -142 -12 44 -57 151 39 151 -56 -68 47 121 60 38 -134 -145 21 -128 -40
4052 -40 -48 -54 202 -105 -109 -94 -65 20 53 25 -17 -11 -79 76 37 -175 131 -9 -78 88 -4 -186 -119 -46 -2 114 -71
4079 -71 69 132 -82 94 42 -44 219 75 -24 -58 -77 -112 51 -130 -82 -14 -110 39 89 -109 114 -56 -29 51 190
4104A90j26P6m2K2j76k9J30o8j46R7l8j6J93k25R7j3J34O0l2L8r1J74k56K70k01
4129B2p9q5J73k39J63K0J0o0N5O6Lr7P4m1L5M0j2J96j09L7k21J11j01K9q9K02
4155A03j35j93k3K77m1k0j9J08l7j2JJ63o2r3J6K2j34OP6k23K08q6J76q2j30P6
4181e8R1l6m4J52j51J41j28oj06j8J55lp4K01k43J07R1j51J01q5L0p1J89mj33
4206e3l1K6J68J8j13k8M9q0R0q1J00K9k05P9j08P9M7J06K6l7j7J5p2o6P1J07j33
4233a4j06J92jj71J93k41Q3o8j2J18K7J8m9K3L2r8K00nj14j33K66l44J35J64l7
4258E8M3J1j07Q8j31K7N7q6J27j06Mk2O5j53M04k11j80lN8l3J36r2Q4J6r8M7K29
4285B32j36p2M0O3o1p5r8K61j38j1j52J09o6J40j8n4J41K8N3rk09Q1J31j62K2
$$ plain form
4104 190 64 140 98 120 -56 -85 45 -23 -169 -72 -110 -126 67 -158 -61 -74 60 120 88 126 35 209 -47 223 22
4129 22 -57 -142 31 -208 -45 -25 -15 -75 -20 46 49 -48 26 -15 20 60 48 244 135 172 -49 62 -39 -10 -99 103
4155 103 -32 -225 -248 29 -12 -32 -51 57 20 8 9 172 110 17 33 55 -79 -73 3 -220 -12 -98 78 -4 -134 -58
4181 -58 33 -3 -47 105 -46 95 -33 -39 -145 -163 -8 -11 -85 116 -127 -20 71 -80 21 -64 -34 -105 84 80 -53
4206 -53 -84 -58 110 128 15 -13 36 -44 46 -35 65 94 -111 -32 -140 -61 -14 92 118 81 64 79 7 -59 12 119 -14
4233 -14 -120 72 71 -100 93 -148 -65 -133 -145 -27 0 18 -31 -8 24 -74 126 121 7 -126 140 -204 -69 95 58
4258 58 101 112 5 93 -38 -11 46 -40 87 -19 -15 -37 28 -125 279 68 -112 -115 -57 -90 46 -46 38 54 -44 3 232
4285 232 96 24 64 127 66 -9 -107 154 16 5 -147 -38 -104 36 18 -36 105 133 186 177 -32 49 180 18 40
4310D0J9j76J38q8q3J54%k1j79J0R8J53l19L36o4r0K28j89l6J04p4O7O8k30M7
4335h7P4J02P3j56k17J59pP1n3p3J55Pq4K22q1j18J43K4j87K21k15R0Q6j23p9
4360e3j09Q1K83j85j35K97k19M1J49j26L4k30K65j76K8Q0nl06J37J78l8r9J12
4383DK8J63j55q4K20j4k11J40j39K16k16P2j68J61j04J9J19k12K62r5j41J36J36
4406A37j84M6q2JK19j59j08K83j28QJ3k49K23R1k51J65j58R7K1j36J72m2J26r4
4430A1R0j22kK6j96K43k11J38O2J1r0l9K8j18K57k17K33j8kj72L0K9J90j39r2
4455g0J09p4Q1j92J61K97m16K10o3k38M3K44o2J3N8j75K42j70m0R5k04J45L6j8
4479A2l6N5j79J65Q0L9k63J69q7J05Q8k76K90j55p9J59j35L3J05j99J64l6j19
$$ plain form
4310 40 59 -117 21 -67 -150 4 4 -17 -196 -186 -88 65 -254 82 18 -72 156 -33 -69 35 -39 28 96 -134 -87
4335 -87 -13 89 162 6 -211 -52 -59 12 -41 -114 41 48 -36 186 105 -13 130 154 -33 188 -27 63 149 26 -53
4360 -53 -162 -81 202 17 -118 179 -40 1 150 24 58 -172 93 -83 -55 25 20 -286 -149 29 -9 -108 4
4383 4 32 195 40 -44 176 162 -49 91 -48 168 -48 24 -144 17 -87 -68 51 -161 101 6 -135 1 137
4406 137 -47 -1 -83 -82 137 -22 -130 153 25 33 46 -203 20 111 -140 25 -133 -36 -15 -151 21 -21 105 11
4430 11 101 -21 -23 3 -193 50 -161 -23 39 50 -40 -79 -51 -169 88 -129 104 86 84 -88 -58 -29 161 22 -70
4455 -70 39 -35 46 -146 15 312 -104 106 43 -195 -152 92 30 43 101 -74 168 -2 -42 53 -151 -6 30 12
4479 12 -24 31 -148 17 97 136 -127 42 -45 60 148 -128 162 7 -72 87 -48 -15 90 -109 55 19 -100
4502a00m2J0J42j01J40m8J32j57J21J59k55JR7l07K6J08m0KJ44Q7q0k30K30O2
4526A01l3k53K87j83J68p5kJ55l57K41m4J0p2Q9k9N9J31l66K00j30L8P0j14J17
4550HK09j52k09J62j56J49j93J63p5l7L6J37j59OP2j6j9K41j37m7j03K04L8j13
4574IJ05j45pk6Q8j03J14k15L8J41l4m6r0K03j4R4m1k8J19k90J85o1NRl7q0J03
4601dQ5j48O2n8j19J19L6k1J58k19J66k7p5J03j24J02j02p9J77N3j59mJ50j50
4625g8Ql9J02N1j76K30j78M4J92j90J15j18Q2k4J24k79q3K68q3K18o9k13N5l5
4649g6lk6R3j95L00l3j33J15q4oR2R9k39p3M9J30l5O6j39Q8R8j75P0n3J20Jl2
4676A9P8n6o3j2N1Q6mO4l7j30K1r8o5R0P2j59j5K19no0L4O0m0j60K00j33P8n8
$$ plain form
4502 -100 -142 -132 10 -91 49 1 133 -24 97 256 1 2 99 -208 -182 -74 -114 -112 32 119 39 -191 39 101
4526 101 68 -185 102 -81 87 12 10 165 -192 49 5 15 -57 32 3 62 193 -173 27 -103 -65 5 -109 8
4550 8 217 65 -144 18 -138 11 -182 -19 -94 -131 -95 42 -117 -111 -39 -55 -74 167 30 -17 -120 84 122 9
4574 9 114 -31 -38 -64 24 -79 35 -180 -142 -1 -35 -81 -171 32 18 112 71 43 162 -128 57 -4 1 10 -27 -107 -4
4601 -4 81 -67 -5 -63 -182 -63 -27 -48 110 -109 57 30 -45 58 -66 36 -66 -145 32 85 -74 -78 72 -78
4625 -78 -70 -109 -7 44 -132 98 -80 -36 156 -34 81 -37 45 21 145 -134 -217 51 -32 186 117 -96 -41 -76
4649 -76 -79 -105 -12 -207 93 60 -73 42 -42 -48 44 143 -96 -169 -120 10 -25 41 -98 -10 88 -87 -17 -70 50 51 19
4676 19 97 41 -22 -34 17 103 99 163 126 -4 17 -81 -146 -56 16 -143 -158 61 56 -4 30 90 50 -110 90 -43 35 -23
4704b3m0O3Mk4J15n0N1o9O9l9o9R6j67J49j6L1K3j60K02k35P1N0j3N4m6n1O4j43
4732a03K54nk81J44j26L1P2n1n1J57k41L24r5l8P5m2K1l4O7K0m1j48J42j34O4
4757a9MJ01k57J92m1O5m8J26j77j00J38R3k6o8J71j44j10O5j1l8N5L1j56J19Q4
4782D9p6n6N3j4J17M3N7m9n6l1n7j2P5p1M5j3j20K28l20J76l5N8J51j13n1p0J11
4809A9k22K98o2K7kj25K15j48l3K53k71m3J19o3P6Qj24J58j67J24j42L8K03j22
4833A4K7j61K10j23P3p0R2Q4L7k22l1j00J26j3J11L9O0j88N2K31k08m2j1P1j01
4858d3R2nj07J46j5o2L1j42K51l21P5K23r7l3l1J97j45r3K16j24N3j06r9J55J58
4883A74k13P4j30J53j88O0j3lK04r2p2K50k38k3R1j23Q6l4J67j10L5j54J02n9
$$ plain form
4704 -23 -63 0 4 -20 95 45 96 27 96 57 -12 84 -83 66 50 81 104 -56 146 -89 -18 32 19 73 27 -24 40 -103
4732 -103 151 146 -135 9 -117 -86 -14 -65 -116 41 -200 124 29 -9 66 24 45 11 78 98 57 -91 51 -83 -19
4757 -19 -15 86 -171 21 -20 45 -3 123 -54 -154 -16 77 51 -17 154 10 -100 -35 -46 -84 -29 2 -154 -35 49
4782 49 -27 -83 -30 -44 73 116 173 124 68 37 -20 -32 43 -28 17 4 -116 112 -208 -32 -67 -9 142 29 -22 -92 19
4809 19 -203 95 33 60 58 -67 148 0 -33 220 -51 -94 25 -38 38 46 -78 80 -87 37 -105 -67 136 14
4833 14 41 -120 90 -33 40 -30 62 146 183 -39 -70 -170 -44 -57 54 93 153 -35 17 248 40 -2 -13 58 -43
4858 -43 49 44 -63 83 68 6 37 -105 146 -175 -100 123 26 -7 -38 159 14 -79 137 13 66 -40 -139 16 174
4883 174 -39 35 -95 58 -130 -70 -83 -86 118 26 -46 204 -34 -57 34 -89 -3 -37 130 20 55 -99 3 -56
4907e6j07J47O4j5O8k19K08j04N9J39k69J02j1J12p3l9J9o0PnJ33J5j98J30J4
4932F1j77M6Q6l1J6J1J74j94jJ5J19j25J25j69NJ72j29O0Pk34P9J51R7j86l3k7
4958h2k2R2R3q4j11Q7J0K0K3j32J25M5N2j20J74j22m6j8P6j07Q4j6J15k04j3J37
4984E6n7pl1J11j02q2m3J47k8Q8o5L3JN6Q5q0p8O9j46P3R4j64O4O4j00P3k97J80
5012h6M1PJ34j17k9m7L38l20J84q9k5Q8n9K1n7P9o4K6j28N5J35j49J03j2j33J01
5038cj35P1J20m1k3O2j66P5M3J08j37J6Ro4J30n5P5j48o7J37K0K3km5q8P3n5m7
5066a14N0o3J80k02K52r2j94J98j4On5Q8j15J95p9J3R6n5j38J00j05M4k7k0k1
5091g2M1j00J70j58J51p2J32J1r0p9K17j57K2k8p4K30j23j02j24J67k9J60n0n8
$$ plain form
4907 -56 -163 -16 48 33 101 -118 90 -14 45 184 -85 17 6 118 45 6 25 -35 -28 -33 100 115 -83 47 61
4932 61 -116 -70 16 -15 1 12 186 -8 -9 6 125 0 125 -44 -39 133 4 64 71 -163 -84 67 164 -22 -55 -82
4958 -82 -104 -12 81 -3 -114 -27 -17 3 26 -106 19 64 116 -4 170 48 2 -16 60 -47 37 21 136 -68 -81 56
4984 56 -1 -8 -39 72 -30 -112 -155 -8 -36 52 -13 20 21 77 162 82 4 73 -73 0 94 -70 -6 58 -42 31 -266 -86
5012 -86 -45 -38 96 -21 -50 -97 241 -79 105 16 -9 79 20 41 -16 63 -1 25 -103 -48 87 -62 41 29 -104 -3
5038 -3 -138 -67 53 12 -11 51 -115 -40 3 111 -26 -10 -1 -65 65 10 85 -63 -130 7 27 50 48 3 -85 -12 -67 -114
5066 -114 -64 -127 53 -149 103 11 -183 15 1 7 -48 40 -75 120 41 54 150 95 -43 57 -48 -4 -31 -51 -72
5091 -72 -31 -131 39 -119 32 -40 92 103 13 -66 151 -6 16 -12 -86 144 21 -81 -205 -38 -67 93 43 -15
5115a5O3n5p7J18j90J71Q3j11o2o3K50p9n9j75K11L9q5Q5j3J33j48r8J05O5j23
5140c0J07o8o8m9N0oJ37j32o0K3o1J89j43J7J6l3Q5l6Q1J44j15j41K21L1l5Nj06
5167B3j60K8K15j51j8kj5J22l1j2Mk89L84LK4o6o8j01J38q2l5K27j69J96k33N2
5193a6N8k9r0J86q0K9M5p5j31J15j26J24L4j27J22l9k8j5N0kL2k21J98o5J20L0
5219I9j63K5J24j08Lm1Q5p0lk3K25k54l9K1J41%m7L35l09K6m7J15l9n6j9O6%M2
5247H9p2l7l7K1m7N7O7m8j11K18L6L3j28l8r6K02j70J29n2j75J70j73J79L2q1
5272c2J18j56K3o4R9O1O9l5jj42M8P8j42PK12j69J34q3L8r4j57K36Pp6Q6j9R4
5299A40j01Ko6l7O7P6K3q3%J26j06j66J75L8j82J76p1j29Q5J25N8j70O5l7N7j50
$$ plain form
5115 -15 48 -7 -84 34 -156 15 98 -13 -75 -138 112 33 -26 -201 10 49 -36 49 36 169 21 -77 28 93 -30
5140 -30 77 9 -59 -108 -58 -64 73 -59 -119 -96 -157 32 -111 -94 -78 -111 -26 -62 19 163 48 -93 128 159 124 129 23
5167 23 -137 -109 106 -45 -63 -65 -80 42 11 -1 3 -286 98 101 125 59 -9 -110 28 -54 -89 138 -31 165 -68 -16
5193 -16 42 13 -77 109 29 58 103 28 -103 12 -114 10 44 -83 39 0 -28 -43 7 5 37 -184 14 -51 69 99
5219 99 -64 -39 85 -23 -20 -61 24 -46 -49 -72 153 -101 -140 -119 22 22 -25 310 1 27 -20 95 56 0 -19 47 47 89
5247 89 17 -20 -57 -36 -83 -26 41 -7 -118 100 136 169 41 3 -93 109 -61 68 16 -159 11 -162 17 49 -32
5272 -32 86 -70 -47 -111 -12 49 118 83 82 -60 -12 66 -76 -69 143 -26 108 25 63 -31 -188 48 55 -21 65 46 140
5299 140 39 41 -25 -62 5 81 104 21 21 147 41 -125 50 88 -94 82 11 -118 -33 92 150 -20 45 8 65 -85
5325h5K10r1Rl7l3rR9N5j25M8j72R3O8q2Mj22K82m2m9Q0R0j38k40J19N7Jo0j34
5353b04K44J6q4nj1J8K2%PJ2j66M9J42k8N2Np9N7j05J15o9Q4r6rP5j19Jj2L12
5382B24l59J76j69J44p3nq8P8j6J05Rp8Q2j58L2K0M6q2Q0NL3L6K3j06J00j03J30
5409H6j05J16j10nk1LJ7q4K34rj92N1j49J7K75q6J73j57o5k8m8N8P5m2N8k4o9
5436c1J11k10J98kN9k22Q1L5n9M1Jj03L10l37J67j28O2o0R2R3p6K6j41R3p3kJ92
5463A17l5p5M3j6M9q8l2o0O7L3n7J9k6%R7r5J76j28J20k11J24o2J04j69K27j26
5489dl6J44r6K1q8Q3j4P5q2r7J76k04J26J5j49R3o9J37o5M1Q4q5k4O2m3N4j02
5516d7J58p4L0j22Q0j26J60J29o4j56K3J44j77qN7J86j33j08J26n1r1J03j62K11
$$ plain form
5325 -85 125 34 43 6 -27 -36 63 118 -7 41 -131 -38 30 -52 -48 -170 112 70 21 101 191 53 -187 -68 -11 -10 -70 -204
5353 -204 40 56 -28 -33 -44 -26 -4 -4 3 15 -151 -102 40 12 64 69 -10 47 -58 57 -12 72 -24 -33 42 -77 -76 -88 224
5382 224 -135 41 -128 16 -57 -62 -150 -72 -88 17 26 -52 30 -128 -96 -76 -30 -112 -32 -27 6 42 65 -41 59 -44 86
5409 86 -19 97 -13 -18 -39 -36 -19 -103 131 122 -70 -19 -168 -151 124 38 211 54 -11 -39 -87 -29 46 4 62 38 -31
5436 -31 80 -130 68 66 125 -97 -16 19 -40 1 2 -101 209 -128 39 -89 -27 -87 5 98 22 48 -93 0 -73 -75 117
5463 117 82 7 50 34 83 -5 -37 -97 -30 3 -54 -35 -61 -61 36 -59 117 -11 109 -102 22 -40 64 -105 122 -4
5489 -4 -40 104 8 29 -59 24 10 85 3 -94 82 -122 4 19 -130 -37 -106 31 -34 7 91 6 -18 44 1 55 -47
5516 -47 111 37 67 -55 25 -101 59 188 124 -32 -9 135 -42 -50 7 193 60 -48 78 27 -64 39 -123 88
5540H8j06j24J50Q8j45P8R3J0j12op3J48n2k1k8R9k63K6K14j51P5K5q5K1l5R1
5566EQ5o2P0j65R1J2r9O8Q7j63J23o6J2K0O5l5lj00k9k2K43j84M6o7J73q0j01
5593g6J30J1J51j30K1m3jj83O3K7O8O1j14j14R7K04l49L54j39r2J26l0J7j41M4
5618c8O2j92K46L5k37K4K1P5MP1Jj08j48R2o5O2J88p9rj27K53p8j03J36j5n7p0
5645e6O3O4j53M8K0j13J73L8j99J24o4o9P2J10j3j42m1j8M7J58k0L0o5r1J26N5
5671H4k25m2J37o8K15o9o7M4q5K1Q8J4L8m6m9l4P8j18J42ONj59m1J59L9j32O3
5698bQ9K9l5j70P3J47j43K5M9j52K64m12K10Q8q3K7J13q3j19L0rJ52k47J54l2
5723c7J64k11J84k77J28K3j9J89j17j05J29j21M6j6l3m5J27qj69L23k6k14J46
$$ plain form
5540 88 -18 -142 8 96 -49 29 122 132 20 14 -59 89 37 16 -12 87 -176 -150 64 -87 -12 13 -72 -51 -86 5
5566 5 90 28 98 -67 24 36 -63 5 92 -71 52 -14 -2 18 83 48 45 -55 -84 -106 137 -47 -1 -68 105 25 -76
5593 -76 54 65 216 86 107 64 63 -120 -57 -30 38 99 -15 -129 -32 172 -177 177 38 -54 72 42 59 -82 -38
5618 -38 24 -168 78 113 -124 -100 -79 -4 0 71 72 -36 -184 -92 -157 -95 93 14 5 -122 131 53 -50 86 71 14 -56
5645 -56 7 71 -82 -34 -14 -127 46 84 -115 9 -55 -124 -52 58 45 -97 -138 -156 -109 49 29 59 -6 -97 29 84
5671 84 -141 -183 -46 -114 101 32 -35 9 -76 -55 33 47 85 39 -10 -44 34 -84 58 64 69 -90 -131 28 67 -65 -2
5698 -2 87 116 81 -89 -16 131 -12 13 62 -90 174 -238 -28 60 -23 4 117 34 -85 -55 -64 88 -159 -5 -37
5723 -37 127 -84 100 -177 -49 -26 -45 144 27 -78 51 -70 -24 -40 -73 -118 9 1 -168 155 129 -85 61
5746F1j64J08j08J26J00j46L0J6l6oJ0nj44K62j32pJ71k80J46j09O5K34j36j6
5770D0O9lj80P3L8J9j1j22k3K72j00O7j24j8J76j14m6k7N3j76J82K7k51K33r8
5795d4J72l7j47J13j43O6r3NJ99j58R9J6k23K69J6o9M1n2r5K43r9q2k3J20j55
5820f1J15k0j15PJ01o7m3R0o6J59k24O8J63q7n9J33j54J77j39P5n4N9l7kJ74k04
5846a1L0r2L21j94j00O8k58K08M3q7J43j89K47j06p1J98q9K2j55J09o5J28o8Q1
5870A13j5r5L4J8J68k96L1j8L7K31j78j22J16p3J29j34J43j59k8Q4K3j01N3R5
5894E6j95J12P9j9j07J63P5j79k3PJ2j3j20Q8j5J83m3j34R8j25J68rp5P2j33J47
5920G0n6L0l6k8J0j23K04N5Oj29l1L9j51J44k10J51P9m8k7K3N0p5n8J23K14j14
$$ plain form
5746 61 -103 5 -103 23 123 -23 7 23 -13 -19 -9 -14 -158 104 -28 -35 136 -144 2 -107 -42 192 56 40
5770 40 109 106 -74 -1 37 56 45 -77 -100 172 72 139 15 -3 173 59 13 -14 39 -137 45 72 -179 54 -44
5795 -44 128 91 -56 57 -86 -20 -113 -108 91 -67 32 48 -175 94 110 41 82 30 -65 178 79 -3 -26 94 -61
5820 -61 54 34 -81 -74 27 -40 -83 7 -59 100 -124 -56 107 20 -39 94 -60 117 -22 53 -1 58 21 19 193 -11
5846 -11 19 -73 248 54 -46 22 -236 -28 15 -72 71 -118 129 23 -48 150 61 83 -72 37 -28 100 32 113
5870 113 98 3 37 55 223 -73 -42 -60 -23 208 30 -92 24 -49 80 -54 89 -70 -98 -14 9 -92 -39 56
5894 56 -139 -27 52 33 -74 89 164 -15 -38 -31 -19 -32 -152 -64 -79 104 61 -73 25 -100 68 59 -16 56 -77 70
5920 70 14 44 8 -20 -10 -133 71 126 132 3 -28 11 -140 4 -206 -55 24 -24 -51 -28 22 -53 -111 12 226 112
5946A12q3J2j71K44j13L1r8P6M4q2Q8P3p9l04K35J10qj53J56l37K47j11K92k82
5970a01N2J22j27J08J3j5m6m2k5L1N4O2p5nr6K00n7l3j09m7N7n6J59o0J27Lo2
5997C2J3j60J91lm5J4j3j23O8Jj03K68j65N1l4K6r3l0l7J61j01N6NQ4j57R0p3
6024g7Q1P5j15n5J00N9j88K30o6j53Q4K3j49J90Qr5J63r8KK6k9p0J5J9k0K5J14
6051I9q3q4J05m0J18q6PJ12j43K1j66K12l7L8j93J43j84P7R1j08J88n6M1K4j16
6076b0j17j8J0O9N5N3l9J26j07q0m6Q5J71j61o0J10o2j8J4J59K0Mj05j57J04j9
6102b9RO6n8j34J72N1j29K54j33j48MJ9J00o1O6k0n5q5J77q6R7l2no2J14n9K0
6129E3j98J83n8J68l35K50j05M1L0mK4J15j76j9p7J69j00Kq2L2j5R0J45r1L5j07
$$ plain form
5946 112 29 41 -130 114 1 32 -66 10 54 -28 60 133 54 -250 -15 95 87 -66 90 -247 0 -111 181 -101
5970 -101 -49 73 -54 54 67 52 6 -36 -61 -30 24 86 11 6 -90 110 53 20 -89 -136 -79 -135 24 -36 91 94 32
5997 32 45 -115 76 73 28 42 29 -94 -26 -25 -128 140 -25 26 -8 18 -75 -105 -142 19 -82 -26 -21 63 -94 -4 -77
6024 -77 4 79 -36 -91 9 68 -120 110 44 -109 -25 -2 -151 39 47 -48 115 17 19 45 16 -54 -39 -20 -40 -15 99
6051 99 16 -68 37 -3 115 29 36 148 5 26 -140 72 35 73 -120 23 -161 -84 7 -101 87 31 72 96 -20
6076 -20 -137 -155 -145 -76 -21 32 -7 119 12 -68 -114 -29 142 -19 -79 31 -31 -49 -35 124 144 148 43 -114 -10 -29
6102 -29 -20 46 -12 -146 26 77 -52 202 69 -79 -75 -56 44 -17 49 29 -26 -111 66 -20 77 45 40 -22 92 33 53
6129 53 -145 38 -20 148 -187 63 -42 -1 29 25 49 164 -12 -31 -108 61 -39 -37 -119 -87 -102 -12 133 42 77 -30
6155c0r5Q0l5J45l5p4L2o3O0Lj18J97m2j13K34j99R5o1J9Mo3J03q7K7p3J40n8
6182gL6N6k46J52O3Pj34R8m0J12l62K49K2j12K11j85J56k42K45l9j54J93o7j04
6206i2J99l8N3j15K8r4R8o0K2l9K6Q3l8M3j91K29k00R9k0j3Oj7N2J0O9r5J53n9
6234I9rk35J00m0l2K8K70j39l5J02j16r0M2JPn0J22J7r7M5J05j13q2Q4K9j26N6
6261e7O9R8J3j71J99m8J3j57O0k1Rj39J49l6L7l3o9N0J15j28J8Q4l6P3J5j08j06
6288a07jJ69m5J90j58M6l54K74rj00J49N5p9k5K0J38j55K1O4j6l0j23q3K01n8
6313a6R0J5j08R2j54J33j07nJ20rk5M1n2j37O6J18j00R1Nj0j77J08j02J02J29
6338A08q8j83L34j53j25KJ79j06M6p1m6J16j68K53j87Q4Q9k08J07Q8k08J63k47
$$ plain form
6155 -30 -125 -45 -80 65 30 -44 -12 -75 -15 -12 -130 67 25 -88 146 -53 42 -19 0 4 -59 44 -43 -16 -89 51 -7
6182 -7 29 85 -161 -9 54 61 -73 25 -15 97 -265 -16 6 -106 105 -80 76 -166 79 40 -114 79 12 -92
6206 -92 107 69 122 7 35 -59 39 -21 1 -38 -12 71 33 76 -115 114 -86 13 -7 -20 -14 -31 21 31 100 5 158 99
6234 99 90 -145 -45 -85 -117 -89 181 42 7 109 -7 -97 -55 -54 -47 -97 25 42 -55 -10 95 -18 -100 -16 13 -113 -57
6261 -57 12 110 123 -48 151 103 116 -41 19 -2 7 -132 17 -19 18 -15 -84 -34 81 -47 -29 55 19 92 107 -1 -107
6288 -107 -108 61 16 206 48 94 -260 14 5 -95 54 109 30 5 25 163 8 29 93 77 47 -76 -159 42 -16
6313 -16 74 89 -19 73 -81 52 -55 -60 60 51 26 67 15 -122 -56 62 -38 53 58 48 -129 -21 -123 -21 108
6338 108 20 -163 171 18 -107 -105 74 -32 14 -57 -103 13 -155 98 -89 -5 84 -124 -17 71 -137 26 -221
6361b21J59J38l9p9J24q7p9J22j11J45k16K21l4P1M5l23PJ24Q4J3j44J75j47l9
6385i1J81J25j33n5j29R7K31k06n3J72j06Nj71P9J24j40J60om1J13j17j35M2j01
$$ plain form
6361 -221 -62 76 37 -42 82 -5 -84 38 -73 72 -144 77 43 114 159 -164 -157 -33 51 64 -80 95 -52 -91
6385 -91 90 215 82 27 -102 -5 226 20 -33 139 33 38 -133 -54 70 -70 90 84 43 156 39 -96 -54 -155
$$ [...]
8191C9
##END NTUPLES=NMR FID
##END=
