##TITLE=1H_ABn3-0706
 CDCl3
 8 sc, 
 8.6.2023
##JCAMPDX= 6.0         $$ Bruker NMR JCAMP-DX V2.0
##DATA TYPE= NMR FID
##DATA CLASS= NTUPLES
##ORIGIN= UXNMR, Bruker Analytische Messtechnik GmbH
##OWNER= root
$$ XWIN-NMR		Version 3.5
$$ Thu Jun  8 13:39:45 2023 Russian Standard Time (UT+4h)  she@DPX200
##.OBSERVE FREQUENCY= 200.13135
##.OBSERVE NUCLEUS= ^1H
##.DELAY= (6, 6)
##.ACQUISITION MODE= SIMULTANEOUS
##.ACQUISITION SCHEME= undefined
##.AVERAGES= 8
##.DIGITISER RES= 18
##SPECTROMETER/DATA SYSTEM= spect
##.PULSE SEQUENCE= zg30
##.SOLVENT NAME= CDCl3
##.SHIFT REFERENCE= (INTERNAL, CDCl3, 0, 15.7039)
##AUDIT TRAIL= $$ (NUMBER, WHEN, WHO, WHERE, WHAT)
$$ ##TITLE= Audit trail, XWIN-NMR		Version 3.5
$$ ##JCAMPDX= 5.01
$$ ##ORIGIN= Bruker BioSpin GmbH
$$ ##OWNER= she
$$ F:/spectra/data/she/nmr/H-F/1/audita.txt
$$ ##AUDIT TRAIL=  $$ (NUMBER, WHEN, WHO, WHERE, WHAT)
(   1,<2023-06-08 13:38:37.78 +0400>,<she>,<DPX200>,
      <created by zg, POWCHK disabled, PULCHK disabled
       configuration hash MD5:
       00 E9 B6 7A A2 85 ED C7 34 08 36 98 17 FE 4E 26
       data hash MD5: 16K
       45 DA 52 4D A1 9E A1 51 57 97 C6 55 97 3F 90 9B>)
$$ ##END=
$$ 
$$ hash MD5
$$ 45 F9 29 EE AE 91 E4 F3 06 9D 6E 85 FD FD 6F 8E
##$RELAX= 
##$RELAX= 
##$RELAX= 
##$RELAX= 
##$RELAX= 
##$RELAX= 
$$ Bruker specific parameters
$$ --------------------------
##$DU= <F:/spectra>
##$EXPNO= 1
##$NAME= <H-F>
##$PROCNO= 1
##$TYPE= <nmr>
##$USER= <she>
##$AMP= (0..31)
100 100 100 100 100 100 100 100 100 100 100 100 100 100 100 100 100 100 
100 100 100 100 100 100 100 100 100 100 100 100 100 100 
##$AQSEQ= 0
##$AQ_mod= 1
##$AUNM= <au_zg>
##$AUTOPOS= <>
##$BF1= 200.13
##$BF2= 200.13
##$BF3= 200.13
##$BF4= 200.13
##$BF5= 200.13
##$BF6= 200.13
##$BF7= 200.13
##$BF8= 200.13
##$BYTORDA= 1
##$CFDGTYP= 0
##$CFRGTYP= 5
##$CHEMSTR= <none>
##$CNST= (0..31)
1 1 145 1 1 1 1 1 1 1 1 1 1 1 1 1 1 1 1 1 1 1 1 1 1 1 1 1 1 1 1 1 
##$CPDPRG= <>
##$CPDPRG1= <>
##$CPDPRG2= <>
##$CPDPRG3= <>
##$CPDPRG4= <mlev>
##$CPDPRG5= <mlev>
##$CPDPRG6= <mlev>
##$CPDPRG7= <mlev>
##$CPDPRG8= <mlev>
##$CPDPRGB= <>
##$CPDPRGT= <>
##$D= (0..31)
0 1.2 0 0 0 0 0 0 0 0.06 0 0.03 0 0 0 0 0.0002 0 0 0 0 0 0 0 0 0 0 0 0 
0 0 0 
##$DATE= 1686217117
##$DBL= (0..7)
120 120 120 120 120 120 120 120 
##$DBP= (0..7)
150 150 150 150 150 150 150 150 
##$DBP07= 0
##$DBPNAM0= <>
##$DBPNAM1= <>
##$DBPNAM2= <>
##$DBPNAM3= <>
##$DBPNAM4= <>
##$DBPNAM5= <>
##$DBPNAM6= <>
##$DBPNAM7= <>
##$DBPOAL= (0..7)
0.5 0.5 0.5 0.5 0.5 0.5 0.5 0.5 
##$DBPOFFS= (0..7)
0 0 0 0 0 0 0 0 
##$DE= 6
##$DECBNUC= <off>
##$DECIM= 32
##$DECNUC= <off>
##$DECSTAT= 4
##$DIGMOD= 1
##$DIGTYP= 9
##$DL= (0..7)
0 120 120 120 120 120 120 120 
##$DP= (0..7)
150 150 150 150 150 150 150 150 
##$DP07= 0
##$DPNAME0= <>
##$DPNAME1= <>
##$DPNAME2= <>
##$DPNAME3= <>
##$DPNAME4= <>
##$DPNAME5= <>
##$DPNAME6= <>
##$DPNAME7= <>
##$DPOAL= (0..7)
0.5 0.5 0.5 0.5 0.5 0.5 0.5 0.5 
##$DPOFFS= (0..7)
0 0 0 0 0 0 0 0 
##$DQDMODE= 0
##$DR= 18
##$DS= 0
##$DSLIST= <SSSSSSSSSSSSSSS>
$$ [...]
##$SUBNAM2= <"">
##$SUBNAM3= <"">
##$SUBNAM4= <"">
##$SUBNAM5= <"">
##$SUBNAM6= <"">
##$SUBNAM7= <"">
##$SUBNAM8= <"">
##$SUBNAM9= <"">
##$SW= 18.05172834244
##$SWIBOX= (0..15)
0 0 2 0 0 0 0 0 0 0 0 0 0 0 0 0 
##$SW_h= 3612.71676300578
##$TD= 16384
##$TD0= 1
##$TE= 0
##$TE2= 300
##$TE3= 300
##$TEG= 300
##$TL= (0..7)
0 120 120 120 120 120 120 120 
##$TP= (0..7)
150 150 150 150 150 150 150 150 
##$TP07= 0
##$TPNAME0= <>
##$TPNAME1= <>
##$TPNAME2= <>
##$TPNAME3= <>
##$TPNAME4= <>
##$TPNAME5= <>
##$TPNAME6= <>
##$TPNAME7= <>
##$TPOAL= (0..7)
0.5 0.5 0.5 0.5 0.5 0.5 0.5 0.5 
##$TPOFFS= (0..7)
0 0 0 0 0 0 0 0 
##$TUNHIN= 0
##$TUNHOUT= 0
##$TUNXOUT= 0
##$USERA1= <user>
##$USERA2= <user>
##$USERA3= <user>
##$USERA4= <user>
##$USERA5= <user>
##$V9= 5
##$VALIST= <valist>
##$VCLIST= <CCCCCCCCCCCCCCC>
##$VD= 0
##$VDLIST= <DDDDDDDDDDDDDDD>
##$VPLIST= <PPPPPPPPPPPPPPP>
##$VTLIST= <TTTTTTTTTTTTTTT>
##$WBST= 1024
##$WBSW= 4
##$XGAIN= (0..3)
0 0 0 0 
##$XL= 0
##$YL= 0
##$YMAX_a= 114518
##$YMIN_a= -133118
##$ZGOPTNS= <>
##$ZL1= 120
##$ZL2= 120
##$ZL3= 120
##$ZL4= 120
##$ABSF1= 10
##$ABSF2= 0
##$ABSG= 5
##$ABSL= 3
##$ALPHA= 0
##$AQORDER= 0
##$ASSFAC= 0
##$ASSFACI= 0
##$ASSFACX= 0
##$ASSWID= 0
##$AUNMP= <proc_1d>
##$AZFE= 0.1
##$AZFW= 0.1
##$BCFW= 1
##$BC_mod= 2
##$BYTORDP= 1
##$COROFFS= 0
##$CY= 11.3945322036743
##$DATMOD= 1
##$DC= 2
##$DFILT= <>
##$DTYPP= 0
##$F1P= 15.7292609196834
##$F2P= 12.9074282941183
##$FCOR= 0.5
##$FTSIZE= 0
##$FT_mod= 4
##$GAMMA= 1
##$GB= 0.15
##$INTBC= 1
##$INTSCL= 1
##$ISEN= 128
##$LB= 0.24
##$LEV0= 0
##$LPBIN= 0
##$MAXI= 10000
##$MC2= 0
##$MEAN= 0
##$ME_mod= 0
##$MI= 1.114404
##$NCOEF= 0
##$NC_proc= 0
##$NLEV= 6
##$NOISF1= 3.799351
##$NOISF2= 2.8
##$NSP= 1
##$NTH_PI= 0
##$NZP= 0
##$OFFSET= 15.70392
##$PC= 1
##$PHC0= -19901.18
##$PHC1= 6.852721
##$PH_mod= 1
##$PKNL= yes
##$PPARMOD= 0
##$PSCAL= 0
##$PSIGN= 0
##$REVERSE= no
##$SF= 200.130013532006
##$SI= 16384
##$SIGF1= 3
##$SIGF2= 2
##$SINO= 400
##$SIOLD= 16384
##$SREGLST= <1H.CDCl3>
##$SSB= 0
##$STSI= 0
##$STSR= 0
##$SW_p= 3612.71676300578
##$SYMM= 0
##$S_DEV= 0
##$TDeff= 0
##$TDoff= 0
##$TI= <>
##$TILT= no
##$TM1= 0
##$TM2= 0
##$TOPLEV= 0
##$USERP1= <user>
##$USERP2= <user>
##$USERP3= <user>
##$USERP4= <user>
##$USERP5= <user>
##$WDW= 1
##$XDIM= 8192
##$YMAX_p= 0
##$YMIN_p= 0
$$ End of Bruker specific parameters
$$ ---------------------------------
##NTUPLES= NMR FID
##VAR_NAME=  TIME,          FID/REAL,        FID/IMAG
##SYMBOL=    X,             R,               I
##VAR_TYPE=  INDEPENDENT,   DEPENDENT,       DEPENDENT
##VAR_FORM=  AFFN,          ASDF,            ASDF
##VAR_DIM=   8192,          8192,            8192
##UNITS=     SECONDS,       ARBITRARY UNITS, ARBITRARY UNITS
##FACTOR=    0.0002768,     1,               1
##FIRST=     0,             0,               0
##LAST=      2.2672688,     0,               0
##MIN=       0,             -133118,         0
##MAX=       2.2672688,     114518,          0
$$ Real data points
##PAGE= N=1
##DATA TABLE= (X++(R..R)), XYDATA
$$ [...]
$$ plain form
1528 -132 -741 422 1255 962 400 1289 1974 1172 -216 -535 109 -495 -1630 -1720 -248 34 -745 -1120 -110
1547 -110 309 -516 -1395 -566 302 -285 -655 140 1562 1357 578 573 1547 1127 -217 -558 400 658 -407 -886
1567 -886 -54 607 -216 -1156 -714 -16 -582 -1391 -871 347 376 -423 -487 580 1054 169 -228 677 1062 377
1587 377 -407 359 1102 388 -585 -244 418 227 -784 -736 394 326 -514 -965 -70 391 -420 -944 -223 780
1607 780 142 -343 159 1241 708 -350 -153 645 415 -743 -719 371 801 -3 -534 352 674 -249 -1186
1626 -1186 -636 144 -361 -864 -187 867 830 -88 -53 748 716 -509 -1082 75 422 -162 -418 486 1227 655
1646 655 -506 -565 174 -421 -1483 -1127 17 542 -45 54 844 1198 -12 -636 -198 121 -369 -1061 60
1665 60 1144 965 60 486 787 316 -1050 -1398 -340 -163 -774 -628 470 1206 454 -194 33 387 -421
$$ packed form
1528a32o09J163Q33k93n62Q89O85q02j388l19O44o04j135r0J472K82p79l75J010
1547a10M19q25q79Q29Q68n87l70P95J422k05p79nR74m20j344l41R58K58j065m79
1567h86Q32O61q23r40M42O98n66q09N20J218K9p99o4J067M74q85l97R05L85o85
1587C77p84P66P43p14r73L41O62j91j011M8J130o8q40m51Q95M61q11n24P21J003
1607G80o38m85N02J082n33j058J97P98k30j158K4J090M30q04n31Q86L22r23r37
1626a186N50P80n05n03O77J054l7r18L5Q01l2j225n73J157L47n84k56R04P41n72
1646F55j161n9P39n95j062L56J144N25n87R9P90L54j210o24M38L19m90o92J121
1665F0J084j79r05M26L01m71j366l48J058J77o11J46J098P36p52o48K27L54q08
$$ plain form
1684 -421 -1400 -953 218 360 -309 386 1244 1165 115 -383 -48 41 -937 -1407 -232 715 295 -213 574 963
1704 963 302 -922 -1134 -296 -444 -1016 -646 531 1031 428 145 624 574 -369 -1123 -711 19 -246 -378 130
1724 130 1091 1248 182 -126 428 75 -1076 -1079 -6 422 99 -10 788 1281 433 -534 -406 -32 -516 -1361
1744 -1361 -829 505 651 124 -25 811 648 -432 -1073 -416 77 -405 -649 225 1244 928 16 226 792
1763 792 292 -592 -763 111 303 -226 -239 593 834 61 -763 -432 55 -654 -1319 -606 255 208 -312 -112 794
1784 794 636 -157 -367 302 459 -41 -426 356 805 489 -232 260 734 152 -746 -786 101 -198 -887 -807 272
1805 272 310 -525 -720 -115 400 -350 -727 59 703 314 -333 285 973 676 -201 7 626 692 -185 -438 388
1826 388 440 -205 -818 -154 -75 -409 -984 -530 207 -118 -716 -363 240 206 -395 -376 460 616 63 -157 756
$$ packed form
1684d21r79M47J171J42o69O95Q58p9j050m98L35Q9r78m70J175R47m20n08P87L89
1704I63o61j224k12Q38j48n72L70J177N00o03k83M79n0r43p54M12P30k65j32N08
1724A30R61J57j066l08N54l53j151lJ073M28l23j09P98M93q48r67J28L74m84q45
1744a361N32J334J46n27j49Q36j63j080o41O57M93m82k44Q74J019l16r12K10N66
1763G92n00q84j71Q74J92n29j3Q32K41p73q24L31M87p09o65P13Q61m7n20K00R06
1784G94j58p93k10O69J57n00l85P82M49l16p21M92M74n82q98m0Q87k99o89Q0J079
1805B72L8q35j95O05N15p50l77P86O44l89o47O18O88k97q77K08O19O6q77k53Q26
1826C88N2o45o13O64P9l34n75M54P37l25n98L53O03l4o01J9Q36J56n53k20R13
$$ plain form
1847 756 1084 393 -393 97 585 -222 -838 -425 265 155 -552 -454 313 221 -684 -750 -194 39 -309 -456 137
1868 137 929 637 122 389 755 267 -361 -517 238 274 -292 -261 533 664 9 -673 -164 -189 -866 -1113 -603
1889 -603 341 131 -243 294 974 790 43 -181 366 272 -302 -404 399 837 394 -80 408 538 -238 -1134
1909 -1134 -1026 -403 -676 -979 -609 445 559 47 -75 366 313 -496 -662 -227 465 415 191 980 1411 1008
1929 1008 -8 -33 190 -222 -977 -1052 -309 56 -263 -257 232 388 -318 -872 -687 -179 -388 -773 -10 1077
1949 1077 1008 537 820 1127 836 -134 -442 149 396 -130 -396 375 826 153 -436 -460 -111 -916 -1359 -1183
1969 -1183 -402 -107 -313 -171 766 826 286 -137 303 645 192 -289 410 1055 925 299 466 725 252 -581
1989 -581 -967 -375 -417 -1017 -920 -349 251 -522 -493 56 276 -294 -814 -23 305 319 38 549 1181 1072 550
$$ packed form
1847G56L28o91p86M90M88q07o16M13O90j10p07R8P67r2r05o6N56K33l48j47N93
1868A37P92k92n15K67L66m88o28j56P55L6n66L1P94J31o55o82N09k5o77k47N10
1889f03R44k10l74N37O80j84p47k24N47r4n74j02Q03M38m43m74M88J30p76q96
1909a134J08O23k73l03L70J054J14n12j22M41n3q09j66M35O92n0k24P89M31m03
1929A008j016k5K23m12p55p5P43L65l19OM89J56p06n54J85N08k09l85P63J087
1949A077o9m71K83L07k91r70l08N91K47n26k66P71M51o73n89k4L49q05m43J76
1969a183P81K95k06J42R37O0n40m23M40L42m53m81O99O45j30o26J67K59m73q33
1989e81l86N92m2o00R7N71O00p73K9N49K20n70n20P91L28J4k81N11O32j09n22
$$ plain form
2010 550 316 636 509 -275 -639 -202 95 -433 -527 -8 74 -288 -852 -645 -214 -231 -914 -258 243 524 118
2031 118 43 720 730 342 -49 527 818 290 -283 235 609 90 -500 -475 -67 20 -895 -771 -93 -19 -579 -586
2053 -586 -83 505 19 -235 282 597 484 156 357 689 487 -1 -74 264 236 -257 -590 -47 119 -402 -841
2074 -841 -453 -80 -525 -1016 -429 47 88 -278 -13 671 689 213 82 516 669 5 -168 223 616 380 -95
2095 -95 99 288 -196 -748 -737 -390 -691 -1064 -814 -80 222 -62 -176 253 641 90 -278 58 632 404 192
2116 192 584 1048 889 332 283 402 -23 -709 -887 -426 -353 -702 -651 -53 112 -398 -699 -643 52 -411 -650
2137 -650 -49 526 803 522 712 982 931 205 -123 270 307 -201 -498 -21 299 82 -325 -250 -62 -557 -1025
2158 -1025 -1075 -409 -441 -605 -148 415 782 471 149 609 589 -5 -98 201 687 658 368 386 908 380 -274 -600
$$ packed form
2010E50k34L20j27p84l64M37K97n28r4N19Q2l62n64K07M31j7o83O56N01K81m06
2031A18p5O77J0l88l91N76K91n28n73N18L74n19n90K5M08Q7r15J24O78P4n60p
2053e86N03N88m86k54N17L15j13l28K01L32k02m88p3L38k8m93l33N43J66n21m39
2074h41L88L73m45m91N87M76M1l66K65O84J8m76j31M34J53o64j73L91L93k36m75
2095i5J94J89m84n52J1L47l01l73K50P34L02k84j14M29L88n51l68L36N74k28k12
2116A92L92M64j59n57m9J19m25o86j78M61P3l49N1N98J65n10l01N6O95m63k39
2137f50O01N75K77k81J90K70n1p26l28L93L7n08k97M77L20k17m07P5J88m95m68
2158a025n0O66l2j64M57N63L67l11l22M60k0n94r3K99M86k9k90J8N22n28o54l26
$$ plain form
2180 -600 -346 -522 -1009 -1118 -252 95 -309 -367 59 298 86 -532 -395 30 265 64 257 871 1059 618
2200 618 351 621 425 -299 -624 -368 44 -328 -588 -175 -58 0 -633 -476 -326 -181 -596 -505 67 521 433
2221 433 183 802 1187 369 -171 212 401 166 -249 -57 243 100 -295 -386 25 -288 -829 -806 -491 -130 -572
2242 -572 -482 17 655 230 154 246 660 530 34 250 621 812 -16 127 480 449 -214 -618 -308 -254 -649 -958
2264 -958 -477 -240 -286 -571 -476 62 71 -310 -105 446 434 266 124 635 938 405 204 389 497 171 -286 -305
2286 -305 171 -144 -538 -549 -194 -283 -815 -724 -175 -206 -298 -226 159 258 308 179 234 757 551 75 318 706 582
2309 582 228 269 451 252 -286 -508 -276 -369 -540 -762 -326 -99 -232 -591 -379 -89 46 -258 58 320 509
2330 509 407 473 733 1076 362 134 205 291 134 -470 -174 215 -31 -479 -400 -62 -117 -887 -759 -493 -228 -587
$$ packed form
2180f00K54j76m87j09Q66L47m04n8M26K39k12o18J37M25K35k01J93O14J88m41
2200F18k67K70j96p24l25K56M12l72k60M13J17N8o33J57J50J45m15R1N72M54q8
2221D33k50O19L85q18n40L83J89k35m15J92L00j43l95r1M11l13n41K3L15L61m42
2242e72R0M99O38m25p6R2M14j30m96K16L71J91q28J43L53l1o63m04L10N4l95l09
2264i58M81K37m6k85R5N38Rl81K05N51j2j68j42N11L03n33k01J85J08l26m57j9
2286c05M76l15l94j1L55q9n32R1N49l1r2P2L85R9N0j29N5N23k06m76K43L88j24
2309E82l54M1J82j99n38k22K32r3j71k22M36K27j33l59K12K90J35l04L16K62J89
2330E09j02O6K60L43p14k28P1Q6j57o04K96L89k46m48P9L38n5p70J28K66K65l59
$$ plain form
2352 -587 -417 188 549 285 128 363 600 356 81 240 664 382 21 364 520 357 -172 -440 -327 -164
2372 -164 -695 -950 -459 -218 -111 -439 34 304 287 -199 -263 107 212 -299 282 378 663 344 411 568 449
2393 449 -17 -548 -489 -202 -244 -623 -267 4 18 -261 -293 98 -84 -433 -608 -98 300 157 168 437 795 460
2415 460 70 186 257 -5 -332 -172 40 170 -131 -342 -36 37 -480 -777 -552 -149 -322 -495 2 287 334
2436 334 182 405 488 469 -55 131 341 286 271 140 267 599 35 -141 -116 -243 -452 -957 -644 -212 -159 -308
2458 -308 -244 18 163 -1 -170 346 186 215 -58 358 645 454 293 321 460 194 -171 -270 -203 -290 -461 -448
2480 -448 -238 -247 -332 -454 -340 -311 -272 -463 -193 -42 18 -18 180 539 544 -2 105 578 383 211 -2 253 333
2503 333 39 -319 -113 102 -231 -609 -475 -158 -258 -435 -400 97 -68 -163 -75 223 227 33 32 214 408 121
$$ packed form
2352e87J70O05L61k64j57K35K37k44k75J59M24k82l61L43J56j63n29k68J13J63
2372a64n31k55M91K41J07l28M73K70j7m86o4L70J05n11N81R6K85l19O7J57j19
2393D49m66n31N9K87m2l79L56K71J4k79l2L91j82l49j75N10L98j43J1K69L58l35
2415D60l90J16P1k62l27J60K12J30l01k11L06P3n17k97K25M03j73j73M97K85M7
2436C34j52K23Q3j9n24J86K10n5j5j31J27L32n64j76K5j27k09n05L13M32N3j49
2458c08O4K62J45j64j69N16j60K9k73M16K87j91j61K8J39k66l65r9O7q7j71J3
2480d48K10rq5j22J14K9L9j91K70J51O0l6J98L59Nn46J07M73j95j72k13K55Q0
2503C33k94l58K06K15l33l78J34L17j00j77L5M97j65r5Q8K98Mj94jJ82J94k87
$$ plain form
2525 121 -12 280 353 313 -49 12 300 -2 -158 -262 -94 -19 -622 -493 -179 -103 -224 -282 -147 169 83 114 236
2548 236 364 258 103 9 278 178 33 -71 323 328 -83 -173 -9 -6 -337 -375 -125 -45 -80 -38 -127 324 140 -66
2572 -66 -197 82 125 -91 -151 145 219 177 41 200 369 170 -288 -156 -86 -169 -369 -306 -17 41 -98 -222 68
2595 68 -87 -211 -317 -46 118 -69 132 25 466 458 148 -155 516 153 -370 -389 76 160 -224 -301 89 -49
2617 -49 -222 -434 58 -21 -400 -248 -102 166 167 31 96 369 200 1 -64 127 53 -54 28 72 334 255 -110
2640 -110 187 -267 -126 -486 -541 -92 -105 -324 -102 60 283 -129 -177 44 86 32 -252 -21 269 165 3 295
2662 295 409 166 -83 -306 -60 -87 -224 -179 -29 65 -113 -138 33 4 -132 -290 -338 102 -152 -50 26 315
2684 315 349 15 -92 315 144 -135 -160 89 83 8 -74 27 195 64 -43 -327 150 -106 -237 -180 -20 85
$$ packed form
2525A21j33K92P3m0l62O1K88l02j56j04J68P5o03J29L14P6j21n8J35L16q6L1J22
2548B36J28j06j55r4K69j00j45j04L94Nm11r0J64Ll31l8K50Q0l5M2q9M51j84k06
2572f6j31K79M3k16o0K96P4m2j36J59J69j99m58J32P0q3k00O3K89N8j39j24K90
2595F8j55j24j06K71J64j87K01j07M41ql10l03O71l63n23j9M65Q4l84p7L90j38
2617d9j73k12M92p9l79J52J46K68Jj36O5K73j69j99o5J91p4j07Q2M4K62p9l65
2640a10K97m54J41l60n5M49j3k19K22J62K23m12m8K21M2n4k84K31K90j04j62K92
2662B95J14k43k49k23K46k7j37M5J50R4j78k5J71k9j36j58m8M40k54J02P6K89
2684C15L4l34j07M07j71k79k5K49op5q2J01J68j31j07k84M77k56j31N7J60J05
$$ plain form
2706 85 -74 -110 138 297 5 -120 -75 39 -169 -115 100 222 216 -105 57 153 129 -255 -264 64 120 102 -21 87
2730 87 70 -17 -98 1 11 -23 -208 -224 302 168 -7 53 236 14 -244 -238 124 64 -196 -335 34 162 -32 -181
2754 -181 -68 174 -47 -85 -68 135 149 12 -169 234 179 103 -9 82 76 -254 -87 -120 -16 -96 -336 -269 49 33
2778 33 -219 -40 107 271 44 -144 57 151 -87 -153 45 133 243 -74 -112 167 97 -132 -66 13 136 -141 -345
2801 -345 -34 122 -147 -115 5 175 7 -70 -105 107 -6 -184 -116 165 158 91 -124 195 112 -114 -70 -134 73
2824 73 -74 -134 -13 306 132 -172 14 203 -75 -139 -82 -2 -212 -255 -249 199 162 175 -133 70 22 -33 -255 -260 27
2849 27 -78 -76 120 333 266 -141 -61 59 65 -165 -192 101 136 145 -116 147 202 124 -77 -65 -81 -107 -150 -102 128 40
2875 40 28 -138 182 49 -244 -362 -264 22 -66 -50 160 237 95 150 -88 185 9 -82 -217 56 136 126 -95
$$ packed form
2706H5j59l6K48J59k92j25M5J14k08N4K15J22ol21J62R6k4l84rL28N6j8j23J08
2730H7j7q7q1R9J0l4j85j6N26j34j75O0J83k22k58OL62o0k60j39L69J28j94j49
2754a81J13K42k21l8J7K03J4j37j81M03n5p6j12R1ol30J67l3J04q0k40O7L18j6
2778C3k52J79J47J64k27j88K01R4k38o6J98Q8J10l17l8K79p0k29O6P9J23k77k04
2801c45L11J56k69L2J20J70j68p7l5K12j13j78O8K81po7k15L19q3k26M4o4K07
2824G3j47o0J21L19j74l04J86J89k78o4N7Q0k10m3OM48l7J3l08K03m8n5k22nK87
2849B7j05KJ96K13o7m07Q0J20Ok30k7K93L5Rk61K63N5p8k01J2j6k6m3M8K30q8
2875D0j2j66L20j33k93j18R8K86q8J6K10P7j42N5k38K73j76r1j35K73Q0j0k21
$$ plain form
2898 -95 92 -31 -118 -205 -110 -160 -74 -376 -229 81 13 -178 -99 201 55 49 -135 261 37 -30 -135 237 284 154
2922 154 2 147 5 6 -278 -193 -16 0 -310 -176 -28 -120 -69 -314 -52 23 -270 -255 13 245 175 -19 163
2945 163 224 149 61 105 258 69 31 -58 19 99 -108 -90 -15 -10 -223 -313 -287 -74 91 -244 -136 51 130 -64 76
2970 76 183 211 31 -96 98 141 -8 -50 196 128 -69 -374 -59 -48 128 -94 -73 32 32 -148 -182 84 -13 8
2994 8 -1 111 79 68 -10 -39 219 78 -11 -44 79 126 25 -278 -166 151 -156 -319 -92 -12 -150 -258 -110 115
3018 115 -73 -140 -157 172 58 40 -60 27 184 220 55 170 174 239 -205 -15 32 -82 -290 -413 -76 -86 -108 -117
3042 -117 8 -44 -35 -52 23 -17 100 -9 39 199 -21 126 123 162 228 19 -62 -3 -122 -271 -192 -67 -131 -252 -164
3067 -164 -12 -13 -85 -305 -213 -49 -13 164 207 327 246 60 228 198 345 -90 41 19 76 14 23 44 96 -23 -207
$$ packed form
2898i5J87j23q7q7R5n0Q6l02J47L10o8j91P9L00j46oj84L96k24o7j05L72M7j30
2922A54j52J45j42Jk84Q5J77J6l10J34J48r2N1k45K62P5k93J5K68K32p0j94J82
2945A63O1p5q8M4J53j89l8q9P7Q0k07J8P5Nk13r0K6K13J65l35J08J87P9j94J40
2970G6J07K8j80j27J94M3j49m2K46o8j97l05L15J1J76k22K1J05%j80l4K66r7K1
2994HrJ12l2j1p8k9K58j41q9l3J23M7j01l03J12L17l07j63K27Q0j38j08J48K25
3018A15j88o7j7L29j14j8j00Q7J57L6j65J15MO5m44J90M7j14k08j23L37j0k2r
3042a17J25n2Rj7P5m0J17j09M8J60k20J47lL9O6k09q1N9j19j49P9J25o4j21Q8
3067a64J52jp2k20R2J64L6J77M3J20q1j86J68l0J47m35J31k2N7o2RK1N2j19j84
$$ plain form
3092 -207 -258 -283 -360 -410 -137 -193 -160 -178 -153 27 238 -8 -74 143 242 119 61 208 225 220 22 131 -10 164 -113
3117 -113 -216 -67 -130 2 -218 -56 109 -234 -68 -44 3 -177 -284 -13 29 166 -2 148 390 267 113
3138 113 113 146 -9 64 -178 125 61 -17 -194 -32 21 -27 -194 -298 8 -82 -245 -119 27 261 82 12 89 246
3162 246 96 215 32 243 216 -87 20 236 10 -165 -168 31 13 -257 -170 -223 41 -62 -102 131 14 113 78
3185 78 92 130 -164 -175 -59 231 183 142 58 -72 96 14 -258 72 -113 35 -172 -29 -137 -35 -240 -24 -95
3208 -95 24 -235 -230 160 10 57 66 237 134 -113 -71 144 124 193 -154 82 18 -116 41 -181 -208 -86 -159 -226
3232 -226 -115 -133 -81 -144 -1 27 59 -4 158 23 116 6 14 423 143 161 -43 60 79 -226 -72 -34 -43 -167 -85
3257 -85 -39 -105 -95 -143 14 -49 -141 -155 -44 51 239 -57 20 81 246 116 43 175 204 145 134 44 155 33 -114
$$ packed form
3092b07n1k5p7n0K73n6L3j8K5J80K11k46o6K17R9j23n8J47J7nj98J09j41J74k77
3117a13j03J49o3J32k20J62J65l43J66K4M7j80j07K71M2J37j68J50K42j23j54
3138A13%L3j55P3k42L03o4p8j77J62N3m8j67j04L06r0j63J26J46K34j79p0P7J57
3162B46j50J19j83K11k7l03J07K16k26j75lJ99j8k70Q7n3K64j03m0K33j17R9l5
3185G8J4L8k94j1J16K90m8m1q4j30J68q2k72L30j85J48k07J43j08J02k05K16p1
3208i5J19k59NL90j50M7RJ71j03k47M2K15k0O9l47K36o4j34J57k22k7J22p3o7
3232b26J11j8N2o3J43K8L2o3J62j35R3j10QM09k80J8k04J03J9l05J54L8rj24Q2
3257h5M6o6J0m8J57o3r2j4J11R5J88k96P7O1J65j30p3J32K9n9j1r0J11j22j47
$$ plain form
3282 -114 -209 -7 -308 -288 -210 -125 -12 -178 -259 71 59 -60 -130 94 142 154 -125 114 144 154 166 8 -17 64 164
3307 164 -139 107 84 -82 23 60 -63 45 -195 -66 135 -7 -59 -16 -61 -9 104 90 157 337 50 30 37 175
3331 175 -32 -25 82 -68 -85 -32 -73 -7 -26 -176 -151 -6 -149 -53 -129 19 48 60 -25 37 262 39 88 -39 45
3356 45 59 -50 -161 60 117 -11 113 -20 169 -249 -223 -22 -30 50 -32 134 72 22 -101 -104 71 76 -68 152 58
3381 58 18 33 2 -16 120 -222 -80 -176 -43 -104 -399 -158 78 -77 -21 -101 -2 23 2 -8 -16 245 -67 -170 95
3406 95 254 109 290 137 217 19 -28 91 88 35 -174 -96 134 46 -77 -190 -47 -181 -221 -174 69 47 129 -67
3430 -67 136 313 -15 30 54 -54 166 141 45 58 265 -105 201 74 -49 -97 -120 -217 -220 -228 -229 80 -54 30 -291
3455 -291 107 -58 39 136 -236 185 131 -19 -90 196 144 109 -9 -40 -21 -63 -67 -70 86 119 -170 -156 55 33 -172
$$ packed form
3282a14r5K02l01K0P8Q5J13j66q1L30j2j19p0K24M8J2k79K39L0J0J2j58k5Q1J00
3307A64l03K46k3j66J05L7j23J08k40J29K01j42n2M3m5N2J13j4O7J80k87k0PJ38
3331A75k07PJ07j50j7N3m1O6j9j50K5J45j43R6p6J48K9J2q5O2K25k23M9j27Q4
3356D5J4j09j11K21N7j28J24j33J89m18K6K01qQ0q2J66o2n0j23lJ75Nj44K20r4
3381E8m0J5l1j8J36l42J42r6J33o1k95K41K36j55N6q0R9K5k1j0qK61l12j03K65
3406I5J59j45J81j53Q0j98m7J19ln3k09P8K30q8j23j13J43j34m0M7K43k2Q2j96
3430f7K03J77l28M5K4j08K20k5r6J3K07l70L06j27j23m8k3r7lqjL09j34Q4l21
3455b91L98j65R7R7l72M21n4j50p1K86n2l5j18l1J9m2mlJ56L3k89J4K11k2k05
$$ plain form
3480 -172 -142 152 117 107 -168 -19 12 112 109 -86 -64 58 2 -10 172 0 -98 -245 30 -8 -59 -199 -169 3
3504 3 117 -239 -33 113 118 6 -110 -51 149 -2 141 42 -58 -31 71 121 33 -120 -18 -35 13 -62 27 -54 -85
3529 -85 -20 -10 -140 -54 -93 -188 -136 88 164 22 -40 79 120 176 53 127 43 71 -121 23 66 -65 40 8 46 17
3555 17 -48 -71 -39 -82 -46 -108 33 70 174 -112 72 -127 173 149 -43 28 90 -42 28 108 82 -60 -114 -115 -69 -23
3581 -23 -94 -331 -60 46 -248 -148 100 60 39 7 -141 13 -105 55 -9 232 37 67 187 180 84 28 -3 148
3605 148 13 28 -70 150 108 -11 -44 -69 23 -110 -146 -41 56 28 121 19 -42 68 -78 -39 110 193 16 3 112
3630 112 182 -7 -112 107 -75 100 91 -1 45 9 -118 75 -71 -21 43 -55 -4 88 45 -132 32 144 -44 -39 78
3655 78 188 100 10 9 163 156 -43 -169 -33 -192 9 -226 -50 55 50 -117 86 215 -52 35 -131 -55 -25 -14
$$ packed form
3480a72L0K94l5j0k75J49L1J00lj95K2J22n6j2J82j72r8j47K75l8n1j40L0J72
3504CJ14l56K06J46Nj12j16N9K00j51J43r9j00K7J02N0q8j53J02j7M8p5Q9q1l1
3529h5O5J0j30Q6l9r5N2K24P6j42o2J19M1N6j23P4q4K8j92J44M3j31J05l2L8k9
3555A7o5k3L2m3L6o2J41L7J04k86J84j99L00k4j92P1O2j32P0Q0k6j42n4jM6M6
3581b3p1k37K71J06k94J00K48m0k1l2j48J54j18J60o4K41j95L0J20pr6n6l1J51
3605A48j35J5r8K20m2j19l3k5R2j33l6J05R7k8R3j02o1J10j46L9J49Q3j77j3J09
3630A12P0j89j05K19j82J75rr2M6l6j27J93j46N0O4r8N1R2m3j77J64J12j88NJ17
3655G8J10q8r0jJ54pj99j26J36j59K01k35J76J05nj67K03J29k67Q7j66P6L0J1
$$ plain form
3679 -14 -69 49 28 9 -34 87 -159 -84 9 -116 36 -94 20 -86 187 -2 -165 -58 -73 126 40 93 1 -18
3703 -18 -17 -1 76 58 -56 -48 91 13 -103 -155 -218 11 -52 -91 87 117 96 79 -34 104 68 29 38 -91 -113 168 119
3730 119 136 160 72 -25 74 226 133 -26 43 10 144 19 135 -53 -94 -213 -321 -177 101 -69 49 25 140
3753 140 227 115 50 -77 -190 165 147 -8 92 20 -27 150 35 -7 125 120 57 -71 -285 79 5 63 -56 45
3777 45 98 47 -145 31 102 49 -15 -92 -8 136 124 -112 -12 1 52 -46 -202 44 209 -62 67 96 24 -61 79
3802 79 44 65 -1 -18 -129 -190 93 -65 -126 19 93 4 78 149 -1 -56 -84 -93 18 29 -117 103 42 6 48 -50 -54
3829 -54 96 -27 -198 7 43 -63 -170 -7 23 -63 -59 -128 -66 -42 -21 -15 -28 -145 -81 -94 71 155 -66 -65 -35 234
3855 234 -67 28 129 138 113 -93 -45 -103 79 70 -155 46 113 -27 -34 110 80 115 17 -273 12 -105 -176 -35 162
$$ packed form
3679a4n5J18k1j9m3J21k46P5R3j25J52j30J14j06K73j89j63J07j5J99q6N3r2j9
3703a8JJ6P7j8j14QJ39p8j16n2o3K29o3l9J78L0k1j7j13J38l6l9Rj29k2K81m9
3730A19J7K4q8r7R9J52r3j59O9l3J34j25J16j88m1j19j08J44K78j70J18k4J15
3753A40Q7j12o5j27j13L55j8j55J00p2m7J77j15m2J32no3j28k14L64p4N8j19J01
3777D5N3n1j92J76P1n3o4p7Q4J44j2k36J00J3N1r8j56K46J65k71J29K9p2q5J40
3802G9l5K1o6j7j11o1K83j58o1J45P4q9P4P1j50n5k8rJ11J1j46K20o1l6M2r8m
3829e4J50j23j71K05L6j06j07J63L0q6Mo9O2K4K1Oj3j17O4j3J65Q4k21JL0K69
3855B34l01R5J01Rk5k06M8n8J82rk25K01O7j40pJ44l0L5r8k90K85j17p1J41J97
$$ plain form
3880 162 -14 -116 64 65 -19 -164 -47 -9 129 -37 -24 44 7 136 -105 -16 152 -63 159 -90 109 -42 -37
3903 -37 37 -12 -58 -71 53 69 55 -134 -38 73 41 -24 53 -85 94 22 -52 107 144 -101 37 57 76 95 -2 -93
3929 -93 -37 28 -136 -134 114 -153 -34 -135 164 85 -104 -96 -98 17 75 -63 150 -17 139 1 71 -231 -75 113
3953 113 -39 140 -54 120 -1 115 -71 36 4 -131 46 107 -74 -54 -92 58 -59 23 -90 77 -26 -46
3975 -46 -121 -232 8 -22 19 90 -3 -50 -132 29 62 -31 -59 121 -17 -174 -92 158 163 78 -201 110 14 58 178 -36
4001 -36 -6 140 -48 63 171 174 -83 -73 -119 -73 -48 -16 37 77 -46 24 -68 38 -71 135 90 -49 72 117 17
4026 17 15 124 -1 65 -258 -54 -245 50 -91 -24 -134 -80 -9 63 118 -151 35 -50 39 -49 -18 -52 231 150 -25
4051 -25 57 86 -139 -96 30 -65 -20 19 -89 119 -14 21 -84 22 40 -8 -125 14 6 34 197 68 87 21 -94
$$ packed form
3880A62j76j02J80Jq4j45J17L8J38j66J3O8l7J29k41Q9J68k15K22k49J99j51N
3903c7P4m9m6j3J24J6j4j89R6J11l2o5P7j38J79p2p4J59L7k45J38K0J9J9r7r1
3929i3N6O5j64KK48k67J19j01K99p9j89QkJ15N8j38K13j67J56j38P0l02J56J88
3953A13j52J79j94J74j21J16j86J07l2j35J77O1j81K0l8J50j17Q2j13J67j03k0
3975d6p5j11K40l0M1P1r3m7q2J61L3r3k8J80j38j57Q2K50Nq5k79L11r6M4J20k14
4001c6L0J46j88J11J08Lk57J0m6M6K5L2N3M0j23P0r2J06j09K06m5j39J21M5j00
4026A7kJ09j25O6l23K04j91K95j41O7j10N4P1P2N5k69J86q5Q9q8L1l4K83q1j75
4051b5Q2K9k25M3J26r5M5L9j08K08j33L5j05J06J8m8j17J39qK8J63j29J9o6j15
$$ plain form
4076 -94 53 273 10 233 99 -58 -22 21 52 -24 -115 -5 -102 -156 -107 -30 -107 30 -193 -17 -108 5 -13 36 -97
4101 -97 -14 50 -85 -57 -133 64 175 193 80 -52 -149 -267 -40 -82 -36 -63 82 -54 -73 59 -86 4 39 161
4125 161 4 -75 -66 99 43 -94 5 -78 68 -96 -45 -315 -19 90 -237 -22 -14 -138 29 17 9 -60 -180 148
4149 148 94 133 -116 -66 88 22 71 -10 50 231 13 3 9 -52 -9 -32 127 -32 -50 37 89 -39 6 -52 63 96
4175 96 -63 -81 71 -12 -3 70 197 98 14 -23 -10 -65 39 49 -225 35 -178 28 -217 -51 -53 37 83 -120 -198 -129
4201 -129 -68 -13 -47 -30 -65 13 23 -131 14 152 35 136 84 -205 -14 11 42 -1 113 -110 -19 -75 -64 -90 -17
4226 -17 -78 -208 -12 32 93 -2 97 23 -247 136 5 118 20 134 -139 124 84 188 73 -112 119 44 1 -150
4250 -150 -54 79 -26 125 -88 -3 -7 -103 48 -2 -53 6 29 -52 32 96 144 169 6 10 84 25 -82 109 164 35
$$ packed form
4076i4J47K20k63K23j34j57L6M3L1p6r1J10r7n4M9P7p7J37k23J76r1J13j8M9j33
4101i7Q3O4j35K8p6J97J11J8j13j32r7j18K27m2M6k7J45j36j9J32j45R0L5J22
4125A61j57p9RJ65n6j37R9q3J46j64N1k70K96J09l27K15Qj24J67j2qo9j20L28
4149A48n4L9k49N0J54o6M9q1O0J81k18j0Oo1M3k3J59j59j8Q7N2j28M5n8J15L3
4175I6j59j8J52q3RP3J27r9q4l7J3n5J04J0k74K60k13K06k45J66kR0M6k03p8O9
4201a29O1N5l4J7l5P8J0j54J45J38j17J01n2k89J91K5L1m3J14k23R1n6J1k6P3
4226a7o1j30J96M4O1r5R9p4k70L83j31J13r8J14k73K63m0J04j15j85K31p5m3j51
4250a50R6J33j05J51k13Q5mr6J51n0n1N9K3q1Q4O4M8K5j63MP4n9j07J91N5j29
$$ plain form
4276 35 -13 -66 100 -82 -61 -111 -118 -87 137 226 -63 9 -91 92 -62 -46 136 130 -43 36 154 106 -29 -119 -196 16
4302 16 -130 -58 -116 -6 -146 -115 -14 39 4 -56 111 101 -87 148 -28 54 127 115 -19 -68 -76 -104 39 34 -46 38
4328 38 -95 6 116 8 55 -105 137 48 -29 -110 17 -55 37 30 151 21 56 -1 -168 131 87 -59 180 54
4352 54 -97 96 33 -47 -162 12 -36 -67 -184 -6 -15 86 28 -76 81 60 58 -38 1 100 -82 88 68 2 30 72
4378 72 -47 28 -62 -38 -81 18 107 -163 9 18 -90 -199 -81 -49 18 -52 21 -84 61 76 30 16 -26 95 13 102
4404 102 -24 -2 -53 49 -47 62 19 -56 -29 -7 74 -49 -3 2 -44 -26 -77 95 -23 -15 -63 -149 -14 -64 162 119 16
4431 16 78 -13 -11 -135 -135 171 84 -75 -2 213 -25 -33 -197 -108 24 -78 -51 -85 -210 211 2 -202 30 64 -2
4456 -2 -5 28 53 141 73 131 130 -26 41 1 -31 -82 81 -128 -84 58 117 -29 8 223 -35 -187 134 -159 -109 -170 -23
$$ packed form
4276C5m8n3J66j82K1n0pL1K24Q9k89P2j00J83j54J6J82oj73P9J18m8j35r0p7K12
4302A6j46P2n8J10j40L1J01N3l5o0J67j0j88K35j76Q2P3j2j34m9qk8J43nq0Q4
4328C8j33J01J10j08M7j60K42q9p7q1J27p2R2pJ21j30L5n7j67K99m4j46K39j26
4352E4j51J93o3q0j15J74m8l1j17J78rJ01n8j04J57k1kr6L9R9j82J70k0o6K8M2
4378G2j19P5r0K4m3R9Q9k70J72Rj08j09J18L2O7p0P3j05J45J5m6j4m2J21q2Q9
4404A02j26K2n1J02r6J09m3p5K7K2Q1j23M6Nm6J8n1J72j18Qm8q6J35n0K26m3j03
4431A6O2r1Kj24%L06q7j59P3K15k38qj64Q9J32j02K7l4j25M21k09k04K32L4o6
4456blL3K5Q8o8N8jj56O7m0l2n1J63k09M4J42N9j46L7K15k58j52L21k93N0o1J47
$$ plain form
4483 -23 118 56 -42 -251 -97 56 63 -95 -72 -38 -130 -60 6 -130 9 -11 17 32 163 93 90 -103 40 87 14 71
4509 71 18 -34 82 159 212 90 -24 -6 93 -18 -40 56 53 11 27 18 -71 -125 -113 7 142 7 45 -32 8 -144 -26
4536 -26 -29 158 161 -26 35 68 -92 -9 -96 -7 -170 34 -94 -150 -53 -72 -171 -61 -28 -79 -115 -42 24 83 -66 -169 -10
4563 -10 82 -11 -60 30 97 8 -67 -23 -32 61 -169 -206 -52 66 -85 19 -208 134 -125 -77 -142 -45 17 141 115 31
4589 31 -45 42 168 64 -78 -128 -37 -54 -89 -29 -152 -17 268 -177 -32 42 -10 60 9 120 -10 121 -34 -123
4613 -123 61 31 29 6 -59 110 -39 -3 9 63 -58 -22 -59 -5 12 -60 161 7 197 194 -168 16 75 -9 -8 123
4639 123 107 -30 101 -109 5 -38 29 -43 30 -60 -118 -11 110 57 -171 28 -65 -142 -115 58 -51 149 -28 68
4663 68 14 2 74 63 66 11 -49 64 88 33 -78 56 -14 -7 185 -129 109 -25 43 -72 -80 11 -212 21 -76 -134 32
$$ packed form
4483b3J41o2r8k09J54J53Pj58K3L4r2P0O6j36J39k0K8J5J31p0lj93J43M7p3N7
4509G1n3n2J16P7N3j22j14J8R9j11k2R6lm2J6rq9n4J2J20J35j35L8p7M0j52J18
4536b6lJ87Lj87O1L3j60Q3q7Q9j63K04j28n6R7j9r9J10L3n1l6P3O6N9j49j03J59
4563a0R2r3m9R0O7q9p5M4rR3k30l7J54J18j51J04k27L42k59M8o5R7O2J24k6q4
4589C1p6Q7J26j04j42n0R1j7l5O0j23J35K85m45J45P4n2P0n1J11j30J31j55q9
4613a23J84l0kk3o5J69j49L6J2N4j21L6l7N4J7p2K21j54J90ll62J84N9q4JJ31
4639A23j6j37J31k10J14m3O7p2P3r0n8J07J21n3k28J99r3p7K7J73j09K00j77R6
4663F8n4j2P2j1Ln5o0J13K4n5j11J34p0PJ92l14K38j34O8j15qR1k23K33r7n8J66
$$ plain form
4690 32 97 13 1 -187 261 -42 -3 -29 -42 55 -13 184 52 47 -52 -139 -31 -27 -222 64 44 -146 -96 65 28 -28
4716 -28 -36 -8 -75 138 -94 272 149 -34 26 -120 -86 87 10 28 -45 68 113 -30 53 116 51 -11 -88 59 -233
4741 -233 -96 -130 -140 -14 16 41 -3 210 12 -190 -16 58 -51 -71 -35 121 121 -39 57 -157 -176 -10 131 23
4765 23 -44 -24 -123 74 -161 -19 202 36 51 3 132 43 97 12 -152 99 -2 -138 -86 159 -9 -83 -52 56
4789 56 -156 109 239 99 107 37 -12 -63 -75 -173 25 -76 53 38 66 -18 107 153 -61 -32 11 -4 -44 -27 -87 -52
4815 -52 -8 -81 -1 103 -12 -71 -56 -25 71 -8 84 18 19 -239 -178 6 -3 27 83 -32 -69 170 -36 -171 58 -47
4841 -47 -109 -31 4 -17 113 23 44 94 11 -10 15 94 95 15 -26 -28 -24 47 -5 43 -26 14 -38 118 98 -51 -40 9 -86 -55
4871 -55 -57 -82 94 203 -88 86 5 88 -45 22 -228 -231 -83 187 21 -40 94 -88 -10 -117 101 34 45 -2 43
$$ packed form
4690C2O5q4j2j88M48l03L9k6j3R7o8J97j32nr9q7J08Mj95K86k0j90N0J61l7n6
4716b8qK8o7K13k32L66j23j83O0j46L4J73p7J8p3J13M5j43Q3O3o5o2p7J47k92
4741b33J37l4j0J26L0K5m4K13j98k02J74P4j09k0L6J56%j60R6k14j9J66J41j08
4765B3o7K0r9J97k35J42K21j66J5m8J29q9N4q5j64K51j01j36N2K45j68p4L1J08
4789E6k12K65J30j40Qp0m9n1j2r8J98j01J29j5K8q4J25M6k14K9M3j5m0J7o0L5
4815e2M4p3Q0J04j15n9J5L1R6p9R2o6Jk58O1J84rL0N6j15l7K39k06j35K29j05
4841d7o2P8L5k1J30r0K1N0q3k1K5P9Jq0m1kMP1n2M8o9M0n2J56k0j49J1M9r5L1
4871e5kk5J76J09k91J74q1Q3j33O7k50lJ48K70j66o1J34j82P8j07K18o7J1m7M5
$$ plain form
4896 43 77 103 -30 -114 -19 4 -148 52 25 -73 -1 -167 -212 8 88 127 155 4 62 -53 5 -121 -81 48 -38 -89
4922 -89 30 -2 11 -51 -50 -41 -26 -112 -16 95 -86 -67 63 190 147 -110 -69 -45 -7 -12 -43 7 -5 39 -10 -80 40 115
4950 115 112 -124 -58 -35 -19 -62 -91 -15 100 66 76 -158 -32 -89 -39 -45 13 25 59 -69 -125 -126 55 78 -173 196 -50
4977 -50 117 -28 -16 17 -50 -56 -69 -6 -7 -71 70 -176 -48 5 3 38 19 132 -7 -17 -145 -31 -206 2 104 -17
5003 -17 174 75 -103 -17 -80 -110 -108 -112 -44 116 -110 -19 164 106 44 34 -96 48 -51 54 62 -64 -118 -235 -100 85
5029 85 42 -117 135 74 70 245 80 -151 -40 -41 54 68 -77 -79 89 45 53 93 -101 -18 -30 50 58 -22 32 65 -12 -21 -54
5058 -54 -117 78 109 -1 52 -42 -78 -49 -11 7 -64 34 -153 9 -20 23 63 31 -37 113 -67 40 1 -98 94 -181
5084 -181 83 -10 53 35 -100 -112 34 7 -220 52 -86 115 -11 151 100 50 -94 -63 -117 143 -53 -10 100
$$ packed form
4896D3L4K6j33q4R5K3j52K00k7r8P2j66m5K20Q0L9K8j51N8j15N8j26M0J29q6n1
4922h9J19l2J3o2JRJ5q6R6J11j81J9J30J27m3k57M1K4L8nl1N0j2M4m9p0J20P5
4950A15lk36O6K3J6m3k9P6J15l4J0k34J26n7N0oN8J2L4j28n6jJ81K3k51L69k46
4977e0J67j45J2L3o7oj3O3jo4J41k46J28N3kL5j9J13j39j0j28J14j75K08J02j21
5003a7J91r9j78Q6o3l0KmO8J60k26R1J83n8o2j0j30J44r9J05Qj26n4j17J35J85
5029H5m3j59K52o1mJ75j65k31J11jR5J4j45kJ68m4QM0j94Q3j2Q0Qq0N4L3p7rl3
5058e4o3J95L1j10N3r4l6K9L8J8p1R8j87J62k9M3M0l2o8J50j80J07l9r9J92k75
5084a81K64r3O3j8j35j2J46k7k27K72j38K01j26J62n1n0j44L1n4K60j96M3J10
$$ plain form
5107 100 110 47 -12 -46 36 -98 46 -42 76 137 6 -85 119 -161 12 -92 -28 83 -143 -163 68 -66 -87 -12
5131 -12 -214 94 125 -60 -164 -39 -13 33 -11 91 -103 -7 76 6 -29 136 -132 16 -5 80 65 60 82 14 53 81
5157 81 82 -24 68 -13 237 -101 40 -30 -86 -102 7 133 -34 -75 1 -54 -78 -31 102 -86 51 101 -63 49 -12
5182 -12 -10 -58 -68 -8 -138 -105 -76 -15 106 242 -8 -82 99 -97 -63 -8 26 13 -30 35 -94 35 78 -28 1 -19
5208 -19 12 37 -79 12 34 -51 -107 -130 162 -108 101 -119 22 83 -63 86 101 -113 79 106 -27 119 -56 14
5232 14 -20 -14 3 -115 109 59 2 -101 -77 -14 140 108 24 -21 92 66 68 -167 -90 116 -17 67 166 66 -17 -98 -69
5259 -69 -13 83 -153 -54 -96 112 -67 -15 27 10 37 52 2 -28 111 -90 24 -15 181 142 -15 -35 157 224 -8
5284 -8 92 -53 -57 65 -164 90 -18 -89 -173 63 -121 111 205 -54 95 -65 -29 -199 -112 -26 50 3 29 49 -88
$$ packed form
5107A00J0o3n9l4Q2j34J44q8J18O1j31r1K04k80J73j04O4J11k26k0K31j34k1P5
5131a2k02L08L1j85j04J25K6M6m4J02j94R6Q3p0l5J65k68J48k1Q5j5nK2o8L9K8
5157H1Jj06R2q1K50l38J41p0n6j6J09J26j67m1P6n5k4M7J33j88J37N0j64J12o1
5182a2Km8j0O0j30L3K9O1J21J36k50p4J81j96L4N5L4j3m3O5j29J29M3j06K9k0
5208a9L1K5j16R1K2q5n6k3K92k70K09k20J41O1j46J49J5k14J92K7j33J46j75P0
5232A4l4OJ7j18K24n0n7j03K4O3J54l2q4m5J13k6Kk35P7K06j33Q4R9j00q3q1K9
5259f9N6R6k36R9m2K08j79N2M2j7K7J5n0l0J39k01J14l9J96l9j57k0J92O7k32
5284hJ00j45mJ22k29K54j08p1q4K36j84K32R4k59J49j60L6j70Q7Q6P6m7K6K0j37
$$ plain form
5309 -88 -101 152 -119 -109 -23 9 -76 148 -186 -23 -80 -30 20 -128 125 135 -48 -46 109 26 -2 40 54 -56 -118 -25
5335 -25 242 90 -96 0 85 -113 -16 54 1 -79 6 158 235 -100 82 -33 -89 -117 -25 -85 -30 56 84 29 -112 -45
5361 -45 -17 -81 -2 -151 -31 178 111 -47 -4 75 -10 -64 -189 59 -42 100 93 -131 136 -80 -65 23 73 150 -134
5386 -134 -31 -5 -108 -3 71 -126 -71 85 -27 215 -43 -118 46 -25 17 -87 51 91 -11 -46 -24 -15 109 59
5410 59 -47 86 5 -38 -28 -24 81 -79 -33 -26 30 -86 -100 46 128 -50 66 -48 37 10 294 -57 -19 -97 -60 -118
5436 -118 -42 -60 -14 -52 -6 4 -90 -38 -4 -21 -66 104 41 -123 -24 119 -34 35 47 118 160 -98 173 51 -14 115
5462 115 -88 -79 -52 -68 -55 106 178 -207 -53 -20 -22 -19 -69 -118 -11 -20 23 84 -129 91 33 15 -23 31 44 -192 -4
5489 -4 81 54 -82 56 21 27 51 -55 135 41 -8 161 51 174 46 -101 -115 134 -25 -63 0 -94 -9 -64 157
$$ packed form
5309h8j3K53k71J0Q6L2q5K24l34J63n7N0N0j48K53J0j83KJ55q3k8M2J4j10o2R3
5335b5K67j52j86R6Q5j98R7P0n3q0Q5J52P7l35J82j15n6k8R2o0N5Q6K8n5j41O7
5361d5K8o4P9j49J20K09o7j58M3P9q5n4j25K48j01J42pk24K67k16J5Q8N0P7k84
5386a34J03K6j03J05P4j97N5J56j12K42k58p5J64p1M2j04J38M0j02l5K2RJ24n0
5410E9j06J33q1m3J0MJ05j60M6PN6j16j4J46Q2j78J16j14Q5k7K84l51L8p8L7n8
5436a18P6j8M6l8M6J0r4N2L4j7m5J70o3j64R9J43j53O9J2P1M2k58K71j22o5J29
5462A15k03RK7j6J3J61P2l85J54L3kLn0m9J07rM3O1k13K20n8j8l8N4J3k36J88
5489dQ5k7j36J38l5OK4j06J90r4m9J69j10J23j28j47j4K49j59l8O3r4Q5n5K21
$$ plain form
5514 157 -36 172 -36 -100 14 9 34 -2 45 97 -113 3 -38 25 34 -51 -193 19 -91 91 123 -166 -64 -57 48
5539 48 -145 105 -74 115 -85 19 -107 -279 -225 -191 36 -11 144 -29 -134 -32 -132 -152 47 63 27 -106
5561 -106 79 12 20 -28 -39 53 149 196 61 135 -24 -9 211 3 181 -60 -23 -96 57 -114 -53 79 70 -2 33 34
5587 34 90 160 39 61 21 -79 54 106 -66 -45 -50 180 -9 -35 -115 13 -124 159 -87 66 -35 135 -135 -54
5611 -54 83 34 92 86 -3 39 171 -79 -72 22 -196 -39 -117 29 65 54 -95 88 120 35 7 47 8 -19 101 -102
5637 -102 -9 88 2 10 26 2 -166 -173 135 -69 -9 -85 -91 -50 -10 243 61 -11 43 160 85 91 26 25 46 140 75 -66 97
5666 97 -97 166 -7 -145 113 191 -93 5 21 -154 18 5 175 -59 25 -70 61 -73 -136 -28 -57 13 19 -72
5690 -72 -121 74 -131 136 145 -8 -82 109 -83 -47 -33 98 182 -259 26 -166 -20 -49 -76 60 -120 35 -20 -4
$$ packed form
5514A57j93K08k08o4J14nK5l6M7N2k10J16m1O3Rq5j42K12j10J82L2k89J02PJ05
5539D8j93K50j79J89k00J04j26j72N4L4K27m7J55j73j05J02j00k0J99J6l6j33
5561a06J85o7Qm8j1R2R6M7j35P4j59J5K20k08J78k41L7p3J53j71O1J32rp2L5J
5587C4N6P0j21K2m0j00J33N2j72K1nK30j89k6q0J28j37K83k46J53j01J70k70Q1
5611e4J37m9N8oq9M2J32k50PR4k18J57p8J46L6j1j49J83L2q5k8M0l9k7J20k03
5637a02R3R7q6QJ6k4j68pL08k04O0p6oM1M0K53j82p2N4J17p5Oo5jK1R4o5j41J63
5666I7j94K63j73j38K58P8k84R8J6j75J72j3J70k34Q4r5J31j34o3J08k9P0Or1
5690g2m9J95k05K67Rj53p4J91j92L6J4J31Q4m41K85j92J46k9k7J36j80J55n5J6
$$ plain form
5714 -4 131 -71 81 30 78 137 10 71 73 0 47 94 57 -179 -68 30 42 74 41 -146 104 59 13 -88 25 56
5740 56 -50 -20 -85 -31 45 -114 157 10 -93 20 -56 34 47 85 67 11 -42 -56 -56 -2 -152 -39 -95 129 -65 5
5766 5 -43 83 32 -103 145 -34 60 168 104 -45 90 -10 92 2 -186 -9 -92 -40 -75 124 -102 -67 7 -59
5790 -59 -9 147 -266 68 -62 114 -78 78 16 -148 -67 -101 53 224 90 -121 25 23 80 -1 -107 0 -178
5813 -178 96 -44 -15 9 -124 48 54 1 -142 -92 -13 -24 -10 159 114 24 98 96 118 -5 65 -78 -122 219 15 131
5839 131 61 -128 98 3 66 75 -59 -36 120 -62 -41 -31 62 -3 56 27 -51 159 16 -25 -78 -245 30 74 22 -92
5865 -92 -185 -111 53 -81 85 23 -23 6 103 -177 -78 46 34 -143 44 33 -76 -31 -22 -57 -45 45 -195 -95 -107 44
5891 44 -39 52 69 -49 -44 -8 43 -18 81 10 125 -30 -154 -254 -44 -47 -107 10 84 23 45 -22 179 -114 -85 -146 3
$$ packed form
5714dJ35k02J52n1M8N9j27O1Kp3M7M7l7k36J11R8J2L2l3j87K50m5m6j01J13L1
5740E6j06L0o5N4P6j59K71j47j03J13p6R0J3L8j8n6n3j4%N4j50J13n6K24j94P0
5766Em8J26n1j35K48j79R4J08o4j49J35j00J02r0j88J77q3N2l5J99k26L5P4o6
5790e9N0J56m13L34j30J76j92J56o2j64Q1l4J54J71j34k11J46kN7q1j06J07j78
5813a78K74j40K9K4j33J72On3j43N0P9j1J4J69m5r0P4kK2j23P0j43m4L41k04J16
5839A31p0j89K26r5O3Rj34K3J56j82K1J0R3o5N9k9p8K10j43m1n3j67K75M4n2j14
5865i2r3P4J64j34J66o2m6K9R7k80R9J24j2j77J87j1j09M5Rl5J2R0k40J00j2J51
5891D4q3R1J7j18NL6N1o1R9p1J15j55j24j00K10lo0J17P4o1K2o7K01k93K9o1J49
$$ plain form
5918 3 -76 -88 72 -23 -68 49 70 95 6 14 -70 50 230 56 -10 -68 120 -82 15 -24 31 -73 -1 -83 -18 128 -305
5945 -305 80 -9 -86 -23 -23 18 16 28 -71 -42 56 55 91 224 24 180 102 44 -60 64 -121 -81 -96 -7 -77 -22 -29 18
5973 18 -51 109 14 -18 73 -163 48 52 -83 -36 -79 -107 72 13 146 -69 4 -124 -52 -202 -4 66 -213 -120 2
5998 2 40 -23 129 -6 -51 75 158 14 -90 15 -70 94 -62 -41 8 63 2 240 195 15 -5 -17 89 -49 233
6023 233 -89 40 43 -167 -96 -78 34 33 -45 -3 67 8 113 100 -1 -29 -147 -163 87 53 39 125 78 12 -49 -4 88
6050 88 72 -77 -147 39 -35 -114 115 47 -27 -105 -136 -34 188 -39 -89 -45 -161 -108 165 -12 25 101 -199 140 42
6075 42 20 20 45 67 24 151 77 139 -68 1 -11 -137 180 -44 -75 -108 -69 21 12 109 29 -80 78 17 130 -53 18
6102 18 80 -4 -8 -105 102 79 96 -50 57 -40 -51 -93 30 7 -3 -92 -52 50 56 11 49 -45 40 15 -60 -79 -104 -86 -199
$$ packed form
5918Cp9j2J60r5m5J17K1K5q9Qq4J20J80j74o6n8J88k02R7l9N5j04P2q2O5J46m33
5945c05L85q9p7O3%M1kJ2r9K9R8jL6J33k00J56p8n8j04J24j85M0j5Q9p0N5pM7
5973A8o9J60r5l2R1k36K11Mj35M7m3k8J79n9J33k15P3j28P2j50J98P0k79R3J22
5998BL8o3J52j35m5J26Q3j44j04J05q5J64j56K1M9N5o1K38m5j80k0j2J06j38K82
6023B33l22J29Lk10P1J8J12jp8M2P0n9J05j3j01k8j18j6K50l4j4Q6m7o6o1M5R2
6050H8j6j49p0J86p4p9K29o8p4p8l1J02K22k27n0M4j16N3K73j77L7P6l00L39r8
6075D2k2%K5K2m3J27p4O2k07O9j2j26L17k24l1l3L9R0rR7q0j09J58o1J13j83P1
6102A8O2q4mr7K07k3J7j46J07r7j1m2J23k3j0q9M0J02Om5L8r4Q5k5p5j9k5J8j13
$$ plain form
6131 -199 55 -112 -29 -26 50 -2 -74 -36 68 69 12 26 -13 106 -84 121 127 -2 48 -4 -127 43 175 98 66 15
6157 15 -32 22 -55 -150 -122 0 123 -68 -84 -30 17 132 8 -50 -19 -125 20 -295 12 -121 -41 -78 2 68 109
6182 109 166 120 -85 -17 127 -26 -51 162 -101 -161 37 70 -8 -8 -116 25 -37 -33 -82 -85 30 106 -100 -57 -17 9
6208 9 113 -14 13 66 134 -125 1 -94 -101 57 96 -53 -35 22 -39 64 82 -73 -78 93 36 -45 31 -41 -189 -137 -212
6235 -212 -39 -67 -128 62 -32 -98 85 89 -4 66 -121 -79 -89 -15 22 -111 -143 -75 -147 11 32 -87 -13 -51 63 -15
6261 -15 155 58 83 7 -107 -55 51 -15 -113 46 98 -120 -134 29 -206 -116 27 59 -97 21 -36 132 -205 -47
6285 -47 -28 26 73 -164 28 -42 12 -102 -29 -15 31 -29 -396 -177 36 18 20 35 -49 131 -75 -35 -152 -26 1 -142
6311 -142 -99 -23 228 -30 17 27 -33 95 -136 148 -65 -103 -21 -67 170 88 31 -111 52 42 -3 118 41 117 34
$$ packed form
6131a99K54j67Q3LP6n2p2L8J04Jn7J4l9J19j90K05Oj29N0n2j23J70J32p7l2n1
6157A5m7N4p7r5K8J22J23j91j6N4M7J15j24n8L1j06J45l15L07j33Q0l7Q0O6M1
6182A09N7m6k05O8J44j53k5K13k63o0J98L3p8%j08J41o2Mm9lJ15P6k06M3M0K6
6208IJ04j27K7N3O8k59J26r5pJ58L9j49J8N7o1J03J8j55nJ71n7q1P6p2j48N2p5
6235b12J73k8o1J90r4o6J83Mr3P0j87M2j0P4L7j33l2O8p2J58K1j19P4l8J14p8
6261a5J70r7K5p6j14N2J06o6r8J59N2k18j4J63k35R0J43L2j56J18n7J68l37J58
6285d7J9N4M7k37J92p0N4j14P3J4M6o0l67K19K13j8KJ5q4J80k06M0j17J26K7j43
6311a42M3P6K51k58M7J0o0J28k31K84k13l8Q2m6K37q2n7j42J63j0m5J21p7P6q3
$$ plain form
6336 34 66 -86 53 132 -1 -132 45 58 -21 -21 -67 -28 41 70 -134 72 36 -82 -128 -26 -29 -135 -175 42 54 10
6362 10 -201 -27 112 -167 -55 37 -18 45 -53 -85 -64 101 62 102 36 32 -196 49 43 -126 -25 -7 161 66 22 76
6388 76 19 -8 -80 194 -47 8 -259 -74 217 10 -80 33 79 -172 16 -43 21 -40 -36 -13 158 -298 80 39 163
6413 163 -76 32 102 -152 -29 48 -87 39 -38 -89 -38 103 -93 37 100 106 64 4 4 28 37 180 -25 99 -81
6438 -81 -50 85 -141 -5 -118 106 -88 -76 -93 -3 58 13 -73 -47 88 187 53 -112 119 184 -61 11 158 34
6462 34 146 -87 64 73 -96 -189 107 0 -32 -171 76 50 16 -2 15 -20 -68 74 -43 -24 -104 -136 -85 172 -29
6487 -29 46 132 36 -90 -9 -65 23 89 32 -16 93 148 -28 -43 -101 -16 -113 44 -66 -49 -57 -47 -91 107 23 89 -73
6514 -73 -69 42 98 -77 -123 -44 -59 -37 18 -135 -58 8 154 122 -19 88 -13 111 28 -19 -130 -17 63 53 96 1
$$ packed form
6336C4L2j52J39P9j33j31J77J3p9%m6L9O9K9k04K06l6j18m6J02lj06m0K17J2m4
6362A0k11J74J39k79J12R2n5O3r8l2K1J65l9M0o6mk28K45oj69J01J8J68r5m4N4
6388G6n7k7p2K74k41N5k67J85K91k07r0J13M6k51J88n9O4o1MK3J71m56L78m1J24
6413A63k39J08P0k54J23P7j35J26p7n1N1J41j96J30O3Om2o0%K4RJ43k05J24j80
6438h1L1J35k26J36j13K24j94J2j7R0O1m5q6K6J35R9j34j65K31O5k45P2J47j24
6462C4J12k33J51Rj69r3K96j07l2j39K47k6l4j8J7l5m8J42j17J9q0l2N1K57k01
6487b9P5Q6r6j26Q1n6Q8O6n7m8J09N5j76j5n8Q5r7J57j10J7qJ0m4J98q4O6j62
6514g3MJ11N6j75m6P9j5K2N5j53P7O6J46l2j41J07j01J24q3m7j11J13Q0j0M3r5
$$ plain form
6540 1 8 118 -58 7 15 -106 163 79 -103 -46 135 109 -19 17 18 -41 28 71 121 222 -110 51 -85 74 108 -39
6566 -39 -58 70 161 89 49 3 -15 -71 -60 138 -45 71 9 -118 70 56 28 5 10 -102 -49 7 -102 8 -42 308
6592 308 4 6 86 37 17 10 -80 13 -141 -37 -25 -52 -55 15 76 -3 8 -210 25 -38 61 18 -69 180 11 -119 73
6619 73 112 52 -157 -35 -79 -43 22 -12 79 13 -67 -134 19 -13 97 -67 162 78 -121 87 119 199 -26 172 -7
6644 -7 -32 -100 -31 162 55 84 -103 -79 35 -21 -148 12 67 -57 49 -109 -154 4 -3 14 -10 -38 -17 -26 -87 -58 -9
6671 -9 95 -114 -145 121 -143 -186 67 83 109 -93 29 -13 261 71 -104 -63 34 124 -4 68 54 -1 -50 63 -124
6696 -124 -67 -2 -48 -178 -28 -35 -57 -99 -36 -72 60 -106 -47 106 6 -38 72 -58 -50 -113 155 91 104 38 54 -24
6722 -24 79 -22 21 -29 26 -149 64 -90 -4 125 2 -11 87 118 -132 -10 37 -50 21 -5 39 4 141 -79 -90
$$ packed form
6540APJ10j76O5Qj21K69q4j82N7J81k6j28L6Jn9O9M3N0J01l32J61j36J59L4j47
6566c9j9J28R1p2m0m6j8n6J1J98j83J16o2j27J88j4k8k3Nj12N3N6j09J10n0L50
6592C08l04KQ0m9k0pr0R3j54J04J2k7lP0O1p9J1k18K35o3R9m3q7K49j69j30J92
6619G3L9o0k09J22m4L6O5l4R1o6q0o7J53l2J10j64K29q4j99K08L2Q0k25J98j79
6644gk5o8O9J93j07K9j87K4J14n6j27J60N5j24J06j58m5J58pJ7k4k8K1ro1K9M9
6671iJ04k09l1K66k64m3K53J6K6k02J22m2K74j90j75M1R7R0j28P2j4n5m9J13j87
6696a24N7O5m6j30J50pk2m2O3l6J32j66N9J53j00m4J10j30Qo3K68o4J3o6J6p8
6722b4J03j01M3n0N5j75K13j54Q6J29j23j3R8L1k50J22M7q7P1k6M4l5J37k20j1
$$ plain form
6747 -90 38 -79 -78 -76 -30 -49 -160 122 52 27 228 27 -66 -14 132 43 -7 -27 -82 -69 -18 -24 -109 -79 111 -76 80
6774 80 -22 42 64 -42 11 8 -33 -101 84 58 60 111 65 71 142 -180 104 -97 -40 97 191 -48 -59 -54 103 -77 17
6801 17 80 -44 34 37 -68 -57 -74 -15 43 -115 159 107 149 -151 8 -77 -26 -30 71 -16 83 176 71 25 169 31
6827 31 -48 -40 -8 211 -60 -79 45 -43 129 9 -278 -26 -14 -150 148 6 87 -32 179 -54 47 -130 182
6850 182 -2 -131 -20 -52 137 -2 12 -192 -123 50 124 37 -63 78 51 137 -41 -99 -35 117 5 -26 -106 8
6874 8 45 -32 -34 -145 18 75 -76 78 61 -2 -60 -97 117 83 -12 142 -137 -59 -64 38 95 -81 -140 -30 -203 -96
6900 -96 -13 -6 25 -12 80 -12 14 -128 126 77 -180 30 80 -37 -35 59 24 16 41 23 -52 158 88 58 141 -56 99 219
6928 219 -1 25 35 -107 -67 -152 68 73 41 53 -32 -54 -133 90 81 61 -84 -246 -76 -18 59 38 118 56 -114 -130 14
$$ packed form
6747i0J28j17JKM6j9j11K82p0k5K01k01r3N2J46q9n0k0n5J3N1oq5L0J90j87J56
6774H0j02O4K2j06N3lm1o8J85k6KN1m6OP1l22K84k01N7J37R4k39j1NJ57j80R4
6801A7O3j24P8Lj05J1j7N9N8j58K74n2M2l00J59q5N1mJ01q7R9R3j05m6J44j38
6827C1p9QL2K19k71j9J24q8J72j20k87K52J2j36K98j42Q1j19K11k33J01j77L12
6850A82j84j29J11l2J89j39J4k04O9J73P4q7j00J41k7Q6j78n8O4J52j12l1q0J14
6874HL7p7kj11J63N7j51J54j7o3n8l7K14l4r5J54k79P8nJ02N7j76n9J10j73J07
6900i6Q3PL1l7R2r2K6j42K54m9k57K10N0j17KR4l5qK5j8p5K10p0l0Q3j97J55J20
6928B19k20K6J0j42M0q5K20Nl2J2q5k2p9K23rk0j45j62J70N8P7k1Q0o2j70j6J44
$$ plain form
6955 14 -25 55 59 -54 -96 76 -60 13 -117 -50 -68 62 74 -4 -56 -71 22 -30 -59 -33 25 -11 66 55 90 162 -3 -12
6983 -12 -8 -10 -60 -41 14 188 -101 -8 -41 -170 -106 57 -113 3 36 43 72 -164 9 9 -61 -111 113 64 107 11 -109
7010 -109 26 107 -3 -159 40 171 29 133 38 15 143 -65 -20 -64 -4 102 -131 -52 56 83 -63 -91 30
7033 30 -6 -6 -28 0 233 156 -69 -98 -92 211 -65 -20 16 -51 -56 -38 -103 9 134 56 136 48 -106 60 48 33 36 -3
7061 -3 20 -36 240 7 87 4 144 1 -54 -254 211 -38 64 -93 101 -150 -19 41 -157 1 -40 -41 -95 -184
7085 -184 -119 -90 -62 26 11 -46 60 157 65 -91 75 -2 -119 94 -131 3 -126 -50 -57 -46 73 -25 7 76 150 -156
7111 -156 61 -142 105 -66 -27 25 64 56 146 -72 43 81 30 90 -30 132 36 108 -97 93 -35 -102 20 69
7135 69 -5 152 -32 -3 83 -249 -163 109 -5 8 15 -96 20 -84 51 48 -142 42 0 -94 75 94 -21 -15 20
$$ packed form
6955A4l9Q0Mj13m2J72j36P3j30O7j8J30J2p8n2j5R3n2k9K6N8l6P7j1L5P2j65r
6983a2Mkn0J9N5J74k89R3l3j29O4J63j70J16L3PK9k36J73%p0n0K24m9M3r6j20
7010a09J35Q1j10j56J99J31j42J04r5k3J28k08M5m4O0J06k33P9J08K7j46k8J21
7033C0l6%k2K8K33p7k25k9OL03k76M5L6o7nJ8o5J12J25p8Q0q8j54J66j2j5Ll9
7061cK3n6K76k33Q0q3J40j43n5k00M65k49J02j57J94k51J31O0j98J58m1jn4q9
7085a84O5K9K8Q8j5n7J06R7r2j56J66p7j17K13k25J34j29P6pJ1J19r8L2O9P4l06
7111a56K17k03K47j71L9N2L9qR0k18J15L8n1O0j20J62r6P2k05J90j28o7J22M9
7135F9p4J57j84K9Q6l32Q6K72j14J3Pj11J16j04J35lj90J84m2r4J69J9j15OL5
$$ plain form
7160 20 -48 135 4 -86 28 142 24 -127 106 101 112 50 -9 64 112 -63 169 -53 -83 -73 23 -41 125 -113 -224
7185 -224 -26 63 29 15 11 -124 3 37 23 61 -70 187 33 55 -86 100 8 -24 44 -89 -61 -99 -24 31 -15 102
7211 102 37 -188 -95 -54 38 6 81 -112 2 19 1 -51 -12 6 16 118 220 -148 -11 78 -31 -13 -49 -19 27 -16
7237 -16 98 84 64 60 -9 53 -33 -5 -23 -63 -67 -79 54 -56 -69 116 13 78 107 -63 -90 -23 -154 -22 -23 46 -89
7264 -89 2 111 -78 -60 8 72 22 15 62 39 169 65 206 -52 56 -64 -49 45 88 -63 103 0 13 56 148
7289 148 62 -35 -147 145 83 -37 -41 61 -64 40 217 140 -60 -49 -15 -72 -26 89 -14 -31 72 114 85 -33
7313 -33 -164 197 -97 133 15 12 114 62 -69 46 81 -4 111 -96 44 -41 -23 108 -10 49 -32 -130 -7 128
7337 128 -38 140 -101 89 -114 -16 28 -62 27 -54 -184 9 3 -21 102 58 -20 63 -88 56 27 23 -16 47 -29 34
$$ packed form
7160B0o8J83j31r0J14J14j18j51K33nJ1o2n9P3M8j75K32k22l0J0R6o4J66k38j11
7185b24J98Q9l4j4mj35J27L4j4L8j31K57j54K2j41J86r2l2O8j33K8l8P5N5m6J17
7211A02o5k25R3M1R2l2P5j93J14J7j8n2L9J8J0J02J02l68J37Q9j09J8l6L0M6m3
7237a6J14j4k0mo9O2q6K8j8m0mj2J33j10j3J85j03O5K9j70k7O7j31J32jO9j35
7264h9R1J09j89J8O8O4n0pM7k3J30j04J41k58J08j20J5R4M3j51J66j03J3M3R2
7289A48q6r7j12K92o2j20mJ02j25J04J77p7k00J1L4n7M6J15j03j7J03M2k9j18
7313c3j31L61k94K30j18lJ02n2j31J15L5q5J15k07J40q5J8J31j18N9q1r8J23J35
7337A28j66J78k41J90k03R8M4r0Q9q1j30J93ok4J23m4p8Q3j51J44k9ml9O3p6O3
$$ plain form
7363 34 39 -229 -118 -30 -50 110 47 48 -92 76 5 -22 -107 38 -77 76 117 -60 117 18 51 -87 -106 45 -92
7388 -92 -97 122 34 -2 35 74 -159 -62 -52 80 99 27 -76 115 35 -24 -58 -24 -44 -81 148 -61 -13 -48 -178 52
7414 52 25 -47 -82 85 37 11 -34 -11 56 110 17 44 26 -110 95 -85 -16 -11 50 -53 -93 -30 75 78 6 212 139 184
7442 184 41 -60 107 31 105 1 -31 -65 26 -47 -95 51 195 153 -51 -82 106 24 -9 68 70 -14 128 -58 -39
7467 -39 -129 166 56 -89 -13 -65 -54 -26 -4 -52 15 64 -54 -37 18 -16 -93 31 -145 229 29 42 -184 31 -52
7492 -52 -58 92 80 5 -44 71 -65 -72 108 86 -31 -50 -17 -129 10 -58 35 16 95 69 -52 92 -59 -86 -13 200
7518 200 -51 -88 75 -129 99 -43 141 -9 90 -89 -135 -166 165 -6 -128 87 -112 123 -122 -75 -13 83
7540 83 22 -74 -51 2 106 78 52 -63 13 132 100 6 -18 -42 -22 88 -233 -11 -158 12 -63 104 -11 -1 -51
$$ packed form
7363C4Nk68J11Q8k0J60o3Jj40J68p1k7q5J45j15J53M1j77J77r9L3j38j9J51j37
7388i2nK19q8l6L7L9k33R7J0J32J9p2j03J91q0n9l4L4k0l7K29k09M8l5j30K30
7414E2k7p2l5J67m8k6m5K3O7N4r3K7j8j36K05j80O9NO1j03m0O3J05Lp2K06p3M5
7442A84j43j01J67p6P4j04l2l4R1p3m8J46J44m2k04l1J88q2l3P7Kq4J42j86J9
7467c9r0K95j10j45P6n2J1K8K2m8O7M9j18J7N5l4p7J24j76L74k00J3k26K15q3
7492e2oJ50j2p5m9J15j36pJ80k2j17j9L3j12J39o8R3j9P9k6j21J44j51k7P3K13
7518B00k51l7J63k04K28j42J84j50R9j79m6l1L31j71j22K15j99K35k45M7O2R6
7540H3o1r6K3N3J04k8k6j15P6J19l2r4k4k4K0J10l21K22j47J70p5J67j15J0n0
$$ plain form
7565 -51 -66 19 11 94 -76 -124 104 52 145 -20 -115 108 81 -19 136 -86 -184 20 -104 5 -23 31 -30 -134 57
7590 57 86 3 70 -6 -34 -87 61 -58 -99 54 74 -79 83 25 -121 23 -7 -33 58 -22 -31 -185 -15 -25 -22 -8 30
7617 30 -126 156 -16 61 64 -24 174 -118 60 44 29 22 3 -29 92 -112 -337 21 -15 89 0 -95 -101 38 69 63
7643 63 1 103 -34 -98 -58 124 60 75 -111 -95 14 -10 -12 76 -68 63 166 102 55 -126 -84 -58 -18 49 212 59
7669 59 54 -64 141 -4 36 15 101 96 -58 -87 35 -57 0 75 -25 51 -26 18 -56 -2 -51 30 110 8 70 33 -175
7696 -175 143 51 -21 16 -30 -78 50 50 61 126 152 141 0 161 89 62 -148 -7 12 23 200 -38 -35 -29 172 -5
7722 -5 -138 -183 -108 -65 -10 -229 -85 -145 -60 208 -77 -8 -11 -101 -135 -57 10 106 99 100 9 193 116 -12 170 -13 -75 -77
7750 -77 -27 41 17 90 -145 125 144 -45 -99 -55 -17 73 23 -1 120 68 -73 -16 113 -64 -73 -73 13 96 48 -194 59
$$ packed form
7565e1j5Q5qQ3j70m8K28n2R3j65r5K23k7j00J55k22r8K04j24J09k8N4o1j04J91
7590E7K9q3O7p6k8n3J48j19m1J53K0j53J62n8j46J44l0k6R1q0rj54J70j0LJ4L8
7617C0j56K82j72P7Lq8J98k92J78j6j5pj9l2J21k04k25L58l6J04q9r5oJ39L1o
7643F3o2J02j37o4M0J82o4J5j86J6J09k4kQ8j44J31J03o4m7j81M2K6M0O7J63j53
7669E9nj18K05j45M0k1Q6nj54k9J22r2N7P5j00P6p7M4p4N4m9Q1Q0j02O2l7k08
7696a75L18r2p2L7m6m8J28%J1O5K6j1j41J61p2k7k10J41J9J1J77k38LOK01j77
7722ej33m5P5M3N5k19J44o0Q5K68k85O9lr0l4P8O7R6pJr1J84p7j28J82j83o2k
7750g7N0O8k4P3k35K70J9j89n4M4L8R0n0k4J21n2j41N7J29j77r%Q6Q3m8k42K53
$$ plain form
7777 59 47 40 -18 -18 -108 210 -39 -41 68 -30 -40 138 62 -14 -109 -43 21 -70 -4 35 37 -65 -59 116 97 186 -168 47 69
7806 69 42 -24 -23 42 -43 -40 134 116 44 45 -146 -80 92 -2 -163 -77 140 -55 14 89 59 -42 -3 -63 47 -77 25
7833 25 16 12 85 -36 258 22 -16 114 127 10 46 -55 48 129 33 90 -42 -98 134 -22 30 -51 -204 69 -169
7858 -169 -97 -24 58 -83 62 20 92 15 -15 65 10 -153 79 150 15 90 36 53 43 58 51 103 15 48 -168 -3 48
7885 48 41 148 -70 15 27 20 -146 106 155 101 -151 13 44 -118 10 -10 -138 -63 -31 58 -10 47 18 67 -14 -27 46
7912 46 21 159 -182 169 35 -226 -45 -34 25 65 115 -21 110 65 -61 17 54 -76 31 114 97 -104 60 -124
7936 -124 190 -83 -237 24 28 78 42 79 26 -89 101 -61 159 120 -32 -22 151 -35 -61 15 -6 -10 -124 -83 -3
7961 -3 143 -44 -27 -188 -15 -96 -140 70 117 35 -20 60 22 79 -12 -231 -43 32 67 -23 -114 -26 41 -52 -2 -56 160
$$ packed form
7777E9j2pn8%r0L18k49kJ09r8j0J78p6p6r5O6O4r1O6L9Kj02OJ75j9Q9l54K15K2
7806F9k7o6JO5q5LJ74j8p2Jj91O6J72r4j61Q6K17j95O9P5l0j01L9o0J10j24J02
7833B5rmP3j21K94k36l8J30J3j17L6j01J03Q1r6N7j32n6K32j56N2q1j53K73k38
7858a69P2P3Q2j41J45m2P2p7l0Q0n5j63K32P1j35P5n4J7j0J5pN2q8L3k16J65N1
7885D8pJ07k18Q5J2pj66K52M9n4k52J64L1j62J28k0j28P5L2Q9o8N7k9M9q1j3P3
7912D6k5J38l41L51j34k61J81J1N9M0N0j36J31m5j26P8L7j30J07Q3j7k01J64j84
7936a24L14k73j54K61MN0l6L7n3j15J90j62K20l9j52J0J73j86k6P6k1mj14M1Q0
7961cJ46j87J7j61J73q1m4K10M7q2n5Q0l8N7r1k19J88P5L5r0r1Q8O7r3N0n4K16
$$ plain form
7988 160 13 84 -66 125 -71 -74 44 -127 121 -153 -29 -128 124 94 -59 -30 -23 53 112 145 40 8 119 16
8012 16 87 -7 -11 50 -49 -135 157 -118 158 -75 -147 -53 100 -72 78 -29 -11 -6 74 -33 -48 -8 2 -5 -18 -1 -50
8039 -50 -19 26 46 29 60 -104 -15 251 -63 -148 -64 23 5 -33 128 31 -13 64 61 -87 80 -144 135 41 1 -14 -187
8066 -187 87 -35 -57 -98 -113 60 -32 -22 28 -20 -36 -168 -137 -27 13 -25 -46 60 -257 -50 -164 -14 -64 4 -161
8091 -161 143 108 52 -131 -87 -242 -91 109 -2 71 61 -41 107 93 22 -208 -62 166 -17 56 -132 -28 3
8114 3 -16 -82 -119 1 -154 54 3 -149 23 -13 -113 6 64 -76 -224 -58 98 -32 -45 -52 -26 -35 169 -20 -44
8139 -44 12 34 32 -50 -27 4 -45 -118 -178 -71 67 -67 -106 -70 -99 -65 -49 79 -225 -27 -95 1 259 19 -56 -52 140
8166 140 167 20 -15 165 -109 21 -27 -70 -191 -112 -86 33 -35 -112 46 68 -52 -59 171 -81 -40 -111 -29 -119 -74
$$ packed form
7988A60j47P1j50J91j96lJ18j71K48k74J24r9K52l0j53K9PP6N9L3j05l2J11j03
8012A6P1r4mO1r9q6K92k75K76k33p2R4J53j72J50j07J8NQ0j07j5M0J0pj3J7m9
8039e0L1M5K0j7L1j64Q9K66l14q5Q4Q7j8l8J61r7m4P7lj48J67k24K79r4m0j5j73
8066a87K74j22k2m1j5J73r2J0N0m8j6j32L1J10M0l8k1J06l17K07j14J50n0O8j65
8091a61L04l5n6j83M4j55J51K00j11P3j0j02J48j4p1k30J46K28j83P3j88J04L1
8114Cj9o6l7J20j55K08n1j52J72l6j00J19N8j40j48J66J56j30j3pK6rK04j89k4
8139d4N6K2kq2K3L1m9p3o0J07J38j34l9L6k9L4J6J28l04J98o8R6K58k40p5MJ92
8166A40K7j47l5J80k74J30m8m3j21P9K6J19o8p7J58K2j20pK30k52M1p1Q2r0M5
8191g4
$$ Imaginary data points
##PAGE= N=2
##DATA TABLE= (X++(I..I)), XYDATA
$$ plain form
0 0 0 0 0 0 0 0 0 0 0 0 0 0 0 0 8 -8 8 -8 8 -16 16 -16 24 -24 32 -34 40 -48 56 -64 72 -81 95 -105 121 -135
36 -135 152 -170 190 -211 236 -261 290 -322 356 -392 432 -478 526 -580 638 -702 775 -855 947
55 947 -1048 1164 -1296 1450 -1633 1852 -2120 2460 -2905 3514 -4409 5850 -8569 15548 -76373
70 -76373 -133118 -50274 -52338 -27844 6176 38002 22435 9042 2707 23794 35098 28813 28481
83 28481 70934 96049 75277 51463 61232 50818 5589 -31226 -32158 -30793 -43521 -61379 -59100
96 -59100 -40695 -33557 -52296 -57099 -32258 -20524 -41473 -42814 -6493 22598 25632 36676 65389
109 65389 85083 76900 54265 44431 47927 32449 -3646 -17105 319 2132 -21188 -27576 -11833
122 -11833 -15163 -44782 -64372 -57648 -46667 -50247 -53029 -30497 4994 17502 11394 23719 50607
$$ packed form
0@%%%%%%%%%%%%%%Qj6J6j6J6k4L2l2M0m8N6o6P4q8J04j20J36j53J76k00K26k56
36a35K87l22L60m01M47m97N51o12O78p48Q24r10J004j106J218j340J477j630J802
55I47j995K212k460K746l083L485l972M580n365O419p923J0259j4419K4117r1921
70g6373n6745Q2844k064K4494L4020L1826j5567j3393o335K1087J1304o285l32
83B8481M2453K5115k0772k3814R769j0414m5229l6815r32J365j2728j7858K279
96e9100J8405P138j8739m803K4841J1734k0949j341L6321K9091L034J1044K8713
109F5389J9694q183k2635r834L496j5478l6095j3459J7424J813k3320o388J5743
122a1833l330k9619j9590O724J0981l580k782K2532L5491J2508o108J2325K6888
$$ plain form
135 50607 51252 28565 24872 42299 44759 28349 21877 31839 33623 12727 -12879 -18742 -14948 -31052
149 -31052 -55905 -53934 -33232 -32089 -43705 -33567 -8736 -1699 -11884 -10901 7483 21274 17177
162 17177 14132 30936 50451 44370 27774 32346 42958 28196 1590 -4238 2056 -7827 -28527
175 -28527 -34410 -24907 -21995 -35126 -43514 -30792 -15749 -20779 -26735 -9492 11848 11071 4133 15604
189 15604 33092 32842 21600 21868 33881 35878 21403 11056 17479 18302 -1616 -20396 -18130 -13935
203 -13935 -26687 -40166 -33574 -19229 -19520 -27979 -22734 -6185 -1113 -9595 -8427 9883 22497 17449
217 17449 16576 32335 43072 32181 17684 18793 22051 8693 -9767 -11248 -2147 -4659 -18348
230 -18348 -20670 -9976 -10192 -26435 -34695 -24971 -17411 -23329 -24214 -5581 14104 16446 13428 22306
$$ packed form
135E0607O45k2687l693J7427K460j6410o472R962J784k0896k5606n863L794j6104
149c1052k4853J971K0702J143j1616J0138K4831P037j0185R83J8384J3791m097
162A7177l045J6804J9515o081j6596M572J0612j4762k6606n828O294r883k0700
175b8527n883R503K912j3131q388J2722J5043n030n956J7243K1340p77o938J1471
189A5604J7488k50j1242K68J2013J997j4475j0347O423Q23j9918j8780K266M195
203a3935j2752j3479O592J4345k91q459N245J6549N072q482J168J8310J2614n048
217A7449q73J5759J0737j0891j4497J109L258j3358j8460j481R101k512j3689
230a8348k322J0694k16j6243q260R724P560n918q85J8633J9685K342l018Q878
$$ plain form
244 22306 33686 28330 12794 9458 17956 17375 5802 3211 14679 17747 3325 -9154 -8310 -9819
258 -9819 -24837 -37845 -32882 -20213 -17726 -20227 -9973 7607 11153 1194 -431 9588 11439 2079
272 2079 1400 15978 27095 23226 17959 23352 26430 12708 -6892 -12638 -9423 -15805 -27201 -23795
286 -23795 -8728 -3563 -10470 -12159 -3594 -1775 -12844 -19588 -10449 1402 2369 2084 15216 30478
300 30478 29034 17551 15140 18115 10333 -5741 -10541 -2168 1678 -5125 -7856 505 4385 -7120
314 -7120 -19531 -18303 -13081 -18340 -24133 -14240 2654 8635 5697 10364 20968 20332 7603 1050
328 1050 6922 9912 2376 -1157 8664 16475 10136 -8 -290 1438 -8478 -22347 -23166 -14384 -11577
343 -11577 -15769 -11534 2572 8833 2411 -1798 4443 8337 1384 -4392 3656 14275 13882 8571 11895
$$ packed form
244B2306J1380n356j5536l336Q498n81j1573k591J1468L068j4422j2479Q44j509
258i819j5018j3008M963J2669K487k501J0254J7580L546r959j625J0019J851r360
272B079o79J4578J1117l869n267N393L078j3722j9600n746L215o382j1396L406
286b3795J5067N165o907j689Q565J819j1069o744R139J1851R67k85J3132J5262
300C0478j444j1483k411K975p782j6074m800Q373L846o803k731Q361L880j1505
314g120j2411J228N222n259n793R893J6894N981k938M667J0604o36j2729o553
328A050N872K990p536l533R821P811o339j0144k82J728r916j3869q19Q782K807
343a1577m192M235J4106O261o422m209O241L894o953n776Q048J0619l93n311L324
$$ plain form
358 11895 18818 13958 148 -5767 -2392 -4819 -14953 -17575 -8230 -2136 -6932 -10732 -4630 1105
372 1105 -4618 -12260 -8013 1419 1961 -2058 3577 15261 17645 10314 7672 13313 12784 2319 -4240
387 -4240 516 4281 -2200 -8494 -4301 1595 -3790 -12796 -11892 -5275 -6502 -13428 -11738 -1192 3295
402 3295 -1623 -1620 7266 12260 6514 1687 7232 13223 8493 1655 4167 10257 6265 -2997 -3942 1502
418 1502 -346 -9181 -11338 -4622 -2147 -8536 -11935 -5629 -97 -4319 -8309 -2446 6004 4879 92
433 92 3837 11671 10750 2882 1642 7379 7626 404 -2771 3062 6449 397 -5690 -2400 972 -5103
449 -5103 -12840 -10500 -3726 -3863 -8298 -4978 4433 6368 929 -1003 4709 6587 -119 -3969 2299
464 2299 8397 5545 1250 5767 10906 5992 -3429 -5036 -1525 -3736 -10652 -10594 -2128 2181 -2109 -3496
$$ packed form
358A1895O923m860j3810n915L375k427j0134k622R345O094m796l800O102N735
372A105n723p642M247R432N42m019N635J1684K384p331k642N641n29j0465o559
387d240M756L765o481o294M193N896n385r006R04O617j227o926J690J0546M487
402C295m918LQ886M994n746m827N545N991m730o838K512O090l992r262r45N444
418A502j848q835k157O716K475o389l399O306N532m222l990N863Q450j125m787
433I2L745P834r21p868j240N737K47p222l175N833L387o052o087L290L372o075
449e103p737K340O774j37m435L320R411J935n439j932N712J878o706l850O268
464B299O098k852m295M517N139m914r421j607L511k211o916N8Q466M309m290j387
$$ plain form
480 -3496 2496 5375 -1469 -7453 -3852 1387 -762 -3300 1989 10784 11049 4808 3501 6817 4069
495 4069 -5240 -9213 -4050 -425 -3954 -4809 2043 7210 2361 -4167 -3674 -691 -4631 -10675 -7628 1171
511 1171 4821 2346 3767 10666 11599 3052 -2822 -656 409 -4401 -7728 -1618 5770 4867 390 1367
527 1367 4751 715 -8286 -10662 -5324 -3469 -6464 -4667 4338 9614 5756 2148 3924 5230 -652
542 -652 -7178 -4675 1846 2397 -640 2646 9167 8272 310 -3598 -1553 -2632 -8892 -10770 -4610 2078
558 2078 1321 -1025 3342 7661 3623 -4216 -4440 11 -996 -4973 -2730 5176 8468 4453 2398 5317
574 5317 5263 -1913 -7693 -4995 -746 -2848 -5428 -723 5810 4461 -997 -1392 1761 -22 -6017 -7042
590 -7042 -1231 2706 540 -357 5080 8146 3555 -2011 -1044 1567 -1776 -6086 -3850 2157 3467 -383
$$ packed form
480c496N992K879o844n984L601N239k149k538N289Q795K65o241j307L316k748
495D069r309l973N163L625l529q55O852N167m849o528M93K983l940o044L047Q799
511A171L650k475J421O899R33q547n874K166J065m810l327O110P388r03m477R77
527A367L384m036r001k376N338J855k995J797R005N276l858l608J776J306n882
542f52o526K503O521N51l037L286O521q95p962l908K045j079o260j878O160O688
558B078p57k346M367M319m038p839k24M451j007l977K243P906L292m015k055K919
574E317n4p176n780K698M249k102k580M705O533j349n458l95L153j783n995j025
590g042N811L937k166q97N437L066m591n566R67K611l343m310K236O007J310l850
$$ plain form
606 -383 -581 3831 3839 -2304 -5568 -1940 786 -2297 -4268 591 5759 3654 -679 888 4259 1769
622 1769 -3959 -4106 579 1600 -2422 -3208 2102 4230 -615 -3710 -704 2140 -1549 -4836 -1642 3191
638 3191 2178 -1478 98 4584 4067 -843 -1713 2471 3433 -897 -2880 931 3344 -787 -4040 -1776
654 -1776 1264 -1132 -5039 -3314 1479 992 -3317 -2984 1801 2556 -1857 -2630 2253 4480 1616 -303
670 -303 3240 6092 2787 -1624 -700 2480 372 -4219 -3216 1411 1628 -2672 -3230 370 751 -3954
686 -3954 -6244 -2874 143 -1567 -3306 900 5887 4697 987 2006 4930 3064 -1922 -2503 1891
701 1891 3179 -23 -652 3286 4630 287 -4066 -3085 -1518 -4649 -8065 -5215 271 861 -1339 463
717 463 4641 4197 -752 -2788 450 2163 -990 -1560 3225 7071 5114 1751 2828 4193 23 -5626
$$ packed form
606c83j98M412Qo143l264L628K726l083j971M859N168k105m333J567L371k490
622A769n728j47M685J021m022p86N310K128m845l095L006K844l689l287L194M833
638C191j013l656J576M486n17m910q70M184R62m330j983L811K413m131l253K264
654a776L040k396l907J725M793m87m309L33M785P55m413p73M883K227k864j919
670c03L543K852l305m411R24L180k108m591J003M627K17m300n58L600L81m705
686c954k290L370L017j710j739M206M987j190l710J019K924j866m986n81M394
701A891J288l202o29L938J344m343m353R81J567l131l416K850N486N90k200J802
717D63M178m44m949k036L238J713l153n70M785L846j957l363J077J365m170n649
$$ plain form
733 -5626 -5896 -2565 -2473 -4878 -3488 1725 3538 -224 -2522 -416 427 -3344 -5782 -1916 2994 3034 1880
750 1880 4638 8423 6395 1042 -712 549 -536 -4545 -5111 -640 2206 180 -1431 855 2021
765 2021 -2167 -6584 -5615 -2536 -2779 -4205 -1001 5029 6291 3566 2978 5208 4469 -700 -3426 -440
781 -440 2140 265 -1063 2278 5238 2438 -2352 -3028 -1803 -4262 -8178 -7398 -2357 -96 -1241 -239
797 -239 3750 5258 1730 -1098 483 2482 465 -1415 1680 5856 5836 2918 2720 4285 2267 -3252
813 -3252 -5670 -3648 -3025 -5301 -5640 -1628 1400 -430 -2924 -1368 838 -1239 -4014 -2331 2228 3117
829 3117 1625 3149 7014 7499 3580 1324 2753 2675 -1376 -3880 -1730 726 -973 -3547 -2153 201
845 201 -1738 -5571 -5669 -2555 -2293 -4165 -3196 1308 3791 2096 1274 4144 5624 3272 652 2192 4400
$$ packed form
733e626k70L331R2k405J390N213J813l762k298K106Q43l771k438L866M910M0j154
750A880K758L785k028n353j754J261j085m009n66M471K846k026j611K286J166
765B021m188m417R69L079k43j426L204O030J262k725n88K230p39n169k726K986
781d40K580j875j328L341K960k800m790o76J225k459l916P80N041K261j145J002
797b39L989J508l528k828J581J999k017j880L095M176k0k918j98J565k018n519
813c252k418K022O23k276l39M012L028j830k494J556K206k077k775J683M559Q89
829C117j492J524L865M85l919k256J429p8m051k504K150K456j699k574J394K354
845B01j939l833r8L114K62j872R69M504K483j695q22K870J480k352k620J540K208
$$ plain form
862 4400 2955 105 612 3056 1985 -2172 -3220 -1311 -1421 -4778 -6291 -3296 -1255 -3012 -4232 -1667
878 -1667 1324 308 -1671 383 3715 3508 1228 2137 4986 5139 2059 875 2774 3215 -61 -2219
894 -2219 -372 835 -1683 -4570 -3323 -1522 -2835 -5490 -4390 -1304 -526 -2317 -1421 2308 3690 1329
910 1329 443 2735 4410 2055 295 2430 4640 3105 460 1065 2460 603 -3221 -4470 -2501 -2300
926 -2300 -4842 -4975 -1538 339 -1444 -2367 -213 1789 -212 -1833 -30 3076 3089 1694 3220 5912
942 5912 5754 2279 653 1695 1087 -2756 -4481 -2317 -464 -1905 -3413 -1757 442 -1537 -4411 -4009
958 -4009 -1667 -1749 -3062 -1466 2925 4940 3521 3156 5146 5490 2213 -443 345 1722 126 -1711
974 -1711 -101 2445 1216 -2017 -2661 -1811 -3043 -6364 -6822 -3797 -1525 -1810 -1206 2196 4629 3134
$$ packed form
862D400j445k850N07K444j071m157j048J909j10l357j513K995K041j757j220K565
878a667K991j016j979K054L332k07k280R09K849J53l080j184J899M41l276k158
894b219J847J207k518k887J247J801j313k655J100L086P78j791Q96L729J382k361
910A329q86K292J675k355j760K135K210j535k645O05J395j857l824j249J969K01
926b300k542j33L437J877j783r23K154K002k001j621J803L106J3j395J526K692
942E912j58l475j626J042o08l843j725K164J853j441j508J656K199j979k874M02
958d009K342q2j313J596M391K015j419l65J990L44l277k656P88J377j596j837
974a711J610K546j229l233o44Q50j232l321m58L025K272k85O04L402K433j495
$$ plain form
990 3134 901 1846 3108 1665 -315 870 4067 4606 2570 2326 3701 2620 -1395 -4295 -3642 -3448
1006 -3448 -5372 -6290 -3455 -349 -830 -1896 -1060 1155 84 -2419 -1854 972 2268 1377 2310 5578
1022 5578 7176 4710 2489 2802 2429 -554 -3484 -2824 -802 -1420 -3108 -2127 -243 -781 -3739 -4466 -3095
1039 -3095 -2356 -3924 -3595 -56 2816 2706 2406 4159 5681 3860 1304 1099 2635 1858 -303 38 2091
1056 2091 2288 -580 -1891 -889 -1460 -4249 -5829 -4304 -2296 -2770 -3212 -1085 2037 1808 142 586
1072 586 2688 2481 615 599 3059 4270 2541 1581 2930 3431 797 -1968 -1936 -975 -2537 -4487 -3792
1089 -3792 -1523 -1459 -2921 -2889 -383 -8 -1769 -1855 434 2221 1383 960 2838 4819 3491 1567 2132
1106 2132 3248 1950 -590 -946 517 73 -2286 -3163 -1610 -1297 -3223 -4121 -2508 -800 -1584 -2480 -788
$$ packed form
990C134k233R45J262j443j980J185L197N39k036k44J375j081m015k900O53J94
1006c448j924r18K835L106m81j066Q36K215j071k503N65K826J296q91R33L268
1022E578J598k466k221L13l73k983k930O60K022o18j688R81J884n38k958p27J371
1039c095P39j568L29L539K872j10l00J753J522j821k556k05J536p77k161L41K053
1056B091J97k868j311J002n71k789j580J525K008m74m42K127L122k29j666M44
1072E86K102k07j866j6K460J211j729r60J349N01k634k765L2R61j562j950O95
1089c792K269O4j462L2K506L75j761q6K289J787q38m23J878J981j328j924N65
1106B132J116j298k540l56J463m44k359q77J553L13j926q98J613J708p84q96J692
$$ plain form
1123 -788 1668 1478 155 1166 3339 3570 1785 1589 3561 3936 1633 291 1349 1469 -857 -2986
1139 -2986 -2070 -1058 -2373 -3934 -3015 -1066 -1278 -3133 -2701 -628 -86 -1141 -1151 1570 3368 2339 2121
1156 2121 3784 4905 3064 809 1117 1975 672 -1511 -1317 483 174 -2025 -2879 -1616 -1662 -4000 -4932
1173 -4932 -3223 -1417 -1854 -1945 672 2951 2725 1390 2023 3539 2686 731 748 2656 3101 1553 1151
1190 1151 2457 2361 -338 -2606 -2625 -2227 -3718 -5201 -3680 -1341 -1022 -1678 -763 861 1007 -821 -1102
1207 -1102 689 1624 995 1188 3366 5081 3861 2386 2422 2571 511 -2304 -2573 -1524 -1437 -2661 -2435
1224 -2435 -264 -75 -1860 -2831 -1882 -1213 -2741 -3111 -881 1518 1815 1713 3094 4936 3899 1342 880
1241 880 1635 999 -820 -1097 806 1621 187 -988 -360 -306 -2190 -4370 -3911 -2350 -2356 -2900 -1257 1560
$$ packed form
1123g88K456j90j323J011K173K31j785j96J972L75k303j342J058J20k326k129
1139b986R16J012j315j561R19J949k12j855M32K073N42j055j0K721J798j029k18
1156B121J663J121j841k255L08Q58j303k183J94J800l09k199q54J263m6k338r32
1173d932J709J806m37r1K617K279k26j335O33J516q53j955J7J908M45j548m02
1190A151J306r6k699k268j9L98j491j483J521K339L19o56R15J624J46j828k81
1207a102J791R35o29J93K178J715j220j475L6J49k060k815k69J049Q7j224K26
1224b435K171J89j785r71R49O69j528l70K230K399K97j02J381J842j037k557m62
1241H80P55o36j819k77J903Q15j434j175O28N4j884k180M59J561on44J643K817
$$ plain form
1259 1560 2229 1152 1305 2230 2162 452 -348 1214 2533 1745 956 2234 3117 1660 -902 -1231 -998 -2020
1277 -2020 -4009 -3846 -1658 -730 -1513 -1378 300 1177 -334 -1204 -65 1004 434 -50 1408 3468 3325
1294 3325 1854 1944 2726 1618 -706 -1615 -825 -518 -1891 -2531 -1173 -16 -1214 -2324 -1687 -547 -1326
1311 -1326 -2447 -1465 674 1153 548 1305 2923 3254 1741 1032 1991 2194 607 -728 252 1352 116
1328 116 -1511 -1147 -264 -1086 -3137 -3074 -1491 -1207 -2354 -1969 -124 792 -102 -373 1139 2323 1504 588
1346 588 1680 2953 2131 711 1038 2078 1443 -755 -883 -54 -184 -1831 -2446 -1274 -913 -1954 -2688
1363 -2688 -1524 -565 -863 -1465 -452 1204 1294 661 1038 2359 2435 1023 630 1623 2070 819 -173 740
1381 740 1383 76 -1631 -1463 -449 -1599 -3111 -2597 -1075 -850 -1452 -1142 771 1073 -52 -599 480
$$ packed form
1259A560O69j077J53R25o8j710q00J562J319p88p89J278Q83j457k562l29K33j022
1277b020j989J63K188R28p83J35J678Q77j511q70J139J069n70m84J458K060j43
1294C325j471R0P82j108k324r09P90L07j373o40J358J157j198j110O37J140p79
1311a326j121R82K139M79o05P57J618L31j513p09R59K03j587j335R80J100j236
1328A16j627L64Q83q22k051O3J583K84j147L85J845R16q94k71J512J184q19r16
1346E88J092J273q22j420L27J040o35k198j28Q29j30j647o15J172L61j041p34
1363b688J164R59k98o02J013J656R0o33L77J321P6j412l93R93M47j251r92R13
1381G40O43j307j707J68J014j150j512N14J522K25o02L10J913L02j125n47J079
$$ plain form
1398 480 1395 609 142 1493 2746 2227 1086 1270 1847 861 -1078 -1491 -837 -844 -1810 -1841 -443 180 -581
1417 -581 -1507 -774 -130 -972 -2188 -1020 628 951 351 1289 2723 2646 1063 326 1147 761 -779 -1349
1435 -1349 -115 673 182 -730 83 700 -648 -2220 -2284 -1311 -1362 -2052 -1202 650 1644 1009 890 1664 1855
1454 1855 294 -769 -119 944 464 -97 772 2131 1442 -27 -708 -440 -915 -2537 -2954 -1325 -496
1471 -496 -931 -678 533 1653 492 -561 -156 452 22 -687 -170 1666 1982 1326 1408 1997 1615 -305
1489 -305 -1553 -1065 -627 -1331 -1978 -525 529 167 -858 -657 249 -413 -2023 -1473 -275 529 22 478
1507 478 2012 2741 1621 372 968 1275 -165 -1052 -537 670 371 -667 -195 576 295 -1313 -1746 -1165
1525 -1165 -848 -1776 -1790 -338 784 559 147 975 1881 787 -444 -73 1048 781 -134 220 1270 1463
$$ packed form
1398D80R15p86m67J351J253n19j141J84N77r86j939m13O54pr66l1J398O23p61
1417e81r26P33O44q42j216J168J648L23o00R38J434p7j583p37Q21l86j540n70
1435a349J234P88m91r12Q13O17j348j572o4R73n1o90Q50J852R94o35j19P74J91
1454A855j561j063O50J063m80n61Q69J359o89j469o81K68m75j622m17J629Q29
1471d96m35K53J211J120j161j053M05O08m30p09N17J836L16o56Q2N89l82j920
1489c05j248M88M38p04o47J453J054l62j025K01R06o62j610N50J198Q04n07M56
1507D78J534P29j120j249N96L07j440q87N15J207k99j038M72P71k81j608m33N81
1525a165L17r28j4J452J122k25m12Q28R06j094j231L71J121k67r15L54J050J93
$$ plain form
1543 1463 365 -292 31 222 -1205 -1882 -1142 -168 -851 -1280 -609 684 258 -776 -495 177 425 -497
1561 -497 -319 720 1404 592 167 1125 1462 523 -651 -178 574 -7 -1094 -650 297 200 -698 -869 -101
1580 -101 -32 -1043 -1169 35 672 -83 -672 135 993 239 -605 98 896 806 -316 -86 768 883 -355
1599 -355 -632 247 437 -656 -1050 -151 655 12 -937 -178 695 93 -814 -604 332 281 -433 -126 904 1292
1619 1292 293 -386 309 563 -412 -1128 -335 485 167 -598 28 888 451 -664 -828 24 131 -1043 -1001
1638 -1001 252 984 399 210 662 1109 359 -889 -539 282 -226 -1019 -331 785 1013 250 -196 380 69
1657 69 -920 -1519 -755 -123 -200 -500 422 1355 829 -198 -39 590 -72 -1033 -902 528 626 59 221 964
1677 964 1227 -38 -1040 -611 -272 -796 -1265 -450 711 914 14 323 984 525 -641 -1325 -362 56 -493
$$ packed form
1543A463j098o57L23J91j427o77P40R74o83m29O71J293m26j034K81O72K48r22
1561d97J78J039O84q12m25R58L37r39j174M73P52n81j087M44R47r7q98j71P68
1580a01O9j011j26J204O37p55n89Q07Q58p54q44P03P98r0j122K30Q54J15j238
1599c55k77Q79J90j093l94Q99Q06o43r49P59Q73o02r07K10R36n1p14L07J030L88
1619A292r99o79O95K54r75p16P93Q20l18p65O26Q60m37j115j64Q52J07j174M2
1638a001J253P32n85j89M52M47p50j248L50Q21n08p93O88J116K28p63m46N76l11
1657F9r89n99P64O32p7l00R22R33n26j027J59O29o62r61J31J430R8n67J62P43
1677I64K63j265j002M29L39n24m69Q15J161K03r00L09O61m59j166o84R63M18n49
$$ plain form
1696 -493 -460 745 1693 913 191 193 551 -270 -1249 -1025 64 66 -343 79 930 1115 132 -566 -138 -174 -944
1717 -944 -1103 -344 596 547 99 481 1260 557 -606 -844 -270 -200 -956 -673 360 1235 540 66 620 785
1737 785 -127 -1073 -895 -41 42 -509 114 1053 1006 57 -59 352 76 -954 -1367 -422 176 -1 -333 225
1757 225 1095 429 -565 -357 59 -125 -940 -426 589 1091 208 283 1064 873 8 -558 -85 239 -276 -797
1777 -797 -157 724 297 -586 -291 232 -50 -1000 -869 -190 138 -460 -247 566 910 285 -336 163 823 167
1797 167 -417 -157 805 757 -14 -219 606 319 -444 -721 -242 -96 -724 -780 -302 408 -326 -890 -385 299 194
1818 194 -708 -183 604 597 -48 -4 873 973 63 -224 388 793 141 -281 271 629 56 -701 -519 -67 -302
1839 -302 -857 -552 203 455 -401 -378 370 616 -78 -417 97 592 315 -151 331 1024 730 -36 41 722 269
$$ packed form
1696d93L3J205R48p80p22KL58q21r79K24J089Km09M22Q51J85r83o98M28l6p70
1717i44j59P59R40m9m48L82P79p03j163k38N74P0p56K83J033Q75o95m74N54J65
1737G85r12r46J78Q54Q3n51O23R39m7r49j16M11k76j030m13R45N98j77l32N58
1757B25Q70o66r94K08M16j84q15N14J015N02q83P5P81j91q65n66M73L24n15n21
1777g97O40Q81m27q83K95N23k82r50J31O79L28n98K13Q13L44o25o21M99O60o56
1797A67n84K60R62m8p71k05Q25k87p63k77M79J46o28n6M78P10p34n64N05O84j05
1818A94r02N25P87po45M4Q77J00r10k87O12M05o52m22N52L58n73p57J82M52k35
1839c02n55L05P55K52q56K3P48K46o94l39N14M95k77m66M82O93k94p66P7O81m53
$$ plain form
1860 269 -628 -839 -208 196 -541 -591 274 607 -59 -648 -186 128 -297 -661 -287 710 762 206 478 949 1018
1881 1018 -41 -611 32 285 -532 -523 -18 683 382 -357 -11 276 -308 -1201 -905 -268 -33 -473 -143 889
1901 889 1224 676 80 518 584 -258 -722 -305 420 243 -36 171 793 553 -457 -833 -578 -476 -1028 -1180
1921 -1180 -265 567 208 68 566 879 162 -374 -78 281 155 -105 323 1085 1202 507 289 520 456 -749
1941 -749 -1387 -817 -366 -570 -967 -180 494 180 -486 -423 -59 -392 -687 -603 418 787 576 600 1181 1623 660
1962 660 -59 -64 362 -357 -714 -132 286 314 -210 -378 2 -201 -1133 -1218 -762 -231 -695 -675 222 776 600 294
1984 294 500 899 328 -331 -181 591 597 202 424 884 898 -185 -631 -344 -432 -863 -1229 -656 -86 -212 -416
2005 -416 -277 470 116 -405 -385 159 259 -169 5 767 1044 650 45 537 830 148 -572 -357 -154 -171 -661
$$ packed form
1860B69q97k11O31M04p37n0Q65L33o66n89M62L14m25l64L74R97N2n56K72M71O9
1881A018j059n70O43K53q17RN05P01l01p39L46K87n84q93K96O37K35m40L30J032
1901H89L35n48n96M38O6q42m64M17P25j77k79K07O22k40j010l76K55J02n52j52
1921a180R15Q32l59j40M98L13p17n36K96L59j26k60M28P62J17o95k18K31o4j205
1941g49o38N70M51k04l97P87O74l14o66O3L64l33k95Q4J021L69k11K4N81M42r63
1962F60p19nM26p19l57N82M18K8n24j68L80k03r32q5M56N31m64K0Q97N54j76l06
1984B94K06L99n71o59J50P72Ol95K22M60J4j083m46K87q8m31l66N73N70j26k04
2005d16J39P47l54n21K0N44J00m28J74P62K77l94o05M92K93o82p20K15K03j7m90
$$ plain form
2026 -661 -706 77 -64 -606 -560 -28 6 -311 -709 -61 670 227 66 480 941 601 30 107 794 555 -195
2047 -195 -269 399 378 -185 -732 -122 -175 -579 -786 -186 61 -112 -662 -122 306 277 -261 124 839 604 130
2068 130 10 536 863 292 -107 183 247 -222 -637 -425 -96 -180 -638 -412 -85 -309 -823 -679 -164 -24 -301
2089 -301 -74 521 845 570 147 574 970 427 -48 -189 305 78 -270 -141 342 143 -677 -777 -467 -332
2109 -332 -850 -990 -367 53 -218 -275 248 847 474 -86 13 632 609 96 126 710 823 550 179 485 267
2130 267 -194 -923 -849 -304 -604 -891 -550 100 -20 -279 -431 72 -75 -584 -436 248 627 385 354 843 1237
2151 1237 794 74 275 282 -128 -687 -516 128 96 -396 -403 -82 -219 -834 -1140 -724 -372 -558 -723 -2 596
2172 596 609 506 566 913 702 19 -56 421 357 -14 129 659 598 215 -418 -252 -261 -771 -1126 -749 -66 -283
$$ packed form
2026f61m5P83j41n42M6N32L4l17l98O48P31m43j61M14M61l40n71P7O87k39p50
2047a95p4O68k1n63n47O10n3m04k07O00K47j73n50N40M28k9n38L85P15k35m74
2068A30j20N26L27n71l99K90O4m69m15K12L29q4m58K26L27k24n14J44N15J40k77
2089c01K27N95L24k75m23M27L96n43m75j41M94k27l48J29M83j99q20j00L10J35
2109c32n18j40O23M20k71n7N23N99l73n60R9O19k3n13L0N84J13k73l71L06k18
2130B67m61p29P4N45l00k87L41O50j20k59j52N03j47n09J48O84L79k42l1M89L94
2151A237m43p20K01Pm10n59J71O44l2m92pL21j37o15l06M16L52j86j65P21N98
2172E96J3j03O0L47k11o83p5M77o4l71J43N30o1l83o33J66rn10l55L77O83k17
$$ plain form
2194 -283 -335 -126 357 570 -93 -150 182 222 71 -59 636 1068 501 116 464 711 163 -479 -621 -145 -486
2215 -486 -794 -603 82 65 -270 -350 -116 105 -393 -474 -51 271 203 91 518 1035 804 251 66 564 168
2236 168 -388 -456 -58 96 -224 -534 -271 101 -502 -712 -572 -184 -301 -602 -253 306 616 280 68 777
2256 777 768 340 0 343 710 265 -109 145 255 32 -373 -398 -232 -475 -837 -731 -34 -200 -517 -557 9
2277 9 61 172 -145 284 777 439 6 263 895 524 61 273 532 269 -334 -316 8 -117 -474 -829 -346
2298 -346 -190 -552 -780 -597 139 -342 -468 -62 414 412 171 253 620 631 298 411 752 652 268 44 373
2319 373 447 -176 -545 -441 -253 -535 -934 -771 -161 -129 -528 -289 -83 64 -126 -273 162 700 332 137 487
2340 487 970 767 195 370 362 161 -532 -308 -181 -17 -419 -557 -20 -97 -272 -678 -660 -173 -387 -568 -143
$$ packed form
2194b83n2K09M83K13o63n7L32M0j51j30O95M32n67l85L48K47n48o42j42M76l41
2215d86l08J91O85j7l35q0K34K21m98q1M23L22o8j12M27N17k31n53j85M98l96
2236A68n56o8L98J54l20l10K63L72o03k10J40L88j17l01L49N59L10l36k12P09
2256G77rm28l40L43L67m45l74K54J10k23m05k5J66k43l62J06O97j66l17m0N66
2277IN2J11l17M29M93l38m33K57O32l71m63K12K59k63o03J8L24j25l57l55M83
2298c46J56l62k28J83P36m81j26M06M76kk41Q2L67J1l33J13L41j00l84k24L29
2319C73P4o23l69J04J88k82l99J63O10L2l99K39K06J47j90j47M35N38l68j95L50
2340D87M83k03n72J75qk01o93K24J27J64m02j38N37p7j75m06J8M87k14j81M25
$$ plain form
2361 -143 412 371 239 425 722 861 97 32 293 322 27 -147 338 469 150 -238 -146 -101 -446 -968 -740 -379
2383 -379 -323 -405 -237 349 388 165 172 366 269 -11 -177 280 564 503 247 278 344 236 -258 -415 -144 -387 -595
2406 -595 -688 -163 10 -171 -387 -166 17 19 -210 -37 235 99 -7 336 780 677 261 171 363 346 -157 -228
2428 -228 -80 -81 -220 -411 -58 106 -344 -571 -440 -189 -352 -606 -363 1 485 172 265 448 666 329 25
2449 25 340 486 30 -232 -7 471 216 -310 -134 -94 -103 -822 -719 -550 -108 -484 -451 -46 282 239 -190 -27
2471 -27 467 333 34 121 444 548 301 180 554 566 -11 -316 -116 -73 -460 -626 -287 -143 -207 -491 -394 35
2493 35 -234 -362 -198 200 89 -72 153 501 609 248 82 384 489 409 -80 2 336 82 -288 -168 35
2514 35 -41 -423 -365 -63 -48 -490 -326 -158 47 38 -43 123 272 207 -33 196 332 436 291 168 273 270 -243
$$ packed form
2361a43N55m1j32J86K97J39p64o5K61K9k95j74M85J31l19l88R2M5l45n22K28L61
2383c79N6q2J68N86L9k23PJ94r7k80j66M57K84o1k56L1O6j08m94j57K71k43k08
2406e95r3N25J73j81k16K21J83Kk29J73K72j36j06L43M44j03m16r0J92j7n03p1
2428b28J48jj39j91L53J64m50k27J31K51j63k54K43L64M84l13R3J83K18l37l04
2449B5L15J46m56k62K25M78k55n26J76M0rp19J03J69M42l76L3M05L28m3m29J63
2471b7M94j34k99Q7L23J04k47j21L74J2n77l05K00M3l87j66L39J44o4k84R7M29
2493C5k69j28J64L98j11j61K25L48J08l61j66L02J05q0m89Q2L34k54l70J20K03
2514C5p6l82N8L02J5m42J64J68K05rq1J66J49o5k40K29J36J04j45j23J05ln13
$$ plain form
2537 -243 -82 -57 154 -257 -216 -245 73 -132 -326 -267 -42 -219 -332 -230 35 82 107 131 560 475 -76 -155 221
2560 221 235 -190 -162 75 390 153 -37 -101 86 21 -413 -615 -157 -287 -147 -316 94 256 140 -116 225
2581 225 247 -55 -91 9 305 166 59 140 450 312 -194 -346 -35 -48 -458 -497 -149 100 38 -210 88 229
2603 229 86 -134 -186 183 94 -178 118 412 559 244 103 181 326 -151 -176 -124 -4 -108 -209 114 142 170
2625 170 -282 -309 -31 -17 -390 -333 195 90 21 75 464 697 259 11 92 166 -124 -209 -13 290 53 41 -120
2648 -120 97 -6 -376 -332 -222 -254 -177 -213 -77 206 84 -125 107 300 102 -189 1 105 243 123 181 521
2670 521 462 58 80 -87 117 -222 -394 -145 157 -31 -281 -1 256 15 -268 -263 -14 -13 -179 -282 214 275
2692 275 72 114 204 281 122 -298 -16 26 -113 20 -74 131 190 46 -50 54 -20 -147 -439 73 147 -193 -180
$$ packed form
2537b43J61K5K11m11M1k9L18k05j94N9K25j77j13J02K65M7K5K4M29q5n51p9L76
2560B21J4m25K8K37L15k37j90o4J87o5m34k02M58j30J40j69M10J62j16k56L41
2581B25K2l02l6J00K96j39j07Q1L10j38n06j52L11j3m10l9L48K49o2k48K98J41
2603B29j43k20n2L69q9k72K96K94J47l15j41P8J45m77k5N2J20j04j01L23K8K8
2625A70m52k7K78J4l73N7N28j05o9N4L89K33m38k48Q1P4k90q5J96L03k37j2j61
2648a20K17j03l70M4J10l2P7l6J36K83j22k09K32J93j98k91J90J04J38j20N8L40
2670E21n9m04K2j67K04l39j72K49L02j88k50K80K57k41k83NK49Jj66j03M96O1
2692B75k03M2R0P7j59m20K82M2j39J33r4K05N9j44r6J04p4j27k92N12P4l40J3
$$ plain form
2715 -180 39 86 31 -283 -120 141 6 -116 -140 155 280 -90 -25 272 256 -65 -252 72 -153 -2 -367 -90
2737 -90 211 89 -3 -215 74 90 -98 -235 -12 123 -78 -267 -17 243 35 -215 24 56 98 -113 34 221
2759 221 237 -29 -179 101 9 -10 88 86 102 130 -130 20 55 122 -136 -187 -24 171 -37 -56 54 -34 37 -262 -58
2784 -58 54 -119 -278 -63 253 -31 -159 20 367 14 -106 -165 70 167 -289 -150 138 137 -47 -5 133 283
2806 283 -116 -238 -227 -51 -176 -117 -283 51 166 -15 33 230 -72 -278 -177 -77 20 -42 -143 112 317 137
2828 137 45 109 106 11 -152 -173 149 358 7 -102 183 218 -64 -146 8 205 -191 -224 -59 -8 307 119 -74
2851 -74 -116 74 -177 -305 -108 -46 -230 -126 202 362 149 -22 71 60 17 -153 -11 199 234 -69 -9 375 313
2874 313 -32 -96 -146 -140 -216 -271 -71 58 -14 -118 166 236 -124 -221 -81 62 -71 -17 51 190 356 73 65 57 190
$$ packed form
2715a80K19M7n5l14J63K61j35j22k4K95J25l70O5K97j6l21j87L24k25J51l65K77
2737i0L01j22r2k12K89J6j88j37K23J35k01j89K50K60k08k50K39L2M2k11J47J87
2759B21J6k66j50K80r2j9R8kJ6K8k60J50L5O7k58n1J63J95k08j9J10q8P1k99K04
2784e8J12j73j59K15L16k84j28J79L47l53j20n9K35R7m56J39K88jj84M2J38J50
2806B83l99j22J1J76j25N9j66L34J15j81M8J97l02k06J01J00R7o2j01K55K05j80
2828A37r2O4lr5j63k1L22K09l51j09K85L5k82q2J54J97l96l3J65N1L15j88j93
2851g4m2J90k51j28J97O2j84J04L28J60k13j71R3j1m3j70J42K10L5l03O0L84o2
2874C13l45o4n0Op6n5K00J29p2j04K84P0l60r7J40J43j33N4O8J39J66k83qqJ33
$$ plain form
2899 190 -77 -125 26 -47 -5 -120 -5 15 -4 -60 -259 -37 -204 -420 -385 69 -14 -89 -169 111 227 307 -69 -77
2923 -77 167 142 -97 -33 291 230 209 131 128 91 -80 -171 -32 -78 -230 13 87 0 3 -53 -147 -1 66 -137 -188 196
2949 196 153 171 45 313 290 267 104 8 161 133 -153 -56 195 121 -24 -70 -86 118 -227 -335 79 -172 -186 -99
2973 -99 -62 130 78 8 55 223 298 143 17 39 215 -39 -141 208 -23 -48 -93 17 0 4 -222 0 -40 78
2997 78 -250 -104 160 51 -44 -129 197 -23 28 41 0 7 51 -48 22 143 26 -99 -124 -56 -67 -165 -134 97 -50
3022 -50 -103 -158 125 -64 -157 -117 193 348 179 -62 -209 245 178 -122 90 201 -54 -120 70 129 11 -34 -343
3045 -343 -50 -154 -321 -160 -86 -102 -18 -229 55 148 113 24 -37 136 144 -18 260 99 535 144 -107 55 70
3068 70 -73 -213 -162 67 -166 -322 -122 -19 -103 -251 -109 -33 56 -95 -36 38 171 60 142 251 331 68 -64
$$ packed form
2899A90k67m8J51p3M2j15J15K0j9n6j99K22j67k16L5M54q3p5q0K80J16Q0l76q
2923g7K44k5k39O4L24o1k1p8ll7j71r1J39m6j52K43P4q7Ln6r4J46O7k03n1L84
2949A96m3J8j26K68k3k3j63r6J53k8k86R7K51p4j45m6j6K04l45j08M14k51j4Q7
2973i9L7J92n2p0M7J68P5j55j26K2J76k54j02L49k31k5m5J10j7Mk26K22m0J18
2997G8l28J46K64j09r5q5L26k20N1J3m1PM4r9P0J21j17j25k5O8j1r8L1K31j47
3022e0n3n5K83j89r3M0L10J55j69k41j47M54o7l00K12J11k55o6J90N9j18m5l09
3045c43K93j04j67J61P4j6Q4k11K84R3l5q9o1J73Qj62K78j61M36l91k51J62J5
3068G0j43j40N1K29k33j56K00J03q4j48J42P6Q9j51N9P4J33j11Q2J09Q0k63j32
$$ plain form
3091 -64 31 177 38 -155 62 193 11 -189 -229 -58 -52 -337 -426 -314 -175 -85 -83 6 197 227 6 39 139 93
3115 93 -156 -26 256 344 131 229 304 136 46 -209 19 -82 -289 -159 -255 -200 -49 -115 -192 -4 68 -114 -118 54
3139 54 6 -30 -17 191 293 92 -1 166 181 55 -125 -15 -36 32 -177 -42 -89 52 -273 -221 -51 -67 -115 -132
3163 -132 -27 133 -20 -28 155 106 112 -114 46 37 79 68 156 234 130 -26 75 63 -18 -104 -277 -84 -69 -20 -202
3188 -202 -178 112 155 -170 -84 118 312 241 24 112 263 -106 -30 91 93 71 -89 -46 12 -22 -76 -218 -28 -29 -10
3213 -10 -91 50 215 -58 -14 -74 45 57 -36 164 90 381 237 45 277 0 -158 -49 -113 -73 -273 -125 -97
3236 -97 40 -75 -165 -91 17 17 -177 -61 65 177 -109 10 -39 102 118 162 68 79 56 -35 210 251 -9 -134
3260 -134 -26 -7 -120 -33 -257 -29 -79 -133 -71 -25 3 -41 138 -96 125 74 188 295 195 60 208 170 341
$$ packed form
3091f4R5J46j39j93K17J31j82k00m0J71Ok85q9J12J39R0KQ9J91L0k21L3J00m6
3115I3k49J30K82Q8k13R8P5j68r0k55K28j01k07J30r6N5J51o6p7J88P2j82mJ72
3139E4m8l6J3K08J02k01r3J67J5j26j80J10k1O8k09J35m7J41l25N2J70j6m8j7
3163a32J05J60j53qJ83m9Ok26J60rM2j1Q8P8j04j56J01j2q1q6j73J93J5M9j82
3188b02K4K90M3l25Q6K02J94p1k17Q8J51l69P6J21Kk2j60M3N8l4n4j42J90jJ9
3213a0q1J41J65k73M4o0J19J2r3K00p4K91j44j92K32k77j58J09o4M0k00J48K8
3236i7J37j15r0P4J08%j94J16J26J12k86J19m9J41J6M4r4J1k3r1K45M1k60j25
3260a34J08J9j13Q7k24K28n0n4O2M6K8m4J79k34K21n1J14J07j00j35J48l8J71
$$ plain form
3283 341 -106 -3 -58 61 23 64 -123 -87 -34 -216 -173 -300 -84 -174 -85 -34 138 246 163 225 91 193 -21 -51
3307 -51 -2 163 230 -118 183 -53 71 -165 -54 18 5 -212 -18 -42 41 -132 172 83 111 -78 41 -118 -81
3330 -81 88 -17 71 262 187 33 124 77 -4 -68 82 42 52 -191 -170 90 164 -21 -191 12 18 -28 -93 -258 82
3355 82 74 169 61 177 175 -138 -203 68 33 -26 -126 131 69 -12 -68 49 -91 -132 -340 -63 83 -151 -77 -201 85
3380 85 34 -51 -50 263 160 92 9 7 157 196 1 132 20 -10 5 -92 -114 -32 -204 -240 -147 -76 -225 -80 104 127
3406 127 -20 -169 -3 114 37 79 114 87 312 161 171 254 108 -44 2 -1 -34 -88 -134 19 10 -43 -312 -61 -58 24
3432 24 -40 -142 -59 142 36 -5 64 250 69 -54 146 286 76 -102 -9 72 53 -124 -185 99 -212 -218 -137 -40
3456 -40 141 -203 -102 -52 -56 21 39 232 227 145 62 10 6 117 29 -61 -4 161 -94 -16 -114 -42 89 -224 74 -56
$$ packed form
3283C41m47J03n5J19l8M1j87L6N3j82M3j27K16r0Q9N1J72J08q3O2j34J02k14l0
3307e1M9J65O7l48L01k36J24k36J11P2j3k17J94k4Q3j73L04q9K8j89J19j59L7
3330h1J69j05Q8J91p5j54R1m7q1o4J50m0J0k43K1K60P4j85j70K03Om6o5j65L40
3355H2qR5j08J16kl13o5K71l5n9j00K57o2q1n6J17j40m1k08K77J46k34P4j24K86
3380H5n1q5JL13j03o8q3kJ50L9j95J31j12l0J5r7k2Q2j72l6R3P1j49J45J84K3
3406A27j47j49J66J17p7M2L5k7K25j51J0Q3j46j52M6ll3n4m6J53rn3k69K51LQ2
3432B4o4j02Q3K01j06m1O9J86j81j23K00J40k10j78R3Q1j9j77o1K84l11oQ1R7
3456d0J81l44J01N0mP7J8J93nq2q3n2mJ11q8r0N7J65k55P8r8P2J31l13K98j30
$$ plain form
3482 -56 -23 -115 -192 8 -6 18 -109 260 8 -38 78 145 27 -85 76 132 132 -12 -105 50 80 -28 0 13 -102
3507 -102 -68 -107 -192 83 -48 -132 -125 122 80 -116 9 23 168 -4 55 20 -3 14 84 31 152 -74 -139 -260 -97
3532 -97 90 -74 -36 5 -3 1 5 102 21 63 -76 -188 171 -31 77 -67 403 66 275 89 148 89 -11 -202 -42
3557 -42 -42 -5 -57 -11 54 -10 -65 -246 -22 6 -103 -25 78 5 60 -164 241 -80 -42 -28 -71 203 88 -99 50
3582 50 -8 120 -120 -192 -100 16 -127 -47 -151 44 77 -198 62 -212 34 -50 24 -1 -122 -90 4 170 182 -150
3606 -150 64 119 97 -101 -95 85 12 -56 -92 -36 -85 -64 -18 -157 -42 97 -102 -16 -4 36 -25 70 69 56 -121 -228
3632 -228 -14 -49 -46 -101 -135 -94 -97 109 178 -53 15 -72 -143 10 -15 -124 -59 -139 244 -49 -53 -145 9 210 -66 29
3658 29 14 51 103 -2 97 58 128 -109 40 -5 55 -66 -29 -69 112 -113 0 -133 113 -14 -91 -7 196 23
$$ packed form
3482e6L3r2p7K00j4K4j27L69k52m6J16O7j18j12J61N6%j44r3J55L0j08K8J3j15
3507a02L4l9q5K75j31q4PK47m2j96J25J4J45j72N9l5k3J7P0n3J21k26o5j21J63
3532i7J87j64L8M1qMMR7q1M2j39j12L59k02J08j44M70l37K09j86N9n9j00j91J60
3557d2%L7n2M6O5o4n5j81K24K8j09P8J03p3N5k24M05l21L8J4m3K74j15j87J49
3582E0n8J28k40p2R2J16j43Q0j04J95L3k75K60k74K46q4P4k5j21L2R4J66J2l32
3606a50K14N5k2j98OJ80p3o8l6N6m9K1M6j39J15J39j99Q6J2M0o1R5jj3j77j07
3632b28K14l5Ln5l4M1lK06O9k31O8q7p1J53k5j09O5q0L83k93mr2J54K01k76R5
3658B9j5L7N2j05R9l9P0k37J49m5O0j21L7m0J81k25J13j33K46j27p7Q4K03j73
$$ plain form
3682 23 -261 279 31 -120 93 65 163 -104 -198 113 13 -49 -120 75 82 -90 -93 151 20 -67 -60 -93 85 183 -116
3707 -116 69 109 221 28 -40 31 20 156 1 -129 94 35 -34 -78 26 -24 17 -114 36 150 -194 -131 27
3730 27 163 68 -95 46 -75 38 81 -91 40 139 31 -2 -79 -145 -91 -86 -8 -14 -133 -130 21 -47 44 -23 14 1 -154
3757 -154 -13 -102 21 -19 165 7 -39 272 54 -268 15 96 -83 -84 87 27 119 -41 -57 208 10 -147 -187
3780 -187 -116 83 -55 -124 2 123 19 106 97 94 43 -113 28 21 -121 -26 -66 21 205 135 -78 10 202 114 -108
3805 -108 -61 -18 -103 -23 138 18 -24 -74 -193 66 -100 -126 -53 74 -22 89 62 82 29 146 -57 46 42 139 -60
3830 -60 -31 -20 109 51 54 61 -164 -134 25 13 31 -58 -72 54 115 -25 -132 52 -28 34 -74 -38 86 -11 -68 -132 -123
3857 -123 -88 92 77 10 22 -111 -87 -33 -58 -46 -42 -93 154 -158 -18 -194 119 113 -61 -201 119 8 30 -18 -109
$$ packed form
3682B3k84N40k48j51K13k8R8k67r4L11j00o2p1J95Pj72lK44j31q7Pl3J78R8k99
3707a16J85M0J12j93o8P1j1J36j55j30K23n9o9m4J04n0M1j31J50J14l44O3J58
3730B7J36r5j63J41j21J13M3j72J31R9j08l3p7o6N4NP8oj19LJ51o8R1o7L7j3j55
3757a54J41q9J23m0J84j58m6L11k18l22K83Q1j79jJ71o0R2j60j6K65j98j57m0
3780a87P1J99j38o9J26J21j04Q7rln1j56J41pj42R5m0Q7J84p0k13Q8J92q8k22
3805a08M7M3q5Q0J61j20m2n0j19K59j66k6P3J27r6J11k7K0n3J17k03J03mR7j99
3830f0K9J1J29n8LPk25L0J59j2J8q9j4J26O1j40j07J84q0O2j08L6J24r7n7o4R
3857a23L5J80j5o7J2j33K4N4k5J2Mn1K47l12J40j76L13oj74j40L20j11K2m8r1
$$ plain form
3882 -109 -77 16 -44 -164 -59 -32 115 124 11 222 -171 -190 189 -41 -100 20 -32 -14 117 -30 90 49 85 -44
3906 -44 113 48 -147 90 -88 -120 -102 -83 84 120 143 78 -189 -109 133 54 80 42 144 113 88 -26 23 -69 -10 -40
3932 -40 -72 31 106 -39 4 32 -23 -139 -51 -17 165 36 -42 85 -78 28 127 62 38 7 21 -155 242 -15 105
3957 105 -140 101 -45 -151 44 39 94 19 -9 23 67 -10 -18 -64 -39 -19 171 -29 65 71 59 79 76 -93 -109 -156 -96 -111
3985 -111 -126 -126 120 78 -37 -236 2 -125 -152 152 -24 173 -16 25 -11 124 -44 26 -45 5 -15 -189 -64 -169
4009 -169 59 105 -93 -115 -132 -18 -31 0 95 -99 -64 99 -20 41 -68 -64 79 130 -6 38 158 204 216 -94 -1
4034 -1 20 -15 -11 -147 41 -51 -197 119 -147 -16 -213 -160 90 100 -88 -89 -122 -39 -18 -212 -13 -8 195 -53 69
4059 69 53 128 -57 69 -63 16 134 93 171 92 -120 -33 3 -31 36 109 6 201 -47 -71 -37 -21 124 -4 152
$$ packed form
3882a09L2R3o0j20J05K7J47Rj13K11l93j9L79k30n9J20n2J8J31j47J20m1L6j29
3906d4J57o5j95K37j78l2J8J9J67L6K3o5k67Q0K42p9K6l8J02l1k5j14M9r2N9l0
3932d0l2J03P5j45M3K8n5j16Q8L4J82j29p8J27j63J06R9o5k4l1J4j76L97k57J20
3957A05k45K41j46j06J95nN5p5k8L2M4p7qm6K5K0J90k00R4Oj2K0lj69j6m7O0j5
3985a11j5%K46m2j15j99K38j27k7L04j76J97j89M1l6J35j68P0p1N0k0j74J25j05
4009a69K28M6j98k2j7J14j3L1R5j94L5J63j19O1j09MJ43N1j36M4J20M6J2l10R3
4034aK1l5Mj36J88r2j46L16k66J31j97N3K50J0j88jl3Q3K1j94J99NK03k48J22
4059F9j6P5j85J26j32P9J18m1P8p9k12Q7L6l4O7P3j03J95k48k4L4J6J45j28J56
$$ plain form
4084 152 -103 58 24 48 170 -17 24 -85 22 65 -40 5 7 -102 77 -37 73 -18 -11 -47 135 103 -167 -71
4108 -71 -175 -32 79 -5 40 25 91 -82 32 24 55 -42 -56 145 5 178 47 -34 -17 77 -7 -34 -41 83 -108 -108
4134 -108 109 285 78 15 -173 -29 -42 -111 72 9 24 -5 -144 -45 -4 -81 -99 -22 106 -27 -158 234 112 105
4158 105 113 -5 9 -44 67 -30 41 66 152 -16 -186 -77 -74 45 -34 99 -16 -41 -22 61 19 14 43 -23 198 9
4184 9 10 -11 66 67 -16 218 74 59 -10 -23 -34 42 -193 -60 64 -74 52 -191 108 -70 3 -93 -76 -6 -82 -172 -23
4211 -23 -101 51 -8 -109 45 -44 124 357 125 110 -96 40 136 97 2 -23 83 102 -89 -1 -86 5 36 -42 -73
4236 -73 -75 134 103 -134 2 -44 109 -28 135 14 117 -83 -190 133 54 -67 15 -78 -49 -97 -58 -59 72 -49
4260 -49 -4 79 -103 -8 -97 -94 -38 -16 40 -72 18 108 -10 123 -41 -53 -17 64 3 -28 -110 -93 -70 -73 83 44 57 -57
$$ packed form
4084A52k55J61l4K4J22j87M1j09J07M3j05M5Kj09J79j14J10r1Pl6J82l2k70R6
4108g1j04J43J11q4M5j5O6j73J14qL1r7j4K01j40J73j31q1J7R4q4k7pJ24j91%
4134a08K17J76k07o3j88J44j3o9J83o3J5k9j39R9M1p7j8P7J28j33j31L92j22p
4158A05Qj18J4n3J11r7P1K5Q6j68j70J09LJ19p9J33j15k5J9Q3m2nK9o6K21j89
4184IJk1P7Jq3K34j44j5o9j3j1P6k35J33J24j38J26k43K99j78P3r6J7P0p6r0J49
4211b3p8J52n9j01J54q9J68K33k32j5k06J36R6l9r5k5J06J9j91Q8q5R1L1p8l1
4236g3kK09l1k37J36m6J53j37J63j21J03k00j07L23p9j21Q2r3K9m8L9jJ31j21
4260d9M5Q3j82R5q9LN6K2N6j12R0R0j18J33j64j2L6Q1o1l1q2J7K3lJ56l9J3j14
$$ plain form
4288 -57 26 -160 -96 32 -13 -117 -170 40 -11 7 9 -72 4 -40 -75 -10 -122 34 -25 -107 0 -7 4 -116 1 -97 -97
4315 -97 -50 -28 -147 -91 52 -78 273 -86 -67 -221 120 -19 -179 -36 22 -5 -81 -92 3 -28 -110 -39 10 -177 43
4340 43 -135 113 28 47 -201 25 176 -37 -38 -83 -44 104 -48 -38 41 165 57 75 99 -111 15 24 76 -24 -15
4365 -15 -139 -130 -62 8 122 -17 25 81 -81 39 -34 214 50 22 -80 65 150 -72 88 -58 7 -72 -32 -151
4389 -151 71 59 -6 -19 -52 101 -164 -14 21 -130 142 15 -60 59 -24 106 15 181 -64 -85 143 -29 -40
4412 -40 25 -30 50 -59 -150 -101 -66 2 104 -125 0 -32 85 -50 -41 0 44 103 37 -46 -18 134 63 139 100 16 -62
4439 -62 15 -169 37 -47 138 73 26 55 20 -41 -29 165 44 205 -13 12 -51 179 -114 165 72 -87 -22 19 -37
4464 -37 29 -32 -44 -57 118 49 -32 -48 57 74 -70 -97 -134 228 -156 28 -84 -12 43 -33 65 -77 192 15 2
$$ packed form
4288e7Q3j86O4J28m5j04n3K10n1J8Kq1P6m4l5O5j12J56n9q2J07pJ1j20J17r8%
4315i7M7K2j19N6J43j30L51l59J9j54L41j39j60J43N8k7p6j1R5l1q2P1M9j87K20
4340D3j78K48q5J9k48K26J51k13jm5L9J48j52J0P9J24j08J8K4k10J26RN2j00R
4365a5j24RO8P0J14j39M2N6j62J20p3K48j64k8j02J45Q5k22J60j46O5p9M0j19
4389a51K22j2o5j3l3J53k65J50L5j51K72j27p5J19q3J30r1J66k45k1K28j72j1
4412d0O5n5Q0j09r1M9L5O8J02k29J25l2J17j35RM1M4N9o6q3K8J52p1P6l9q4p8
4439f2P7j84K06q4J85o5m7K9l5o1J2J94j21J61k18K5o3K30k93K79r3j59O5M1n6
4464c7O6o1j2j3J75o9q1j6J05J7j44k7l7L62l84J84j12P2N5p6R8j42K69j77j3
$$ plain form
4489 2 354 -125 43 -11 -85 -175 109 19 -2 52 28 69 -46 0 -76 -118 -55 -43 78 -138 -18 -39 -27 99 8 -29
4515 -29 31 -84 -39 -47 77 -44 78 4 -18 -20 84 41 59 -26 -229 -60 -131 -10 -96 107 46 -55 -54 -89 1 110
4541 110 69 -82 167 -58 41 -122 8 84 -10 -51 -41 92 -67 -51 -161 -56 31 127 -25 53 -14 -221 2 -15
4565 -15 -105 -32 42 92 76 152 45 23 136 60 154 -108 -196 -13 117 -23 156 -3 -121 190 -150 40 58 -48
4589 -48 -96 -36 -65 96 19 16 -214 100 23 -73 -15 217 52 -45 -47 -58 -125 229 -262 -128 -52 -29 -49 29 21 -127 69
4616 69 22 -12 68 -88 -34 -70 20 -126 119 128 25 79 29 -32 -37 68 -70 -54 -39 63 26 -49 -44 14 116 -62 -21
4643 -21 67 29 -25 91 -14 -73 -47 -111 -6 -147 72 -169 55 38 -228 -7 135 -134 31 -84 116 -112 160
4666 160 20 122 71 3 -43 -172 147 -100 2 -27 133 64 27 46 34 110 276 -116 45 -15 47 -99 -13 127
$$ packed form
4489BL52m79J68n4p4r0K84r0k1N4k4M1j15M6p6m2O3J2J21k16J20k1J2J26r1l7
4515b9O0j15M5qJ24j21J22p4k2kJ04m3J8q5k03J69p1J21q6K03o1j01Jl5R0J09
4541A10m1j51K49k25R9j63J30P6r4m1J0J33j59J6j10J05Q7R6j52P8o7k07K23j7
4565a5r0P3P4N0j6P6j07k2J13p6R4k62q8J83J30j40J79j59j18L11l40J90J8j06
4589d8m8O0k9J61p7lk30L14p7r6N8K32j65r7kj1o7L54m91J34P6K3k0P8qj48J96
4616F9m7l4Q0j56N4l6R0j46K45Rj03N4n0o1nJ05j38J6J5J02l7p5NN8J02j78M1
4643b1Q8l8n4J16j05n9K6o4J05j41K19k41K24j7k66K21J42k69J65j15K00k28K72
4666A60j40J02n1o8m6j29L19k47J02k9J60o9l7J9j2P6J66l92J61o0O2j46Q6J40
$$ plain form
4690 127 107 -55 90 -64 -90 -81 -45 -50 -37 100 119 49 -53 116 21 23 122 -4 35 -54 77 -55 38 53 6 -6 -71
4717 -71 -74 -83 -35 -97 -25 10 -132 -22 -151 -16 70 132 -80 36 28 55 202 -8 32 25 -63 82 11 -25 174 115 -63
4744 -63 94 26 153 -156 -69 -34 -191 -15 -51 -59 -57 45 -28 74 -28 113 99 -19 -23 -87 63 96 -171 -122 0
4769 0 31 9 -95 -74 -52 -123 23 1 -8 41 -80 54 20 238 57 54 59 92 27 30 12 -33 -81 132 32 48 46 71 64 13
4799 13 -163 78 -28 -227 -14 10 112 -73 75 -90 -19 31 -64 -52 74 46 -196 66 -76 55 10 62 -43
4822 -43 30 138 51 106 23 -7 66 169 -17 -167 -12 -174 40 -91 -82 183 54 -65 -27 -15 88 46 21 5 -71
4847 -71 -41 -36 -43 -67 121 32 45 3 -67 -80 -114 38 -13 -7 -42 1 198 -35 -59 2 -151 66 -23 -64 212 3 -83 49
4875 49 37 -118 -11 82 -149 197 192 -25 22 11 -58 93 -1 18 27 -238 -199 -51 -83 -109 -70 -53 52 166 -165 152
$$ packed form
4690A27k0j62J45j54k6RL6nJ3J37J9p0j02J69r5KR9j26L9q9J31j32R3J5m7j2o5
4717g1lrM8o2P2L5j42J10j29J35Q6O2k12J16qK7J47k10M0pq8J45p1l6J99n9j78
4744f3J57o8J27l09Q7L5j57J76l6qKJ02p3J02j02J41j4j18mo4J50L3k67M9J22
4769@L1k2j04K1K2p1J46k2rM9j21J34l4K18j81lNL3o5Lj8m5m8K13j00J6kK5pn1
4799A3j76K41j06j99K13K4J02j85J48j65P1N0r5J2J26k8k42K62j42J31m5N2j05
4822d3P3J08q7N5q3l0P3J03j86j50J55j62K14j31RK65j29j19L8J2J03m2k5j6p6
4847g1L0Npk4J88q9J3m2p0j3l4J52n1Ol5M3J97k33k4O1j53K17q9m1K76k09q6J32
4875D9j2j55J07R3k31L46nk17M7j1o9J51r4J9Rk65L9J48l2k6L9J7J05J14l31L17
$$ plain form
4901 152 21 -65 -1 37 -93 2 57 -181 5 70 -6 -70 -53 184 54 -146 25 112 119 -6 -61 -130 7 -91 158
4926 158 16 232 -40 52 66 11 -109 -80 45 -11 108 -80 -28 -27 -106 75 207 72 53 116 -55 -147 15 -44
4950 -44 -18 33 -28 -70 73 -16 -140 49 -85 12 9 -34 27 55 -96 83 44 -95 64 -179 156 -213 22 1 18
4975 18 147 21 42 -166 12 -64 64 -40 166 -13 -60 58 -124 1 104 -29 51 -100 -58 -37 98 -6
4997 -6 82 129 45 2 -2 0 -169 33 82 -17 31 -9 4 98 -105 109 105 25 172 142 88 59 111 -44 19 63 -192 -150 1
5026 1 54 166 96 20 -120 -17 -23 118 2 -38 -49 -187 -87 -93 5 18 116 55 -90 -29 -68 -76 245 44 12 6 25 157
5054 157 77 38 19 -41 18 -195 -137 -146 -11 -40 -23 -117 -28 -59 -19 -46 68 -49 6 -27 -9 41 -67 60 31 -145 45
5081 45 -117 140 25 -77 -3 -89 117 42 -87 -90 -59 -167 17 -112 8 -106 13 21 -22 -29 85 -111 91 -11
$$ packed form
4901A52j31q6O4L8j30R5N5k38J86O5p6o4J7K37j30k00J71Q7Pj25n5o9J37r8K49
4926A58j42K16k72R2J4n5j20K9J25n6J19j88N2Jp9J81J32j35j9O3j71r2J62n9
4950d4K6N1o1m2J43q9j24J89j34R7lm3O1K8j51J79l9j39J59k43L35l69K35k1J7
4975A8J29j26K1k08J78p6J28j04K06j79m7J18j82J25J03j33Q0j51M2K1J35j04
4997fQ8M7q4m3mKj69K02M9r9M8m0J3R4k03K14mq0J47l0n4k9N2j55O3M4k55M2J51
5026AN3J12p0p6j40J03oJ41j16m0j1j38J00oR8J3R8o1j45O1l9qL21k01l2oJ9J32
5054A57q0l9j9o0N9k13N8rJ35k9J7r4Q9l1M0k7J14j17N5l3J8N0j08J27k9j76J90
5081D5j62K57j15j02P4q6K06p5j29lL1j08J84j29J20j14J19Qm3pJ14j96K02j02
$$ plain form
5105 -11 6 29 -29 108 -112 -38 233 65 -52 58 -23 84 9 41 -96 71 3 122 -151 3 -58 207 -166
5128 -166 -93 275 -71 -142 -132 -29 -15 105 50 -70 -50 -71 -35 -6 -130 87 -173 89 -14 75 92 106 -6 -32
5152 -32 -122 -2 101 -173 6 127 124 179 -50 59 2 -84 -78 -114 97 106 25 -25 -29 62 3 -79 87 56 19 11 -64 -143
5180 -143 83 116 31 115 42 -118 -2 -39 3 -50 69 142 -22 -173 57 89 28 -234 -9 19 -12 -185 43 -212
5204 -212 -122 -105 -46 39 -55 86 17 -33 -32 35 40 86 -26 64 103 -24 -71 -8 -71 -85 15 161 182 164 -98 -92 -58 -27
5232 -27 28 120 122 107 -27 66 -126 -6 182 -140 48 158 -104 -38 18 60 -72 54 42 -57 167 -126 -168 53
5256 53 -43 21 89 56 -42 14 -40 -122 -47 25 23 -203 29 -73 -74 118 103 93 -9 -125 -102 115 -65 -83 -177 33 -40
5283 -40 152 62 218 151 -6 4 115 -4 -75 -125 -11 60 -51 -32 -3 104 -133 -68 -100 52 55 -84 34 -136
$$ packed form
5105a1J7K3n8J37k20P4K71j68j17J10q1J07p5L2j37J67o8J19k73J54o1K65l73
5128a66P3L68l46p1J0J03J4J20n5j20K0k1L6K9j24K17k60K62j03Q9J7J4j12k6
5152c2r0J20J03k74J79J21lN5k29J09n7q6Ol6K11Rq1n0mR1n9q2J66l1l7qp5p9
5180a43K26L3q5Q4p3j60J16l7M2n3J19P3j64j51K30L2o1k62K25K8l1j73K28k55
5204b12R0J7N9Q5r4J41o9n0JO7NM6j12R0L9j27m7O3o3j4J00J46K1j8k62OL4L1
5232b7N5R2Kj5j34R3j92J20J88l22J88J10k62O6N6M2j32J26j2r9K24k93m2K21
5256E3r6O4O8l3r8N6n4q2P5P2kk26K32j02jJ92j5j0j02j16K3K17j80j8r4K10p3
5283d0J92r0J56o7j57J0J11j19p1n0J14P1j11J9K9J07k37O5l2J52Lj39J18j70
$$ plain form
5307 -136 -36 -64 62 -139 189 -25 -89 -79 -39 22 104 -16 59 198 243 119 98 153 47 7 -150 105 13 -18
5331 -18 -53 -25 -255 142 -23 -70 -3 -32 -107 114 164 -5 107 -4 55 42 -7 -35 -35 -75 -25 4 -60 -73 54 29 218
5358 218 -30 -69 -90 -66 -161 -44 37 105 36 46 110 -211 64 69 -9 -107 -148 79 -45 -28 -38 -90 -215 -118 -13 24
5384 24 98 -146 -169 -39 -89 99 158 12 -22 44 30 30 67 -200 81 47 -71 34 20 131 -53 -22 131 -11 35
5409 35 -61 -50 -8 -9 75 30 -149 -34 17 -163 76 106 -46 111 92 294 -21 -38 4 -93 -81 20 186 36 70
5434 70 -108 119 -41 -34 156 -23 -36 -168 -52 134 -52 -60 -60 -48 52 -18 -45 -79 -83 -47 -51 56 27 244 0 -38
5460 -38 41 194 96 154 -129 -182 14 89 -45 -93 -102 -25 69 -24 -1 -11 74 60 39 267 -162 -38 71 27 48 145 -63
5487 -63 -47 49 -104 16 -47 -40 41 -57 -87 63 -60 0 -69 42 29 8 208 -79 -105 39 162 80 56 -58 13 -78
$$ packed form
5307a36J00k8J26k01L28k14o4J0M0O1Q2j20P5J39M5j24k1N5j06m0j57K55r2l1
5331a8l5K8k30L97j65m7O7k9p5K21N0j69J12j11N9j3m9k8%m0N0K9o4j3J27k5J89
5358B18k48l9k1K4r5J17Q1O8o9J0O4l21K75Np8r8m1K27j24J7j0n2j25R7J05L7
5384B4P4k44k3J30n0J88N9j46l4O6j4%L7k67K81l4j18J05j4J11j84L1J53j42M6
5409C5r6J1M2jQ4m5j79J15N1j80K39L0j52J57j9K02l15j7M2r7J2J01J66j50L4
5434G0j78K27j60PJ90j79j3j32J16J86j86q%J2J00p0k7l4mL6mJ07k9K17k44l8
5460c8P9J53r8N8k83n3J96P5j34m8rP7R4r3K3j0Q5j4k1K28m29J24J09m4K1R7k08
5487f3J6R6j53J20o3PQ1r8l0J50j23O0o9J11j3k1K00k87k6J44J23q2k4j14P1r1
$$ plain form
5513 -78 -42 65 168 33 184 -77 -79 -1 22 141 118 -13 -6 -28 12 -5 122 -113 22 -42 -95 34 78 32 -67 -192
5539 -192 98 57 20 -68 117 -36 24 128 15 25 -99 143 -21 64 -38 78 -122 50 36 -7 98 116 57
5562 57 -79 -33 -36 223 -21 -25 169 -15 -76 120 -108 -14 -106 44 68 -49 -47 65 -142 160 53 -14 143 133 37
5587 37 -53 75 118 32 -39 79 196 -3 -51 46 0 -98 -62 -85 -148 -111 77 154 54 -92 -43 61 51 18 17 -61 52
5614 52 -29 -154 -39 10 159 92 -47 -116 45 -49 38 1 6 8 43 -34 -101 -204 35 132 105 161 64 -170 -19 -124
5640 -124 188 86 -45 -41 -117 63 23 -105 148 69 -50 -11 -163 82 13 -121 2 -53 -73 43 -139 -7 29
5663 29 -22 -186 47 74 -180 107 24 -42 45 -32 -2 30 23 41 123 60 49 -24 -57 -65 -59 77 -9 -13 -65 59 -124 -32 -73
5692 -73 11 141 -63 -83 -139 38 199 69 4 166 -29 -36 162 -137 -14 110 57 137 67 12 -126 37 173 -34
$$ packed form
5513g8L6J07J03j35J51k61kP8K3J19k3j31Pk2M0j7J27k35J35o4n3J29M4m6r9j25
5539a92K90m1l7q8J85j53O0J04j13J0j24K42j64Q5j02J16k00J72j4m3J05J8n9
5562E7j36M6lK59k44mJ94j84o1J96k28R4r2J50K4j17KJ12k07L02j07o7J57j0r6
5587C7r0J28M3q6p1J18J17j99m8R7m6r8L6k3o3L7J88P7j00j46M9J04j0l3jp8J13
5614E2q1j25J15M9J49o7j39o9J61r4Q7l7NKL5p7o7j03K39R7k7N6r7k34J51j05
5640a24L12j02j31Mp6J80m0j28K53p9j19L9j52K45o9j34J23n5k0J16j82J32L6
5663B9n1j64K33K7k54K87q3o6Q7p7L0L2pJ8Q2o3j1p3l3qOJ36q6mn2J24j83R2m1
5692g3Q4J30k04k0n6J77J61j30o5J62j95pJ98k99J23J24n3Q0p0n5j38J63J36k07
$$ plain form
5716 -34 -30 -52 -56 -91 65 46 26 -12 -74 -16 -68 -142 -85 95 98 224 65 -71 -109 37 124 -65 22 -39 -125 -57 98 0
5744 0 -49 98 17 113 131 63 40 99 -135 -105 51 -41 -58 80 125 59 70 -8 -46 16 2 52 -74 10 -102 -45 30 -122
5772 -122 -33 78 -63 -2 -161 -35 18 -4 131 109 -101 25 -116 -45 67 81 -225 -55 178 44 109 -9 58
5795 58 34 6 -76 2 -10 -97 8 -33 162 73 64 -95 -61 263 61 22 29 -100 84 -150 95 36 -113 -36 65 -2
5821 -2 67 59 67 -61 112 -114 78 -108 140 1 151 -105 -117 2 79 -82 -50 -42 74 -12 -143 -73 -143 1 -5 87
5847 87 -177 -39 27 -46 105 -65 -184 8 -290 -124 -72 -185 -95 32 119 18 0 -152 105 -181 -66 -23 -1
5870 -1 220 -29 13 -23 94 -46 5 -138 203 -29 -104 -115 11 -54 59 -26 -165 -204 -17 49 86 -89 -152 -6
5894 -6 77 90 1 70 78 76 -91 -40 -53 -49 -42 -83 -10 7 11 5 19 49 97 39 -62 38 85 27 92 -59 -43 -76 53 -57 -91
$$ packed form
5716c4Mk2ml5J56j9k0l8o2N8n2p4N7J80LJ26j59j36l8J46Q7j89Q7o1q6O8J55r8
5744@m9J47q1R6J8o8k3N9k34L0J56r2j7J38M5o6J1p8l8O2j4N0j26Q4j12N7P5j52
5772a22Q9J11j41O1j59J26N3k2J35k2k10J26j41P1J12J4l06J70K33j34O5j18O7
5795E8k4k8q2P8j2q7J05m1J95q9rj59L4L24k02l9Pj29J84k34K45n9j49P7J01o7
5821bO9qQj28J73k26J92j86K48j39J50k56j2J19P7j61L2QJ16q6j31P0p0J44oR2
5847H7k64J38O6p3J51j70j19J92k98J66N2j13R0J27Q7j01j8j52K57k86J15M3K2
5870aK21k49M2l6J17j40N1j43L41k32p5j1J26o5J13q5j39l9J87O6L7j75o3J46
5894fQ3J3q9O9Qkj67N1j3MPm1P3J7MoJ4L0M8n8j01J00M7n8O5j51J6l3J29j10l4
$$ plain form
5925 -91 25 76 164 -63 -74 64 -25 18 120 -25 94 11 16 -27 -20 -39 74 55 -100 76 27 27 104 4 -38 -55 33
5952 33 -119 19 125 -19 -70 133 69 -64 204 -53 89 29 -6 46 -43 -16 -44 52 56 0 -13 65 39 -4 -110 6
5978 6 38 58 -67 105 -47 137 100 42 104 -74 17 -26 105 113 -210 -71 60 188 -87 -63 54 -48 68 19
$$ packed form
5925i1J16N1Q8k27j1J38q9M3J02j45J19q3Nm3Pj9J13j9j55J76m9%P7j00m2j7Q8
5952C3j52J38J06j44n1K03o4j33K68k57J42o0l5N2q9K7k8R6Mn6j3P8k6m3j06J16
5978FL2K0j25J72j52J84l7n8O2j78R1m3J31Ql23J39J31J28k75K4J17j02J16m9
$$ [...]
8191H3
##END NTUPLES=NMR FID
##END=
