##TITLE=1H_ABn1904
 CDCl3
 8 sc, 
 20.4.2023
##JCAMPDX= 6.0         $$ Bruker NMR JCAMP-DX V2.0
##DATA TYPE= NMR FID
##DATA CLASS= NTUPLES
##ORIGIN= UXNMR, Bruker Analytische Messtechnik GmbH
##OWNER= root
$$ XWIN-NMR		Version 3.5
$$ Thu Apr 20 13:47:18 2023 Russian Standard Time (UT+4h)  she@DPX200
##.OBSERVE FREQUENCY= 200.1316
##.OBSERVE NUCLEUS= ^1H
##.DELAY= (6, 6)
##.ACQUISITION MODE= SIMULTANEOUS
##.ACQUISITION SCHEME= undefined
##.AVERAGES= 8
##.DIGITISER RES= 18
##SPECTROMETER/DATA SYSTEM= spect
##.PULSE SEQUENCE= zg30
##.SOLVENT NAME= CDCl3
##.SHIFT REFERENCE= (INTERNAL, CDCl3, 0, 15.7039)
##AUDIT TRAIL= $$ (NUMBER, WHEN, WHO, WHERE, WHAT)
$$ ##TITLE= Audit trail, XWIN-NMR		Version 3.5
$$ ##JCAMPDX= 5.01
$$ ##ORIGIN= Bruker BioSpin GmbH
$$ ##OWNER= she
$$ F:/spectra/data/she/nmr/H-F/1/audita.txt
$$ ##AUDIT TRAIL=  $$ (NUMBER, WHEN, WHO, WHERE, WHAT)
(   1,<2023-04-20 13:46:13.07 +0400>,<she>,<DPX200>,
      <created by zg, POWCHK disabled, PULCHK disabled
       configuration hash MD5:
       00 E9 B6 7A A2 85 ED C7 34 08 36 98 17 FE 4E 26
       data hash MD5: 16K
       5F 48 F3 45 F9 0D 75 D9 DA 54 55 5B B6 40 15 91>)
$$ ##END=
$$ 
$$ hash MD5
$$ CB E1 24 D9 AF 9F 77 97 8E E3 2B C9 0B 26 1A 8B
##$RELAX= 
##$RELAX= 
##$RELAX= 
##$RELAX= 
##$RELAX= 
##$RELAX= 
$$ Bruker specific parameters
$$ --------------------------
##$DU= <F:/spectra>
##$EXPNO= 1
##$NAME= <H-F>
##$PROCNO= 1
##$TYPE= <nmr>
##$USER= <she>
##$AMP= (0..31)
100 100 100 100 100 100 100 100 100 100 100 100 100 100 100 100 100 100 
100 100 100 100 100 100 100 100 100 100 100 100 100 100 
##$AQSEQ= 0
##$AQ_mod= 1
##$AUNM= <au_zg>
##$AUTOPOS= <>
##$BF1= 200.13
##$BF2= 200.13
##$BF3= 200.13
##$BF4= 200.13
##$BF5= 200.13
##$BF6= 200.13
##$BF7= 200.13
##$BF8= 200.13
##$BYTORDA= 1
##$CFDGTYP= 0
##$CFRGTYP= 5
##$CHEMSTR= <none>
##$CNST= (0..31)
1 1 145 1 1 1 1 1 1 1 1 1 1 1 1 1 1 1 1 1 1 1 1 1 1 1 1 1 1 1 1 1 
##$CPDPRG= <>
##$CPDPRG1= <>
##$CPDPRG2= <>
##$CPDPRG3= <>
##$CPDPRG4= <mlev>
##$CPDPRG5= <mlev>
##$CPDPRG6= <mlev>
##$CPDPRG7= <mlev>
##$CPDPRG8= <mlev>
##$CPDPRGB= <>
##$CPDPRGT= <>
##$D= (0..31)
0 1.2 0 0 0 0 0 0 0 0.06 0 0.03 0 0 0 0 0.0002 0 0 0 0 0 0 0 0 0 0 0 0 
0 0 0 
##$DATE= 1681983972
##$DBL= (0..7)
120 120 120 120 120 120 120 120 
##$DBP= (0..7)
150 150 150 150 150 150 150 150 
##$DBP07= 0
##$DBPNAM0= <>
##$DBPNAM1= <>
##$DBPNAM2= <>
##$DBPNAM3= <>
##$DBPNAM4= <>
##$DBPNAM5= <>
##$DBPNAM6= <>
##$DBPNAM7= <>
##$DBPOAL= (0..7)
0.5 0.5 0.5 0.5 0.5 0.5 0.5 0.5 
##$DBPOFFS= (0..7)
0 0 0 0 0 0 0 0 
##$DE= 6
##$DECBNUC= <off>
##$DECIM= 32
##$DECNUC= <off>
##$DECSTAT= 4
##$DIGMOD= 1
##$DIGTYP= 9
##$DL= (0..7)
0 120 120 120 120 120 120 120 
##$DP= (0..7)
150 150 150 150 150 150 150 150 
##$DP07= 0
##$DPNAME0= <>
##$DPNAME1= <>
##$DPNAME2= <>
##$DPNAME3= <>
##$DPNAME4= <>
##$DPNAME5= <>
##$DPNAME6= <>
##$DPNAME7= <>
##$DPOAL= (0..7)
0.5 0.5 0.5 0.5 0.5 0.5 0.5 0.5 
##$DPOFFS= (0..7)
0 0 0 0 0 0 0 0 
##$DQDMODE= 0
##$DR= 18
##$DS= 0
##$DSLIST= <SSSSSSSSSSSSSSS>
$$ [...]
##$SUBNAM2= <"">
##$SUBNAM3= <"">
##$SUBNAM4= <"">
##$SUBNAM5= <"">
##$SUBNAM6= <"">
##$SUBNAM7= <"">
##$SUBNAM8= <"">
##$SUBNAM9= <"">
##$SW= 18.0517057926174
##$SWIBOX= (0..15)
0 0 2 0 0 0 0 0 0 0 0 0 0 0 0 0 
##$SW_h= 3612.71676300578
##$TD= 16384
##$TD0= 1
##$TE= 0
##$TE2= 300
##$TE3= 300
##$TEG= 300
##$TL= (0..7)
0 120 120 120 120 120 120 120 
##$TP= (0..7)
150 150 150 150 150 150 150 150 
##$TP07= 0
##$TPNAME0= <>
##$TPNAME1= <>
##$TPNAME2= <>
##$TPNAME3= <>
##$TPNAME4= <>
##$TPNAME5= <>
##$TPNAME6= <>
##$TPNAME7= <>
##$TPOAL= (0..7)
0.5 0.5 0.5 0.5 0.5 0.5 0.5 0.5 
##$TPOFFS= (0..7)
0 0 0 0 0 0 0 0 
##$TUNHIN= 0
##$TUNHOUT= 0
##$TUNXOUT= 0
##$USERA1= <user>
##$USERA2= <user>
##$USERA3= <user>
##$USERA4= <user>
##$USERA5= <user>
##$V9= 5
##$VALIST= <valist>
##$VCLIST= <CCCCCCCCCCCCCCC>
##$VD= 0
##$VDLIST= <DDDDDDDDDDDDDDD>
##$VPLIST= <PPPPPPPPPPPPPPP>
##$VTLIST= <TTTTTTTTTTTTTTT>
##$WBST= 1024
##$WBSW= 4
##$XGAIN= (0..3)
0 0 0 0 
##$XL= 0
##$YL= 0
##$YMAX_a= 91325
##$YMIN_a= -117574
##$ZGOPTNS= <>
##$ZL1= 120
##$ZL2= 120
##$ZL3= 120
##$ZL4= 120
##$ABSF1= 10
##$ABSF2= 0
##$ABSG= 5
##$ABSL= 3
##$ALPHA= 0
##$AQORDER= 0
##$ASSFAC= 0
##$ASSFACI= 0
##$ASSFACX= 0
##$ASSWID= 0
##$AUNMP= <proc_1d>
##$AZFE= 0.1
##$AZFW= 0.1
##$BCFW= 1
##$BC_mod= 2
##$BYTORDP= 1
##$COROFFS= 0
##$CY= 11.3945322036743
##$DATMOD= 1
##$DC= 2
##$DFILT= <>
##$DTYPP= 0
##$F1P= 15.7292609196834
##$F2P= 12.9074282941183
##$FCOR= 0.5
##$FTSIZE= 0
##$FT_mod= 4
##$GAMMA= 1
##$GB= 0.15
##$INTBC= 1
##$INTSCL= 1
##$ISEN= 128
##$LB= 0.24
##$LEV0= 0
##$LPBIN= 0
##$MAXI= 10000
##$MC2= 0
##$MEAN= 0
##$ME_mod= 0
##$MI= 1.114404
##$NCOEF= 0
##$NC_proc= 0
##$NLEV= 6
##$NOISF1= 3.799351
##$NOISF2= 2.8
##$NSP= 1
##$NTH_PI= 0
##$NZP= 0
##$OFFSET= 15.70392
##$PC= 1
##$PHC0= -19825.27
##$PHC1= 5.80081
##$PH_mod= 1
##$PKNL= yes
##$PPARMOD= 0
##$PSCAL= 0
##$PSIGN= 0
##$REVERSE= no
##$SF= 200.130013532006
##$SI= 16384
##$SIGF1= 3
##$SIGF2= 2
##$SINO= 400
##$SIOLD= 16384
##$SREGLST= <1H.CDCl3>
##$SSB= 0
##$STSI= 0
##$STSR= 0
##$SW_p= 3612.71676300578
##$SYMM= 0
##$S_DEV= 0
##$TDeff= 0
##$TDoff= 0
##$TI= <>
##$TILT= no
##$TM1= 0
##$TM2= 0
##$TOPLEV= 0
##$USERP1= <user>
##$USERP2= <user>
##$USERP3= <user>
##$USERP4= <user>
##$USERP5= <user>
##$WDW= 1
##$XDIM= 8192
##$YMAX_p= 0
##$YMIN_p= 0
$$ End of Bruker specific parameters
$$ ---------------------------------
##NTUPLES= NMR FID
##VAR_NAME=  TIME,          FID/REAL,        FID/IMAG
##SYMBOL=    X,             R,               I
##VAR_TYPE=  INDEPENDENT,   DEPENDENT,       DEPENDENT
##VAR_FORM=  AFFN,          ASDF,            ASDF
##VAR_DIM=   8192,          8192,            8192
##UNITS=     SECONDS,       ARBITRARY UNITS, ARBITRARY UNITS
##FACTOR=    0.0002768,     1,               1
##FIRST=     0,             0,               0
##LAST=      2.2672688,     0,               0
##MIN=       0,             -117574,         0
##MAX=       2.2672688,     91325,           0
$$ Real data points
##PAGE= N=1
##DATA TABLE= (X++(R..R)), XYDATA
0@%%%%%%%%%%%%%%pJ5j6J6j6K1k9L2l7M5n2O0p2Q4r3J06j22J40j63J85k09K37
$$ 0 0 0 0 0 0 0 0 0 0 0 0 0 0 0 -7 8 -8 8 -8 13 -16 16 -21 24 -28 32 -40 44 -49 57 -65 75 -88 97 -112 125
36A25k66K98l34L72m13M60n11N67o28O94p66Q46r32J027j131J243j370J513j671
$$ 125 -141 157 -177 195 -218 242 -269 298 -330 364 -402 444 -488 539 -592 651 -719 794 -877
55h77J849k051K280k546K856l222L668m225M940n894P241r305J2917k1078P6915
$$ -877 972 -1079 1201 -1345 1511 -1711 1957 -2268 2672 -3222 4019 -5286 7631 -13447 63468
70F3468K984n5836M9758m7855o675N0971k7886q4356J6766M777l9048K8783M1928
$$ 63468 66452 10616 60374 12519 5844 56815 28929 -55427 -38661 -33884 -72932 -44149 -2221
83b221o2742k7214M4526p340q677P2281M815n8005K6041L8998k4007L8865N6005
$$ -2221 -64963 -92177 -47651 -54991 -63668 8613 13428 -44577 -18536 20462 -3545 35320 91325
96I1325m9124l4906M3303p986j8061N0383m813p4845q57K1789l7840N284L7992
$$ 91325 42201 7295 50598 42612 24551 74934 70121 -4724 -5581 16208 -21632 -16348 21644
109B1644n0580n0704L2484j431k8382M7712J5142o2344P615M4195j8798J9378
$$ 21644 -28936 -79640 -47156 -48587 -76969 -29257 -14115 -76459 -68844 -24649 -43447 -24069
121b4069O0355k7359l6821M4068J5743j6740M6661K0553n8345n511L6666k3166
$$ -24069 36286 8927 -27894 16174 31917 15177 61838 82391 24046 18535 55201 32035
133C2035m822M0820l2602n6083K2718N466l6347K4842J7013n9035j5063L4958
$$ 32035 27213 68033 35431 -20652 2066 7532 -28815 -3973 13040 -45995 -61058 -26100
145b6100j7037m459M6787j4016m4205K9425K5324j7042L2519L4547l9880j3165
$$ -26100 -43137 -47596 -809 -14825 -59030 -29605 -4281 -21323 11196 45743 5863 -7302
157g302M3207l066r200M3914q075n2165J5914K0201l1718J1680K5176m9515l1004
$$ -7302 35905 32839 23639 67553 59478 7313 23227 43428 11710 23390 48566 -949 -31953
170c1953K9085j1940k1822L3685n533n3420J0138K7101k1696J4266L7863l1338
$$ -31953 -2868 -14808 -36630 -2945 -8478 -61898 -51760 -24659 -46355 -32089 5774 -25564
182b5564k4139M0661P990j1843M1453J1034m3422J0661L3142j7956O743L4053
$$ -25564 -49703 -9042 -1052 -12895 28558 39592 -3830 6831 39973 22017 28760 62813
194F2813l0333l4709K5433J010k4660K2801L961n1268q087K5005j9098m118L1437
$$ 62813 32480 -2229 23204 24214 -446 22355 26316 -24952 -33039 -8034 -27132 -31250 187
207A87k3946l7587K6716J4840j6422K8384K0163l8096j469L8737m703R67L8487
$$ 187 -23759 -61346 -34630 -19790 -36212 -7828 12335 -25761 -27230 11507 6804 7771 46258
220D6258j2258l5654K4187J7671k0446J8231J6710m4117j7182K7623j2477j3951
$$ 46258 34000 -1654 22533 40204 19758 37989 54699 10582 -6600 21023 8546 -5405
232e405K6490j6820m6571J3596J7164k1978J2971K0986l6835j5566L4965J418
$$ -5405 21085 4265 -42306 -28710 -11546 -33524 -20553 433 -36402 -51968 -17003 -15585
244a5585o581L3266m05l5213J7619K9092j2031J2313K6335k9917k1297L0838K351
$$ -15585 -22166 11100 10695 -24518 -6899 22193 10162 22475 48810 18893 -2404 28434 30785
257C0785j5680K2235m403m5078K557K2722j8824j225J9364l1424k9559K6864O950
$$ 30785 15105 37340 32937 -12141 -9584 13138 -5686 -6911 12453 -18971 -48530 -21666 -14716
270a4716j6642K1809N042l7564N698L3903p639K824K9579j7907k4878L1236J6121
$$ -14716 -31358 -9549 -4507 -42071 -36373 -2470 -10109 -7285 22294 4387 -20491 10745 26866
283B6866j5009K0020R486l7955j908L0261j0971q190K0830k1996l4778J9330J2392
$$ 26866 11857 31877 41363 3408 1500 31761 20790 12600 33430 11434 -23344 -4014 8378
296H378k1707R407Q232l7560q472L0919m629q945K3736j0123k9613K2917K4143
$$ 8378 -13329 -3922 4310 -33250 -41722 -10803 -15432 -24377 -641 -10764 -40377 -17460 6683
309F683j2680J1953J8129k7415p819L4211K126j0983K1135o908l3585J3918K1688
$$ 6683 -5997 5956 24085 -3330 -11149 23062 25188 14205 35340 28432 -5153 8765 30453
322C0453j8668M18J2740l1437j8849K6656o66j8406J5310m670l4643J0727K5864
$$ 30453 11785 12203 24943 -6494 -25343 1313 647 -17759 -2449 -7119 -41762 -31035 -5171
335e171j4102J427K0231k1185j4887L2596J0158j2828J9611N213k9126R715K9714
$$ -5171 -19273 -17846 2385 -18800 -33687 -1091 9067 -3761 15850 21063 -8063 1652 31366
348C1366j0814l242J8651k0427k2877K3960P320k0626Q703J590l4429j720K5183
$$ 31366 20552 17310 35961 15534 -7343 16617 23937 3311 12014 13604 -20825 -22545 2638
361B638j2259r947J6556j5935k4154K3217J5516j5455J1171J2093k5505J218L3184
$$ 2638 -9621 -19568 -3012 -18947 -43101 -19884 -4368 -19823 -8652 3441 -22064 -20846 12338
374A2338j898o834K1299p720k3430K1342J8115j6910M847J0334k8686r158K5323
$$ 12338 10440 3606 24905 17185 -6245 15097 33212 16302 21149 31483 2797 -6361 18962
387A8962o012j6269J2934j0494l0288J3255J7288j7739J187J2822k3498r633K9897
$$ 18962 12950 -3319 9615 -879 -31167 -17912 -624 -18363 -17176 -4354 -27852 -37485 -7588
400g588L671j1477J8021N96k3715J5999K6273j0501J203J6405j8616j3148K6764
$$ -7588 -3917 -15394 2627 3223 -20492 -4493 21780 11279 12482 28887 10271 -2877 23887
413B3887M591j7065J0213j579k9959M555K1345j4675q583J1658j9883j9139K2902
$$ 23887 28478 11413 21626 20047 -9912 -5357 15988 1313 -7270 4388 -15495 -34634 -11732
426a1732P711j7038R604M574k4962O354K8977o020m698J7957j0470j5561K5703
$$ -11732 -4021 -21059 -11455 -6881 -31843 -25489 3488 -2532 -7230 10727 257 -15304 10399
439A0399J4698j4512Q197P007k4173M07K5721p840j2235J1541j3703k3399J6858
$$ 10399 25097 10585 18782 25789 1616 2023 27744 19904 7669 19210 5507 -17892 -1034
452a034J2151j9212O08N775k4940l881K6471l066j2439J3368n059j9219J9678
$$ -1034 11117 -8095 -7487 -1712 -26652 -30533 -4062 -7128 -19567 -6199 -11258 -30477 -10799
465a0799K1266j2402K650J3060j7377l315K8837K284j3828J1411l040k2540J2520
$$ -10799 10467 -1935 715 13775 -3602 -6917 21920 24204 10376 21787 18747 -3793 8727
478H727J9002j6351n965Q167k0733j2443K3327P35j9026O842j949k2987J0478
$$ 8727 27729 11378 5413 13580 -7153 -19596 3731 4466 -14560 -7718 -9667 -32654 -22176
491b2176K2468j1675n237J3393j2197q667K7238R706j3788R219N499j8540R221
$$ -22176 292 -11383 -16620 -3227 -15424 -24091 3147 12853 -935 8284 13783 -4757 4464
504D464K5334r495r149J1409j2311j5032J9945P889k0410K78K138k2870N96K2061
$$ 4464 29798 20303 11154 22563 10252 -4780 15165 23054 2644 2922 5060 -17810 -17214 4847
518D847r950j4148J0228q596j5234K0294J4290j5929L114J0640j5145L160K7507
$$ 4847 -5103 -19251 -9023 -17619 -32853 -12559 1731 -14198 -11084 -444 -15589 -12429 15078
531A5078j480j1222J3210k808j5050J8118J5370j6991k505P354j8040n418K1586
$$ 15078 13598 2376 15586 12778 -2272 15846 31216 14225 11720 19074 1034 -4384 17202
544A7202m992j8656N785m886j9565J2068J5182j6377m946J0229j3086m564K4935
$$ 17202 12210 -6446 -661 -5547 -25112 -13044 2138 -14239 -19185 -8956 -22042 -26606 -1671
557a671L360j3820J0156M173j4281J3472K1791j0887n350J2555j0381q822K2037
$$ -1671 1689 -12131 -1975 2198 -12083 1389 23180 12293 6943 19498 9117 295 22332
570B2332L692j9073L163J630j9636M357J7684j4035j2433R088j0582j2629J9011
$$ 22332 26024 6951 10114 11744 -7892 -3535 14149 114 -12319 -3231 -13813 -26442 -7431
583g431O910j7487L585P519j5169N997K3788n947q865J3300l513r894K0019J1936
$$ -7431 -521 -18008 -14423 -6904 -22073 -16076 7712 1765 -7100 6200 2687 -7207 12812 24748
597B4748j5423R92P480j4978L27K0692p404j5906O989n335j6058J3203J0057j8096
$$ 24748 9325 10317 17797 2819 3146 23838 16434 528 7517 2182 -13876 -673 9384 -8712
611h712m244P294j3955k740K1712k462j4330R443J125j2666J5424J7400j2374
$$ -8712 -12956 -5662 -19617 -22357 -645 -3107 -17437 -7994 -6869 -19535 -4111 13289 915
624I15k725J1710r283k469K2468J065j6340O410J375j5358R358J4898j5470r482
$$ 915 -1810 9900 617 -1852 20616 21681 5341 11751 13126 -2232 7126 22024 6554 -2928
638b928P967j1625q432J8046Q06j8308L142K865j4178Q191J8637j0452q274J1190
$$ -2928 5039 -6586 -15018 3028 3834 -14474 -11332 -8467 -22645 -14454 4183 -6269 -14543 -3353
652c353n059n349K0945P259j5000L644P341j1082O252J9218r394j1973Q621m990
$$ -3353 -8412 -13761 7184 14443 -557 3087 10428 -654 5598 24816 15422 3449 12070 7080
666G080j1125J5221N812j9071k467N279j4004O43J7611q260j4746Q366j780j0299
$$ 7080 -4045 11176 16988 -2083 -4550 729 -13275 -12632 4979 -3281 -18027 -9661 -11441 -21740
680b1740J6208J1154j5258q09J0978q490K458K1489l127j3787R266J844j0314
$$ -21740 -5532 5622 -9636 -10445 533 -7957 -5499 15990 12863 -924 8342 10186 -128
693a28J2968J1717j6440n705Q295j0458m020J6621m448j8092L814J047j2384R300
$$ -128 12840 24557 8117 2412 10707 249 -3771 12850 8402 -9690 -5876 -4829 -17213 -7913
707g913J2016j4407p110R983n579k828J9065J719j4563O010P107q623R377J6010
$$ -7913 4103 -10304 -17414 -7431 -13010 -15838 3227 4946 -9617 -3607 3500 -5123 4254 20264
721B0264j1079q237J0785m242o159J5644J870j8136P24N046j2041L187J3533j2318
$$ 20264 9185 948 11733 7491 1332 16976 18846 710 1434 6480 -5561 -2374 11159 -1159
735a159j2875Q386l216q589J4836M723j6604J084R404p901M064J7677o924j0714
$$ -1159 -14034 -5648 -8864 -17453 -2617 2106 -14498 -13414 -4010 -11911 -7847 9830 2906 -7808
749g808J0741J441o955J4302P917j5624j360Q922q662k08J5181p487j5235O302
$$ -7808 2933 4374 -2581 11721 19638 4014 2654 11576 2914 2706 17887 10400 -4835 1467
763A467l5j0190R103P473j6437m948Q953o880j867J5452k869j4040P343N178p885
$$ 1467 1432 -8758 345 7818 -8619 -13567 -4614 -11494 -13361 2091 -778 -14818 -7475 -2297 -10182
778a0182J0065J2309j2534m833J1987l865k789J5871q12j5529M772N209j0210
$$ -10182 -117 12192 -342 -5175 6812 2947 158 16029 15217 -312 4460 9669 -541
791e41N769J1071j3910r305R010m872o653J3325m58j6708K405O771r094N028J3226
$$ -541 5228 16299 2389 -6916 2094 -2778 -9431 3894 3436 -13272 -10867 -4096 -13190 -8162 5064
806E064j0045q809J0960J43m800J4095M450j4051K002R332o685L297J3465q505
$$ 5064 -4981 -13790 -2830 -2687 -7487 6608 11058 -2993 -991 8341 1656 4953 18418 9913
820I913j1439Q095Lp801R884L903j6723k489P366p353j106J2594p417j3496P735
$$ 9913 -1526 6569 6572 -1229 8655 12558 -4165 -6654 712 -6641 -7747 4847 -2570 -16066 -8331
835h331K574p389J0554P815j4089j507J1363l920L35J4912l302j2824P821N054
$$ -8331 -5757 -13146 -2592 5223 -8866 -10373 990 -2930 -2595 12317 9015 -3809 4012 9066
849I066p530Q359Q172j4035n786R380n099l759J1343m269j5784L647M635q496
$$ 9066 1536 9895 18067 4032 -1754 7626 2527 -1232 10111 5842 -9942 -6295 -1660 -10156
863a0156N074Q850j2735o877J0290j125l318J2861O09j3264M889Q979n551N325
$$ -10156 -5082 3768 -8967 -15844 -5554 -6679 -9997 2864 3473 -9791 -4902 4077 -1474 3851
877C851J1279r903p846J0478K6n362J0341J025j5944P45P574p766P26R431j0634
$$ 3851 15130 5227 -2619 7859 7885 2523 12864 13889 -2055 -1310 6264 -1502 -776 8655 -1979
892a979j1552Q785P22o970R486L064j4711R89J0333m663J720J2350o529r982J0448
$$ -1979 -13531 -4746 -4024 -10994 -1508 1556 -13155 -12166 -1833 -6496 -4776 7574 1045 -8937 1511
907A511M359n849R073N321j3576j180R995m323j849R955o699j2992O049L639p953
$$ 1511 5870 21 9094 14415 839 -341 9654 5331 3482 13437 6738 -6254 -205 3434 -4519
922d519M880M812j3610m403R996l147k653J0130l154j2016O593P582n670N648
$$ -4519 361 5173 -8437 -12840 -2844 -5991 -8644 1486 -1668 -13684 -7091 491 -5179 469
936D69Q391j0470m260J1665Q5m094J0357j335j3138M386P610p188K112P170j1753
$$ 469 8860 -1610 -5870 5795 5880 1786 12143 10808 -2330 2056 9666 2478 4590 11760 7
951Gp893R683j283o443Q068q62j4074K773Q246n935J510Q996q530p022J0828K740
$$ 7 -7886 1797 514 -5929 2139 1277 -12797 -10024 -1778 -7713 -6203 2793 -5737 -12759 -1931 809
967H09m826Q947K938j1730K365J0122m062R7Q799o999r441Q403K538p111N127
$$ 809 -4017 4930 7868 -3862 -1497 8625 4563 4660 13459 6460 -2981 5422 7960 849 5976
982E976K248j3665j560Q602m780k946Q173o337j0646P932M921o168N576N217j0720
$$ 5976 8224 -5441 -7001 1601 -3179 -6125 2048 -4289 -14935 -7003 -2082 -8250 -2674 2543 -8177
997h177j060J1687j258j869R702k832j0183P860O499o565L990N437j1542m179
$$ -8177 -9237 2450 1192 -677 9025 6193 -3990 3870 10369 3804 7794 13231 1689 -2490
1011b490R613k747m929O786l817j2633M173O245o922J621N873j0126m644J0502
$$ -2490 7123 4376 -553 6233 2416 -10217 -6044 201 -6721 -5100 773 -9353 -13997 -3495
1025c495Q17m317Q356N10j0431N270R571m395K070P687p717o088J0069J563n860
$$ -3495 -2678 -6995 1361 1871 -8560 -3290 6281 1886 3956 11643 3926 -2162 7907 9470 3610
1040C610N626J07j2425J069P904n611j968N701q205q493Q161K490o211N267K120
$$ 3610 9236 9343 -3082 -2013 5891 280 -1688 4013 -4192 -12685 -4524 -2034 -8245 -2978 -858
1055h58j0969J423J0808k743r40Q317m542p129R468N097n265M748L557j0561q43
$$ -858 -11827 -10404 404 -2339 -3279 5038 496 -6633 2835 7932 2667 7415 10972 411 -432
1070d32J0121l138m067O253n182j0381O033M520o861J361L170j0330k960J0077
$$ -432 9689 6551 2484 8737 3555 -6826 -793 3727 -3134 -1773 1397 -8933 -11893 -1816
1084a816j269m139O638k044r024O625P988m588K241N973p935k846J1262O18m780
$$ -1816 -3085 -7224 -586 -2630 -11654 -5029 2959 -1629 612 6585 -1350 -4196 7066 7684 2904
1099B904N951j159j0142M328P449o073j010M693q947o001R161L40o785M220j75
$$ 2904 8855 7696 -2446 1882 9331 3258 2248 6941 -2006 -8007 1154 1494 -5291 -1071 -1246
1114a246j0577L151Q810m607p71O376n883n051J0150L553n109N050K149r023K545
$$ -1246 -11823 -8672 138 -4469 -5240 1136 -4747 -9798 352 3905 -1204 3846 5995 -3028 -483
1129d83R970l161k646N491n063p374P628L328p186J857J421r685r54Q862l159
$$ -483 9487 6326 3680 9171 4108 -3266 4362 7690 504 2361 3782 -5903 -6857 2005 -1154
1144a154m697M960l893p396P196N639n690K194M210p510j06J0534l24l957O231
$$ -1154 -5851 -891 -4784 -12180 -4984 655 -5035 -2841 1369 -6141 -6247 4287 3963 6 6237
1159F237j688p395O661O528o014P3L917q134l098Q615j240o190L736k243q925
$$ 6237 4549 -2846 3815 10343 4329 4402 8319 185 -2913 5702 4462 -1728 2008 -235 -9160
1174i160M084O478n998r39M684o767l272J0026J408n105M735J008p170M713Q792
$$ -9160 -5076 1402 -4596 -5535 -851 -7618 -10890 -864 544 -4561 174 1182 -5988 -1275 7517
1189G517m040j286N682n158m183Q489J871o579K417R16r004J220P532m561m050
$$ 7517 3477 2191 7873 2715 -1468 7021 8892 2313 4730 5646 -3358 -2138 5394 833 -3217
1204c217L822m785o138P414L346o567K459K403p479J598R769k236l001N792k407
$$ -3217 605 -4180 -10318 -2904 442 -6125 -3666 -1263 -8742 -7144 2625 389 -2612 3180 773
1219G73n194P720N238n854J355L201p148m56Q716k615n249L657k574p667N357
$$ 773 -4421 3299 8537 2683 4038 7239 91 -365 8351 5736 487 4144 1570 -6097 -740
1234g40M865o653j013L152o868j581Q863n28n277M133p4o399N585P247m803l17
$$ -740 4125 -2528 -3541 -389 -7257 -8838 25 -503 -5780 -1647 -1721 -8120 -2535 4712 -91 -408
1250d08N072n065k160R128O67n647L071L99p252L650O337n522k585L638n330m288
$$ -408 4664 -401 -2561 6567 7234 1587 4658 5057 -2195 1455 7792 2270 -315 3323 -2007 -6295
1266f295P639Q62o910K213O86o710K758P962m227k721M743l232l521Q384L315
$$ -6295 1344 2206 -4704 -2491 -1805 -8515 -5757 2205 -2022 -4743 0 -3232 -6753 1631 4946
1281D946n579K099K528o011K208Q155l136l889L847k871n220O621L086p016k81
$$ 4946 -633 1466 3994 -2017 191 8346 5210 1321 5168 2297 -2923 3698 6784 -232 -513
1296e13K350o787J28P535k960n419L865j615n375O455M689n794K8L988m950M61
$$ -513 1837 -4950 -4822 2713 -247 -5666 -1801 -3416 -8791 -2336 2353 -3441 -3413 575 -4375 -3914
1312c914Q874r61m921M325j35n365N755N257n880j495L404n079j802P368j277
$$ -3914 4960 3999 -922 3403 3268 -2097 3658 8915 3035 1540 4944 -135 -1937 5431 4154
1327D154o556J973n5o047L363N559n555k583L900l618k034Q072J093n803K762
$$ 4154 -2402 -429 -484 -6531 -3168 2391 -3164 -5747 -1847 -5465 -7499 573 1666 -4137 -1375
1342a375J947m610L764P275l942k907M543k546l011P064J442o662R51J649o065
$$ -1375 572 -4038 -274 7001 3059 152 4695 2149 -862 6202 7644 982 1933 3582 -2483
1357b483J228O624m584m843L264k279m242O444K356o565O33K862m444J262P940
$$ -2483 -1255 5369 785 -4058 -794 -3073 -7315 -871 1485 -5080 -4447 -1585 -6029 -4767 3173
1372C173k459l990M284k57l624O220M087n870j71L453m404K8O898k448n978K859
$$ 3173 714 -3276 1008 751 -2873 3347 7434 1564 1393 4846 442 470 7368 4920 -1058 1801
1388A801r70m655M156L514o267j843L281l844r15O676p90n787L097J250m278M623
$$ 1801 831 -3824 332 3846 -2421 -4264 -983 -4827 -5742 934 144 -5643 -2546 -1296 -5574 -951
1404i51N593n117j361M503k612j185P225j7n881K085J808m876K732N135n390l566
$$ -951 4642 -475 -1836 2667 55 -1130 6095 6078 197 2282 4090 -786 1946 7081 1691 -1875
1420a875L472k804k816N966K82o548J112J905m546K044O027l962l577M327r77
$$ -1875 1597 -1207 -4023 1943 2225 -4323 -3211 -1306 -5852 -3808 2219 -1743 -5320 -993 -1970
1435a970k460O309K512n782R17L235l435J724O201l254m539L730p92l675N072
$$ -1970 -4430 1879 4391 -1391 -474 2761 -674 1050 7251 3997 -542 3188 2396 -1279 3793
1450C793K035o530r78K715m020r8N736k858n396L035Q8l598M433L896n705r80
$$ 3793 5828 -702 -1680 1035 -2985 -3083 2653 -205 -5601 -2566 -2478 -6076 -1643 2253 -3452 -4432
1466d432M525k592M1O967j146m986L204J412l534M050M124n439k087L623k659
$$ -4432 93 -2499 -2458 4509 3363 -1623 1581 2993 -541 3509 7633 2194 107 3730 1071
1481A071j598N307j303o516J593J211m367K515M047n056k908L776j280j522N743
$$ 1071 -527 4780 3477 -3039 -1446 -235 -4602 -2087 1960 -3096 -6004 -2228 -3508 -5030 713
1496G13O40n682K293K921k796K532N228l666l020M259o42k467N565O54o716N27
$$ 713 1353 -4329 -2036 885 -1911 621 5849 2183 -837 3422 2780 313 5878 6532 -184 343
1512C43K638l939O44M753m390m650L083m69l056M390J502o080K55L717k608R93
$$ 343 2981 -958 -314 4439 49 -4601 -1518 -1987 -5043 -653 849 -5231 -4976 -1259 -3867 -2874
1528b874N550k172m069L879J459k748M575K684n154q24L593k163m87M939k388
$$ -2874 2676 504 -3565 314 1773 -975 3600 6284 1130 306 3899 1736 1249 6188 3800
1543C800n636K341R45l687K537K593n494k282L534j871j324N218j151n101K455
$$ 3800 -1836 505 1450 -2237 300 2893 -2601 -4883 -1349 -3220 -4544 674 -477 -5578 -3123
1558c123K655k851K937M538m683j732M261m93j326N070k48n533J699K780l473
$$ -3123 -468 -3319 -382 4156 -527 -2259 2002 1509 183 5253 5005 -528 1171 3951 478
1573D78J554L589m904l604L698j139k614M010l3n555N91K800k680Q39M604l408
$$ 478 2032 5621 717 -2887 811 -328 -2942 1068 1035 -4520 -3929 -1129 -3809 -2970 1634 -1774
1589a774l371M183M23j887M381J467m913P58L837k060M23M325k487m369L028J048
$$ -1774 -5145 -962 -539 -2426 1955 3422 -1491 -733 3104 1044 1467 5792 3305 -1064 1964 3012
1605C012l237L053J426n874q36L461k489q34L977k508m967K932J665k945L117
$$ 3012 -225 2828 4254 -1620 -2456 1005 -1484 -2318 1659 -849 -5816 -2884 -1219 -4164 -1047
1620a047K482m646q01M378p94o37M804q93m526K616K450k634K478K687m629k180
$$ -1047 1435 -3211 -4012 366 -428 -1065 3739 2846 -1680 936 3386 752 3230 5917 1288 -892
1636h92L624j117j840L279r69n619J406K390k996R68K989m225k497L660nj615
$$ -892 2732 1615 -225 3054 2085 -3534 -2128 262 -2734 -1766 1223 -3002 -5499 -1839 -1844 -3459
1652c459L922N56m637J385L927j663Q03M003l237k900L908O08k102L026P37n612
$$ -3459 463 1019 -3618 -2233 1694 31 834 4837 1600 -1300 2608 3216 1114 4140 4877 -735
1668g35L16L145k556q57L516l470m187L014Q38k543K609J450n196K70L942j235
$$ -735 -419 2726 170 -687 2829 -641 -4828 -1814 -976 -3519 -910 540 -4656 -4386 -444 -1679
1684a679j66L870j509l731L576K237k369K820J691m646n02M209j512j132L182
$$ -1679 -1845 2025 516 -3215 361 2598 229 3049 4740 94 -408 3801 2289 1157 4339
1699D339k031m622K167J638k603R78J812m578j872L957p13j431L151p55m241K373
$$ 4339 2308 -2314 -147 1491 -1112 -134 1678 -2900 -4772 -815 -1528 -2959 192 -563 -4804 -2431
1715b431L324k556J684K887l320j717M283Q2j724L233l62m559J667L052k409M8
$$ -2431 893 -1663 21 2908 -412 -2129 2154 2236 512 3745 3383 -1176 491 3543 1134 1182
1731A182K539l844k802L172M95k720K349J62m791P31L291j826N8L118k638k850
$$ 1182 3721 -123 -2925 247 742 -1978 371 533 -4258 -3527 -236 -2062 -2004 1114 -1524 -4374
1747d374M079J258k013K471R84l715N47L868j473m59L141k358l577K845J759k793
$$ -4374 -295 963 -1050 1421 2405 -1310 -763 3105 1632 1173 4314 1956 -1621 1224 2983 190
1763A90J240J178m511q16L655j284j682K589j621l959L136K180k583J270J944
$$ 190 1430 2608 -1903 -2719 936 -348 -2030 559 -1062 -5021 -1885 295 -2288 -1018 926
1778I26l544m95M164j61j512L132q19l426K516K753k283M60K263l675j675L754
$$ 926 -2618 -3113 1051 890 -622 2510 1691 -1735 781 3534 1251 1711 3974 299 -1376 2378
1794B378l50k335K427j114m324J556K709k494j17K250l191j933L875N36k121K238
$$ 2378 2028 -307 2120 1006 -3318 -1762 947 -1547 -1664 586 -2605 -4538 -663 -127 -2248 -10
1810a0O11l605J372L696j482j67K787k403k019L624R26k551J818L47l963L42L226
$$ -10 601 -3004 -1632 2064 582 415 3202 799 -1220 2404 3330 779 2597 2944 -1019 -677 2549
1827B549j898j569K410k393l167L089J064k743J586Q76l575L38L999r41j066K813
$$ 2549 651 -918 1492 -901 -4068 -979 85 -2658 -1072 -196 -3771 -3433 566 -375 -1441 1372
1843A372j350k779L309K374k432J298J519l364k40L478p77j831K080j273l652
$$ 1372 22 -2757 552 2926 494 1792 3311 -53 -293 3185 2408 577 2657 1384 -2268
1858b268K099J968k585M9J432l263r65L303j16k007K241n59l314K138L170j689
$$ -2268 -169 1799 -786 -737 695 -2568 -3533 -230 -346 -2353 -112 -671 -3985 -1847 1323 -366
1874c66K1K221k337j023L607N21k321K146r5l420J534K676k026p88J859k790k150
$$ -366 -345 1876 -461 -1484 2123 2644 323 2469 2374 -1046 488 3164 1138 350 2209 -581 -2731
1891b731L353L75k627J354J41l394Q58L341j500q69K410k180j699L285J635k510
$$ -2731 622 997 -1630 -276 -135 -3529 -2671 670 -830 -1699 711 -1469 -3168 117 1752 -758
1907g58J400J064k934O85L656j214j393K093j404k433K615J656k813M38O01k910
$$ -758 642 1706 -1228 -543 3113 1899 506 2599 1195 -1238 1377 3033 220 658 1259 -1651
1923a651m65L406j145k036J766r53k646K299K107k293M31J598k445n15L881k14
$$ -1651 -2116 1290 145 -1891 -125 -1078 -3724 -1425 682 -1611 -1180 418 -2027 -2542 1339 1125
1939A125j709K245l05k632K294K530k310l03J730k476j046L292n15k484J219l50
$$ 1125 -584 1661 1356 -1276 1018 3548 1238 935 2665 189 -857 2435 1920 -564 655 305
1955C05k983J559K463k617o25J539j726j335L380K40k113J392O10k450J548L326
$$ 305 -2678 -1119 1344 -1273 -1898 -359 -2085 -3420 -40 200 -1913 -521 89 -2361 -813 2513
1971B513j456j100K296j301j845L247Q78k590Q37O54k987M91K842k007j751J727
$$ 2513 1057 -43 2253 952 -893 2354 3232 642 1479 2133 -854 -363 2479 472 -1279 448
1987D48j610k145K815Q50k673N79J280k714P26L271j007j170K069m92j743K787
$$ 448 -1162 -3307 -492 358 -2315 -1736 -456 -3170 -2444 827 -180 -1350 719 227 -1516 1271
2003A271J642k252L44J426k114j65L012j012k166J363n36k499J656J693k555n29
$$ 1271 2913 661 1005 2431 317 152 3164 2152 -14 1349 813 -1686 -30 1663 -892 -1421
2019a421J255k019p38L140k27k385J391L84k087J915K496k129l05K199j276r05
$$ -1421 -166 -2185 -2923 217 -10 -2395 -1004 -620 -2707 -792 1704 -425 -730 1469 193 -712
2035g12L245K15k526J244L73k432J341K479k322j141J353j624j442K512J33k612
$$ -712 2533 2748 222 1466 1839 -593 748 3227 905 -236 1117 -507 -1949 563 696 -1916
2051a916P10N98k351J036K842j933j088J847n58j409K774J269k193N63J132j590
$$ -1916 -1206 -608 -2959 -1923 919 -1014 -2102 -255 -813 -2222 552 1821 -372 191 1323 -267
2067b67N20K827j389j540J574p71j800K291J094k871j84J162k031k48K757j148
$$ -267 253 3080 1691 151 1725 954 -846 1445 2539 -332 -516 646 -1385 -1633 1124 -24
2083b4k133J483k67k161K399J599k363K35J319j556K41L031n19j809J391L38j683
$$ -24 -2157 -674 -941 -3102 -703 896 -1467 -1232 87 -1469 -1228 1803 1284 -525 866 1204 -479
2100d79J788J769k313m18J411j676o78K503n06k541J023J53k180J202J886k290
$$ -479 1309 3078 765 347 1758 82 -596 1907 1401 -1140 -117 36 -2144 -942 944 -1346
2116a346p59J631j323q21K823K86k332J088J178j593R28K670j465j083J830o72
$$ -1346 -2105 -474 -1797 -2618 205 491 -1841 -753 425 -1168 -240 2430 965 -118 1712 1040
2132A040j199K476M72k511K94R87k160N84J771j460j899J251o18j588K225O64
$$ 1040 -159 2317 2789 278 572 1559 -601 -17 1754 294 -1605 -354 -972 -2560 -335 329
2148C29k403K20J177j159K32K776j057j708K152l32j097K145J486k248j34J339
$$ 329 -2074 -1854 -677 -1836 -1604 1172 115 -1593 559 227 -870 1275 2761 513 379 1718
2164A718j163o2K291j075k027Q90K21j989J005J525k530q13J719j273p52K741
$$ 1718 555 493 2784 1709 -318 572 793 -1196 -191 1334 -1196 -2009 -290 -1563 -2315 426
2180D26l51k219J109P99j547J487K063j880o18J793n98o48K442j08k085N49J020
$$ 426 75 -2144 -1035 -236 -1783 -296 1767 -113 -731 1062 464 -184 2258 2150 65 614 1634
2197A634j658N50J879k047j226J227o64j248K128qk532M32J034j187M93J982j600
$$ 1634 -24 526 2405 358 -868 359 -305 -1553 575 567 -1965 -1533 -499 -1686 -1193 789 -811
2214h11j171J732op26J805Q12j976K66J319j218M27K094j295j553J314j76j408
$$ -811 -1982 -250 -256 -982 823 1635 -341 -75 1244 26 453 2547 1252 -301 1013 837 -571
2231e71J627P39k380k59J275j318r2J695r94j855J301L61j241J208J325j868m19
$$ -571 1056 1795 -585 -844 431 -887 -979 716 -278 -2133 -832 -471 -1712 -504 821 -1047 -1466
2248a466J739p51j19K039j82j988J378O40j428J234J367k036p79J593p05r11J578
$$ -1466 273 -478 -597 1442 1260 -728 650 1290 -138 1096 2463 427 -352 1241 536 -375 1203
2265A203q3k456P54N82j293N47J549k067o12J212k52o47J784M24k071P97R66o57
$$ 1203 1120 -1336 -582 0 -1293 -746 803 -1264 -1876 -664 -916 -1563 221 645 -1426 -629 337 -320
2283c20O66J655j391r47J623k66r72J596M08k289J92J107j272J05J230j114j794
$$ -320 346 2001 610 -337 1286 1020 48 1644 2052 -237 -45 1062 -210 -105 1125 11 -1783
2300a783J349j6j182J161P88k099N6J389p11N6J826o58j486J338O68j107J444
$$ -1783 -434 -450 -1632 -471 317 -1782 -1726 -337 -1048 -992 834 176 -1310 28 696 -411 1033
2317A033J093j817k16J340p82j71J508o37k108Q38M71j350M16J137j734p70J267
$$ 1033 2126 309 93 1433 651 480 1988 1351 -757 81 552 -798 -382 755 -979 -1749 -482
2334d82o45m42J616k6k032J136R85j169P99J747j642o06J806k31o87J512j78j720
$$ -482 -1127 -1569 47 21 -2011 -875 110 -1059 -260 1487 -155 -761 1045 814 127 1639 1461 -259
2352b59P45P98j031R3J153j588r41J211j65j239J207L61k088L33J186o91k12J795
$$ -259 486 1284 253 346 1499 -89 -1030 181 16 -1223 -16 345 -1743 -1410 -224 -915 -1127 668
2370F68j153j237J658L20j065J300P58j776L90J372o20j88J365p92j464J022N59
$$ 668 -485 -1722 -64 256 -809 491 1249 -527 -137 1235 615 427 1792 1000 -464 558 1117
2387A117j249P07P23k047l95J428r46l43J409p56j508J097M22r34Q80R12j642
$$ 1117 -132 575 1298 -749 -1144 284 -662 -1005 404 -352 -1860 -763 -341 -1275 -395 517 -1125
2404a125j95J755o42j95J530l29j497R72Q71r13N99R80j592n24J314k73p93R20
$$ -1125 -1320 435 -207 -402 1128 799 -698 274 1145 232 831 1811 219 -305 1009 736 -57 863
2422H63l5j946M71Q49j064M41P81j217j017J570R7r38J092L78j492M68J537j024
$$ 863 828 -1118 -647 202 -862 -421 360 -857 -1874 -304 -207 -1145 -53 325 -1167 -699 838 -186
2440a86Q6J605r74j028J542K66j146R04M61j713P7J057q13q5R47r88j504J112
$$ -186 -100 1505 531 -497 1045 1311 165 1069 1530 -183 -106 951 138 53 1000 12 -1492 -380
2458c80K19j093O31Q85j743k9J415n39j30J271l95j248J311Q43r96N61J063j322
$$ -380 -161 -1254 -623 262 -1481 -1510 -95 -634 -764 507 112 -1136 175 1018 22 583 1646 324
2476C24l75J348m78n23J086o03j409N38Q17j358K29Q17j490l31J243m88n45Q74
$$ 324 -51 1297 819 296 1382 779 -630 -92 725 -633 -404 413 -1077 -1408 -165 -653 -1198 -324
2494c24O6j261Q23R90q11M27Q77j039l19J442N5p22J045J45j587N74J010j136
$$ -324 -258 -1519 -696 294 -517 -90 787 -252 -571 871 926 204 1249 1394 -193 381 1391 255
2512B55K0P97j033j057J099J04j010P09J15j574L89J181q54r5J180p63p22J250
$$ 255 275 1072 39 -1018 81 185 -825 -116 -1 -1575 -1186 -5 -859 -954 226 -537 -1259 -9
2530iN43r65Q23O21j235R7J284m90m07J067p08j011R48M73j028K71O05j420l65
$$ -9 534 -431 392 1013 -222 -125 1159 669 262 1329 621 -390 558 1031 3 274 879 -541 -906
2549i06J293n18o60Q08l16j315J239J81o74M70O85j100l20J621m56m05R12J03
$$ -906 387 -131 -791 17 -299 -1614 -375 -194 -868 -398 287 -813 -1133 488 32 -373 539 642
2567F42j157Q70R00q73N9R33j318m84J111P4r58N73R2j343L02R11p72j84P17p81
$$ 642 -515 355 1255 382 441 1374 56 -428 683 757 -201 372 464 -879 -577 334 -438 -622 95 -686
2587f86p94J285l9o57P53L57j182O04J199r56J42J037m64j081J440J48q45O25
$$ -686 -1480 -195 -234 -891 -138 219 -963 -359 840 -116 26 1063 599 -482 958 1106 261 886
2605H86K37j328N1J283q10p00O82n72r35J002K23j006K32P54j231M0J130j98l96
$$ 886 1123 -205 -154 1129 319 -381 301 -271 -1206 -204 19 -987 -755 -1 -1232 -1192 -62 -260 -656
2624f56R72k47p85J078N09m99J15N31p35l15R73j83q05R10k86r64M21P24j124
$$ -656 316 69 -716 362 871 372 487 1018 283 -32 941 758 -47 863 577 -387 34 758 -366
2643c66R5N22j148l42J064r9p55Q07M4j061O14J167o49j10Q90o70o43J489m9n05
$$ -366 -271 251 -897 -1239 -175 -274 -1029 -222 -178 -1239 -625 542 -107 -217 673 3 -640 849 800 295
2663B95O26n5q95K04R78p10l67N06o21o61P20L42j010L00J41r17R7J149l51n74
$$ 295 921 866 -29 175 1153 443 76 582 -39 -700 20 362 -648 -348 -207 -1124 -1027 122 -229 -803
2683h03R35n25o01J047K93q52O90M09r04K09R52j85m66N18k29q13Q88N09j005
$$ -803 132 -393 -994 53 346 -506 184 593 -311 -102 850 665 199 717 488 -325 563 1072 67
2702F7p1L42r25j2R25m25n20M08j37o97P70L53o53J14O64q58j10J146o9n94O57
$$ 67 -4 338 -587 -599 326 -99 -619 -211 -348 -1045 -275 78 -575 -461 203 -655 -765 381 312 -282 375
2723C75J00p84L92Q99q37J41P47o89q57J126K5r83N14J45j062K40Q47n30n07O58
$$ 375 475 -309 83 982 145 286 1033 344 -513 613 638 -345 169 314 -748 -508 339 -191 -698 -40
2743d0n19m32R29L71r87M60K49o57L86R41m47m66P95m78m40Q57O44r11R9N60r70
$$ -40 -559 -991 -62 309 -678 -218 31 -626 -240 701 254 -212 583 105 -335 522 1166 255 354 914 -56
2764e6P7P24m57o02M18k47o14N36M02q27j47N95p54O9J056k72n95Q03p7m76O10
$$ -56 21 745 288 -314 104 -143 -757 -221 181 -646 -793 -198 -952 -883 173 -99 -694 109 32 -444 166
2785A66P43p30o8O89o08rP23k57m46J36O3o73J90O82q28n3K78o67j67P93L4q54
$$ 166 909 179 111 800 192 183 906 649 203 339 402 -271 -81 601 -227 -280 -2 -669 -836 -43 -9 -863
2807h63M96L57p94O39N28n50j54Q38l20n01Q79M33q79K31K56o62J50Q04m68n05
$$ -863 -367 -10 -804 -165 363 -187 -341 497 177 -324 555 988 109 340 596 -66 84 888 420 -85
2827h5M37m71n01P54J98q21J37L68o87j3P89n07k52P46m08k82N65N55p20L2P76
$$ -85 352 -119 -620 134 332 -489 -352 16 -671 -684 105 -402 -654 92 -316 -598 -33 522 -198 -166 610
2848F10o32m9J074n70l94N57l66m11N88L61q80j04M38k95l81O82j53q70P52o2
$$ 610 -22 -71 1003 433 39 596 230 -181 407 768 -112 -216 222 -73 -454 228 75 -795 -43 -105
2868a05q01O49M86o60j60M60j06p3P38n5n54M38L12o78L54N13n58q3L78k86k56
$$ -105 -906 -257 229 -431 -591 -131 -237 -310 428 373 -181 257 569 -109 245 758 200 117 495 209 -47
2889d7N22J81r73M71Pn69O6O68n92k48K62j14o16Q68L79r26L72L17m55Q6R04m31
$$ -47 475 656 -317 154 161 -408 -342 326 -266 -514 -252 -366 -982 -114 265 -661 -289 28 -427 -341 563 132
2911A32m51P74j73m54N73L88q27K48K55m93q5Q33n00o16L35K3o21L09N96n29j93
$$ 132 -319 455 282 -172 401 789 -38 210 465 -28 -113 720 220 -396 -61 -38 -659 -350 246 -283 -476
2932d76L32k62m09Q22J34m16K21J73n16N45L63k66j84N39j57n97P30K8p64J06
$$ -476 -144 -406 -815 7 141 -275 -54 119 -397 148 511 245 61 600 443 -154 576 604 -160 -54
2952e4M69n99J45K81l06m80M48l68j85N60J52r77L33N99p38K53P19k39l19M44
$$ -54 415 -184 -39 242 -64 -544 -96 -464 -649 -89 63 -914 -581 18 -720 -467 252 13 -306 138
2972A38O2k63O45k9n08M1M47m08Q3N08m29n53M25j22m30L60L71p35J15J01m01
$$ 138 200 -63 582 553 45 86 533 125 208 716 287 -266 159 37 -393 -33 338 -397 -282 -181 -582
2993e82n3P25k22n42O54k38n7L36M69p06j8L65J28l44O02j65n41L71K87n40L1
$$ -582 -635 90 -132 -674 -20 -258 -315 21 490 -216 -234 131 259 -85 517 352 -189 182 469 -71 -40
3014d0N77m13k38L54j56k99M07j26l69J40J55m48K00K75m14K2K96jk86L13L88
$$ -40 537 124 -114 240 84 -215 192 66 -303 -163 -8 -456 -256 19 -395 -373 -77 -78 -364 -51 337
3035C37n53K48L46m01J16L91k87m03N94Mk59J84k9m33p1M94l98k75N80l05l99
$$ 337 -216 32 378 -23 93 484 197 -206 388 392 133 317 288 -145 -216 278 -120 -395 185 -120 -519
3056e19M37o3m18M70O5l77J70L40l12P6L64K6o64N79J36l52M21J90n01R7K96l56
$$ -519 -82 -145 -563 -93 -28 -405 -235 105 -207 -131 233 259 -405 174 310 -42 379 569 68 165 461 105
3078A05j24M65r2n83N1K58m34K20K76m94r1L80l47j33N40n8m98M97L14l21K34
$$ 105 -19 446 354 -229 -178 80 -354 -134 142 -352 -443 -63 -410 -543 -3 -61 -559 -62 252 -69 165
3099A65K09j94k24L69M1j84M33j55n20K00M16m95k79O89n47m05L65L0j92J85O9
$$ 165 374 180 -44 325 366 182 615 460 -60 140 556 61 -218 471 -76 -481 -116 -86 -278 -93 -24
3120b4m86J21K10j04P2M48l29l97M43L01m95L33M62o89jM81k39J55J70k45m93
$$ -24 -510 -389 -179 -283 -211 237 -92 -489 -46 255 -240 93 555 -134 -135 346 107 262 432 187 -306
3141c06M37J59m53K99K32o67m2L41l00j48O62j62n33L35K38m52M76N0k78r0M30
$$ -306 131 290 -163 136 368 -299 -341 0 -300 -448 214 52 -481 -146 92 -360 116 166 -112 -202 228
3162B28nl4K86k5n96L40M8k99J57M54o02j25K48j81j22L08o2l30p3K63j86M7N10
$$ 228 223 189 475 450 -146 194 242 -57 100 554 -48 -173 75 -106 -228 80 18 -312 -385 -122 -308 -261 249
3185B49m44k57L96J78m33M15J79m53K21L78n33L96J62q8l65L84k64k36M65k8l66
$$ 249 -195 -452 -56 122 -311 104 283 -170 51 429 -104 292 454 366 1 385 121 -115 350 322 -44
3206d4j37M48l54k32N54r3n22M2M56n37L66O9m25j15M69J07k38M96j33m64N72
$$ -44 -181 267 -87 -319 235 142 -380 -338 118 -419 -53 16 -409 -524 -55 52 -186 310 177 -287 285
3227B85Q7l30k6L93l76j58N80k45m28L81L7n43M38K9k94R8K27k33l01L57m5k15
$$ 285 372 42 16 409 33 -125 455 210 -218 163 200 -343 95 124 -170 -72 155 -78 -379 -22 -67 -282
3249b82L49J48l84M7K58k97K83J98k11j30L56Lj85J48J81n30P1K22j83l40N19
$$ -282 67 215 -169 -122 136 -161 122 320 109 -21 335 338 153 301 482 -48 23 245 62 -278 241
3270B41q1n39K72O6k87K4M14n86R8M09r7j68M19k53j82K33K22k80J67K12k58q5
$$ 241 160 -379 -107 -41 -328 -304 110 -476 -378 31 -66 -234 185 -68 -250 -17 205 -75 92 304 46 -39
3292c9N52l49n3L51l32l34K57J2j76j3L11k02j87J59p5q6J10J77n17L89R2k47
$$ -39 513 164 111 462 130 -204 53 65 -111 -124 187 -15 -202 -43 -118 -204 -94 83 -434 -45 47 -200
3314b00J17K67j05k67L95p1j4j2J53k47J43K69m47J0M15n40j8K23J28l11K67j22
$$ -200 -83 184 79 -188 207 136 122 110 263 16 159 428 -19 -9 406 -134 -152 71 199 -112 155 33
3336C3k81o8M23l60R8J68p5k6J02J29k36R3J88k38p5K35q8M3K78j15k26M02Ok96
$$ 33 -248 -316 107 -253 -155 13 -62 -88 14 143 -93 0 188 -50 -125 110 22 65 343 228 2 404 410 114
3360A14J19j62r7q1K16j11j62K87l64M5K2K55l69K9K65l59Q6L01j69l0J56K27
$$ 114 233 71 -26 -107 109 -2 -164 123 -241 -196 -174 81 -288 -259 6 -353 -267 34 -135 -165 -9 218
3382B18m30K34M13l79K06J23k89j22M73k31n8K3l8l50L9N06n48J22L24q23J04
$$ 218 -212 22 435 56 262 385 96 -26 447 216 158 181 143 -207 -168 338 -210 -88 236 -587 -483
3403d83M89q3j21K77o2l12L12L04l37j6J41j31J9K21l3l5N8J10j76j43R4M8j57
$$ -483 6 -77 -198 79 17 -295 17 321 -16 -32 109 -22 -3 218 185 150 208 318 142 -1 93 141 -16
3426a6J09M8l90L93k24j96M72q9n12K21K22j81k7K85j24l32L22J75o9J72N8k54
$$ -16 93 141 -249 144 -80 -276 196 107 -405 -184 38 -143 -170 115 -9 -341 -19 156 87 259 317 63
3448F3j42K72J18n30J76K31j72j9K58k34k32J75l29J49M8r7J48N3J06m77L12K98
$$ 63 -79 193 311 -219 -43 188 16 -3 255 21 -211 -36 -365 -216 -168 -265 -117 -64 42 -435 -123 175
3470A75j56j00L22k81QL08l9k17P5R5k17j70M92q7l61K54m1j81M4J00j57J78j13
$$ 175 19 -81 241 -40 -32 276 237 20 95 190 -27 -197 295 208 -153 101 60 -121 -77 23 -134 44 -69
3493f9j24L6K24m00O7L39r5k89L52K2k59K44j90qJ04K52j8l05L4K84j82N8Q6j
$$ -69 -193 -157 67 -333 -266 73 -22 -311 41 63 -196 48 -142 -150 -46 206 188 -117 -83 201 19 77 163 162
3517A62l18M16l33N5L0K11m38L09R3k25p3J69l54Q0K30k77L5M00j67l55L24K2
$$ 162 -156 260 -73 -18 12 223 -215 94 187 -38 -111 58 -296 -216 14 -263 -228 172 5 -350 -26 -4
3539dj51K52L11m49K4K08j83l1L45r8k09P2P3l04J43J53r4j69K98k10l77L07J15
$$ -4 -155 97 408 -41 -17 191 8 -23 322 224 15 87 160 -144 -1 152 58 -111 187 -23 -400 -93 22
3562B2L8N4k20p0O3L22k36j13P1L84k28J40j1M3j2r8j46j19J95R4l73M48j28l61
$$ 22 60 114 -106 -176 -113 209 -27 -140 -69 315 87 227 216 259 247 149 3 -116 79 173 -200 248 120 -241
3586b41K42O7r6O9p2k29O9J19J99k12j08J87j35P8L90k49n4J11k74J75N2J48j86
$$ -241 1 68 -28 41 -31 -260 -191 -72 127 -85 -193 -6 -141 -63 327 78 24 135 -139 36 88 236 50
3609E0l9K88k84q3J20r4nj38J03n0j9K0q0L3J66l7nP1m4j51K9J75j81K81J64n06
$$ 50 11 299 15 -68 52 -42 -47 -185 -82 -132 -151 -131 -211 -178 -12 -49 -54 17 -27 -178 -149 26 -155 126 290 -216
3635b16K56Q4k89M6K98Ol84L99q8k70J4K90j47q1K15j67j32L88j30j42Pp6j28
$$ -216 40 124 -165 -119 179 185 -199 200 112 -158 -144 146 -1 -82 133 -34 -166 222 92 -50 -43 -119 -247
3658b47L08moN9j26J37j02l2o6O1l7K48k96K03J07l16J5L19k99K1Q6l3l00K93
$$ -247 61 57 51 110 -16 121 19 -13 -79 -18 -55 193 -103 100 207 -109 -94 225 -74 -53 33 0 -300 -7
3682gK72n00J96J8P8j06l6k6m1L95k25o2L7J1m4j4J02K4n2L41m05%K19N5j8j79
$$ -7 265 -235 -39 -21 57 -49 -85 -111 -152 243 18 -44 -7 4 -40 -54 48 72 20 361 -44 -44 175 230 212 33
3708C3K81l73J4K41j70k06J53m7j93N7K19j89J34P1j32P2J65k47J59J06j40o4
$$ 33 314 -59 -45 196 26 -180 -27 -74 -267 -210 9 -180 -46 25 -107 -35 130 -117 42 148 8 -56
3730e6J40n7J29k60K96j42j17J33J37l06J27J28k49q5L35k15k04J19N7Lq6j4j27
$$ -56 84 27 156 -104 192 50 -67 66 203 -103 24 152 -97 -182 153 -62 -266 -147 -90 -87 -173 -187 -314
3753c14L59j33n9J08K94l40M4K49k30j41K93Q1k50m7L9P0n9k7k3LJ03n5j24J22
$$ -314 45 -88 -147 -39 255 -85 -41 208 -22 -163 130 211 -39 -86 -47 23 -36 -63 -86 -83 20 -35 -159 -37
3777c7J60l70L0N4J47N6J31j14k30J71J05k59K13l5m3J46j09q6LJ20K04k44J93
$$ -37 123 -247 -217 -163 -16 40 171 57 -173 -2 103 -156 57 22 -21 125 16 -70 -67 53 257 13 206
3800B06j76k76K07K21k68R9P2p6k19K01n6K2n7j01K4k2J80P5L5o3l0k09J29K44
$$ 206 30 -246 -39 182 -86 13 85 9 -210 -9 -65 -43 -100 -201 -177 -199 -19 56 91 28 -2 -211 -82 162
3824A62k15M8J39j07O2J0k0n1J84k47k06M4L37l25K93j52N9j62L29l8j85l5J59
$$ 162 -53 -5 134 27 89 99 79 28 212 -35 -241 -197 140 -185 108 -44 15 -147 182 144 -41 -76 83
3847H3j21N0M8k78J06Q7P4j10L12j67j89J44k2qQ4J70j65j5P8j99l8Q6k25J80
$$ 83 -38 12 60 -218 -112 -25 49 -61 251 84 -105 39 17 9 93 263 98 83 161 -38 -76 10 -215 -35
3871c5j41K16k58K67r0j11j4K30r9m1J09K48l43L61l15kk36J84p2P3K34k59K0
$$ -35 -176 40 -218 49 -41 -152 -166 64 -35 -76 33 281 -62 299 -16 -18 -254 -70 -142 -69 165 -94 -74
3894g4K28k6k40K3L9M1k11K76j40j20j81K85R6M9j0m0q3J41p2o8K14j43o9K77
$$ -74 154 128 -112 -89 -50 -9 -220 56 -84 -204 -385 -100 -4 45 35 -5 -88 53 -19 -87 127 -16 -85 192
3918A92j55q3Q8j2l3k16L91j66r9K52j80k17M08k11j52J82J1p7L3J2j80J20P2
$$ 192 37 -46 42 30 -3 -219 172 6 -93 159 -21 -238 170 -41 -193 -11 0 -77 -44 -32 -212 -92 -20
3941b0k1l8R1j03j8K12r7j9k9p0K10j56P9K14j88q0J77k47N7J75p5j46K01j45
$$ -20 -41 -79 12 -91 -109 103 6 -13 -42 -112 98 -58 21 235 47 -33 144 -103 -46 129 54 -92 109 -36
3965c6K1J01k07P2N5M4k9k11L38j74j86J65J72j50Q3K05k06j45L26k15q0L59k70
$$ -36 -15 86 -121 -49 6 50 21 -190 148 -26 -212 -47 125 -25 58 263 57 -88 238 23 -57 302 32
3988C2Q0j91K01j00J11O5l12J63R1j10p9K17k90J31j16O0k83Q0K08j22QK21m2
$$ 32 112 -79 122 22 133 198 -114 49 140 30 -49 168 -122 9 -107 -47 -330 -250 -42 -164 -156 65 23
4011B3L4NP6j80R9J3j52O8J12k11J40mJ12k43J7R3k39L15N5l08L9J56o5j69J5
$$ 23 57 62 138 -42 57 70 -82 -14 98 -113 27 23 135 -108 -91 2 -237 78 133 -175 -136 20 -45 -214 -199
4036a99J51m2K67l51O4K5L8j6O4m3O9l8R3O4q0q6K95l52J10Q7j78RJ17J01j31
$$ -199 -48 -90 177 -174 -110 -85 -47 -63 1 -42 27 -11 82 146 66 -20 275 -77 33 120 -58 -49 68 169 38
4061C8J4k65j1N5J75n5j70K31o7R6p8J80l04J33J10k06J20l8P4n5J02m0j77J93
$$ 38 52 -213 -224 -169 6 -49 -219 12 -55 41 -37 143 -161 -28 82 -124 -4 -42 32 -23 79 39 -138 55
4085E5j13k5j6j3O1Q3P8l8j66J65k66K16l25K54M5J12Nq1M1j15l7O4J98k97NK66
$$ 55 -58 -83 -99 -112 -51 32 110 72 -94 71 -195 21 -304 -50 -5 107 112 31 72 -43 -80 -16 182 -115 -110 156
4111A56j16j36P6Qk8lL57l04lJ77j65o7J25j6j06o0J92j11N4j18O7l0Q1N9j57
$$ 156 40 -96 -20 -12 -40 -43 314 10 7 184 19 -48 77 61 -45 -105 87 -24 30 -88 -21 -51 30 89 -68
4136f8P1Jj79J50J77j38L6P1m8j63N7J09j03k76M42k09K8K46m59J74J02O6j59
$$ -68 3 4 -175 -25 152 14 50 121 73 -90 -33 76 -27 -303 139 -70 -42 204 -255 -81 21 87 -72
4159g2Q4j9j71K29q7R7Q1j21K26l24L53l54J18l8K27k42q4O9Q9r5N8N7O0J01k05
$$ -72 12 -7 -178 51 -36 61 142 21 247 -77 276 -78 40 2 229 -13 -97 -28 61 -34 24 81 141 242 37
4184C7j74QJ33l24L06r3Q4R2r3R5k19K03Q9j71j7j3P1LL9k0k29K32J21l28K54
$$ 37 -137 -129 4 -320 -14 -107 -23 69 -24 71 -148 55 144 -27 -44 -57 14 17 56 36 -193 39 160 -168 86
4209H6J2j46L8L21m07M7Q9J7j74J24k7r0L9r8n0K8J82J77j12l8K7j03jN1%m3K00
$$ 86 98 -48 -10 311 -96 -49 40 57 -117 7 -20 -110 -71 -169 -219 -191 -9 168 56 18 45 -58 -59 -8 -8 -51 149
4236A49j43M5j14K06j62J93k47P9k6K19k14K4Rj7j61Q6k2K5Q2J92l36k4L24o8
$$ 149 6 51 -63 143 -19 174 -73 6 -20 199 -15 9 18 1 -160 -74 -96 -71 11 203 -133 -157 167 99
4260I9r0O5k9N9j7J38k32o6Q8j32j98M86j17J7O7k84Q8o5j6k1J47J31r0j52K10
$$ 99 9 74 45 104 87 225 -7 -73 15 -117 -315 171 54 71 138 -146 -58 -123 -139 -160 -13 118 28 -124 86
4285H6p2o2O9q9l0J95j22L1O8o0k17J52K25k71m3M34K8m85L29o7M4j9q7m3m6J25
$$ 86 14 -48 21 -68 -98 97 -25 6 74 14 -203 -51 174 -97 -140 294 322 -163 166 99 143 124 37 -6 -52 73
4311G3O9j73o8K01k05J50j10j25J47J07j12J26J57l92K29J6n4k44K43J95j64k43
$$ 73 142 -31 -99 102 -103 47 -63 -188 -41 66 -46 80 237 -155 74 90 36 -208 35 230 66 -177
4333a77P4J19r7K18j63N3j66J4N0n3L69k95Mq5Lq1J74KM1K2j3k50J58J36J49l14
$$ -177 -103 16 -81 137 -26 27 -139 -125 -75 -128 241 -54 -50 -135 -132 -213 -39 -37 4 26 13 -237 -79 57 206 -108
4359a08K31j58N1M3J17k78o0K56j33p9K40q1j84K68k55n3J62L1Jj02l8P4j36L86
$$ -108 123 -35 16 59 176 -102 -162 94 -39 -118 122 41 -143 125 -130 -183 -21 10 11 -91 -129 -55 -191 195
4383A95j24j93K52j17j60J73J22l23K15J3k9R2J18k24l9K22k14j98L09l6j34M1
$$ 195 71 -122 130 13 -147 26 148 -175 40 53 24 116 234 10 -29 193 -21 -219 90 54 -80 -39
4405c9J21j86m5M9l3J27n0kj92K40J27k04K14p9j08n4K18j31M5K8j95L13j26J15
$$ -39 82 -104 -149 -100 -133 -6 -56 -58 -250 -10 117 -87 127 48 -60 -114 104 -27 18 46 -149 164 38 153
4429A53j78j52J97R4j01m3n8l2KJ92k26L04k46j15J51J51r2J01mo6j82QR3J23
$$ 153 -25 -177 20 114 13 -30 -88 -120 -118 74 -152 152 -94 -209 -58 93 1 102 98 32 -150 -142 -49 74
4453G4j27K13j02p6J51j06J6Q7PM3k84N7J92l08K07m6K06j83J3j12J21J48j55
$$ 74 -53 160 58 -18 133 27 43 130 137 180 -104 -47 145 -163 44 -2 204 21 34 -78 43 191 36
4476C6k38L02j1k23K45j01M2j6j67J72J76k74J56j22k3j1nJ49l5L6k68K53j44
$$ 36 -202 100 89 -134 111 10 52 36 -131 41 217 -57 99 -23 -46 -57 -62 87 52 88 -180 73 -71
4499g1P0L6q8M6K2j14Q2J06j55R0N7N6j96K30j60J10j80J52l7L9LJ58j66l7J45
$$ -71 -1 35 -53 -7 15 -99 -17 89 -66 24 81 137 -59 171 11 121 -59 93 56 95 98 256 90 53 198
4524A98k80J02J37J21l39J27j28K86j34n4r7N2J60k64P2o4J94o0rj24jJ34O7j61
$$ 198 -82 20 157 278 -61 66 -62 224 90 36 -61 -9 151 -113 -41 -105 89 29 20 -104 -105 29 96 -65
4548f5L0N5J43m8k09M09l54K6qj01R9q4J93k22O6J89q8K12k02k03J58j2j70J33
$$ -65 -35 20 163 115 -94 315 -39 -13 -21 -122 -23 -107 86 -136 -70 119 31 243 41 -162 -4 -16 -186 -53
4572e3O4N2j69J46J06j30o3K29k33P6K54l48J44O6j50J12k1q6k0J83o5k02J50
$$ -53 11 63 -106 40 146 16 -47 182 -51 25 279 -69 75 141 -9 103 82 -4 -24 159 94 -108 42
4595D2j01R2%Nj09q2L32k12p8L24k30P1J48j49Mj63J60j17j33K21J84l43K76J7
$$ 42 -59 33 33 38 -71 -153 179 -33 -111 213 -17 54 202 53 57 -106 54 -63 -196 25 209 -134 142 159
4619A59Rj73l1J64j98J04J72m45K55j8o6k6L59k18j32K09k67KJ57J30m7n7L8l31
$$ 159 168 -5 -36 128 -70 34 206 -239 16 -2 -68 -94 265 47 -85 124 -143 -141 16 146 99 42 80 -251
4643b51J10P1J13qM2j53J86o6k06k2M02j04k94q1N30m01J06J0O3j64M3J45k99
$$ -251 -141 -70 43 35 77 -76 110 44 -162 -184 218 114 -180 -261 269 -132 -26 -16 47 -117 -74 71 -228
4666b28J81j29K20PJ3%o9q4O3J6J31R4k90m8L47k61M2J49k22J14j1K19j90j80
$$ -228 -47 -176 44 51 64 64 -5 -89 -26 -10 121 215 -75 -123 224 -37 5 154 -68 46 35 254 64 -116
4690a16K61n20M20K7N0j09n4o1R3J41k08j1J29L6q6O3PL5k19M7K34k25J15j69
$$ -116 145 -375 45 72 122 13 -41 -102 -9 132 -76 -87 42 78 -8 55 62 97 -122 -75 159 -66 49 -120
4714a20j84L78rj09L9kJ70k08J02j25K60l36K25l6j19nK19j02j03J24j93J20J33
$$ -120 -304 74 65 -44 -5 -7 163 -45 57 -68 192 -144 81 45 -74 -79 140 38 -65 59 -134 -14 119
4737A19l4Ko9j38J5K18n3j63lJ93k53Q9J85j21L1l3o7m3K16jk57O0K31j04L2j46
$$ 119 85 87 18 -120 -105 113 60 -103 -106 87 -166 -77 108 -13 18 -15 -82 -125 91 90 -167 -107 124 20 52 -94
4763i4J31J15j64j54J86J23j12j38P7j49pK74O9k53J01o4J52j30o2Q7P5R0j27
$$ -94 37 152 -12 -166 20 143 31 -107 -30 -179 -186 88 157 -96 5 -59 93 -37 -99 -12 63 153 26
4786B6k20J20K21J9l28J69j95K52M0j8N7o1l5O9l4N6q8pm4K8j48Q5J34j04j7J62
$$ 26 -194 -74 147 166 -162 7 -188 64 104 86 143 82 47 116 82 138 50 43 -1 27 -121 -36 98 -6 -23 139
4812A39m5m4j25J18j00J50j13j05m3K26Mj26M1q8R9j89L64k41pK26k46q8K00j55
$$ 139 94 50 -75 43 -57 93 -20 -125 -168 58 62 -64 -23 -111 -12 -201 163 -78 -85 141 -105 -193 7 -148
4836a48K5L24j88j28R0rjP9j41J67k38J16J7r4kK02j34J21L2j69J9R8Q2j67N7
$$ -148 -123 201 13 -115 -25 -34 -35 44 -97 70 -168 -52 -35 -129 -131 71 -63 58 90 -79 -60 38 120 -47 10
4861A0l7Q1r5j43K54q6k1r3j24M83l86K61Jk52R8K7j52K05j02J58j50L9K14j71
$$ 10 -27 54 -41 -184 70 -16 -37 -130 -254 229 -157 104 105 -147 -49 -22 -174 31 -71 87 -63 -24 190 19
4885A9n3jj03M0K04L5j34r2R0j2L4j12j0N4k4jj33L69j07j25j50M39l15j01J29
$$ 19 -34 -35 -138 -98 106 141 7 -85 5 -7 27 -85 -95 -41 -65 -66 -199 170 63 -62 -212 227 -88 -189 -60
4910f0M7m4k4O2P9m0N0k72N7L14j20l2K3K7k58K52K6o6q9O9j31O6J41o7K0m1J03
$$ -60 -13 -57 -81 -19 60 20 70 -202 -145 169 49 17 40 67 -191 61 87 21 -68 1 -130 -64 77 10 30 -11 92
4937I2mp5J20k67L18j20j87l4L16j34j25R0P7j29K15Ml24J92J00p9P7p7j41K5
$$ 92 88 13 133 -134 184 64 -123 -157 159 25 -100 -10 67 -62 153 157 -167 25 125 46 123 46 -95 -70
4961g0K92j09k65R6K3k7o7P5M7j16R5Q9k7k5l9J05n5r5j04J74N5Jl7P1Mj69Q2
$$ -70 222 113 -152 -56 -33 -60 -127 -52 -5 -121 -26 63 36 11 -28 77 22 -73 -177 -3 52 53 16 87 91 -78 4
4988DjJ29p3K0n3Lj51K47k67K25k28J06n8K71j79k64K63J08k34K23k4o1O2j04
$$ 4 3 132 59 79 26 29 -122 125 -142 83 -145 -39 -97 174 -5 -269 -6 102 -132 91 67 6 68 -36
5012c6P0J00j7j19M4lj37K5J86o2j08Q6J2N4N6j43n6J88j57j39J49m7L2j09j98
$$ -36 34 134 117 -2 42 39 -98 -73 113 51 -57 29 41 95 151 8 -48 140 -17 -156 -7 -54 -22 -131 -329
5037c29M02j52Q5K81k91j7O5M4j38J8K29j07m0n0q4Q8K13j36j45L1L3l8L8j47
$$ -329 73 -79 6 287 -4 -21 44 88 -50 -32 197 90 50 0 -84 4 217 81 -64 -33 0 -38 0 -147
5061a47O9J38Rj86P7K27k62j1J05r0l7j49M40l73J62m5J67k26N5J05l8J35j32
$$ -147 -78 60 69 -117 -40 187 -75 -86 19 -71 -108 -257 183 -190 -28 -73 94 -132 -77 28 -10 125 -7
5084gk20l3L64q7r7J10O4r7l0J42k20N8N2kR6mj23K03p4k08K9N8O2o7Q3n8%J4
$$ -7 -227 -260 104 17 -80 30 94 -3 -33 109 -111 -53 -1 -3 93 89 -34 169 95 -113 -84 -26 36 -31 52 -6 -6 8
5112Hj4P9k07J40M9L0k58M9R7o6J86m56K61J38j12J90j04j29k8n9K54j70l9L99
$$ 8 -6 73 -134 6 55 85 -173 -124 -27 -93 93 -363 -102 36 -76 114 10 -119 -147 -206 48 -122 -161 238
5136B38j20j64R2J91l81J63jNj16K23k04J22j38%R3n7M1j57K10j6l0J6J97j19
$$ 238 118 -46 46 237 -144 19 18 23 -93 130 -74 48 -90 -90 3 -54 -13 -170 40 24 -6 10 207 88
5160H8j78m3Q7O8j09J87m7q1O4j44J74j25J76Q7k17K9j35O4J0j04K48m4Q6k93
$$ 88 -90 -133 -46 22 -87 100 53 -28 36 -108 66 -59 117 204 -13 16 -119 -55 -45 -149 99 55 141 -152
5184a52K57j77J63n6k95K06J34j10J40j58J31j7l7K12k16l4O3K09l57L9L1j08
$$ -152 105 -72 91 35 -260 -54 80 -30 110 -48 83 66 29 241 25 -9 54 263 -94 -55 -24 -132
5206a32J29o2Q6k75K10L01j84j02n8j7o0K64j63n7J84K4k62L07Q3j22K7q9k7m2
$$ -132 -3 -65 21 -254 -44 257 73 -29 -87 -104 -164 100 -63 -120 64 88 -174 133 216 94 121 32 5 -37
5230c7J59j00O0r1l9n1K40k92J28J58O4l64M4J44q0q3K57m8j19J88k46n7K52p0
$$ -37 122 22 82 -9 -48 -99 141 -151 -23 135 199 -165 -121 23 -57 -140 117 69 -50 138 -108 -165 87 17
5254A7j65J5K21k68J39o2J78l3p2J03j3j96R1K00r4J22p7k92J73j18j4M24j02
$$ 17 -148 -133 88 -180 -41 -103 75 42 -30 73 60 -136 -45 155 61 183 106 -186 -13 -131 -145 279 177
5277A77j43q7J14j03O9K05l51K32M2j58q8j36K61M4o1J03Q8l49J34j35Q7J76j76
$$ 177 34 -53 61 -42 27 232 -119 113 155 -3 -91 -227 34 78 17 120 208 -141 -7 -142 -55 121 -55
5300e5k6J05K37j47k80J91j3J62j72J24n8j61oJ7J67l0k10j06M06k85N9L0J92
$$ -55 -81 24 261 114 -166 25 12 174 2 126 68 -93 -99 -82 85 55 -155 -261 145 -140 -81 -51 141
5323A41j85N4K60k99n6J16j3k10J49m7K12p6j2m7R2j88K9J51j80J49qj04J32l2
$$ 141 -44 10 270 -29 -85 31 18 -192 -43 -90 122 46 34 -13 79 -109 -80 71 -109 40 32 -72 60 28
5347B8M1n3N2j84KK6K8J7J62j27J87o6q1J26j06L5j31Q7J95l06J66Nj88M4j29
$$ 28 69 16 68 -116 -114 -88 -60 -43 119 -8 179 113 32 158 52 87 -44 43 238 -68 98 103 -85 -41 -170
5372a70J19M6J39j45M4n2L6l5K41j97r5J5J42j65NR0K53l20k7K73k38Q2m6N3k8
$$ -170 -51 -5 134 -11 33 -19 17 -18 223 26 -69 -54 88 -77 -72 18 271 -49 -76 197 -41 41 -5 48 20
5397B0m4J71k64J89l1k8J52j53O7j34J03J0p6J71k47L5J36j6k19J53j7j9J3r6
$$ 20 -24 147 -117 72 41 13 165 12 79 -55 48 58 -18 153 -94 -59 77 61 -158 -5 -22 -41 -28 -124
5421a24J67P9k26k7J78j76L61n27K40K14k18R0M2q6ll2J92k02J36m7j59J30N3
$$ -124 43 122 -104 -131 47 -129 232 -295 -55 159 -59 31 73 -13 -16 -48 144 -58 78 31 -128 2 55
5444E5Km7J94j27j0o3L2j01J23l9j10O5R7jj89L13q3j72J0L8j15M9q2J78q1Lj6
$$ 55 57 10 204 77 67 4 36 -65 58 19 -91 -26 71 70 -119 194 111 -61 -51 -13 -128 -79 -161 17 -64 -61 -77
5471g7J81n4J79j5j52km51M31Jj54K95k07Q6j00J42P0p2j34m8N1p5J89q6j45J25
$$ -77 104 50 229 214 62 60 -391 40 41 -113 182 -25 61 -39 103 173 101 -33 -81 -30 -105 84 -2 -147 -22
5496b2j1J69p5k26K24n7m0l8K2J4o7J39kN2j78K31j95l3k5o2K40m6J49k15J02
$$ -22 -33 136 61 -165 59 2 -38 -76 -54 -40 -107 32 30 82 -96 135 -60 -93 -118 -180 60 14 163 -52 50
5521E0j2o1j96Q9P1J55p4j9o7R5R0q3j82K33l4j6j27P1Q7l3j99R8j16J48m7J24
$$ 50 38 -23 -219 -130 -59 96 22 3 -64 31 121 38 -144 89 55 39 -88 -17 70 37 -162 -64 -180 -32 -79 45
5547D5Q0j78k7k26L85j74J7L4j26J43K1O2M2lk58K07J61j90K5Q2j72m0J48q7k9
$$ 45 125 -53 -80 -306 79 -95 -78 -44 -170 -27 -6 56 98 95 -163 44 205 15 40 122 -50 -90 58 -29 -58
5572e8k5R8k0p0K27j99M4m5K3J87j47Q8r6o2L2j4L1r9R3m4j0J25%l8O2P9k87J10
$$ -58 -83 15 -5 -75 152 -47 -3 -48 -25 162 15 103 7 -55 -23 -37 -6 -105 -12 -56 -66 59 59 21 83 162 -125 -15
5600a5J00kj13J06o8j07j96N4J10P3j50J61j04K30k20O0L21k03j49n2K75k20J24
$$ -15 85 83 -30 76 8 -99 -295 -241 -131 -58 -208 -47 -151 79 -141 -81 240 37 -112 -164 111 -109 15
5623A5n8LP4K4k43oJ49J2j65J10P3N3L9j37O3jm0J56k08l2K72K8l39J55j6k04
$$ 15 -43 -40 34 58 -185 -191 -42 -30 -195 -85 -12 41 80 -57 6 5 -35 121 -87 -119 153 181 -158 -3 -19 -223
5649b23K50r6K19l28J2R3J71k8k73L62l45K05M4qM3M9L2k56K63k04j46q5L61L
$$ -223 27 -69 150 -178 -166 -73 98 70 -203 159 -186 19 63 55 98 147 179 -77 186 -18 -164 -249 112 115
5673A15oPj38J22N7r2r5jR6j27J76p8J03l8l9r3j85K50J02R8k44r8J51j63Q8O3
$$ 115 109 116 -22 100 157 65 -30 -31 65 -62 114 36 139 101 62 -31 -216 34 136 234 -10 -108 43 -120 -32 31
5699C1j7J14o5j00j29K0K03J51p0j35J09k81J05J25k65K67j7j62j9j5J67J04Q
$$ 31 14 128 63 -37 -166 -146 57 208 138 3 112 -169 -64 61 -204 63 46 -116 -135 -150 17 121 129
5722A29J5j39n6n0P6N7K2j58pJ49PJ4Lq1J13j21N3j4J9o7J02O4K71l05J01j45
$$ 129 144 5 -51 -101 -25 32 54 -104 -111 38 45 59 62 -19 94 -27 26 12 31 -36 66 130 401 96 197 52
5748E2L7rj11P0J9K5q3p4l5P9j64J11K13m2n9kK03q4j58j02J5Q1k6L2j44J55O2
$$ 52 89 80 -31 39 58 83 0 -74 -109 -30 -194 -83 130 88 29 27 230 146 -12 -114 -99 -18 -44 -12 -156 -1 61
5775F1j33jj7R5m0r1J63j06O2l0PJ91j64j85L21p3n3L5Pk73K63L8K6j99J10Q2
$$ 61 -72 -73 -90 5 -35 -126 37 -69 -7 -37 -30 161 -3 -188 133 60 7 42 49 -224 39 77 103 -96 14 96
5801I6l17K28p3K23p8M8k55Q4j7M4nj37J41N3Q0q2PK1M5r5j06R2m6j10N2K89m70
$$ 96 -221 7 -66 157 79 127 -128 -44 -61 -17 -22 -159 -18 35 115 33 40 61 106 11 -95 -3 -49 -159 -107 182 -288
5828b88K08J2r3J40rj76J69Q6L0M2J5j03q9L8jL2j31K44j01k92L90j59N4j09J50
$$ -288 -80 -68 -161 -21 -30 -206 -37 49 79 121 136 33 -56 -18 -19 13 -118 126 25 -267 123 -36 18 -91 59
5853E9o3O5k24L43j10J18l8k00J31p5k14k4L42j99o1J77J5k52J99j01J53k1j26
$$ 59 -4 61 -163 180 70 188 150 -50 81 6 -208 -232 110 -89 -150 27 42 -210 -11 -112 41 20 -106
5876a06k1L21o4l06jM1L16j73nj8L4k56K13k5N6o1q4J8J4RR6N5L5m0m3L7j29J09
$$ -106 -127 194 130 -176 -177 -136 180 7 2 -16 18 -238 -25 -50 6 -55 -139 -121 -107 -98 -2 53 88 48 5 42 -87 22
5904B2K12l22m1J68R2j03o1J77j88J19j48J5N0J41j45J1J58q4P2j73n2R7l6p6
$$ 22 234 -88 -129 39 131 28 -33 144 -44 75 -73 -58 -8 133 -12 -1 157 73 145 -28 -80 17 -19 -95
5928i5J31r9L7o5K1J38j00L0J41Q7l40P9P0J29k23M7j07L0J81j00M1j83N2O1j2
$$ -95 36 -63 -26 -91 -70 68 -32 -2 139 226 -114 -35 35 164 -59 -12 -119 -89 92 -8 33 -150 -98 -37 -49
5953d9k3k9l4J39m5Q5k99M14Q8j95rJ0j03j17R4K10M9j03j88n7K12qp9jR3n0J50
$$ -49 -72 -101 -135 4 -41 44 -255 159 247 52 43 53 -50 -167 -73 137 186 83 -105 -162 50 42 -37 -38 55 5 155
5980A55k80l2L05j22l8Q2K0p8K0j19j60L76o7j90K48o1q3P3o%J7k15K3J37Q0O4
$$ 155 -125 -157 148 26 -12 70 90 12 32 -87 -247 129 62 -128 120 59 -24 49 43 43 60 -155 -132 5 85 149
6006A49k60J19j03Q3k0k24M72j49k18N2J81j86P9p5L9J4J01n6P0r9J7J38k34J9
$$ 149 -111 8 -95 -12 -32 -256 216 67 -151 -99 82 -104 -25 -100 -61 -47 54 -2 68 -31 -14 124 -110 -91
6030i1m3J11R7K6M1n6j34k5J72r3n1K31mk80J09oM8l7m9j22K51mQ5k20J55K1l78
$$ -91 -134 -23 74 100 141 85 -49 -74 98 5 -46 185 181 -99 10 4 52 15 -34 -156 95 91 176 -44 111 132 -246
6057b46L30mj23n8J02J17N1j81J29j46j26M5K21Q2k24J35j14m7R0q1j5K55J6l14
$$ -246 84 80 -43 -101 1 118 169 -12 117 -29 -155 -110 111 193 -31 104 -10 -57 33 -48 -63 192 208 -106
6081a06j36K02K19j65m4j4p5j0R4P9R4k21J41l1m23M01L8mk09J14o1K09k08J1
$$ -106 -242 -40 179 14 -30 -44 -119 -129 -35 44 138 -83 58 27 -396 5 43 39 -170 -56 -117 92 -116 -105
6105a05N0P6J10q7q1O7j44L0K6Q1L3m3j29K56j13n9J72j57J58Jj26j11QJ19M3
$$ -105 -55 21 131 44 -37 30 -114 -84 -58 23 56 13 -116 140 27 -32 140 -17 141 142 16 -95 -87 32 75
6130G5j19n6R8j4jj84Q8L04k96O9N9J00q3k33K51R2l44R6J58R7k30P1m2J22j38
$$ 75 -44 -100 -2 -16 -17 -201 -113 191 -105 -36 23 123 40 -193 58 150 -194 -98 60 157 -73 -2 -44 78 -60
6155f0J04j04l7J95r6J30p3j95pJ69qp7O1OM1l0P2m1j52r4K44j58J8J01J47k66
$$ -60 44 -60 -97 98 2 132 59 -136 -143 26 18 -59 2 8 49 19 91 50 -102 -196 48 -110 -92 9 156 -110
6181a10O5Q0Q6j49j3k07J30J42O1k33R2j1M6j25J20J06m4jPj84P0J51l00P6L33
$$ -110 -45 35 121 -28 -41 -248 -118 24 85 -148 -56 -67 -21 -146 -26 80 36 35 42 -142 -72 79 -221 -145 188
6206A88k64Q8%r8PlO9r9k6P3J29p4p1M8k5P8L0j5j29K33j96J13K57n07N9K2K99
$$ 188 -76 12 12 -86 -79 -82 -13 -112 -138 -65 64 -10 -81 -33 -58 20 50 35 -94 139 -57 56 313 -194 -135 -113 186
6233A86m23J84J71l05N0J08O6j6Pj03K16q8q6J76L2k5j00P7j98m1K18mj83J59
$$ 186 -237 -53 118 -187 -137 -29 37 21 28 -75 141 53 -33 143 175 150 50 127 -71 -112 106 102 -81 78
6257G8Jj67O1J75r6j56MJ38n2N6Kl4J26k83K77j37J09J22j95j13J56N5j96j36
$$ 78 79 -88 -27 148 52 -104 -100 38 -14 42 44 10 136 -147 130 -7 102 224 29 -84 72 127 -69 -205
6281b05K46j07m6J08R1n8o4K17k78k8J65j13l3m3J07j05R7J6j7L4lq8R7P6q5P
$$ -205 41 -66 -112 -4 87 29 -35 182 -96 -124 41 -72 -105 -148 -41 -146 -49 -33 -50 -16 -19 -107 -10 66 -19 -12
6307a2J49pj79j57K30o9O6n9p7K07j05Q6O9j63n5P1J13J1j2j50J08P1p6O8n5n5
$$ -12 137 130 -49 -206 24 -45 21 -38 -115 92 -13 73 142 -21 -76 -5 108 119 107 -43 65 136 60 128 73 18
6333A8L8r4K20j49n2R5q8R2oo7K3j11J58o7o9j9Q3J2R9j62r6K24j97j6J89r0m2
$$ 18 56 -38 182 33 -19 76 -12 80 74 7 30 -81 77 10 -59 -78 5 17 116 -46 -142 82 -115 -131 58 -32 -74
6360g4kq6K31k14L64k82P9J03k12j0m6J3J49P8p2J35n8k80K22R2q5O2k42p9K77
$$ -74 -76 -162 69 -145 219 -63 16 119 -93 -103 -149 -136 13 91 19 154 96 -184 38 130 45 107 -135 -214 63
6385F3l9j25k1K11k14K27k73m0K11L6ok07J05M2k08J85N8q7j67J11K34k07J05
$$ 63 24 -101 -122 89 -125 102 -171 -211 0 36 30 -177 -72 -30 -238 -53 5 -82 -249 -138 96 -111 -6
6408fm1J06j20J23q1p7J35J67l44Q0PJ89r4p4l5J34r6J56k8o0P2j37K83k06m8
$$ -6 -47 59 -61 62 -19 -96 39 206 -138 -58 -51 138 44 -30 -65 69 -27 129 101 41 113 -24 259 53 5
6433Ej99L27l3J80j46j51J3P3j33q2J74j15O3o3J49m5N4n1j46N4k5J01J03j01
$$ 5 -194 133 100 280 134 -17 -4 69 -64 -146 28 -87 -24 -87 62 17 71 20 -126 -72 -97 4 107 6
6457FM6q2j5J3K4j0l0oL5j55K05k4J28j65m7J31Q0j15j27RJ29L7O1k02K04k8q8
$$ 6 52 -30 -45 -32 -8 -18 -48 -54 -19 -174 31 7 135 -30 -77 54 134 19 -108 -99 30 67 128 -74 130 102 14
6484A4k46J48J1j29K07m2j1p2K37j24m8p1l1K03k6L8j23j0j14K16m0L5k02RK10
$$ 14 -232 -84 -73 -202 5 -37 -48 -120 117 -7 -55 -126 -157 46 20 58 -65 -75 -189 27 -13 22 -180 -171 39
6509C9j32K19j38o5l1O5J08K0O4k62o6K49j17n2K2Q4j4J00k30J60k00K72r0j17
$$ 39 -93 126 -12 -77 -108 -43 65 85 149 -113 -179 70 -47 -99 -77 7 -7 93 -137 23 -177 95 5 -112
6533a12J79o9R7Lk51K33k54L81k37N0N5j26m3O1J82L0j51n7J29j25k9J11k1Q4
$$ -112 67 -2 95 98 -153 80 -174 207 -30 20 75 -51 -94 -33 149 179 28 -29 100 -25 -54 57 36 120
6557A20qj44M2P5k4J0j33L1J52m9j27J04j62j3R5J03k71K65P5l52K97j93R5K92
$$ 120 112 -32 10 85 61 71 -62 -31 121 72 -55 49 -113 -126 -31 72 -199 66 141 -211 86 -107 -12 280
6581B80j98K07l51J19k7m5N1qM7j43J0J19n9m6K44j18n6J10r3Lm4n5J38j24K23
$$ 280 82 289 -62 57 30 -15 36 28 75 -68 -58 61 2 -44 200 82 26 136 43 46 2 -53 85 -39 184
6606A84j35j27k0L44j65mQ6j78j15j04J78m3J62j80j7K10qr6J03k2R5K2p9j93
$$ 184 49 -78 -98 246 81 77 163 -15 -130 -234 -56 -99 63 -117 -134 76 68 -28 75 53 148 170 91 -102
6630a02K28q3M8p1m9R3n0K4O6j87J28k34K62p9K8M3J66l73J38K51k11j09j4Mj5
$$ -102 126 43 91 20 -29 64 14 38 104 -83 45 -189 73 -6 22 65 231 -142 -4 247 36 -73 -87 -83 -98
6655i8J60j13J00p1o1O1r0J45O0q0K0K25l58J31j03J19p7NJ10l1j28K8K12l42
$$ -98 62 -51 49 -22 -83 -22 -112 33 93 13 33 258 -100 31 -72 47 -30 -25 85 54 -74 -46 166 -176
6679a76K14m7j24PK63o8j54J1N6K05k94Q2O8O7k01K37j4k59L1J58j67O5j1J66
$$ -176 38 -9 -133 -126 137 69 -85 -74 -18 187 -107 -25 43 110 -91 146 132 -127 -96 62 -105 -40 -51 115
6703A15l03J18K79l45L36k21L5Jj22J48l0J78k52p4P0j3J06j9J05j46K57r4k45
$$ 115 -188 -70 209 -136 200 -21 14 15 -107 41 11 189 -63 -137 -67 -80 26 7 112 -34 223 129 -116
6726a16P7k6K8J77j63j4m6L0R5K9j02j10R5J27K9q1j6p8j16K08j04J17l16K36
$$ -116 -39 -65 -37 140 -23 -37 -83 -53 42 71 -31 -141 -46 81 110 29 13 -65 -181 27 -77 40 -276 -40
6750d0M0p6Q5m8Kj0N8Kn2J39q0O8P0j79q5J71pj37N1n7J90j38K69m0j48q8j2P7
$$ -40 0 -76 9 -39 -37 -47 11 13 -39 100 20 88 158 -21 -106 65 58 -79 -28 -85 105 -33 236 196 48 -40 -52 25
6778B5j05K0Q1o5j15J64p9l5J07J3J26r8N8Q0j64Jn4O6N8j07o7J22m0K18l74j8
$$ 25 -80 -60 21 -44 -159 5 -74 -109 -2 11 137 39 97 177 13 14 -40 26 84 -23 -90 32 -8 210 -164 -182
6804a82L39j13j8j52K36o7j09LN5M3m4o4J00LNj8L0j13R3J8j41J48J29m13K65
$$ -182 157 44 26 -126 110 43 -66 -63 -8 35 -9 -73 27 30 35 17 47 -66 27 45 -96 52 181 -232 33
6829C3k49M3lK27k01L52k17p4M1J56Q2j94k5J39r2n7J40M7q6l0o3J1k9m5J06o7
$$ 33 -216 -173 -176 51 -150 202 -15 -89 -48 108 190 -4 -29 110 18 -39 101 148 62 32 -31 -20 -49 -94 12 -55
6855e5m7J26K4o6q1Q1J13n9j76M2J96l5o8PJ03j83J6o7R5r0L8K29l13K37J3lJ88
$$ -55 -102 24 48 -18 -99 -18 95 36 -140 -98 98 63 -5 2 105 -78 -62 -129 -34 -124 -86 143 -170 67 80 77 265
6882B65j95j85J29p3o7J11l8q0L05k96J59O8j48O3l18M01k69K87q5j86K88l21
$$ 265 70 -115 14 -59 -126 -15 -53 -133 172 -124 35 103 -45 18 -300 101 -168 119 34 -152 136 -185
6904a85L7M33l16q6J4P6J21n9K8j28M1o9L37l39Q6l6j8J18k31L08o2l2m5J5J18
$$ -185 -148 285 -31 -117 -103 -27 94 35 63 -65 -24 -93 244 -95 -9 -45 -63 55 -176 132 70 38 -7 8 126
6929A26O1j20k12M00l04L8j13J15l0m4K44j9j43J65o4j55j6J45q7j75K66N1j23
$$ 126 187 67 -145 255 -49 -11 -124 -9 -39 -83 161 142 -1 164 100 -55 -71 74 -13 -188 78 129 6
6952FR1n4k2l7J8o6L4n0K07l3j80K19j95p9J60j36L24k17jJ68k35L88m70K19R1
$$ 6 97 43 21 -16 2 -64 -30 -80 127 94 -86 133 -62 -141 19 -117 207 -10 -11 157 -78 310 -160 59 150
6977A50j60L4j31L13q2r1K03k87Q8J13J98o33K05L3k41L10J2N4n8J19k36J14j20
$$ 150 -10 24 -107 206 124 33 236 -51 37 150 348 -285 -80 -47 -288 22 34 88 30 149 -87 27 -93
7000i3J84k5K8o0l6r1K27j91rJ12K01j74Kl20K30j11P5J5K27j79j28J20j77K00
$$ -93 91 66 94 34 -2 -93 134 -57 -66 46 247 73 75 -245 -15 -126 -51 -36 191 12 -116 4 -173 27
7024B7N6o7q9R5j6O2j51J43j88J03L6o5j9q3KM8L2J64j2k28J77l4K2lj52K24K4
$$ 27 83 16 -73 22 6 68 -83 60 -128 -25 11 -54 -73 -156 -154 -106 -74 90 78 -150 27 -7 15 12 -140 84 108
7051A08r5o2L67l75J21p6j20K92k19O6Q9m19M77L5r3j73K06j77m9J86O3k79K30
$$ 108 13 -49 318 -57 64 -12 -132 160 -59 7 96 -323 154 189 96 -77 129 -48 -97 89 152 -127 103
7074A03k42k7L08o1j16J77k92L38j25j28K86j45P6m9j62J3J35k2q9r9J42L6mk00
$$ 103 -139 -166 142 81 -35 142 -150 188 63 -65 221 76 152 103 -59 -46 89 67 -22 -121 21 57 53 -147
7098a47q6J31Q0j08J61m7j6o7j7J33m3M6j15J09m6J58n7K6j16P5P2j44n4%L1L1
$$ -147 -233 -102 -22 -130 31 -16 -32 -99 -116 17 -26 20 -95 14 -32 126 69 95 -21 54 126 -18 -72 -72 -41 -10
7124a0j08j3O4JJ87l09M3J68p2J39q4O9o3J0J0p5J77j91M8n8M9r5J80j73oJ13
$$ -10 -118 -131 -67 -66 121 -188 -145 23 -49 90 6 75 12 22 32 -43 134 -57 -9 -67 -18 -113 67 -106 -112 1
7150Aj61J9K6J39j0j69L73j36r5M2j04J27j17m8N9L9j5J0J4N7m7q2JK10k46J24
$$ 1 -160 -141 -115 24 14 -155 218 82 -13 29 -75 52 -65 -113 -54 -15 -30 -20 -6 51 4 -78 -77 133 -113 11
7176A1J16j9j21k9r2J98j0o5k60M04k17J57n7p8j3K09k49K74k33M1Q3Nl4RN1m0
$$ 11 127 108 -13 -42 -134 64 54 -11 -271 133 -84 73 16 -62 -75 134 -115 159 -74 -33 50 55 21 30 81 41
7202D1j61J50k4j95J42L2n1l2P8Pj31K29o1l4J9j28K27m3MN4j62j9L3PK30k77
$$ 41 -120 30 6 -189 -47 -15 -66 -98 -20 -13 -144 85 24 -10 9 -119 108 65 69 123 -39 -58 -25 -18 212 -65
7228f5Q0l7J14k19J03Rm6J26P9k4k01j49J42J1K7O3Qj11R5P2p6N0q1Q7j9rj07
$$ -65 15 -22 92 -127 -24 -15 -61 65 144 120 -81 -230 -88 -77 -50 13 21 -90 5 77 1 51 -30 57 38 29 -78
7255g8L9j64K54q2K46j88j89K45k07L56j12j51J1jj3J05j44J28k32K40o9j18P7
$$ -78 -39 -203 51 -31 215 27 -162 83 -124 232 120 -31 -20 -21 -34 71 -73 55 -177 63 -6 -124 -47
7278d7N3q2O2J96k38Q4j42J58m0m4l8P1M3o2o2R0l3L0j16N4j6N7J74j71nJ30j86
$$ -47 6 -76 -14 182 -56 28 -114 44 4 -40 -78 -7 36 -26 -88 2 -31 -1 -117 -63 -79 -22 152 -19 -24 106 -80
7305h0n3L04j53k15R8K50j35L09l74K01l73K20Q8l7n6N2l0R9k32l7R8J10j20J93
$$ -80 -133 171 18 -197 -99 151 16 325 -49 152 -221 -1 87 50 -6 46 16 115 -117 -154 -56 54 -66 127
7329A27j92NQ2r6JQ0O3O8j67P0j10R5P1k89J40NJ20rj05K53j01M8P9m24K79L1
$$ 127 -65 -60 22 -74 -73 7 70 138 -29 41 -69 26 97 -192 -52 -47 73 64 -41 212 111 159 238 -186 93 124
7355A24k85P7R8J57k41j3P5P2p7n3l4j9K33k06J14J54j71J0ko8k8K31r2J5o7q2
$$ 124 -161 -84 14 171 -70 -83 -8 64 -13 -66 -100 -119 114 -92 22 176 5 15 13 -55 -83 148 56 71 4 -78
7381g8J64j25Q4j15q2Q2o6J62K8k09L01r9lR1o0j77K38j36l9K22q7k2J02j31j92
$$ -78 86 -39 45 -70 -152 -70 -136 26 54 -155 146 47 44 135 75 -102 136 0 -39 183 96 74 176 45 -147
7406a47NO1J05j30N0J05P7p0k61J21R1m4q2K82r6k9L9o2p1J3P2j33P0k0nK11o5
$$ -147 -142 -81 24 -106 -56 49 126 56 -205 -84 7 -37 -119 163 67 38 77 15 -56 -43 29 -104 -34 -54 -59 152 87
7433H7L9j17m4J31p5p0l2J53k31J14n6J34R5k01J33j22R4j07K09o8L5j36N3j52
$$ 87 126 9 -35 96 21 -49 -81 72 -159 -45 -101 33 128 -73 60 -62 32 -75 134 66 101 -35 18 -134
7457a34J53j30J27p6J08L6p5R1k23K22mq1N5m4k08K81k5jk73J69kR6j27P5Q2r8
$$ -134 19 -111 16 -60 48 84 9 100 -123 99 95 14 69 25 -183 98 73 72 -201 -32 -34 62 -65 10 92 -6
7483fM9k8j59J56n4n8K82j02R7l20K01j90J33l03L81l13L01J7j79J2J61R0l5r5
$$ -6 43 15 -144 12 -42 -100 182 80 177 -143 58 -132 1 -302 79 -234 67 84 -95 -83 78 168 133 38
7507C8k51K50j45j51L02l0m9m4K11j27k01N7Q7j19J94J02k6j1o6l5Q9m0j7J01
$$ 38 -213 37 -108 -259 43 13 -36 -80 131 4 -197 -140 -53 -172 22 124 98 87 21 -14 75 35 18 119
7531A19KLk56K33m6p1K43j63k75L36j96L6o2j73L24j39R4K17j59l20L18Q8k36
$$ 119 121 124 -132 101 55 -16 227 64 -211 125 -71 -35 -97 -270 54 -85 9 226 67 -253 65 153 -83
7554h3J43j23p5N2RP0N4n5q7K39k26O1j4J34q4K2K3Jj72p7L37O6k92K04k16J15
$$ -83 60 -63 -138 -86 -77 -7 47 -8 -95 144 -82 -21 -35 99 15 37 60 61 -111 -188 149 215 -77 127 -89 26
7580B6M8k8j35R3Lj26Q7k48K97j31M9J51k16K74k98J79R8N0j43m4p4K11k32J69
$$ 26 74 46 -89 4 7 -119 -32 -280 17 -114 -65 86 -130 144 -154 25 123 173 30 -14 -88 123 -109 60
7604F0O2k62K5j5J32p9K9K54k04P3k6l0o4j3q1QJ2M4J46j20L5Q7j50K02k60J32
$$ 60 122 -140 -115 -130 2 -77 -48 206 2 75 49 19 -45 -58 -139 -131 -119 -75 71 -49 -14 73 -77 125 -135 -3
7630cm0n5N3J36r6R6k44K75r9k32J40k7J65k98K33n3l2j02J50J15j09O6j53K58
$$ -3 -43 -98 -45 91 -5 91 -153 122 23 -209 -69 -96 69 -229 4 -49 -81 -183 -33 82 -27 39 -114 144
7654A44k52J20jQ1j21K12l20J43n3QR2n8Ol1l4j15K11j30MP3l4N7q1J82r2J5l5
$$ 144 -108 12 11 92 -29 183 -137 6 -47 -39 53 -5 1 -30 -64 -179 32 -98 -94 -21 -55 2 -79 103 11 26 -9
7681iq9k50K41L99l27q2p8p6K45J71j96K28j30M8P5j44k66J44n3Q4j09K85k89
$$ -9 -98 -348 -107 292 -35 -117 -195 -271 -26 145 -51 177 47 95 170 26 -240 -96 -149 -65 -174 111 -178
7704a78J74O2J1J56l06K35l32P8J09k7KMn6J50j25J36k03J70k3j37n8J69k25M71
$$ -178 -4 58 69 225 -81 154 -178 -100 9 -18 -16 -12 -68 82 -43 93 -110 60 37 -100 -158 11 -214 257
7728B57m01J07L7O1L2j99N6j5R0j08J80O4q8Q3j79r0J40Op8o1oj9J91J1j52O1
$$ 257 -144 -37 0 61 93 -106 -50 -65 25 -83 97 161 73 156 -23 -113 27 33 -45 -106 -112 -131 60 71 -81 -20
7754b0P1j01J19k3k69J78R9j85K33j09o7lJ68P2r0m54L13K53j26J01j68j47J77
$$ -20 51 -50 69 46 -223 -45 54 -131 102 -7 -74 -77 91 163 73 -381 -68 185 59 160 -8 -155 22
7777B2j04j1Q6n1J31J12j45j00K73j46j22Q0o1P5j49K77k23k9pJ52R3k98K21P
$$ 22 -82 -93 -7 -58 73 185 40 -60 213 67 -55 25 -36 39 -110 167 -56 -85 -92 60 153 -145 76 83
7801H3j00o5Q9m3n7j04J89j7K12j9k80J87JO7j92j59K08m2n5K09k11J04j04q7
$$ 83 -17 -82 7 -36 -93 -197 -8 -25 187 168 -112 75 76 143 -49 -208 0 -42 -97 112 -99 5 -99 -186
7825a86Q1J29k0m4LK2k36M10k82K96j01k7j30r1L99l39K50k47J90j49N6P3Q7j
$$ -186 -105 24 4 -40 -37 -15 -251 159 -123 173 72 45 -85 -176 223 -116 134 -113 77 -72 -16 57 144 143
7849A43p9O8j39p9J55l14L36j52n0J32q7N4J1J36k01J65j01j4q6K2J17l5oJ21
$$ 143 64 132 -7 -86 69 -245 91 -61 -111 21 -66 -12 -1 135 -66 99 -2 -16 -102 -80 37 2 -4 117
7873A17j42J08r0J18j19k0k19K65J6j73P3J43k31J41J1j17L11q8j74j3Q4j04o
$$ 117 -25 83 -7 111 -8 -28 -247 18 34 -139 -66 77 -154 -13 -2 -119 192 104 -70 -83 1 -103 -109
7896a09J71j14J03n9J58k7q3J10k15r7J43K2J01j94k0M9j8QJ05L0j92J5J32K9
$$ -109 62 -52 51 -8 150 123 40 150 -65 -162 -19 3 104 -90 -110 -61 -79 -71 34 64 -128 -113 19 48
7920D8J7n8R8j0p3R2k19l8N2LN0M7k14J29k8J47N6k61K12j95K31o1K5r8j0Q2o7
$$ 48 65 7 105 95 22 114 -105 -143 -91 -88 -38 9 -205 -76 -104 43 99 -162 50 -145 86 25 50 -48 -58 24 -43
7947d3q7R3o5J19K5Q3r7q5J90M8k13J54k42M16j17k93L17l8k33nK30j05P2j13
$$ -43 -130 -37 -102 17 42 125 28 -57 133 181 -32 122 -120 296 179 -114 203 165 -68 -73 157 52 124 11
7971A1j03J22K4l28L64j31R9j34k5o3K30j00R0l1n8Q6j30p7K43j52K5L3j02K51
$$ 11 -92 30 54 -274 90 -41 58 -76 -101 -164 66 -34 56 25 -33 53 -77 -154 89 -63 -38 -5 -107 144
7995A44j40N7q0J39j91N4L8k32J23L7J51j32M1j11L9P3rj42J0J97J2j27j6J72
$$ 144 4 61 -19 120 -71 -17 21 -211 -88 -51 100 -32 9 -102 -63 10 1 -141 -131 66 78 -49 -65 107
8019A07p7n3j6J44j15J68m9j93K03p1j06J15N9j90K37j27l3J96j12j54J72j45
$$ 107 30 -23 -39 105 -10 158 109 -84 119 48 -58 57 116 -74 163 36 3 199 87 -67 105 -40
8041d0j55J47Q4L5J22m6k38J97l50K83l1L3j27N1P3Nq8j8J36k55J24J56l3j71
$$ -40 -195 -48 36 71 193 147 -91 106 -244 39 8 41 -86 -35 38 43 -45 -63 73 -182 -58 98 65 -106
8065a06Q6j10PJ87Q6j7k24J64l6j66JJ27J8p2K9L18k54j38K31k55K00j07K0M5
$$ -106 -20 -130 -123 64 150 133 -91 73 37 -129 -128 -1 17 -55 -26 292 38 -100 131 -124 76 -31 -11 34
8089C4J36k68n2J04L7MJ61j16j08N6o4J84l11K39J64k05j73K50r4P8m0nq6J37
$$ 34 170 -98 -150 -46 -9 -5 156 40 -68 -12 -76 108 -203 36 200 -5 -178 72 -22 56 16 11 -75 62
8113F2j60m1O6K7j00J98J2j08J87j26j90K59L5j38Q6l4r7pmj3J71j38qj0P9L4
$$ 62 -98 -139 -73 -46 -146 52 64 -44 143 17 -173 86 121 -17 69 35 -62 -69 -73 -86 85 -53 -61 -71 8 42
8139D2O9k06J60r0qK5k04J67O0J25j49j62O6J41j01K45m9r3P1k19J47n8N1o6n
$$ 42 111 -95 65 -25 -33 -8 -212 -45 15 140 -9 -171 -105 36 -65 180 131 38 109 -110 37 -21 30 -36 -41
8164d1J20j18J38j78J60l45L67j82j2p2L16j29N9k61L10r7k72J93j06K03N7k13
$$ -41 79 -39 99 -79 81 -264 103 -79 -91 -163 153 24 83 -178 132 35 -237 -44 -150 53 110 -103
8186a03J40j49n4N0J78
$$ -103 37 -112 -166 -116 62
8191F2
$$ Imaginary data points
##PAGE= N=2
##DATA TABLE= (X++(I..I)), XYDATA
0@%%%%%%%%%%%%%%%%%%%qJ6j6J6j6J6k1K9l2L2m0M8n1N9o6P4q5R3j04J20j33J46
$$ 0 0 0 0 0 0 0 0 0 0 0 0 0 0 0 0 0 0 0 0 -8 8 -8 8 -8 8 -13 16 -16 16 -24 24 -27 32 -34 40 -45 48 -56 64 -69 77
41G7j62J78j97K20k41K66k96L25l57L95m36M80n31N87o49P20q03R00j014J152
$$ 77 -85 93 -104 116 -125 141 -155 170 -187 208 -228 252 -279 308 -341 379 -424 476 -538 614
61F14j322J538j824K216k791L717n446R725l8114o6141O1729j1288k6685M5512
$$ 614 -708 830 -994 1222 -1569 2148 -3298 6427 -31687 -97828 -36099 -47387 -74072 -28560
75b8560j2633p6381K7181N1159j9313K0517N1624m2869k8538O6007K2419j8659
$$ -28560 -41193 -117574 -90393 -39234 -58547 -38030 13594 -29275 -57813 8194 30613 11954
87A1954M9842J0673o7737J2236N4429k5781j619L6842n5322n7139M2302Q115l8175
$$ 11954 61796 72469 4732 16968 71397 45616 43997 80839 25517 -31622 10680 18795 -19380
100a9380K3316k286p5636l732M8770j8996q138M0550k9272m4832N0260L5239k3039
$$ -19380 3936 1650 -73986 -77718 -28948 -47944 -56082 -15532 -44804 -89636 -39376 -4137 -27176
113b7176L4279K9626n2625L180O4980o353o796M4574k5570n2798L7035K7255l4295
$$ -27176 7103 36729 -15896 -12716 52264 45911 39115 83689 58119 5321 42356 69611 35316
126C5316J1411J1716o4608k1373M4083j4389k7162K7929k2094n7140K7234L2682
$$ 35316 46727 58443 -6165 -27538 16545 2156 -25006 2923 -19171 -76311 -49077 -16395
138a6395k9579J2020K9502m2758j3237N6526O193j3566L9869j221m4196K7807
$$ -16395 -45974 -33954 -4452 -47210 -60447 -3921 2272 -11294 28575 27354 -16842 10965
150A0965M2574j9913N813K6483m1371k7720M1961L078l1272J8872o700n8535O504
$$ 10965 53539 33626 39439 65922 24551 -3169 38792 41870 10598 29470 22770 -35765 -29261
163b9261L4676k8797q825K5723l6694l2010M2344J2874k4095K7245J1082m3067
$$ -29261 5415 -23382 -32207 -6484 -43178 -75188 -32844 -19970 -44065 -16820 -5738 -48805
175d8805J3518M9374r422n98L5395k1086k9867M1994K1000k5360J7412R569m8356
$$ -48805 -35287 14087 4665 4067 39462 18376 -11491 30503 51503 26143 43555 53124 4768
188D768l362L8101j7959j8210K1771k6409m2740K5765J6603k9028Q995J2189m1163
$$ 4768 1406 39507 21548 3338 25109 -1300 -44040 -18275 -1672 -30700 -21705 -9516 -50679
201e0679o384M3215j794j1588K9899p811l2695L2255L4333j7026J1414K1540l3943
$$ -50679 -57063 -13848 -15642 -27230 2669 -5142 -37837 -5582 28751 11725 23139 44679 10736
214A0736r740M2869l09j9963K0458j1512m3846J5660K5360k7173m650J4033l8889
$$ 10736 996 43865 43556 23593 44051 32539 -11307 4353 29713 2540 -2110 11923 -26966
227b6966k2146L5985J536k3277J9488k739l8661J8619L7768j4310K029K5441k3445
$$ -26966 -49112 -13127 -11591 -34868 -15380 -18119 -56780 -38161 -393 -14703 -12674 12767 -10678
240a0678j5104M3084J4349j8073J8806L514l6326J0492L4877j6010j1096J6091
$$ -10678 -25782 17302 31651 13578 32384 35898 -428 10064 44941 28931 17835 33926
252C3926k6841k9417K9033R979k7828N988J476l9652J690L6353j1208j2467K0341
$$ 33926 7085 -22332 6701 16680 -11148 -5160 -3684 -43336 -41646 -5293 -16501 -28968 -8627
265h627j6066k4124L4958K4188j8585J0857J4083k9128M208M2171l487j4715K0110
$$ -8627 -24693 -48817 -13859 10329 -8256 2601 16684 -12444 -8236 33935 30448 15733 35843
278C5843j2497k9245K6119K1433k6177j206Q183l5217r023L4131p320k3049J3072
$$ 35843 23346 -5899 20220 41653 15476 14270 22453 -12764 -21787 12344 5024 -18025 -4953
291d953j0934l1010K1599K6188k0778j212J6078k3527n899M0764O138j7993J7189
$$ -4953 -15887 -46897 -25298 890 -19888 -21100 -5022 -28549 -34448 6316 12454 -5539 11650
304A1650J187k5941K0829L1941j6890o377J5205k2341j4632L2623M086k6578O014
$$ 11650 12837 -13104 7725 39666 22776 16399 31604 9263 -5369 27254 31340 4762 10776
317A0776k055l2641R050K7454j9198j4109J3513j9169j7335L2124J1397k3074
$$ 10776 8721 -23920 -14870 12584 -6614 -20723 -7210 -26379 -43714 -11590 -193 -23267
329b3267R427Q092k4436J1887L6371r554j0332K0087j0487j6192L1613J5498k3711
$$ -23267 -13840 -5748 -30184 -18297 18074 8520 -1812 18275 7788 -8404 23209 38707 14996
342A4996M324P788k7487J428K9915j2616k0781J1331j3056k4691K1642J4707k5572
$$ 14996 19320 27108 -379 1049 30964 18348 -2433 8898 -4158 -28849 -7207 7500 -18072
355a8072j893R677k3714j003L3667l453j6987J6474j557j8700K5136K5172j7538
$$ -18072 -19965 -10288 -34002 -35005 -1338 -4791 -21778 -5304 -6861 -25561 -425 24747 7209
368G209n01J6019j7854m069L2860n33k2027J0441k917k6061J3866K0411k3167
$$ 7209 6708 22727 4873 804 33664 33131 11104 21545 18628 -7433 6433 26844 3677
381C677j0501J0350k1315j2441K7582Q63k3607Q593K433k2506J4507K8091j3706
$$ 3677 -6824 3526 -17789 -30230 -2648 -1785 -25392 -16799 -14366 -36872 -22365 5726 -7980
394g980o878J8036j0753q287L2246J0221j9687Q509P023k1426Q921K7491j4894
$$ -7980 -14858 3178 -7575 -15862 16384 26605 6918 15427 22450 1024 9945 37436 22542
407B2542j5207J1396j3835j7616K2499P191k6276n20M765k3485K590K7096j0547
$$ 22542 7335 18731 4896 -12720 9779 16970 -9306 -9826 -5061 -28546 -25956 1140 -9407
420i407j6305J4020o022j4560K5599J7424j8338K621J3049j5498M016L1632m482
$$ -9407 -25712 -11692 -17714 -32274 -6675 10749 -7589 -4968 8081 -7417 -3401 28231 23749
433B3749j6679J2496l321j7668J9512J5530k3056o204Q314k0071n488K5169o747
$$ 23749 7070 19566 16245 -1423 18089 33619 10563 4359 12673 -7398 -12886 12283 5536
446E536k2715P188l065j9273J6563J9571j8927o296J3636j2229k267L0328L665
$$ 5536 -17179 -9991 -13056 -32329 -15766 3805 -15122 -21418 -7782 -20011 -22278 8050 11715
459A1715j8875J0145N357j4817J6197K3997j6511j0066J2846j1365q845K4085
$$ 11715 -7160 2985 8342 -6475 9722 33719 17208 7142 19988 8623 -222 23863
471B3863J815k5222J561K705k0335O886K0710j7410j6008J1060r050j0643K4245
$$ 23863 25678 456 2017 4722 -15613 -8727 11983 -5427 -21435 -10375 -19425 -30068 -5823
484e823P963k1924L549J0318j3297R599K7262r188j3173J4545j830r448K3397
$$ -5823 2140 -19784 -16235 -5917 -19214 -9615 17647 8459 -4714 9831 8001 -1447 21950
497B1950J0772k2195j323R132j5800J258K2306j2147k1364P813m600j5906J6274
$$ 21950 32722 10527 9204 18336 2536 3794 26100 13953 -7411 402 -4198 -20104 -3830
510c830J0502k3417o029J0950j2143K33K5444m164j8099J1539N020j0216J8538
$$ -3830 6672 -16745 -22774 -11824 -23967 -23734 1710 -2454 -20553 -9014 -3994 -14210 4328
523D328J8452j7459m441J5345q168k542K3988k489k2131N816K908j6611R885J4279
$$ 4328 22780 5321 880 16225 8057 5515 29503 27014 4883 10699 13607 -3004 6881 21160
537B1160k1130j2861R778j0227q024K0230r12k2473M964P725j2505J1124K0721
$$ 21160 30 -12831 -3053 -13280 -21304 -1074 -1986 -24459 -19495 -11770 -24275 -13151 7570
550G570j3497r256J5947j844m774K3074O388j9721M417R911j2266N609J9078j4208
$$ 7570 -5927 -15183 764 -1080 -5854 17220 23608 3887 8304 18215 5949 11558 30636 16428
564A6428j6730J0006m809j2601J5567M185k4462l047Q900j3024J341J9569r916
$$ 16428 -302 9704 4895 -7706 7861 12046 -12416 -15463 -6563 -19587 -18246 1323 -8593
577h593j6503J2471K111r289J8431J2673j7876k45J5126p743J974K2531n358j7503
$$ -8593 -25096 -12625 -10514 -19803 -1372 11301 -6575 -6820 8306 563 2537 25068 19710 2207
591B207J0047K834j2351J2416J0768k1431q415J0204j0334n079J7498o255k1527
$$ 2207 12254 15088 2737 15153 25921 4490 -3925 6279 -4055 -9134 8364 2109 -19418
604a9418N748M412j2036J0471J4273j6427p484J4664l636k610K1350J648j7352
$$ -19418 -13670 -9258 -21294 -10823 3450 -12977 -20461 -5797 -9433 -12043 9307 10955 -6397
617f397P236R697r661R363J7057j4875j1334J2157m153p983J6286J79k2872K74
$$ -6397 839 10536 875 10238 27295 12420 1086 13243 9090 1107 17393 17572 -5300 -5026
631e026P451j2760L243J4666j4645j4980J1959j294q245J7041N625j8964J959
$$ -5026 2425 -10335 -7092 7574 -7071 -22051 -10092 -11386 -19631 -2590 3035 -15929 -13970
644a3970J2695p046N221J9561q989j3150J2475L170p469J5075O954k0031l010
$$ -13970 -1275 -8321 -3100 16461 7472 -5678 6797 9967 2498 17573 24527 4496 1486
657A486J0911q752j091J5132j0360j9230P373K324j1325J0290P566j9458n339
$$ 1486 12397 3645 2554 17686 7326 -11904 -4531 -2207 -13532 -3242 4324 -15134 -20473
670b0473J2719n444j205J7871l641j6711J0135Q604p517J1752J3112j5755o236
$$ -20473 -7754 -13198 -14403 3468 -173 -16884 -6749 1855 -5662 6090 19202 3447 -2789
683b789J5023l125l556J6369l687k0090N182P027j1571N193R900j7794j1542J1635
$$ -2789 12234 9109 5553 21922 18235 -1855 3327 10354 -1217 3976 13876 -3918 -15460 -3825
697c825l411o784J3877j180j9355M430J0951p187N891J4265j1275r484J4736K802
$$ -3825 -7236 -14020 -143 -1323 -20678 -16248 -5297 -12484 -6593 7672 -3603 -13087 1649 4451
711D451m645J4729L120j7654K401J1908p234J595J2224j2353j4439J0007R40r993
$$ 4451 -194 14535 17655 1 2402 14310 7076 8671 20895 8542 -5897 4110 5050 -4943
725d943R292K516k0091k127J1844p115j033J3705q341j4567J1823O382p052J1236
$$ -4943 4349 6865 -13226 -15353 -3509 -10624 -11657 2048 -6293 -20860 -9037 -2655 -9707 1529
739A529Q032j5797r54J5354l242j120J4606n866j5406R127O865r618O178O870
$$ 1529 9561 -6236 -7190 8164 4922 3802 18408 12542 -2864 6263 13128 3510 9688 16558
753A6558j7745o602J1909m647n944J1483n362j7252O235Q166q522N291R584j3503
$$ 16558 -1187 -7789 4120 -527 -6471 5012 -350 -17602 -11367 -3201 -11723 -6432 3152 -10351
767a0351o241J4522N93m162J3226L08j5398O784J1519p038L456J1340j2423r752
$$ -10351 -16592 -2070 -1477 -5639 7587 7895 -7503 -719 10800 3762 7218 18558 6135 -3617
781c617J2778M0q092R533R9j8585J445J0400q549n38J0136j1440j2203J2133K902
$$ -3617 9161 9201 1109 10642 10741 -7844 -6399 4001 -4548 -5086 5050 -6390 -18593 -6460 -3558
796c558p645R775L673j5769K158J3895m549N54J2723p237j1234J2114N701p367
$$ -3558 -11203 -1428 2245 -13524 -11366 2529 -2020 -1466 11257 4020 -7214 4900 10601 3234
810C234Q107M510j5713j708J1803m947l795R739p866j4771P705N511r141M565
$$ 3234 11341 15851 138 -1570 10233 5286 1491 11230 3364 -11407 -3702 1809 -7332 -2767
824b767N518j5343m026J3330k426l570J1483l287j3161R019J0307o544N331R083
$$ -2767 2751 -12592 -16618 -3288 -5714 -9284 2199 -1088 -14249 -5230 5077 -1467 3864 12947
838A2947j2608m614J4197k84n298J0090k884j5722N451Q909q589N71O694j3614
$$ 12947 339 -4275 9922 9638 4340 14430 11546 -4176 1275 10184 1595 2166 8860 -4754
852d754q549J1649J12p517Q130r20j5124M466J1539n562J476R724r064p138J3387
$$ -4754 -13303 -1654 -1542 -9059 -929 -1849 -16973 -12507 -968 -6530 -5054 4670 -4394 -11532 1855
867A855M570n793Q423K574j3572K599J2284n190j986Q330r259j1236R799L736
$$ 1855 6425 632 9055 11629 -1943 656 12940 7750 5764 14094 4835 -6401 3398 7134
881G134r440M425J986j5555j087J2093m257l978Q627o179j1080J1082P427o747
$$ 7134 -2306 2119 4105 -11450 -12537 -444 -4701 -8679 -52 -6231 -17311 -6229 1198 -5549
895e549N572N548j1853j87J4538j305l769R113m170j1820Q872P951q668K132M466
$$ -5549 23 5571 -6282 -6469 8069 6764 2995 12108 7938 -3882 4990 12941 4273 6405 10871
910A0871j3196m639J1824k279p161O537l785j3039O359Q927p414R23O583r709
$$ 10871 -2325 -6964 4860 2581 -4580 1957 -1828 -14867 -8508 419 -6995 -6072 511 -9198
924i198m477J3446K137n544P773L51j1140O206J1469n842k41P186q835p028J1907
$$ -9198 -13675 -229 1908 -3636 4137 4488 -6652 -446 11023 5181 4940 12126 3291 -3737 8170
939H170K130q557M515P2j3736K183J0559o665l702O503q351q277J1044L953p906
$$ 8170 10300 1743 6258 6330 -7406 -5223 5336 -1329 -5031 1472 -6879 -15156 -4112 -159 -8065
954h065M813K855j0978K714J2880l163k798Q582m809p758J1027O106p583L439
$$ -8065 -3252 -397 -11375 -8661 4219 1056 -1742 6840 2031 -5727 5300 11406 3823 7262
968G262L633j1502m70J1487l862n962N751n178j0871P553N863q795O06L926j0558
$$ 7262 10895 -607 -1077 10410 6548 586 6337 1159 -9712 -2159 3704 -5091 -4485 -559 -11117
983a1117k119J2346j154n738O877j168r275Q547R634o316J327O504q095k685J2733
$$ -11117 -13236 -890 -2044 -7782 -905 -2073 -11348 -2801 6833 517 1844 8348 253 -2432 10301
998A0301L26o972N552j255j1459N280Q259q034k503M804r329n764J0742J90q404
$$ 10301 10627 3655 9207 7952 -3507 1773 10032 1998 -505 4299 -5030 -10794 -52 138 -8266
1013h266M345L30j0536M672J0733m939j670P244n582m556J2476L967o642M343
$$ -8266 -3921 -3591 -14127 -9455 1278 -3661 -5331 1913 -3669 -8225 4251 8218 1576 5919
1027E919K715r419K697J1125m760m801N382n921q150Q605L380r174Q90J859j0524
$$ 5919 8634 -785 1912 13037 8277 3476 8858 2937 -5213 3392 6772 -2402 -1512 347 -10177
1042a0177m4J0893l708n492N752l239p290R651P154p044K105N216p689O02J2868
$$ -10177 -10221 672 -3036 -8528 -2776 -6015 -13305 -3654 3500 -3544 -1439 3777 -3912 -3310 9558
1057I558j449n575N968j942q443P344O900q527r81L512q823l251R942j852p744
$$ 9558 8109 2534 8502 6560 -1883 5461 12361 3834 2853 6365 -2458 -5709 4233 2381 -5363
1072e363L521j722r138O072Q073o883j473N508o086k257J1953J643o431M867J445
$$ -5363 -1842 -3564 -12702 -6630 1443 -5440 -6913 -1405 -7491 -9748 2205 3848 -2583 2284 3729
1087C729p389N420J0057n664l271N314n192m949R818J728r138J455R91r583K522
$$ 3729 -3660 1760 11817 6153 2882 8196 3004 -1945 7873 9601 463 1918 2909 -6674 -4152
1102d152R025o182n382M924m815n613R908L782q209K299L600p099K665J1264k976
$$ -4152 4873 -1309 -6691 -1767 -6582 -12195 -2287 1495 -6714 -4415 -815 -7914 -5249 6015 3039
1117C039m464O001k158n392R021N537q147M79L322p705j18R635l607p175L303
$$ 3039 -1425 4576 2418 -2974 6047 11584 3437 3916 7238 -467 -585 9050 5443 -1732 1571
1132A571k200p401O227N387q452j622M232o277j293J0740q91o746M613J051n990
$$ 1571 -629 -8030 -1803 3584 -4868 -6490 -2258 -8535 -9828 912 21 -6725 -2112 -1061 -7051
1147g051O856Q313o368j441N721m685j886J0097J11q218L132O00p518L855O926
$$ -7051 -195 8118 1750 309 6030 1345 -541 9556 9667 1449 4581 5181 -2337 1518 8444
1162H444p470m367M269n284m063Q591M32q221K462K082o833L939R113m889l465
$$ 8444 974 -3393 876 -4408 -8471 120 552 -7669 -5207 -3125 -9958 -6019 3094 -1795 -5260
1177e260O107k177l235R675L372p458J913L441o020K016Q976n016o097M355k857
$$ -5260 847 -1330 -4565 5110 8482 1024 2937 6378 358 2374 11350 6334 237 4592 1735
1192A735n789O976K734r093n92L044o671K96Q639l264o259M615l01m848P649N590
$$ 1735 -4054 2922 5656 -3437 -4029 -985 -7656 -7360 1279 -1985 -8244 -3629 -3930 -8778 -1129 4461
1208D461o627k87N455m445L44R829j584o603M300J15n737N246N654q147k833L992
$$ 4461 -2166 -2453 3002 -1443 -1099 8730 7146 543 4843 4958 -779 4467 10121 1974 -859 3133
1224C133n117k458Q097j574q143K586P90n870M263O958o456k931N342k765j643
$$ 3133 -1984 -4442 3655 2081 -6062 -3476 -2686 -8556 -4293 2665 -3791 -6722 -1380 -4145 -5788
1239e788R074J525p389K877L185n077L937P515n402m190M690k634l547P329R91
$$ -5788 3286 4811 -2578 299 3484 -1593 2344 9859 4457 267 4957 2323 -1224 6105 7096
1254G096q723N79K810o217J514P030n410n481M252j419l972P368K928p769Q10
$$ 7096 -1627 -1048 1762 -4455 -2941 4089 -1321 -6802 -2550 -3969 -7941 -573 2355 -5414 -4604
1269d604M479m033J626Q698l350n203M728J46l712O659L702p681j140M305m572
$$ -4604 -125 -4158 -2532 6166 2816 -2387 2341 2487 -1225 5434 9136 1455 315 4620 48
1284D8j23P260l430p412L210Q1n103M872L969p810k154M569l351p73P941j020
$$ 48 -75 7185 3755 -3657 -447 -366 -5469 -597 3372 -4438 -6592 -2023 -5374 -6147 1794 774
1300G74o872L591K661m257N137O070o117k436N401k188j436P428n80p680K302
$$ 774 -6098 -2507 154 -4103 1034 7104 987 -1449 3952 1764 328 7756 7176 -504 1798
1315A798K282n071K488N181o614m523M285k296k945O130K28p866J384L398l852
$$ 1798 4080 -991 1497 6678 64 -4459 -174 -2470 -5415 715 943 -6923 -5539 -2141 -5993
1330e993K617O712m807m111N600p6k306O971K109o873P45M386l703J262O195m390
$$ -5993 -3376 3336 -1471 -5582 18 -58 -2364 4607 6716 -157 588 4974 1271 2533 8728 4338
1346D338n871L814j74m359M950J637p935j130M116l895l08O342l078o000M003
$$ 4338 -1533 2281 2107 -2252 2698 4335 -3600 -4730 -614 -4509 -4817 1525 -1553 -7553 -3550
1361c550J540l363N107M108o527n98N657k081k28P064j935o231L591J898l906
$$ -3550 -2010 -5373 -266 3842 -2685 -3283 2374 293 65 7129 5194 -1037 2554 4452 546
1376E46L303L918p205k639M336k601k113N653j913p416K348K459m028K686M706
$$ 546 3849 7767 562 -2077 2259 -342 -2455 3198 1285 -6131 -3783 -1324 -5352 -2666 2040
1391B040n685k846N279p43j566O306L94o334K468L996k995J914N719n154m217
$$ 2040 -3645 -6491 -1212 -1955 -3521 2785 3179 -3155 -687 3309 314 2228 7947 2793 -1424
1406a424N083m70l169M941N00p763M62L580l933O10M771m764n018M155K91k945
$$ -1424 3659 3189 20 4961 5461 -2302 -1840 1740 -2193 -1583 3188 -1576 -6594 -2439 -2148 -5093
1422e093M742J796o733L79N231k684J076N919k861m991M603J922l027M136K573
$$ -5093 -351 1445 -5288 -4909 322 -2362 -1286 4633 1772 -3219 1384 3306 279 4415 6988
1437F988o687p00M474k315j070M776k963o457L004K020m210K705K808o653j801
$$ 6988 301 -399 4075 1760 690 5466 2503 -3954 -950 1070 -3140 -435 2373 -4280 -6081
1452f081M644j539j248N525j439n799L542L194l022L241M279n265k197N441l14
$$ -6081 -1437 -2976 -4224 1301 -138 -5937 -2395 799 -2223 1018 5297 32 -2165 3276 2962
1467B962j898N359j273o373K057L289l847J135L483n889l643M373m83k918L926
$$ 2962 1064 6423 5150 -1223 834 4123 276 1411 4894 -995 -4638 -265 -748 -3666 260
1482B60k20o514J280M143k505J028M719m108l378N448J051k006M450J511n964
$$ 260 40 -6474 -5194 -1051 -3556 -2528 2191 -1917 -5295 153 1204 -802 3648 5159 -805
1497h05O15N166k387r5M269l907m878L979Q61l637K681J007o808q28M477k447
$$ -805 -190 4976 2589 2494 6763 2856 -2022 1957 2818 -819 1862 2869 -3939 -4767 -290 -2737
1513b737j116M508k778n357M493K501k885L005L004n416l95N727p65j073M643
$$ -2737 -3853 655 -2123 -7480 -2987 -486 -3371 -366 2638 -2778 -3173 2554 1789 716 5359
1528E359j512n298L475K927l063J322K475n927k442M749j294k514L171j137o187
$$ 5359 3847 -1451 2024 4951 1888 3210 5685 -242 -2684 2065 771 -1743 1428 291 -5896
1543e896K033L428l075R06L429m384k609N337N49j810M015K66m917K052M669k298
$$ -5896 -3863 -435 -3510 -2604 825 -3559 -6168 -831 -282 -2092 1923 2189 -2728 -676 3993 1695
1559A695N99L585l967l241M621M71l247L017N5o214L85M264l168o05L451l936
$$ 1695 2294 5879 1912 -1329 3292 3763 516 3533 3588 -2626 -2241 2023 -1145 -1750 1701 -2235
1575b235m109M228J552k990K657J530n162M17N202j425m44M091k054m012M475
$$ -2235 -6344 -2116 -564 -3554 -897 633 -4529 -4112 1090 -335 -779 3312 1258 -2754 1721
1590A721K451k772J748J886m932j097M955j641k078L293k505n066K905K593l454
$$ 1721 4172 1400 3148 5034 102 -995 3960 2319 241 3534 1029 -4037 -1132 1461 -1993
1605a993O54K173n132j228M618k75k196L604q06m404L184L905k409Q33L378l984
$$ -1993 -1339 834 -4298 -5526 -908 -1183 -3379 225 -581 -4985 -1801 2104 -305 528 3906 -78
1621g8j694N435J94k562K961m77n178J687L526k904l83K451m395l116M302K83
$$ -78 -1772 3663 3857 1295 4256 3779 -1399 288 3814 910 527 2978 -1417 -4533 -231 52
1637E2l139K340N3m824J225M296j869n11L402k597k602M655K223k865K681J302
$$ 52 -3087 -747 -694 -5518 -4293 3 -1866 -2377 1025 -1572 -4174 481 2704 -161 2520 3822
1653C822m527Q11M873j848j458K725k463m119L478J801l778J124J082n334l81
$$ 3822 -705 106 4979 3131 1673 4398 1935 -2184 1294 3095 -683 441 1523 -3811 -4192
1668d192M367j346k051K660j650l696L820K849k622J355K337l838l39N127j37
$$ -4192 175 -1171 -3222 -562 -2212 -5908 -2088 761 -1861 -506 1831 -2007 -2346 2781 2644
1683B644j788K912q30m221K943L140k956RJ798m247j773M099l33l286J956o05
$$ 2644 856 3768 2938 -1283 1660 4800 1844 1853 3651 -596 -2369 1730 1397 -1889 67 -538
1699e38m477K021L357k565n19K784k769j883M408J408k473K169R78m179K214M441
$$ -538 -5015 -2994 363 -2202 -2721 63 -2706 -4589 -181 1227 -1246 923 1901 -2278 -64 4377
1715D377k261r25K857k839k557M035R51l430J323M88m612P65L874k128j909K188
$$ 4377 2116 1191 4048 1209 -1348 2687 3638 208 1531 2019 -2593 -1828 2046 -82 -1991 197
1731A97k242l114M068J601l122J377J312l566P67M734j134j458K498j145k787
$$ 197 -2045 -5159 -1091 510 -2612 -1235 77 -3489 -2722 2012 878 -580 1918 773 -2014
1746b014L819K150k881M64J832l784m27M257j147k637J894j137l594K464K583
$$ -2014 1805 3955 1074 1538 3370 -414 -841 3416 2269 -368 1526 389 -3205 -741 1842
1761A842l128m99J558k930r47M337r0k606K072j74l064K644L658k651oK375k296
$$ 1842 -1286 -1785 -227 -3157 -4104 233 143 -2463 -391 -565 -3629 -985 2673 22 16 2391 95
1778I5j512M619J95k694J507K72l715J577L389k914j320K011k693k105L746M32
$$ 95 -1417 3202 3397 703 2210 2482 -1233 344 3733 819 -501 1510 -1183 -3288 458 890
1794H90l333J039Q50l758J464M013k064j367K487j261j897M119J424k679J097
$$ 890 -2443 -1404 -554 -4312 -2848 1165 -899 -2266 221 -1040 -2937 1182 2606 -73 1024
1809A024J626l330P23M266j574k229K111j471k905L150J703l519l21J325l461
$$ 1024 2650 -680 43 4309 2735 506 2617 1146 -1759 1391 3094 -425 -746 579 -2882
1824b882q0L785j232k672K009m86k843L177K782l074L36K208k314j17M383k86
$$ -2882 -2962 823 -409 -3081 -1072 -1558 -4401 -1224 1558 -1516 -1180 1028 -1286 -1403 2980 2694
1840B694k593K122j06k917K565K412k877j022J798k542j237L652n46l258J153
$$ 2694 101 2223 2117 -800 1765 4177 1300 278 2076 -466 -1703 1949 1403 -1855 -702
1855g02O5l272J940L161k672j008K012j617j086M117N90k727J183J261k811J923
$$ -702 -637 -3909 -1969 1192 -1480 -2488 -476 -2093 -3179 938 1528 -1199 -16 1245 -1566 357
1871C57L381j935j370J962j407j915L407Q96l465N29R04l203N92L374k277k236
$$ 357 3738 1803 433 2395 988 -927 2480 3376 -89 440 1344 -1859 -1267 2107 -170 -2406
1887b406K051j123k111L145J478l342N23J725k526R70L659j258j772K224m80k139
$$ -2406 -355 -1478 -3589 -444 1034 -2308 -1785 -60 -2586 -1616 2043 785 -987 1237 757 -1382
1903a382L130J904k929J42J487k409k97L528j170k835J330l35k655K342K051l411
$$ -1382 1748 3652 723 865 2352 -57 -354 3174 2004 -831 499 164 -2491 -149 1902 -1509
1919a509p24K072k320l96L393k06k828J703O80k500K380K675k380o77K285j349
$$ -1509 -2233 -161 -2481 -2877 516 310 -2518 -815 -135 -2635 -255 2420 40 -637 1648 299
1935B99r87L736Q5l173J411N81k535J247K247k409j560J605j483j485K941L73
$$ 299 -688 3048 3133 -40 1371 1952 -583 664 2911 502 -1058 547 -936 -2421 520 893
1951H93l492R67R54k259R41L233k023j448K242n66j149L211R42k594N32J668k001
$$ 893 -2599 -1632 -678 -2937 -1996 1237 -786 -2234 8 -558 -1707 1504 2446 -148 384 2052 51
1968E1M10L192j656k255J781m56k042K466P66l301l29J476k160o4K913j367k529
$$ 51 461 3653 1997 -258 1523 1067 -975 1491 2257 -1044 -1373 103 -2057 -2121 792 -575 -3104
1985c104J575M48j866K391J868k430l49K266j293J1L481o10k444J650J77j761
$$ -3104 -1529 -1081 -2947 -556 1312 -1118 -1467 799 -494 -483 2998 2388 -56 1594 1771 10
2001A0J659J854k879j036J689j585r07K835p29l208R97M93j903J101K306k293
$$ 10 1669 3523 644 -392 1297 -288 -1195 1640 911 -2297 -1300 -807 -2710 -1609 697 -1596
2017a596j216K053n51j045L208N09k531J158J333j752J379K504k102j470K071
$$ -1596 -2812 -759 -1310 -2355 853 1362 -1169 -11 1322 -430 949 3453 1351 -119 1952
2032A952n79j491K483K73l188K60J059k123M69K085j750j989J499Q8j604K222
$$ 1952 1373 -118 2365 2638 -550 -290 769 -1354 -885 1200 -550 -2539 -1040 -952 -2556 -334
2048c34J050k959M76J977j548L61K832j039j949J960L73j392K162J335k929l67
$$ -334 716 -2243 -1767 210 -1338 -977 1855 816 -1133 827 1200 -192 1970 3305 376 9
2064IJ721j186o43K568j273k549J300J81j933J402J534l044m80J564p58o66K708
$$ 9 1730 544 -99 2469 1196 -1353 -53 128 -1805 -403 1131 -1913 -2393 -829 -1587 -2253 455
2081D55m65k545J666J153j489J575K242k627n66K184q68m26K208k97k559Q00J451
$$ 455 -10 -2555 -889 264 -1225 350 2592 -35 -601 1583 715 289 2497 2200 -359 441 1892
2098A892k202R14J648k377j560J741p29j023K014j61k669N32J576j504N69K349
$$ 1892 -310 604 2252 -125 -1685 56 -673 -1696 318 157 -2512 -1980 -404 -1908 -1339 1010
2114A010j865j165K085M3j153K512R75k757O54J721j238M3K185j649j960J643
$$ 1010 -855 -2020 65 108 -1045 1467 2442 -315 339 2060 822 865 3050 1401 -559 1084
2130A084m3j716J754M46k957k44J548j139l14K042j056k395J752O84j420J709
$$ 1084 1041 -675 1079 1525 -1432 -1676 -128 -1267 -1581 461 -595 -2990 -1238 -554 -1974 -265
2146b65J364k133j64K097m83k96K283m09k392J517O63j365J065J235k478j050
$$ -265 1099 -1034 -1198 899 416 120 2403 1994 -398 1119 1782 417 1482 2717 239 -811
2162h11J459m40j065J652l26k955R88J086j414P29J573j927q88J954Qp47J937
$$ -811 648 208 -857 795 469 -2486 -1498 -412 -1826 -1097 476 -1451 -2339 -385 -377 -1124 813
2179H13M25k317R52J715j179M93J877j879j471J740J85j299J511L01k886M02J345
$$ 813 1238 -1079 -127 1588 409 902 2779 900 -571 1169 1354 55 1566 1867 -1019 -617 728
2196G28j667P3J668j652j611J672L80j265J351Q16k309J73K110q80j15K334j194
$$ 728 -939 -866 802 -850 -2461 -789 -409 -1674 -323 493 -1816 -1643 467 -413 -528 1806 612
2213F12j547J637Q06j668J596R46k395k67J687q40n05J524q87k213J051Q76j535
$$ 612 -935 702 1508 -160 1436 2382 -13 -280 1407 567 62 1586 699 -1514 -463 413 -1122
2230a122P74Q47k060o35J913l61p86J746l66j888J103J436r41Q75J237j622o71
$$ -1122 -348 499 -1561 -2196 -283 -644 -1430 316 -50 -1938 -835 601 -340 535 1772 150 -521
2247e21J737j51q54J813n20k276Q37J482j332j09J305j692j322J572Rj328J138
$$ -521 1216 1065 211 2024 1504 -772 65 1547 215 106 1411 -281 -1603 -31 -22 -1350 -212
2264b12L15k336O37J610j097K21J593j251j204J958N11j202J504O46k102M49J549
$$ -212 103 -2233 -1596 14 -1083 -862 731 -520 -1724 234 745 -457 1047 1693 -409 40 1589
2281A589r13m4J411j199j841J632N42j617Q18M72k351O6J398q52o99J594r29j395
$$ 1589 676 632 2043 844 -997 635 1177 -440 378 850 -1501 -1435 -37 -889 -1588 6 -923 -2318
2299b318J345J012j048P94J084j616l04K043j60q41J901n65j846J293J178j669
$$ -2318 -973 39 -1009 -215 869 -747 -1051 992 832 -9 1892 1327 -519 774 1952 283
2315B83N67R37j737r30J658m00j087J008l61k249R95J355j216K32J241j384q32
$$ 283 850 1787 50 -880 778 378 -709 299 -62 -2311 -1316 39 -1177 -945 296 -1088 -1920
2332a920K019J32r86J335L19j828R09J531j126K27J449j343j209J707J01j221
$$ -1920 99 231 -755 580 899 -929 -20 1511 385 612 2061 718 -491 1216 1317 96
2348I6Q59J23j966J50J246p99o31J355j294j240J617M97j227O77P79j741L36J660
$$ 96 955 1078 -888 -738 508 -291 -922 433 -861 -2101 -484 13 -1214 -537 242 -1499 -1163 497
2366D97l89m59J478p29j022J254P44j090N94P49j629k70J616m39j240J234p29
$$ 497 108 -351 1127 398 -624 630 1374 284 878 1627 -2 -272 1344 905 -335 899 170
2383A70j492P30J082j170k8R68j626o10K083k70q50J065j30j754J408J363j222
$$ 170 -1322 -592 490 -680 -708 260 -1366 -1976 107 -163 -1013 52 -78 -1832 -424 939 -283
2400b83J96J227r87p44J876qr43O76O6j606O27J312j255l16J051j195j166J724
$$ -283 -87 1140 153 -591 1285 1277 334 1010 1076 -530 97 1409 154 -162 889 -306 -1472 252
2418B52k90j073P34K35j378L18J437o53m25J291p29j096J581P54j035O13O47j415
$$ 252 -38 -1111 -377 -142 -1520 -1202 235 -418 -843 448 -281 -1377 204 958 -77 536 1183 -232
2436b32L01J490o74o19R48m91j367J160O22j389J54P02j698j36J414m92q44R87
$$ -232 69 1559 885 266 1214 723 -644 516 1138 -251 -97 605 -1093 -1229 185 -307 -1151 -164
2454a64k22j334J151R04j087M33R26j334mJ681k1j010J234j15j258Q02J087r01
$$ -164 -386 -1720 -569 335 -752 -319 607 -727 -731 950 929 -81 1153 1038 -220 582 1669 768
2472G68l63Q36j189q69J403M4j295O62p2j503O49J183j111k11J118r47o66J521
$$ 768 405 1241 52 -817 586 630 -665 -3 -75 -1578 -929 254 -857 -1068 50 -897 -1563 -42
2490d2N13r09N99N72j239O36J457o97n28J150p83j146J425L38j379M87J60j303
$$ -42 471 -438 161 733 -506 130 1587 890 362 1512 729 -417 1008 1346 -33 454 614 -689
2508f89K66J110q58o03P49q81o50R31P36j058K59P16j150J63J680n20l43O79j47
$$ -689 -423 687 -171 -774 -25 -906 -1556 -625 111 -947 -688 28 -1122 -959 721 201 -142 537 390
2527C90r03J139Q14j350K40O70r68j97J282m21r71P26k47j093P71M78q89j58N18
$$ 390 -513 626 1440 90 330 1000 32 -165 1117 696 -275 451 204 -889 -118 360 -529 -687 -169
2546a69q56m17J558l09q73P65J01o13N85J182q85j84J001q99l40J511L1j077N41
$$ -169 -1025 -1442 116 -193 -1066 -301 -200 -813 -228 954 69 -115 886 -13 -353 1158 1189 112 653
$$ [...]
8191A14
##END NTUPLES=NMR FID
##END=
