##TITLE=1H_ABC 0802
 CDCl3,40 sc, 
 8.02.2021
##JCAMPDX= 6.0         $$ Bruker NMR JCAMP-DX V2.0
##DATA TYPE= NMR FID
##DATA CLASS= NTUPLES
##ORIGIN= UXNMR, Bruker Analytische Messtechnik GmbH
##OWNER= root
$$ XWIN-NMR		Version 3.5
$$ Mon Feb  8 13:47:31 2021 Russian Standard Time (UT+4h)  she@DPX200
##.OBSERVE FREQUENCY= 200.1315066352
##.OBSERVE NUCLEUS= ^1H
##.DELAY= (6, 6)
##.ACQUISITION MODE= SIMULTANEOUS
##.ACQUISITION SCHEME= undefined
##.AVERAGES= 8
##.DIGITISER RES= 18
##SPECTROMETER/DATA SYSTEM= spect
##.PULSE SEQUENCE= zg30
##.SOLVENT NAME= CDCl3
##.SHIFT REFERENCE= (INTERNAL, CDCl3, 0, 15.7039)
##AUDIT TRAIL= $$ (NUMBER, WHEN, WHO, WHERE, WHAT)
$$ ##TITLE= Audit trail, XWIN-NMR		Version 3.5
$$ ##JCAMPDX= 5.01
$$ ##ORIGIN= Bruker BioSpin GmbH
$$ ##OWNER= she
$$ F:/spectra/data/she/nmr/H-F/1/audita.txt
$$ ##AUDIT TRAIL=  $$ (NUMBER, WHEN, WHO, WHERE, WHAT)
(   1,<2021-02-08 13:46:24.12 +0400>,<she>,<DPX200>,
      <created by zg, POWCHK disabled, PULCHK disabled
       configuration hash MD5:
       00 E9 B6 7A A2 85 ED C7 34 08 36 98 17 FE 4E 26
       data hash MD5: 16K
       2F 42 0D C5 C6 E8 C1 FE 9A F0 41 A6 02 3C 4E 9F>)
$$ ##END=
$$ 
$$ hash MD5
$$ CD 08 61 4A 68 E6 BF 12 FE FB DD 10 08 E2 95 3D
##$RELAX= 
##$RELAX= 
##$RELAX= 
##$RELAX= 
##$RELAX= 
##$RELAX= 
$$ Bruker specific parameters
$$ --------------------------
##$DU= <F:/spectra>
##$EXPNO= 1
##$NAME= <H-F>
##$PROCNO= 1
##$TYPE= <nmr>
##$USER= <she>
##$AMP= (0..31)
100 100 100 100 100 100 100 100 100 100 100 100 100 100 100 100 100 100 
100 100 100 100 100 100 100 100 100 100 100 100 100 100 
##$AQSEQ= 0
##$AQ_mod= 1
##$AUNM= <au_zg>
##$AUTOPOS= <>
##$BF1= 200.13
##$BF2= 200.13
##$BF3= 200.13
##$BF4= 200.13
##$BF5= 200.13
##$BF6= 200.13
##$BF7= 200.13
##$BF8= 200.13
##$BYTORDA= 1
##$CFDGTYP= 0
##$CFRGTYP= 5
##$CHEMSTR= <none>
##$CNST= (0..31)
1 1 145 1 1 1 1 1 1 1 1 1 1 1 1 1 1 1 1 1 1 1 1 1 1 1 1 1 1 1 1 1 
##$CPDPRG= <>
##$CPDPRG1= <>
##$CPDPRG2= <>
##$CPDPRG3= <>
##$CPDPRG4= <mlev>
##$CPDPRG5= <mlev>
##$CPDPRG6= <mlev>
##$CPDPRG7= <mlev>
##$CPDPRG8= <mlev>
##$CPDPRGB= <>
##$CPDPRGT= <>
##$D= (0..31)
0 1.2 0 0 0 0 0 0 0 0.06 0 0.03 0 0 0 0 0.0002 0 0 0 0 0 0 0 0 0 0 0 0 
0 0 0 
##$DATE= 1612777583
##$DBL= (0..7)
120 120 120 120 120 120 120 120 
##$DBP= (0..7)
150 150 150 150 150 150 150 150 
##$DBP07= 0
##$DBPNAM0= <>
##$DBPNAM1= <>
##$DBPNAM2= <>
##$DBPNAM3= <>
##$DBPNAM4= <>
##$DBPNAM5= <>
##$DBPNAM6= <>
##$DBPNAM7= <>
##$DBPOAL= (0..7)
0.5 0.5 0.5 0.5 0.5 0.5 0.5 0.5 
##$DBPOFFS= (0..7)
0 0 0 0 0 0 0 0 
##$DE= 6
##$DECBNUC= <off>
##$DECIM= 32
##$DECNUC= <off>
##$DECSTAT= 4
##$DIGMOD= 1
##$DIGTYP= 9
##$DL= (0..7)
0 120 120 120 120 120 120 120 
##$DP= (0..7)
150 150 150 150 150 150 150 150 
##$DP07= 0
##$DPNAME0= <>
##$DPNAME1= <>
##$DPNAME2= <>
##$DPNAME3= <>
##$DPNAME4= <>
##$DPNAME5= <>
##$DPNAME6= <>
##$DPNAME7= <>
##$DPOAL= (0..7)
0.5 0.5 0.5 0.5 0.5 0.5 0.5 0.5 
##$DPOFFS= (0..7)
0 0 0 0 0 0 0 0 
##$DQDMODE= 0
##$DR= 18
##$DS= 0
##$DSLIST= <SSSSSSSSSSSSSSS>
$$ [...]
##$SUBNAM2= <"">
##$SUBNAM3= <"">
##$SUBNAM4= <"">
##$SUBNAM5= <"">
##$SUBNAM6= <"">
##$SUBNAM7= <"">
##$SUBNAM8= <"">
##$SUBNAM9= <"">
##$SW= 16.9725356469052
##$SWIBOX= (0..15)
0 0 2 0 0 0 0 0 0 0 0 0 0 0 0 0 
##$SW_h= 3396.73913043478
##$TD= 16384
##$TD0= 1
##$TE= 0
##$TE2= 300
##$TE3= 300
##$TEG= 300
##$TL= (0..7)
0 120 120 120 120 120 120 120 
##$TP= (0..7)
150 150 150 150 150 150 150 150 
##$TP07= 0
##$TPNAME0= <>
##$TPNAME1= <>
##$TPNAME2= <>
##$TPNAME3= <>
##$TPNAME4= <>
##$TPNAME5= <>
##$TPNAME6= <>
##$TPNAME7= <>
##$TPOAL= (0..7)
0.5 0.5 0.5 0.5 0.5 0.5 0.5 0.5 
##$TPOFFS= (0..7)
0 0 0 0 0 0 0 0 
##$TUNHIN= 0
##$TUNHOUT= 0
##$TUNXOUT= 0
##$USERA1= <user>
##$USERA2= <user>
##$USERA3= <user>
##$USERA4= <user>
##$USERA5= <user>
##$V9= 5
##$VALIST= <valist>
##$VCLIST= <CCCCCCCCCCCCCCC>
##$VD= 0
##$VDLIST= <DDDDDDDDDDDDDDD>
##$VPLIST= <PPPPPPPPPPPPPPP>
##$VTLIST= <TTTTTTTTTTTTTTT>
##$WBST= 1024
##$WBSW= 4
##$XGAIN= (0..3)
0 0 0 0 
##$XL= 0
##$YL= 0
##$YMAX_a= 426413
##$YMIN_a= -463107
##$ZGOPTNS= <>
##$ZL1= 120
##$ZL2= 120
##$ZL3= 120
##$ZL4= 120
##$ABSF1= 10
##$ABSF2= 0
##$ABSG= 5
##$ABSL= 3
##$ALPHA= 0
##$AQORDER= 0
##$ASSFAC= 0
##$ASSFACI= 0
##$ASSFACX= 0
##$ASSWID= 0
##$AUNMP= <proc_1d>
##$AZFE= 0.1
##$AZFW= 0.1
##$BCFW= 1
##$BC_mod= 2
##$BYTORDP= 1
##$COROFFS= 0
##$CY= 11.3945322036743
##$DATMOD= 1
##$DC= 2
##$DFILT= <>
##$DTYPP= 0
##$F1P= 15.9154993809931
##$F2P= -4.1035820241983
##$FCOR= 0.5
##$FTSIZE= 0
##$FT_mod= 4
##$GAMMA= 1
##$GB= 0.15
##$INTBC= 1
##$INTSCL= 1
##$ISEN= 128
##$LB= 0.24
##$LEV0= 0
##$LPBIN= 0
##$MAXI= 10000
##$MC2= 0
##$MEAN= 0
##$ME_mod= 0
##$MI= 1.114404
##$NCOEF= 0
##$NC_proc= 0
##$NLEV= 6
##$NOISF1= 3.799351
##$NOISF2= 2.8
##$NSP= 1
##$NTH_PI= 0
##$NZP= 0
##$OFFSET= 15.70392
##$PC= 1
##$PHC0= -10756.58
##$PHC1= 11.20094
##$PH_mod= 1
##$PKNL= yes
##$PPARMOD= 0
##$PSCAL= 0
##$PSIGN= 0
##$REVERSE= no
##$SF= 200.130013532006
##$SI= 16384
##$SIGF1= 3
##$SIGF2= 2
##$SINO= 400
##$SIOLD= 16384
##$SREGLST= <1H.CDCl3>
##$SSB= 0
##$STSI= 0
##$STSR= 0
##$SW_p= 3612.71676300578
##$SYMM= 0
##$S_DEV= 0
##$TDeff= 0
##$TDoff= 0
##$TI= <>
##$TILT= no
##$TM1= 0
##$TM2= 0
##$TOPLEV= 0
##$USERP1= <user>
##$USERP2= <user>
##$USERP3= <user>
##$USERP4= <user>
##$USERP5= <user>
##$WDW= 1
##$XDIM= 8192
##$YMAX_p= 0
##$YMIN_p= 0
$$ End of Bruker specific parameters
$$ ---------------------------------
##NTUPLES= NMR FID
##VAR_NAME=  TIME,          FID/REAL,        FID/IMAG
##SYMBOL=    X,             R,               I
##VAR_TYPE=  INDEPENDENT,   DEPENDENT,       DEPENDENT
##VAR_FORM=  AFFN,          ASDF,            ASDF
##VAR_DIM=   8192,          8192,            8192
##UNITS=     SECONDS,       ARBITRARY UNITS, ARBITRARY UNITS
##FACTOR=    0.0002944,     1,               1
##FIRST=     0,             0,               0
##LAST=      2.4114304,     0,               0
##MIN=       0,             -463107,         0
##MAX=       2.4114304,     426413,          0
$$ Real data points
##PAGE= N=1
##DATA TABLE= (X++(R..R)), XYDATA
$$ [...]
$$ plain form
1869 423 -561 595 -486 -229 515 477 -432 286 -181 152 222 -542 66 409 -244 -85 412 113 752 -612
1889 -612 -146 446 -417 -700 -707 -132 -6 -107 -66 590 -715 -320 837 -405 303 186 -725 89 -74 -221
1909 -221 332 25 -241 230 -309 -193 285 -402 227 75 -295 530 -255 -141 353 -265 -546 -47 -309 97
1929 97 173 -535 156 -157 -313 186 -185 -230 399 -400 -29 273 -533 245 123 -132 176 102 -395 183 -213
1950 -213 -211 557 -260 -62 351 -415 119 459 -1 64 98 -160 481 277 2 441 -334 135 148 9 922 247
1972 247 -381 765 -236 -351 648 -237 -302 599 -262 133 258 -426 499 330 -431 475 13 -400 492 -368
1992 -368 -362 475 -468 20 124 -346 132 384 -579 218 61 -417 567 -227 -275 536 -452 -330 427 -502 -176
2013 -176 176 -589 170 38 -611 604 -56 -512 536 -288 -109 791 -600 222 487 -609 56 -40 -366
$$ packed form
1869D23r84J156j081K57P44l8r09P18m67L33P0p64O08L43o53J59M97k99O39j364
1889f12M66N92q63k83pN75J26j01M1O56j305L95J157j242P08j17r11Q14j63j47
1909b21N53l07k66M71n39J16M78o87O29j52l70Q25p85J14M94o18k81M99k62M06
1929I7P6p08O91l13j56M99l71m5O29p99L71L02q06P78j22k55L08p4m97N78l96
1950b13KP68q17J98M13p66N34L40m60O5L4k58O41k04k75M39p75M69J3j39R13o75
1972B47o28J146j001j15R99q85o5R01q61L95J25o84R25j69p61R06m62m13Q92q60
1992c68OQ37r43M88J04m70M78K52r63P97j57m78R84p94m8Q11r88J22P57r29L26
2013a76L52p65P59j32o49J215o60m56J048q24J79R00j391Q22K65j096O65r6l26
$$ plain form
2032 -366 617 33 -410 702 -120 -197 555 -339 69 443 -516 345 313 -515 673 -48 -351 612 66 -189
2052 -189 607 -727 -27 549 -598 385 134 -425 536 10 -216 262 -479 -233 618 -302 -44 374 -538
2071 -538 175 196 -309 475 -72 -356 418 -199 -493 375 -478 -142 480 -633 -9 279 -525 230 153 -564
2091 -564 249 -153 -273 383 -454 58 247 -583 119 105 -246 17 36 26 533 -130 -85 251 -262 -66 -39 -406
2113 -406 565 155 -118 168 -34 -43 19 256 -105 398 -223 175 547 -356 182 43 -45 222 241 -479 20 -238
2135 -238 -132 130 -275 -178 839 217 -180 147 -386 337 323 -218 -651 458 -607 353 -131 -176 -210 159
2155 159 -488 280 189 -352 -40 -510 70 96 40 114 -769 1165 928 -805 165 -554 -1265 434 627 -651
2175 -651 -99 -473 47 32 723 436 424 176 -349 272 -499 48 -1015 -47 400 -38 864 66 -795 403
$$ packed form
2032c66R83n84m43J112q22p7P52q94M08L74r59Q61l2q28J188p21l03R63n46k55
2052a89P96j334P00N76j147R83k51n59R61n26k26M78p41K46Q51r20K58M18r12
2071e38P13K1n05P84n47k84P74o17k94Q68q53L36O22j113O24K88q04P55p7p17
2091e64Q13m02j20O56q37N12J89q30P02j4l51K63J9j0N07o63M5L36n13J96K7l67
2113d06R71m10k73K86k02rO2K37l61N03o21L98L72r03N38j39q8K67J9p20M99k58
2135b38J06K62m05R7J017o22l97L27n33P23j4n41m33J109j065R60m84m5l4L69
2155A59o47P68r1n41L12m70N80K6n6P4q83J934k37j733R70p19p11J699J93j278
2175f51N52l74N20j5O91k87j2k48n25O21p71N47j063R68M47m38R02p98q61J198
$$ plain form
2195 403 449 -41 785 -243 689 -444 -154 362 -36 -439 -1036 -515 -515 26 70 241 -462 15 132 -1 112
2216 112 1067 128 -300 -357 340 260 240 114 -385 91 -725 527 181 -292 197 -545 146 -157 -216 30 289
2237 289 -720 87 -405 201 715 -222 -487 -163 193 -802 131 -232 -557 259 592 90 65 -394 285 348
2257 348 -372 53 75 -1294 231 355 -666 -30 42 -373 434 -144 291 38 -414 725 222 -328 178
2276 178 463 -223 422 190 -604 339 -248 -462 60 -434 34 303 -484 1363 303 -446 15 181 -423
2295 -423 493 -323 -427 627 -340 -108 210 -278 78 231 -486 50 15 -568 484 -348 -63 479 -9 -65
2315 -65 281 -391 274 26 -609 136 -73 -400 447 -339 -123 408 -386 111 165 -410 307 222 -622 246 146
2336 146 -423 337 -27 -279 422 -130 -149 473 -264 231 68 -346 384 170 -316 348 -94 -69 250 -97 120
$$ packed form
2195D03M6m90Q26j028R32j133K90N16l98m03n97N21%N41M4J71p03M77J17j33J13
2216A12R55r39m28n7O97q0k0j26m99M76q16J252l46m73M89p42O91l03n9K46K59
2237B89j009Q07m92O06N14r37k65L24L56r95R33l63l25Q16L33n02k5m59O79O3
2257C48p20M25K2j369J525J24j021O36P2m15Q07n78M35k53m52J139n03n50N06
2276A78K85o86O45k32p94R43n87k14N22m94M68K69p87J847j060p49M61J66o04
2295d23R16q16j04J054r67K32L18m88L56J53p17N36l5n83J052q32K85N42m88n6
2315f5L46o72O65k48o35P45k09l27Q47p86K16N31p94M97N4n75P17q5q44Q68j00
2336A46n69P60l64k52P01n52j9O22p37M95j63m14P30k14m86O64m42K5L19l47K17
$$ plain form
2357 120 299 -666 -74 498 -359 640 86 -499 401 113 -463 402 -387 -236 218 -307 146 431 -434 563
2377 563 -145 -585 -102 -247 -593 302 -369 -324 154 -292 12 281 -210 257 -62 -462 321 16 -339 196
2397 196 -159 -235 346 -320 -204 221 -512 108 298 -533 431 -207 -141 388 106 -190 166 -537 35 432 -467
2418 -467 234 398 -494 261 -100 -344 325 -51 -410 403 -57 15 496 -30 193 386 -457 321 92 -697
2438 -697 311 -301 -344 866 -458 409 -23 -222 108 188 -105 -109 329 -621 389 -51 -241 693 -191 204
2458 204 -77 -810 141 -196 -594 471 260 -135 257 -39 -82 305 -635 -113 496 -472 405 209 -50 304
2478 304 -497 -304 -91 -381 193 308 -358 410 20 -491 57 253 6 -11 23 -661 672 -458 50 -451
2498 -451 -171 731 1171 -14 159 -15 84 1357 471 428 886 287 -439 478 -234 1151 475 -499 390 231
$$ packed form
2357A20J79r65N92N72q57R99n54n85R00k88n76Q65p89J51M54n25M53K85q65R97
2377E63p08m40M83j45l46Q95o71M5M78m46L04K69m91M67l19m00P83l05l55N35
2397A96l55p6N81o66J16M25p33O20J90q31R64o38O6N29k82k96L56p03N72L97q99
2418d67P01J64q92P55l61k44O69l76l59Q13m60P2M81n26K23J93q43P78k29p89
2438f97J008o12m3J210j324Q67m32j99L30Q0k93mM38r50J010m40j90R34q84L95
2458B04k81p33R51l37l98J065k11l95L92k96m3L87r40N22O09r68Q77j96k59L54
2478C04q01J93K13k90N74J15o66P68l90n11N48J96k47j7L4o84J333j130N08n01
2498d51K80R02M40j185J73j74R9J273q86m3M58n99p26R17p12J385o76r74Q89j59
$$ plain form
2518 231 -1101 498 35 -195 108 69 1042 367 -712 220 22 -346 258 27 -379 874 39 -594 1041
2537 1041 -61 481 181 -375 -6 464 533 527 292 -233 109 248 -287 767 -80 73 506 -12 68 -110
2557 -110 -282 338 -274 -577 399 406 -675 211 195 -165 413 94 264 -166 67 267 29 -184 190 156 -286
2578 -286 252 -111 -89 695 -183 -221 351 40 165 195 -206 12 -38 -274 509 -200 -74 185 -227 -82 305
2599 305 -330 72 83 -99 338 199 -258 102 85 -18 323 -372 -37 9 -456 116 238 -417 -7 115 -320
2620 -320 447 -341 -225 389 -148 146 321 -323 3 207 -183 302 169 -128 505 53 -29 490 -149 -71 304
2641 304 -327 -14 180 -442 143 25 -300 377 -181 -342 383 -299 -240 242 -223 180 238 -253 118 76 -358
2662 -358 516 -75 -282 349 -113 20 193 -137 138 163 -327 40 -3 -258 258 325 -350 410 14 -323 386
$$ packed form
2518B31j332J599m63k30L03l9R73o75j079R32j98l68O04k31m06J253q35o33J635
2537A041j102N42l00n56L69M70O9ok35n25L42J39n35J054q47J53M33n18Q0j78
2557a10j72O20o12l03R76Pj081Q86j6l60N78l19J70m30K33K00k38k13L74l4m42
2578b86N38l63K2P84q78l8N72l11J25L0m01K18n0k36P83p09J26K59m12J45L87
2599C05o35M02J1j82M37j39m57L60j7j03L41o95L35M6m65N72J22o55M10J22m35
2620c20P67p88J16O14n37K94J75o44L26K04l90M85j33k97O33m52q2N19o39P8L75
2641C04o31L13J94o22N85j18l25O77n58j61P25o82N9M82m65M03N8m91L71m2m34
2662c58Q74n91k07O31m62J33J73l30K75K5m90L67m3k55N16O7o75P60l96l37P09
$$ plain form
2683 386 -368 -71 480 -109 229 188 -243 366 175 -205 261 -230 -136 367 -157 -153 315 -258 108 297 -408
2704 -408 323 -8 -289 205 -157 28 354 -308 139 -27 -375 70 231 -242 377 87 -163 625 -174 -273
2724 -273 308 -38 32 80 -325 433 220 -437 72 16 -274 205 -202 -329 188 -230 -38 395 -455 105 225
2745 225 -502 170 -59 -65 228 94 -12 426 -364 242 207 -228 -5 225 -305 285 -105 -163 -193 143 -211 335
2767 335 -47 -316 199 -352 66 29 -222 268 25 -325 140 -24 4 113 -149 154 422 -128 154 186 -75
2788 -75 104 43 -340 202 -144 -205 279 -19 -329 187 83 97 78 -4 266 33 91 186 42 -285 44 -109 -32
2811 -32 -2 -156 67 105 -217 226 121 -317 342 -96 -249 197 8 -57 269 -62 -78 269 100 87 62 -277
2833 -277 250 -192 11 469 20 -107 247 -202 -24 267 -204 137 149 2 131 -118 -87 166 30 -100 5
$$ packed form
2683C86p54K97N51n89L38m1m31O09j91l80M66m91R4N03n24MM68n73L66J89p05
2704d08P31l31k81M94l62J85L26o62M47j66l48M45J61m73O19k90k50P88p99r9
2724b73N81l46P0M8m05P58k13o57N09n6k90M79m07j27N17m18J92M33q50N60J20
2745B25p27O72k29oK93j34j06M38p90O06l5m35K23K30n30N90l90n8l0L36l54N46
2767C35l82k69N15n51M18l7k51M90k43l50M65j64K8J09k62L03K68n50K82L2k61
2788g5J79o1l83N42l46o1M84k98l10N16j04J4j9q2K70k33N8R5j44l27L29j53P7
2811c2L0j54K23L8l22M43j05m38O59m38j53M46j89o5L26l31j6L47j69j3k5l39
2833b77N27m42K03M58m49j27L54m49J78K91m71L41J2j47J29k49L1K53j36j30J05
$$ plain form
2854 5 -41 122 -199 -103 149 137 -53 118 123 28 263 -122 -139 164 -118 -76 -144 -173 -106 204 50 199 53 -95
2878 -95 207 -66 -222 246 -167 9 124 158 288 246 -170 49 165 11 251 -263 -62 129 -14 -56 239
2899 239 -39 8 84 -40 -100 124 36 163 -31 155 345 -186 -182 204 -153 -28 -86 -124 183 40 35 22 7 126
2923 126 18 74 57 -58 -297 373 425 -266 -222 -259 -123 -233 594 -368 73 156 436 -310 314 455 618 -349
2945 -349 124 33 -417 154 -62 -348 357 -26 -149 497 -730 746 290 -439 507 -264 -507 113 -300 -50
2965 -50 683 -92 -315 606 -241 847 -768 -623 288 -50 -312 -91 60 -469 116 -255 125 87 313 483
2985 483 -131 -348 -85 236 -256 82 60 55 185 -183 -156 190 65 -185 230 -266 74 118 -187 141 -65 -89
3007 -89 190 -101 -29 230 -128 23 -51 -89 18 104 6 102 78 -5 242 -397 -91 -27 3 -155 359 268 563 -55
$$ packed form
2854Em6J63l21R6K52j2j90J71Nr5K35l85j7L03k82M2o8k9O7L10j54J49j46j48
2878i5L02k73j56M68m13J76J15L4J30m2m16K19J16j54K40n14K01J91j43m2K95
2899B39k78M7P6j24o0K24q8J27j94J86J90n31ML86l57J25n8l8L07j43nj3j5J19
2923A26j08N6j7j15k39O70N2o91M4l7J36j10Q27r62M41Q3K80p46O24J41J63r67
2945c49M73r1m50N71k16k86P05l83j23O46j227J476m56p29R46p71k43O20m13K50
2965e0P33p75k23R21q47J088j615J45R11l38k62K21J51n29N85l71L80l8K26J70
2985D83o14k17K63L21m92L38k2nJ30l68K7L46j25k50M15m96L40M4l05L28k06k4
3007h9K79k91P2K59l58J51p4l8J07Q6r8R6k4q3K47o39L06O4L0j58N14r1K95o18
$$ plain form
3031 -55 -160 89 -248 647 863 -293 211 -15 90 628 70 -679 206 -189 399 -321 77 -28 80 -262
3051 -262 -301 225 -58 218 129 -139 -115 -99 98 15 -57 -83 73 -109 -175 174 11 -57 -23 -182 182 94 80 206
3075 206 16 -61 7 -35 -180 71 -100 -190 53 -200 185 142 184 -19 -14 171 210 -65 -187 504 -32 70 -53
3098 -53 76 -176 5 -74 -15 66 -90 306 -169 -181 129 -139 72 39 -47 -114 70 130 217 -102 -224 118 -37
3121 -37 -87 -97 -129 123 -192 -63 -128 111 120 -155 38 -336 -73 -2 10 152 95 -53 -178 43 -304 305 -151
3144 -151 77 -24 58 185 188 65 -45 103 -51 194 -9 88 37 129 -171 105 -277 233 131 60 282 -89
3166 -89 -76 248 -86 -85 149 -35 57 -13 -5 78 340 180 35 59 104 -23 -18 -140 106 -27 -57 9 -42 138 -63
3191 -63 -220 150 -17 138 281 -93 12 123 -322 -312 96 222 38 56 78 5 -337 181 -88 112 241 248
$$ packed form
3031e5j05K49l37Q95K16j156N04k26J05N38n58p49Q85l95N88p20L98j05J08l42
3051b62l9N26k83K76q9k68K4J6J97q3p2k6J56j82o6L49j63o8L4j59L64q8j4J26
3075B06j90p7O8m2j45K51j71r0K43k53L85m3M2k03NJ85L9k75j22O91n36J02j23
3098e3J29k52J81p9N9Q1j56L96m75j2L10k68K11l3q6o7J84O0Q7l19j22L42j55
3121c7n0j0l2K52l15J29o5K39Rk75J93l74K63P1J2J42n7j48j25K21l47O09m56
3144a51K28j01Q2J27Lj23j10J48j54K45k03R7n1R2l00K76l82N10j02p1K22l71
3166h9J3L24l34JK34j84R2p0QQ3K62j60j45K4M5j27Nj22K46j33l0O6n1J80k01
3191f3j57L70j67J55J43l74J05J11m45J0M08J26j84J8K2p3l42N18k69K00J29P
$$ plain form
3213 248 400 -319 -151 -549 -68 -364 -7 420 -232 -15 329 130 216 -96 -283 -111 -261 210 -148 123
3233 123 -229 92 55 197 -135 -584 -299 428 -283 -261 -20 468 347 -42 410 230 145 -275 -506 30 404
3254 404 -13 262 438 266 423 -107 170 -76 -264 181 -270 -198 359 -461 96 207 50 370 -368 -163
3274 -163 -211 113 536 120 -451 -10 -40 -365 256 -401 -394 -181 -364 -308 -271 -678 -233 -451 324 175 226 -93
3296 -93 -177 -100 364 -557 -20 -54 -424 254 -198 480 -16 140 83 -146 287 -167 318 -158 299 -319 -109 675
3318 675 756 -570 489 -3 332 284 180 387 319 -430 -151 749 173 37 80 158 -266 76 450 93 -243
3339 -243 -38 -179 390 209 45 130 -453 74 -244 210 -208 133 52 205 -125 314 -218 -195 26 -75 -93
3360 -93 -227 47 141 175 -204 -74 225 47 121 48 -45 26 48 27 -55 43 68 -57 -285 132 -185 275 159 -5
$$ packed form
3213B48J52p19J68l98M81k96L57M27o52K17L44j99Q6l12j87J72j50M71l58K71
3233A23l52L21l7J42l32m49K85P27p11K2K41M88j21l89M52j80q5m20k31N36L74
3254D04m17K75J76j72J57n30K77k46j88M45m51P2N57q20N57J11j57L20p38K05
3274a63m8L24M23m16n71M41l0l25O21o57PK13j83N6L7m07M45k18P75j49N1l19
3296i3q4P7M64r21N37l4l70O78m52O78m96J56n7k29M33m54M85m76M57o18K10P84
3318F75Q1j326J059m92L35m8j04K07o8p49K79R00n76j36M3P8m24L42L74l57l36
3339b43K05j41N69j81j64Q5n83N27l18M54m18L41q1J53l30M39n32K3K21j01j8
3360i3j34K74R4L4l79J30K99j78P4p3r3P1K2k1q2R8K5j25k28M17l17M60j16j64
$$ plain form
3384 -5 69 5 -328 -15 199 23 -53 165 -95 132 98 -171 106 -66 57 134 -104 150 -36 -96 -202 -62 -158
3407 -158 87 -8 -148 -27 -144 -41 171 -81 -30 -349 25 -39 -162 70 2 343 139 213 58 54 -61 224
3429 224 -86 -109 93 -151 -131 45 119 8 146 -209 143 -188 -81 -44 58 -80 -83 -54 -43 283 -87 87 -78
3452 -78 -19 -182 -196 14 96 67 23 -79 5 91 26 -30 -123 -186 80 -123 127 -87 -85 -185 47 -74 81 -1 -221
3477 -221 70 302 30 60 -92 117 384 -92 116 -21 69 -52 65 -332 145 6 126 -43 -108 62 44
3498 44 145 101 -34 100 -6 9 -64 -53 -165 63 135 -28 -222 -152 203 -153 -18 48 4 -111 13 44 -53 5
3522 5 108 61 211 -34 123 -52 -50 -6 -9 -101 -32 30 115 -24 -192 -205 -9 142 6 200 -22 -52 -8 217 95
3547 95 197 -23 -22 -78 -184 -104 107 -77 40 68 14 -147 32 -198 -64 64 -23 -24 -181 78 -29 -21 -57 32 -138
$$ packed form
3384eP4o4l33L13K14j76p6K18k60K27l4k69K77j72J23P7k38K54j86o0j06J40r6
3407a58K45r5j40J21j17J03K12k52N1l19L74o4j23K32o8L41k04P4j55mj15K85
3429B24l10k3K02k44K0J76P4j11J38l55L52l31J07L7J02j38lK9J1L26l70J74j65
3452g8N9j63j4K10Q2k9m4j02Q4Q6o5n6r3o3K66k03K50k14Kj00K32j21J55q2k20
3477b21K91K32k72L0j52K09K67m76K08j37R0j21J17l97M77j39J20j69o5J70j8
3498D4J01m4j35J34j06J5p3J1j12K28P2j63j94P0L55l56J35O6m4j15J24L1r7N8
3522EJ03m7J50k45J57j75KM4lr2O9O2Q5j39j68j3J96J51j36J94k22l0M4K25j22
3547I5J02k20Jn6j06Q0K11j84J17K8n4j61J79k30J34J28q7jj57K59j07Ql6Q9j70
$$ plain form
3572 -138 47 -59 -189 237 -295 233 72 12 15 55 -96 -13 -97 82 -16 -278 112 153 1 125 -233 -6 -109
3595 -109 -58 -96 -167 53 -126 76 -256 175 -59 -90 98 -119 -152 -23 32 -272 103 -165 -123 6 80 9 -93
3618 -93 35 264 121 -2 -215 29 94 -221 -131 -81 105 -111 -122 -81 225 105 227 -182 9 137 54 18 -28
3641 -28 -219 -143 -170 -110 121 -11 82 9 -62 12 -121 41 125 325 157 59 -577 439 170 359 5 715 -68
3664 -68 445 -225 -168 -35 711 -571 -634 232 -117 -614 -66 -343 334 282 -101 6 -275 84 -513 114 223
3685 223 109 390 4 -23 317 382 -586 -486 30 153 514 7 302 116 33 46 -65 64 -197 -17 18 167
3707 167 9 -52 -207 -238 159 -237 -282 70 68 -180 12 -4 -62 215 -35 -62 67 -76 162 -69 99 -147 -134
3730 -134 25 -33 112 -93 -225 -106 152 -38 121 -395 -39 -16 -118 259 -54 -23 196 108 181 144 -215 150
$$ packed form
3572a38J85j06j30M26n32N28j61o0LM0j51Q3q4J79r8k62L90M1j52J24l58K27j03
3595a09N1l8p1K20j79K02l32M31k34l1J88k17l3J29N5l04L75k68M2J29P4p1j02
3618i3J28K29j43j23k13K44O5l15R0N0J86k16j1M1L06j20J22m09J91J28q3l6m6
3641b8j91P6k7O0K31j32R3p3p1P4j33J62Q4K00j68r8o36J016k69J89l54P10p83
3664f8N13o70N7J33P46j282o3Q66l49m97N48k77O77n2l83J07k81L59n97O27J09
3685B23j14K81l86k7L40O5r68J00N16J23L61n07K95j86q3J3j11J29k61J80L5J49
3707A67j58o1j55l1L97l96m5L52kk48J92j6n8K77k50k7J29j43K38k31J68k46J3
3730a34J59n8J45k05j32J19K58j90J59n16L56K3j02L77l13L1K19q8P3l7l59L65
$$ plain form
3752 150 33 173 -56 64 213 193 48 -106 -91 118 -1 130 -170 -47 245 -226 85 -215 110 5 134
3773 134 -205 149 -175 -122 100 -118 125 -128 41 65 397 163 97 114 -174 41 -148 90 13 -155 60 46
3795 46 -206 80 9 -130 -23 -101 -292 -96 -10 -65 152 129 -69 92 227 -232 52 -155 38 150 96 -185
3817 -185 31 -104 96 -63 136 -13 -166 -172 -74 58 54 58 -82 -82 -257 275 139 -227 -163 -81 64 28 15 118
3841 118 90 -95 -125 141 68 -132 -67 -175 -120 -183 -38 329 -134 -83 69 -140 198 210 -145 157 -169 112 100
3864 100 -149 159 6 -30 -51 101 -226 -103 -38 -219 10 184 309 27 -93 166 147 105 105 -334 80 58 37
3887 37 -48 -258 216 -140 -14 58 -129 0 30 -112 39 -251 -228 -235 247 -130 211 -307 89 27 -53 100 83
3910 83 -58 -35 -52 -7 127 -33 -67 223 -207 -11 112 -103 -60 179 -5 133 -35 -214 45 -34 63 23 -154
$$ packed form
3752A50j17J40k29J20J49k0j45j54J5K09j19J31l00J23K92m71L11l00L25j05J29
3773A34l39L54l24N3K22k18K43k53J69K4L32k34o6J7k88K15j89K38p7j68K15j4
3795D6k52K86p1j39J07p8j91J96Q6n5K17k3j98J61J35m59K84k07J93J12n4k81
3817a85K16j35K00j59J99j49j53oR8J32mMj40%j75N32j36l66O4Q2J45l6j3J03
3841A18k8j85l0K66p3k00O5j08N5o3J45L67m63N1J52k09L38J2l55L02l26K81j2
3864A00k49L08j53l6k1J52l27J23O5j81K29J74J25k82j20K59j9m2%m39M14k2k1
3887C7q5k10M74l56J26P2j87J29L0j42J51k90K3pM82l77L41n18L96o2q0J53j7
3910H3j41K3j7M5J34j60l4K90m30J96J23k15M3K39j84J38j68j79K59p9R7m0j77
$$ plain form
3933 -154 39 -136 -117 -65 -235 -128 63 68 -38 328 -125 153 87 120 -144 -211 -54 38 16 -144 37 -100 102
3956 102 -93 -104 34 -8 -66 173 -35 -118 141 107 -61 106 -55 99 163 -155 -55 239 16 -9 114 -237
3978 -237 24 118 -7 54 69 160 113 66 -75 141 -161 -59 76 -39 144 -44 -105 -85 -234 156 82 140 -107
4001 -107 217 -142 4 -159 36 -41 281 -39 -21 93 116 60 -166 191 13 -86 -69 -35 97 -174 -21 116
4023 116 61 106 -61 73 -38 84 92 -144 -109 1 113 110 240 -63 11 -19 -153 26 173 2 148 -22 72
4046 72 -12 105 72 -124 134 122 297 6 27 -192 -30 -120 -171 -41 151 -196 -88 60 17 -224 -267 -48 171
4069 171 45 -169 -78 -186 -188 78 -63 -56 67 -124 -38 -18 -124 -36 -190 -67 206 -54 130 46 -5 13 26 -111
4093 -111 23 95 96 -69 -66 67 208 -71 26 21 9 1 -117 1 14 136 -75 150 102 116 378 118 31 -48 -90 -14
$$ packed form
3933a54J93j75J9N2j70J07J91Nj06L66m53K78o6L3k64o7J57R2k2j60J81j37K02
3956A02j95j1J38m2n8K39k08q3K59l4j68J67j61J54O4l18J00K94k23k5J23l51
3978b37K61R4j25O1J5R1m7m7j41K16l02J02J35j15J83j88o1K0j49L90p4N8k47
4001a07L24l59J46j63J95p7L22l20J8J14K3n6k26L57j78r9J7L4J32k71J53J37
4023A16n5M5j67J34j11J22Qk36L5J10J12lJ30l03P4l0j34J79J47j71J46j70R4
4046G2q4J17l3j96K58j2J75k91K1k19J62r0n1J30J92l47J08J48m3k41m3K19K19
4069A71j26k14R1j08kK66j41PJ23j91Q6K0j06Q8j54J23K73k60J84q4n1J8J3j37
4093a11J34P2Jj65LJ33J41k79R7nj2qj18J18J3J22k11K25m8J4K62k60q7p9m2P6
$$ plain form
4119 -14 65 -265 -21 86 -224 -45 -53 11 -36 -56 93 -25 82 82 32 -79 273 -50 27 -105 267 153 -180 -152
4143 -152 -183 138 -93 448 66 42 -15 89 -3 15 74 -14 226 71 60 31 157 -31 42 58 87 -51 -121 224
4167 224 -120 -245 -86 149 111 -104 -283 73 187 -429 -85 -151 -135 -8 57 -16 -57 -102 259 20 -234 17
4189 17 -295 475 -373 -752 -645 -70 -217 452 588 522 -568 -572 87 -11 -714 15 224 -605 -10 46 -78 251
4211 251 214 -150 86 327 -122 41 349 -488 241 -36 -76 15 -85 130 18 -69 318 591 -156 403 -234
4232 -234 244 -9 172 -795 -267 -320 -455 -260 15 3 77 -300 -207 363 -71 -81 -182 -88 183 -43 128 -283
4254 -283 -144 -149 68 -83 79 -112 -149 363 -202 -66 -28 -151 292 235 319 111 -372 57 -381 -305 -210 -617 -423
4277 -423 -191 409 -52 -250 95 70 -314 -88 239 -562 236 9 -78 -132 -122 -42 184 -354 183 -363 -324 29
$$ packed form
4119a4P9l30K44J07l10J79qO4m7k0J49j18J07%n0j11L52l23P7j32L72j14l33K8
4143a52l1L21k31N41l82k4n7J04r2J8N9q8K40j55j1k9J26j88P3J6K9j38p0L45
4167B24l44j25J59K35l8k15j79L56J14o16L44o6J6J27O5p3m1m5L61k39k54K51
4189A7l12P70q48l79J07N75j47O69J36o6j090mO59r8p03P29K09q29N95N6j24L29
4211B51l7l64K36K41m49J63L08q37P29k77m0R1j00K15j12q7L87K73p47N59o37
4232b34M78k53J81r67N28n3j35J95K75j2P4l77R3N70m34j0j01R4K71k26J71m11
4254b83J39nK17j51J62j91l7N12n65J36L8j23M43n7Q4k08m83M29m38P6R5m07J94
4277d23K32O00m61j98L45k5l84K26L27q01P98k27q7n4J0Q0K26n38N37n46L9L53
$$ plain form
4299 29 241 -19 240 138 53 -71 -25 114 -17 155 29 -13 209 140 17 65 242 -168 223 -71 37 92
4321 92 -185 102 32 63 -29 124 175 -144 -153 89 -151 -167 -187 -7 99 96 -5 -38 -83 -70 116 -192 78 89 184
4346 184 -102 -14 16 153 102 -29 105 -153 -70 -45 -255 -167 -156 -67 -5 -24 -10 44 0 80 64 250 116 -244 115
4371 115 104 43 146 122 11 -225 143 -111 30 -107 -18 -187 -35 -146 8 72 117 71 167 64 -44 -51 -34 -129
4395 -129 179 -124 -115 19 -130 26 -112 103 -126 -90 104 177 212 -96 102 -96 193 89 -109 101 -38 59
4417 59 47 -187 -53 -23 37 42 73 201 207 54 -188 52 -193 47 -259 101 -201 -177 180 71 -93 162 -177
4440 -177 59 169 -83 2 -15 -126 -31 -7 -8 -59 -117 -191 -26 -33 10 -2 98 -68 17 76 -120 48 33 42 95 -25
4466 -25 53 93 61 109 -113 -29 29 32 -99 231 215 157 -175 -128 -74 -23 21 111 -10 128 -147 46 -276 87 -83
$$ packed form
4299B9K12k60K59j02q5j24M6J39j31J72j26m2K22o9j23M8J77m10L91k94J08N5
4321I2k77K87p0L1r2J53N1l19rK42k40j6k0J80J06lj01l3m5J3J86l08K70J1R5
4346A84k86Q8L0J37n1j31J34k58Q3K5k10Q8J1Q9O2j9J4N4m4Q0j6J86j34l60L59
4371A15j1o1J03k4j11k36L68k54J41j37Q9j69J52j11J54O4M5m6R6j03j08pJ7r5
4395a29L08l03RJ34j49J56j38K15k29L6J94P3L5l08J98j98K89j04j98K10j39R7
4417E9j2k34J34L0O0NL1J28Oj53k42K40k45K40l06L60l02K4L57j09j64K55l39
4440a77K36J10k52Q5j7j11R5K4jn1n8p4J65pM3j2J00j66Q5N9j96J68j5RN3j20
4466b5P8M0l2M8k22Q4N8Lj31L30j6n8l32M7N4N1M4R0j21J38k75J93l22L63j70
$$ plain form
4491 -83 267 173 -111 -3 84 84 83 105 -154 -60 -210 173 -92 322 -116 4 -257 -13 -7 158 -41 63 85 -68
4515 -68 151 -85 -190 -40 -147 18 198 119 84 -189 -185 -120 -39 -9 3 132 88 34 -21 -60 -174 -186 58 -22 11
4540 11 -23 3 -60 -95 23 -53 145 309 206 -198 114 88 174 -162 -173 -33 162 108 -161 56 95 -62 -49 -44 -141
4565 -141 -153 222 179 -139 -42 83 -218 96 -162 -62 29 -240 -55 0 76 207 -20 58 7 -33 -18 28 -114 237
4589 237 168 70 108 81 109 -35 -184 -121 127 94 64 -174 56 159 -113 -85 104 -7 190 226 -20 -6 -71 -89
4613 -89 -86 -182 -72 -102 31 -105 -34 -15 271 121 -114 -151 154 -19 -1 53 -140 -134 -199 -89 179 130 233 -57 -41
4638 -41 141 -20 -38 28 79 -159 0 -19 -137 109 -37 71 52 -276 12 44 -67 -48 34 -175 -47 84 -274
4661 -274 26 -98 230 90 139 23 -63 27 -200 68 91 -205 45 185 151 -104 147 -183 174 -13 -115 118
$$ packed form
4491h3L50r4k84J08Q7%jK2k59R4j50L83k65M14m38J20k61K44OJ65j99J04K2j53
4515f8K19k36j05J50j07J65J80p9l5k73MO5Q1L0J2J29m4n4n5l9j14j2K44q0L3
4540A1l4K6o3l5J18p6J98J64j03m04L12k6Q6l36j1J40J95n4k69K17L9j57J3Nr7
4565a41j2L75m3l18R7J25l01L14k58J00R1k69J85N5P6J31k27P8n1m0J5M6j42L51
4589B37o9r8L8k7K8j44j49O3K48l3l0k38K30J03k72K8J89j11J97L6k46J4o5j8
4613h9Lr6J10l0J33j36P1J9K86j50k35l7L05j73J8N4j93Oo5J10K68m9J03k90J6
4638d1J82j61j8O6N1k38J59j9j18K46j46J08j9l28K88L2j11J9Q2k09J28J31l58
4661b74L00j24L28j40M9j16q6R0k27K68K3k96K50J40l4k55K51l30L57j87j02K33
$$ plain form
4683 118 142 141 -18 55 37 -6 89 -266 3 -52 -82 -50 15 119 -199 -164 -110 -150 223 -119 -113 277 -61 44 219
4708 219 -84 -49 33 -49 39 -297 -58 -168 -325 -25 -3 54 73 -16 -162 97 287 44 -102 -59 167 -14 70
4731 70 99 -217 -273 -56 -87 41 100 0 -169 21 -18 -69 143 77 76 53 5 -74 -8 28 -108 -16 -71 79 -215 91
4757 91 146 -196 -76 42 -163 72 -5 165 113 14 86 -120 98 -3 135 -129 87 -69 -130 -124 -15 81 -62
4780 -62 -72 46 49 -55 -114 231 120 -7 3 -114 6 -17 -155 -63 69 107 98 -143 -93 -143 90 -185 38 62 183
4805 183 153 7 14 248 7 -56 19 -51 42 193 176 111 -133 -212 129 50 94 -44 13 -272 -161 94 -43 77
4829 77 -157 86 69 -75 -165 60 -183 -25 -118 -156 213 3 -92 264 0 110 199 -186 -19 40 161 -38 125
4852 125 18 -13 32 187 -14 95 -8 -160 24 84 -65 36 41 -193 -83 91 -25 -124 39 112 109 116 48 39 -203
$$ packed form
4683A18K4jj59P3j8m3R5l55K69n5l0L2O5J04l18L5N4m0L73l42OL90l38J05J75
4708B19l03L5Q2q2Q8l36K39j10j57L00K2N7J9q9j46K59J90k43j46M3K26j81Q4
4731G0K9l16n6K17l1J28N9j00j69J90l9n1K12o6jk3m8p9O6L6j36R2n5J50k94L06
4757I1N5l42J20J18k05K35p7J70n2r9P2k06K18j01J38k64K16j56o1OJ09R6j43
4780f2j0J18Lj04n9L45j11j27J0j17J20k3j38R2J32L8rk41N0n0K33k75K23K4J21
4805A83l0j46PK34k41o3P5p0R3J51j7o5k44p9L41p9M4j38N7k85J11K55j37J20
4829G7k34K43j7j44r0K25k43J58r3l8L69k10r5L56k64J10Q9l85J67N9J21j99J63
4852A25j07l1M5J55k01J09j03j52J84O0j49J01Nk34J10J74j16r9J63P3lPo8rk42
$$ plain form
4877 -203 -169 47 74 -136 25 -81 62 -42 107 211 -206 -14 155 6 85 168 111 259 176 108 -78 -220
4899 -220 -7 -60 60 25 278 35 13 33 -73 97 76 -235 228 -85 -32 -154 130 -107 12 71 -217 104
4921 104 -76 15 -31 131 -96 102 18 -57 -1 -231 -235 -35 132 8 -46 147 113 -31 -167 64 166 95 76 186
4945 186 -14 -18 28 121 -56 -58 34 -168 -120 89 95 93 8 -103 17 106 142 -19 -14 -37 -89 6 -154 154 19 -207 179
4972 179 -86 48 71 -32 193 20 155 56 -197 -136 -12 70 -1 385 43 -112 117 84 23 -176 86 -51
4994 -51 335 113 -34 -129 -195 100 21 143 -157 30 -58 -44 -49 -182 -164 -179 -31 69 -22 26 -147 251 206 46
5018 46 52 71 -165 48 19 -78 225 -246 112 31 -66 2 -40 -66 153 318 -26 114 -36 55 58 -82 -11 203 35
5043 35 -25 47 -3 -88 -134 -65 35 48 -67 0 99 -142 -48 -268 -62 36 -11 127 13 -39 -164 -83 -35 38 -172 -118
$$ packed form
4877b03L4K16K7k10J61j06J43j04J49J04m17J92J69j49P9Q3n7J48q3o8j86j42
4899b20K13n3J20l5K53k43k2K0j06J70k1l11M63l13N3j22K84k37J19N9k88L21
4921A04j80R1m6J62k27J98q4p5N6k30mK00J67j24n4J93l4j44j36K31J02p1j9J10
4945A86k00mM6R3j77kR2k02M8K09Okq5j11J20Q9L6j61Nk3n2R5j60L08j35k26L86
4972A79k65J34K3j03K25j73J35r9k53O1J24Q2p1L86l42j55K29l3o1j99K62j37
4994e1L86k22j47r5o6K95p9J22l00J87q8J4nj33J8j5J48J00r1M8j73L98m5j60
5018D6OJ9k36K13k9r7L03m71L58q1r7O8m2k6K19J65l44J40j50R1Lj40P1K14j68
5043C5o0P2n0q5m6O9J00J3j15O7R9k41R4k20K06R8m7J38j14n2j25Q1M8P3k10N4
$$ plain form
5069 -118 -131 33 -97 44 -107 -100 93 199 -103 -98 -27 80 -23 40 67 17 -45 -95 140 -91 58 44 117 -23
5093 -23 -128 107 -104 -292 206 -126 -34 114 -176 128 138 48 85 -192 -189 7 -138 56 73 -196 13 9 -81 104
5117 104 -99 -232 98 -130 -80 -41 11 54 -45 -146 177 -19 105 -36 200 88 -77 57 111 12 -106 53
5139 53 67 -215 -124 -83 -30 17 -187 5 -89 -150 -37 133 102 -20 115 88 11 119 -111 28 244 -122 98 162
5163 162 -139 32 202 -71 165 -12 -43 -23 75 -96 183 77 129 -21 38 71 47 -332 -178 73 -40 -200
5185 -200 68 -23 -61 -106 -34 221 -113 -102 94 -70 -226 -183 -173 31 89 -252 60 -81 90 38 -22 -281 -107
5208 -107 -75 366 -216 64 35 -5 -18 139 -32 8 -79 -8 28 23 -59 -7 48 -166 2 92 107 72 78 -84 171 -291
5234 -291 -38 -112 -174 -211 -96 117 -91 -23 82 151 136 102 19 -61 -149 -185 -200 -93 84 -65 21 48 -2 292 -354
$$ packed form
5069a18j3J64j30J41j51PJ93J06l02NP1J07j03O3K7n0o2n0K35k31J49j4P3j40
5093b3j05K35k11j88M98l32R2J48k90L04J0r0L7k77LJ96j45J94J7k69K09mr0J85
5117A04k03j33L30k28N0L9N2M3r9j01L23j96J24j41K36j12j65J34N4r9j18J59
5139E3J4k82R1M1N3M7k04J92r4o1J13J70l1j22J35k7p7J08k30J39K16l66K20O4
5163A62l01J71J70k73K36j77l1K0R8j71K79j06N2j50N9L3k4l79J54K51j13j60
5185b00K68r1l8m5P2K55l34J1J96j64j56M3J0K04N8l41L12j41J71n2o0k59J74
5208a07L2M41n82K80k9m0j3J57j71M0q7P1L6nq2N2N5k14J68R0J5l5Oj62K55m62
5234b91K53p4o2l7J15K13k08O8J05O9j5l4q3q0q8l6j5J07J77j49Q6K7n0K94o46
$$ plain form
5259 -354 -92 38 186 76 424 -173 -125 157 -225 262 -86 59 41 180 -202 -91 -41 130 305 -224 22
5280 22 120 -95 143 -144 -43 -115 -7 -229 121 -146 -43 269 -143 15 -38 -130 62 51 -76 118 -203 -142
5302 -142 7 -164 -74 -1 -17 -66 -97 41 127 -257 -62 1 -123 84 110 16 64 -50 11 90 -175 180 0 82
5326 82 -105 -24 -142 148 -104 49 70 121 -79 -34 130 -183 61 -202 -191 -75 33 -240 19 94 -66 -282
5348 -282 -279 -72 77 164 62 -30 -179 -32 83 -157 8 -3 -23 -172 -233 135 38 39 8 134 -49 132 77 171
5372 171 24 44 58 162 53 -1 186 9 -78 -65 104 -104 144 138 36 22 73 165 -21 -98 -203 -97 -81 -63
5396 -63 -31 137 44 36 8 -34 119 80 217 -45 -170 144 123 21 48 -81 -59 92 23 -98 -154 138 62 -120 9
5421 9 -125 113 -35 -8 85 18 136 -71 25 -72 52 -20 148 -131 -88 217 83 -47 138 54 31 151 36 -82
$$ packed form
5259c54K62J30J48j10L48n97M8K82l82M87l48J45j8J39l82J11N0J71J75n29K46
5280B2R8k15K38k87J01p2J08k22L50k67J03L12m12J58n3r2J92j1j27J94l21O1
5302a42J49j71R0P3j6m9l1J38Q6l84J95O3j24K07K6r4M8j14O1P9k65L55j80Q2
5326H2j87Q1j18K90k52J53K1N1k00M5J64l13K44k63J1J16J08k73K59P5j60k16
5348b82LK07J49Q7j02r2j49J47J15k40J65j1k0j49o1L68r7Jl1J26j83J81n5R4
5372A71j47K0J4J04j09n4J87j77q7J3J69k08K48oj02j4N1R2j86p7j05J06J6J8
5396f3L2J68r3qk8m2J53l9J37k62j25L14k1j02K7j29K2J51o9j21n6K92p6j82J29
5421Ij34K38j48K7R3o7J18k07R6r7J24p2J68k79M3L05j34j30J85q4k3J20j15j18
$$ plain form
5445 -82 -115 58 94 30 -18 35 86 145 -94 -267 45 6 -334 96 -125 57 -269 -61 -108 -285 -162 -126 -81 169
5469 169 59 -188 -129 88 225 -99 -18 -165 -140 -88 147 8 80 -62 140 -369 260 285 -184 -250 82 -156
5491 -156 181 -122 -221 192 -83 84 -27 -189 -162 -71 45 -800 -477 -140 118 -198 -374 326 -467 0 -156
5512 -156 524 -206 -86 196 166 -460 -143 161 -243 539 291 -348 92 -110 -561 348 131 12 427 231
5532 231 -102 79 207 -54 245 -29 72 43 152 -57 -178 -156 -124 37 -141 -61 150 21 -200 18 2 -213
5554 -213 -72 -89 -103 -173 -136 -144 -187 -145 36 -121 3 136 -47 178 125 -57 -133 9 -228 340 31 -14 87 207
5578 207 240 -154 -226 -93 75 128 -96 -99 -7 -3 230 93 -223 -111 177 -210 -97 -106 -46 -68 269 -62 189 81
5602 81 -23 139 8 -8 32 -80 -250 -23 -148 143 -57 173 -73 11 -59 -110 -58 115 -47 -358 -80 -116 168
$$ packed form
5445h2l3J73L6o4m8N3N1N9k39j73L12l9l40M30k21J82l26K08m7j77J23L6M5K50
5469A69j10k47N9K17J37l24Q1j47K5N2K35j39P2j42K02n09O29K5m69o6L32k38
5491a56L37l03r9M13k75J67j11j62K7R1J16q45L23L37K58l16j76P00p93M67j56
5512a56O80p30J20K82l0o26L17L04m04P82k48o39M40k02m51R09k17j19M15j96
5532B31l33J81J28k61K99k74J01k9J09k09j21K2L2J61j78Q0K11j29k21K18j6k15
5554b13J41j7j4p0L7qm3M2J81j57J24J33j83K25n3j82p6J42k37N68l09m5J01J20
5578B07L3l94p2J33J68N3k24lR2MK33j37l16J12K88l87J13rO0k2L37l31K51j08
5602H1j04J62j31j6M0j12j70K27j25K91k00K30k46Q4p0n1N2J73j62l11K78l6K84
$$ plain form
5625 168 141 -228 18 26 233 -50 -67 -83 -31 -88 113 177 48 -13 187 79 26 -144 -58 -12 203 -82 146 224
5649 224 -204 198 57 -125 55 -176 48 16 -214 82 143 28 -118 280 37 102 56 143 -81 63 -65 225
5671 225 -77 30 -25 -82 -97 64 107 26 208 -57 230 -121 110 237 1 -52 -193 -119 -253 -16 -61 10 63
5694 63 -241 25 189 49 -156 -202 -31 187 17 9 -222 212 -27 -109 126 -34 22 65 -1 48 23 29 50 -93
5718 -93 -6 2 -191 114 138 -188 -149 -116 96 -155 61 23 -17 -13 34 -126 96 -39 42 -38 148 56 105 199 -41 89
5744 89 97 -65 -79 -258 -30 128 16 233 -146 29 -24 -172 -194 62 -18 -16 42 -107 41 -90 118 -40 110
5767 110 79 -129 -60 79 -7 41 -128 38 153 -28 -9 232 -127 2 -117 -84 135 -220 -147 79 10 131 145
5790 145 -417 -37 123 -44 32 1 135 173 78 9 117 -125 -88 144 54 175 -4 -306 169 23 6 40 187
$$ packed form
5625A68k7l69K46QK07k83j7j6N2n7K01O4j29o1K00j08n3j70Q6M6K15k85K28P8
5649B24m28M02j41j82J80k31K24l2k30K96O1j15j46L98k43O5m6Q7k24J44j28K90
5671B25l02J07n5n7j5J61M3q1J82k65K87l51K31J27k36n3j41P4j34K37m5P1N3
5694F3l04K66J64j40k05m6J71K18j70qk31M34k39q2K35j60N6M3o6M9k5OK1j43
5718i3Q7Qj93L05K4l26L9L3K12k51K16l8m0MM7j60K22j35Q1q0J86r2M9R4k40J30
5744H9Qj62j4j79K28J58j12K17l79J75n3j48k2K56q0KN8j49J48j31K08j58J50
5767A10l1k08O9J39q6M8j69J66J15j81J9K41l59J29j19L3K19l55P3K26o9J21J4
5790A45n62L80J60j67P6l1J34L8r5o9J08k42L7K32r0J21j79l02M75j46j7L4J47
$$ plain form
5813 187 -104 110 -108 -103 3 -18 -174 120 -56 35 98 13 -251 -30 83 242 17 62 -29 4 17 -164 17
5836 17 26 -95 37 -55 -162 231 61 -32 49 -23 -41 103 -230 63 -269 76 -158 113 79 117 114 -173 18 -100
5860 -100 -100 2 96 34 -10 80 -2 168 72 169 -10 6 -171 112 -170 -145 110 -57 78 122 131 -187 59 -248 -16
5885 -16 125 133 -203 -24 272 107 -151 -99 -11 -202 -294 300 34 26 206 -164 -192 -127 6 -210 -109 35 65 140
5909 140 -123 -75 186 -110 59 -19 -214 -114 11 289 138 64 -38 259 -59 -82 -139 79 182 -70 22 19 171
5932 171 50 -146 -278 240 -55 -126 52 122 -172 86 -16 103 -194 -74 174 53 -32 -4 234 -33 298
5953 298 110 137 66 -53 190 -42 -56 17 134 173 202 -161 37 -152 144 35 40 -24 207 31 -222 -210 -145 203
5977 203 54 -48 -133 -34 214 61 -95 -114 121 64 40 -92 -221 56 -31 -87 -59 207 179 -65 123 79 75 7
$$ packed form
5813A87k91K14k18NJ06k1j56K94j76R1O3q5k64K21J13J59k25M5r1L3J3j81J81
5836A7Rj21J32r2j07L93j70r3Q1p2j8J44l33K93l32L45k34K71l4L8lk87J91j18
5860a00%J02R4o2m4R0q2J70r6R7j79J6j77K83k82K5K55j67J35M4Rl18K46l07K32
5885a6J41Ql36J79K96j65k58N2Q8j91r2N94k66qJ80l70k8O5J33k16J01J44L0P5
5909A40k63M8K61k96J69p8j95J00J25K78j51p4j02K97l18k3n7K18J03k52R2lJ52
5932A71j21j96j32N18k95p1J78P0k94K58j02J19k97J20K48j21q5K8K38k67L31
5953B98j88K7p1j19K43k32j4P3J17L9K9l63J98j89K96j09No4K31j76k53J2O5L48
5977B03j49j02q5R9K48j53j56j9K35n7k4j32j29K77q7n6K8K66k8k44J88m4mo8
$$ plain form
6001 7 -42 -172 204 53 -96 -168 95 99 -182 -56 8 127 -63 -29 -199 -160 -39 -30 -192 -56 49 6 -92 -57 106
6026 106 -9 -49 -64 350 7 -129 25 -119 -177 83 241 118 -171 -135 12 -43 -250 -78 187 248 146 77
6048 77 -203 81 -229 10 -109 13 -123 -15 106 61 378 111 11 121 105 5 123 6 124 -93 -163
6069 -163 -206 167 -107 -26 157 72 -209 -107 -185 202 -153 84 -181 -20 -88 111 -131 -209 125 72 -70 57
6091 57 114 265 -28 -122 51 46 202 184 -34 -161 234 -74 7 -88 -132 -141 -221 193 -63 42 -161 -138 228 -15
6115 -15 278 -99 155 -127 -41 157 131 -116 36 1 -86 43 -26 -107 -16 61 62 179 -21 156 -14 -117 161 -148
6139 -148 101 65 -247 88 -114 -3 -28 197 159 70 22 -162 -152 34 28 -91 -59 20 95 144 -233 168 -82 69
6163 69 -211 91 96 -11 -27 173 -27 -187 312 43 76 118 -8 100 49 21 -182 -89 152 18 216 -4 65
$$ packed form
6001Gm9j30L76j51j49p2K63Mk81J26O4J19j90L4j70L9J21Rj62J36J05m3r8L5J63
6026A06j15m0j5M14l43j36J54j44n8K60J58j23k89L6J47n5k07J72K65O1j02o9
6048G7k80K84l10K39j19J22j36J08J21m5L17k67j00J10j6j00J18j17J18k17p0
6069a63m3L73k74Q1J83q5k81J02p8L87l55K37k65J61o8J99k42p8L34n3j42J27
6091E7N7J51k93r4J73nJ56j8k18j27L95l08Q1r5m4rq0M14k56J05k03K3L66k43
6115a5K93l77K54k82Q6J98k6k47J52l5q7J29o9q1R1P7JJ17k00J77j70j03K78l09
6139a48K49l6l12L35k02J11k5K25l8q9m8j84J0J86oj19L2P9P5M9l77M01k50J51
6163F9k80L02Nj07j6K00k00j60M99k69L3M2j26J08n1k8k03R3K41j34J98k20O9
$$ plain form
6186 65 -170 68 -65 -91 -51 -98 -70 -62 89 157 89 11 90 -58 -168 -248 13 201 25 -60 65 85 118 99 384
6211 384 1 25 -119 30 -28 -22 -159 -154 140 249 -49 47 221 69 241 63 129 23 63 -161 203 -87 183
6234 183 45 32 -48 -168 -106 42 -6 51 -106 -146 -47 31 14 -3 -162 222 161 -89 -73 -202 -59 -26 136 103 16
6259 16 3 223 63 -86 -191 11 62 -56 -118 18 246 9 177 30 167 50 -123 319 103 -207 -34
6280 -34 29 136 109 6 167 -35 80 54 65 -202 339 -252 -115 -18 -56 83 -154 -50 -167 -209 118 57 -7
6303 -7 13 -116 144 4 -247 -45 -83 111 -138 -222 -12 -178 100 -48 -110 -64 -7 -102 -38 36 93 138 84 -41 -26
6328 -26 -44 -49 -24 55 16 44 124 -142 142 94 60 -54 58 11 -113 -92 110 -23 246 31 -299 -69 28 -19 -139
6353 -139 -133 2 183 12 -106 -340 122 117 87 139 89 47 -32 49 156 51 -10 82 -276 54 -34 24 235 -372 -112
$$ packed form
6186F5k35K38j33k6M0m7K8QJ51O8o8p8P9j48j10q0K61J88j76q5J25K0L3j9K85
6211C84l83K4j44J49n8Oj37NK94J09k98R6J74j52J72j78O6j06M0k24L64k90K70
6234A83j38j3q0j20O2J48m8N7j57m0R9P8j7j7j59L84o1k50J6j29J43L3J62l3q7
6259A6j3K20j60j49j05K02N1j18o2J36K28k37J68j47J37j17j73M42k16l10J73
6280c4O3J07k7j03J61k02J15k6J1k67N41n91J37R7l8J39k37J04j17m2L27o1o4
6303gK0j29K60j40k51K02l8J94k49q4K10j66K78j48o2M6N7r5O4P4N7M5n4j25J5
6328b6j8nK5P9l9K8Q0k66K84m8l4j14J12m7j24K1K02j33K69k15l30K30R7m7j20
6353a39OJ35J81j71j18k34M62nl0N2n0m2p9Q1J07j05o1R2l58L30q8N8K11o07K60
$$ plain form
6378 -112 44 41 -104 -44 -121 -246 244 -110 -59 32 60 68 -132 103 -59 -18 292 54 -109 -109 -170 -122 -79 -201 44
6403 44 24 -174 -63 -37 -77 -10 38 -274 141 12 -2 227 -13 -239 29 -301 97 28 71 -163 -5 73 -9 55
6427 55 65 121 -23 -136 -93 -126 -156 11 -33 -36 116 3 -181 -63 68 -62 -81 23 31 -277 39 -114 -40 -54 1
6452 1 87 130 -200 -147 -42 147 115 -130 192 35 8 -59 -11 -21 75 53 159 -236 124 -109 -122 71 -196 -133 120
6477 120 307 1 13 218 62 -116 69 -49 -134 -92 -30 -47 82 -142 -29 -34 118 -107 -91 35 7 74 189
6500 189 30 -14 239 -155 -142 -55 186 63 99 -71 -22 -219 29 -130 -81 51 260 202 -339 -175 13 -49 260
6523 260 -151 36 110 36 -141 222 79 -161 52 158 11 19 70 -87 -85 10 -70 100 -24 -207 13 158 -13
6546 -13 7 118 -41 330 28 -117 21 -121 -183 -134 -65 153 -102 112 -109 -95 121 -225 259 188 -68 -304
$$ packed form
6378a12J56lj45O0p7j25M90l54N1R1K8Qk00K35j62M1L10k38j63%o1M8M3j22K45
6403D4k0j98J11K6m0O7M8l12M15j29j4K29k40k26K68l30L98o9M3k34J58P8q2O4
6427E5J0N6j44j13M3l3l0J67m4lJ52j13j84J18J31j30j9J04Ql08L16j53P4j4N5
6452AQ6M3l30N3J05J89l2k45L22j57k7o7M8j0R6k2J06l95L60k33j3J93k67O3K53
6477A20J87l06J2K05j56j78J85j18q5M2O2j7J29k24J13nJ52k25J6J26k8O7J15
6500A89j59m4K53l94J3Q7K41j23L6j70M9j97K48j59M9J32K09n8n41J64J88o2L09
6523B60m11J87P4p4j77L63j43k40K13J06j47QN1j57KR5q0J70j24j83K20J45j71
6546a3K0J11j59L71l02j45J38j42o2M9O9K18k55K14k21J4K16l46M84p1k56k36
$$ plain form
6568 -304 -106 54 115 -98 136 5 -212 80 123 -124 -190 -173 32 67 52 -82 30 -31 26 70 -19 -178 -108 -338
6592 -338 167 -162 -119 -42 -78 -138 -20 134 117 109 -102 108 -16 6 9 135 -381 -88 269 100 38 -112 -66 -260
6616 -260 21 33 81 -25 -86 119 33 168 -28 -107 -41 -19 70 -15 85 6 -81 71 -70 0 -58 6 -168 99 -72
6641 -72 9 -145 13 136 -130 -109 152 -191 -244 8 -71 75 23 40 -202 28 24 70 -132 108 201 -36 -74 -107
6665 -107 -65 -9 -34 -8 35 -105 -3 -164 160 -6 95 -180 -176 -120 53 180 203 52 -70 6 21 55 -82 -86 244
6690 244 -92 -185 275 18 -65 146 10 -222 143 47 -234 -197 -49 74 -164 24 10 243 218 -89 -332 39
6712 39 123 -130 63 -119 69 -243 176 -193 -22 139 128 232 -78 -188 -132 -53 361 61 -131 -54 -222 -204
6734 -204 -27 70 29 -45 159 -221 -118 17 10 11 53 47 19 74 163 110 -44 121 -211 -22 -132 -90 -187 112 68 -55
$$ packed form
6568c04J98J60O1k13K34j31k17K92M3k47o6J7K05L5j5j34J12o1N7M4q9j59P0k30
6592c38N05l29M3P7l6o0J18J54j7qk11K10j24K2LJ26n16K93L57j69o2j50M6j94
6616b60K81J2M8j06o1K05q6J35j96p9O6K2Q9q5J00p9q7J52j41P0n8O4j74K67j71
6641g2Q1j54J58J23k66K1K61l43n3K52p9J46n2J7k42K30mM6k02K40R3k37l8l3
6665a07M2N6k5K6M3j40J02j61L24j66J01k75MN6J73J27K3j51j22P6J5L4j37mL30
6690B44l36r3M60k57q3K11j36k32L65r6k81L7J48J23k38J88j4K33k5l07k43L71
6712C9Q4k53J93j82J88l12M19l69J71J61j1J04l10j10N6P9M14l00j92P7j68J8
6734b04J77R7m1p4K04l80J03J35pJM2ok8N5Q9n3j54J65l32J89j10M2r7K99m4j23
$$ plain form
6760 -55 165 6 -9 56 -29 -20 118 200 -122 138 81 170 -1 89 -126 173 -95 -1 150 152 -117 102 -153 59
6784 59 -136 73 182 -182 -196 61 -140 222 219 -87 16 -7 -319 7 -145 -49 117 129 274 116 -131 6
6806 6 27 132 -94 -94 79 -33 -153 71 -214 -11 160 -36 -115 -42 62 -187 173 -60 -15 73 35 40 -80 -242
6830 -242 134 -151 121 -34 295 -2 87 -54 -141 -185 -31 43 -68 29 -176 267 -8 65 -25 -237 286 49
6852 49 40 22 32 -125 7 -107 -211 -14 46 -79 243 132 142 -41 53 31 35 66 -99 -146 291 383 8 -39 -93
6877 -93 136 47 127 112 237 -210 159 -51 95 -93 1 -120 78 207 -47 150 -68 8 -98 36 101 -10
6899 -10 196 67 231 -159 -123 81 17 2 -132 -102 40 -113 -69 183 157 -173 -167 -52 113 -55 -81 57 -98
6922 -98 -114 19 -117 166 181 227 96 187 30 -2 -55 122 -187 88 37 57 -94 39 -61 28 11 -72 -383 -52
$$ packed form
6760e5K20j59j5O5q5RJ38Q2l22K60n7Q9j71R0k15K99k68R4J51Kk69K19k55K12
6784E9j95K09J09l64j4K57k01L62ll06J03k3l12L26j52R6J66J2J45j58k47J37
6806FK1J05k26%J73j12j20K24k85K03J71j96p9P3J04k49L60k33M5Q8l8Nj20j62
6830b42L76k85K72j55L29k97Q9j41q7m4J54P4j11R7k05M43k75P3r0k12N23k37
6852D9rj8J0j57J32j14j04J97O0j25L22j11J0j83R4k2ML1j65m7M37R2l75m7n4
6877i3K29q9Q0j5J25m47L69k10J46j88R4j21J98J29k54J97k18P6j06J34O5j11
6899a0K06j29J64l90L6K04o4j5j34L0J42j53M4K52k6l30OJ15J65j68k6J38j55
6922i8j6J33j36K83J5M6j31R1j57l2n3J77l09K75n1K0j51J33j00Q9j7q3l11L31
$$ plain form
6946 -52 44 307 -183 42 -148 209 -211 -120 112 -76 147 -182 204 114 162 111 -68 -56 -236 295 126 23
6968 23 -248 123 71 -206 95 -10 34 27 30 -177 -29 -69 90 72 -162 138 -109 -324 8 122 69 51 6 -93
6992 -93 -42 -64 6 54 23 -100 -55 -17 15 1 -30 105 4 78 381 83 -204 -36 -192 50 -280 -207 44 -68
7016 -68 -54 -283 130 193 -118 -26 64 117 -278 -88 -58 -192 -120 -158 -61 10 150 68 31 31 -94 34 52 59 -29 13 -40
7043 -40 54 -33 61 75 97 45 -14 -110 68 80 -242 -286 -322 -22 -106 61 23 -126 127 73 -37 9 129 1 -5 -111
7069 -111 -138 104 -90 -159 -335 -9 104 106 -34 -210 143 96 56 -123 83 162 -41 107 130 -67 -198 86 -177
7092 -177 -25 179 22 -44 -160 89 196 -29 -47 -20 171 -85 -147 -46 -77 -120 1 131 123 27 14 -78 -108 34
7116 34 102 268 51 -150 159 76 -165 92 229 -145 -112 74 -233 -56 196 64 -531 233 113 -850 131
$$ packed form
6946e2R6K63m90K25j90L57m20R1K32j88K23l29L86r0M8n1j79J2j80N31j69j03
6968B3k71L71n2k77L01j05M4pLk07J48m0J59j8k34L00k47k15L32J14n3j8m5r9
6992i3N1k2P0M8l1j23M5L8L2j4l1J35j01P4L03k98k87J68j56K42l30P3K51j12
7016f8J4k29M13O3l11R2R0N3l95J90L0j34P2l8R7P1J40q2l7%j25J28J8Pq8M2n3
7043d0R4q7R4J4K2n2n9r6J78J2l22m4l6L00q4J67l8j49K53n4j10M6J20j28oj06
7069a11k7K42j94o9j76L26J13Kj40j76L53m7m0j79K06P9k03J48K3j97j31K84k63
7092a77J52K04j57o6j16K49J07k25j8K7J91k56o2J01l1m3J21J30qr6j3r2l0J42
7116C4O8J66k17k01L09q3k41K57J37l74L3J86l07J77K52j32n95P64j20r63R81
$$ plain form
7137 131 157 110 -666 -163 270 -89 161 38 808 -38 442 776 348 -68 -416 -107 17 -92 235 663 -180
7158 -180 45 -386 96 -206 29 299 -380 33 239 -140 68 17 -475 -95 53 289 258 602 233 -369 -373
7179 -373 14 -194 312 -216 -286 -67 -274 284 -35 25 18 -68 107 124 9 -258 115 212 12 13 239 -23 193
7202 193 209 -5 -64 164 43 -100 4 -199 -85 114 168 58 -86 102 -289 21 -118 183 137 -46 -49 7
7224 7 118 -54 -97 37 139 187 4 -56 26 -252 -166 148 -228 -112 141 65 290 155 -108 5 76 -133 175
7247 175 20 -41 -176 114 -51 -46 162 203 71 -92 -241 35 139 76 -163 147 -40 247 108 67 -190 -26
7269 -26 137 -19 218 -12 -137 236 -401 113 122 -5 100 19 -161 -411 -166 318 303 63 -468 -135 -176 22
7291 22 -224 -343 -46 228 211 -176 50 -261 -85 -200 -30 84 -44 -383 -146 -25 -8 -122 -198 44 -53 -238
$$ packed form
7137A31K6m7p76N03M33l59K50j23P70q46M80L34m28m16l48L09J24j09L27M28q43
7158a80K25m31M82l02K35K70o79M13K06l79K08n1m92L80J48K36l1L44l69o02m
7179c73L87k08N06n28p0K19k07N58l19O0pq6J75J7j15k67L73R7k00JK26k62K16
7202A93J6k14n9K28j21j43J04k03J14J99N4j10j44J88l91L10j39L01m6j83lN6
7224GJ11j72m3J34J02M8j83o0Q2k78Q6L14l76J16K53p6K25j35k63J13P1k09L08
7247A75j55o1j35K90j65NK08M1j32j63j49K76J04o3k39L10j87K87j39m1k57J64
7269b6J63j56K37k30j25L73o37N14Rj27J05q1j80k50K45M84j5k40n31L33m1J98
7291B2k46j19K97K74j7l87K26l11J76j15J70J14j28l39K37J21J7j14p6K42r7j85
$$ plain form
7313 -238 137 -26 167 17 -23 -284 -31 -61 46 -77 -181 181 88 -110 -32 -47 210 31 97 -134 187 -117
7335 -117 -51 -63 -123 99 -74 76 99 -40 -37 -48 -48 -134 93 -121 15 141 106 117 31 179 64 -85 83 159 61
7360 61 27 -134 51 98 259 174 -36 96 146 117 207 -113 175 -329 -194 77 -87 70 33 -72 -9 -36 209
7383 209 -77 -62 -79 81 135 -83 42 73 -33 45 -240 17 -48 -47 -32 -47 -16 -85 126 -40 -6 -84 79 80 -30
7408 -30 12 -238 222 130 57 -98 -7 85 -128 103 16 -120 -20 36 -75 -118 -397 -182 11 56 -98 36 141
7431 141 -154 139 103 -80 -122 -13 6 8 138 -237 53 -121 -53 -89 -106 69 163 90 -92 -184 -152 -20 -175 -87
7455 -87 -290 -51 -174 151 -130 193 -11 8 -53 36 13 118 124 -12 -5 -115 -40 103 201 -43 -135 -72 165 83 84
7480 84 -102 -307 168 -61 -43 148 -245 52 -302 79 109 -26 12 29 -34 -15 -108 199 12 -72 -12 -83 159 -79
$$ packed form
7313b38L75j63J93j50m0k61K53l0J07j23j04L62r3j98P8j5K57j79O6k31L21l04
7335a17O6j2o0K22j73J50K3j39Lj1%q6K27k14J36J26l5J1q6J48j15j49J68P6r8
7360F1l4j61J85M7J61q5k10J32N0k9R0l20K88n04J35K71j64J57l7j05O3k7K45
7383B09k86J5j7J60N4k18J25L1j06P8k85K57o5JJ5j5L1o9K11j66L4p8J63Jj10
7408c0M2k50M60r2p3j55R1R2k13K31q7j36J00N6j11m3k79K15J93M5j54J34J05
7431A41k95K93l6j83m2J09J9KJ30l75K90j74O8l6j7J75R4p3j82r2L2J32j55Q8
7455h7k03K39j23L25k81L23k04J9o1Q9k3J05Oj36Pj10P5J43R8k44r2O3K37q2J
7480H4j86k05M75k29J8J91l93K97l54L81L0j35L8J7o3J9r3L07j87q4O0p1K42k38
$$ plain form
7504 -79 66 184 -94 204 99 107 150 -85 140 220 77 -129 58 -149 -105 -348 -126 -245 -188 -4 132 -78
7526 -78 -37 261 -78 -386 -53 54 192 371 419 -19 191 266 -59 12 66 -218 122 126 -87 -16 -352 97 407
7549 407 -82 175 295 68 295 483 224 -210 -166 146 -172 -24 -119 -423 47 -456 365 -18 -65 450 -264
7570 -264 416 -14 333 121 326 -425 -33 232 35 0 117 834 580 0 75 -489 82 354 -192 218 -339
7591 -339 -217 -328 96 231 -126 -44 -27 -81 -212 -55 -246 -6 -77 74 191 -26 -68 167 21 -311 -163 14
7613 14 -167 10 11 -13 14 59 25 -20 -248 32 -120 57 -142 8 97 -34 19 -88 160 -122 -88 92 11 -86
7637 -86 31 -71 -127 -142 147 -113 -144 191 -172 49 18 86 110 -212 151 200 -41 48 90 -69 63 -57 -268
7660 -268 140 30 13 -122 134 79 68 -92 -151 156 -151 67 69 21 -103 -45 49 -170 -74 -150 -133 301 -263 6
$$ packed form
7504g9J45J18k78K98j05QM3k35K25Q0j43k06J87k07M4k43K22j19N7J84J36k10
7526g8M1K98l39l08L33J07J38J79M8m38K10P5l25P1N4k84L40Mk13P1l36M49L10
7549D07m89K57J20k27K27J88k59m34M4L12l18J48r5l04M70n03Q21l83m7N15p14
7570b64O80m30L47k12K05p51L92K65j97l5J17P17k54n80P5n64N71K72n46M10n57
7591c39J22j11M24J35l57Q2J7n4j31J57j91K40p1J51J17k17m2K35j46l32J48J77
7613A4j81J77Jk4K7M5l4m5k28K80j52J77j99J50Q9j31N3j07K48k82L4J80q1r7
7637h6J17j02n6j5K89k60l1L35l63K21l1O8K4l22L63M9k41Q9M2j59J32j20k11
7660b68M08j10j7j35K56n5j1j60n9L07l07K18Km8j24N8R4k19R6p6J7M34n64K69
$$ plain form
7684 6 -108 153 186 -82 499 147 -165 11 58 158 51 -256 100 -286 145 -75 -10 229 278 -4 -138 29
7706 29 -91 -33 124 60 -198 -26 5 94 -148 -158 -148 -91 115 86 0 -184 277 28 -44 -103 -75 -336 18 70 -79
7731 -79 227 101 -40 -377 74 -25 117 133 9 257 143 16 50 -61 -174 -56 -214 -76 145 498 255
7752 255 -137 -408 -18 -531 -127 -39 -45 67 -306 -26 39 8 163 270 20 108 -50 -193 -78 20 -31 -158 -10
7775 -10 -43 -91 21 -27 -194 -99 154 -266 40 130 -155 -105 127 95 -12 111 -93 133 82 -118 -240 103 -179
7798 -179 8 -325 -44 -20 178 -27 219 -202 -52 -329 -5 88 78 47 166 -86 67 -25 201 16 66 2
7820 2 185 -154 -73 -56 23 83 62 12 -108 -255 39 53 -21 20 -72 117 -159 137 70 -31 12 -203 -236 13 -71
7845 -71 251 76 125 -106 -5 -47 -121 -114 25 -7 93 -56 172 -64 -169 226 -108 -386 254 -39 -82 -101 -191
$$ packed form
7684Fj14K61L3k68N81l52l12J76M7J00j07l07L56l86M31k20O5K39M9k82j34J67
7706B9j20N8J57o4k58J72L1Q9k42j0J0N7K06k9q6j84M61k49p2n9K8k61L54N2j49
7731g9L06j26j41l37M51r9J42J6j24K48j14j27L4j11j13J18j58J38K21L53k43
7752B55l92k71L90n13M04Q8oJ12l73K80O5l1J55J07k50Q8j58j43J15R8n1j27J48
7775a0l3m8J12m8j67R5K53m20L06R0k85N0K32l2j07J23k04K26n1k00j22L43k82
7798a79J87l33K81K4J98k05K46m21J50k77L24R3j0l1J19k52J53r2K26j85N0o4
7820BJ83l39Q1J7P9O0k1n0j20j47K94J4p4M1r2J89k76K96o7j01M3k15l3K49q4
7845g1L22j75M9k31J01m2p4PJ39l2J00j49K28k36j05L95l34k78O40k93m3j9r0
$$ plain form
7868 -191 -26 -77 9 97 20 2 134 -188 51 -66 91 49 20 22 172 -2 70 -30 -103 -335 -43 18 -85 52
7892 52 -127 -97 -134 74 237 -107 -76 112 54 44 163 -54 -103 -192 20 317 52 126 -22 -127 123 15 248
7915 248 62 -242 -137 396 99 137 41 -419 -186 262 -76 -640 20 923 376 935 241 -435 89 220 377
7936 377 128 -348 -319 -2 -86 47 63 110 70 -64 -17 47 24 3 76 195 76 293 -40 -61 -10 158 -66 -97
7960 -97 126 330 -34 -103 -129 -6 -120 -124 164 -141 253 -54 -42 -389 -102 147 151 170 93 -59 -221 -96 -158 52
7984 52 234 -48 -177 -92 -3 108 -12 -165 101 120 191 99 39 -88 125 -78 -177 4 164 -65 15 170 24
8007 24 -176 -143 84 18 39 217 91 77 59 78 -6 116 -123 -76 355 292 101 175 20 -163 -270 84 -98 -404
8031 -404 91 422 137 537 -229 -64 165 55 122 -75 217 21 188 277 -15 -646 378 92 -317 308
$$ packed form
7868a91J65n1Q6Q8p7j8J32l22K39j17J57m2k9KJ50j74P2j00p3k32K92O1j03J37
7892E2j79L0l7K08J63l44L1J88n8j0J19k17m9q9K12K97k65P4j48j05K50j08K33
7915B48j86l04J05N33k97L8r6m60K33M48l38n64O60R03n47N59o94o76N24J31J57
7936C77k49m76K9L17q4J33J6M7m0j34M7O4k3k1P3J19j19K17l33k1N1J68k24l1
7960i7K23K04l64o9k6J23j14mK88l05L94l07J2l47K87K49MJ9p7j52j62J25o2K10
7984E2J82k82j29Q5Q9J11j20j53K66J9P1r2o0j27K13k03r9J81J60k29Q0J55j46
8007B4k00L3K27o6K1J78j26j4j8J9q4J22k39M7M31o3j91P4j55j83j07L54j82l06
8031d04M95L31k85M00p66J65K29j10O7j97K92j96J67Q9k92o31J024k86m09O25
$$ plain form
8051 308 -191 26 232 -536 -332 -127 -78 22 36 -682 -81 500 -163 66 239 239 -52 -277 -153 0 -167
8072 -167 236 -102 -37 53 -42 -167 -11 195 119 -163 32 -120 78 153 104 149 135 166 7 -268 25 -73 328
8095 328 -17 145 33 -194 222 153 128 124 93 -23 -51 21 112 -80 95 100 -21 202 276 -126 67 -75 94 184
8119 184 138 -180 -112 159 198 -148 -49 -23 363 -125 -213 -76 126 -7 -157 -167 217 265 -220 -111 186 -78 -196
8142 -196 174 -147 236 -9 205 219 -65 -511 -142 301 -170 -3 -300 86 80 -13 -331 -121 -32 191 -41 107
8164 107 -186 -63 94 -55 -43 138 -4 -154 218 86 128 11 24 -9 -47 -154 65 -141 -194 -163 14 21 46
8187 46 133 -82 195 166
$$ packed form
8051C08m99K17K06p68K04K05M9J00J4p18O01N81o63K29J73%k91k25J24J53j67
8072a67M03l38O5R0r5j25J56K06p6k82J95j52J98P5m9M5j4L1j59k75K93r8M01
8095C28l45J62j12k27M16o9k5ml1j16k8P2R1j92J75Nj21K23P4m02J93j42J69R0
8119A84m6l18O8K71L9l46R9K6L86m88q8J37K02j33j50j0L84M8m85J09K97k64j18
8142a96L70l21L83k45K14J4k84m46L69M43m71J67k97L86or3l18K10Q9K23k32J48
8164A07k93J23J57j49J2J81j42j50L72j32M2j17J3l3l8j07K19k06n3L1J77PK5
8187D6Q7k15K77k9
8191A66
$$ Imaginary data points
##PAGE= N=2
##DATA TABLE= (X++(I..I)), XYDATA
$$ plain form
0 0 0 0 0 0 0 0 0 0 0 8 -8 8 -8 16 -16 24 -32 36 -40 52 -64 77 -92 110 -128 149 -173 202 -235 269 -309 353
32 353 -401 455 -513 580 -654 734 -822 917 -1024 1137 -1263 1402 -1553 1716 -1892 2086
48 2086 -2301 2536 -2793 3076 -3387 3734 -4120 4554 -5044 5602 -6242 6989 -7871 8933
62 8933 -10239 11888 -14048 17007 -21345 28375 -42373 132302 -322280 73836 225050 -463107
74 -463107 336569 97820 -294535 400203 -112414 -246866 396269 -276421 -33167 348715
84 348715 -337793 129901 223570 -384588 250146 50937 -320216 356183 -79311 -206531
94 -206531 362912 -243324 -75220 309058 -305148 85783 210169 -337780 205440 65569
104 65569 -296300 289499 -79434 -199751 320397 -192644 -72189 275495 -289282 50299
$$ packed form
0@%%%%%%%%%Qj6J6j6K4l2M0n6O8p6R2j16J41j69K02k38K77l22L75m37N04n78O62
32C53p54Q56r68J093j234J388j556J739j941K161k400K665k955L269l608L978
48B086m387M837n329N869o463P121p854Q674r598J0646j1844J3231j4860J6804
62H933j9172K2127k5936L1055l8352M9720p0748J74675m54582L96116J51214o88157
74d63107P99676k38749l92355O94738n12617j34452O43135o72690K43254L81882
84C48715o86508M67694R3669o08158O34734j99209l71153O76399m35494j27220
94b06531N69443o06236J68104L84278o14206L90931J24386n47949N43220j39871
104F5569l61869N85799l68933j20317N20148n13041J20455L47684n64777L39581
$$ plain form
114 50299 203805 -293359 190154 86940 -281270 239024 -55775 -189352 294745 -141292
124 -141292 -75057 249978 -248490 31868 181334 -257771 162671 85870 -240858 217929
134 217929 -38769 -180944 252558 -123479 -74009 239007 -196824 20047 164615 -226707
144 -226707 116706 85217 -202272 181935 -19080 -156461 208794 -109575 -71963 196805
154 196805 -175339 17256 146290 -200298 99771 71937 -194882 155203 -13891 -144146
164 -144146 185634 -91101 -73749 167569 -151754 4816 127710 -174625 80453 59890
174 59890 -170708 134527 -16524 -129227 161262 -83324 -69070 151387 -132778 340
184 340 117051 -153544 68245 59403 -144120 113640 -8865 -106350 135495 -65973 -51401
$$ packed form
114E0299J53506m97164M83513j03214l68210N20294k94799j33577M84097m36037
124a41292O6235L25035m98468K80358J49466m39105M20442p6801l26728M58787
134B17929k56698j42175M33502l76037M9470L13016m35831K16871J44568l91322
144b26707L43413l1489k87489L84207k01015j37381L65255l18369L7612K68768
154A96805l72144J92595J29034l46588L00069k7834k66819L50085j69094j30255
164a44146L29780k76735J7352K41318l19323J56570J22894l02335K55078k0563
174E9890k30598L05235j51051j12703K90489k44586J4254K20457k84165J33118
184C40J16711k70595K21789q842k03523K57760j22505r7485K41845k01468J4572
$$ plain form
195 -51401 130472 -112438 7986 98207 -131358 67092 50108 -122042 106700 -4959
205 -4959 -92351 123421 -55401 -44891 117807 -92727 12452 86972 -110043 60261 39320
216 39320 -101832 96981 -9581 -74509 112395 -59670 -33057 103858 -91548 16888
226 16888 75319 -103247 57428 32475 -94850 87307 -14040 -65854 97538 -57552 -24527
237 -24527 84952 -85834 19667 57808 -95439 56685 18650 -86784 82386 -23474
247 -23474 -57793 88896 -58722 -20780 75165 -79603 19073 49275 -84872 54559 10679
258 10679 -73220 76606 -28456 -43945 81421 -59616 -9329 69846 -80092 27942 45356
269 45356 -82777 60166 9077 -67743 77104 -26860 -38699 80192 -55771 -2786 65584
$$ packed form
195e1401J81873k42910J20424R0221k29565J98450j6984j72150K28742j11659
205d959q7392K15772j78822J0510J62698k10534J05179P4520j97015J70304k0941
216C9320j41152J98813j06562o4928J86904j72065K6613J36915j95406J08436
226A6888N8431j78566J60675k4953j27325J82157j01347n1814J63392j55090L3025
237b4527J09479j70786J05501L8141j53247J52124l8035j05434J69170j05860
247b3474l4319J46689j47618L7942R5945j54768R8676L0202j34147J39431m3880
258A0679q3899J49826j05062j5489J25366j41037N0287P9175j49938J08034J7414
269D5356j28133J42943n1089p6820J44847j03964j1839J18891j35963N2985O8370
$$ plain form
280 65584 -74991 34652 36968 -75036 65107 2447 -60621 79602 -32368 -34110 80824
291 80824 -59816 1093 64782 -75817 34443 34512 -73468 60713 929 -57796 74512
302 74512 -34627 -31749 73845 -62384 3488 57643 -76478 35007 28994 -77012 59278
313 59278 -2645 -61491 73319 -36688 -34104 70575 -63327 236 54385 -75542 32375
324 32375 26878 -75787 59355 -7014 -60307 74735 -39900 -32452 72701 -64860 60
335 60 57803 -77103 33102 31422 -75841 59211 -2586 -57823 72644 -34248 -29547 71232
347 71232 -59213 2965 57247 -72891 36102 31106 -71308 61201 -660 -55518 73583
358 73583 -30085 -30555 72745 -54358 846 58149 -67574 32845 32077 -66959 56293 1149
$$ packed form
280F5584j40575J09643K316j12004J40143o2660o3068J40223j11970j742J14934
291H0824j40640O0909O3689j40599J10260O9j07980J34181n9784n8725J32308
302G4512j09139K878J05594j36229O5872N4155j34121J11485o013j06006J36290
313E9278o1923n8846J34810j10007K584J04679j33902O3563N4149j29927J07917
324C2375n497j02665J35142o6369n3293J35042j14635P448J05153j37561O4920
335F0N7743j34906J10205j680j07263J35052o1797n5237J30467j06892M701J00779
347G1232j30445O2178N4282j30138J08993m996j02414J32509o1861n4858J29101
358G3583j03668m70J03300j27103N5204N7303j25723J00419p68r9036J23252n5144
$$ plain form
370 1149 -53790 70053 -29161 -30401 70976 -54943 -890 56881 -68001 28730 33251 -68333
382 -68333 51380 3520 -56992 65050 -26645 -33440 65657 -51588 -4467 52540 -65952
393 -65952 24069 31407 -67708 47696 3324 -57400 61910 -25335 -35552 63219 -46988 -8801
405 -8801 52230 -60492 18052 32982 -62644 42115 6427 -52327 55865 -19718 -32680 58937
417 58937 -41132 -8172 51767 -55283 17457 34150 -57970 39520 10909 -49181 53227
428 53227 -13259 -32391 57253 -34615 -9079 50392 -48613 16025 33550 -52587 36512 12007
440 12007 -46305 49930 -10858 -31448 54253 -31731 -10881 47952 -44551 10876 32589 -48263
452 -48263 29360 12694 -43890 42521 -9098 -30554 46334 -28604 -11800 40747 -40756 6969
$$ packed form
370A149n4939J23843r9214j240J01377j25919N4053N7771j24882R6731M521j01584
382f8333J19713m7860o0512J22042r1695o795R9097j17245M7121N7007j18492
393f5952R0021P338r9115J15404m4372o0724J19310q7245j0217R8771j10207L8187
405h801O1031j12722P8544J4930r5626J04759l5688n8754J08192p5583j2962R1617
417E8937j00069L2960N9939j07050P2740J6693r2120R7490k8611o0090J02408
428E3227o6486j9132Q9644r1868K5536N9471r9005O4638J7525q6137Q9099k4505
440A2007n8312R6235o0788k0590Q5701q5984K0850N8833r2503N5427K1713q0852
452d8263P7623j6666n6584Q6411n1619k1456P6888p4938J6804N2547q1503M7725
$$ plain form
464 6969 28718 -46035 24252 11595 -41915 36352 -7780 -30283 39473 -24281 -13733 36143
476 36143 -35050 3708 25848 -40586 20349 9883 -36862 32236 -6571 -26707 36240 -21109
488 -21109 -12449 34234 -31334 3944 25127 -35694 18719 11255 -31472 28817 -3336 -22576
500 -22576 33085 -16935 -9661 31272 -26109 5297 22544 -29536 17919 10949 -26828 26170
512 26170 -1871 -19691 29680 -13845 -7702 27140 -21716 4395 18866 -24673 14889 8739
524 8739 -22546 22241 -3496 -16391 25063 -14046 -6850 22406 -20661 3766 14679 -23024
536 -23024 12205 6619 -21445 18611 -4076 -14645 19588 -13821 -5560 17258 -18991 3275
548 3275 11131 -21503 11422 1901 -18362 16572 -7284 -12293 17642 -13344 -3877 13877 -16845
$$ packed form
464F969K1749p4753P0287j2657n3510P8267m4132k2503O9756o3754J0548M9876
476C6143p1193L8758K2140o6434O0935j0466m6745O9098l8807k0136O2947n7349
488b1109Q660M6683o5568L5278K1183o0821N4413p464m2727O0289l2153j9240
500b2576N5661n0020P274M0933n7381L1406J7247n2080M7455o970l7777N2998
512B6170k8041j7820M9371m3525O143L4842m8856K6111J4471m3539L9562o150
524H739l1285M4787k5737j2895M1454l9109P196K9256m3067K4427J0913l7703
536b3024L5229n586k8064M0056k2687j0569L4233l3409Q261K2818l6249K2266
548C275P856l2634L2925r521k0263L4934k3856n009K9935l0986R467J7754l0722
$$ plain form
561 -16845 4856 9954 -17363 11508 1518 -14314 15596 -6486 -8561 15609 -11690 -522 14066
574 14066 -15649 6914 7719 -14555 13658 667 -11086 15678 -5615 -5305 16086 -11830 2540
587 2540 11846 -14391 8754 5343 -13242 14045 -1306 -9560 15814 -8848 -3300 15150 -13443
600 -13443 3466 9256 -14556 8454 3085 -13211 13534 -3630 -8892 15092 -10164 -2924 12418
613 12418 -14655 3617 7519 -15989 9491 1837 -14687 13807 -5638 -9627 14837 -11967 -2728
626 -2728 12029 -15338 3954 7378 -16367 10189 1273 -13916 14857 -5972 -8892 15273 -11898
639 -11898 -1795 13243 -15154 5253 8693 -16210 11805 1692 -13485 15929 -5296 -7436
651 -7436 16482 -11249 -916 14462 -15032 6329 9424 -15618 12955 1985 -13043 16753
$$ packed form
561a6845K1701N098k7317K8871r990j5832K9910k2082k075K4170k7299J1168J4588
574A4066k9715K2563Q05k2274K8213j2991j1753K6764k1293L10K1391k7916J4370
587B540R306k6237K3145l411j8585K7287j5351q254K5374k4662N548J8450k8593
600a3443J6909N790k3812K3010n369j6296K6745j7164n262K3984k5256P240J5342
613A2418k7073J8272L902k3508K5480p654j6524K8494j9445l989K4464k6804R239
626b728J4757k7367J9292L424k3745K6556q916j5189K8773k0829k920K4165k7171
639a1898J0103J5038k8397K0407L440k4903K8015j0113j5177K9414k1225k140
651g436K3918k7731J0333J5378k9494K1361L095k5042K8573j0970j5028K9796
$$ plain form
663 16753 -4728 -7418 17237 -10808 -1101 15088 -15123 6262 9538 -15893 12105 2438 -13492
676 -13492 15375 -4794 -8821 16677 -11153 -2466 14000 -15018 4917 8505 -16274 10490 2071
689 2071 -14507 14507 -5166 -10127 15670 -11530 -3263 13331 -15559 3330 8833 -16844 9415
702 9415 2838 -14994 14082 -4701 -10064 15000 -10882 -3552 13379 -14491 3247 9303 -15880
715 -15880 9705 3414 -14215 13923 -3392 -9421 15356 -8699 -3564 14170 -12786 2947 10479
728 10479 -14341 9206 4391 -12543 12918 -1718 -8835 14822 -7096 -3364 13977 -11397 2622
741 2622 10054 -12997 8140 5018 -11995 11484 -408 -9080 13304 -6242 -4071 12576 -10360
754 -10360 1791 9067 -12149 6673 4444 -11947 10152 -926 -9371 11804 -6353 -4981 10764
$$ packed form
663A6753k1481k690K4655k8045R707J6189l0211K1385L276k5431K7998r667j5930
676a3492K8867k0169m027K5498k7830Q687J6466k9018J9935L588k4779K6764q419
689B071j6578K9014j9673m961K5797k7200Q267J6594k8890J8889N503k5677K6259
702I415o577j7832K9076j8783n363K5064k5882P330J6931k7870J7738O056k5183
715a5880K5585o291j7629K8138j7315o029K4777k4055N135J7734k6956J5733P532
728A0479k4820K3547m815j6934K5461j4636p117K3657k1918L732J7341k5374J4019
741B622P432k3051K1137l122j7013K3479j1892q672K2384j9546K171J6647k2936
754a0360J2151P276k1216J8822k229j6391K2099j1078q445K1175j8157J372J5745
$$ plain form
767 10764 -9915 400 8090 -11429 4480 3892 -11303 8309 -1315 -8525 9712 -5954 -4398
780 -4398 9276 -8510 -335 7385 -10640 4242 3554 -10070 7800 -426 -7451 8664 -4168
793 -4168 -3953 8449 -6713 224 6888 -8194 4324 3509 -7549 7139 -110 -5616 8395 -3191
807 -3191 -2801 8217 -5524 939 6257 -6851 4202 3197 -6035 6064 300 -4097 7065 -2811
821 -2811 -1702 6606 -5133 1318 4780 -5742 3674 2286 -5643 5170 -660 -3951 5737 -3222
835 -3222 -1653 4708 -4710 737 2675 -5338 2738 573 -4657 4508 -2176 -3294 4476 -4230 -742
850 -742 3287 -5225 1203 1841 -5309 2907 -325 -4036 4139 -2760 -1848 3662 -4020 506 2490 -4855
866 -4855 2626 946 -4446 4528 -1301 -2713 4879 -3014 -621 4353 -3860 1631 2769 -4216 3819
$$ packed form
767A0764k0679J0315P690j9519J5909n88j5195J9612r624p210J8237j5666J556
780d398J3674j7786Q175P720j8025J4882o88j3624J7870q226p025J6115j2832
793d168K15J2402j5162O937O664j5082J2518q15j1058J4688p249n506J4011j1586
807c191L90J1018j3741O463N318j3108J1053j005r232J2099n764m397J1162r876
821b811J109Q308j1739O451L462j0522R416j388p929J0813n830l291R688q959
835c222J569O361r418N447J938q013Q076k165n230R165o684j118P770q706L488
850g42M029q512O428O38p150Q216l232l711Q175o899R12N510p682M526J984p345
866d855P481j680n392Q974n829j412P592p893K393M974q213N491J138o985Q035
$$ plain form
881 3819 504 -3189 5112 -1926 -1341 5080 -3455 1034 4176 -4834 2905 2573 -4999 4931 4 -3395
897 -3395 5507 -2613 -1650 5210 -4258 873 3802 -5339 3487 1426 -5242 5309 -1420 -3939 5665
912 5665 -4174 -2021 5725 -6010 860 4250 -6932 3683 1150 -6224 5277 -1670 -4698 5976
926 5976 -4632 -1976 5844 -6931 1443 3942 -7558 4313 1267 -6796 6296 -1103 -5153 7316
940 7316 -4301 -2177 6429 -6798 1193 4671 -7169 4393 1998 -6922 7017 -1201 -4788 8130
954 8130 -4371 -1943 7721 -6522 1549 6308 -7420 4466 3321 -7290 7060 -381 -5336 8212
968 8212 -4021 -2405 8050 -6647 1178 6272 -8149 4720 3254 -7933 7251 -337 -6349
981 -6349 8456 -3904 -3585 8142 -6739 -340 6660 -8752 3691 3437 -8653 6256 -500 -6917
$$ packed form
881C819l315l693Q301p038N85O421q535M489L142r010P739l32p572R930m927l399
897c395Q902q120R63O860r468N131K929r141Q826k061o668J0551o729k519R604
912E665r839K153P746j1735O870L390j1182J0615k533p374J1501o947l028J0674
926E976j0608K656P820j2775Q374K499j1500J1871l046q063J3092p399m050J2469
940G316j1617K124Q606j3227P991L478j1840J1562k395q920J3939q218l587J2918
954H130j2501K428R664j4243Q071M759j3728J1886j145j0611J4350p441m955J3548
968H212j2233J616J0455j4697P825N094j4421J2869j466j1187J5184p588o012
981f349J4805j2360L19J1727j4881O399P000j5412J2443k54j2090J4909o756o417
$$ plain form
995 -6917 7866 -3898 -4493 8153 -7282 -759 6677 -9108 2764 4379 -8521 5913 223
1008 223 -7637 7826 -3291 -4984 8150 -6142 -784 6998 -8420 2994 4336 -8968 5933
1021 5933 1590 -7655 8368 -2097 -4837 8895 -5370 -1398 7824 -7286 2228 5497 -7991
1034 -7991 5935 1996 -6841 7804 -2103 -4835 8578 -5092 -1682 7703 -7274 2237 5843 -8336
1048 -8336 5315 2650 -7155 7182 -1263 -5519 8168 -4003 -2673 7554 -6525 945 5047
1061 5047 -7982 4264 1970 -7365 6790 -915 -5770 7260 -4087 -3301 6971 -6287 253
1074 253 5653 -7242 2823 2673 -7573 5409 -407 -5602 6678 -3760 -3038 6388 -5627 179
1088 179 5244 -6958 3071 3144 -6740 4775 420 -5901 6363 -2212 -3329 5983 -4337 -444
$$ packed form
995f917J4783j1764n95J2646j5435O523P436j5785J1872J615j2900J4434n690
1008B23p860J5463j1117j693J3134j4292N358P782j5418J1414J342j3304J4901
1021E933m343r245J6023j0465k740J3732j4265L972R222j5110R514L269j3488
1034g991J3926l939q837J4645r907k732J3413j3670L410R385j4977R511L606j4179
1048h336J3651k665r805J4337q445m256J3687j2171J330J0227j4079P470M102
1061E047j3029J2246k294r335J4155p705m855J3030j1347P86J0272j3258O540
1074B53N400j2895J0065j50j0246J2982n816n195J2280j0438P22R426j2015N806
1088A79N065j2202J0029P3r884J1515m355o321J2264q575j117R312j0320L893
$$ plain form
1102 -444 5272 -5592 2163 2792 -5817 5321 380 -4842 6156 -2447 -3371 6524 -4449 -757 5593
1117 5593 -5317 1680 3183 -5718 4286 1311 -4349 5572 -1544 -2818 5522 -3799 -354 4805
1131 4805 -4861 1926 2945 -5117 3648 683 -4623 4966 -1703 -2796 4718 -3430 -1077 3487 -4242
1146 -4242 1534 2056 -4728 2798 -188 -4033 4541 -1764 -3273 4539 -3400 -985 3633 -3962 915
1161 915 2492 -4519 2540 282 -3909 3981 -1097 -2199 4120 -2565 -210 3016 -4273 1593 2123
1176 2123 -3596 3283 128 -3030 4542 -1057 -1781 3825 -3065 59 3643 -3425 1468 2001 -3329
1191 -3329 3154 533 -2704 3756 -1565 -673 3849 -2286 346 3365 -3724 1909 1850 -2955 2520 -239
1207 -239 -2817 3307 -1539 -1479 3201 -2951 82 2335 -2989 1815 775 -3318 3309 -394 -3187 3362
$$ packed form
1102d44N716j0864P755O29q609J1138m941n222J0998q603r24R895j0973L692O350
1117E593j0910O997J503q901J0004k975n660R921p116j274Q340r321L445N159
1131D805r666O787J019q062Q765k965n306R589o669j093P514q148K353M564p729
1146d242N776N22o784P526k986l845Q574o305j509P812p939K415M618p595M877
1161I15J577p011P059k258m191P890n078j102O319o685K355L226p289N866N30
1176B123n719O879l155l158P572n599p24N606o890L124L584p068M893N33n330
1191c329O483k621l237O460n321Q92M522o135K632L019p089N633n9m805N475k759
1207b39k578O124m846O0M680o152L033K253n324M804j040m093O627l703k793O549
$$ plain form
1223 3362 -2361 -995 2936 -3661 422 2171 -3837 1683 1148 -3301 2374 -716 -2480 3521 -2282
1238 -2282 -857 3034 -3112 1075 2155 -3795 2265 1260 -3028 3032 -896 -2130 3417 -2030 -645
1253 -645 3119 -3539 422 1171 -3851 2563 521 -3081 3362 -1364 -2173 3641 -2161 -1186 3491 -3833
1269 -3833 832 2725 -2604 2471 1122 -2634 3420 -248 -1904 3360 -2369 -636 3580 -3960 587
1284 587 2331 -3674 2066 1654 -3802 3418 -1186 -3268 4062 -2704 -1481 3186 -4016 19 2815
1299 2815 -3986 1697 940 -3231 3779 -251 -2682 3755 -3238 -1406 3423 -3416 689 3033 -3628
1314 -3628 2005 1654 -4153 3450 -649 -2841 3963 -1832 -1280 3880 -3584 438 2921 -4544 2646
1329 2646 1846 -4027 3638 10 -3304 4495 -1953 -1808 4657 -3238 5 3314 -3883 2074 1866 -3880
$$ packed form
1223C362n723J366L931o597M083J749o008N520n35m449N675l090j764O001n803
1238b282J425L891o146M187J080n950O060j005m288O060l928j234N547n447J385
1253f45L764o658L961P49n022O414k042l602O443m726q09N814n802R75M677p324
1269c833M665J893n329N075j349l756O054l668j656N264n729J733M216p540M547
1284E87J744o005N740m12n456P220m604k082P330o766J223M667p202M035K796
1299B815o801N683p57m171P010m030k431O437o993J832M829o839M105K344o661
1314c628N633l51n807P603m099k192O804n795N52N160p464M022K483p465P190
1329B646q00n873P665l628l314P799o448J45O465p895L243L309p197N957k08n746
$$ plain form
1345 -3880 3472 285 -3310 4473 -1890 -1903 4578 -3238 23 3505 -4400 1543 2380 -4088 3221 369
1361 369 -3708 4022 -1467 -2133 3913 -2925 -659 3290 -3779 1497 2106 -4391 3047 572 -3800 3861
1377 3861 -1359 -2672 4071 -2824 -1199 3780 -3821 882 2353 -4359 2404 842 -3495 3477 -756
1392 -756 -2953 3660 -2443 -920 3747 -3815 928 2681 -4089 2355 1366 -3619 3571 -502 -2801
1407 -2801 4022 -1973 -1055 3644 -3352 677 2788 -3813 2167 1477 -3340 3175 -67 -2467 3605
1422 3605 -1865 -1426 3720 -2702 164 3004 -3300 1813 1591 -3455 2881 -5 -2730 3293 -1672
1437 -1672 -1550 3245 -2730 -361 2258 -2931 1735 1503 -3789 2461 245 -3272 3037 -2097 -1658 2682
1453 2682 -2660 -964 2107 -3224 990 1239 -3130 2139 295 -2612 2733 -1361 -1954 3082 -2161
$$ packed form
1345c880P352l187l595P783o363j3O481p816L261L482p905N943Q37o468P309k852
1361C69m077P730n489o66O046o838K266L949p069N276O09o497P438k475m372P661
1377C861n220j313O743o895J625M979p601M703J471o712O763j562m337O972m233
1392g56k197O613o103J523M667p562M743J753o770O444r89m985P190m073k299
1407b801O823n995R18M699o996M029K111o601N980o90m817O515l242k400O072
1422C605n470M39N146o422K866K840o304N113k22n046O336k886k725O023m965
1437a672J22M795n975K369K619n189M666k32n292O250k216l517O309n134M39M340
1453B682n342J696L071n331M214K49m369N269j844k907N345m094n93N036n243
$$ plain form
1468 -2161 -504 2701 -2835 876 1538 -2904 1630 498 -2401 2614 -872 -1656 2547 -2015 -241
1483 -241 2240 -2444 777 1406 -2660 1670 849 -2438 2373 -465 -1636 2766 -1221 -281 2206 -2235
1499 -2235 604 1547 -2298 1540 534 -2189 2409 -438 -1393 2832 -1814 -112 2558 -2278 601
1514 601 1825 -2391 1411 339 -2065 1854 -779 -1227 2189 -1215 -670 1844 -2300 547 1093 -3065
1530 -3065 995 443 -1941 2140 -897 -1433 2134 -1155 -136 2069 -1682 518 1298 -2288 736 539
1546 539 -1743 961 422 -1202 1483 -1281 -439 1356 -1786 629 1517 -1992 1028 681 -1944 1989
1562 1989 116 -891 2037 -1223 -167 1397 -1529 558 941 -1648 1531 512 -1590 1791 -710
1577 -710 -1490 1446 -847 297 1598 -1839 631 1378 -1807 1515 166 -1602 1541 -816 -1002 1600
$$ packed form
1468b161J657L205n536L711O62m442M534j132k899N015l486p84M203m562J774
1483b41K481m684L221O29m066M330q21l287M811k838j171M402l987R40K487m441
1499b235K839R43l845L838j006k723M598k847r55M225m646J702K670m836K879
1514F01J224m216L802j072k404L919k633m48L416l404N45K514m144K847N46m158
1530c065M060n52k384M081l037n36L567l289J019K205l751K200P80l586L024j97
1546E39k282K704n39j624K685k764Q42J795l142K415Q88l509L020l47k625L933
1562A989j873j007K928l260J056J564k926K087L83k589L179j019k102L381k501
1577g10p80K936k293J144J301l437K470P47l185L322j349j768L143k357j86K602
$$ plain form
1593 1600 -1100 -297 1856 -1825 605 790 -1899 1270 149 -1606 1670 -681 -1107 1746 -1480 -234
1609 -234 1416 -1967 462 738 -1985 1355 58 -1733 1768 -950 -1111 1823 -1498 -394 1710 -1819
1625 -1819 726 874 -1908 1275 214 -1623 1846 -506 -1115 1868 -1495 -246 1633 -1774 424
1640 424 1038 -1797 1354 335 -1615 1998 -595 -1031 2115 -1106 -291 1600 -1714 693 1047 -1989
1656 -1989 1467 256 -1562 2113 -317 -1160 1783 -1256 -390 1843 -1751 530 1248 -1892 1230 333
1672 333 -1838 1592 -561 -1232 1882 -1094 -313 1740 -1961 290 1144 -2153 1167 354 -1908 1664
1688 1664 -370 -1361 2057 -940 -914 1725 -1559 171 1217 -1827 833 609 -1828 1738 -52 -1283
1704 -1283 1716 -1214 -641 2013 -1430 305 1600 -1696 898 798 -1685 1456 -19 -1304 1911
$$ packed form
1593A600k700Q03K153l681K430J85k689L169j121j755L276k351m26K853l226J246
1609b34J650l383K429K76k723L340j297j791L501k718j61K934l321J104K104l529
1625a819K545J48k782L183j061j837L469k352o09K983l363J249J879l407K198
1640D24O14k835L151j019j950L613k593m36L146l221Q15J891l314K407L54l036
1656a989L456j211j818L675k430q43K943l039Q66K233l594K281P18l140L122q97
1672C33k171L430k153o71L114k976P81K053l701K251Q54l297L320q13k262L572
1688A664k034r91L418k997K6K639l284J730J046l044K660k24k437L566j790j231
1704a283K999k930N73K654l443J735J295l296K594j00k483L141j475j285L215
$$ plain form
1719 1911 -724 -915 1649 -1351 146 1762 -1567 969 820 -1751 1669 300 -1358 1748 -194
1734 -194 -704 1572 -1235 -23 1404 -1537 511 897 -1821 1480 77 -1671 1769 -264 -1106 1592
1750 1592 -1293 -846 1420 -1464 548 864 -1066 964 73 -1857 1062 -582 -929 1505 -1259 -379
1766 -379 920 -943 53 659 -1298 753 515 -1103 1294 133 -283 1425 -1138 -563 1358 -1260
1782 -1260 -229 453 -1014 403 735 -918 1361 113 -743 1114 -479 -262 1397 -384 189 736
1798 736 -1031 907 441 -807 469 345 -917 992 -94 -33 998 -738 80 534 -893 189 780
1815 780 -1127 861 402 -1082 893 -423 -507 536 -492 -207 503 -790 477 421 -580 559 -196
1832 -196 -835 678 -97 -1128 389 -738 -133 551 -430 373 503 -820 619 245 -759 502 -243
$$ packed form
1719A911k635j91K564l000J497J616l329K536j49k571L420j369j658L106j942
1734a94n10K276k807J212J427k941K048L86k718L301j403j748L440k033q42K698
1750A592k885M47K266k884K012L16j930K030q91j930K919j644l47K434k764Q80
1766c79J299j863R96O06j957K051k38j618K397j161m16J708k563N75J921k618
1782a260J031O82j467J417L32j653K279j248q56J857j593K17J659j781N73N47
1798G36j767J938m66j248J276j24j262J909j086O1J031j736Q18M54j427J082N91
1815G80j907J988m59j484J975j316q4J043j028K85P10j293J267n6j001J139p55
1832a96o39J513p75j031J517j127O05O84r81Q03J30j323J439l74j004J261p45
$$ plain form
1849 -243 -60 433 -442 -28 616 -751 299 920 -809 576 -129 -558 444 146 -82 385 -512 78
1867 78 218 -700 66 463 -661 -60 78 -303 66 -32 411 752 -336 -2 261 -136 215 19 -376 43
1887 43 -5 -211 893 -976 52 640 115 -143 592 -582 -242 -297 -138 -337 -232 -201 314 -128 56 219
1907 219 -378 71 -223 -263 105 -176 -417 277 -216 -51 118 -573 -154 88 -193 305 -25 -229 366 -43
1927 -43 -134 296 -326 13 141 -270 56 90 -340 193 -11 -222 443 -16 -224 618 -439 60 502 -283 206
1948 206 71 -521 473 -132 -304 424 -121 -93 336 -312 266 112 -36 982 -654 -1457 584 65 -751
1967 -751 1018 -76 136 -174 -308 -244 811 -624 444 443 -436 324 -49 -393 470 -410 -388 425 -438 89
1987 89 319 -461 76 177 -433 287 -138 -14 668 -446 -212 557 -343 145 295 -516 413 239 -499 667
$$ packed form
1849b43J83M93q75M14O44j367J050O21j729J385p05m29J002k98k28M67q97N90
1867G8J40r18P66L97j124O01J38l81L69r8M43L41j088L34K63l97L51j96l95M19
1887D3m8k06J104j869J028N88n25k58P35j174L40n5J59j99J05L1N15m42J84J63
1907B19n97M49k94m0L68k81k41O94m93J65J69o91M19K42k81M98l30k04N95m09
1927d3r1M30o22L39J28m11L26L4m30N33k04k11O65m59k08Q42j057M99M42p85M89
1948B06j35n92R94o05j72P28n45K8M29o48N78j54j48J018j636q03K041n19q16
1967g51J769j094K12l10j34O4J055j435J068jq79P60l73l44Q63q80K2Q13q63N27
1987H9K30p80N37J01o10P20m25J24O82j114K34P69r00M88J50q11R29j74p38J166
$$ plain form
2007 667 10 -305 486 -50 -224 619 -327 -98 547 -308 82 351 -547 599 224 -307 747 -335 -321
2026 -321 608 -461 153 381 -376 165 379 -613 405 246 -452 498 -248 -175 584 -271 -136 425 -388 241
2046 241 338 -456 192 -40 -372 423 -190 -210 388 -329 -87 361 -842 192 232 -682 334 -30 -365 478
2066 478 -181 -323 576 -197 -103 238 -474 -154 318 -375 204 259 -513 399 -54 -259 595 -196 -38 557 -211
2087 -211 -272 278 -443 267 213 -232 283 -129 -91 561 171 -601 473 -423 75 404 -451 302 476 -539
2107 -539 79 -214 -520 402 -200 17 537 -248 93 389 -897 171 101 -329 243 -178 150 229 338 -265
2127 -265 -73 416 122 -76 -141 -217 413 -259 -88 100 -364 207 -232 -248 569 -582 160 87 -398 -156 106
2148 106 -455 95 249 -457 -266 -304 147 517 15 -324 8 154 445 -40 -815 442 -68 -120 916 344
$$ packed form
2007F67o57l15P91n36j74Q43r46K29O45q55L90K69q98J146l75n31J054j082J4
2026c21R29j069O14K28p57N41K14r92J018j59o98R50p46P3P59q55J35N61q13O29
2046B41R7p94O48k32l32P95o13k0N98p17K42M48j203J034M0r14J016l64l35Q43
2066D78o59j42Q99p73R4L41p12L20M72o93N79N5p72R12m53k05Q54p91J58N95p68
2087b11o1N50p21P10n4m45N15m12L8O52l90p72J074q96M98L29q55P53J74j015
2107e39O18k93l06R22o02K17N20p85L41K96j286J068p0m30N72m21L28P9J09o03
2127b65J92M89k94j98o5p6O30o72J71J88m64N71m39j6Q17j151P42p3m85K42K62
2148A06n61N50J54p06J91l8M51L70n02l39L32J46K91m85p75J257n10n2J036n72
$$ plain form
2168 344 1124 -119 69 680 -481 817 157 -631 -800 520 392 -277 499 -699 -21 282 1085 1419
2186 1419 1046 -269 -18 277 -442 -1124 12 -116 106 -899 571 124 -624 -547 -479 -402 -127 429 247
2205 247 335 -197 515 -100 -125 20 -270 -30 -113 -348 320 -411 -280 459 -54 -466 336 -152 -510 509 -302
2226 -302 -484 620 160 -138 -251 -1003 470 -400 -703 118 -538 -96 445 -202 -442 657 -27 292 267
2245 267 -985 -100 1051 -466 -346 472 -760 371 -480 -709 482 287 167 325 1 -217 -101 -389
2263 -389 267 -607 -938 -370 227 -429 172 34 -412 633 -495 11 334 -524 135 26 -346 84 216
2282 216 -897 669 23 -437 642 -566 -157 101 -625 336 282 -408 134 248 -133 427 13 -590 302
2301 302 -420 -352 216 -207 60 265 -342 436 13 -456 348 -238 -175 367 -325 34 171 -387 -10 345 -615
$$ packed form
2168C44P80j243J88O11j161J298o60p88j69J320j28o69P76j198O78L03Q03L34
2186A419l73j315K51K95p19o82J136j28K22j005J470m47p48P7O8P7K75N56j82
2205B47Q8n32P12o15k5J45k90K40q3k35O68p31J31P39n13m12Q02m88l58J019q11
2226c02j82J104m60k98j13p52J473q70l03Q21o56M42N41o47k40J099o84L19k5
2245B67j252Q85J151j517J20Q18j232J131q51k29J191j95j20J58l24k18J16k88
2263c89O56q74l31N68N97o56O01j38m46J045j128N06L23q58O59j09l72M30J32
2282B16j113J566o46m60J079j208M09K58p26R61n4o90N42J14l81N60m14o03Q92
2301C02p22O8N68m23K67K05o07P78m23m69Q04n86O3N42o92L59J37n58L77L55r60
$$ plain form
2322 -615 366 -36 -527 407 -252 -246 516 -284 -46 526 -260 68 128 -386 146 315 -636 335 18 -454 279
2343 279 -363 -26 315 -400 -23 138 -633 156 145 -204 490 -271 -370 380 -138 -503 135 -114 16 205 -242
2364 -242 119 284 -186 310 79 -306 652 -233 -297 116 -473 -198 619 -638 289 -255 -431 501 655 -191
2384 -191 672 -43 -394 647 -357 -90 191 -354 376 291 -550 607 139 -81 229 -6 -296 539 -179
2403 -179 -360 199 -298 173 290 -194 369 66 -390 222 90 -121 471 -145 -39 453 -133 90 -72 -650
2423 -650 28 199 -389 204 -126 -300 218 108 -315 350 -108 211 233 -468 244 -3 -706 -52 -68 -214 38
2444 38 -321 -231 635 -33 110 268 -174 251 -545 -423 756 -113 -225 69 -64 186 172 -346 -160 487 -266
2465 -266 602 555 115 125 62 -391 481 -379 255 -286 -189 86 309 -457 54 -777 -50 345 606 -125 -531
$$ packed form
2322f15R81m02m91R34o59OP62q00K38N72p86L28O0n14N32J69r51R71l17m72P33
2343B79o42L37L41p15L77J61p71P89j1l49O94p61r9P50n18l65O38k49J30J89m47
2364b42L61J65m70M96k31l85R58q85o4M13n89K75Q17j257R27n44j76R32J54q46
2384a91Q63p15l51J041j004K67K81n45P30q5q41J157m68k20L10k35k90Q35p18
2403a79j81N59m97M71J17m84N63l03m56O12j32k11N92o16J06M92n86K23j62n78
2423f50O78J71n88N93l30j74N18j10m23O65m58L19K2p01P12k47p03O54j6j46K52
2444C8l59R0Q66o68J43J58m42M25p96J22J179q69j12K94j33K50j4n18J86O47p53
2465b66Q68m7m40J0o3m53Q72q60O34n41R7K75K23p66N11q31P27L95K61p31m06
$$ plain form
2486 -531 -669 -135 864 -748 -737 100 -973 34 -370 -1036 -338 -373 104 857 124 781 -370 -256 -166 -1160
2506 -1160 -629 -299 378 -415 1161 180 -854 -452 627 62 396 -658 -19 308 -1905 -54 -165 -309
2524 -309 522 -278 -478 267 -1117 4 323 274 301 38 -447 -359 -465 91 80 -386 -595 -257 -627 -55 -763
2545 -763 5 -187 -273 -322 -114 400 138 132 -297 -602 71 -106 -373 47 -373 -416 87 -318 697 -33 -567
2566 -567 -583 138 -179 -184 -319 -328 327 -275 380 108 -724 182 -10 -453 313 -121 -278 361 -100 113 120 -338
2588 -338 125 181 -202 256 -35 -235 182 -338 -204 217 -488 -245 369 17 99 372 -97 -28 317 -151 123
2609 123 -47 -569 273 -356 -38 528 -327 -37 424 -328 242 96 -376 79 148 -389 223 -302 -111 312
2629 312 -394 103 119 -79 244 408 -250 393 -127 -280 392 33 -157 343 47 -245 316 -333 230 66
$$ packed form
2486e31j38N34R99j612J1Q37j073J007m04o66O98l5M77P53p33O57j151J14R0r94
2506a160N31L30O77p93J576r81j034M02J079n65L34j054O39L27k213J851j11j44
2524c09Q31q00k00P45j384J121L19m9K7k63m85Q8j06N56j1m66k09L38l70N72p08
2545g63P68j92q6m9K08N14k62om29l05O73j77k67M20m20m3N03m05J015p30n34
2566e67j6P21l17nj35rO55o02O55k72q32R06j92m43P66m34j57O39m61K13Pm58
2588c38M63N6l83M58k91k00M17n20J34M21p05K43O14l52Q2K73m69O9L45m68K74
2609A23j70n22Q42o29L18N66q55K90M61p52N70j46m72M55O9n37O12n25J91M23
2629C12p06M97J6j98L23J64o58O43n20j53O72l59j90N00k96k92N61o49N63j64
$$ plain form
2649 66 -389 326 15 -258 627 -94 -192 133 -227 -231 395 -289 172 -46 -297 257 239 -332 263 -14 -487 112
2671 112 -280 -212 173 -144 282 143 -410 172 277 -198 479 -289 -241 248 -348 -46 375 -252 34 357 -372
2692 -372 242 208 -151 311 -189 -30 390 -296 -122 283 -123 143 318 -151 346 136 -335 422 -111 -514
2712 -514 368 -191 -208 168 -74 232 125 -620 104 43 -242 253 23 -243 261 -555 20 311 -478 138 188
2733 188 -289 269 120 -127 133 -55 -199 114 -228 -169 278 -509 256 70 -269 256 58 -378 208 127 -83
2754 -83 233 -316 -99 298 -77 99 326 -78 -67 335 -298 176 87 -141 448 -30 -178 165 74 166 -26 -158
2776 -158 168 129 -145 145 -54 -130 505 -61 110 328 -323 97 241 -253 136 -14 -112 228 130 -106 282
2797 282 -228 142 285 -190 -108 144 -257 39 184 -362 282 -78 -143 166 -234 9 163 -182 -44 275 -264
$$ packed form
2649F6m55P15l11k73Q85p21r8L25l60mO26o84M61k18k51N54j8n71N95k77m73N99
2671A12l92O8L85l17M26j39n53N82J05m75O77p68M8M89n96L02M21o27K86L23p29
2692c72O14l4l59M62n00J59M20o86J74M05m06K66J75m69M97k10m71P57n33m03
2712e14Q82n59j7L76k42L06j07p45P24o1k85M95k30k66N04q16N75K91p89O16N0
2733A88m77N58j49k47K60j88j44L13l42N9M47p87P65j86l39N25j98m36N86q1k10
2754h3L16n49K17L97l75J76K27m04J1M02o33M74q9k28N89m78j48L43r1R2j92j32
2776a58L26l9k74K90j99p6O35n66J71K18o51M20J44m94L89j50r8L40r8k36L88
2797B82n10L70J43m75Q2K52m01K96J45n46O44l60o5L09m00K43J54l45J38L19n39
$$ plain form
2818 -264 -130 151 -75 152 117 -371 103 36 -111 168 -96 -222 110 -302 124 104 -370 -20 -185 1 -62
2839 -62 -177 -214 68 -241 -29 137 -192 251 218 -136 175 58 -278 263 -111 129 95 33 -145 130 -297 -97
2861 -97 147 -195 20 -21 -80 72 27 -29 249 -86 169 146 24 281 19 -79 376 -3 -102 73 -215 -94 322
2884 322 -116 209 186 -149 86 -16 -389 121 54 -17 148 -229 0 478 -110 62 271 -93 307 133 -56
2905 -56 258 -121 68 74 -81 -23 165 -152 88 263 124 111 41 -16 97 161 -325 354 -253 57 223 10 407
2928 407 -127 -196 -31 234 -179 87 -291 410 305 243 -66 281 -91 -438 704 378 182 -276 -413 468
2948 468 -63 -206 467 -134 30 412 -271 314 457 155 -37 263 210 -489 14 -65 517 419 -175 694 -504
2969 -504 -216 421 359 33 89 269 390 726 -178 145 180 -8 264 -212 -403 295 -132 368 279 -39 258
$$ packed form
2818b64J34K81k26K27l5m88M74o7j47K79k64j26L32m12M26k0m74L50j65J86o3
2839f2j15l7K82l09K12J66l29M43l3l54L11j17l36N41l74K40l4o2j78K75m27K00
2861i7K44l42K15m1n9J52m5n6K78l35K55k3j22K57k62r8M55l79r9J75k88J21M16
2884C22m38L25k3l35K35j02l73N10o7p1J65l77K29M78n88J72K09l64M00j74j89
2905e6L14l79J89Oj55N8J88l17K40J75j39j3p0n7J13O4m86O79o07L10J66k13L97
2928D07n34o9J65K65m13K66l78P01j05o2l09L47l72l47J142l26j96m58j37Q81
2948D68n31j43O73o01J64L82o83N85J43l02j92L00n3o99N03p9N82r8n94Q69j198
2969e04K88O37o2l26N6J80J21L36r04L23L5j88K72m76j91O98m27N00q9l18K97
$$ plain form
2990 258 126 -119 52 -111 -114 198 -3 -164 120 -279 -158 251 -251 144 -81 -137 -34 154 -38 122 13
3011 13 -167 45 -157 -55 -8 -194 210 -95 93 -162 -71 -157 337 -14 309 -37 -20 261 446 148 61 -13
3033 -13 -241 82 185 359 303 -479 -330 125 46 -467 -574 -359 -497 -48 386 -10 -227 -48 155 -166 95
3054 95 33 -330 -139 -36 -283 -35 53 -178 235 200 -124 120 -60 -317 -111 -493 64 60 -375 -8 286 -46
3076 -46 48 -221 -196 -40 11 -166 167 -104 208 78 -87 82 -28 -119 43 104 2 108 -50 -75 245 -65
3098 -65 -241 -15 -131 75 -12 -90 -72 -145 -152 -44 -209 -32 163 -57 -210 82 -109 -2 291 -2 56 108 -71
3121 -71 -27 -181 -232 175 -120 41 104 -199 143 199 -56 159 36 -10 57 -128 -12 217 -25 -193 27 -105
3143 -105 -47 17 -168 236 208 120 121 9 53 321 -103 88 93 -49 102 86 -11 -138 264 -35 87 155 -262 72
$$ packed form
2990B58j32k45J71j63lL12k01j61K84l99J21M09n02L95k25n6J03J88j92J60j09
3011A3j80K12k02J02M7j86M04l05J88k55R1q6M94l51L23l46J7K81J85k98q7p4
3033a3k28L23J03J74n6p82J49M55p9n13j07K15j38M49M34l96k17J79K03l21K61
3054I5o2l63J91J03k47K48Q8k31M13l5l24K44j80k57K06l82N57mm35L67K94l32
3076d6R4k69K5J56N1j77L33k71L12j30j65J69j10r1J62O1j02J06j58k5L20l10
3098f5j76K26j16K06q7p8J8p3pJ08j65J77J95k20j53K92j91J07K93k93N8N2j79
3121g1M4j54n1M07k95J61O3l03L42N6k55K15j23m6O7j85J16K29k42j68K20j32
3143a05N8O4j85M04k8q8Jj12M4K68m24J91Nj42J51j6r7j27M02k99J22O8m17L34
$$ plain form
3167 72 93 58 -72 77 -186 -72 -90 381 76 -82 147 -129 -11 139 -170 -7 175 -103 -76 -134 -19 -280
3189 -280 73 75 -126 109 -139 194 -49 -183 -22 -52 75 80 31 106 -199 70 -181 -73 -130 -26 96 -293 -179
3212 -179 210 328 -174 -150 -297 606 -91 48 159 172 -185 -337 198 213 162 -256 244 -265 276 -352 -611
3233 -611 -12 188 221 -372 30 -120 -823 -406 161 -251 -65 54 35 133 182 -28 238 51 85 -402 -146 -126
3255 -126 196 145 -40 -362 192 -79 -24 -41 922 -380 -112 -114 -130 -230 -204 -128 81 -98 61 54 -59 -380 391
3278 391 127 -183 49 648 -125 -105 371 -149 -70 -215 -398 390 -57 -467 -502 14 -413 13 -225 -211 -25
3299 -25 -93 110 -75 -474 -15 57 -170 539 235 413 -15 280 165 -24 -14 -384 86 -49 -75 543 -288 498
3321 498 375 934 275 48 446 132 148 -340 -473 -163 -464 293 -245 665 24 206 487 -222 -202 148 -488
$$ packed form
3167G2K1l5j30J49k63J14j8M71l05j58K29k76J18J50l09J63J82k78K7n8J15k61
3189b80L53Kk01K35k48L33k43j34J61l0J27Nm9P5l05K69k51J08n7J04J22l89J14
3212a79L89J18n02K4j47R03o97J39J11J3l57j52N35J5n1m18N00n09N41o28k59
3233f11N99K00L3n93M02j50p03M17N67m12J86J19j9R8M9k10K66j87L4m87K56K0
3255a26L22n1j85l22N54k71N5j7R63j302K68kj6j00K6P6K09j79J59pj13l21P71
3278C91k64l10K32N99p73K0M76n20P9j45j83P88m47m10l5N16m27M26k38J4J86
3299b5o8K03j85l99M59P2k27P09l04J78m28K95j15j89J0l70M70j35k6O18q31P86
3321D98j23N59o59k27L98l14J6m88j33L10l01P57n38R10o41J82K81p09K0L50o36
$$ plain form
3342 -488 314 -281 -38 -102 90 99 229 -115 186 -63 -12 264 -39 -244 -49 33 -397 -343 -7 -268 -34 -92
3364 -92 165 137 -50 125 7 56 61 -178 -61 -25 -35 -132 -257 46 -85 433 -43 -114 -99 -25 -279 -57 224 150
3388 150 -160 211 51 26 43 142 -45 -110 -233 -227 -119 -79 13 168 -7 -126 -107 -173 -162 224 -38 59 -182 -141
3412 -141 349 3 90 38 -5 13 88 -73 72 -46 2 94 -33 5 57 54 -61 -15 6 -108 213 79 -129 -205 183
3437 183 -276 60 23 -76 -36 -47 83 -1 107 -104 -62 52 -60 124 -343 -252 -117 3 466 48 -370 237
3459 237 167 -37 -55 45 136 -80 -56 -16 55 -89 -57 -157 102 -20 -163 52 154 -27 -13 -98 91 136 99 62
3483 62 53 171 -98 -279 -77 -29 94 -57 -67 61 -68 213 -44 11 80 -77 1 -97 -54 -334 -205 19 19 -19
3507 -19 60 56 98 -60 -114 102 -126 268 28 -197 -348 32 -86 5 -5 -40 -20 -59 -3 8 41 226 79 -30 78
$$ packed form
3342d88Q02n95K43o4J92RJ30l44L01k49N1K76l03k05J95Q2m30N4L36k61K34n8
3364i2K57k8j87J75j18M9Nk39J17L6j0r7j25L03j31N18m76p1J5P4k54K22K81p4
3388A50l10L71j60k5J7R9j87o5j23OJ08M0R2J55j75j19J9o6J1L86k62R7k41M1
3412a41M90l46Q7n2m3J8P5j61J45j18M8R2j27L8N2lj15M6K1j14L21j34k08p6L88
3437A83m59L36l7r9M0j1J30q4J08k11M2J14j12J84m67R1J35J20M63m18m18O07
3459B37p0k04j8J00R1k16K4M0P1j44L2j00K59j22j43K15J02j81J4q5J89M5l7l7
3483F2rJ18k69j81K02M8J23j51j0J28j29K81k57N5O9j57P8r8M3k80J29K24%l8
3507a9P9mM2j58n4K16k28L94k40k25j51L80j18R1j0l5K0l9N6J1L3J85j47j09J08
$$ plain form
3532 78 46 -30 -40 96 11 -178 54 -33 -115 126 -156 236 177 36 52 46 -152 91 -44 217 -42 -25 -238 -33
3556 -33 -70 -24 219 118 340 17 -39 258 -228 5 104 47 44 1 75 23 -2 -75 56 -9 7 -31 -81 233 147 -75
3582 -75 84 198 47 -18 -57 -42 -60 34 -10 84 -15 -110 32 -42 -88 142 70 -98 147 -75 -176 -48 -68 162 -252
3607 -252 60 -190 35 150 -48 257 186 103 -92 38 93 -166 -122 -295 89 -161 -91 175 -46 -127 -302 236
3629 236 -115 -191 62 84 7 -59 20 -112 -13 65 -62 -165 79 65 -201 73 -100 -121 164 -25 -11 -152 187
3652 187 95 106 22 -266 268 -726 -271 245 62 500 -291 233 41 -377 371 118 39 437 -178 -414 277
3673 277 517 -369 436 -619 200 94 -784 276 -418 -25 443 137 -264 -351 91 -317 -555 -110 144 335
3693 335 -641 97 -101 -70 -2 293 -143 185 163 221 -191 -174 -309 117 108 85 321 -77 -70 -2 -434 259 -125 21
$$ packed form
3532G8l2p6j0J36q5j89K32q7q2K41k82L92n9j41J6oj98K43j35K61k59J7k13K05
3556c3l7M6K43j01K22l23n6K97m86K33R9n7lm3P4n2k5p3J31o5J6l8n0L14q6k22
3582g5J59J14j51o5l9J5j8R4m4R4r9r5J42p4m6K30p2j68K45k22j01J28k0K30m14
3607b52L12k50K25J15j98L05p1q3j95J30N5k59M4j73L84k50P0K66k21q1j75N38
3629B36l51p6K53K2p7o6P9j32R9P8j27j03K44j4k66K74j73k1K85j89J4j41L39
3652A87r2J1q4k88N34r94M55N16j83M38p91N24j92m18P48k53p9L98o15k36O91
3673B77K40q86Q05j055Q19j06q78J060o94L93M68l06m01q7M42m08k38M45K54J91
3693C35r76P38j98L1O8K95m36L28k2N8m12J7j35M26rk3K36l98PO8m32O93l84J46
$$ plain form
3717 21 196 -385 41 253 -26 -256 22 -144 -152 -119 99 -17 -139 -154 -124 -222 -167 -139 -34 -2 -57 106 -227 100
3741 100 -14 -39 -2 230 -51 -70 -72 79 -180 -149 -91 72 62 109 -70 -48 116 15 -106 147 115 32 38 -70 244
3766 244 -11 -222 117 -167 184 222 -178 -98 -16 194 241 -72 -128 -68 183 -70 81 -41 38 -161 -131 15 -64
3789 -64 -48 -139 -49 -72 -47 -164 65 137 86 190 113 -90 143 -61 -165 47 -68 -14 -246 186 73 -184 -8
3812 -8 -84 -118 -75 74 33 47 -30 66 66 -25 -126 176 -72 173 262 -118 -108 91 -31 -175 -96 -148 172 27 136
3837 136 -79 88 -202 -197 -269 -135 -127 -63 -43 3 36 87 205 180 37 51 82 -98 177 8 50 95 237 239 -83 -177
3863 -177 107 -309 45 -354 -100 79 15 -24 -51 33 -121 235 -182 -6 -13 2 13 -82 69 121 23 58 233 86
3887 86 82 -48 -286 -72 -31 66 -82 36 1 171 -248 111 11 223 44 173 53 31 -113 -154 202 127 -100
$$ packed form
3717B1J75n81M26K12k79k30K78j66qL3K18j16j22j5L0r8N5K8J05L2n5J63l33L27
3741A00j14k5L7K32k81j9kJ51k59L1N8J63j0M7j79K2J64j01j21K53l2q3Oj08L14
3766B44k55k11L39k84L51L8m00Q0Q2K10M7l13n6O0K51k53J51j22P9j99L0J46p9
3789f4J6r1R0k3K5j17K29P2n1J04p7k03K33k04j04K12j15N4k32M32j13k57J76
3812hp6l4M3J49m1J4p7R6%r1j01L02k48K45Q9l80J0J99j22j44P9n2L20j45J09
3837A36k15J67k90Np2J34QO4K0M6L3N1J18k5j43J4L1j80K75j69M2M5J42Kl22r4
3863a77K84m16L54l99K54J79o4l9k7Q4j54L56m17J76pJ5J1r5J51N2r8L5J75j47
3887H6mj30k38K14M1R7j48J18l5J70m19L59j00K12j79J29j20k2j44m1L56p5k27
$$ plain form
3910 -100 -172 53 -65 36 130 187 -64 207 -55 79 -53 -92 80 174 -109 -76 -93 190 -56 -35 -28 119 19
3933 19 112 53 -87 349 191 88 -124 -143 82 -152 -17 68 248 273 41 -163 -33 -33 -116 4 55 5 181 -99
3957 -99 87 55 -87 400 201 -26 113 -56 24 280 -187 80 173 -24 -50 67 112 -204 25 -35 55 191 -236
3980 -236 46 140 21 278 -32 217 209 -234 -67 123 54 11 -307 -87 129 51 -6 287 147 -75 191 -152
4002 -152 -135 95 -96 -33 69 94 -41 175 -16 101 141 -363 180 35 -109 61 16 -54 -7 123 91 244 -283
4025 -283 -172 176 53 -9 -71 -274 -68 -125 -40 -131 146 145 23 -51 101 -96 -137 66 -110 75 65 -4 105 -145
4049 -145 185 15 -4 -171 -202 114 -221 -31 46 133 52 50 -116 -120 -244 152 112 -24 99 -30 177 -170 14
4072 14 -71 40 -17 72 -97 12 -58 26 21 -124 -222 -13 -110 -7 -82 43 323 -264 193 25 3 137 -56 -93
$$ packed form
3910a00p2K25j18J01R4N7k51K71k62J34j32l9J72R4k83L3j7K83k46K1PJ47j00
3933A9R3n9j40M36j58j03k12j9K25k34J35Q5J80K5k32k04J30%q3J20N1n0J76k80
3957i9J86l2j42M87j99k27J39j69Q0K56m67K67R3j97k6J17M5l16K29o0R0J36m27
3980b36K82R4j19K57l10K49qm43J67J90o9m3l18K20K16p8n7K93j40k22K66l43
4002a52J7K30j91O3J02K5j35K16j91J17M0n04N43j45j44J70m5p0M7J30l2J53n27
4025b83J11L48j23o2o2k03K06n7Q5r1K77jj22p4J52j97m1K03j76J85j0o9J09k50
4049a45L30j70j9j67l1L16l35J90P7Q7q1kj66mj24L96m0j36J23j29K07l47J84
4072A4q5J11n7Q9j69J09p0Q4nj45r8K09r7J03p5J25K80n87M57j68k2J34j93l7
$$ plain form
4096 -93 -127 86 76 -146 -87 45 119 21 -158 -84 91 -132 -128 -56 255 -291 167 5 -130 -10 -84 187 40 2
4120 2 48 140 -4 -74 114 -202 2 200 10 -86 182 -73 161 -3 113 124 -145 59 38 -79 -151 -7 -197
4143 -197 6 -37 18 -135 81 14 4 -255 -153 122 -52 -233 -42 55 140 118 125 -163 1 -30 267 -10 184
4166 184 358 72 -137 8 -72 -355 285 -92 444 -58 -339 -9 -99 34 -28 82 -45 38 -360 -570 -284
4187 -284 -703 -83 -135 22 -76 126 55 -86 387 -151 570 231 293 778 121 -273 176 177 -593 240 518 -48
4209 -48 377 497 -39 -277 -448 -93 444 -79 -237 -165 676 534 -361 -270 -55 -136 5 104 33 -160 -95 -234
4231 -234 121 116 -318 -1 -36 -397 58 55 -19 -114 219 -150 234 -112 -64 61 169 -52 396 -50 -39 1 161
4254 161 149 137 -47 41 1 131 264 -25 -375 -105 652 655 446 629 368 -171 -186 481 146 -61 -362 550
$$ packed form
4096i3l4K13j0k22N9J32P4r8j79P4J75k23MP2L11n46M58j62j35J20p4K71j47l8
4120BM6R2j44p0J88l16K04J98j90r6K68k55K34j64J16J1k69K04k1j17p2J44j90
4143a97K03m3N5j53K16o7j0k59J02K75j74j81J91R7Q5k2Pk88J64l1K97k77J94
4166A84J74k86k09J45q0k83O40l77N36n02k81L30r0J33o2J10j27Q3l98k10K86
4187b84m19O20n2J57r8K02p1j41M73n38P21l39O2M85o57l94M49Jp70Q33K78n66
4209d8M25J20n36k38j71L55N37n23j58P2Q41j42q95R1K15q1J41R9p1j93O5j39
4231b34L55nm34L17l5l61M55lp4r5L33l69L84l46M8J25J08k21M48m46J1M0J60
4254A61j2j2j84Q8m0J30J33k89l50K70P57Lk09J83k61n39j5O67l35k07l01R12
$$ plain form
4276 550 409 183 236 -431 -60 297 -158 -241 18 -167 285 323 50 -329 130 -25 99 81 174 332 188 315
4298 315 133 -119 256 119 -82 -279 106 4 31 165 -72 -6 88 24 106 -41 16 -38 29 -103 83 6 -25
4321 -25 -121 28 67 -110 -82 -78 0 249 -108 -120 -103 120 15 -33 -115 -202 -171 -64 -17 -198 13 5 47 164 -25 -219
4347 -219 29 -86 -57 -186 -68 132 -64 34 -23 -129 -250 23 -25 -206 56 35 -156 -102 -173 -130 -91 46 -32
4370 -32 360 10 273 -16 -107 5 -135 -238 -57 -141 2 61 -131 77 7 168 74 311 42 66 -78 -25 -50
4393 -50 -281 118 -141 252 -98 -143 29 -143 -36 -63 226 -49 68 100 -34 114 -244 119 100 -113 -134 45
4415 45 -54 -138 170 -25 163 63 -62 257 -46 233 100 -30 -192 -28 -23 -146 215 230 75 -19 68 -93 79
4438 79 -228 -118 69 -300 110 -41 -107 94 4 -14 -40 86 41 -28 -151 112 -59 -13 25 40 -68 187 -192
$$ packed form
4276E50j41k26N3o67L71L57m55q3K59j85M52L8k73l79M59j55J24j8R3J58j44J27
4298C15j82k52L75j37k01j97L85j02K7J34k37O6R4o4Q2j47N7n4O7j32J86p7l1
4321b5r6J49L9j77K8MP8K49l57j2J7K23j05m8q2q7L1J07M7j81K11qM2J17j89j94
4347b19K48j15K9j29J18K00j96R8n7j06j21K73m8j81K62k1j91N4p1M3L9J37p8
4370c2L92l50K63k89r1J12j40j03J81q4J43N9j92K08p0J61r4K37k69K4j44N3k5
4393e0k31L99k59L93l50m5J72j72J07k7K89k75J17L2j34J48l58L63j9k13k1J79
4415D5r9q4L08j95J88j00j25L19l03K79j33j30j62J64Nj23L61J5j55r4Q7j61J72
4438G9l07J10J87l69M10j51o6K01r0j8k6J26m5o9j23K63j71M6L8J5j08K55l79
$$ plain form
4461 -192 -130 56 -30 164 -22 39 90 313 130 -15 -48 -43 68 113 -55 52 25 33 68 33 129 -13 73 35 28 36 13
4488 13 98 -53 94 -210 -115 168 44 -140 -98 95 107 -54 -106 -56 -79 216 -24 -43 -14 138 8 165 -48
4511 -48 -30 -230 -17 63 -168 113 -291 -81 -21 70 161 -24 11 26 -35 -42 -120 214 233 65 -11 365 -104 -8 -75
4536 -75 97 -40 -246 125 9 43 73 163 -119 -99 176 9 127 65 -221 159 90 1 89 -120 81 82 120 318
4560 318 19 -6 124 -49 59 193 -30 54 -144 100 136 53 165 115 89 9 43 44 63 -126 94 -202 28 129
4584 129 5 -22 -53 41 218 217 100 93 -44 -86 -31 -144 -291 -67 176 53 -196 230 -91 -46 -47 -110 -53 204 -176
4609 -176 213 36 41 124 -72 74 51 -6 -134 -290 -6 30 24 209 -236 234 13 -79 -171 28 -102 18 234
4632 234 99 -59 155 -295 4 116 235 52 23 99 183 -125 -189 -157 -195 79 -19 -4 103 -146 -64 -75 174
$$ packed form
4461a92O2J86q6J94j86O1N1K23j83j45l3NJ11M5j68J07k7QL5l5R6j42Q6l8pQk3
4488A3Q5j51J47l04R5K83j24j84M2J93J2j61n2N0k3K95k40j9K9J52j30J57k13
4511d8J8k00K13Q0k31K81m04K10O0R1R1j85L5J5o1pp8L34J9j68p6L76m69R6o7
4536g5J72j37k06L71j16L4L0R0k82K0K75j67J18o2k86L80o9q9Q8k09K01JL8J98
4560C18k99k5J30j73J08J34k23Q4j98K44L6q3J12n0k6q0L4JJ9j89K20k96K30J01
4584A29j24k7l1R4J77jj17pj37m2N5j13j47K24K43j23k49M26l21M5jo3N7K57l80
4609a76L89j77NQ3j96J46k3n7j28j56K84L6oJ85m45M70k21r2r2J99j30J20K16
4632B34j35j58K14m50K99J12J19j83k9P6Q4l08o4L2l8K74r8J5J07k49Q2j1K49
$$ plain form
4655 174 -106 50 33 89 -92 -283 -253 -50 15 -123 191 108 -180 13 -105 137 49 -4 -158 -134 48 -150 -255
4678 -255 -82 39 -117 -114 96 73 102 -8 109 -129 180 5 22 153 -23 156 271 159 29 -254 88 109
4700 109 121 90 5 5 -96 3 -286 -64 -5 1 -4 34 -72 155 8 -17 -292 266 64 -69 139 -5 261 3
4724 3 67 37 -82 238 52 126 -231 -112 -3 11 -81 -273 19 -119 89 247 10 -28 -163 10 -230 -218 108
4747 108 -205 -160 -90 1 11 -71 215 -68 -80 42 93 2 -70 -19 124 -37 134 -48 353 115 219 208 31 -182
4771 -182 69 7 -103 0 -100 283 -34 -4 55 32 15 -11 -17 -133 89 -21 34 67 -425 -67 -93 -366 -37 -88
4795 -88 64 143 32 119 165 -158 -88 -88 64 193 135 -38 -148 -6 15 93 -30 7 220 -33 -154 -59 2 177
4819 177 -36 52 -17 75 158 169 106 20 130 -248 52 -96 -93 270 -138 -88 216 16 -126 -85 54 -183 -216 -20
$$ packed form
4655A74k80J56j7N6j81j91L0K03O5j38L14q3k88J93j18K42q8n3j54K4J82j98j05
4678b55J73J21j56LK10k3K9j10J17k38L09j75J7J31j76J79J15j12j30k83L42K1
4700A09J2l1q5%j01R9k89K22N9OnL8j06K27j47k5k75N58k02j33K08j44K66k58
4724CO4l0j19L20j86P4l57J19J09J4r2j92K92j38K08J58k37l8j35J73k40J2L26
4747A08l13M5P0R1J0q2K86k83j2J22N1r1p2N1J43j61J71j82M01k38J04j1j77k13
4771a82K51o2j10J03j00L83l17L0N9k3j7k6oj16K22j10N5L3m92L58k6k73L29n1
4795h8J52P9j11Q7M6l23P0%J52J29n8j73j10J42K1P8j23L7K13k53j21R5O1J75
4819A77k13Q8o9R2Q3J1o3q6J10l78L00j48LL63m08N0L04k00j42M1J39k37l3J96
$$ plain form
4843 -20 -115 28 198 154 46 -197 -237 193 -109 -46 38 -103 89 71 -107 36 192 200 257 -84 -43 43 -53 51
4867 51 165 -76 -33 -80 53 -65 5 -101 89 -107 -98 -39 -187 -114 -85 -110 -35 -93 -31 -134 84 -91 -130 65 75
4892 75 201 136 86 113 21 12 43 29 28 111 -254 -34 -61 -129 104 21 -10 136 -22 -102 192 -1 97 84 -175 -96 -69
4919 -69 -63 -79 -151 36 -230 68 84 -65 -94 69 -153 29 86 -26 83 0 153 -35 226 -128 -297 199 -54
4942 -54 -162 -22 -100 200 -185 -91 59 268 140 133 -66 40 -50 113 -164 57 140 94 184 37 237 13 -118
4965 -118 137 -56 -69 -54 200 123 -28 107 -99 -111 -36 243 -146 -55 3 155 -76 217 -205 4 -109 -61 82
4988 82 -5 98 11 -92 -82 11 -292 -38 -136 -91 102 -140 67 -44 114 -144 129 243 111 68 87 158 -104
5011 -104 -174 -59 -91 -11 113 -10 -78 88 245 57 73 -34 14 30 15 -133 6 -12 -104 115 -149 153 10
$$ packed form
4843b0r5J43J70m4j08k43m0M30l02O3Q4j41J92j8j78J43J56QN7l41M1Q6r6J04
4867E1J14k41M3m7J33j18P0j06J90j96RN9j48P3K9k5P5n8O2j03K18j75l9J95J0
4892G5J26o5n0K7r2rL1j4jQ3l65K20k7o8K33q3l1J46j58q0K94j93R8j3k59P9K7
4919f9Oj6p2J87k66K98J6j49k9J63k22J82N7j12J09q3J53j88K61l54j69M96k53
4942e4j08J40p8L00l85R4J50K09j28pj99J06r0J63k77K21Q3m6R0j47K00k24j31
4965a18K55j93j3J5K54p7j51J35k06j2P5K79l89R1N8J52k31K93m22K09j13M8J43
4988H2q7J03q7j03J0R3l03K54r8M5J93k42K07j11J58k58K73J14j32m3J9P1k62
5011a04p0J15l2Q0J24j23o8J66J57j88J6j07M8J6j5j48J39j8r2K19k64L02j43
$$ plain form
5034 10 -169 -139 -39 111 49 -10 -50 -162 -125 123 260 -64 46 -7 -92 110 -10 -56 -137 161 -118 -145 126 82
5058 82 21 -74 184 42 75 154 26 -117 -28 -103 2 -158 12 -52 145 -55 1 55 10 -47 -251 -158 111 -178
5082 -178 208 48 27 41 219 -45 -6 182 17 -117 -58 159 -23 91 71 170 -166 -67 -51 -156 21 -285 73
5105 73 -88 -37 -33 48 -165 159 80 148 13 -81 126 -152 -97 258 48 -113 -67 22 -188 -197 61 87 -23 47 59
5130 59 -142 37 7 -105 -33 -87 -59 109 79 137 -6 133 38 114 291 105 -26 85 177 -74 -169 179 78 85
5154 85 -46 30 -38 -4 109 31 -261 56 267 -116 -111 -41 -123 -157 -204 201 -82 42 56 -2 -103 13 -159 -175 -29
5179 -29 -199 -76 -132 108 57 -180 -155 43 216 -172 200 -51 22 273 -137 -10 100 110 54 -24 42 32 -92
5202 -92 77 110 191 -7 188 179 -208 -22 31 75 2 -280 28 251 -53 13 -34 -200 62 -17 14 -4 -72 -28 -85
$$ packed form
5034A0j79L0J00J50o2n9m0j12L7K48J37l24J10n3q5K02j20m6q1K98k79k7K71m4
5058H2o1r5K58j42L3P9j28j43Q9p5J05j60J70o4J97k00N6N4m5n7k04R3K69k89
5082a78L86j60k1J4J78k64L9J88j65j34N9K17j82J14k0R9l36R9J6j05J77l06L58
5105G3j61N1MQ1k13L24p9O8j35r4K07k78N5L55k10j61M6Q9k10rK58K6j10P0J2
5130E9k01J79l0j12P2n4K8J68l0N8j43J39r5P6J77j86j31J11R2k51r5L48j01P
5154H5j31P6o8L4J13p8k92L17K11l83NP0q2l4m7M05k83J24J4n8j01J16j72j6J46
5179b9j70J23n6K40n1k37K5J98J73l88L72k51P3K51m10J27J10J0n6p8O6j0j24
5202i2J69L3Q1j98J95rl87J86N3M4p3k82L08K23l04O6m7j66K62p9L1j8o8M4n7
$$ plain form
5227 -85 -130 150 118 -310 155 -120 -9 -93 84 -97 -103 -104 -11 177 -19 87 65 -14 16 290 374 97 -87 101
5251 101 190 -103 -125 123 -155 -6 -206 185 54 -289 247 29 -39 -14 -8 231 61 -104 -35 99 102 93 373 47
5275 47 -54 68 -211 58 98 -104 -197 244 -166 -16 6 -46 -72 127 -15 -285 -178 60 212 155 104 84 -13
5298 -13 -77 61 -224 17 -87 276 159 41 45 -32 -28 165 84 -214 -210 -152 83 -351 -57 -132 199 -201 -63 -75
5322 -75 20 -107 114 -72 -138 103 5 9 -5 -87 189 90 59 -16 122 106 22 214 -12 -62 13 -121 -32 29 50 -39
$$ packed form
5227h5m5K80l2m28M65k75J11q4J77j81ojR3J88j96J06k2p9L0K74Q4k77j84J88
5251A01Q9k93k2K48k78J49k00L91j31l43N36k18o8K5OK39j70j65O9J34LrK80l26
5275D7j01J22k79K69M0k02r3M41m10J50K2n2k6J99j42k70J07K38J52n7n1k0r7
5298a3o4J38k85K41j04L63j17j18Mp7MJ93q1k98MN8K35m34K94p5L31m00J38j2
5322g5R5j27K21j86o6K41r8Mj4q2K76r9l1p5J38j6q4J92k26n0P5j34Q9O1K1q9
$$ [...]
8191B63
##END NTUPLES=NMR FID
##END=
