##TITLE=1H_ABPB2307
 CDCl3, 8 sc, 
 24.7.2019
##JCAMPDX= 6.0         $$ Bruker NMR JCAMP-DX V2.0
##DATA TYPE= NMR FID
##DATA CLASS= NTUPLES
##ORIGIN= UXNMR, Bruker Analytische Messtechnik GmbH
##OWNER= root
$$ XWIN-NMR		Version 3.5
$$ Wed Jul 24 14:37:11 2019 Russian Standard Time (UT+4h)  she@DPX200
##.OBSERVE FREQUENCY= 200.13155
##.OBSERVE NUCLEUS= ^1H
##.DELAY= (6, 6)
##.ACQUISITION MODE= SIMULTANEOUS
##.ACQUISITION SCHEME= undefined
##.AVERAGES= 8
##.DIGITISER RES= 18
##SPECTROMETER/DATA SYSTEM= spect
##.PULSE SEQUENCE= zg30
##.SOLVENT NAME= CDCl3
##.SHIFT REFERENCE= (INTERNAL, CDCl3, 0, 15.7039)
##AUDIT TRAIL= $$ (NUMBER, WHEN, WHO, WHERE, WHAT)
$$ ##TITLE= Audit trail, XWIN-NMR		Version 3.5
$$ ##JCAMPDX= 5.01
$$ ##ORIGIN= Bruker BioSpin GmbH
$$ ##OWNER= she
$$ F:/spectra/data/she/nmr/H-F/1/audita.txt
$$ ##AUDIT TRAIL=  $$ (NUMBER, WHEN, WHO, WHERE, WHAT)
(   1,<2019-07-24 14:36:16.31 +0400>,<she>,<DPX200>,
      <created by zg, POWCHK disabled, PULCHK disabled
       configuration hash MD5:
       00 E9 B6 7A A2 85 ED C7 34 08 36 98 17 FE 4E 26
       data hash MD5: 16K
       F5 AF 91 24 93 C5 5B 68 21 DE 7B E7 AA 0D 31 2B>)
$$ ##END=
$$ 
$$ hash MD5
$$ 3A 70 88 81 C7 CD 60 FD 9C 7D 18 7A 79 05 CB 67
##$RELAX= 
##$RELAX= 
##$RELAX= 
##$RELAX= 
##$RELAX= 
##$RELAX= 
$$ Bruker specific parameters
$$ --------------------------
##$DU= <F:/spectra>
##$EXPNO= 1
##$NAME= <H-F>
##$PROCNO= 1
##$TYPE= <nmr>
##$USER= <she>
##$AMP= (0..31)
100 100 100 100 100 100 100 100 100 100 100 100 100 100 100 100 100 100 
100 100 100 100 100 100 100 100 100 100 100 100 100 100 
##$AQSEQ= 0
##$AQ_mod= 1
##$AUNM= <au_zg>
##$AUTOPOS= <>
##$BF1= 200.13
##$BF2= 200.13
##$BF3= 200.13
##$BF4= 200.13
##$BF5= 200.13
##$BF6= 200.13
##$BF7= 200.13
##$BF8= 200.13
##$BYTORDA= 1
##$CFDGTYP= 0
##$CFRGTYP= 5
##$CHEMSTR= <none>
##$CNST= (0..31)
1 1 145 1 1 1 1 1 1 1 1 1 1 1 1 1 1 1 1 1 1 1 1 1 1 1 1 1 1 1 1 1 
##$CPDPRG= <>
##$CPDPRG1= <>
##$CPDPRG2= <>
##$CPDPRG3= <>
##$CPDPRG4= <mlev>
##$CPDPRG5= <mlev>
##$CPDPRG6= <mlev>
##$CPDPRG7= <mlev>
##$CPDPRG8= <mlev>
##$CPDPRGB= <>
##$CPDPRGT= <>
##$D= (0..31)
0 1.2 0 0 0 0 0 0 0 0 0 0.03 0 0 0 0 0 0 0 0 0 0 0 0 0 0 0 0 0 0 0 0 
##$DATE= 1563964575
##$DBL= (0..7)
120 120 120 120 120 120 120 120 
##$DBP= (0..7)
150 150 150 150 150 150 150 150 
##$DBP07= 0
##$DBPNAM0= <>
##$DBPNAM1= <>
##$DBPNAM2= <>
##$DBPNAM3= <>
##$DBPNAM4= <>
##$DBPNAM5= <>
##$DBPNAM6= <>
##$DBPNAM7= <>
##$DBPOAL= (0..7)
0.5 0.5 0.5 0.5 0.5 0.5 0.5 0.5 
##$DBPOFFS= (0..7)
0 0 0 0 0 0 0 0 
##$DE= 6
##$DECBNUC= <off>
##$DECIM= 24
##$DECNUC= <off>
##$DECSTAT= 4
##$DIGMOD= 1
##$DIGTYP= 9
##$DL= (0..7)
0 120 120 120 120 120 120 120 
##$DP= (0..7)
150 150 150 150 150 150 150 150 
##$DP07= 0
##$DPNAME0= <>
##$DPNAME1= <>
##$DPNAME2= <>
##$DPNAME3= <>
##$DPNAME4= <>
##$DPNAME5= <>
##$DPNAME6= <>
##$DPNAME7= <>
##$DPOAL= (0..7)
0.5 0.5 0.5 0.5 0.5 0.5 0.5 0.5 
##$DPOFFS= (0..7)
0 0 0 0 0 0 0 0 
##$DQDMODE= 0
##$DR= 18
##$DS= 0
##$DSLIST= <SSSSSSSSSSSSSSS>
##$DSPFIRM= 0
$$ [...]
##$SUBNAM2= <"">
##$SUBNAM3= <"">
##$SUBNAM4= <"">
##$SUBNAM5= <"">
##$SUBNAM6= <"">
##$SUBNAM7= <"">
##$SUBNAM8= <"">
##$SUBNAM9= <"">
##$SW= 24.9336996594482
##$SWIBOX= (0..15)
0 0 2 0 0 0 0 0 0 0 0 0 0 0 0 0 
##$SW_h= 4990.01996007984
##$TD= 16384
##$TD0= 1
##$TE= 0
##$TE2= 300
##$TE3= 300
##$TEG= 300
##$TL= (0..7)
0 120 120 120 120 120 120 120 
##$TP= (0..7)
150 150 150 150 150 150 150 150 
##$TP07= 0
##$TPNAME0= <>
##$TPNAME1= <>
##$TPNAME2= <>
##$TPNAME3= <>
##$TPNAME4= <>
##$TPNAME5= <>
##$TPNAME6= <>
##$TPNAME7= <>
##$TPOAL= (0..7)
0.5 0.5 0.5 0.5 0.5 0.5 0.5 0.5 
##$TPOFFS= (0..7)
0 0 0 0 0 0 0 0 
##$TUNHIN= 0
##$TUNHOUT= 0
##$TUNXOUT= 0
##$USERA1= <user>
##$USERA2= <user>
##$USERA3= <user>
##$USERA4= <user>
##$USERA5= <user>
##$V9= 5
##$VALIST= <valist>
##$VCLIST= <CCCCCCCCCCCCCCC>
##$VD= 0
##$VDLIST= <DDDDDDDDDDDDDDD>
##$VPLIST= <PPPPPPPPPPPPPPP>
##$VTLIST= <TTTTTTTTTTTTTTT>
##$WBST= 1024
##$WBSW= 4
##$XGAIN= (0..3)
0 0 0 0 
##$XL= 0
##$YL= 0
##$YMAX_a= 16889
##$YMIN_a= -18225
##$ZGOPTNS= <>
##$ZL1= 120
##$ZL2= 120
##$ZL3= 120
##$ZL4= 120
##$ABSF1= 10
##$ABSF2= 0
##$ABSG= 5
##$ABSL= 3
##$ALPHA= 0
##$AQORDER= 0
##$ASSFAC= 0
##$ASSFACI= 0
##$ASSFACX= 0
##$ASSWID= 0
##$AUNMP= <proc_1d>
##$AZFE= 0.1
##$AZFW= 0.1
##$BCFW= 1
##$BC_mod= 2
##$BYTORDP= 1
##$COROFFS= 0
##$CY= 11.3945322036743
##$DATMOD= 1
##$DC= 2
##$DFILT= <>
##$DTYPP= 0
##$F1P= 18.9103706918063
##$F2P= -1.10871071338519
##$FCOR= 0.5
##$FTSIZE= 0
##$FT_mod= 4
##$GAMMA= 1
##$GB= 0.15
##$INTBC= 1
##$INTSCL= 1
##$ISEN= 128
##$LB= 0.24
##$LEV0= 0
##$LPBIN= 0
##$MAXI= 10000
##$MC2= 0
##$MEAN= 0
##$ME_mod= 0
##$MI= 1.114404
##$NCOEF= 0
##$NC_proc= 0
##$NLEV= 6
##$NOISF1= 3.799351
##$NOISF2= 2.8
##$NSP= 1
##$NTH_PI= 0
##$NZP= 0
##$OFFSET= 15.70392
##$PC= 1
##$PHC0= -8938.834
##$PHC1= 11.00096
##$PH_mod= 1
##$PKNL= yes
##$PPARMOD= 0
##$PSCAL= 0
##$PSIGN= 0
##$REVERSE= no
##$SF= 200.130013532006
##$SI= 16384
##$SIGF1= 3
##$SIGF2= 2
##$SINO= 400
##$SIOLD= 16384
##$SREGLST= <1H.CDCl3>
##$SSB= 0
##$STSI= 0
##$STSR= 0
##$SW_p= 3612.71676300578
##$SYMM= 0
##$S_DEV= 0
##$TDeff= 0
##$TDoff= 0
##$TI= <>
##$TILT= no
##$TM1= 0
##$TM2= 0
##$TOPLEV= 0
##$USERP1= <user>
##$USERP2= <user>
##$USERP3= <user>
##$USERP4= <user>
##$USERP5= <user>
##$WDW= 1
##$XDIM= 8192
##$YMAX_p= 0
##$YMIN_p= 0
$$ End of Bruker specific parameters
$$ ---------------------------------
##NTUPLES= NMR FID
##VAR_NAME=  TIME,          FID/REAL,        FID/IMAG
##SYMBOL=    X,             R,               I
##VAR_TYPE=  INDEPENDENT,   DEPENDENT,       DEPENDENT
##VAR_FORM=  AFFN,          ASDF,            ASDF
##VAR_DIM=   8192,          8192,            8192
##UNITS=     SECONDS,       ARBITRARY UNITS, ARBITRARY UNITS
##FACTOR=    0.0002004,     1,               1
##FIRST=     0,             0,               0
##LAST=      1.6414764,     0,               0
##MIN=       0,             -18225,          0
##MAX=       1.6414764,     16889,           0
$$ Real data points
##PAGE= N=1
##DATA TABLE= (X++(R..R)), XYDATA
0 0 0 0 0 0 0 0 0 0 0 0 0 0 0 0 0 0 0 0 0 0 0 0 0 0 -4 7 -8 8 -8 8 -8 8 -8 10 -12 16 -16 16 -18 21 -24 25 -28 32 -36
45 -36 39 -44 50 -53 60 -69 79 -94 110 -132 165 -215 299 -474 966 -5043 -18225 1240 13067
64 13067 -3486 -11714 7348 14014 -6775 -14857 5304 12732 -5975 -11778 6757 10368 -8621
77 -8621 -10652 9985 12121 -8784 -11780 7246 8665 -9240 -7917 11605 9762 -10905 -10393 9038
91 9038 8600 -8656 -6285 10493 6131 -11765 -7436 10821 7638 -8694 -4922 9453 3295 -11400
105 -11400 -3926 11896 5041 -10453 -4308 9545 2710 -9889 -1444 11408 2057 -11858 -3655
118 -3655 9725 2687 -8352 -168 9814 -198 -11327 -1766 9659 1573 -8170 43 8282 -1158
132 -1158 -9256 883 9451 -435 -9102 -16 7787 -1037 -7530 2341 8836 -1775 -9323 345 7820
147 7820 -597 -6583 2154 7276 -2426 -7976 1795 7860 -1013 -6583 1669 6032 -2800 -6606 3201
162 3201 7737 -1963 -7030 1615 5829 -2708 -5983 3491 6962 -2921 -7061 2283 6321 -2531 -5918
177 -5918 3031 5836 -3687 -6503 3393 6625 -2934 -6088 2943 5227 -4123 -5765 4440 6380 -3988
192 -3988 -6258 3607 5389 -4288 -5216 5054 5688 -5121 -5998 4742 5633 -4681 -4909 5439 4935
207 4935 -5859 -5169 5930 5277 -5572 -4640 5905 4263 -6296 -4005 6891 4347 -6738 -4188
221 -4188 6534 3623 -6714 -3022 7415 3200 -7507 -3284 7122 2719 -7193 -2196 7486 1930
235 1930 -7731 -1893 7584 1499 -7667 -1294 7445 678 -7682 -393 7846 232 -7910 -262 7451
250 7451 -327 -7442 809 7663 -948 -7639 1011 7340 -1343 -7071 1899 7183 -2108 -7110 2357
265 2357 7082 -2397 -6700 2827 6654 -3055 -6449 3413 6479 -3433 -6173 3686 5994 -3849 -5713
280 -5713 4179 5619 -4343 -5467 4427 5216 -4561 -4945 4746 4678 -5023 -4642 5026 4371 -5164 -4210 5170
297 5170 3854 -5406 -3769 5378 3476 -5488 -3340 5413 3021 -5536 -2810 5589 2604 -5633 -2426
312 -2426 5621 2237 -5571 -1955 5656 1819 -5583 -1520 5687 1443 -5566 -1148 5679 1082 -5554
327 -5554 -799 5667 764 -5527 -533 5540 432 -5433 -178 5459 57 -5391 118 5354 -321
342 -321 -5360 437 5286 -626 -5312 697 5176 -952 -5267 965 5093 -1231 -5124 1299 4978
357 4978 -1548 -5041 1588 4877 -1812 -4865 1925 4760 -2089 -4723 2214 4619 -2371 -4527 2571
372 2571 4523 -2619 -4388 2798 4362 -2842 -4173 3036 4182 -3005 -3936 3214 3862 -3272 -3637 3491
388 3491 3637 -3502 -3407 3675 3342 -3782 -3245 3853 3108 -3904 -2963 3979 2772 -4109 -2724 4071 2474
405 2474 -4251 -2401 4239 2194 -4397 -2195 4278 1898 -4427 -1812 4403 1598 -4507 -1497 4459
420 4459 1246 -4579 -1130 4624 1016 -4618 -837 4685 720 -4649 -535 4711 484 -4573 -202
435 -202 4682 128 -4598 96 4661 -156 -4533 418 4619 -488 -4525 674 4516 -807 -4461
450 -4461 1006 4482 -1096 -4455 1195 4347 -1381 -4357 1416 4275 -1547 -4221 1598 4027 -1835
465 -1835 -4051 1864 3890 -2061 -3832 2128 3686 -2358 -3720 2382 3569 -2521 -3522 2600 3418
480 3418 -2707 -3357 2764 3251 -2846 -3126 2975 3120 -2973 -2926 3113 2856 -3131 -2662 3323 2673 -3268
497 -3268 -2468 3398 2378 -3446 -2193 3620 2157 -3608 -2001 3709 1896 -3754 -1764 3796 1616
512 1616 -3867 -1524 3894 1391 -3954 -1325 3885 1061 -4002 -975 4001 793 -4075 -764 3933
527 3933 495 -4043 -357 4053 223 -4107 -173 4016 -30 -3989 175 3997 -271 -3966 398
542 398 3927 -438 -3781 662 3741 -776 -3636 1003 3727 -971 -3566 1121 3502 -1227 -3336
557 -3336 1485 3425 -1481 -3369 1493 3245 -1543 -3042 1741 3000 -1864 -3012 1818 2886 -1846
572 -1846 -2748 1897 2521 -2138 -2555 2165 2497 -2205 -2491 2067 2199 -2259 -2133 2368 2094 -2432 -2160
589 -2160 2289 1971 -2268 -1752 2424 1678 -2552 -1742 2524 1757 -2328 -1496 2397 1343 -2524 -1279 2687
606 2687 1463 -2478 -1329 2433 1179 -2439 -967 2693 1103 -2666 -1165 2501 1080 -2354 -796
621 -796 2489 687 -2714 -840 2640 900 -2449 -739 2348 390 -2656 -459 2761 571 -2684
636 -2684 -651 2401 304 -2564 -174 2746 185 -2902 -413 2664 318 -2488 -42 2561 -185
651 -185 -2833 94 2893 90 -2582 146 2494 -509 -2686 685 3025 -377 -2854 369 2601
666 2601 -622 -2521 1029 2839 -984 -2943 867 2783 -861 -2462 1212 2446 -1559 -2745 1488
681 1488 2811 -1313 -2502 1406 2146 -1914 -2317 2085 2529 -1973 -2512 1731 2036 -2070 -1904 2386 2009
698 2009 -2491 -2188 2231 1920 -2157 -1525 2418 1326 -2779 -1504 2780 1627 -2458 -1263 2457 847
714 847 -2748 -740 3068 1047 -2812 -928 2579 577 -2600 -185 2985 314 -2976 -435 2737
729 2737 336 -2429 119 2531 -394 -2809 295 2800 -172 -2474 354 2210 -842 -2471 900
744 900 2617 -730 -2491 572 2046 -961 -2006 1223 2142 -1244 -2267 1008 1973 -1030 -1662 1293
760 1293 1600 -1541 -1782 1452 1818 -1172 -1457 1279 1197 -1529 -1234 1701 1497 -1379 -1322 1251 1029 -1332
778 -1332 -823 1595 998 -1528 -1056 1354 942 -1178 -621 1360 564 -1535 -732 1458 853 -1204 -670
795 -670 1079 374 -1348 -470 1410 620 -1290 -711 1000 411 -1117 -353 1209 399 -1316 -596 1086
812 1086 511 -1005 -360 1046 240 -1261 -382 1274 557 -1095 -460 1047 310 -1149 -251 1365 500
829 500 -1223 -476 1171 421 -1110 -218 1349 310 -1379 -361 1379 400 -1249 -244 1329 132
845 132 -1493 -174 1574 254 -1519 -229 1415 30 -1565 1 1631 -4 -1699 -89 1526
860 1526 -102 -1580 179 1598 -321 -1761 252 1684 -313 -1652 416 1618 -603 -1726 632
875 632 1773 -605 -1714 672 1656 -787 -1602 941 1715 -904 -1635 972 1603 -998 -1447 1194 1496
892 1496 -1240 -1438 1330 1435 -1316 -1288 1454 1248 -1548 -1223 1624 1202 -1636 -1144 1625 993 -1760
909 -1760 -963 1776 872 -1862 -885 1784 700 -1872 -654 1850 481 -1977 -489 1916 364 -1959
925 -1959 -303 1938 159 -2001 -116 1998 71 -1963 5 1939 -89 -1892 220 1924 -231
940 -231 -1831 338 1853 -357 -1745 523 1775 -536 -1695 644 1719 -633 -1631 743 1612 -781
956 -781 -1555 853 1544 -864 -1505 864 1416 -946 -1386 938 1283 -1043 -1292 1004 1166 -1122 -1193 1092
974 1092 1056 -1199 -1090 1165 996 -1230 -1012 1191 901 -1250 -879 1262 829 -1261 -779 1291 751 -1283
992 -1283 -678 1310 683 -1272 -592 1326 599 -1261 -471 1328 501 -1297 -392 1379 402 -1314 -334
1009 -334 1370 356 -1319 -281 1323 259 -1307 -222 1281 159 -1311 -142 1282 63 -1327
1024 -1327 -63 1282 -7 -1313 -17 1244 -71 -1308 47 1234 -162 -1292 123 1234 -210
1039 -210 -1267 192 1217 -248 -1226 265 1181 -308 -1144 360 1148 -390 -1105 478 1168 -448 -1097
1056 -1097 543 1159 -516 -1053 598 1121 -551 -1036 632 1053 -628 -984 692 988 -694 -946 737
1073 737 921 -773 -914 774 825 -840 -855 823 767 -913 -793 877 702 -964 -731 915 656 -990
1091 -990 -667 957 589 -987 -580 962 507 -997 -482 1001 441 -1028 -389 1055 383 -1021 -294
1108 -294 1079 311 -1030 -225 1094 246 -1023 -159 1088 190 -1031 -89 1076 117 -1009 -33 1020
1125 1020 46 -993 29 978 -70 -980 113 964 -187 -991 185 951 -255 -988 223 922 -303
1142 -303 -966 259 888 -355 -925 302 846 -385 -862 380 811 -441 -806 448 771 -483 -747
1159 -747 505 729 -507 -673 579 700 -553 -635 630 656 -577 -585 640 600 -589 -511 635 530 -605
1178 -605 -461 647 468 -636 -399 655 393 -667 -368 665 335 -689 -327 647 269 -689 -296 646
1196 646 219 -693 -251 618 170 -678 -200 605 128 -650 -150 610 77 -640 -74 609 44 -616 -38 607
1216 607 43 -585 16 619 9 -576 32 621 12 -535 61 597 -6 -523 88 575 -25 -505 101 535
1236 535 -83 -497 139 542 -125 -532 118 512 -139 -516 129 484 -160 -550 105 490 -162 -514 121 453
1256 453 -197 -525 152 482 -211 -528 179 472 -244 -516 248 508 -262 -544 248 535 -265 -508 337 539
1276 539 -313 -538 340 573 -297 -485 391 526 -384 -466 472 534 -428 -480 497 468 -526 -434 616 492 -619
1297 -619 -477 616 446 -641 -396 669 363 -760 -412 721 365 -757 -333 742 212 -849 -259
1314 -259 836 182 -854 -179 795 38 -897 -15 951 -5 -989 -19 930 -60 -908 171 966 -189 -977
1333 -977 219 965 -232 -854 368 880 -437 -893 494 955 -434 -830 522 786 -621 -760 729
1350 729 815 -702 -776 685 684 -761 -573 865 600 -908 -631 822 521 -843 -396 891 273 -1047
1368 -1047 -356 1017 313 -988 -242 925 38 -1070 -56 1081 75 -1036 -80 915 -101 -917 249
1385 249 1041 -218 -1027 179 926 -211 -764 428 831 -477 -872 486 887 -368 -683 500 628
1402 628 -620 -649 692 759 -554 -651 498 479 -602 -391 730 459 -729 -521 571 346 -578 -219 656
1421 656 171 -788 -323 653 281 -545 -150 510 -31 -678 -53 687 148 -553 -137 394 -66 -465 149 575
1441 575 -32 -535 -57 379 -16 -269 200 401 -176 -463 69 425 75 -189 78 188 -161 -278 147 375
1461 375 44 -225 -65 102 -58 -107 149 260 -54 -299 -128 150 87 -60 17 120 -86 -324 -108 280 198
1482 198 -182 -174 92 8 -252 -45 353 182 -337 -287 181 156 -192 -26 379 95 -463 -208 403 244 -278 -69
1504 -69 374 17 -530 -66 608 202 -475 -143 426 2 -504 80 677 24 -643 -64 529 -40 -481 200
1524 200 618 -223 -721 137 657 -163 -575 258 548 -418 -698 359 709 -323 -660 314 499 -493 -551 561
1544 561 607 -546 -613 463 480 -543 -378 697 415 -740 -460 710 428 -645 -263 763 244 -812
1562 -812 -234 865 303 -749 -177 765 73 -791 -6 880 71 -832 -14 766 -70 -745 177 803 -201
1581 -201 -829 173 758 -233 -708 309 692 -405 -754 362 699 -368 -644 382 547 -507 -570 517
1599 517 547 -531 -530 504 436 -569 -406 620 400 -634 -394 605 357 -581 -255 640 248 -637 -208 665
1619 665 213 -591 -117 625 113 -600 -45 654 58 -585 -14 594 -36 -575 91 576 -95 -570 73 531
1639 531 -115 -520 137 480 -179 -504 152 441 -195 -445 183 395 -242 -421 225 373 -247 -384 230 342
1659 342 -246 -333 254 320 -242 -304 258 300 -248 -272 271 277 -244 -245 255 263 -236 -209 258 232 -251 -187 285 210 -265
1684 -265 -191 299 219 -260 -200 271 207 -271 -182 259 186 -261 -179 250 148 -293 -174 249 134 -305 -166 276
1706 276 121 -320 -161 286 121 -336 -128 326 108 -347 -126 349 122 -338 -120 355 123 -339 -89 366
1726 366 101 -321 -46 375 71 -349 -15 389 38 -376 9 407 16 -375 12 419 -16 -389 32 398
1746 398 -43 -417 51 400 -73 -395 70 392 -99 -413 103 382 -147 -397 134 371 -191 -395 166 379
1766 379 -227 -402 210 372 -236 -372 236 360 -240 -349 271 353 -265 -327 306 338 -285 -305 339 323 -309 -269
1788 -269 357 298 -339 -249 390 285 -367 -240 404 259 -399 -227 417 232 -409 -212 408 195 -422 -191 412
1809 412 148 -456 -165 428 109 -474 -130 436 93 -492 -117 460 65 -493 -87 479 41 -493 -52 493
1829 493 31 -493 -18 495 4 -489 34 492 -31 -483 86 519 -61 -483 110 525 -101 -479 154 525
1849 525 -122 -474 177 510 -174 -480 219 481 -227 -464 261 467 -268 -453 276 452 -318 -448 308 415
1869 415 -363 -434 336 386 -403 -411 363 354 -406 -394 381 335 -426 -348 409 309 -443 -279 450 267 -455 -225 497
1892 497 225 -479 -201 509 214 -476 -147 514 176 -479 -130 533 139 -485 -105 509 93 -475 -49 510
1912 510 52 -482 -28 495 9 -469 22 477 -47 -504 21 471 -50 -473 29 431 -90 -475 73 425
1932 425 -99 -448 68 384 -142 -417 119 400 -157 -417 120 386 -152 -358 182 368 -185 -381 197 420
1952 420 -141 -346 192 371 -190 -349 224 410 -139 -341 182 346 -176 -289 250 366 -219 -352 212 334
1972 334 -198 -309 250 320 -290 -377 254 357 -255 -342 254 282 -337 -327 321 349 -333 -377 253 284 -348 -291 385
1995 385 301 -418 -346 364 299 -368 -233 440 223 -504 -283 502 321 -430 -226 459 185 -499 -140 590 233
2016 233 -525 -179 517 136 -512 -13 641 89 -626 -104 586 86 -529 53 605 -110 -682 51 683 -35
2036 -35 -587 66 538 -217 -629 219 646 -206 -642 145 492 -297 -520 374 584 -397 -634 305 527 -333
2056 -333 -426 447 435 -511 -498 489 521 -400 -370 466 297 -550 -312 641 401 -523 -315 486 201 -535 -101 677
2078 677 196 -638 -212 553 153 -501 4 594 -18 -667 -50 614 79 -492 30 463 -187 -573 145 594
2098 594 -93 -542 58 376 -227 -435 277 487 -261 -525 132 373 -202 -311 305 320 -349 -413 240 367 -166
2119 -166 -211 259 172 -349 -212 374 312 -227 -205 223 113 -272 -61 375 180 -293 -208 187 122 -159 -4 258
2141 258 41 -303 -132 206 139 -112 -45 120 -45 -225 -40 222 101 -145 -122 29 -20 -124 -4 160 59
2162 59 -181 -166 56 112 -28 -46 69 50 -154 -151 109 184 -16 -130 31 75 -109 -116 177 216 -113 -217 65 177
2186 177 -75 -121 199 209 -200 -258 172 280 -101 -175 193 185 -253 -240 271 269 -221 -244 197 161 -311 -166 338 203
2210 203 -374 -245 295 160 -349 -140 393 104 -472 -172 424 158 -400 -97 418 37 -480 -44 505 66
2230 66 -466 -23 455 -35 -471 93 535 -69 -523 87 513 -102 -466 203 513 -204 -511 206 513 -193
2250 -193 -432 266 440 -314 -456 349 455 -326 -416 337 373 -384 -365 422 363 -452 -364 420 304 -456 -292 453
2272 453 246 -519 -270 471 205 -497 -198 465 125 -524 -126 521 115 -518 -92 495 67 -490 -10 532
2292 532 20 -512 13 506 -9 -473 68 472 -77 -467 97 454 -97 -434 132 408 -136 -399 176 399
2312 399 -171 -393 176 359 -205 -354 201 330 -222 -353 208 313 -215 -303 196 266 -236 -279 237 256 -256
2333 -256 -255 216 219 -231 -211 236 211 -259 -216 241 202 -229 -187 236 173 -235 -167 247 201 -206 -171 213 177 -210 -130
2358 -130 244 174 -217 -149 230 160 -214 -131 236 133 -248 -158 245 150 -234 -160 228 113 -261 -148 245 138
2380 138 -264 -153 235 109 -257 -125 263 104 -296 -134 256 102 -274 -85 285 75 -305 -85 318 83
2400 83 -299 -74 308 66 -314 -45 330 61 -322 -45 335 24 -323 10 333 -4 -324 13 346 -14
2420 -14 -323 43 334 -52 -338 72 346 -81 -354 73 339 -121 -347 103 329 -132 -340 116 307 -164
2440 -164 -314 152 276 -185 -302 174 270 -205 -290 215 268 -236 -265 235 255 -228 -243 245 234 -250 -219 277 222
2463 222 -259 -185 278 190 -263 -167 281 159 -290 -148 290 135 -303 -126 302 120 -309 -106 306 99 -291
2484 -291 -99 294 67 -309 -64 287 59 -318 -43 300 11 -301 -25 286 -3 -306 -7 283 -27 -303
2504 -303 6 298 -38 -303 30 274 -46 -275 36 284 -53 -254 76 276 -62 -242 104 264 -93 -242
2524 -242 114 271 -99 -244 119 255 -124 -240 127 231 -137 -229 141 224 -161 -231 150 206 -164 -215 155 184
2546 184 -188 -196 168 168 -194 -183 181 167 -198 -179 191 157 -210 -160 204 145 -215 -150 226 136 -207 -116 226 127 -216
2571 -216 -109 225 99 -228 -79 246 78 -237 -63 255 60 -238 -43 258 47 -252 -42 253 33 -236
2591 -236 -27 235 11 -253 -13 241 -23 -252 3 222 -50 -255 29 222 -66 -252 32 214 -74 -240
2611 -240 61 232 -82 -246 71 230 -83 -221 80 208 -103 -199 117 220 -99 -184 121 194 -110 -172 145
2632 145 204 -144 -190 148 189 -139 -169 163 163 -170 -162 166 160 -151 -139 171 136 -202 -147 195 138 -186 -145 171 100
2657 100 -207 -113 214 87 -225 -121 206 92 -220 -90 200 67 -249 -100 216 76 -211 -64 208 30
2677 30 -244 -36 251 45 -217 -7 235 12 -217 29 265 23 -241 8 246 10 -214 58 246 -55
2697 -55 -254 44 245 -42 -214 69 209 -104 -232 91 224 -108 -239 85 184 -149 -208 144 203 -164 -235 99
2719 99 176 -153 -177 146 160 -187 -200 160 166 -153 -144 174 116 -221 -136 223 153 -185 -129 188 96 -196 -80 230 115
2744 115 -193 -101 191 96 -163 -29 223 70 -223 -51 208 63 -179 -15 204 8 -224 -11 223 19 -215
2765 -215 -19 166 -22 -206 19 193 -25 -213 -36 142 -35 -173 23 133 -49 -194 12 156 -28 -135
2785 -135 20 128 -66 -154 58 173 -22 -132 40 123 -55 -135 60 161 -25 -136 33 144 -4 -90 58
2806 58 129 -36 -132 52 144 -24 -110 51 125 -59 -124 73 156 -48 -146 36 117 -61 -142 71 145 -62 -165 22
2830 22 129 -76 -149 63 123 -108 -169 64 142 -94 -164 87 128 -125 -156 117 160 -107 -155 120 159 -129 -139 160
2854 160 174 -149 -147 164 162 -146 -112 187 147 -179 -112 210 142 -186 -102 208 96 -215 -91 231 90 -233 -83
2877 -83 239 59 -252 -69 242 41 -261 -48 239 24 -281 -26 255 -19 -278 8 255 -63 -277 35
2897 35 250 -78 -281 57 253 -89 -275 108 259 -106 -251 119 246 -127 -218 178 243 -159 -217 197 229 -174
2919 -174 -172 202 199 -201 -169 225 192 -210 -146 220 129 -223 -124 248 122 -247 -118 218 83 -235 -73 242 37
2942 37 -268 -74 231 22 -257 -32 243 -15 -278 -10 239 -1 -240 10 204 -55 -233 50 235 -59
2962 -59 -222 62 196 -68 -189 107 204 -85 -193 91 188 -85 -144 127 168 -132 -163 126 172 -107 -126 124 131
2985 131 -127 -122 135 132 -124 -107 131 90 -138 -78 157 75 -168 -101 111 57 -132 -88 131 48 -159 -93 104 54 -134
3010 -134 -65 111 22 -143 -50 132 35 -120 -40 99 20 -108 -11 131 33 -120 -25 135 49 -93 2 124 15 -114
3034 -114 -17 131 45 -107 -17 108 11 -126 -12 129 35 -112 -19 101 3 -121 12 131 -9 -141 -12 114
3056 114 -9 -116 14 122 -37 -150 7 126 -7 -132 30 111 -52 -142 29 134 -39 -122 41 124 -62
3077 -62 -120 64 146 -50 -127 60 132 -48 -116 89 136 -76 -119 104 141 -80 -112 105 111 -102 -110 118 121 -110 -105 119
3103 119 95 -129 -102 138 96 -147 -103 124 88 -144 -87 135 70 -165 -88 144 51 -161 -64 148 27 -183 -47
3126 -47 166 29 -167 -33 158 22 -188 -25 172 13 -178 6 180 -5 -166 18 180 -24 -174 31
3146 31 177 -17 -161 61 180 -37 -152 63 171 -56 -167 61 156 -72 -158 68 150 -94 -152 81 151 -99
3168 -99 -149 83 121 -114 -143 97 110 -129 -136 102 99 -139 -108 129 109 -127 -106 133 101 -149 -96 142 95 -122 -78
3193 -78 149 84 -131 -80 151 69 -145 -58 150 62 -134 -44 162 62 -153 -31 165 31 -165 -21 163 33
3215 33 -165 -19 168 26 -156 -23 156 17 -156 -18 148 -7 -149 19 139 -19 -151 1 144 -41
3235 -41 -159 23 143 -34 -158 20 131 -43 -157 41 152 -39 -139 48 143 -38 -140 53 134 -46 -124
3256 -124 75 137 -73 -123 81 133 -75 -111 87 143 -78 -129 86 125 -86 -137 81 123 -99 -123 93 124 -103 -124
3280 -124 108 109 -111 -120 98 97 -128 -107 106 97 -129 -90 122 97 -138 -95 142 88 -143 -91 145 88 -147 -85 145
3305 145 70 -156 -56 162 56 -147 -56 167 52 -153 -48 171 51 -167 -37 193 39 -174 -30 181 37
3326 37 -180 -21 179 7 -190 -4 181 -19 -204 9 187 -34 -195 16 175 -45 -193 35 201 -57
3346 -57 -201 46 191 -74 -195 70 196 -84 -195 96 175 -103 -174 117 168 -115 -172 132 156 -135 -162 144
3368 144 149 -152 -149 148 158 -157 -135 157 128 -183 -124 183 109 -174 -98 180 89 -196 -81 207 76 -203 -70 200
3392 200 58 -205 -44 205 33 -215 -41 205 19 -199 -16 211 -4 -218 -3 198 -1 -192 15 192
3412 192 -38 -192 59 199 -47 -197 56 180 -67 -173 71 189 -80 -166 77 170 -74 -147 92 135 -116
3433 -116 -150 92 134 -112 -136 105 98 -126 -130 118 112 -126 -123 100 85 -132 -91 135 86 -136 -104 102 80 -117 -74 117
3459 117 51 -143 -78 114 56 -127 -50 111 42 -133 -54 137 54 -110 -59 109 35 -122 -32 128 37 -112 -47 120
3483 120 47 -102 -31 108 38 -125 -54 122 36 -110 -43 100 9 -134 -35 122 40 -136 -45 93 11 -124 -42 133
3507 133 20 -157 -51 124 15 -125 -16 126 8 -174 -26 154 30 -144 -12 149 -1 -168 12 171
3527 171 7 -159 6 157 -13 -152 49 192 -33 -184 28 181 -45 -155 63 183 -61 -180 80 190
3547 190 -76 -166 79 159 -122 -175 105 169 -116 -181 99 142 -145 -168 144 150 -173 -176 135 130 -168 -142 172 123 -195
3572 -195 -127 185 129 -186 -105 200 94 -206 -87 216 98 -205 -72 221 67 -199 -38 232 52 -233 -22
3593 -22 223 26 -215 4 231 -4 -221 8 235 -27 -228 32 218 -45 -227 47 211 -67 -225 48
3613 48 198 -84 -213 71 195 -104 -198 90 172 -117 -183 104 164 -131 -163 118 157 -140 -154 133 135 -143 -148 148
3637 148 145 -140 -118 161 125 -138 -89 157 115 -134 -79 168 98 -140 -58 162 77 -149 -53 168 68 -147 -62 165
3661 165 60 -148 -45 138 52 -150 -47 126 32 -150 -40 130 16 -148 -37 126 10 -149 -27 141 13
3682 13 -138 -13 132 11 -135 -18 116 18 -131 -13 132 9 -118 4 137 12 -131 0 132 13 -115
3703 -115 12 137 -1 -126 11 145 3 -125 19 144 -10 -149 16 144 -3 -131 16 134 -25 -138
3723 -138 30 141 -37 -156 32 132 -40 -152 37 138 -68 -159 38 137 -71 -163 44 134 -84 -158 67 145
3745 145 -92 -150 78 140 -86 -131 106 155 -100 -128 109 135 -105 -114 139 143 -119 -122 151 133 -118 -97 149 103 -139
3770 -139 -89 152 112 -150 -91 144 76 -160 -84 169 75 -164 -75 161 59 -174 -53 182 50 -200 -47 169
3792 169 36 -188 -46 178 3 -185 -26 176 18 -182 5 183 8 -178 21 193 -6 -180 31 175
3812 175 -30 -170 36 191 -35 -160 64 183 -33 -157 62 179 -57 -156 77 174 -58 -159 76 145 -76
3833 -76 -146 91 142 -99 -150 90 123 -102 -142 112 137 -127 -140 120 119 -127 -130 116 98 -149 -123 113 101 -141 -104
3858 -104 131 91 -148 -97 136 81 -147 -82 149 81 -147 -76 162 69 -150 -53 168 65 -155 -46 178 62 -148
3881 -148 -47 161 61 -151 -22 161 35 -159 -18 173 19 -170 -8 172 1 -168 -5 165 -4 -181
3901 -181 -11 161 -14 -181 12 159 -21 -182 22 156 -46 -154 30 146 -47 -148 54 150 -57 -148 63
3922 63 152 -65 -139 78 157 -77 -139 78 145 -69 -128 106 142 -83 -112 108 125 -93 -116 114 125 -109 -108 124 121
3947 121 -119 -110 123 98 -119 -99 113 103 -132 -88 128 79 -135 -75 119 79 -143 -70 124 57 -144 -71 141 44
3971 44 -147 -60 138 34 -150 -43 146 36 -138 -41 133 36 -144 -30 164 35 -136 -13 159 23 -146
3992 -146 -4 156 3 -147 5 145 2 -133 20 157 -7 -151 13 146 -15 -139 9 154 -25 -146
4012 -146 27 131 -36 -151 43 140 -43 -137 46 135 -60 -143 51 136 -66 -144 60 132 -73 -147 63 136 -78
4035 -78 -129 77 123 -92 -124 89 128 -89 -123 104 127 -87 -105 120 112 -100 -99 103 113 -108 -87 134 109 -117 -98
4060 -98 131 93 -124 -88 128 80 -129 -66 135 67 -137 -73 128 49 -145 -63 149 39 -152 -44 143 36 -158
4083 -158 -41 131 18 -148 -30 158 24 -146 -18 157 13 -147 -6 150 -7 -147 15 149 -4 -146
4103 -146 33 160 -14 -153 32 145 -19 -138 43 146 -40 -139 32 131 -35 -132 40 129 -53 -116 57 123
4125 123 -68 -130 51 125 -70 -128 58 105 -67 -121 61 104 -84 -113 66 100 -68 -117 68 96 -81 -92 69 88
4149 88 -83 -87 99 81 -83 -97 85 89 -94 -92 88 77 -100 -73 101 81 -112 -79 101 68 -109 -79 110 61 -111
4174 -111 -70 106 60 -117 -65 115 66 -110 -67 126 57 -121 -54 132 47 -124 -50 133 39 -132 -50 129 38 -130
4198 -130 -34 121 19 -128 -27 147 24 -145 -24 139 3 -142 6 151 -1 -158 20 147 3 -139
4218 -139 30 153 -15 -151 38 156 -15 -140 34 142 -39 -141 55 157 -53 -150 62 145 -58 -139 76
4239 76 139 -79 -136 69 138 -84 -129 90 131 -97 -123 104 116 -96 -107 113 106 -107 -84 126 105 -125 -93 112 88
4264 88 -130 -75 128 74 -146 -89 136 70 -137 -62 124 50 -148 -49 147 64 -135 -42 126 29 -131 -20 147 21
4288 21 -156 -24 131 13 -128 3 146 -5 -139 -11 133 9 -128 8 124 -29 -137 12 133 -8
4308 -8 -121 21 117 -27 -117 49 127 -35 -120 30 99 -37 -96 64 121 -51 -124 42 122 -26 -90 43 84 -67
4332 -67 -117 64 107 -48 -97 47 79 -68 -94 70 95 -80 -99 54 66 -68 -71 84 78 -89 -94 73 96 -65 -71 71
4358 71 56 -97 -66 94 81 -81 -73 82 58 -81 -60 101 67 -99 -64 70 77 -73 -24 122 64 -94 -50 110 67
4383 67 -89 -27 97 33 -117 -20 114 38 -102 -38 97 20 -114 -13 122 16 -121 -33 107 15 -109 -9 118
4406 118 3 -133 -9 120 9 -104 3 108 -17 -124 26 134 1 -115 17 119 -13 -102 43 133 -29
4427 -29 -113 36 135 -28 -99 57 109 -47 -109 54 121 -56 -106 66 93 -70 -99 83 112 -65 -81 67 88 -87
4451 -87 -81 85 84 -91 -85 84 84 -80 -82 91 64 -109 -96 83 51 -101 -64 96 39 -111 -52 112 51 -98 -48 99
4477 99 29 -104 -29 119 43 -113 -24 107 37 -86 -19 115 31 -99 -6 111 25 -99 -3 108 2 -104 -4 116
4501 116 6 -106 2 105 -7 -93 6 105 -24 -108 13 94 -22 -109 10 98 -33 -99 32 93 -35 -84 29
4524 29 96 -42 -102 39 86 -42 -86 45 91 -36 -85 44 85 -32 -84 48 82 -41 -61 69 85 -45 -56 80
4548 80 87 -44 -70 74 77 -50 -70 77 80 -69 -64 79 79 -66 -72 67 73 -68 -58 76 53 -86 -56 87 42 -90 -53
4575 -53 87 43 -96 -36 82 48 -89 -44 85 40 -88 -32 101 35 -90 -20 90 32 -84 -18 92 29 -81 -14
4599 -14 97 23 -61 -1 100 20 -79 -2 115 8 -89 3 107 13 -84 23 105 -2 -85 30 101 -9 -95 22 90
4624 90 -16 -82 31 85 -26 -96 23 87 -38 -95 44 84 -42 -94 33 74 -54 -82 44 69 -54 -73 52 80
4648 80 -61 -67 61 73 -55 -57 79 66 -54 -45 70 65 -50 -46 73 75 -69 -42 72 52 -62 -46 70 43 -68 -38 76
4675 76 51 -63 -30 79 32 -63 -27 87 20 -69 -24 84 29 -89 -24 81 22 -91 -29 70 4 -87 -14 71 -5 -84 -17
4702 -17 78 4 -84 -8 75 4 -74 8 78 4 -69 6 87 -10 -70 21 94 -4 -55 26 89 3 -64 24 79 -11 -70 17 69 -24
4732 -24 -68 35 74 -27 -71 32 68 -40 -71 30 68 -32 -69 32 68 -43 -61 27 57 -59 -62 36 46 -54 -72 32
4758 32 50 -62 -63 57 51 -61 -54 59 36 -56 -50 56 49 -61 -38 58 39 -53 -39 80 50 -55 -37 80 38 -50 -24 78
4786 78 32 -55 -27 67 22 -74 -24 78 16 -66 -10 70 6 -86 -17 58 19 -81 -4 49 -8 -77 -2 68 -9 -84 4 58 -7
4815 -7 -69 15 69 -8 -75 6 70 -19 -52 17 65 -27 -75 22 52 -23 -60 31 59 -28 -66 39 57 -33 -37 44 49 -22 -50 55 60
4846 60 -41 -43 55 55 -39 -44 57 47 -42 -38 44 39 -47 -34 55 25 -51 -49 32 11 -63 -25 41 10 -63 -41 46 16 -62 -21 49 16
4878 16 -62 -12 50 9 -61 -14 55 18 -43 5 50 10 -48 10 56 -1 -48 9 58 -2 -52 -2 50 4 -39 12 47 -7 -44 24
4908 24 50 -6 -39 4 43 -23 -47 19 48 -6 -44 15 45 -19 -29 17 51 -14 -52 7 29 -20 -31 25 33 -29 -43 16 51 -16 -25
4939 -25 29 34 -38 -32 36 44 -17 -29 26 30 -17 -23 50 44 -29 -33 36 33 -28 -17 39 28 -37 -24 41 25 -17 -27 20 20 -41 -16 46 17 -29
4974 -29 -23 28 18 -32 -3 40 23 -37 -25 33 19 -24 0 38 8 -53 -15 38 16 -31 -9 31 -3 -48 7 47 6 -52 -13 42 -11
5005 -11 -31 16 47 12 -54 5 32 9 -29 14 48 -4 -43 10 58 14 -28 14 33 -13 -40 15 50 -5 -33 15 31 -21 -25 33 40
5036 40 -20 -42 2 34 -19 -18 25 37 -30 -38 34 42 -15 -15 23 15 -39 -16 38 29 -15 -35 25 18 -32 -16 34 27 -43 -27 22 15 -25 -6 33
5071 33 9 -45 -23 42 13 -7 1 35 0 -52 -8 48 27 -26 -13 20 11 -37 0 42 4 -44 -16 27 6 -19 12 34 -15 -40 -7
5102 -7 40 -4 -27 -2 26 1 -42 -3 35 3 -35 1 16 -13 -15 28 42 -10 -34 13 26 0 -17 21 22 -10 -44 4 20 -6 -22 17
5134 17 26 -25 -31 22 35 -5 -26 17 10 -8 -8 24 30 -6 -18 18 26 3 -7 20 17 -17 -20 20 21 -12 3 33 15 -16 -17 39 19 -25 -19 5
5170 5 5 -23 -7 32 19 -23 -1 23 11 -3 11 15 2 -3 2 22 16 -13 0 28 -9 -31 -3 23 4 -26 -6 13 -7 -24 4 20 16 -23
5204 -23 -9 12 13 -22 3 17 9 -25 5 20 3 0 10 24 4 -14 9 30 14 -8 9 9 -5 -5 10 13 -7 -20 14 8 -15 -9 10 7 -16
5239 -16 -9 2 2 -7 -19 7 11 -9 -3 17 11 -7 -25 6 4 -16 -7 7 14 -13 -3 7 10 -13 -4 11 -4 -20 -2 23 10 -1 4 9 13 -20 -5
5276 -5 18 19 -6 -5 22 7 -7 14 15 -3 -5 1 9 -6 -17 8 -3 -12 -8 -2 3 -2 -11 -6 3 -12 -15 -7 9 -1 -10 -7 -2 -12 -20 -6 -4 -6 -10 14 6 -4 -3
5319 -3 6 17 -12 5 10 19 1 -10 7 8 3 1 17 4 -10 -1 2 -1 -6 8 5 -3 -15 6 11 1 -13 5 14 -14 -15 -4 13 0 -19 -2 0 -15 -24
5358 -24 0 -3 -20 -21 2 2 -13 -15 0 7 -15 -10 -7 0 -6 -13 15 1 -17 2 4 5 -11 -2 7 17 3 1 19 18 -7 11 13 -1 -5 -6 13 -7 -5 1 16
5399 16 0 -7 9 7 -2 -4 -2 0 -10 -19 2 9 -5 -10 7 4 -11 -3 10 8 -4 -16 8 6 -1 -13 4 1 -5 -19 0 -11 -20 -10 -1 -8 -12 1 4 6 -5
5440 -5 1 7 8 -13 -6 16 13 -4 12 16 13 -8 -3 23 14 -4 -9 15 2 -8 10 9 -13 0 -5 7 -9 -6 -14 2 -14 -20 -10 9 -9 -19 -2 0 1
5479 1 -9 -2 2 2 -7 4 7 -9 -2 -5 4 -1 -2 -4 6 -11 -12 -2 8 1 -12 10 4 -3 -5 7 4 0 0 1 9 13 -3 8 25 7 -5 2 14 13 0 0 21
5522 21 -1 -8 11 2 -7 -10 -11 -12 -17 -21 -9 11 -25 -20 -2 -16 -18 -8 0 2 -13 -8 -1 -3 -12 -17 -1 0 -18 -10 9 5 -10 -14 7 -2 -4 -7 5 17 -8 3
5564 3 10 6 -12 -6 7 6 -1 4 5 7 -3 2 23 13 -13 -2 12 -6 -3 9 3 0 -14 9 -1 0 -19 -1 1 -18 -16 -3 5 -19 -14 0 3 -14 -12 -1
5604 -1 5 -16 -17 -3 -3 -22 -19 8 14 -9 -6 8 17 -3 -6 20 13 -5 -2 21 4 -5 0 9 13 -4 -13 12 17 -16 -10 6 7 -6 -2 14 7 -8 -5 14 17 -7
5646 -7 4 2 -3 -21 -7 5 2 -26 -20 8 -12 -26 2 6 -2 -20 -11 11 -16 -20 -10 5 -20 -30 -3 8 1 -6 12 26 4 -15 13 24 0 -3
5682 -3 9 22 -2 -14 13 28 3 -11 -12 10 -3 -5 12 0 -12 -24 -1 24 0 -15 18 6 -22 -12 5 15 -20 -19 -1 6 -22 -2 17
5715 17 13 -31 -18 5 17 -7 -18 5 4 -15 -24 4 0 -19 -8 9 -6 -21 -2 25 6 -5 5 16 0 -18 21 23 -3 -18 1 22 12
5748 12 -7 8 21 1 -23 13 15 5 -17 3 4 -4 -30 -6 28 -2 -16 -9 21 -12 -27 0 20 -4 -32 -9 11 -12 -22 -3 10 -17
5780 -17 -28 3 15 -20 -10 5 6 -19 -19 14 20 -20 -25 6 12 -23 -25 9 11 -13 -13 17 20 -10 -13 20 20 -17 -11 19 31 -20 -9 22 19 -26 -15
5817 -15 16 25 -10 -21 14 3 -16 -13 19 5 -32 -30 8 17 -16 -18 10 -11 -34 -14 19 3 -22 -17 15 8 -32 -17 30 -5 -15 -9 22 7
5851 7 -31 11 27 5 -37 -8 19 5 -18 -4 17 -13 -23 2 29 14 -25 0 17 4 -36 2 26 0 -32 7 19 -15 -24 11 24
5882 24 -7 -40 12 23 -3 -26 9 20 -11 -35 8 27 -20 -33 -2 13 -19 -33 -2 20 -26 -21 12 7 -14 -18 20 25 -19 -17 16 21 -11
5915 -11 -15 24 10 -19 -15 30 22 -17 -14 8 16 -26 -23 28 14 -25 -14 20 3 -20 -14 33 17 -24 -5 36 13 -21 -21 16 5 -21 -8 16
5949 16 6 -23 -4 28 7 -38 -7 19 8 -29 -5 14 -19 -36 0 25 0 -29 1 27 -8 -20 6 17 -11 -21 8 23 1 -25
5979 -25 -1 26 -2 -16 14 31 -6 -19 10 28 -5 -12 8 8 -16 -25 12 19 -18 -28 7 18 -13 -26 0 17 -29 -18 10 12 -10 -24 16
6012 16 24 -15 -19 12 13 -18 -22 15 6 -28 -20 14 18 -16 -25 12 5 -18 -23 1 -3 -30 -16 2 14 -22 -18 14 10 -7 -10 28 20 -6 -24 25 13 -20
6050 -20 -5 19 4 -25 -2 29 0 -20 0 22 8 -29 -12 7 0 -42 -13 25 1 -30 3 22 -2 -27 -11 21 -8 -30 -8 24 -9
6081 -9 -35 -3 18 -3 -16 1 22 -4 -20 8 18 -12 -34 0 24 -16 -30 7 20 -19 -23 11 27 -17 -13 20 18 -14 -22 24 30 -3 -16
6114 -16 28 34 -13 -7 23 29 -12 -24 23 19 -17 -16 18 17 -29 -23 15 19 -19 -13 13 8 -16 -16 23 5 -27 -9 12 5 -13 -5 24 4 -18 -14 25
6151 25 14 -21 1 36 2 -30 0 13 -6 -27 9 33 -2 -34 8 23 -3 -18 -1 38 5 -24 11 37 -12 -17 2 25 4 -7 25
6182 25 27 0 -12 14 22 -4 -26 9 20 -7 -28 3 14 -12 -12 5 21 -20 -23 6 7 -20 -36 11 16 -25 -29 16 8 -18 -12 13 19 -14 -9 12
6218 12 13 -10 -18 18 19 -18 -10 17 14 -13 -12 24 19 -15 -5 23 16 -14 -10 27 21 -19 -1 27 18 -11 -7 21 17 -22 -12 21 9 -17 -11 24 10
6255 10 -33 -14 23 -3 -25 -11 16 3 -40 -14 22 2 -34 -14 21 -1 -35 3 29 7 -31 5 26 0 -26 4 32 -10 -17 17 40
6286 40 -2 -25 16 35 3 -19 19 41 9 -24 14 45 -4 -32 24 34 -15 -15 12 36 -18 -29 35 30 -17 -22 19 25 -33 -21 17 25 -23
6319 -23 -27 9 22 -26 -27 24 22 -21 -30 28 15 -28 -6 18 9 -28 -29 27 15 -21 -7 33 15 -25 -15 38 21 -32 11 36 9 -30 -3
6352 -3 47 15 -12 7 36 4 -30 10 42 1 -37 12 34 2 -28 17 36 -6 -39 -2 40 -8 -21 12 34 -7 -35 19 19 -19 -29
6383 -29 5 11 -12 -18 1 22 -17 -29 4 16 -19 -19 21 28 -12 -12 0 27 -4 4 20 22 -13 -18 34 23 -1 2 27 13 -16 3 23 15 1
6418 1 -11 18 18 -8 0 19 19 -15 -11 19 8 -19 -17 6 10 -20 -17 1 19 -11 -11 15 8 -17 -7 10 7 -10 -25 7 10 -13 -15 22 13 -15 -7 28
6456 28 9 -18 6 16 8 -23 -15 20 6 -11 -5 25 7 -22 6 27 17 -19 1 18 9 -12 -12 45 11 -26 -4 23 14 -27 0 24 0
6489 0 -34 -8 26 -2 -28 -8 18 -7 -32 -2 22 -20 -41 -11 25 -12 -30 7 21 -19 -27 0 27 3 -22 20 24 -13 -26 22 34 -5
6521 -5 -13 23 20 -26 -15 15 27 -11 -27 24 32 -6 -7 26 29 -13 -12 23 27 -20 -6 22 11 -21 -11 32 21 -18 -10 20 4 -40 -19 17 4
6556 4 -23 -12 10 -11 -25 -8 22 -6 -34 -16 19 3 -25 -6 16 -4 -29 2 34 12 -23 18 23 2 -15 7 32 13 -19 20 37
6587 37 -12 -14 2 31 0 -14 14 34 -4 -5 6 26 -3 -23 19 19 -1 -19 15 20 -15 -13 9 9 -3 -16 11 14 -7 -10 12 15 -17 -19 -3
6622 -3 4 -20 -26 8 11 -3 -18 4 2 -19 -16 14 12 -18 -3 17 16 -13 -2 16 15 -7 0 22 15 -6 2 27 25 1 8 19 14 1 15 25 10 -2
6660 -2 -1 12 13 -14 -2 22 -1 -12 4 12 -7 -13 -3 19 1 -19 -1 28 0 -10 2 24 12 -22 3 32 -9 -26 -1 11 -15 -20 20
6693 20 11 -17 -19 0 8 -3 -17 14 13 -14 -9 15 22 6 -3 22 20 3 -20 19 25 -13 -21 9 13 -8 -9 21 17 -15 -10 11 10 -14 -13 10 14 -28 -9
6732 -9 -6 1 -18 -17 16 8 -15 -5 8 7 -15 8 10 5 -16 -13 16 1 -19 -6 20 -5 -2 -3 8 1 -12 3 10 1 -17 10 13 10 -18 -8 24 9
6770 9 -8 -2 34 11 -5 1 22 9 -6 16 19 9 -17 13 19 2 -17 1 17 -2 -26 5 28 1 -22 -3 8 -9 -20 10 8 -20 -12 2
6804 2 1 -19 -21 18 29 -5 -12 8 18 -13 -6 21 22 -6 -14 23 15 -32 -11 15 16 -10 9 19 17 0 -4 16 5 -6 -4 13 10 -6 -2 15 9 -5
6842 -5 -2 14 19 -14 1 16 2 -21 6 -1 0 -14 -6 6 5 -12 -14 9 -4 -24 1 4 3 -14 -2 10 2 -20 -11 14 -8 -6 -5 13 9 4 3 21 5
6881 5 -3 13 16 -8 -5 7 14 -5 -10 1 17 7 -9 11 7 -9 -4 -5 4 -5 -4 10 25 0 -8 6 6 -3 -23 1 24 -3 -20 0 15 -2 -1 8 17
6920 17 -10 -18 11 7 -16 -16 2 11 -15 -19 10 7 -9 -16 7 18 -7 -10 3 15 -10 0 10 9 0 -11 10 22 2 -1 19 12 -8 -1 26 15 -6
6957 -6 -6 18 -3 -10 0 18 10 -21 -6 21 2 -21 -1 8 9 -15 -1 4 5 -9 -9 3 2 -17 2 20 7 -6 13 17 -11 -13 7 10 -5 -18 -1
6994 -1 5 -15 -16 12 5 -13 -12 14 10 -7 -4 11 17 0 2 13 24 13 -4 25 23 -8 11 18 10 6 -1 13 5 -9 8 9 4 5 -7 -6 3 5 -2 12 9 -11
7036 -11 -15 8 9 -16 -9 11 -1 -12 -10 12 1 0 -5 -3 2 -3 6 -3 2 1 -1 4 -4 -2 5 -4 5 -6 -3 8 7 0 -8 19 13 10 5 14 7 4 -1 3 17 -3 8 13 9
7083 9 0 5 10 1 1 -6 0 9 0 -8 5 6 2 2 -10 -8 -15 -8 6 4 -13 -12 -4 4 -8 1 11 0 -9 -11 12 11 -2 -12 5 3 -7 3 3 8 2 -8 3 1 -4 -3
7129 -3 5 5 -11 -2 21 -2 6 10 19 -2 -10 16 14 -1 6 28 10 0 -8 13 13 -5 -8 4 7 -3 -18 3 4 -7 -13 7 -4 -18 -23 5 -1 -14 -10 -6
7169 -6 -7 -19 -4 -2 0 -12 1 20 5 -4 -3 4 6 3 8 10 8 -4 6 7 -9 -13 -2 9 -2 -11 14 3 5 0 17 16 -15 -11 5 11 -1 -1 2 13 -8
7210 -8 1 24 0 -5 1 23 3 -8 2 11 6 -17 -7 0 -3 -18 -4 10 -12 -11 2 -4 -15 -7 4 -9 -1 -19 2 7 -4 -10 7 4 -1 -8 8 5 -10
7249 -10 9 0 3 11 4 27 6 -11 -1 17 -6 -4 4 2 3 -6 -11 -8 -1 -9 -5 2 -3 2 4 3 -3 -7 0 7 0 6 10 -11 -1 -19 -5 -3 -1 -7 -15 -6 -16 -5 -12 -1
7295 -1 -3 -6 10 4 1 -1 9 -9 21 11 2 1 15 4 5 4 6 11 -2 8 14 19 14 5 5 -2 3 16 -2 2 -4 1 -3 -3 -2 -8 -8 0 -9 -16 6 -8 -2 5 -12 -7 -6
7342 -6 -1 6 -8 -22 -2 1 -10 -12 -8 9 0 -2 4 5 -2 -11 1 -10 -7 -13 -1 -3 7 7 -3 2 13 5 2 7 6 11 9 8 2 5 18 6 12 6 6 3 -5 0 -2 -12 -2
7389 -2 0 1 9 6 -7 -3 -4 -4 0 -12 1 -7 -15 -2 -15 0 2 -10 -8 -1 6 9 8 -2 -1 5 0 -2 -1 -4 -10 5 -3 2 2 8 5 12 4 7 3 3 9 6 17 4 9 11 7 10
7439 10 3 0 11 10 6 0 9 16 3 11 2 -10 -12 -4 -4 0 -9 -3 -7 -13 0 -8 -5 -10 3 -4 -9 -6 2 4 -7 6 6 5 2 2 6 12 1 -3 5 8 5 17 -3 8 8 -3
7487 -3 2 -2 -1 3 4 -8 -1 9 16 10 0 -1 5 17 8 14 12 6 7 -4 9 -2 8 17 4 -6 2 1 4 -5 -6 4 -4 -1 6 -10 -12 -12 3 -9 1 -13 -6 -5 -21
7532 -21 -13 -9 2 6 4 0 15 9 -4 7 9 12 -1 -4 1 8 -9 -1 14 -2 4 7 4 14 11 13 2 0 3 4 6 2 0 -3 -2 -10 5 9 -2 -12 -3 0 3 4 -4 -12 -6
7579 -6 -8 5 -4 -1 -10 -10 2 -2 0 -13 1 -15 -13 -14 6 -6 4 -12 -11 14 0 -7 1 1 3 -12 4 13 8 8 5 11 17 10 11 9 9 -2 3 1 1 3 -5 21 -7
7624 -7 -6 -4 16 11 -11 1 6 -7 -18 -12 0 -1 -9 -3 0 -7 4 8 10 9 -17 -13 11 -7 -8 14 -3 -13 -14 2 10 3 -19 -5 22 -16 -4 14 17 3
7664 3 -2 -6 17 0 -1 12 17 4 -4 6 7 7 5 15 14 1 -7 17 19 -2 4 22 -5 -14 -13 0 2 -12 -5 4 7 -12 -3 9 -4 -22 -2 -3 3 -19 -10 14
7706 14 -4 -12 -1 16 -4 0 -3 7 3 -23 0 22 0 -8 -2 9 -7 -5 6 21 0 -15 5 4 -15 -6 6 9 11 -15 7 4 -1 -7 -11 6 -11 -2
7744 -2 -11 13 4 -3 0 5 -23 2 11 12 -7 -3 -3 8 -6 -9 6 -4 -9 -23 -10 0 -18 -8 -1 -13 -21 -6 -3 1 -3 -3 1 2 -10 -7 1 11 -5 -5 -10 4
7786 4 -3 -8 3 11 -11 -1 7 7 -9 -6 0 -1 -6 -13 2 -1 -3 -10 -1 3 -2 -3 3 16 5 -15 3 10 2 -4 15 -7 -22 -23 -7 1 -25 -14 -4 -9 -23 -21 2
7829 2 6 -21 -8 -6 7 -16 -2 17 7 -12 -12 11 4 -17 -9 18 0 -28 -12 7 0 -11 -7 15 -4 -4 7 18 15 -3 -7 2 -3 -9 -6 24 -5 -19
7867 -19 -1 16 1 -6 -2 1 -4 -18 -4 14 -4 -24 14 9 -19 -16 -6 6 -15 -23 -10 -4 -23 -14 12 0 -24 -17 1 6 -20 -8 11 -3 -15 -8
7903 -8 20 10 -10 -8 9 1 -6 3 9 16 -4 11 13 17 2 -2 19 12 -19 3 -2 0 -9 1 19 -7 -14 5 -6 -2 4 11 12 -8 3 13 2 -5 -3 1 6 -7
7945 -7 -11 7 5 -9 -7 4 -4 -13 -8 5 0 -24 -11 2 19 -20 0 12 10 3 -13 3 -7 -15 -8 6 21 3 -7 10 0 -1 7 14 22 -3 -4 12 2
7984 2 -3 -2 1 -1 -11 -16 -11 -3 -13 -6 -5 0 -14 -1 3 1 -22 -12 -5 -9 -16 0 -6 -15 -1 -9 -2 4 -16 -9 2 -1 -11 -15 12 -14 -16 -5 0 -14 -1 -9 5 -2
8028 -2 -24 -3 6 -1 0 -1 3 7 -12 3 13 0 4 2 5 5 2 -1 14 2 -2 -6 8 -1 -11 4 -1 4 -16 -2 0 -2 -11 -8 11 -14 -11 -4 -1 -11 -28 2 -5
8071 -5 -3 -9 4 2 -8 -9 7 -1 -22 -4 3 7 -14 -12 4 17 -19 -10 11 6 -6 -16 10 4 -13 3 20 11 -4 3 30 19 -8 -12 26 3 -9 2
8109 2 17 7 -14 -16 6 8 -8 0 5 -2 -10 -9 -2 -14 -20 -14 -2 -4 -23 -7 1 1 -21 -7 13 -4 -28 1 10 -20 -15 -8 9 -17 -8 -4 14 -23 -16 9
8149 9 23 -5 2 6 8 -8 -4 10 4 6 -11 12 19 -1 -7 1 12 -13 -14 16 14 0 -8 3 6 -5 -13 1 0 -12 -4 9 -6 -27 -8 8 1 -20 -21 2
8189 2 -3 -16
8191a6
$$ Imaginary data points
##PAGE= N=2
##DATA TABLE= (X++(I..I)), XYDATA
0 0 0 0 0 0 0 0 0 0 0 0 0 0 0 0 0 0 0 1 -8 8 -8 8 -8 8 -8 16 -16 16 -16 24 -24 25 -32 32 -40 41 -48 52 -57 64
40 64 -72 79 -87 97 -106 117 -132 146 -165 181 -205 235 -269 311 -366 443 -552 724 -1034 1776
60 1776 -7150 489 16889 -2447 -11102 5288 13042 -7911 -14728 5521 14002 -5724 -12041 6196
74 6196 11196 -7654 -10090 9474 11502 -9757 -12317 7683 10394 -7848 -7701 10711 8844 -11590
88 -11590 -10330 9931 9804 -8508 -7244 9453 5956 -11334 -6697 11613 7920 -9602 -6456 8677
102 8677 3750 -10516 -3401 11930 4595 -11313 -4939 9792 3474 -9591 -1966 10524 1408 -12023
116 -12023 -3035 10916 3511 -8734 -1433 8724 -526 -10939 -841 10738 1997 -8717 -805
129 -805 8029 -772 -8795 1111 9466 -653 -9369 145 8531 -264 -7368 1869 8151 -2275 -9296
144 -9296 1033 8784 -134 -6943 1430 6812 -2449 -7687 2215 8078 -1296 -7259 1185 6149 -2246
159 -2246 -6171 3188 7250 -2702 -7656 1511 6283 -2127 -5764 3207 6434 -3378 -7234 2457 6641
174 6641 -2400 -6122 2711 5753 -3437 -6169 3605 6637 -3158 -6467 2778 5556 -3495 -5330 4452
189 4452 6163 -4238 -6416 3740 5867 -3805 -5132 4780 5470 -5126 -5859 5020 5958 -4559 -5180
204 -5180 5068 4868 -5669 -5022 5998 5316 -5717 -4984 5688 4436 -6082 -4089 6622 4123
218 4123 -6930 -4391 6562 3913 -6590 -3297 7021 2993 -7620 -3369 7258 3020 -7132
231 -7132 -2449 7291 1972 -7693 -1956 7638 1686 -7643 -1440 7537 1008 -7523 -482 7794 289
246 289 -7911 -251 7725 64 -7338 664 7590 -875 -7651 1016 7552 -1077 -7118 1677 7154
261 7154 -1986 -7122 2280 7148 -2328 -6886 2606 6672 -2952 -6542 3235 6460 -3436 -6367 3519
276 3519 6052 -3802 -5873 3969 5613 -4316 -5605 4335 5313 -4530 -5122 4598 4750 -4942 -4698 5015
292 5015 4490 -5102 -4296 5146 4019 -5268 -3787 5406 3645 -5407 -3386 5492 3216 -5424 -2872 5608
308 5608 2749 -5582 -2475 5679 2390 -5549 -2036 5657 1927 -5589 -1643 5656 1507 -5619 -1276
323 -1276 5650 1132 -5612 -942 5599 771 -5621 -690 5509 449 -5522 -347 5401 66 -5474
338 -5474 -24 5314 -275 -5402 339 5301 -560 -5338 630 5228 -853 -5240 952 5177 -1103
353 -1103 -5108 1266 5070 -1410 -4999 1586 4980 -1666 -4824 1905 4853 -1974 -4713 2198 4717
368 4717 -2238 -4521 2525 4559 -2560 -4418 2734 4400 -2784 -4243 2957 4198 -3012 -4078 3086
383 3086 3879 -3267 -3778 3360 3621 -3526 -3554 3563 3331 -3769 -3323 3784 3147 -3916 -3072 3894 2827
400 2827 -4089 -2790 4070 2587 -4173 -2456 4237 2299 -4325 -2194 4356 2060 -4328 -1837 4458
415 4458 1741 -4415 -1524 4506 1399 -4477 -1142 4657 1115 -4567 -895 4667 810 -4632 -591
430 -591 4717 541 -4621 -319 4634 167 -4646 -6 4633 -130 -4603 284 4560 -487 -4614
445 -4614 534 4494 -779 -4524 870 4432 -1093 -4506 1103 4364 -1316 -4389 1376 4295 -1509
460 -1509 -4275 1535 4097 -1720 -4033 1860 3974 -1948 -3845 2108 3767 -2225 -3656 2403 3704
475 3704 -2408 -3510 2599 3508 -2613 -3369 2783 3352 -2761 -3146 2948 3155 -2952 -3001 3051 2909 -3099
492 -3099 -2743 3223 2663 -3312 -2599 3306 2398 -3441 -2305 3518 2145 -3645 -2113 3623 1921 -3762
508 -3762 -1872 3742 1666 -3867 -1611 3836 1435 -3947 -1374 3905 1173 -3951 -1013 4008 881
523 881 -4052 -786 4021 645 -3963 -380 4081 308 -4062 -178 4098 124 -3954 123 4020
538 4020 -188 -3936 364 3973 -400 -3836 558 3778 -706 -3677 902 3685 -995 -3667 1024
553 1024 3516 -1173 -3422 1336 3357 -1526 -3448 1447 3287 -1544 -3163 1594 2961 -1852 -3051
568 -3051 1810 2941 -1850 -2852 1839 2605 -2026 -2532 2148 2534 -2187 -2515 2127 2355 -2135 -2118 2328
585 2328 2111 -2397 -2121 2405 2120 -2207 -1825 2360 1713 -2472 -1667 2600 1811 -2395 -1620 2364 1415
602 1415 -2446 -1279 2648 1389 -2601 -1419 2438 1248 -2424 -1064 2544 986 -2733 -1182 2559
617 2559 1138 -2441 -985 2356 673 -2649 -786 2675 866 -2585 -886 2330 517 -2505 -393
632 -393 2729 506 -2756 -645 2541 502 -2428 -188 2676 167 -2840 -281 2834 447 -2512
647 -2512 -160 2514 -78 -2671 207 2931 60 -2723 -8 2500 -331 -2531 666 2890 -549
662 -549 -2996 326 2722 -493 -2537 839 2636 -1085 -2967 886 2854 -844 -2652 984 2380
677 2380 -1459 -2637 1536 2793 -1421 -2728 1259 2259 -1669 -2182 2062 2442 -2065 -2588 1812 2289
693 2289 -1842 -1904 2260 1935 -2468 -2101 2411 2131 -2117 -1681 2292 1405 -2588 -1352 2871 1640 -2584
710 -2584 -1469 2408 1045 -2544 -713 2985 896 -2986 -1045 2665 754 -2549 -342 2759 176
725 176 -3065 -420 2860 398 -2599 -162 2409 -342 -2730 341 2813 -226 -2684 166 2259
740 2259 -635 -2319 918 2572 -844 -2622 594 2258 -740 -1963 1142 2091 -1261 -2223 1144 2174
756 2174 -939 -1760 1182 1612 -1418 -1641 1590 1887 -1268 -1624 1190 1318 -1381 -1147 1693 1399 -1546
773 -1546 -1445 1289 1173 -1243 -897 1469 866 -1625 -1060 1425 997 -1270 -809 1213 520 -1505 -664
790 -664 1503 792 -1358 -824 1060 479 -1227 -408 1400 526 -1403 -704 1119 563 -1027 -352 1186
807 1186 375 -1276 -482 1246 620 -990 -412 1031 308 -1108 -238 1336 526 -1162 -501 1072 403
824 403 -1058 -222 1298 390 -1309 -511 1202 473 -1103 -317 1216 240 -1402 -360 1362 379 -1325
841 -1325 -362 1245 127 -1445 -160 1507 163 -1606 -309 1415 93 -1501 -23 1584 -30
856 -30 -1707 -86 1610 1 -1553 142 1586 -254 -1669 314 1753 -245 -1642 392 1655 -469
872 -469 -1629 666 1802 -576 -1723 659 1701 -680 -1575 898 1688 -912 -1662 946 1634 -958
888 -958 -1503 1085 1451 -1229 -1497 1264 1429 -1348 -1392 1339 1240 -1540 -1262 1566 1185 -1675 -1217 1592
906 1592 1038 -1732 -1003 1754 904 -1850 -902 1799 792 -1832 -672 1871 561 -1910 -484 1970
922 1970 450 -1909 -306 1978 263 -1941 -99 2040 127 -1942 1 1990 -3 -1879 190
937 190 1923 -198 -1861 310 1869 -349 -1791 446 1764 -527 -1752 584 1706 -663 -1705
952 -1705 666 1591 -800 -1611 793 1521 -902 -1563 844 1419 -945 -1431 917 1306 -1024 -1306 1009
969 1009 1206 -1082 -1187 1093 1117 -1151 -1074 1194 1055 -1181 -987 1239 980 -1195 -865 1280 890 -1233
987 -1233 -778 1311 803 -1248 -686 1335 703 -1263 -614 1328 606 -1291 -523 1316 490 -1309 -439
1004 -439 1318 393 -1343 -391 1310 329 -1360 -340 1301 238 -1338 -261 1270 147 -1334 -176
1020 -176 1269 82 -1335 -86 1275 10 -1311 -20 1273 -35 -1289 65 1284 -102 -1253
1035 -1253 156 1274 -138 -1218 221 1260 -198 -1193 279 1240 -242 -1128 354 1184 -349 -1118
1051 -1118 440 1162 -442 -1114 514 1133 -524 -1106 545 1083 -589 -1096 588 1024 -650 -1049 624
1068 624 961 -716 -989 688 906 -780 -938 752 840 -837 -857 826 782 -877 -800 882 746 -933
1086 -933 -727 940 692 -957 -657 969 651 -956 -577 991 562 -970 -478 1024 485 -985 -387
1103 -387 1059 402 -1009 -301 1077 338 -1027 -248 1075 253 -1035 -194 1069 175 -1052 -143 1034
1120 1034 93 -1049 -91 1012 8 -1031 -34 953 -83 -999 69 936 -175 -998 156 950 -238
1137 -238 -992 220 958 -272 -953 279 936 -306 -896 345 905 -338 -839 397 856 -390 -795
1154 -795 461 797 -434 -728 505 759 -491 -682 560 704 -536 -655 592 648 -586 -616 607 599
1172 599 -618 -579 610 519 -637 -522 622 444 -666 -452 635 377 -687 -398 635 328 -696 -352
1190 -352 648 280 -702 -312 649 239 -684 -226 648 206 -642 -188 654 172 -617 -119 636 128 -595 -61
1210 -61 648 97 -600 -12 643 52 -580 19 633 23 -567 30 610 6 -576 33 573 -43 -557 43
1230 43 539 -68 -545 66 492 -108 -539 84 501 -143 -550 85 486 -156 -532 117 489 -170 -542 123
1250 123 499 -143 -518 125 468 -179 -493 185 506 -189 -499 206 513 -185 -467 254 533 -246 -517 279
1270 279 553 -243 -498 310 546 -308 -530 343 573 -308 -515 337 501 -377 -492 434 496 -469 -524 455 458
1291 458 -533 -465 551 438 -635 -500 599 444 -636 -436 647 368 -750 -407 737 385 -743 -357
1309 -357 729 274 -806 -237 854 228 -854 -194 827 126 -833 -5 952 23 -966 -2 976 3
1327 3 -892 137 949 -176 -960 223 996 -198 -902 299 871 -408 -879 491 929 -469 -909 460
1345 460 782 -574 -765 674 770 -741 -839 653 711 -719 -633 786 565 -921 -658 857 573 -838
1363 -838 -469 848 301 -989 -303 1052 355 -1000 -285 954 142 -979 -26 1093 82 -1070 -66
1380 -66 976 10 -880 206 990 -228 -1032 206 1013 -168 -836 314 789 -473 -848 487 889 -414
1398 -414 -801 411 622 -564 -634 669 709 -652 -737 485 531 -548 -440 663 401 -773 -533 624
1416 624 438 -569 -300 602 159 -747 -245 757 330 -591 -224 500 57 -583 16 717 122 -616 -150
1435 -150 479 47 -394 146 537 -97 -576 -18 472 63 -297 111 316 -215 -448 118 461 23 -329 -26
1455 -26 157 -137 -249 160 336 -68 -351 -97 120 -18 -97 106 160 -145 -325 -64 229 126 -95 -55 67
1476 67 -86 -236 7 327 167 -229 -204 117 109 -147 17 341 132 -347 -238 274 258 -135 -63 293 50 -419
1498 -419 -146 456 261 -315 -160 312 25 -455 -27 584 148 -555 -195 433 63 -455 46 574 -66 -708
1518 -708 -85 567 9 -509 96 526 -247 -708 165 692 -134 -625 168 548 -345 -632 410 735 -342
1537 -342 -693 305 589 -378 -503 559 606 -554 -614 516 570 -473 -393 653 413 -710 -429 733 476
1556 476 -647 -346 686 251 -776 -229 856 284 -808 -263 732 110 -784 -43 828 28 -885 -82
1574 -82 764 -40 -768 113 755 -231 -852 157 789 -205 -738 234 685 -370 -744 387 732 -366 -676
1593 -676 380 601 -428 -548 528 595 -500 -537 525 511 -501 -383 620 431 -608 -384 637 386
1611 386 -570 -295 627 257 -631 -218 665 224 -610 -167 603 102 -618 -77 604 35 -643 -57 550 -40
1631 -40 -592 30 556 -104 -619 57 525 -114 -535 93 476 -155 -505 147 466 -189 -451 186 410 -215
1651 -215 -404 244 409 -229 -370 254 379 -221 -314 278 358 -232 -288 273 310 -230 -271 279 289 -250 -254 274 262
1674 262 -247 -231 262 215 -271 -220 266 191 -282 -221 258 188 -299 -232 265 190 -288 -215 236 159 -270 -201 251 150
1698 150 -280 -176 266 139 -286 -149 295 151 -286 -144 309 135 -298 -108 336 133 -319 -107 359 147
1718 147 -319 -104 358 130 -315 -91 364 114 -327 -71 369 73 -345 -27 372 30 -387 -27 371 -9
1738 -9 -401 -4 377 -23 -423 -5 375 -45 -421 32 386 -91 -425 56 384 -102 -413 88 377 -133 -402
1759 -402 127 388 -178 -389 178 396 -210 -371 225 398 -203 -371 249 397 -205 -347 259 369 -239 -319
1779 -319 307 357 -273 -299 331 328 -314 -285 344 287 -360 -275 372 272 -390 -275 376 243 -423 -275 386 215
1801 215 -421 -245 387 185 -438 -205 400 141 -438 -187 403 125 -457 -141 447 107 -481 -107 471 104
1821 104 -470 -65 502 68 -477 -29 502 52 -472 1 518 15 -469 35 511 -7 -476 70 514 -48
1841 -48 -489 97 510 -99 -507 126 516 -141 -516 143 485 -177 -495 171 468 -225 -496 208 448 -276
1861 -276 -477 245 423 -324 -454 296 407 -346 -442 339 407 -362 -411 366 399 -386 -377 401 368 -398 -313 428 325
1884 325 -409 -283 453 305 -449 -237 487 251 -466 -201 514 223 -492 -181 520 173 -482 -144 503 138
1904 138 -504 -115 495 105 -493 -88 479 33 -497 -51 466 -5 -493 -9 456 -38 -503 28 469 -53
1924 -53 -473 30 454 -82 -458 81 455 -78 -433 78 405 -94 -390 140 414 -120 -401 148 418 -109
1944 -109 -368 183 393 -168 -371 205 421 -144 -356 164 375 -177 -357 210 378 -192 -377 166 323 -178
1964 -178 -323 210 304 -259 -370 206 336 -229 -347 203 278 -311 -360 270 356 -272 -366 232 280 -304 -322 330
1986 330 344 -338 -380 290 322 -282 -275 371 287 -400 -315 403 341 -351 -245 403 240 -465 -238 522 309 -457 -272
2009 -272 452 206 -475 -144 564 202 -577 -220 502 165 -501 -78 567 40 -663 -110 615 96 -575 -32
2029 -32 531 -98 -657 65 669 -36 -631 22 538 -169 -591 219 634 -216 -665 156 559 -222 -497 354
2049 354 534 -403 -616 357 607 -300 -467 395 430 -489 -460 533 524 -427 -441 418 337 -508 -280 616 361 -574
2071 -574 -389 502 262 -495 -132 605 138 -693 -226 600 181 -519 -91 525 -51 -657 -26 638 73 -557
2091 -557 -38 441 -121 -523 178 593 -126 -596 54 436 -144 -400 280 463 -277 -527 182 465 -142 -325
2111 -325 251 311 -331 -371 319 418 -189 -291 210 182 -306 -171 382 283 -298 -264 212 153 -229 -76 338 126
2133 126 -357 -219 241 175 -164 -61 194 -1 -315 -97 259 155 -150 -105 81 -28 -177 4 225 65 -193
2154 -193 -138 76 58 -68 11 148 28 -196 -128 112 163 -12 -75 48 40 -107 -82 164 195 -48 -172 18 111 -62
2178 -62 -74 157 174 -150 -242 78 201 -58 -140 131 141 -219 -261 187 268 -131 -243 129 153 -236 -214 259 258 -252
2202 -252 -275 201 196 -240 -155 317 194 -378 -232 333 209 -313 -137 354 121 -449 -147 448 178 -399 -120
2223 -120 406 49 -446 -18 506 69 -483 -52 456 7 -453 83 519 -79 -538 69 509 -99 -475 156
2243 156 475 -205 -533 209 513 -216 -500 230 431 -313 -459 315 451 -347 -458 327 383 -382 -379 393 356
2264 356 -446 -374 433 330 -444 -305 469 260 -488 -260 496 245 -473 -197 474 172 -498 -125 525 128
2284 128 -507 -97 516 78 -502 -40 516 22 -510 1 506 -13 -487 38 474 -75 -469 82 453 -109
2304 -109 -455 89 404 -152 -415 143 379 -189 -418 165 377 -190 -370 182 344 -214 -355 213 333 -212
2324 -212 -312 206 282 -220 -261 244 268 -233 -247 244 258 -212 -214 261 218 -236 -198 252 211 -232 -197 231 180 -233
2348 -233 -171 245 187 -234 -183 208 160 -220 -167 214 136 -240 -176 209 132 -245 -152 207 118 -266 -159 232 142 -240
2372 -240 -170 219 108 -259 -140 244 130 -256 -140 243 139 -245 -111 261 125 -256 -116 280 129 -268
2392 -268 -93 286 104 -293 -67 323 103 -306 -73 311 72 -301 -46 337 56 -331 -48 320 31 -339
2412 -339 -15 327 -12 -351 -6 324 -22 -354 18 321 -69 -351 50 333 -87 -362 67 329 -108 -337
2432 -337 107 331 -115 -328 135 323 -126 -297 168 312 -171 -295 204 317 -178 -265 227 281 -208 -245 246
2453 246 277 -228 -246 243 253 -244 -228 270 227 -264 -202 265 197 -272 -182 271 163 -294 -159 278 122 -311 -157
2476 -157 283 107 -326 -135 291 90 -318 -113 292 57 -313 -83 301 40 -306 -44 304 36 -302 -14
2496 -14 303 19 -289 3 308 6 -275 43 316 -3 -272 44 305 -15 -269 77 288 -35 -256 65
2516 65 268 -58 -255 97 271 -82 -249 91 250 -120 -269 93 240 -130 -252 114 224 -148 -247 114 217
2537 217 -159 -242 127 208 -170 -230 144 181 -170 -188 177 189 -188 -187 195 171 -189 -161 222 170 -190 -150 216 172
2561 172 -186 -133 239 156 -214 -113 241 129 -213 -89 238 106 -216 -88 242 86 -237 -71 242 54 -240
2582 -240 -56 248 49 -252 -58 250 21 -267 -31 225 -3 -251 -29 232 -24 -262 3 224 -51 -251
2602 -251 35 236 -58 -236 55 243 -46 -239 65 243 -66 -230 92 242 -53 -209 94 239 -79 -186
2622 -186 133 221 -91 -176 119 202 -106 -177 161 189 -143 -184 149 185 -151 -180 151 169 -170 -181 160 168 -171 -171 143
2647 143 114 -189 -158 180 113 -213 -156 161 112 -209 -115 186 99 -229 -123 198 106 -211 -92 212 77 -239 -78
2670 -78 239 89 -199 -59 230 48 -209 -8 268 43 -234 -21 241 35 -218 15 257 -5 -249 -11
2690 -11 253 1 -234 30 225 -70 -247 48 247 -45 -242 56 199 -86 -227 92 225 -99 -258 86
2710 86 191 -135 -195 128 199 -170 -244 124 214 -120 -176 151 163 -185 -171 171 178 -155 -138 169 140 -182 -106 223
2734 223 160 -185 -133 187 126 -166 -72 223 100 -231 -103 208 113 -163 -56 200 27 -228 -57 211 50 -186
2756 -186 -47 171 -6 -222 0 200 -3 -215 -54 170 -14 -182 11 189 -37 -220 -10 172 0 -149
2776 -149 15 150 -42 -165 33 178 -2 -138 31 130 -42 -123 85 180 -37 -134 26 146 -27 -110 80 159
2798 159 -42 -154 44 152 -8 -103 46 120 -64 -142 55 144 -28 -121 26 110 -52 -120 65 133 -70 -154 28
2821 28 122 -55 -134 54 132 -66 -161 47 145 -60 -134 69 123 -79 -156 90 158 -83 -135 88 145 -95 -129 118
2845 118 185 -115 -149 124 165 -116 -135 154 164 -135 -154 165 168 -137 -131 168 126 -180 -129 195 127 -204 -123 209 87
2870 87 -225 -111 220 81 -242 -79 245 73 -256 -70 250 60 -266 -65 255 24 -281 -27 265 2
2890 2 -277 10 275 -34 -268 41 270 -57 -260 68 271 -70 -244 112 283 -90 -243 126 263 -108 -213
2911 -213 161 233 -138 -213 177 227 -163 -193 189 191 -219 -186 208 186 -223 -174 213 131 -236 -138 226 117 -246 -118
2935 -118 232 99 -238 -81 225 47 -271 -66 252 43 -246 -6 255 16 -254 -4 272 4 -230 7
2955 7 225 -16 -210 71 237 -48 -221 57 217 -60 -185 101 202 -103 -192 93 201 -76 -160 128 146 -125
2977 -125 -164 123 167 -118 -150 111 118 -120 -119 126 121 -139 -131 103 93 -124 -88 138 81 -154 -95 138 90 -124 -74 129
3003 129 65 -137 -58 140 78 -118 -51 122 42 -117 -28 128 57 -112 -36 107 47 -103 -10 126 20 -121 -38 122
3027 122 41 -95 -18 107 24 -136 -30 125 32 -109 -30 105 -1 -121 -7 119 9 -132 -25 111 -2 -128
3049 -128 -5 116 -23 -137 -8 129 7 -119 7 122 -23 -132 20 143 -6 -126 18 125 -24 -121
3069 -121 46 144 -23 -131 25 134 -38 -112 76 138 -63 -141 74 140 -57 -119 76 136 -84 -131 79 133 -85
3092 -85 -121 94 118 -102 -131 99 116 -111 -110 110 94 -121 -95 124 95 -139 -114 135 93 -130 -84 145 79 -149 -72
3117 -72 161 79 -142 -50 162 53 -154 -44 171 54 -174 -31 174 20 -172 -13 177 3 -185 -5 181
3138 181 1 -177 2 166 -24 -166 22 167 -20 -174 28 163 -48 -172 49 154 -54 -164 50 162
3158 162 -71 -167 60 152 -84 -158 76 148 -92 -143 102 131 -90 -134 105 149 -95 -126 121 117 -116 -113 126 123 -120
3183 -120 -96 128 114 -118 -93 137 107 -140 -94 141 90 -137 -73 145 66 -147 -69 142 54 -154 -56 144 44 -161
3207 -161 -49 150 31 -165 -39 154 18 -172 -33 156 25 -159 -21 148 14 -152 -25 149 7 -152
3227 -152 14 162 -9 -148 21 157 -5 -144 35 166 -17 -141 42 172 -28 -144 42 160 -32 -151
3247 -151 42 142 -52 -153 47 133 -57 -143 57 131 -70 -131 69 137 -88 -135 75 116 -85 -150 81 126 -96
3270 -96 -135 87 118 -93 -126 93 117 -106 -115 113 123 -106 -97 111 118 -112 -96 120 106 -116 -101 126 114 -121 -91 146
3296 146 104 -132 -80 141 104 -125 -75 144 88 -144 -77 146 71 -155 -61 146 52 -184 -64 178 34 -178 -60
3319 -60 168 27 -189 -45 181 19 -183 -43 167 10 -179 -10 179 -3 -189 11 184 -19 -185 24
3339 24 200 -48 -192 54 204 -33 -180 63 195 -51 -191 73 204 -62 -174 87 186 -77 -172 115 177
3360 177 -109 -188 120 175 -132 -154 138 152 -159 -171 151 139 -151 -150 153 117 -192 -140 164 111 -193 -137 160 73
3384 73 -200 -97 200 69 -215 -87 189 66 -215 -57 204 47 -215 -32 216 44 -199 -15 209 12
3404 12 -198 9 218 6 -177 19 198 -24 -182 50 207 -49 -185 63 178 -59 -167 79 169 -89 -189
3425 -189 80 171 -72 -171 69 132 -115 -155 98 133 -114 -149 89 107 -128 -135 115 103 -133 -112 90 109 -132 -95
3449 -95 127 82 -137 -104 116 87 -101 -76 110 55 -115 -70 121 77 -114 -45 119 62 -111 -50 141 55 -121 -52
3473 -52 107 62 -101 -26 121 40 -121 -50 116 39 -98 -44 110 27 -128 -57 106 36 -130 -72 85 7 -120 -40
3497 -40 120 15 -136 -76 104 35 -123 -11 127 18 -148 -45 118 34 -121 -23 132 3 -141 -6 165 26
3519 26 -149 -2 137 -3 -155 11 175 -1 -176 -1 167 -15 -154 33 176 -31 -192 32 176 -46
3539 -46 -177 36 150 -82 -188 63 172 -89 -194 63 148 -118 -187 92 158 -134 -198 95 148 -138 -173 127
3561 127 145 -158 -160 141 149 -165 -144 164 120 -187 -123 196 128 -187 -111 190 95 -190 -73 234 99 -224 -87 216
3585 216 78 -203 -51 220 41 -228 -40 231 9 -234 -4 226 -9 -237 -1 217 -19 -236 12 201
3605 201 -50 -229 40 207 -66 -234 40 194 -83 -211 62 186 -103 -203 89 170 -117 -174 106 163 -128
3626 -128 -165 126 161 -116 -152 135 160 -135 -140 141 140 -133 -115 148 131 -134 -117 160 107 -147 -94 144 86 -163 -85
3651 -85 144 71 -152 -79 154 56 -166 -71 142 45 -162 -70 125 41 -149 -56 121 29 -153 -36 121 22 -151 -29
3675 -29 139 8 -152 -41 125 13 -139 -28 128 -1 -123 -22 140 13 -132 -11 127 21 -142 -13
3695 -13 128 2 -132 -6 128 11 -115 9 140 11 -140 -1 144 4 -132 4 127 -25 -150 2
3715 2 131 -18 -144 9 132 -38 -141 25 139 -42 -152 11 124 -44 -146 23 127 -68 -148 39 132
3736 132 -55 -154 54 136 -79 -151 77 144 -77 -155 76 140 -87 -128 101 134 -103 -134 105 135 -112 -125 122 124
3760 124 -138 -130 131 125 -123 -111 141 102 -147 -110 153 109 -165 -103 139 79 -156 -93 159 62 -173 -86 162 56
3784 56 -176 -63 161 30 -193 -57 180 32 -186 -46 163 19 -181 -20 183 7 -185 -7 184 -3
3804 -3 -176 20 190 -9 -182 30 178 -28 -165 39 173 -35 -185 45 181 -56 -175 49 171 -65 -174
3825 -174 59 154 -76 -173 63 153 -92 -162 81 141 -101 -150 87 131 -105 -152 92 127 -122 -143 99 127 -132 -144
3849 -144 113 119 -143 -124 131 127 -129 -106 131 105 -145 -92 152 80 -151 -91 146 80 -150 -82 154 68 -156 -68 164
3874 164 80 -169 -67 169 54 -151 -45 161 31 -177 -47 156 28 -166 -25 171 19 -180 -13 163
3894 163 14 -179 9 168 -3 -169 3 170 -16 -169 -1 160 -28 -163 36 175 -27 -160 27 148
3914 148 -43 -172 56 149 -59 -151 63 145 -62 -151 69 153 -84 -156 69 145 -89 -139 84 124 -87 -126 93
3937 93 136 -100 -130 108 116 -121 -115 111 112 -128 -104 112 99 -119 -108 127 96 -121 -99 145 90 -132 -90 130 90 -128
3963 -128 -82 133 66 -131 -55 134 72 -139 -52 148 45 -146 -41 146 55 -140 -48 159 34 -140 -25 151
3985 151 26 -149 -17 145 19 -136 -18 141 12 -148 -8 139 -12 -149 -4 150 -14 -154 6 149
4005 149 -11 -150 19 139 -8 -142 17 146 -32 -141 46 148 -44 -138 35 143 -57 -142 54 151 -55
4026 -55 -139 74 127 -74 -127 75 152 -73 -141 81 132 -92 -129 93 122 -92 -120 95 112 -99 -121 90 106 -120
4050 -120 -116 107 104 -120 -108 121 93 -135 -98 115 83 -128 -99 123 86 -133 -81 123 63 -138 -66 144 61 -133 -40
4075 -40 148 44 -139 -52 154 43 -140 -29 142 31 -149 -33 155 25 -150 -21 153 17 -160 -8 147
4096 147 -10 -158 6 145 -15 -154 3 131 -42 -156 28 129 -22 -151 24 135 -47 -143 28 134
4116 134 -49 -133 48 117 -56 -128 45 114 -57 -121 59 126 -66 -120 61 106 -66 -105 86 121 -56 -103 69 114
4140 114 -71 -94 89 105 -79 -104 71 93 -72 -97 80 95 -93 -98 98 72 -104 -98 78 74 -107 -90 97 73 -111
4165 -111 -94 90 80 -103 -87 84 67 -110 -71 110 70 -124 -69 113 74 -110 -58 122 57 -128 -58 129 50 -121
4189 -121 -45 127 61 -135 -44 138 42 -120 -27 125 25 -130 -28 146 26 -139 -12 136 18 -135 -8 147
4211 147 5 -159 -3 158 3 -153 2 129 -32 -174 0 146 -28 -176 15 131 -47 -150 36 139
4231 139 -64 -162 50 133 -64 -126 73 131 -67 -138 78 129 -73 -135 81 118 -96 -118 111 146 -95 -109 106 119
4255 119 -107 -93 127 104 -132 -103 115 93 -115 -83 143 63 -140 -92 131 73 -136 -68 129 45 -159 -58 133
4278 133 46 -149 -55 124 15 -143 -22 128 14 -147 -38 141 12 -125 -5 137 3 -159 -3 154 12
4299 12 -136 10 116 -13 -114 28 145 -6 -118 13 115 -24 -109 49 131 -28 -120 34 122 -33 -104 56
4321 56 97 -55 -124 42 108 -41 -102 36 85 -71 -109 61 99 -73 -119 35 83 -72 -81 64 88 -93 -114 53 75
4346 75 -68 -89 66 62 -98 -94 72 81 -75 -80 66 56 -101 -75 92 71 -87 -75 77 62 -73 -45 103 63 -101 -65
4372 -65 98 82 -76 -48 98 51 -109 -41 106 63 -100 -45 87 18 -103 -25 109 32 -130 -60 99 20 -97 -16
4396 -16 97 11 -144 -34 112 19 -115 -8 106 -12 -131 -7 133 11 -125 -2 107 -19 -107 24 128
4417 128 -19 -121 20 112 -25 -112 34 128 -42 -117 40 113 -23 -98 49 117 -47 -121 63 113 -47 -104 63
4440 63 89 -63 -98 74 95 -81 -109 65 79 -84 -91 76 88 -106 -101 76 79 -87 -78 67 57 -108 -79 90 74 -94
4466 -94 -67 96 39 -117 -55 117 50 -110 -60 102 39 -106 -34 109 37 -111 -48 123 42 -96 -25 110 30 -96
4490 -96 -6 118 27 -103 -13 117 14 -107 -2 102 -9 -113 -16 99 -4 -114 6 102 -28 -123 -1 99
4512 99 -15 -103 15 92 -26 -98 16 92 -34 -110 27 82 -34 -101 28 88 -43 -103 36 87 -42 -88 38 85
4536 85 -43 -81 49 91 -46 -79 54 87 -51 -85 65 84 -55 -67 60 60 -60 -74 55 77 -79 -85 71 64 -72
4561 -72 -58 69 47 -86 -75 59 44 -83 -64 64 46 -81 -66 73 40 -97 -49 78 32 -109 -63 76 31 -90
4585 -90 -49 83 31 -86 -26 91 23 -84 -23 89 25 -106 -18 97 24 -95 -5 90 9 -87 13 110 -3 -105 -5
4610 -5 105 -1 -106 1 95 -18 -94 9 98 -16 -105 5 89 -29 -90 24 83 -32 -98 22 82 -37 -91 23
4634 23 78 -58 -96 34 69 -53 -93 45 76 -59 -74 31 63 -44 -67 55 60 -50 -77 62 62 -65 -71 57 66 -71
4660 -71 -57 63 44 -73 -60 67 57 -75 -57 73 49 -74 -49 75 42 -71 -44 75 23 -75 -31 76 29 -94 -37
4685 -37 69 22 -88 -38 60 12 -98 -24 73 11 -78 -22 68 5 -86 -10 72 2 -90 -10 84 5 -77 -3 77 -12 -81 7 80
4714 80 -4 -84 8 78 -14 -72 10 79 -13 -70 13 79 -24 -80 21 61 -27 -74 21 71 -38 -73 25 69 -23 -65 36 58
4742 58 -42 -73 37 63 -42 -66 40 67 -48 -61 41 50 -48 -68 44 38 -38 -68 53 45 -65 -46 35 38 -53 -46 59 43
4770 43 -64 -44 61 58 -60 -48 50 30 -60 -23 61 23 -65 -33 67 18 -67 -21 69 4 -69 -26 72 18 -73 -10 61 12 -73
4799 -73 -19 67 12 -71 -13 59 4 -68 2 72 -5 -75 -1 55 -2 -65 10 73 -21 -86 1 57 -19 -72 5 59 -22 -71 10 57
4829 57 -26 -66 30 55 -33 -61 37 60 -51 -57 33 40 -43 -57 47 49 -45 -45 36 44 -47 -59 42 45 -65 -47 44 29 -58 -37 55
4860 55 24 -60 -32 47 17 -46 -32 50 17 -51 -16 63 26 -57 -19 50 21 -55 -11 52 8 -58 -19 38 10 -54 -11 58 -13 -69
4890 -69 -6 45 5 -58 1 40 -2 -55 3 50 0 -48 -3 38 -16 -49 1 53 -15 -43 7 46 -11 -39 19 41 -8 -47 8 48
4920 48 -21 -37 21 41 -36 -48 24 48 -21 -50 20 22 -33 -41 27 37 -22 -43 16 19 -24 -37 32 38 -38 -52 10 15 -24 -27 33 15 -48
4953 -48 -33 28 27 -31 -24 17 9 -54 -25 30 33 -27 -27 41 5 -35 -14 45 27 -33 -25 30 32 -22 8 48 15 -43 -27 53 26 -29 -11 45
4987 45 14 -43 -12 52 13 -32 -12 22 -12 -45 1 35 1 -49 -19 31 -1 -29 9 44 -10 -51 -11 39 -6 -37 8 35 -20 -56
5017 -56 4 51 -13 -48 -5 27 -16 -23 13 47 -12 -37 9 18 -16 -17 35 38 -28 -41 21 39 -12 -17 22 31 -38 -34 28 39 -15 -35 17 13
5051 13 -38 -24 46 30 -47 -42 3 17 -19 -12 34 15 -52 -43 23 14 -32 -21 25 3 -45 -27 28 9 -38 -15 17 -8 -39 -4 43 18
5083 18 -26 -9 32 15 -24 2 36 13 -46 -5 32 21 -15 -5 25 -11 -33 8 43 6 -22 -5 23 3 -28 3 46 -2 -33 -13
5113 -13 16 -15 -24 12 21 -19 -49 0 26 -3 -28 3 14 -28 -31 10 25 -12 -28 3 5 -25 -34 10 18 -14 -32 0 17 -15 -21 29 20 -25
5147 -25 -35 6 13 -3 -14 19 13 -17 -26 14 35 -11 -5 16 13 -19 -16 21 13 -22 -22 2 9 -20 -5 26 16 -31 -24 32 1 -19 0 11 -8
5182 -8 -34 -22 17 -7 -24 2 -1 -10 -42 2 27 6 -19 -11 22 3 -21 9 11 10 -22 -2 22 -1 -22 5 15 -2 -25 19 38 -4 -4 10
5216 10 11 -1 -11 11 14 -4 -7 3 26 11 -10 11 17 -7 -13 12 18 -12 -8 -7 7 -16 -17 6 5 -13 -11 -1 1 -19 -21 -9 0 -25 -9 13 -2
5253 -2 -10 -1 6 -8 -5 0 1 -4 -11 -7 12 13 -10 3 7 23 4 5 22 15 -8 6 25 9 -3 1 8 -1 9 1 6 -5 -4 2 15 1 -18 3 -2 -4 -13 3
5295 3 0 -2 -15 -6 3 -13 -18 4 -5 -13 -11 -1 7 -21 -19 -6 9 -15 -6 0 14 -18 -12 11 11 -9 -9 7 7 -13 -18 8 6 -1 -1 9 2 -7 -9 12 -2 -10 4
5338 4 9 -2 -13 -10 -2 -9 -5 -7 5 -15 -16 -8 -7 -4 -19 -6 -1 -10 -18 -9 1 -11 -5 0 4 -10 -17 3 -6 -7 -12 -8 3 -20 -19 9 2 -8 -20 18 4 -12 -8
5381 -8 12 2 -4 13 12 1 -6 4 17 -11 -8 3 15 6 -5 -3 18 -10 -8 -1 14 -1 -17 5 -1 2 -6 8 6 -7 -29 2 7 0 -19 7 3 -22
5419 -22 -18 -2 0 1 -13 -4 1 -12 -17 4 -1 -12 -10 3 1 -8 -12 4 7 -12 -4 10 13 -2 6 14 12 -8 -7 14 -9 5 2 22 7 -6 -5 1 4 -13 0
5460 0 18 8 -16 6 3 -11 -15 -9 13 5 -14 5 18 -3 -6 4 16 -5 -16 -12 -3 -2 -3 -5 0 -10 -20 -2 5 -13 -13 0 4 1 -9 9 11 -5 0
5499 0 9 15 6 -1 13 12 7 -8 -5 10 3 -7 -10 5 -1 -7 14 3 -4 -4 12 10 -2 -15 -4 10 -1 2 5 3 1 -12 6 5 -19 -11 3 -5 -18 0 3 -2
5541 -2 -4 -5 10 2 -14 -13 13 4 -8 -10 11 8 -7 -14 17 6 -14 -12 7 5 -4 -8 3 0 -11 -1 17 1 -7 6 12 8 -27 -1 21 9 -15 -4 11
5580 11 0 -14 -5 6 -13 -34 -13 17 -8 -24 -5 21 -10 -13 -11 8 -4 -10 -6 2 -13 -17 3 8 -6 -16 19 21 -2 -23 -2 13 1 -13 2
5615 2 10 -12 -13 4 10 -13 -2 16 14 -16 -13 3 5 -9 -8 13 1 -21 -9 0 -3 -9 4 8 -2 -18 2 5 5 -6 -2 2 -13 -15 -9 25 0 -32 -3
5654 -3 5 4 -14 -2 -3 -8 -15 -5 10 -14 -16 -5 5 -10 -26 -5 20 -5 -9 -3 11 3 -8 7 18 -16 -13 5 14 -3 -10 17 14 -14 -12 10 16 6
5692 6 -8 6 8 -18 -5 16 14 -4 -21 14 1 -15 -19 16 9 -27 -12 6 -7 -3 -15 15 6 -14 -17 3 21 -9 -13 14 3 -18 -24 24 9
5727 9 -16 -10 7 5 -23 0 31 5 -32 -13 10 10 -15 0 17 -1 -8 -12 14 12 -19 -1 15 -8 -26 -5 18 -4 -18 4 17 -12 -21 22
5761 22 21 -4 -22 -7 14 3 -11 11 23 -13 -24 -2 28 -2 -5 17 16 -28 -24 -2 21 -12 -14 -7 3 -17 -20 16 15 -19 -20 7 20 -9 -13
5796 -13 12 25 -23 -18 9 10 -9 -27 15 8 -17 -18 22 18 -16 -14 23 15 -8 -4 31 8 -14 -7 17 17 -18 -7 12 3 -15 -13 21 18 -21 -6 9
5833 9 2 -33 -14 34 11 -20 -7 12 13 -25 2 23 -3 -34 -9 15 -8 -24 -14 15 -5 -35 -3 19 -4 -23 -6 19 -6 -40 -2 36
5865 36 1 -20 -5 32 -8 -34 -2 30 -4 -26 9 34 -12 -28 9 19 -13 -37 20 21 0 -18 11 18 -16 -21 14 23 -19 -27 9 27 -26
5898 -26 -24 9 17 -17 -34 8 28 -22 -22 16 9 -22 -22 21 20 -25 -29 15 15 -21 -27 21 8 -25 -24 23 17 -26 -18 14 17 -24 -14 25 15 -14 10
5935 10 35 16 -19 -4 30 4 -28 -14 19 6 -39 -5 33 9 -32 -3 21 -4 -41 -6 21 -7 -25 -7 27 -5 -23 -10 19 -8
5965 -8 -34 5 15 -17 -36 5 17 -14 -26 3 19 -13 -34 -7 18 -12 -26 6 22 -8 -29 6 21 3 -20 5 23 -5 -16 10 22
5996 22 -13 -17 1 18 -8 -15 24 30 1 -19 1 19 -20 -8 19 23 -15 -17 19 8 -17 -17 4 16 -25 -16 25 13 -18 -22 8 3 -26 -26 2
6031 2 4 -21 -30 10 10 -29 -26 12 13 -24 -10 12 10 -26 2 17 14 -25 -17 28 13 -15 3 35 10 -16 -6 26 14 -22 -4 20 -1 -25 -3
6066 -3 23 7 -24 -3 21 -8 -21 -13 23 -5 -31 -7 12 -4 -34 3 12 -4 -39 2 20 -15 -33 -6 29 -17 -38 -5 20 -25 -27 9
6098 9 20 -14 -36 17 18 -15 -19 4 24 -10 -24 22 22 -18 -24 12 19 -20 -17 22 25 -17 -17 31 7 -19 -3 21 25 -20 -20 22 -1 -30 -23 13
6134 13 8 -31 -20 13 12 -39 -17 18 8 -45 -15 19 4 -25 -7 27 -5 -27 -20 20 -13 -46 -8 12 -4 -34 -4 24 1 -30 7 22
6166 22 3 -15 13 35 2 -24 7 28 -9 -18 9 39 5 -20 14 29 -1 -18 4 24 -15 -19 4 17 -6 -25 14 31 -19 -21 10 13
6198 13 -24 -29 10 7 -14 -13 13 13 -21 -17 19 16 -28 -20 15 21 -27 -18 13 17 -32 -17 18 20 -16 -19 24 16 -12 -2 20 18 -19 -11 37 14 -15 -16
6236 -16 29 7 -23 1 19 14 -14 -3 19 13 -17 -25 26 16 -28 -10 19 -9 -30 -13 17 -5 -31 -18 31 -8 -35 -6 25 -3 -28 -2
6268 -2 37 5 -32 1 19 -2 -31 0 22 -1 -32 -6 35 0 -31 8 28 -5 -23 4 28 -2 -29 4 36 -1 -35 21 41 -5 -33
6299 -33 15 35 -8 -34 18 36 -16 -28 15 23 -23 -31 27 24 -24 -36 19 16 -26 -25 21 23 -39 -37 13 13 -33 -33 18 11 -47 -20 29 14 -42
6334 -42 -19 24 14 -24 -16 31 10 -22 -18 31 11 -30 -2 38 2 -27 -3 29 19 -35 0 27 -2 -32 1 32 -15 -38 -2 41 -3
6365 -3 -35 6 33 -14 -43 0 30 -17 -20 3 25 -11 -30 10 28 -19 -30 0 16 -21 -33 14 20 -19 -34 9 23 -26 -11 17 6 -22
6397 -22 -32 6 14 -17 -15 18 22 -12 -16 12 18 -14 -10 17 8 -13 -9 23 17 -10 -25 6 19 -12 -23 14 11 -18 -22 13 4 -20 -15 7 0 -16 -15 16
6435 16 12 -22 -12 9 0 -33 -11 12 15 -36 -13 5 13 -20 -23 15 5 -31 -22 18 5 -14 -15 0 -5 -19 -9 20 4 -15 -13 26 -4 -12 -4 26
6471 26 0 -32 -7 20 9 -6 12 21 -3 -25 -6 26 16 -20 -19 26 2 -12 4 32 3 -30 -12 33 -8 -40 -3 26 -11 -38 -3
6502 -3 23 -5 -23 7 7 -10 -31 16 27 -8 -24 13 7 -10 -30 10 27 -17 -31 13 12 -13 -20 33 19 -12 -31 4 14 -14 -18 32 13
6535 13 -16 -9 16 20 -9 -12 20 3 -29 -10 23 9 -20 -29 24 15 -28 -16 11 10 -35 -1 14 12 -23 -13 11 10 -24 -8 20 0 -33 5
6569 5 21 -14 -21 5 31 5 -21 -8 20 -2 -20 2 32 -9 -19 0 18 -5 -23 0 27 -5 -14 1 14 6 -9 13 27 -6 -8 18 33
6602 33 -6 1 0 19 2 -9 11 13 -6 -20 13 13 -8 -15 8 11 -12 -15 16 12 3 -12 2 10 -20 -5 17 8 -11 -14 14 18 -18 -6 26 13 -19
6639 -19 -2 16 9 -20 -6 25 -4 -26 -3 17 8 -9 -15 9 2 -17 11 23 10 -13 -4 30 11 -3 0 21 14 -3 2 24 4 -17 8 21
6673 21 0 -15 0 20 0 -11 5 27 -2 -15 -4 7 -3 -17 4 22 -4 -25 -6 21 8 -22 12 12 -12 -28 7 13 -4 -17 11
6704 11 16 -6 -12 7 18 -2 -13 9 17 2 -19 2 24 0 -10 19 12 -7 -11 11 12 -9 -10 16 24 5 8 21 7 -1 -11 24 13 -22 -14 12
6740 12 1 -24 -10 15 -1 -25 -6 9 1 -17 -20 11 5 -8 -13 12 3 -20 0 20 -13 -18 -12 17 -3 -12 9 19 5 -15 -3 17 5 -31
6774 -31 -10 15 7 -19 -5 19 -9 -13 0 15 0 -12 1 20 0 -9 9 12 -6 -8 10 16 -1 -18 7 7 1 -24 17 16 -12 -14 0 19 -10
6809 -10 -16 1 7 -11 -18 12 6 -12 -21 6 2 -13 -14 13 10 -8 -11 15 15 -22 -7 16 12 -17 -6 24 14 -21 -1 25 11 -9 -5 15 17 -10 -2
6846 -2 23 3 2 -6 13 -5 -18 -4 6 -1 -17 -6 23 4 -4 -4 2 -2 -9 7 20 -2 -21 -16 1 -9 -27 3 9 -3 -29 3 2 5 -17 -4 6
6883 6 -5 -11 1 15 -9 -7 0 10 -9 -11 3 -5 -4 -5 1 12 2 -13 9 16 1 -10 5 21 9 -14 8 20 -10 -15 10 14 -7 -15 8 11 -13
6920 -13 -21 7 3 -17 -21 -2 5 -12 -19 3 13 -15 -5 4 1 -19 -12 -1 -6 2 -7 -3 7 -10 -17 -2 12 -8 -14 19 0 -21 -16 14 15 -17 0 14
6958 14 17 -11 -2 6 11 -3 7 12 9 -13 -3 10 2 -13 6 26 3 -12 -4 7 6 -21 0 9 -4 -20 -3 4 -1 -12 -3 8 -6 -14 0 6 -4 -6
6996 -6 4 2 3 -25 3 6 -3 -1 4 8 -3 -7 7 21 -1 -9 16 5 -8 -3 11 19 0 3 9 -1 -6 7 16 20 4 -3 9 4 -7 -5 9 -2 -11 8 20
7037 20 9 -3 -9 4 -5 -5 1 -3 6 -20 -9 -17 4 -9 -7 3 -1 -19 -15 -4 -5 5 9 2 -4 -8 -9 5 8 13 -3 2 -2 5 10 9 4 8 -1 -1 10 2 2 6 11 -10
7083 -10 -3 14 11 10 9 9 -8 -13 3 20 8 7 3 2 10 4 -3 8 5 4 -9 3 4 -6 -2 8 0 -6 7 12 -4 -12 -11 3 -22 -11 -7 16 7 -15 -12 9
7125 9 1 -17 4 15 -1 -6 0 4 4 2 11 7 -3 -6 9 19 0 7 10 3 -5 -5 5 6 -3 -11 4 0 -10 -3 2 13 -9 -20 10 -6 -2 7 6 9 -12 -10 2
7168 2 2 -10 -7 12 -5 -13 3 3 3 -18 10 15 -7 -14 -2 25 -9 -9 5 10 -1 -1 21 16 -1 -2 11 14 -1 6 11 2 -3 -3 16 19 2 -11 11 5 -13
7209 -13 5 10 4 -17 2 0 -15 -12 -2 4 0 0 -13 10 -2 2 3 -6 -9 -15 -12 4 -2 -8 -10 -5 -12 -14 2 5 -7 -19 3 -10 -5 -14 6 -3 -17 -9 -7 -2 -4 7
7253 7 -2 9 -8 9 7 4 1 2 11 12 -3 -1 11 2 1 -5 14 5 2 5 24 -13 -3 6 -6 -5 -6 -11 5 -8 -10 1 -4 -3 -5 1 -9 -6 -5 1 -3 8 -1 -9 -5 -2
7299 -2 10 -3 1 -12 -9 -2 -3 -9 4 2 1 5 -14 3 7 -2 -9 7 6 4 10 6 7 10 -6 2 5 2 -5 -2 5 -5 4 -4 -2 8 -13 -1 -3 -1 -2 -5 -3 -7 -7 0 -13 1
7347 1 -9 0 5 1 -5 -7 0 -2 2 -7 2 5 8 -6 0 5 -2 5 3 8 -1 -4 7 0 -10 5 11 -8 -9 -7 -1 6 -4 2 3 7 3 -4 5 -1 -2 3 -2 -3 -3 -4 5 -8 -1 5 4 5 -5
7400 -5 2 -2 -8 -10 -6 -15 -8 -3 -10 1 -5 -16 -13 -5 -20 -20 -2 -10 -4 -8 0 -11 -6 -13 5 -7 2 -4 -11 4 -1 1 -1 -3 5 -3 5 1 -8 0 -9 -7 -9 4 0 -9 -9 -1 1 0 3 -13
7452 -13 -6 9 1 5 -7 -12 -7 -1 -6 -5 -1 -6 3 -12 0 16 -8 3 14 -16 -9 -10 -6 -1 -6 1 -5 -9 -6 -1 -5 -4 -6 -1 6 -3 7 -6 0 -2 3 8 -4 -3 5 -11 -4
7499 -4 10 0 6 6 3 -6 2 2 4 -1 7 7 4 4 -9 -1 -1 -7 3 -10 -9 -15 -10 2 -13 1 7 -14 -14 3 -3 0 -9 -5 13 3 5 -11 -5 -6 1 -1 -5 -7 -4 -10 4
7546 4 0 -12 -9 0 2 -10 -3 1 -13 -10 -6 -3 -2 -9 -5 6 3 -4 1 -9 11 -2 -1 12 -10 8 7 -2 -3 -5 -3 8 5 -1 -5 2 8 -3 -7 -7 9 -5 15 -2 -3
7591 -3 -6 -4 5 1 -4 -6 11 9 3 0 1 -9 -10 -12 -7 -3 -6 -6 4 5 -3 -7 7 11 -17 -8 0 -2 -8 -12 6 1 1 -6 15 7 -1 -4 9 6 -7 10 0 -4 1 2 -5 -1 3 0
7641 0 -4 -4 -24 -5 3 0 -12 -3 11 -25 -18 -14 -1 -3 -19 2 13 -13 -5 -6 9 -1 -17 -8 8 -7 -2 7 5 -9 -11 8 17 -10 -1 13 7 -9 -4 2 17
7682 17 -6 -2 13 13 -8 -1 17 9 -8 -1 2 15 -14 -5 23 5 -13 -1 12 -8 -14 -13 7 -4 -21 -2 4 -5 -12 -17 -7 -5 -8 0 1 -2 -19 5 -8
7721 -8 -20 -11 9 17 -2 -15 2 -2 -2 -1 10 5 -9 -10 7 7 -1 -12 14 10 -13 -12 7 10 4 6 13 11 -2 3 12 8 -18 2 7 3 -6 -2 2 -4 1 8 5 5 0 8
7767 8 -3 0 4 2 7 6 -10 -11 2 -6 -9 -5 5 6 0 -2 -8 -5 6 3 5 4 5 -6 18 12 14 -6 1 -6 -4 6 15 3 0 -10 -1 8 6 -1 6 -2 -9 -6 -1 18 0 6
7815 6 7 4 -3 -15 12 9 -5 -15 -17 3 4 -9 3 13 -3 -15 4 -7 -3 -8 12 -2 -16 -9 5 -9 -18 6 1 -6 -20 -19 13 -9 -9 -3 4 3 -6 -4
7855 -4 9 3 -6 4 4 4 -7 11 17 -5 -14 0 20 -2 -4 -1 12 -18 -9 6 10 -4 -15 -10 4 -13 -21 14 11 -19 -24 -16 -1 -16 -15 11 -6 -15 -9 5
7895 5 -8 -7 -13 20 -2 -17 -6 7 2 -16 -2 -1 -3 -15 3 6 -12 -10 0 15 -10 -27 4 8 6 -16 -8 18 4 -18 6 3 -8 -6 9 11 -10
7932 -10 -8 -5 14 0 -9 7 -5 -13 -17 -1 12 -19 -5 11 2 -17 -25 -3 12 -10 -6 14 -4 -21 -24 0 2 -22 -15 16 1 -24 -11 4 2 -12
7968 -12 -10 -12 4 -6 -9 -3 -3 -1 -6 -1 3 -1 -5 8 -2 -5 -2 6 2 13 0 19 4 -5 4 14 -7 -10 -4 9 -4 -13 -12 1 -8 -7 -7 8 -2 -12 -2 5 3
8011 3 -14 -2 15 -4 -21 -1 2 -3 -13 -14 -4 -2 -2 2 7 -10 -9 13 -6 -6 -8 -10 7 8 -20 -2 15 1 -15 1 4 -6 4 -3 15 -4 -5 6
8049 6 4 -5 -1 8 9 -9 -16 -14 -2 1 -6 10 5 -5 -12 7 0 -9 -4 3 17 -10 -12 5 10 -23 -23 -1 15 -10 -26 1 11 -15 -16 6 3 -6 -14 12 11 -6
8091 -6 -15 8 14 -26 -9 23 16 -6 -8 15 11 -24 -10 9 2 -21 -8 9 -1 -20 -7 14 4 -16 -5 9 -8 -14 1 9 -2 -21 -1 6 -10
8126 -10 -7 -14 14 3 -25 -12 9 -5 -26 -8 0 -8 -20 3 10 -21 -25 -6 4 -8 -16 -2 0 -10 -11 2 0 -2 -13 9 13 -6 -20 5 10 -15 -1
8163 -1 12 10 -6 -5 10 2 3 -8 -1 4 -19 -16 7 16 -18 1 16 -7 -13 -7 0 8 -16 -9 11 6 0 -11
8191a1
##END NTUPLES=NMR FID
##END=
