##TITLE=1H_ABPA2401X
 CDCl3
 8 sc, 
 25.1.2023
##JCAMPDX= 6.0         $$ Bruker NMR JCAMP-DX V2.0
##DATA TYPE= NMR FID
##DATA CLASS= NTUPLES
##ORIGIN= UXNMR, Bruker Analytische Messtechnik GmbH
##OWNER= root
$$ XWIN-NMR		Version 3.5
$$ Wed Jan 25 14:37:00 2023 Russian Standard Time (UT+4h)  she@DPX200
##.OBSERVE FREQUENCY= 200.13135
##.OBSERVE NUCLEUS= ^1H
##.DELAY= (6, 6)
##.ACQUISITION MODE= SIMULTANEOUS
##.ACQUISITION SCHEME= undefined
##.AVERAGES= 8
##.DIGITISER RES= 18
##SPECTROMETER/DATA SYSTEM= spect
##.PULSE SEQUENCE= zg30
##.SOLVENT NAME= CDCl3
##.SHIFT REFERENCE= (INTERNAL, CDCl3, 0, 15.7039)
##AUDIT TRAIL= $$ (NUMBER, WHEN, WHO, WHERE, WHAT)
$$ ##TITLE= Audit trail, XWIN-NMR		Version 3.5
$$ ##JCAMPDX= 5.01
$$ ##ORIGIN= Bruker BioSpin GmbH
$$ ##OWNER= she
$$ F:/spectra/data/she/nmr/H-F/1/audita.txt
$$ ##AUDIT TRAIL=  $$ (NUMBER, WHEN, WHO, WHERE, WHAT)
(   1,<2023-01-25 14:35:16.60 +0400>,<she>,<DPX200>,
      <created by zg, POWCHK disabled, PULCHK disabled
       configuration hash MD5:
       00 E9 B6 7A A2 85 ED C7 34 08 36 98 17 FE 4E 26
       data hash MD5: 16K
       14 05 3B ED 29 A7 01 F4 33 F8 36 4E 19 1E A4 85>)
$$ ##END=
$$ 
$$ hash MD5
$$ 60 92 E0 E9 D2 21 6E 34 11 20 04 22 5B FE C9 D4
##$RELAX= 
##$RELAX= 
##$RELAX= 
##$RELAX= 
##$RELAX= 
##$RELAX= 
$$ Bruker specific parameters
$$ --------------------------
##$DU= <F:/spectra>
##$EXPNO= 1
##$NAME= <H-F>
##$PROCNO= 1
##$TYPE= <nmr>
##$USER= <she>
##$AMP= (0..31)
100 100 100 100 100 100 100 100 100 100 100 100 100 100 100 100 100 100 
100 100 100 100 100 100 100 100 100 100 100 100 100 100 
##$AQSEQ= 0
##$AQ_mod= 1
##$AUNM= <au_zg>
##$AUTOPOS= <>
##$BF1= 200.13
##$BF2= 200.13
##$BF3= 200.13
##$BF4= 200.13
##$BF5= 200.13
##$BF6= 200.13
##$BF7= 200.13
##$BF8= 200.13
##$BYTORDA= 1
##$CFDGTYP= 0
##$CFRGTYP= 5
##$CHEMSTR= <none>
##$CNST= (0..31)
1 1 145 1 1 1 1 1 1 1 1 1 1 1 1 1 1 1 1 1 1 1 1 1 1 1 1 1 1 1 1 1 
##$CPDPRG= <>
##$CPDPRG1= <>
##$CPDPRG2= <>
##$CPDPRG3= <>
##$CPDPRG4= <mlev>
##$CPDPRG5= <mlev>
##$CPDPRG6= <mlev>
##$CPDPRG7= <mlev>
##$CPDPRG8= <mlev>
##$CPDPRGB= <>
##$CPDPRGT= <>
##$D= (0..31)
0 1.2 0 0 0 0 0 0 0 0.06 0 0.03 0 0 0 0 0.0002 0 0 0 0 0 0 0 0 0 0 0 0 
0 0 0 
##$DATE= 1674642916
##$DBL= (0..7)
120 120 120 120 120 120 120 120 
##$DBP= (0..7)
150 150 150 150 150 150 150 150 
##$DBP07= 0
##$DBPNAM0= <>
##$DBPNAM1= <>
##$DBPNAM2= <>
##$DBPNAM3= <>
##$DBPNAM4= <>
##$DBPNAM5= <>
##$DBPNAM6= <>
##$DBPNAM7= <>
##$DBPOAL= (0..7)
0.5 0.5 0.5 0.5 0.5 0.5 0.5 0.5 
##$DBPOFFS= (0..7)
0 0 0 0 0 0 0 0 
##$DE= 6
##$DECBNUC= <off>
##$DECIM= 32
##$DECNUC= <off>
##$DECSTAT= 4
##$DIGMOD= 1
##$DIGTYP= 9
##$DL= (0..7)
0 120 120 120 120 120 120 120 
##$DP= (0..7)
150 150 150 150 150 150 150 150 
##$DP07= 0
##$DPNAME0= <>
##$DPNAME1= <>
##$DPNAME2= <>
##$DPNAME3= <>
##$DPNAME4= <>
##$DPNAME5= <>
##$DPNAME6= <>
##$DPNAME7= <>
##$DPOAL= (0..7)
0.5 0.5 0.5 0.5 0.5 0.5 0.5 0.5 
##$DPOFFS= (0..7)
0 0 0 0 0 0 0 0 
##$DQDMODE= 0
##$DR= 18
##$DS= 0
##$DSLIST= <SSSSSSSSSSSSSSS>
$$ [...]
##$SUBNAM2= <"">
##$SUBNAM3= <"">
##$SUBNAM4= <"">
##$SUBNAM5= <"">
##$SUBNAM6= <"">
##$SUBNAM7= <"">
##$SUBNAM8= <"">
##$SUBNAM9= <"">
##$SW= 18.05172834244
##$SWIBOX= (0..15)
0 0 2 0 0 0 0 0 0 0 0 0 0 0 0 0 
##$SW_h= 3612.71676300578
##$TD= 16384
##$TD0= 1
##$TE= 0
##$TE2= 300
##$TE3= 300
##$TEG= 300
##$TL= (0..7)
0 120 120 120 120 120 120 120 
##$TP= (0..7)
150 150 150 150 150 150 150 150 
##$TP07= 0
##$TPNAME0= <>
##$TPNAME1= <>
##$TPNAME2= <>
##$TPNAME3= <>
##$TPNAME4= <>
##$TPNAME5= <>
##$TPNAME6= <>
##$TPNAME7= <>
##$TPOAL= (0..7)
0.5 0.5 0.5 0.5 0.5 0.5 0.5 0.5 
##$TPOFFS= (0..7)
0 0 0 0 0 0 0 0 
##$TUNHIN= 0
##$TUNHOUT= 0
##$TUNXOUT= 0
##$USERA1= <user>
##$USERA2= <user>
##$USERA3= <user>
##$USERA4= <user>
##$USERA5= <user>
##$V9= 5
##$VALIST= <valist>
##$VCLIST= <CCCCCCCCCCCCCCC>
##$VD= 0
##$VDLIST= <DDDDDDDDDDDDDDD>
##$VPLIST= <PPPPPPPPPPPPPPP>
##$VTLIST= <TTTTTTTTTTTTTTT>
##$WBST= 1024
##$WBSW= 4
##$XGAIN= (0..3)
0 0 0 0 
##$XL= 0
##$YL= 0
##$YMAX_a= 675398
##$YMIN_a= -1015178
##$ZGOPTNS= <>
##$ZL1= 120
##$ZL2= 120
##$ZL3= 120
##$ZL4= 120
##$ABSF1= 10
##$ABSF2= 0
##$ABSG= 5
##$ABSL= 3
##$ALPHA= 0
##$AQORDER= 0
##$ASSFAC= 0
##$ASSFACI= 0
##$ASSFACX= 0
##$ASSWID= 0
##$AUNMP= <proc_1d>
##$AZFE= 0.1
##$AZFW= 0.1
##$BCFW= 1
##$BC_mod= 2
##$BYTORDP= 1
##$COROFFS= 0
##$CY= 11.3945322036743
##$DATMOD= 1
##$DC= 2
##$DFILT= <>
##$DTYPP= 0
##$F1P= 2.36226072786647
##$F2P= -0.459571619588291
##$FCOR= 0.5
##$FTSIZE= 0
##$FT_mod= 4
##$GAMMA= 1
##$GB= 0.15
##$INTBC= 1
##$INTSCL= 1
##$ISEN= 128
##$LB= 0.24
##$LEV0= 0
##$LPBIN= 0
##$MAXI= 10000
##$MC2= 0
##$MEAN= 0
##$ME_mod= 0
##$MI= 1.114404
##$NCOEF= 0
##$NC_proc= 0
##$NLEV= 6
##$NOISF1= 3.799351
##$NOISF2= 2.8
##$NSP= 1
##$NTH_PI= 0
##$NZP= 0
##$OFFSET= 15.70392
##$PC= 1
##$PHC0= -19105.84
##$PHC1= 3.600793
##$PH_mod= 1
##$PKNL= yes
##$PPARMOD= 0
##$PSCAL= 0
##$PSIGN= 0
##$REVERSE= no
##$SF= 200.130013532006
##$SI= 16384
##$SIGF1= 3
##$SIGF2= 2
##$SINO= 400
##$SIOLD= 16384
##$SREGLST= <1H.CDCl3>
##$SSB= 0
##$STSI= 0
##$STSR= 0
##$SW_p= 3612.71676300578
##$SYMM= 0
##$S_DEV= 0
##$TDeff= 0
##$TDoff= 0
##$TI= <>
##$TILT= no
##$TM1= 0
##$TM2= 0
##$TOPLEV= 0
##$USERP1= <user>
##$USERP2= <user>
##$USERP3= <user>
##$USERP4= <user>
##$USERP5= <user>
##$WDW= 1
##$XDIM= 8192
##$YMAX_p= 0
##$YMIN_p= 0
$$ End of Bruker specific parameters
$$ ---------------------------------
##NTUPLES= NMR FID
##VAR_NAME=  TIME,          FID/REAL,        FID/IMAG
##SYMBOL=    X,             R,               I
##VAR_TYPE=  INDEPENDENT,   DEPENDENT,       DEPENDENT
##VAR_FORM=  AFFN,          ASDF,            ASDF
##VAR_DIM=   8192,          8192,            8192
##UNITS=     SECONDS,       ARBITRARY UNITS, ARBITRARY UNITS
##FACTOR=    0.0002768,     1,               1
##FIRST=     0,             0,               0
##LAST=      2.2672688,     0,               0
##MIN=       0,             -1015178,        0
##MAX=       2.2672688,     675398,          0
$$ Real data points
##PAGE= N=1
##DATA TABLE= (X++(R..R)), XYDATA
$$ [...]
1584G57j386m01J709N94j097q55J021Rj326N40J559j74j475K87O38q39o73J268
$$ 757 -629 -1030 679 1273 176 -679 342 351 -975 -435 1124 950 -525 -238 400 -439 -1112 156
1602A56J123j349r82R36N81j219k46J937M74j713p44J419J37j560P79J703k56
$$ 156 1279 -70 -1052 -116 465 -754 -1000 937 1411 -302 -1046 373 510 -1050 -271 1432 1176
1619A176k108J97J543o20j143R72J590j284j538O89J294j030p47J587P51j975
$$ 1176 -932 -735 808 188 -955 17 1607 323 -1215 -526 768 -262 -1009 578 1329 -646
1635f46o87J297L66j031K86J273l41j531K11J266m8j053P41J250j126j291Q27
$$ -646 -1333 -36 330 -701 -415 858 517 -1014 -803 463 415 -638 103 1353 227 -1064 -237
1652b37J046p12o66J144P34j889o80J448N25j039o6J421n30j792K68J694n80p09
$$ -237 809 97 -569 575 1309 -580 -1260 188 713 -326 -392 1029 499 -1293 -1025 669 89 -620
1670f20P16R59j115j226J136J062r67n50J093M60j635m63J579Q15j520j37J566
$$ -620 96 1055 -60 -1286 -150 912 -55 -605 488 948 -687 -1150 429 1244 -276 -413 1153
1687A153n37j786L69J957m98j654Q85J076j295j185J324J213j177o84Q67N32j198
$$ 1153 616 -1170 -801 1156 658 -996 -111 965 -330 -1515 -191 1022 -155 -839 28 560 -638
1704f38m68J306Q49j137o01J221m5j401K31J744%j713L72J231q50j120J047J469
$$ -638 -1106 200 1049 -88 -689 532 487 -914 -683 1061 1061 -652 -280 951 101 -1019 28 1497
1722A497j371j068J127L65j320k55J464J85j012k62R19j61j007M21J301m95j187
$$ 1497 126 -942 185 550 -770 -1025 439 624 -388 -650 269 108 -899 -478 823 328 -859
1739h59M57J212p70j193J255J209j139j281J512P63j757k68J899O5j895j9J599
$$ -859 -402 810 40 -1153 102 1311 172 -1109 403 1166 -591 -859 1040 1105 -790 -809 790
1756G90l20j433P86J119n20j418M32J242p19r39Q19J165q84j184R41J006j050
$$ 790 470 -963 -177 942 422 -996 -564 678 -41 -980 -161 1004 120 -1064 -123 883 -167
1773a67r51J718M55j724k61J883j23j709O89J339q45j457J066J063r37q46R20
$$ -167 -1118 600 1055 -669 -930 953 830 -879 -190 1149 304 -1153 -87 976 39 -807 113
1790A13O56r13q90J106N31r11m78J112M24j505k12J602Rj496J95J542l66j604
$$ 113 769 -144 -1034 72 603 -308 -786 326 750 -755 -967 635 644 -852 -657 885 519 -1085
1808a085Q08J426q27j256J180R97j562p35J641L16j251k93J171J67j255k19J222
$$ -1085 -277 1149 322 -934 246 1243 -319 -1054 587 903 -348 -641 530 697 -558 -777 445
1825D45J02j409J50J401l30j403N11J507o54j420Q67J286r86j332J720P74j673
$$ 445 547 -862 -712 689 359 -1044 -533 974 320 -1100 -233 1053 67 -1265 455 1229 -444
1842d44m12J448K63j504O7J498o72p56K74J208p00j009O99P17n96j085O91J179
$$ -444 -856 592 855 -649 -582 916 244 -512 -238 970 270 -739 -40 677 81 -1004 -313 866
1860H66r86q60J138O96j463n50J601N46j804K8J627k55j478K78J726m77j568P99
$$ 866 -120 -980 158 854 -609 -1159 442 988 -816 -788 839 584 -894 -616 1110 633 -935 -136
1878a36J137q81q15P33Q74r05p99R34O83j238o25J451M09j661k5J505r2j612M45
$$ -136 1001 120 -695 38 912 7 -792 142 825 -413 -1038 413 822 -839 -864 641 549 -1063 -618
1897f18J569o07j327Q16J168q11j347J225R89j198p73J340N40j424m89J423N20
$$ -618 951 344 -983 -167 1001 190 -1157 68 1057 -141 -914 426 966 -458 -947 476 996
1914I96j476j22J251J05j519J04J488l12j489P02J041q47r83R94Q35j109o07J275
$$ 996 -480 -602 649 754 -765 -661 827 515 -974 -272 769 -78 -1061 -67 768 -341 -948 327
1932C27M69j339k97J411J81j459J32J383k30j536N18J453o93j231Q85R02q73j078
$$ 327 796 -543 -840 571 752 -707 -575 808 578 -958 -440 1013 320 -911 -26 876 3 -1075
1950a075J140R04j186q44J271M64j130m20J268K47j259l9J269l65r46N04J190
$$ -1075 65 969 -217 -1061 210 674 -456 -876 392 639 -620 -659 610 245 -701 -197 993
1967I93r11p63O81J024j257p51J577M41j318n22J276M77j495l66J757j76j438
$$ 993 82 -681 0 1024 -233 -984 593 1034 -284 -806 470 947 -548 -914 843 667 -771
1984g71K54J450o41j380N55J403o52j070N81R73p28r22J109J119j214j201J642
$$ -771 -517 933 292 -1088 -533 870 218 -852 -271 702 -26 -948 161 1280 66 -1135 507
2001E07K37j189j93J492P1j585J74J163l32j007N30J077o05r77N56P84j069m82
$$ 507 744 -445 -638 854 925 -660 -486 677 345 -662 -132 945 340 -637 -81 703 -366 -848
2019h48R90O34r78o78J099L14j231k85J614L01j956M42J057j44j238P68J308r86
$$ -848 142 776 -202 -880 219 533 -698 -983 631 932 -1024 -582 475 331 -907 -139 1169 183
2037A83j105J061P57j150k87J293J28j370j29R07K22r66P1J177j54j574O1J516
$$ 183 -922 139 896 -254 -541 752 880 -490 -619 288 510 -456 -385 792 638 -936 -875 641
2055F41k62j292P32J400j007j530J294J040j181o94J711J02j455m68J450J86j207
$$ 641 379 -913 -181 1219 212 -1318 -24 1016 -165 -859 852 954 -501 -969 481 667 -540
2072e40K14J142m64j116L06J033l54o79M93O73q44q85Q13R59p03o65R88K45j395
$$ -540 -326 816 352 -764 -458 575 221 -458 35 708 -136 -1021 -208 751 48 -617 371 616 -779
2091g79l28J670J01j139J45J288q08j269R23J196o42p52N36O14r72n90Q54Q42
$$ -779 -1107 563 664 -475 -330 958 150 -1119 -196 1000 358 -394 142 756 -216 -806 48 890
2109H90o83n24M67L33q93m17J341M27j146k35J033l79j428P72J536q60r67P01
$$ 890 207 -317 150 483 -410 -827 514 941 -205 -440 593 214 -1214 -442 1094 234 -733 -32
2127c2P02j122m67J497L79j136j92P27j35q23K09J137K6j111j79R12j08j005L43
$$ -32 670 -452 -919 578 957 -179 -371 356 221 -602 -393 744 770 -341 -520 392 284 -721 -378
2146c78J211k46j396O39P23q80o84J440O03j431l74J176k49q61K91J314n24p84
$$ -378 833 587 -809 -170 553 -327 -1011 429 1032 -399 -773 403 154 -707 -416 898 374 -410
2164d10Q2P78n25m49P41O38n21r94L48P36m68o41J103O41j202q66J026M06q68
$$ -410 -328 450 -75 -524 217 855 334 -660 -312 424 -44 -685 418 1059 -143 -1009 17 423 -445
2183d45K9J195l20j245K65Q87m95m38Q64M76p45p15P07N79n83l66R36N3r26l85
$$ -445 -416 779 459 -786 -521 366 -129 -567 297 773 28 -687 20 599 16 -350 586 639 -287 -672
2203f72J044J24p58m2R39k18j313K95J040l10p09P05O60r52o95P05N92n22k95
$$ -672 372 496 -262 -304 635 417 -896 -601 439 129 -580 125 785 -167 -862 -157 435 -87 -382
2222c82Q21r0q72r0J223r8p33J10O38k11p13k0J017k57p70N22M90q39n60Q86O84
$$ -382 439 349 -523 -613 610 512 -221 -111 527 316 -397 -417 600 343 -427 95 585 -254 -814 72 756
2243G56q04m23P75oq09K1J025Q6r11M7O20j20q59M28N78k29o44M37M44o13k93
$$ 756 -48 -471 304 298 -511 -490 535 621 -290 -243 377 257 -602 -174 404 175 -469 -32 412 -201 -494
2264d94O34L51l78o45P96K86j079R2Q99l0q28n3J016o21n01M57P26m05q15N43
$$ -494 140 491 113 -532 264 550 -529 -437 462 432 -396 -449 567 -54 -555 -98 628 223 -592 -49
2284d9N43p13m55O71N15n14o32O68M15o65j21P45k0n33k04N83J33o20K42L51l28
$$ -49 494 -219 -674 -3 512 -2 -634 34 449 -216 -337 408 388 -145 -349 234 367 -253 -11 340 12
2305A2l64J76O70n78k99N08K85p19j59P08r8l81k03Q82j9r11J84O43q6p16L06
$$ 12 -352 -176 494 -84 -383 125 410 -309 -468 240 142 -239 -442 440 421 -490 -306 337 251 -465 -159
2326a59P33n99m32M65M57l53m59L77M66n60l10M72K05o51j00O74N6p66K12O02
$$ -159 574 -25 -457 8 465 112 -347 30 496 -64 -374 98 303 -348 -448 226 282 -484 -272 330
2346C30j09m40J83M08k99n31M65M57o03k17N29K52m92k07M97R8n21p5N47M6n77
$$ 330 221 -219 -36 372 73 -458 7 464 -139 -356 173 425 -67 -274 223 321 -200 -275 272 318 -259
2367b59l7O08J32r90J53O16r2l63Q0M05l63m66N69L13m17k41M56L8n23J56K90
$$ -259 -296 312 444 -546 -393 223 131 -232 -152 253 -110 -576 -7 306 -111 -352 104 142 -381 -225 65
2388F5J04m01J5N50q8n09K37M06k99m42K67N54m23m70M06L95m74j90N04J98q10
$$ 65 169 -232 -217 333 245 -264 -27 379 80 -362 -95 459 36 -434 -28 367 -107 -297 207 405 -405
2409d05J84M37k05n54M12L77o4n96M07L49j60l51J38L19k59k14M33K32m84j90
$$ -405 -221 216 11 -543 -131 246 182 -414 -7 342 182 -169 -31 288 29 -185 248 480 -4 -194
2429a94K77L29n62j85O49O7p50J81L56p9n00L41M02k20m97L30M70m43j73K20J53
$$ -194 83 412 -150 -335 314 381 -369 -188 168 89 -411 -70 332 112 -385 -55 415 -28 -201 19 172
2450A72l61P7J82J20j60j90K82O0l71J03L20p1n19J72L71j12l77L06M41m25l75
$$ 172 -189 -112 70 190 30 -160 122 182 -189 -86 234 163 -356 -184 187 75 -302 4 445 20 -355
2471c55M78K93n99o1N36r0m43N9L72Rm26J98J92q7k27m9N28l60k10L19J72k64
$$ -355 123 416 -183 -244 292 202 -241 -182 190 199 -227 -29 163 76 -151 -200 328 -32 -242 77 249 -15
2493a5m10N78J19l71j26M41%o07NP63l16l19J70K18m5l68J43L00j5m25RM96k57
$$ -15 -425 153 272 -99 -225 216 216 -391 -386 377 61 -258 -88 130 85 -283 -140 160 145 -280 -271 225 -32
2516c2k80K44N11l77m55O56j4l13r8L13K15n59J66J74k71j97L46J49k26r5NK6
$$ -32 -312 -68 443 66 -389 267 253 -60 -158 155 370 -189 -23 151 -120 -317 29 178 -48 -143 -138 -112
2538a12m6q2L67J02l30o9K59N1l79Q5N10k21m78M3L71n1l21M21L12m36j99j2L84
$$ -112 -158 -240 127 229 -101 -170 89 140 -239 -154 356 135 -343 -300 71 20 -301 120 432 -4 -203 -215 169
2561A69l46l4K58J73k99k49K86Pr5o0L25M0j62k72L75j38j66J49J68q6l60K17
$$ 169 -177 -211 47 220 -79 -328 -42 -35 -130 -190 135 175 13 -259 116 -22 -188 -39 129 43 -317 -100
2583a00M17l42k69N85R4p17j53O78Q8l79J7L50j50l47jK09J07l61L95K8j89k92
$$ -100 317 -25 -294 291 385 -332 -485 193 281 -98 -81 269 119 -228 -229 -20 87 -274 121 149 -40 -332
2605c32K01K00j08ML3J70l01k51N53Kj39L1J11k1n72J88N06j28l49L68N4k70l26
$$ -332 -131 69 -39 -35 -2 168 -133 -384 169 171 32 63 174 153 -419 -231 275 147 -202 166 220 -50 -376
2628c76M93L73m03k66L13J70o15p8N34J68m27j33M96j15l08K7O31k48m97Q0M09
$$ -376 117 490 87 -179 134 304 -311 -389 145 313 -114 -247 249 134 -174 -147 484 236 -261 -181 228
2649B28j69l05L81Q2j60k96J81J22j85k1M77m9j85l08J95Q9m94K95M65j17m38
$$ 228 59 -246 135 217 57 -239 -58 64 -121 -142 335 286 101 -207 -12 77 -417 -122 343 226 -212
2670b12P8L26k06j79K59L05k95l38J17L38k29rJ58L2j91j90L10Lk44K46K65k34
$$ -212 -134 192 -14 -193 66 371 76 -262 -145 193 -36 -45 113 145 -46 -236 74 77 -167 79 344 110
2692A10l74J29K52k53J44J38K0m27O6K10j17lK5J92K60n18q4J65L52m45J14K89
$$ 110 -264 -135 117 -136 8 146 166 -261 -195 15 -102 -105 -80 112 372 -146 -230 -65 287 -158 -44 245
2714B45j79l40j39O33k50j42K07O3l06r6L37Mj26P8J48m2l93J69J59O9k66J45
$$ 245 66 -274 -413 220 -30 -172 35 98 -208 -304 33 37 -89 -11 137 95 -298 -129 30 99 -167 -22
2736b2L1n0j72J56K37N0n16L97Q3m25O7K06K55k68k08L30jm70K69L28r2l88Q2
$$ -22 9 -41 -213 -57 180 230 -286 111 194 -231 -164 42 297 29 -179 151 150 -320 -51 277 185 -203 -121
2759a21J99j05k8j4K04j11j52K40k7k51j97L50K17l68q0L88m0l64K96K89j12n54
$$ -121 78 -27 -55 -69 135 24 -128 112 85 -166 -363 -13 204 -164 -244 144 104 -260 36 325 213 -341
2781c41K94K39j04k65M32o0k24j11J61K03l67o2K31K3N5l78L09O7k42K4M52k71
$$ -341 -47 192 88 -177 255 195 -29 -140 21 224 -143 -205 26 49 104 -274 35 102 -140 -116 336 65
2803F5k92M9M74k28k99J40L47l98j26K25K51k69j2L78k24o3q2n2n1oJ69L0K87
$$ 65 -227 -178 296 68 -231 -91 256 -142 -268 -43 208 -61 -73 305 81 18 -64 -116 -167 -173 -4 26 313
2826C13m80L9R7M8j35Q1Nq0m4K08N9k25j14K73N2k57O4J60L1j85j49M55l67j34
$$ 313 -167 -128 -31 17 -118 -37 -32 -112 -156 52 111 -114 -228 45 97 -160 -96 64 95 -90 -239 216 -151 -285
2850b85K56J96p5k34R4J52j44j25L22o8j37k07M33p8j73j17L77j65k24K88n6p5
$$ -285 -29 167 92 -142 -48 104 -40 -165 157 89 -48 -255 178 100 -73 -190 187 22 -202 86 30 -45
2872d5j12L03mk39k8J91o9N3k42K84O9k28n6J80k1l2j39K08P8l58R2K96j79j38
$$ -45 -157 146 142 -97 -125 66 -3 50 -192 92 161 -67 -123 57 36 4 -135 73 151 -207 -115 181 2 -136
2896a36J18M6O4r4q1K32m5k99K21o6M2j35M59j91l33K81K7j15p7J4K27l01J8K1
$$ -136 -18 28 92 -2 -83 149 104 -195 26 -40 2 -133 326 135 -198 83 110 -5 -82 -68 159 -142 -124 -103
2920a03L03k66j74K08J48k34p5K09L3k8j59N7L28k88m9K91j01r3j39K70L2j89
$$ -103 200 -66 -240 -32 116 -118 -193 16 49 21 -138 -81 247 -41 -90 201 100 7 -132 138 170 -19
2942a9j42L12j05J22j24Q8q6j7j35Q5j14K26j63J07j18k8K52o9k25N9L42l58L9
$$ -19 -161 151 46 168 44 132 46 29 -106 -21 -135 91 -72 35 -83 -111 141 72 -153 -94 248 -110 -71
2965g1J91L9j29k08N5L27j36j29J74K5r5j51j6L31k39J80m7M5j37j5J29j56K5
$$ -71 120 159 30 -178 -123 204 68 -61 113 138 43 -108 -124 207 -32 148 101 146 9 -6 123 -33 -8
2988hj12J8J53j21K2M4m8q2K7mJ15J43j8J27k78%K66j69j34M5J61q3k98L14K1
$$ -8 -120 -102 51 -70 -48 -4 -52 -134 -107 -111 4 147 129 256 -22 -22 244 75 -59 -14 147 64 -234 80 101
3013A01k06j42J92N4r4M8J52K0k09J0MJ65j55m4J45j55J32Q9k1j20l6R1l5l1J2
$$ 101 -105 -247 -55 -1 -95 -47 105 125 -84 -74 -70 95 -60 -104 41 -114 18 107 86 -34 -70 21 -14 -45 -33
3038c3Q0j8j4k21K57N0j35O9rR3j01n3O2J30j62ln3K19k58m8J18J19k02K8K40
$$ -33 47 29 15 -206 51 101 -34 35 26 119 18 -35 27 157 -5 -8 -61 158 -100 -148 -30 89 -113 -85 155
3063A55k47o0K31N9j22J57r9J3j76k9K26k2q6J00k4m2n4j07J02r9R2J7Q5j94l5
$$ 155 -92 -152 79 138 16 173 74 87 -89 -118 108 86 0 100 76 34 -20 -127 -25 -124 -32 -15 70 -124 -159
3088a59R6P9j07r1J69J10l47J93P6R4j73P2J63l13J56j27K02p9l4o4J06j09p8
$$ -159 -63 16 -91 -182 -13 97 -250 -57 19 113 -60 12 175 -138 18 -109 93 14 -20 -84 22 -87 -165
3111a65J71P8l1j81J66Mj01k3J53r2K9l3J65j44k27K08L3j12r9J50J10j31N9j06
$$ -165 6 84 53 -128 38 42 -59 -82 71 -21 8 -25 140 -4 -231 -23 10 -102 -201 -51 59 -72 -13 -119
3135a19J89l2j40J76j61Q4j42K22L9j8k21mn7J79j0p4J06k56L22l0q1j64K01m5
$$ -119 70 38 -102 74 -87 -3 -145 77 116 98 -123 -127 -184 -5 -15 -89 17 -239 83 53 -28 -192 9 -36
3159c6jk4J82P0j25o6j4N8n3n2MJ63l17K71R4k38Q6O5r9P8k43J58K9M5K2j57M6
$$ -36 -37 -61 121 191 66 0 -14 44 -9 -61 -57 106 -211 60 154 -84 2 67 -32 46 -197 -39 -10 35 57 -100 -54
3186e4L4N6j00P4j58k7j2J75j17Q9K01j56j13oJ92j17N7M4L7O7k10Q0J49k30m2
$$ -54 -20 36 -64 10 -148 -175 -187 -12 -129 -40 161 5 -108 -114 78 -39 18 62 99 166 -44 36 185 -45 -87
3211h7K1Q5j52k5J11RK19j60m3jJ76k46K20m4j21J75p0n0j93K75N3j16k8j69J95
$$ -87 -66 19 -133 -158 -47 -38 181 21 -22 -23 153 -93 127 83 -38 137 67 17 -176 99 152 36 8 -161 34
3236C4j50j26K77r9O4q8J04j0k84K48P1J07o7j00Oj11oJ33Q3j41j85L44k28k9
$$ 34 -116 -242 35 -64 0 -88 16 6 -278 -30 41 148 81 -19 -13 -124 -130 3 86 -55 -240 104 -124 -153
3260a53r8K99j01m0J20N4m3n9P8PO5k55O8K02j51j96J88L4p8j1m8J81j85m1J81
$$ -153 -251 48 -53 -93 27 81 38 -21 57 64 129 -126 -58 144 -7 -203 -15 19 -59 -70 -118 63 -122 -163 18
3285A8K4p9lJ00j70J18nl6L4j90J07L8r3K0K10j0Kq4Q9J9qj09P9K0m4L3K6r0j62
$$ 18 42 -37 -40 60 -110 8 3 -33 1 -189 -82 -44 -137 -117 93 83 85 1 90 109 101 -8 71 91 47 80 106 16 -146
3314a46J44J84j85l7N7K24k90N5j35J07k4J2J28J9k43Q8P3n9L1q8L82l40M6j38
$$ -146 -2 182 -3 -40 17 241 -49 6 -129 -22 -46 -34 94 113 -130 -42 31 -28 3 -85 297 -43 3 -135
3338a35K22K9k67J8K16n3l04K91N0j64j10K26J53j62p5J02n6j15J91P6o9j87J70
$$ -135 87 116 -151 -133 83 30 -274 17 67 -97 -207 19 172 10 -65 37 -19 -134 57 133 64 -123 47
3361D7Q2n2k15J58n5L8pP1n5j07J02q0K16j52j3P1q0p7L9J14l4j9m5P9J04r1j17
$$ 47 129 77 -138 20 -35 3 -4 67 12 -95 7 -73 143 -9 -22 49 -31 -108 -69 45 11 -8 -53 26 130 39 -78
3388g8K41l42LL51m4k47J01m4J13j15j39L83j08j61J27m9P4j71L2J14o9L7j82
$$ -78 163 -179 -176 175 131 -116 -15 -59 54 -61 -200 183 75 -86 41 -8 66 -105 -73 41 -28 9 -173
3411a73L07k11l5L49j25l40J09J61j31M9k1J72p7k69K34J21j92Q5j6K38j47l39
$$ -173 134 -77 -112 237 112 -228 -119 42 -89 -40 -61 111 34 -235 -1 120 -72 13 -3 235 88 -251
3433b51K9L32k99kK03O2j02k5J03j7j26M8L4j8p1J33K10k01r1J23j15J68j05l5
$$ -251 -222 110 -189 -191 12 74 -28 -53 50 33 -93 -45 -11 -29 -100 33 243 42 -49 74 -41 127 22 -13
3457a3J01o7r9O2lO5j36J97j61j69J18R1M1j44R6J51l64K08J94r9Qn2k8K21k12
$$ -13 88 21 -78 -16 -19 46 -90 107 -54 -223 -105 -14 27 -117 -21 130 -234 -26 168 69 77 25 -3 218 6
3482Fk32J83J12j25L9O1n8l3M3R4k30M3R5nQ9j86J25J75k57O2J3M5j47j54J75
$$ 6 -226 -43 69 -56 -17 44 -14 -47 -4 90 -140 -97 -2 -7 82 -104 21 196 -61 1 14 59 -88 -242 -67
3507f7N2oo1J35rj80O9K31j13n6Pk3R9j69QM1m0J59q2Q5j96J19J2J84j13m7N9
$$ -67 -15 -21 -82 53 44 -136 -67 164 51 -5 2 -21 78 -91 -83 -42 -82 77 -5 80 -116 3 15 199 86 39 98
3534I8j56R5N7J1q0j36J58p9q6j3J09J04pj72J40%n3M1m0J31k17K8K11O0k56j4
$$ 98 -58 37 94 105 25 -111 47 -32 -118 -131 -22 82 75 -97 43 43 -10 31 -9 122 -95 -67 144 204 -52 -66
3560f6J6K9j13K2J79o5J07j30J31j75l8L9K7J56l18K54q3J04j24j28J20p3K18
$$ -66 -50 -21 -134 -112 67 2 109 -21 110 -65 -103 -64 -37 119 -199 55 -28 76 -48 -176 -56 -129 89
3583H9k1j23j55O4J73m9j5P6J15l14R0J25P3k67o9K73Mj79N6J00Q2j67j18L93
$$ 89 68 -55 -210 -146 27 -22 -37 39 154 -160 -70 55 128 -139 -208 65 69 -110 -54 46 128 -39 -157 236
3607B36j49r7O8K2nj26N0q2J10j29j4K70j57J6Q6l4k66J42L8L0R4p6Q2j76j08
$$ 236 87 -10 58 80 75 -51 -1 -83 27 -102 -116 154 -3 13 99 65 -201 -59 -21 9 103 27 109 -67 -175
3632a75K06J19j93j10J03J52k11n9J70J41j05j25M3J4q2j12L28qj16N3j30J34
$$ -175 31 150 -43 -153 -50 102 -109 -168 2 143 38 -87 -44 -30 -112 -224 104 96 -20 33 -97 37
3654C7j16K44l2j36oK19r4k36r4K05K80m60K03K2J51l73K44l3Lq0R9n0J33j57
$$ 37 -79 165 133 -3 -9 210 116 -120 -214 -9 271 -189 14 36 187 -186 58 25 28 -52 47 -3 130 -27
3678b7J12l0K8j98J44Q5j27j31K50m3j03M1J50P6k37o8J56K9k60R6Q4j0k03J42
$$ -27 85 55 83 -115 29 114 -13 -144 106 63 -40 1 151 227 -10 -78 78 107 -153 -57 27 17 -186 -44
3702d4J4M6r2J10L4j32j9K24p4j17l6R2j2j14J26J54N0j51j27J92Q7k65OK27j09
$$ -44 -30 16 -76 34 68 -64 -83 141 67 -50 -86 6 -6 -120 6 160 210 59 -68 124 211 -54 -48 179 70
3727G0k5k06L27l17K45q0j32K00j77K26j17k88L64L6ok99O0K17n7m8J57r0j38
$$ 70 45 -161 166 -151 94 14 -118 82 -95 131 14 -274 90 126 120 -179 -119 98 41 -7 150 60 -78
3750g8j09J20J29j55J7R3j7rR6Lk9j26K83q5j35j33N0J93k73m6J64N8P5j52J07
$$ -78 -187 -67 62 -93 -76 17 0 -9 87 90 61 -65 218 133 -2 -135 -85 108 -165 -211 -47 11 86 -66 41
3775D1J17j99M3p7J17j4M3J04j45jn2k7Q0j87N3P8O1j22k9J07Rj17J23m9J32k47
$$ 41 158 -41 2 -75 42 28 71 175 30 29 -23 -50 30 -157 -104 -26 35 -87 -116 -9 0 -117 6 -43 89 -158
3801a58K20L7k63o4L41l5k76K81j7j2j14J79m3J37k75Q0R9k30K14Q5j98j65K27
$$ -158 62 99 -164 -228 113 78 -198 83 66 54 -60 119 76 213 -62 18 117 -113 101 186 -12 -177 50
3824E0Pm8j54R4J32j42r9K88M6j47r7J06J44k13jL0P3j70kK60k7k20N3l6J03k8
$$ 50 57 9 -145 -51 81 -61 -160 128 174 27 -70 36 180 -33 -34 -4 69 -101 -103 157 130 -90 -37 -73 30 2
3850Bj5J30m8j66K8Q9j6nR4j90j1k19J84K4K0n5L64j97o7r1J87j76k8J69K02k28
$$ 2 -13 117 69 -97 -69 20 4 -1 93 -97 -108 -327 -143 -119 -99 -154 210 13 -54 -145 42 -134 -162 7 209 -19
3876a9l0j00J75J19j79Mk6j80J93K2M6pk6r0O9J3j72J17J49Rl0n0J43j92j04K91
$$ -19 -49 -149 26 145 -34 -30 -56 -236 -43 -21 25 18 -8 -98 -29 -16 -188 -71 78 87 57 7 150 -42 -146 145
3902A45r4l8j47J39j14J93r6O2p5L1L2P1k19N1L7R3P7j17J19j83j6pR4K77l54
$$ 145 51 13 -134 5 -109 84 -12 50 -25 6 38 109 -110 -59 -22 71 148 31 150 -33 -49 -56 38 315 -39
3927c9KJ7M9k16P9K5K64k36J25Q0k61J11M2Q4k70J37j44J56j71J47P5k9k9jJ17
$$ -39 -37 -20 29 -187 -108 -83 181 -55 70 150 -111 0 42 126 -144 -7 -151 5 -166 -19 56 27 -2 -3 114
3952A14o9q0KJ31j61J2K12l15M8N1J15O7j68K9J49j31j52L5J68J29l56k7K68q6
$$ 114 45 -35 -33 98 -63 -51 161 -154 -106 -55 60 127 -41 -12 137 6 -146 -111 57 186 -170 -197 71 -15
3976a5j2M0J66j75oL1o7j19K86j32oj2l6J86j35J03l1j70R1J6m5J11Q7k44P6O1
$$ -15 -27 13 179 4 -2 29 -38 -157 129 -3 -9 -21 -57 129 -6 97 66 -104 -13 3 -42 69 156 -88 -12 49
4002D9J48j34M2k0m7j58K75k69L9j6O2J53m18L51n9K30k27j4PLj19p3K13K1p4
$$ 49 197 63 105 85 38 -120 155 -114 -75 -91 -29 124 -294 57 -2 228 1 -13 -6 -3 -122 -195 18 39 -35
4027c5J43Pj53pm7Mj31J20K34l01J79k8R0l8k45N5Q0M6R6oL8m3l4l12M23k49k3
$$ -35 108 115 -38 -45 -92 -88 -219 -99 135 -166 13 -15 75 37 -208 -153 -73 -27 69 63 101 58 24 -288 135 -114 -137
4054a37J63q7N7j5J32j98J66j9Q6j69j0Q8Kk3j25J88l1j62J30M5J0j74m5K00m9
$$ -137 26 -61 -4 -19 113 -85 81 62 148 -21 -31 57 59 36 -89 99 68 -94 36 81 91 -83 -128 72 23
4079B3Q6j86J73P0k86O9M3J20k42K57K4k2k66K16k56J30n2Kk5Q0M8o1l3r5K48
$$ 23 109 -77 96 166 -120 -51 -8 112 -130 127 151 129 -137 79 -177 -47 -99 -97 -122 -42 6 -55 -88 -183 65
4104F5Q0jj32j47K65j19Oq3J74j27q3K30J3j73j4K27j89j11J08p8qj04J69n9K38
$$ 65 145 144 12 -135 130 11 17 -66 108 -19 -102 128 141 -32 -46 181 -8 -119 -11 -89 -97 -201 -32 -91 147
4129A47k49J54n1J08j14l0j0N5O7k27M8J0J92j2n7n5oN8l5R0q2J31m0k93J95L1
$$ 147 -102 52 1 109 -5 -35 -45 10 77 -150 -102 -92 100 88 31 -24 -30 28 -7 83 1 132 92 -201 -6 25
4155B5k2O7p0R0j88M4K8K7K6j01K6J22ln6q6O6Q8p2m4K8k9J2J35k26K37k3j37
$$ 25 3 70 0 90 -98 -54 -26 1 27 -74 -48 74 71 15 -71 -5 83 11 -33 -5 -34 -22 113 -113 124 101 -36
4182c6Q9j06R7m0o7J28O6pj68j31J07R0k78L01n7q6K84k86J32j60N5J11ll6J30
$$ -36 53 -53 44 4 -63 65 131 124 -44 -175 -68 22 -256 45 -12 -98 186 -100 32 -128 -73 38 35 -1 129
4207A29j68q5J13oKl8l5J48q0J1O4k1q5J87j8j33Q4r6j37R5l8p9J97n7M4J09j48
$$ 129 -39 -124 -11 -17 -15 -53 -88 60 -20 -9 55 34 -51 136 118 -15 69 -27 -164 -69 -107 -186 11 -46 -2 107 -41
4234d1o1O0j21J62J15L7k39JN3P1j07J9J29j02L1J6p1K14k61J36r8K81j67j63
$$ -41 -102 -42 -163 -1 114 151 -88 -87 -34 37 -70 -51 78 -24 7 23 -48 166 -95 41 -57 224 57 -106
4258a06J45r9LK84m69J33M1K8Q4j00P7o2J44n7o0j75J66k6K12j27P4p7l8J63o7
$$ -106 39 -60 -57 227 -242 -109 -68 -40 44 -56 21 -41 103 46 -14 -189 -23 -49 163 36 110 33 -5 158 91
4283I1Lk9r8jO3n1J50j62J53k25Q0P6j50K18j53J87Ok2l02J96j27N1j57J3J00
$$ 91 94 65 -33 -34 29 -22 128 -34 119 -106 -26 50 -100 118 -35 152 158 136 -166 30 -97 -46 -203 -190 -90
4308i0P5p8O9J37j10k04J96n9o5J85m4k4p7j09J99J9Jp6J87j62o5n1L36j65N2
$$ -90 -15 -93 -24 113 3 -201 -5 -64 -129 56 12 -12 -89 -198 1 20 21 -55 132 -30 -95 -146 190 25 77
4333G7m5m4J47p4J01l39R7q6J68N4j7j90k3K99k32J05J43l5m5k32J13o3J86k18
$$ 77 32 -12 135 61 162 -177 -80 -166 2 56 39 -151 -174 125 -107 -2 141 106 61 -171 -58 -121 65 -153
4357a53J1L01l23K32nj24r2J9J98k1q3l8J4L21l03r2J93O7j36O8j26K4R5o9L2
$$ -153 -142 159 -164 68 63 -61 -153 -134 64 43 -40 -78 -64 257 -46 -138 55 122 -14 54 -72 -48 47 -22 10
4382A0k03K50j15K1N4Kj45K69o2j88J41j5j75J46k6j5L5r7J25P2r7J06j61Q9l8
$$ 10 -193 57 -58 -37 17 19 -126 143 81 -107 34 19 -156 -10 -36 -51 -16 -113 12 84 -13 93 -68 21 -17
4407a7R2j26J64j87m3o3J21J36k6jp3J44k9j49M5P4rk2j05J43J02k50m0J79j26
$$ -17 75 -51 113 -74 -117 -180 -59 77 51 50 -23 121 92 -57 -12 62 53 31 -74 69 171 -79 -119 60 -66
4432f6k4J66j14J45j06R3k6m2n9J83j26K1m1rp2J08m1J6K8L7k01J21q8n1J71O9
$$ -66 -90 76 -38 107 1 94 68 26 -33 150 24 45 4 -5 -77 31 -10 6 34 71 -130 -9 -97 -148 23 92
4458I2j51J35k8r2J12j74K00P8q7j2L8j32q7J42q0K6l3M1L1m4Q5L0m6m8Nj34l9
$$ 92 -59 76 48 -44 68 -106 94 172 85 73 111 -21 -108 34 -46 -20 -53 -12 19 -25 60 90 44 -4 1 -133 -172
4485a72P3K69k44J07m1J30k27P3J58o3j39Q2m2OmL1k9p8J50n1jj29N6M5JJ72M4
$$ -172 -99 170 -74 33 -8 122 -105 -32 126 63 -76 6 -36 -30 -34 -3 -32 -110 40 -11 -12 -141 -85 -40 -39 133 177
4512A77j38o3J02n9m6J40K7o2j11KK06j88j70J17J14J07j62p0o9J48Q1J48j78
$$ 177 39 -24 78 19 -27 113 140 78 -33 -31 175 -13 -183 -66 48 155 -7 -77 -146 2 83 231 53
4535E3n3J09n8k06R8O1M6J7K0q4K3n4o4K49k07J9P7k8m9J16k32J90o4rl1J22m2
$$ 53 0 109 51 -155 -57 4 50 67 87 3 26 -28 -92 157 -50 -31 46 18 -31 85 -147 43 -21 -30 -61 61 19
4562A9j67R6J00l5Qk2j3P4K6N3p5n1j03J42J49j78m2mP4r4K15j02l5P4j21N9k9
$$ 19 -148 -52 48 13 21 -1 -14 60 86 139 64 13 -90 52 201 23 -19 -23 51 -43 172 70 35 109 -12 47 18
4589A8q6J35j1o1J25j36p1Q9P1L3Lj51K7J27o4k04J22P8j16J74p3j41J9J88j79
$$ 18 -68 67 56 -5 120 -16 -87 2 73 106 109 -42 -15 112 48 -156 -34 44 -72 102 29 -112 -93 95 -84
4614h4R6q1J34j6j78R3j13K11r9k8J06N3M2j40nN0j04J17l6p1J2R3p5k0RP8Nk6
$$ -84 12 -69 65 49 -129 -36 -149 62 -37 -65 41 94 136 -4 -9 41 -63 54 18 -53 -41 52 -23 -43 -34 44 49 23
4642B3K4o9l7J33qj78m1J95j35o7O0P6o5r8L40q4j48L8J8Q5q2K22j74J9l6k6K7
$$ 23 47 -22 -59 74 66 -112 -153 42 -93 -160 -100 -24 -89 -187 153 69 -79 -41 -23 62 -20 202 28 47 11 -15 12
4669A2n8M3L6ko5m0Q6J8J05j89o4%K73j91kpjP9o3J99j26K0j5J8OJ7n8J29j73
$$ 12 -46 -3 33 31 -34 -74 12 30 135 -54 -118 -118 155 -36 -38 -45 -46 33 -30 169 43 63 48 66 72 89 31 160 -13
4698a3j8J76Ml37J06J13j03n1M8L7r7K24j68n0K12o8M0j60J56j85Q9K0L4N3o2
$$ -13 -31 145 149 -188 -82 31 -72 -123 -75 -38 -135 89 -79 -129 83 15 55 -105 51 -134 -45 -25 9 62 0
4723@j86J85N9j76R2M8lJ04j31l0L0j18K59l67K46r9J33j26K20k19J42j16J54
$$ 0 -186 -1 58 -118 -26 22 19 123 -8 -38 -8 -126 133 -234 12 -87 46 -80 140 -79 63 -53 101
4746A01j40R9P5k68J24N5j27N5N7o0Qj22J60k73K40l2N9K2P0j65R8j91K64L5j03
$$ 101 -39 60 135 -133 -9 46 -81 -26 31 -29 -21 -143 17 -256 -16 -48 11 33 103 -62 36 -155 109 144 41
4771D1K4j40m9R1J47p7q7Ln5J60j68O8j04K46j71n8Q4J35j53J20k4o9lN1M9n2
$$ 41 65 -75 -124 -33 114 37 -50 -47 -102 58 -110 -42 -146 100 -71 -129 -45 90 -63 57 33 -36 -39 12 61 9
4797Ik7P6l0j0lj08J64j41JL8o4J67o1l8J63q9l7M1l0K3j45N9J33o2n7NM6j5J06
$$ 9 -18 58 28 18 15 -93 71 -70 -69 -31 -95 72 11 -27 136 47 10 51 21 44 -101 -42 91 29 -28 -23 23 8 114
4826A14o4J4j86L38k23q0L4pJ36o1j45j4J23m6J45n2j44K47k01K0N4l2r6O1L7
$$ 114 50 64 -122 216 -7 -87 -53 -60 76 15 -130 -144 -21 -67 78 26 -118 129 -72 -52 2 -30 -126 -65 -28
4851b8Ml5K2J22q9J09l7j18M2J03j84RJ33j51J08q1J64j06j37j3L83j87o0n4R4
$$ -28 -24 -59 -37 85 -4 105 68 -50 -8 95 -89 -80 53 -98 10 -71 93 -13 -150 -163 220 33 -27 -81 13
4876A3M5o5l8Q1L2k22J55j02J97j74J32q3m8N4J09o0K1q9J15p0j68K30P9j24q8
$$ 13 58 -7 -45 36 68 -154 1 -101 96 -78 54 -29 -77 -23 86 26 47 -42 73 3 -165 65 144 20 -68
4901f8R6L6K1j82j79K94J10j52J8q0J07j32k2N1N1O0m4o4r0J86M1l5P2o0m8J06
$$ -68 28 64 85 -97 -276 18 128 -24 -6 -86 21 -111 -133 -82 -31 29 -15 -79 -169 17 58 23 95 35 -13 93
4927I3mpj4j68M7K04k55R5k2J7L7k46K10o3R2J48k38K55k05L5n7K20k76J11N2
$$ 93 89 82 68 -100 -53 151 -104 -9 -31 -14 23 -223 -13 -76 16 164 -74 181 -24 11 -46 174 -102 9 61
4952F1o9o3J08J6o9J56M6j37k17K10J54k44J47j20p7N0P6O8q5k30J96mP8j08J11
$$ 61 -8 -71 37 53 -16 140 186 49 -168 42 196 -48 99 -21 -98 -48 28 96 11 -219 -23 -27 51 -57 54
4977E4P5j4j34OP1j2r1J41r7j07K09j55J28j02k4m9R8J7j43OO7M8J8N6k8j31J41
$$ 54 129 115 -19 -13 58 46 -45 96 -1 -108 101 -54 74 -28 -52 -101 -3 14 -129 -123 -56 -8 10 66 38 -93 48
5004D8j69K48k92K7J06M1K32k87N7J48l15J71n9J16n2j04J68j23J07j70O6p1p6
$$ 48 -121 127 -165 -138 -32 9 241 -46 11 159 -156 15 -44 72 20 -84 84 -39 68 -102 -36 -107 -183
5027a83J48P6%p6R4j2O0j00j5r9J36j21l6J87k51K69j02j9o5O6P1J04n9j09N1
$$ -183 -35 41 41 -35 59 47 107 7 -8 -107 29 -92 -128 59 -192 77 -25 -44 -109 -43 28 132 73 -36 15
5052A5J1rP2k4n2p4O7j18K56k82J19j7OJ2k6jJ69P5j24J6M9j97j1l0J36q9J8M
$$ 15 26 17 89 65 13 -61 6 -112 144 -138 -19 -36 -30 -18 -44 -45 124 199 75 91 140 -57 -68 -98 38 -51 -33 -29
5080b9l2J60j12m2P8j62J80j46m7R8K81j95m5J27M8j04j18J37nr7J17p8k46O9
$$ -29 -61 99 -13 -55 23 -139 41 -105 -152 -54 227 32 -13 114 162 58 -60 77 72 -25 92 14 -232 -163
5104a63P2M1P0J10j82J14k18o9k0K25O8m6M6j18o7R2JQ8j73J79L9j53k1J10j26
$$ -163 -91 -50 20 130 -52 62 -156 -225 -245 -20 48 2 48 -70 -137 -45 -44 44 -129 50 89 -64 -85 25 -101
5129a01J67Q6r7k9q5%L5l5L1M1J8J1m8J15k04K44j79J39j5P6l63K96j76j4J36
$$ -101 66 152 55 26 -59 -59 -24 -59 -28 13 31 42 -6 109 -95 149 -30 109 94 170 -193 103 -73 -87 49
5154D9k28J51J03J22j95K32j29j19K22j90P8N4j85n3Q2K0k1o4O8J30n0n3j56n
$$ 49 -179 -28 75 197 2 234 105 -14 208 18 96 150 -35 -88 -6 14 -7 -71 -3 127 77 24 -132 -137
5178a37J59J23j56j3k0P4n6K04p4ko4l1M9l5J07p8l0k2J19j37N5j5O3j34o1J4
$$ -137 22 145 -11 -24 -44 30 -26 178 104 102 38 7 56 21 128 50 20 -2 117 -20 35 20 83 -51 -112 -98
5204i8K46k53O1K8Q7j01l2M9J20k01k3J10j27J18K7L8M0l7j24J17n1Q7j20J01
$$ -98 148 -105 -44 -16 71 -30 -62 -13 107 -94 -117 -7 -134 -16 11 49 89 52 -72 45 -6 81 -39 62
5228F2P6q5p0j41K5J08j40K24m9j34K30k96J09J2Q9m1J32j32n0M0Q0N0M9l6j24
$$ 62 138 53 -17 -158 -133 -25 -165 59 10 -124 106 -190 -81 -69 20 -21 111 -21 -71 -31 49 99 148 112 -12
5253a2j21J28O9p2j56J56o9p6J9K67j09M7n8n6K19j85R1qJ4j82K46n6j52L6K93
$$ -12 -133 -5 64 -8 -164 -8 -77 -153 -134 133 24 71 13 -43 176 -9 82 74 88 -94 152 96 -56 -20 273
5278B73k99K6m7J88k21O3p8J05k9j18l5J86N2N2r2o0l0lJ71k35P1L3j45K27j43
$$ 273 -26 0 -47 141 -80 -17 -95 10 -19 -137 -172 14 66 118 26 -34 -64 -67 104 -131 -60 -27 -172 55 -88
5303h8L0J57J4j62N2J31j30j39J23n9J68p3rJ3n5lJ7N7j0L9j2Qrj24J05j5m5r
$$ -88 -58 99 113 -49 3 134 4 -135 -12 -71 97 24 15 28 -27 -30 -13 44 34 73 61 69 60 -64 41 26 -19 -28
5331b8M4k1j05J31k7m2%j7M5P0m6k1K6M4j22J62O2j25q4R7r7K4J65j55n5k2J13
$$ -28 16 -5 -110 21 -6 -48 -48 -65 -20 50 4 -17 9 53 -69 93 155 30 -54 43 -54 -30 135 -20 -75 -97 16
5358A6J43j89oJQ6O6j75J32rq9p0N7Q6j81J68j26J07K7o0j2O9m9J7J57k25O5K4
$$ 16 159 -30 -36 -35 51 117 -58 74 65 -24 -94 -37 49 -132 36 -90 17 44 -16 -28 41 -8 9 166 -59 6 30
5385C0r8N6J6J09o6l9P4m9%k15K64n4n0L5R8j7j48j70K15k6k7Q1m8l6l0J38n5
$$ 30 -68 -12 4 113 47 8 82 33 33 -182 82 28 -22 13 111 94 -54 -224 -9 -35 -62 19 -29 -65 -95 43 -12
5412a2J17j10QJ27j68j13J79j14J58j67j0J40l7l0K29k50K0n3O5R3j7j70J54K3
$$ -12 105 -5 3 130 -38 -151 28 -86 72 -95 -105 35 -2 -32 197 -53 -33 -86 -21 72 55 -115 39 62
5436F2k94L81j99l7M6J32k34J45J01k72K43j42n1P0J25j22N9M0J03k35J59r0J34
$$ 62 -232 149 -50 -87 -41 91 -143 2 103 -169 74 -68 -119 -49 76 -46 13 53 156 -79 80 -10 124
5459A24j51n2J90j88J41%l8K1l8j02k0O6J12j33N9q3L1j5J47j17M3L3Ok17K45
$$ 124 -27 -79 111 -77 64 64 26 47 9 -93 -113 -47 65 -68 -9 -92 -61 -76 71 -46 -3 30 36 -181 64
5484F4nj41P9j30J91j69P1R0l0K1J3j20l0J31K5r9P4j8p8O7J54r8j21P6o1j87
$$ 64 59 -82 -3 -133 58 -111 -40 50 20 41 54 -66 -96 35 60 -39 35 17 -61 6 160 62 -59 17 -44 -231
5510b31K58j48J5L8P1O3m4J1J10K8j21J12o1j30mM1Q6j11JK7L5oRn9P1j43Q7m0
$$ -231 27 -121 -106 -68 3 66 22 33 143 171 50 162 101 -29 -33 8 94 -17 -16 11 46 40 49 -10 61 -82 5 -35
5538c5l3J60j32J45j15m5n8J20J54j67k6n8O3kL0k6J07q2kJ05j65J84j56jL3l2
$$ -35 -68 92 -40 105 -10 -55 -113 7 161 -6 -32 -90 -27 -29 1 -25 82 0 -2 103 -62 122 -34 -35 -2 -34
5564c4n4J42P1r3Q4m5M8j44J31j15j18lN1L4p5J21k4K5K53l49Q9nr0N7RO1j02
$$ -34 -88 54 125 32 116 71 119 -25 106 -9 -127 -130 -79 -45 -120 1 -23 2 255 -94 -5 -10 -100 -43 -34 27 -75
5591g5Q1j92K65j10j9P4Nr2P3j03J10O7l7J54k57J9k02K11om1K2M8m3J8n5K18
$$ -75 6 -186 79 -31 -50 24 29 -63 10 -93 17 84 47 201 -56 -37 -239 -28 -34 -75 -53 -5 -48 -30 -85 133
5617A33p3O7j48K7l7O7j01j42K17n9p4J40j72K16j9j66L02k34J03j97J63Q1j67
$$ 133 60 127 -21 6 -31 36 -65 -207 10 -49 -123 17 -155 61 42 -124 178 -56 47 -150 13 94 -73
5640g3R6k1n4J77j94K20p0j17R9p5q4O7j38K3K22j44j93K42j22J04m0O7K04l25
$$ -73 23 2 -52 125 -69 151 81 -36 63 -12 -96 -29 -167 -144 78 -66 -259 -17 -139 -35 -75 -8 196 -129
5664a29J11J49j09J7k2Q9m4j34%J97j18k03J97l2N5j12O9p8R4r0r4L03j68n4n7
$$ -129 -18 131 22 39 17 106 62 -72 -72 125 7 -196 1 -31 24 -88 -19 -97 -3 -93 -187 116 -52 -106 -163
5689a63J64L4P1p0k0K5K9K2j77M1m8J36o7N5k5L0j11K8J72j14k27J69N6j26Q4
$$ -163 1 35 106 36 16 41 70 92 -85 -44 -92 44 -23 32 7 37 -74 -46 126 12 -215 -46 10 -116 -32
5714c2k3n2p6J84M8N4j71J63Lo8o6L3J26k22O8p4J71J12k40J45j96j6P5j4R2q3
$$ -32 -55 -107 -183 1 49 103 -68 95 98 30 -36 -3 123 -99 -31 -105 66 178 -62 83 -113 -129 -54 -68 24 -59
5740e9R1Kj33lj21K13p6J59Rj4j65L7J47o6k6k5j08J92m2l4k40K70k6K60q7j59
$$ -59 32 34 -99 -102 -223 -10 -86 73 82 68 -97 -60 87 21 -5 -30 -138 54 12 -22 -262 8 -18 242 155 -4
5766dk27K64n6R2J1k8k2R7k34P0M9K5J7k19K94j63j42L60l52K58j70J82j06J6
$$ -4 -231 33 -23 69 80 52 30 127 -107 -37 12 37 54 -165 129 -34 -176 184 -168 90 -80 102 -4 12
5790A2J05j97J07j46J8j3J45k91M20l66J68L7k32L29Jo1j75L5Rk6K24j57O6j33
$$ 12 117 -80 27 -119 -101 -114 31 -260 160 -206 -38 -1 -233 96 97 36 -139 -104 -95 -121 103 -54 12 -121
5814a21J49j61K61j07P4j96j7J55l3j67K72j75K9J1mJ39p5O7j9q4o5M4J15j25
$$ -121 28 -133 128 21 95 -101 -118 37 4 -163 109 -66 -37 -26 -30 109 34 101 82 -2 -67 -23 92 -33
5838c3n0P6R1j27J3k7qj3q6K01J41r6j87qR1J8j22P6N6m6KK1K6q6J16n9l4K2J67
$$ -33 -83 -7 84 -43 -30 -57 -65 -78 -164 37 178 82 -105 -113 -22 -4 -126 -50 6 -40 -38 -17 9 -77 39 -20 -54 -32 135
5867A35j23QN2rK9m6M7k27J50J16m9J67j91o1J8M8OM3O3j42K8j75J47r7J46o2
$$ 135 12 20 72 63 92 46 93 -134 16 132 83 250 59 -2 16 64 70 113 176 34 62 -113 34 -63 83 21
5893B1J1j25L04k32M3L4M5Q4k17J3j45J78M4j47P2l3m1K0J78J3o9m4J2j9k57J63
$$ 21 32 -93 211 -21 22 56 101 185 -32 -19 -164 14 58 -89 -17 -50 -91 -71 107 120 51 7 19 0 -257 -94
5919i4QJ42p4NJ20j70Q2L6O4K6m5j26J9j0K8q0J18j9J61m6j75p7R4Oj07J44l1
$$ -94 -86 56 -18 -13 107 -63 19 55 119 145 100 -26 -7 -17 11 -69 49 30 191 145 -30 -107 -13 -7 -114 30 -1
5946aj58K85L8k44k6J62r1N3j12P9J1j14J86m4j00L5J14qj12P4L1rR2k24J42m2
$$ -1 -159 126 164 -80 -106 56 -35 18 -94 -15 -4 -118 68 24 -76 -41 73 65 -47 27 58 49 141 -83 59 17
5972A7O8j46lJ3P9L6j85k8K33l5J5J9o7P1k06K26j13j8K12j17j44L3m7J75j03
$$ 17 85 -61 -64 -51 28 64 -121 -149 84 49 64 83 16 87 -119 107 -6 -24 188 71 -73 -40 -87 88 -15
5997a5J25j36N6L2JO6j14L5k17J96P9l9j15J25J7j4r3o2J17r0J23J8p9J8q8J39
$$ -15 110 -26 30 62 63 129 15 50 -167 29 108 69 -46 79 96 82 -11 -73 44 -46 77 95 16 34 -54 85
6023H5l7N8N6j97N1J0o0j7N2j0nQjO5j75J50j18Q0k0j4J15m3k48J55n3J3J90M3
$$ 85 48 106 162 -35 16 26 -34 -51 1 -9 -14 -6 -7 58 -117 33 -85 -5 -25 -39 76 33 -215 -60 -113 -100 90 133
6051A33l7o3r6K19j47j60J31J36m7k9k22J77k0O9O5j08Q9j95J8j09K52lj38n3
$$ 133 96 33 -63 156 9 -151 -20 116 69 40 -182 -5 -25 44 109 1 90 -105 -87 -196 56 53 -85 -138
6075a38P9J10l7N6M4j99N5J0Q7l6l2k7J20j72O2r2J24J8O4q7j8K0q2J01M2q4j36
$$ -138 -59 51 14 70 114 -85 -30 -20 67 31 -1 -28 92 -80 -18 -110 14 32 96 9 -9 11 -71 30 72 -12 -148
6102a48N4J44j52J2K1O0K19k83J84j17N6k8j0K1j30n7J96o7J71m1j31P4j57J50
$$ -148 -94 50 -102 -90 -69 -9 210 -73 111 -6 50 22 12 33 -97 -154 42 -25 146 105 -26 48 -109 41
6126D1r8N6J0o1L3lJ45K5j97J01j1QJ9j27%Q0J22j64o3K33n2K1p8Q7j76N8o2J00
$$ 41 -57 -1 9 -52 -19 -22 123 148 -49 52 41 49 68 -59 -59 21 143 -21 -84 149 97 118 40 127 -49 9 -53 47
6154D7j90J66R0j42j4KQ8k14N1R7J13j37K32j37K9k89L36k39J38o6M6k5o2J58
$$ 47 -143 23 113 -29 -43 -41 47 -167 -116 -19 94 -43 189 52 81 -208 128 -111 27 -39 7 -18 -80 78
6178G8q2m6J11j80n4J28n1J21j28M4l0J12Q3M6J8j52j10qPO1K27k67K7l8K1J21
$$ 78 -4 -50 61 -119 -173 -45 -96 25 -103 -59 -89 23 106 152 170 18 -92 -100 -93 -32 195 -72 -45 -83 -62 59
6204E9p6j2RL6N5j07J44j64P1J57j15j04JN9r9J15N6r4J7J42j18o7O2K4n8m9J79
$$ 59 -17 -29 -20 16 71 -36 108 -56 15 172 57 -47 -46 13 -86 29 85 -9 8 150 32 -35 27 51 -7 -56 123
6231A23p8j17Q1J1P4j7k2j19l5P2N3j15K35j54m3J24p2o4m8J09j99J23J06K7M3
$$ 123 45 -72 9 20 94 77 55 -64 -99 -27 26 -89 146 -8 -51 73 1 -63 -111 -2 -201 -78 28 55 98
6256I8j0j15m6n3M8j2J45J31k0n8Jq7N5p7J27m7j8j9j72J33j60Q2J19%k9q0J14
$$ 98 88 -27 -73 -126 -78 -90 55 186 166 108 109 22 77 0 127 80 62 43 -129 4 -156 -74 45 45 16 -64 50
6283E0q3MJ49l8k10M3J26o9JJ8M2o5j24M6J42N9j61l7M0L2L3j44K02J47p7j7j29
$$ 50 -33 -29 120 82 -128 -85 41 -28 -27 -9 33 -32 -156 -110 32 91 -70 -107 -67 -35 -2 -146 56 203 126 109 -20
6310b0N9j45K13K4j42j0J07p8o6J57qr3M7j84J14j15J47r4P7m0m7M1K20k62O9
$$ -20 39 -106 107 131 -11 -21 86 8 -58 99 91 -2 45 -139 -25 -140 7 -87 -10 -50 -97 -56 164 -98 -29
6335b9P1n1o7L0M4P8j67QP7j21J70j20K86j65k4R3j07j3J74j60O6j03k6k5R7q7
$$ -29 42 -9 -76 -46 -2 76 -91 -83 -6 -127 43 -77 209 44 20 113 6 -7 167 7 73 -30 -56 -81 16 -71
6361g1j4l3P3m7J27N3m6M6j37Q4m6lo5K14L7k15QM6rP8m7N4K3p6r8J51N7j67J57
$$ -71 -85 -118 -45 -92 35 88 42 88 -49 35 -11 -14 -79 135 172 -43 -35 11 2 80 33 87 110 34 -64 87 144 -23 134
6390A34j23j16J4M4n7J46N1j94K73k15oJ39j39J16k89K30p1L1P7p9L6K11k41J04
$$ 134 11 -105 -91 -47 -104 42 93 -101 172 -43 -49 90 -49 67 -222 8 -63 -32 45 -34 2 213 -28 76
6414G6p5k2o2n2R0l1m5J43j13J13K2m3K5j91K56n5p3J78j21p6J81j89J61k6M1
$$ 76 1 -21 -83 -135 -45 -76 -121 22 -91 22 44 1 26 -165 91 36 -37 141 20 -56 125 -64 97 71 112
6439A12j55m0J04M7j28Q6j77J21j31R5J36r0R2j18L4J05K8k60J71j14M9N0K08
$$ 112 -43 -83 21 68 -60 26 -151 -30 -161 -66 70 -20 72 -46 -12 93 121 -139 32 -82 -33 17 225
6462B25j11k34M3O5M1p0n1J00n7j21J46Jj06K67j21j8jk7Q3O0m1j26J30k69K33
$$ 225 114 -120 -77 -12 29 -41 -92 8 -49 -170 -24 -23 -129 138 17 -1 -2 -29 54 114 73 -53 77 -192 41
6487D1k04K08j87O8J57q0p5J59L9k19J24k9l4l2Q6k9p9j8J91j91KJ36L0M3r2m6
$$ 41 -163 45 -142 -74 83 3 -72 87 126 -93 31 2 -32 -64 22 -7 -86 -104 87 -104 -102 34 64 107 15 -31
6513c1l5N8j00L1Kl3K63j98N3l5J52m9p5K27k69r8lN2R4k0j64L08k07Q8Q4j29
$$ -31 -66 -8 -108 -77 -75 -108 155 -43 10 -25 127 78 3 230 -39 -137 -140 -88 6 -14 -178 130 -77 11 95 -34
6539c4J25j96J30N5j24J20j22J0N3m3O0j07K1O3j88J66%n1K7K4j13O8J23o8k4
$$ -34 91 -105 25 80 -44 76 -46 -36 17 -26 34 -73 -52 11 -177 -11 -11 -62 -35 -11 -124 -56 67 -1 -25
6564b5K1q3PQR4r2N1l5J86l09K06p4J7j4O2p6J6R0j50O6K3K2q7J33r3m8o8K63
$$ -25 -4 -87 -80 -72 22 -70 -19 -54 132 -177 29 -45 -28 -42 20 -56 -40 50 -100 -34 -11 11 -76 57 -36 -84 -152 111
6592A11j29J01k8L4p7J95j90P9o1M7K8k32J3J32K1r6O6r9m2M4J96M5j48k2J41
$$ 111 -18 83 55 89 12 207 17 96 35 82 110 -122 -109 23 44 -52 14 -85 -127 -83 113 158 10 -12 129
6617A29k12J8K33l5j29K8j10R9k04J82j39K44Mk74J62L7J35r5M4j86m3O5R0q9
$$ 129 -83 -65 168 133 4 32 -78 21 -183 -1 -140 104 108 -166 -4 33 168 73 117 -69 -112 -47 43 -46
6641d6M8j50K2K42j65L7j12p1J10J13J42j08J4O7j16l9P4N8j50N7k9j5r2J28j6
$$ -46 2 -148 -126 116 -49 -12 -124 -195 -85 28 170 62 76 143 27 -12 62 120 -30 27 -2 -17 -109 19 3
6666Cj33J39P9qk16P0k8l0L14k41P7J20k77oJ0J84j75P8MJ77j56j17J68j00J05
$$ 3 -130 9 88 80 -136 -66 -94 -124 190 -51 26 146 -131 -137 -127 57 -118 -40 -36 141 -15 -132 36 -64 41
6691D1l2j6O6n3p0J89l60J87J12l9q8L6J73j03n4K1J05Ol5j02J0L2k7r2J28O7
$$ 41 9 -7 59 6 -64 125 -235 -48 64 25 -63 -27 146 43 -11 10 115 121 86 -16 -6 26 -1 -93 35 102
6717A02r2J9jk0q6QL8J86k01O4r8J11j69R3o5J44K3l2K0n0J85j67k6Q4k11J14
$$ 102 10 29 28 8 -78 -70 -32 154 -47 17 -81 30 -139 -46 -111 33 56 24 44 -6 179 12 -14 70 -141 -27
6743b7O1Lk2P9j96J12K8j00JJ74M1p0q6j8J20j5j11J94k30P9M9qj17p9J26p0J0
$$ -27 34 37 15 94 -102 10 38 -62 -61 113 154 84 -2 -20 100 85 -26 168 -62 17 66 58 -59 -138 -12 -82 -72
6770g2J5Q0p0nR5R6j28k7K0J05p3j19J93Kl7j65J30O8j70J1m2J74j15NJ1J01j91
$$ -72 -57 23 -47 -52 43 139 11 -16 4 109 36 -83 110 112 75 -90 40 108 -62 -51 -93 81 -34 -29 -18 83 -108
6797a08J75P7j39n3nJ1j1R9j00k9K32p1n6j7M1q0P9J1m5q8N0m7j49J73Q0Jk0K8
$$ -108 67 144 5 -48 -53 -42 -53 46 -54 -83 149 78 22 5 46 -34 45 56 11 -77 -27 -74 -223 -50 30 31 11 39
6825C9q2J9J68j74j24K31j22j26K87k3j70J33j71O8N9RN1j61J74k74K24mN0n8
$$ 39 -43 -24 144 -30 -154 77 -45 -171 116 93 -77 56 -115 -47 12 21 72 -89 85 -189 35 31 81 23
6849B3K1L3j92K50K0k20R0J68r4j1j68J36N6k14P1o8K30J9k06j5J46j15J38nj31
$$ 23 44 77 -115 135 155 -65 25 193 99 88 -80 56 112 -102 -31 -99 131 150 -56 -71 75 -40 98 93 -38
6874c8k2k4J67k44J81m9J90j62L7n7j1J19j61m1J37q4Pm7J43p4nJ07j08R2L5n5
$$ -38 -60 -84 83 -161 20 -29 161 -1 36 -21 -32 87 -74 -115 22 -62 -55 -102 41 -33 -38 69 -39 53 88 33
6900C3j16K4K1l6J01r3J64j67R0jJ9p6J36j72J91p0J6Lk36K55j33nJ8O4Ok1K8
$$ 33 -83 -59 -38 -74 27 -66 98 -69 21 20 39 -37 99 -73 118 48 64 67 -169 86 -47 -52 -34 30 36 15 43
6927D3j1L3j22p0J16j34J05J30l2L9j88k0P5o8J97k47J64n1J68p7n1o8L8J60j26
$$ 43 32 65 -57 -127 -11 -145 -40 90 58 97 -91 -111 -36 -104 93 -154 10 -41 127 50 -1 -69 -31 129 3
6952Cj09K78l19J38n6N3o3J12j6j84J85n7J18j40J01j98R2M1J92k05J31lj43K0
$$ 3 -106 172 -147 -9 -65 -12 -75 37 21 -163 22 -35 83 -57 44 -154 -62 -21 171 -34 97 94 -49 -29
6976b9J40r5j26J57n9N7K7p8O6j35J06L4j17j0J82j1r8k61K00J61m2n1O1j95K46
$$ -29 111 16 -110 47 -12 45 72 -6 60 -75 31 65 -52 -62 120 109 11 -250 -50 111 69 18 79 -116 130
7001A30j23kJ20j83L4NK6J6p9LJ4nJ41o0j70K10r1M6o7Mn3o0R7O4n7p2J13R9p9
$$ 130 7 5 125 -58 -24 -19 7 23 -56 -53 -39 -44 97 37 -133 77 -14 32 -35 -31 -84 -144 -47 17 -40 -112 1 100 21
7030B1J21k5j45J9P2j52R6j0r8J00O5O3j43N7j42K11n0n4K0l0j07J7J22Rp8K8
$$ 21 142 117 -28 -9 63 -89 7 -3 -101 -1 64 127 -16 41 -101 110 60 6 26 -4 -111 -94 28 37 -41 -13
7056a3R0n8n3J07p3R8p8P2k07L1J54J47k68n9J14J04k31J59j10m0K14j52R3P8
$$ -13 77 19 -34 73 0 98 20 92 -115 -84 70 217 -51 -110 4 108 -123 36 -74 -114 100 -52 41 119
7080A19pj61o8K14j13j6J66k04K19j32L0N4j67J65j0n4j29J17j49K12L6o5%j91
$$ 119 112 -49 -117 97 -16 -32 134 -70 149 17 47 101 -66 99 89 35 -94 23 -126 86 122 57 57 -134
7104a34J81J01p2k19J16P9m2K33k28M8%J08j82J56j71K24J09k53M3J3J89l28M4
$$ -134 47 148 76 -143 -27 52 10 243 15 63 63 171 -11 145 -26 198 307 54 97 110 299 -29 15
7127A5j07J85r5m1J1M9m0p2J24p9k8P0Q2j67N7J10n3l0o5K82j40k3L8j52K6J51
$$ 15 -92 93 -2 -43 -32 17 -23 -95 29 -50 -78 -8 74 -93 -36 74 21 -9 -74 208 68 45 83 -69 -43 108
7153A08k26r2K15M6K0O1j65q8J54o7J96j17j45J47j61J27j61J08M7j5m9J65p8
$$ 108 -118 -210 5 51 71 132 -33 -121 33 -34 162 45 -100 47 -114 13 -148 -40 7 -8 -57 108 30
7176C0Q2k15R2Q9k60K01L1n7P9k2m9p2N1P6m8O1j62M0J22m3m6N7o3L3q9M3l9P
$$ 30 112 -103 -11 78 -182 19 50 -7 72 50 1 -71 -20 56 8 69 -93 -53 69 26 -20 37 -26 7 -82 -39 -78 -71
7204g1K00j41o2K4P4j9q4L8l2J41r8P4j91J48m0j32J14J31j86O9J93j68M5k13
$$ -71 129 -12 -74 -50 24 5 -79 -41 -73 68 -30 44 -147 1 -39 -171 -57 74 -112 -43 150 -18 27 -186
7228a86J53J93k23M0LO5Q7j36p3K3P8Q0q2j52K00j47j35J41lo5K38p6K0j7J0j29
$$ -186 -33 160 -63 -23 -20 45 132 -4 -77 -54 24 104 22 -130 70 -77 -212 -71 -74 -139 99 23 43 26 36 -93
7254i3J99L7r4j24JJ23J04j96JP4M7j70J22JK7j70J98M6P6j86m5nr4K41j6j37
$$ -93 106 143 49 -75 -74 49 153 -43 -42 32 79 -91 31 32 59 -111 87 133 209 23 -22 -27 -121 120 104 -33
7280c3J87k61L4N1j04J83n5J09p9m3%R6j58M3J54j57J34M1k76J95j02K7n0K11
$$ -33 154 -107 -73 -22 -126 57 2 111 32 -11 -11 85 -73 -30 124 -33 101 142 -134 61 -41 -14 -64 147
7304A47m8m1N4m9O3n7J1j96L65k33k26nJ39Q0n8k1K3N1q9J64l1o5J05j59p2J21
$$ 147 99 58 112 63 126 69 80 -116 249 16 -210 -215 -76 4 -54 -75 -52 -1 -90 74 43 -22 83 -76 -148 -27
7330b7K8J95k52J83jj06j65K33p1K2l2l1l8j11K30p2K6j27M6j36J27J63j57P9
$$ -27 1 196 -56 127 126 20 -145 88 17 39 7 -24 -62 -173 57 -15 11 -116 -70 -206 -79 84 -73 6
7354FM1k4n5p3Q5O5j55N9J91j54l6n1J42PN8j61J76j6j9j15m7n6K22j05k01N7
$$ 6 47 23 -32 -105 -20 45 -110 -51 140 -14 -50 -101 41 48 106 -55 121 105 86 -29 -76 -132 90 -15 -216 -159
7380a59J13J07j86J08J21k88K20q0M5J04j06o9K9R4p1RJ20k01O2J59o0Mp4m0R1
$$ -159 -46 61 -125 -17 104 -184 36 -44 1 105 -1 -70 -41 53 -18 -9 111 -90 -28 131 71 75 1 -39 52
7405E2j69P1J8LP6ol6m0J4l5M6l4n7J75p4O4m2j14J51n0L0j60O6k3j06K31QJ1
$$ 52 -117 -46 -28 -25 51 45 9 -31 -17 -52 -6 -40 -97 78 4 68 26 -88 63 13 43 -117 -51 -74 -180 51 59 70
7433G0j73K03j43M8M3k11K26j28K4K6j09K00m8J4p1O5k8J10j10p3Q4mPN1n1k5
$$ 70 -103 100 -43 5 48 -163 63 -65 -41 -15 -124 76 28 42 -29 36 8 118 8 -65 19 15 22 73 22 -3
7459cj18J13j6N2j6J67n4k79lN9M2M6J8j52K37j99PJ01r8PJ95j01m0q8N0N9j37
$$ -3 -121 -8 -24 28 12 179 125 -154 -157 -98 -56 -10 8 -144 93 -106 -99 2 -96 -89 106 5 -35 -123 -73 -14 -151
7486a51J61K5Jj28Q8K2K7j7L9l6Q6j97O5p8p0L58l14K68o1j40J92n8N6o2l3J35
$$ -151 10 35 36 -92 -4 18 45 28 67 31 117 -80 -15 -93 -163 195 -119 149 88 -52 140 82 138 76 43 178
7512A78j10q3q5J5M8m6R5l2R7j0Rm1q9p5N0j08K18j30P9q0J11j8J05j50j3J15
$$ 178 68 -15 -100 -85 -37 -83 12 -20 77 67 76 35 -54 -129 -79 -187 31 -99 -20 -100 11 -7 98 -52 -65 50
7538E0J15j54k6m0O1J18k24J82j24M7Q2j47J45j12J5R8j43O5j02K17j40J08M4
$$ 50 165 11 -15 -55 6 124 -100 82 -42 5 87 -60 85 -27 -12 86 -57 8 -94 123 -17 91 135
7561A35k94J62qP7j16J02lq8m9O1j50K04r5L7J60l1r9J52j57j16J50nj87o9L09
$$ 135 -159 3 -5 72 -44 58 55 -33 -82 -21 -171 33 -62 -25 135 104 5 157 0 -116 34 29 -158 -227 82
7586H2J04j54J11j73P0M2M3L9l59K38m4N0J73j29j13J04j42J96m8q4j48J55j70
$$ 82 186 32 143 -30 40 82 125 164 -195 43 -1 49 222 93 -20 84 -58 138 90 6 -142 13 -157
7609a57P0O3N4n6k8K4N4J65j30p2O1L5J3k47J67p9l0K1K09k25N4Q9j31N8M9L7
$$ -157 -87 -24 30 -26 -54 -30 24 189 59 -13 48 83 96 -151 16 -63 -93 -72 137 -88 -34 55 -76 -18 31 68
7635F8j62K50K3m10K21R4j09N0n2%j20K85p0j98J76j39J29J76k37j81J89O2Jp6
$$ 68 -94 156 179 -231 -10 84 -25 25 -27 -27 -147 138 68 -130 46 -93 36 212 -25 -206 -17 45 46 -30
7659c0l2M7j53K03L1j95J20J17j34J11j33q2k1J44Q0l1K4j13N3q0j6J88J03k38
$$ -30 -62 -15 -168 35 66 -129 -9 108 -26 85 -48 -130 -151 -7 73 42 66 -47 6 -74 -90 98 201 -37
7683c7J32m7n7P6j28r3J49J09o0q5k6K10r8k3J77k89j0k8J06r6J05J04j66j5J9
$$ -37 95 48 -9 67 -61 -154 -5 104 44 -41 -67 143 45 22 199 -90 -100 -128 -22 -118 -13 91 -75 -90 -71
7708g1J75k21P4p4K34L6r9o3K9MO5j48P1j42K21mj91J91r1Q5O6k0j05Qk0N8q1
$$ -71 104 -117 -43 -117 117 153 54 -9 20 24 89 -59 12 -130 91 87 -104 87 -4 81 147 127 22 30 10 68 -13
7735a3L0K2N4j60K0J4J91l60J09L6r9J70K15l13mJ68q9n8K45k43L4j34K37Q4j10
$$ -13 17 39 93 -67 -47 -33 158 -202 -93 -57 -156 14 229 -84 -88 80 -9 -67 178 -65 -31 -165 72 156 46
7760D6j37j3Q5P6nO2Lj99O4K66k47N1qk4q8J40Or6M5MJ3l8k2J40j44J0J01J40
$$ 46 -91 -104 -19 57 52 114 117 -82 -18 248 1 52 44 20 -68 72 78 -18 27 31 44 6 -16 124 -20 -10 91 231
7788B31k70J09r2J33k02O5M9o3Q7k32Q2R6O8j2J1K05k94p4J61j21J07n5lJ01r5
$$ 231 -39 70 -22 111 -91 -26 23 -40 47 -185 -103 -7 61 49 60 265 -29 -103 58 -63 44 -11 -14 87 -8
7813hJ1o5R6j31Q5j00J76m4r5J48J4j9j44J61j02q5J80J1j90M1M2j03J42J8j21
$$ -8 3 -62 34 -97 -12 -112 64 20 -75 73 87 68 -76 85 -17 -102 78 89 -101 -60 -18 -121 21 39 -82
7838h2m5J5K87k90J18J00j45N2j85M37j79k6k34K13L8j86P8l6K37p8J01o9k85
$$ -82 -127 -112 175 -115 3 103 -42 10 -175 262 83 57 -177 36 74 -112 -34 -70 167 89 190 121 -164
7861a64J61J9k9Rn9K0J61M6k19k0J22K6J17k54J66kp4r3J92k50N2J03Nj11M2J13
$$ -164 -3 16 -13 -4 -63 -43 118 164 -55 -75 47 73 190 -64 102 100 26 -67 125 -125 -73 30 35 -76 -34 79
7887G9k01J4k3P7J18n7k6o1J02qp3J78k20O5J13l6j6j26lJ46R2k1k42J32j34J48
$$ 79 -122 -108 -131 -54 64 7 -19 -80 22 14 -59 119 -101 -36 77 41 25 -101 -104 42 134 113 -129 3 -131 17
7913A7j9o1J31O6j75PN3Q4j27n1k7M4K0l8J88OJ35l25k1J85J0J04j5r6j02P4n0
$$ 17 -2 -63 68 134 -41 -34 19 103 -24 -75 -102 -58 -38 -76 112 118 253 -72 -93 92 102 206 191 95 -7 67 17
7940A7j8n3K74j64k33J23J25j60r4L49k9k2k4j25J5Q5k45O3N0J27j77J71j45K
$$ 17 -1 -54 220 56 -177 -54 71 -89 -183 166 137 115 91 -34 -19 66 -179 -116 -66 61 -116 55 -90 -88
7964h8M1J23r2O9o8J36j89J29o2k8J20K8j85L4K5J2n9K3K05j22o0J76k05J4J29
$$ -88 -47 76 -16 53 -15 121 -68 61 -1 -29 91 119 -66 -32 -7 5 -54 -31 174 52 -8 168 -37 -23 106
7989A06Q4k43J24o6J8L8k16J92M5k19J98k3Oj43Q1n5r0J86j19K69j37j63nJ52
$$ 106 190 -53 71 5 23 61 -155 37 82 -137 61 38 44 -99 -18 -73 -163 23 -96 173 36 -127 -132 20
8013B0Om8m1Q7K3k94J78J63j17J13n3j68J39n3m1J42J36k01j71K00o4l9J6J60
$$ 20 26 -22 -63 24 47 -247 -69 94 -23 90 37 -131 8 -45 -86 56 192 -9 -180 20 -44 -83 -67 93
8037I3O0j88l4j5N6K9PM2j13Ko0K43k77J31N5jrl7J65L4k03M2J48j58N5m2J7j07
$$ 93 153 -35 -69 -84 -28 1 8 50 -63 -61 -121 122 -155 -24 31 30 21 -16 149 183 -20 22 170 12 67 25 42 -65
8065f5J46n3l7r6J13R4M0j34O3m6m3Pq9K18k09J18j2J99m43K22QJ42j54J09o5
$$ -65 81 28 -9 -105 8 102 142 8 71 25 -18 -11 -100 118 -91 27 15 214 -229 -7 1 143 -11 98 33
8090C3J46l06L4J79k57J09lJ45n6k15K85j92J68j2k3j09J9Q9LJ18p1j59J25M4
$$ 33 179 -127 -93 86 -171 -62 -65 80 24 -191 94 -98 70 58 35 -74 -55 34 37 155 84 -75 50 94
8114I4p2o5K0K7j50J79k2n4k5K33k46j8J89j24L7J37no0r0nn5j27Q8J13p5K9o0
$$ 94 22 -43 -23 4 -146 33 11 -43 -68 165 -81 -99 90 -34 3 140 135 75 -15 -20 -75 -202 -114 -1 -76 -47 -107
8141a07M9J01n0J07n7j10J03k6k10K50O9o4r8K2P2j19L9O8j30J39o7J1j74L3J24
$$ -107 -58 43 -7 100 43 -67 36 10 -200 50 119 55 -43 -21 51 -68 -29 39 -91 48 -19 -8 -182 -149 -25
8166b5m7P0m9q2J73N9j16L8j66P1mJ86j85Q6J04k38P2r3Q8O5p2j9J33j70Q5
$$ -25 -72 -2 -51 -133 40 99 -17 21 -145 -74 -78 108 -77 9 113 -125 -53 -146 -58 7 -65 -84 49 -121 -36
8191c6
$$ Imaginary data points
##PAGE= N=2
##DATA TABLE= (X++(I..I)), XYDATA
0@%%%%%%Qq%mJ2j6J6k4L2m0M8n6P2q8J04j24J48j75K03k36K76l20L68m17M74n44
$$ 0 0 0 0 0 0 0 8 0 0 -4 8 -8 8 -16 16 -24 24 -32 40 -48 56 -68 80 -95 108 -128 148 -172 196 -221 253 -291
32b91O18o95P84q84R92j109J236j378J535j703J885k084K304k545K807l094L409
$$ -291 327 -368 416 -468 524 -585 651 -727 808 -895 990 -1094 1210 -1335 1472 -1622 1787
49A787l755M134m553N021n544O131o795P553q430R456j0674J2152j3982J6314
$$ 1787 -1968 2166 -2387 2634 -2910 3221 -3574 3979 -4451 5005 -5669 6483 -7499 8815
63H815j9401K3686l0042M0396n9979J09042m42814o44881J400491K25409j119189
$$ 8815 -10586 13100 -16942 23454 -36525 72517 -370297 -1015178 385313 610722 -508467
74e08467K16700R67165n30605p80245M63904N51450k67652k27668R4648Q0556
$$ -508467 -291767 675398 144793 -635452 -171548 379902 112250 -115418 -20770 59786
84E9786j3925j23175j13705K24130J88921k14232j02069J92451j63256k37718
$$ 59786 45861 -77314 -191019 33111 222032 7800 -94269 98182 -65074 -302792
94c02792M13487L14548n43714k88425N54812J52606n17118L1001M38203j95712
$$ -302792 110695 425243 -118471 -406896 147916 300522 -216596 -185595 252608 56896
104E6896l29457L45197K41174m30430k00804M11370J64977l35535j19544K90618
$$ 56896 -272561 72636 313810 -116620 -317424 93946 258923 -76612 -196156 94462
114I4462J06372k77672j35702K54604J39391k46231q2118L06976J1291m09443
$$ 94462 200834 -76838 -212540 42064 181455 -64776 -146894 160082 171373 -238070
124b38070J2454M24934m4629l06527J76129J64097l66114j01267M70553Q3208
$$ -238070 -225616 199318 154689 -151838 24291 188388 -177726 -278993 191560 274768
134B74768m20822j3666L13515q4621k47041J10713K02701n6951j31457K9535R1356
$$ 274768 -146054 -159720 153795 69174 -177867 -67154 135547 78596 -52861 -23326 68030
145F8030p0351j61073J15098L05688j12276m08370J05795M00493j73758l35798
$$ 68030 -2321 -163394 -48296 257392 145116 -263254 -157459 243034 69276 -266522
155b66522K93698K69008l84693j87953M12470P3581m02395L2613L61501q8872
$$ -266522 27176 296184 -88509 -276462 136008 209589 -192806 -160193 201308 112436
165A12436k75741J07815J67542j21325r1354J28431P7277j05034r5474P7605J26497
$$ 112436 -163305 -55490 112052 -9273 -100627 27804 105081 47 -95427 -17822 108675
176A08675p6084j65908R5528J94272j19345j76307J55451R9950k28769j3545L16518
$$ 108675 32591 -133317 -37789 156483 37138 -139169 16282 116232 -112537 -126082 190436
187A90436l7640l52898O5916L09661j14072k38893J68399J82736j89476j33234
$$ 190436 152796 -200102 -134186 175475 61403 -177490 -9091 173645 -15831 -149065
197a49065J75600P5278j62352l1883J70506M0786j66747p5389J34401P9085j07295
$$ -149065 26535 101813 -60539 -92422 78084 118870 -47877 -123266 11135 90220 -17075
208a7075l9289J24370n256j70448K7887J98829m3714j91143P6162J66710j14674
$$ -17075 -56364 68006 62750 -107698 -79811 119018 75304 -115839 -39677 127033 12359
219A2359j41837J34713J02967j47849n4162J66653J6414j86000k910J91024L660
$$ 12359 -129478 5235 108202 -39647 -93809 72844 89258 -96742 -99652 91372 95032
230I5032j78398L845J63938k2455j53429M6558J43895p5721j34074J09741J30908
$$ 95032 -83366 -79521 84417 61962 -91467 -44909 98986 23265 -110809 -1068 129840
241A29840j34998j25953J41414J06048j34998o9230J30762L1808j35926j1553
$$ 129840 -5158 -131111 10303 116351 -18647 -87877 42885 74693 -61233 -72786
251g2786J34902K45j27509R852J24318j7921j27355K1704J26700k9271j14076
$$ -72786 62116 62361 -65148 -55296 69022 51101 -76254 -54550 72150 42879 -71197
262g1197N3389R7625r1325q8594J25184Q3716j38718o4394J38326L2525j31549
$$ -71197 -17808 79817 -11508 -100102 25082 108798 -29920 -94314 44012 76537 -55012
273e5012J509J22843k8059j11179M5087R7310n8274q9931O3268Q8596o1677q9312
$$ -55012 -53503 69340 41281 -69898 -24811 72499 14225 -75706 -12438 76158 14481 -74831
285g4831O0485Q5609o7838p8072Q5446O6733j09172n5489J30339M0470j40733
$$ -74831 -14346 71263 3425 -74647 10799 77532 -31640 -87129 43210 83680 -57053
296e7053j8318J41058n992j29617L1582J13821n1581r6645O4315Q1010o9332p0631
$$ -57053 -75371 65687 59695 -69922 -38340 75481 23900 -72745 -8430 72580 3248 -67383
308f7383O8945O4348o5049o1939O2488N8674o6334n1395P5992L9058r2737k5426
$$ -67383 1562 65910 861 -61078 1410 60084 -6250 -57645 18347 57405 -35332 -60758
320f0758J07513Q383j15792J1244J12634l2045r7958N3927P8538p0005n7192P8772
$$ -60758 46755 55138 -60654 -49410 63224 31179 -66779 -12852 65686 -4319 -61511 17261
332A7261L8989p8547k5913P1712J9897o2427j9136N7445K1261n9223k0999O8421
$$ 17261 56250 -22297 -48210 23502 43399 -19028 -38164 19281 40542 -18681 -39680 28741
344B8741J5798q5212o919J00893r476j09955L0396J07220n5670r3224P7832P2711
$$ 28741 44539 -40673 -47592 53301 43825 -66130 -35734 71486 15816 -77408 424 73135
356G3135r0779m7408R3894K2923q7028n628P4047k064n7815J668M6053M295m0464
$$ 73135 -17644 -65052 28842 51765 -35263 -40891 33156 31092 -26723 -25055 20998 25293 -15171
369a5171r262M4026J0931n3667n593O5214r279p5463K7272P6128m7475o5124O6524
$$ -15171 -24433 19593 30524 -23143 -28736 36478 27199 -48264 -20992 55136 7661 -57463 9061
382I061M4908q2733k1599R0254p42q6447J9438P5267l1970o2387L4686N0975k9246
$$ 9061 53969 -28764 -50363 39891 39149 -47298 -27860 47407 15437 -46950 -12264 38711 9465
395I465l9911K4056L7252k1897m4028K2515N7013k4067o5085L0962O2643m7514
$$ 9465 -30446 -6390 30862 8965 -35063 -12548 44465 20398 -44687 -13725 48918 1404
407A404n5395O5756M4822p6622k7175P7333J018p3715K1461O5802l3145n1179
$$ 1404 -53991 11765 56587 -20035 -47210 30123 31141 -42574 -21113 44689 11544 -39635
419c9635L6486L1336l9363j7391M0852J6447l5680j9280L1035K1513l6106k3988
$$ -39635 -3149 28187 -11176 -28567 12285 28732 -6948 -26228 4807 26320 -9786 -33774
431c3774N0429L0921o3547l2752P0890K0515p9860O71R1171j5773r4446K3266
$$ -33774 16655 47576 -15971 -48723 22167 42682 -37178 -36507 54664 38891 -55555 -32289
443c2289Q1231l2751o3670M2585N1546m3252m4649L1770L3558k1722k3403K3908
$$ -32289 48942 16191 -47479 -4894 46652 3400 -41249 -9479 24079 2357 -21046 2862
455B862K6272k8009l6404K5395L7456k4703k3195L6905Q467n3185K50N7469j1446
$$ 2862 29134 1125 -35279 -9884 27572 2869 -20326 16579 25046 -28139 -27889 29580 18134
468A8134m7865L2454L9976n1042l7796N3888K7578m9660r550N0143j909n3754
$$ 18134 -29731 2723 42699 -8343 -46139 7749 35327 -14333 -23883 26260 24351 -29403
480b9403l485M8279J2015l6399j0479L4477O276m4496j0689N1046J4953m6187
$$ -29403 -32888 15391 27406 -8993 -19472 15005 21281 -23215 -33904 17142 32095 -14092
492a4092l670M3299j4969m7599K4130M6323k1754k7602K5864M150l9153N296M2957
$$ -14092 -17762 25537 10568 -37031 -12901 33422 11668 -15934 9930 14080 -25073 -19777 23180
505B3180p643l1790J8615K1982l4621k7781L8006L4380k9490k8544K9716K0282
$$ 23180 15537 -16253 2362 24344 -10277 -38058 -52 34328 4838 -23706 6010 26292
517B6292m6586k7174O0238M2343n8473m1839N6510K7057o7515j7115Q0805J9956
$$ 26292 -20294 -47468 12770 55113 -3360 -45199 11311 38368 -29147 -46262 34543 54499
529E4499p7889j7014O4952J053o2390J0838O8299o173o4142r67M7299o828l8852
$$ 54499 -23390 -40404 24548 25601 -36789 -25951 42348 36175 -27967 -28934 18365 11537 -27315
542b7315K0233M3946k3009m6263J8314L3904k5510j9989M1211J8876m5824j7118
$$ -27315 -7082 36864 13855 -32408 -14094 19810 -5700 -25689 15522 34398 -11426 -28544
554b8544L7755J788l4664J7681M3874k1616m7739J5869L6728j9485k6960L3525
$$ -28544 9211 10999 -23665 -5984 37890 16274 -31465 -15596 21132 1647 -25313 8212
566H212L1412l7195l7998K7954K9284k7246j4791M0564J3135n0793k0532M1705
$$ 8212 39624 2429 -35569 -7615 21669 -5577 -20368 20196 33331 -17462 -37994 3711
578C711J5379k8960L938L1003j6356l7882J3909L0454j2718j3453K4898Q809l5666
$$ 3711 19090 -9870 -5932 25071 8715 -29167 -15258 15196 2478 -10975 13923 22732 -12934
591a2934j4774L1520J2285k3250M196L0375j5132m5732J1018M8700q351m1013
$$ -12934 -27708 3812 16097 -7153 -2957 27418 12286 -33446 -22428 26272 17921 -23092
603b3092J9383L8573l3593m5377L5596M4968l3273l3278M0609K4352n1479k7335
$$ -23092 -3709 34864 1271 -44106 -8510 36458 3185 -30093 10516 34868 -16611 -43946
615d3946M9844K9205l9266j8247L7199O474m4854n817M8229R413l9910j716L5666
$$ -43946 5898 35103 -4163 -22410 14789 21263 -23591 -29408 18821 28234 -11676 -13392 22274
628B2274j3486m1992J9174M4882j6457l2760K1276J6222l6326j2296M4411J4363
$$ 22274 8788 -33204 -14030 30852 14395 -18365 2911 19133 -17193 -29489 14922 29285
640B9285l7790p553K9480p132l2696J2391L7755o075l2997N191K5658j5510k8224
$$ 29285 -8505 -16058 13422 6290 -26406 -14015 23740 17665 -15332 -10141 15517 7 -28217
653b8217K4306L9299k2882m0558K2090K9520l1862k0310M5059J8279m7933j3448
$$ -28217 -3911 35388 12506 -28052 -5962 23558 -8304 -28614 16445 34724 -13209 -26657
665b6657M2834k39m0953J2296M1640j4849l6687J3614K5067j8831j8514K5304
$$ -26657 16177 15938 -25015 -12719 28921 14072 -22615 -9001 16066 -2765 -21279 4025
677D025K0639k4289k2376K0151J7937k2490j3724L1802J5335l7023j5151L6728
$$ 4025 24664 375 -22001 -1850 16087 -6403 -20127 11675 27010 -10013 -25164 11564
689A1564O475l9037O924M6122j4031m8198J6851L9928k3888k9738L3024K5043
$$ 11564 18039 -20998 -14074 32048 18017 -30181 -13330 26598 2710 -27028 5996 31039
701C1039l6624k2794L1998J5165k8374o975L0721O253l3451j0505L0522J0237
$$ 31039 -5585 -28379 3619 18784 -9590 -16565 14156 20409 -13042 -23547 6975 17212
713A7212k7251k776L0997m493l7166Q506L7697j2289l2140K1654K6177k9764k2121
$$ 17212 -10039 -12815 18182 13689 -23477 -14971 22726 10437 -21703 -49 26128 -3636 -25757
726b5757L2190J4894l0731n000L0616l144l1357M714K8549m736k3879P108K1712
$$ -25757 6433 21327 -9404 -14404 16212 13068 -18289 -13575 14974 10238 -13641 -6533 15179
739A5179j0576k3865J1932K5813j3731k4697J9162K3368k6417k2387L1813J9551
$$ 15179 4603 -19262 -7330 18483 4752 -19945 -783 22585 -3832 -26219 5594 25145
751B5145l3915j1112L5905J659l7971N490L6714j0158l1146J4281K5019j7952
$$ 25145 -8770 -19882 16023 17682 -20289 -14799 21915 11757 -19389 -5108 19911 1959
763A959k1513J8348J9013j6655j6130J5453J3692j8212j3751K1612J4829k4049
$$ 1959 -19554 -1206 17807 1152 -14978 475 14167 -4045 -17796 3816 18645 -5404
775e404j3539K6424Q857k9636k151L2772l957l2715J0478L0141j7407k5293K2570
$$ -5404 -18943 7481 16338 -13298 -15449 17323 13366 -19349 -8871 21270 3863 -21430 1140
788A140K0358k4604j5098K4451R418k3606n125K2740L007k2414k511K1785J552
$$ 1140 21498 -3106 -18204 6247 15665 -7941 -13066 9674 12681 -9733 -12244 9541 11093
801A1093k2485L69K3548k883k5232O355K6054j0792k5301J6174K3189k0710j9621
$$ 11093 -11392 -11023 12525 9642 -15590 -9235 16819 6027 -19274 -3100 20089 -621 -20242
814b0242K4371J4831k6280q926K6825M098k5756P3K3311k894k0748M819J8887
$$ -20242 4129 18960 -7320 -16246 10579 14677 -11079 -11006 12305 9411 -11337 -6518 12369
827A2369o674j8308P490J7658q683j7012J0699J5645j3741j4572J7477J2727k0579
$$ 12369 5695 -12613 -5123 12535 3852 -13160 -2461 13184 -557 -15129 2348 15075 -5504
840e504r703K2863N530k3722j109K4560l440k2986P129K0828r989j8404J2124
$$ -5504 -15207 7656 13186 -10536 -11645 12915 9475 -13511 -6382 14446 4457 -13947 -1823
853a823J6652j3080j4879J3183J2705j3873j1030J4976R709j6581q075J7229N404
$$ -1823 14829 1749 -13130 53 12758 -1115 -12145 2831 12540 -4041 -12116 5113 10517
866A0517j7911k553J8403j009j8081M320J7203p873j5122J0988J2924j2829j0109
$$ 10517 -7394 -9947 8456 7447 -10634 -6314 10889 3016 -12106 -1118 11806 -1023 -11132
879a1132J4625P538j5986n182J6949L602j7031k219J7203L48j7758J399J8459
$$ -11132 3493 11031 -4955 -10137 6812 10414 -6617 -8836 8367 8715 -9043 -7644 10815
892A0815l097j8971M754J8490p327j7879R262J6890j1089j4897J2406J2064j3944
$$ 10815 7718 -11253 -6499 11991 4664 -13215 -3953 12937 1848 -13049 -643 11421 -2523
905b523r143J4937P107j4347m653J3211K024j2579P32J2636k333j1750L880J0628
$$ -2523 -11666 3271 10378 -3969 -8622 4589 6613 -5966 -5234 7402 5069 -6681 -2801 7827
919G827o388r727R126Q727j0644p450J1083N483j3248l433J4655K482j5122j372
$$ 7827 1439 -8288 838 9565 -1079 -8529 2554 8037 -5211 -8644 6011 8493 -6629 -8001
933h001J4366p53j4287K679J5397l492j5286L695J3890n177j2218P723J2173q983
$$ -8001 6365 5612 -8675 -5996 9401 5909 -9377 -5682 8208 3031 -9187 -1464 10709 1726
947A726j1087Q982Q358r696n086J1267L246j1421k056R460o04q311L814Q588n445
$$ 1726 -9361 -379 7979 -1717 -6803 4464 7710 -3711 -5767 3693 3089 -5222 -1408 7180 1735
962A735q923M795P430n727n488Q293N934j0646o964J0974O098j1270l174J3690
$$ 1735 -7188 -2393 5037 -690 -6178 2115 8049 -2597 -9561 1413 7511 -3759 -6933 6757
976F757K101j5980j727J5425M43j3784L251J3423n506j4012M902J1896l803q897
$$ 6757 8858 -7122 -8849 6576 7019 -6765 -3514 9909 4403 -9609 -4707 7189 3386 -5511
990e511N313O922o484q332N488Q500m320o094N522M046q242m234R048M197p967
$$ -5511 -198 6724 240 -8092 -2604 5896 1576 -4518 1004 5050 -3192 -7426 1622 5819 -2148
1005b148n47P948l421r638N087R355m678n931O461L101r311l367R195M142o423
$$ -2148 -2695 5253 1832 -7806 -2719 6636 1958 -3973 2488 5589 -3722 -7089 2106 6248 -175
1020a75k438N538m03p409o20Q623L019p450k479O038q80p823K747R763j984q196
$$ -175 -2613 2925 2522 -4887 -5507 3116 6135 -1315 -3794 2244 1364 -6459 -3712 6051 4067 -4129
1036d129K854M652o243l238Q616L976p078j893M910j922n750L925P164k128o400
$$ -4129 -1275 3377 -2866 -6104 2512 6488 -590 -2483 2427 505 -5245 -1320 5844 3716 -2684
1051b684J276L790l121m677N208P128m283q292L820O289o713n553J0392O533j0524
$$ -2684 -1408 2382 -739 -5416 -208 6920 2637 -5655 -1835 4454 -2259 -7812 2580 9113 -1411
1066a411o404R178K746r296N70J1162j48j0329q30O600l78m468K710N814j665
$$ -1411 -7815 1363 4109 -5187 -4617 6545 6397 -3932 -4762 1838 1460 -3008 -298 5516 3851
1081C851o936j352N237J225l660J851N216l731p400K565N736l121j546O131j49
$$ 3851 -3085 -4437 800 2025 -1635 216 5432 1701 -5699 -3134 2602 -519 -2065 4066 3917
1096C917q325n50O472p55l262M572K921n970m254M439K857k187m5L402l85m685
$$ 3917 -4408 -4958 1514 759 -2503 2069 4990 -980 -5234 -795 2062 -125 -170 3232 2847 -1838
1112a838k305L725L557k270k034L650N12o676j660P441J747n907R89N294m192
$$ -1838 -4143 -418 3139 869 -1165 2485 2997 -3679 -5339 2102 3849 -2058 -1069 4225 33
1127C3o541M469N796k911k820L870O40n680j289N362K309k840j053K885q72m528
$$ 33 -6508 -2039 3757 846 -1974 1896 2536 -3144 -4433 929 3238 398 -655 2230 1358 -3170
1143c170K6N551J501m573l75L972k515n907L435P196k910n372L063K856n611k495
$$ -3170 -3144 2407 3908 -665 -1040 2932 417 -5490 -2055 5141 2231 -3141 -78 2778 -2833 -5328
1159e328O856L587n278k614L242K24l563J33N219J383m263k155K907Q55l312Q39
$$ -5328 1528 5115 -163 -2777 465 689 -2874 -2741 2478 3861 -402 -2557 350 1205 -2107 -1268
1175a268N182n97n270k13L841j775k908M203L058m392k819L265M88l269J215M265
$$ -1268 3914 3317 -1953 -2166 1675 -100 -3008 1195 4253 -139 -2958 307 795 -2474 -1259 3006
1191C006j380l943P80K251j096j747K273K676j832l551J405K750j738j938L312
$$ 3006 1626 -2317 -1537 714 -382 -2129 144 2820 988 -2563 -1158 1592 -146 -2084 1228
1206A228K953m429l282L763K206l998r9N068o04n677K32M601q72l319K103L206
$$ 1228 4181 -248 -3530 233 2439 -1559 -1658 3410 2806 -2871 -2639 1962 1090 -2229 -126 3080
1222C080k734l573K132K628j343j882K332J539k892k374L016K293k516r37L011
$$ 3080 346 -3227 -1095 1533 190 -1692 640 2179 -713 -3087 -71 2222 -294 -1231 1780
1237A780M20m073l10M172M9l517R11L346k341l631K662L183k377k326K509J476
$$ 1780 2200 -1873 -2183 1989 2038 -1479 -568 2778 437 -3194 -532 2651 274 -2052 457 1933
1253A933l434j141L540J102l136o08L192k83l165K46L311j07k683P88K344j814
$$ 1933 -1501 -2642 898 2000 -1136 -1744 1448 1165 -2000 -1754 1557 1450 -1233 -445 1899 85
1269H5k393K039K855j658k435J678J947k573j688K988J565k988j424L024L58l534
$$ 85 -2308 -269 2586 928 -1507 171 2118 -455 -2143 845 2410 -578 -2002 1022 1380 -2154
1285b154M00L673o03l677R75L346j674k871K417K603k557k390K770J851k718j300
$$ -2154 -1754 1919 1316 -2361 -1386 1960 286 -2585 -168 2435 -122 -2512 258 2109 -609 -1909
1301a909K995J020k766j110K913O32k821k52L025k04l167L81L089n42l237J062
$$ -1909 1086 2106 -660 -1770 1143 1775 -1046 -1298 1727 1523 -1644 -1263 1826 1284 -1953 -891
1317h91K844j594k606J875K071k157j495K451J159k546p56K428M40k172P3J975
$$ -891 1953 359 -2247 -372 1699 -458 -1953 498 1657 -889 -1645 783 1223 -949 -876 1099
1333A099o9k093M50K240o15k466R54K490j604k318K102J892k331j624K609J097
$$ 1099 1030 -1063 -613 1627 1012 -1454 -500 1990 386 -1932 170 2062 -269 -1893 716 1813
1349A813k952o81L038J3k683j12K685m21k102M52K115m90j839M29J932n85j922
$$ 1813 -1139 -1820 1218 1231 -1452 -1564 1121 700 -1402 -950 1165 675 -1164 -735 1197 612 -1310
1366a310J020K038j096k398J584J888j757j541K451P78k781j25K661l67k526P46
$$ -1310 -290 1748 652 -1746 -162 1726 -31 -1572 879 1657 -1124 -1249 1412 1045 -1481 -735
1382g35K207j252j713J521J111j544j040J662Q92j588o91J352J197j563j299J957
$$ -735 1472 220 -1493 28 1139 -405 -1445 217 1109 -479 -1170 182 1379 -184 -1483 474
1398D74J263k258r70K818L33k955R4L275o85l163J102K591j612k022J859J331
$$ 474 1737 -521 -1491 1327 1660 -1295 -1201 2074 1389 -1774 -672 1919 307 -1715 144 1475
1414A475k123q35J742N79j421m51J340N49j263p26J513M38j449k81K037j18k365
$$ 1475 -648 -1483 259 838 -583 -1034 306 855 -408 -1134 379 817 -632 -913 1124 1006 -1359
1431a359O45K372j091k171J669K083k125j683K298J097k568p18K722L26k542r6
$$ -1359 -714 1658 567 -1604 65 2148 23 -1660 638 1735 -833 -1551 1171 1497 -1045 -1141
1447a141J758J40j783j14K057l9j930j68J916O8j981O52K107p31k177R96J872
$$ -1141 617 757 -1026 -1140 917 878 -1052 -1220 696 764 -1217 -565 1542 811 -1366 -370 1502
1464A502j186j442J672J115k268n35J898O6j535M94J302p37j334N43J005m83q61
$$ 1502 316 -1126 546 1661 -607 -1142 756 822 -713 -219 1083 346 -988 -445 560 77 -784
1481g84N95J102r81j323J067J258q10r84J180Q88j795q51K071N87j791M1J740
$$ -784 -189 913 -68 -1391 -324 934 124 -860 320 1208 -587 -1438 633 1220 -571 -530 1210
1498A210m53k132P32J792o55j240J144O16j420p75J174R48j276k49R09K72j582
$$ 1210 757 -1375 -643 1149 494 -746 398 1014 -406 -1181 -7 941 -335 -584 325 597 -985
1515i85k79J655N29j492r3J770l97k312O18K560n96k126J099J710j739j876K019
$$ -985 -1264 391 920 -572 -665 1105 708 -1604 -986 1574 978 -1148 -49 1661 -78 -1954 65
1532F5J613j392j226J356Q03j650j002J861R96j501r38J108M38j611q9J839M74
$$ 65 1678 286 -940 416 1219 -431 -1433 428 1424 -77 -1015 93 531 -1080 -1169 670 1144
1549A144j819o1J213l78j172Q67J378o32j379R28N64j242k67J637M46j465m09
$$ 1144 -675 -736 477 99 -1073 -206 1172 540 -839 89 653 -589 -856 781 1227 -238 -647
1566f47J320l45j123J86J843k19j782J65R74m43j079R42J523r57j598Q80P42q10
$$ -647 673 328 -795 -609 1234 1015 -767 -602 372 -71 -1150 -208 1315 358 -1240 -360 382 -428
1584d28n62J547P44j502q49J194K40j088M81J480l83j654L04J076n19p73J090
$$ -428 -990 557 1301 -201 -1050 144 384 -704 -223 1257 874 -780 -476 600 81 -692 398
1601C98J098j407j252R90P67r97m40J459M50j938n64J554M13j279K39J790o58
$$ 398 1496 89 -1163 -173 594 -403 -843 616 1066 -872 -1436 118 531 -748 -509 1281 623
1618F23j894K12J678j50j130O49J449j135j629J011J243p29q14J218P41j914o99
$$ 623 -1271 -1059 619 469 -661 -12 1437 302 -1327 -316 927 198 -616 602 1343 -571 -1270
1635a270J306Q66j101l34J354l78j731L36J655j64j376O29J133j099j366J057
$$ -1270 36 902 -199 -533 821 443 -1288 -952 703 539 -837 -208 925 -174 -1540 -483
1651d83J407n71r36Q85N58j480o33J855N89j284p5J085m46j755P54J473k53j090
$$ -483 924 353 -583 302 860 -620 -1253 602 1191 -93 -168 917 471 -1284 -530 943 690 -400
1669d00L27P66j012j040J157J231q01j029Q79M63j355n03J657J113j882l52J359
$$ -400 -73 693 -319 -1359 -202 1029 228 -801 78 541 -814 -1317 340 1453 -429 -781 578
1686E78j17j611N88J943l47j850O96J299j377r20J374J170j268r53R71K87j066
$$ 578 461 -1150 -562 1381 1034 -816 -120 1179 -198 -1118 256 1426 158 -795 176 463 -603
1703f03k03J331N86j352o80J144L02j429J64J680k14j603J75J514n25j325J062
$$ -603 -806 525 1111 -241 -921 223 525 -904 -740 940 726 -877 -702 812 287 -1038 24
1720B4J323j127j135R93O85j205k93J631J30j553j46R74oj051L86J170l24j298
$$ 24 1347 220 -915 78 763 -442 -735 896 1026 -527 -673 301 295 -756 -370 800 476 -822
1738h22J06J451p86r77J027J100j219j415J645Q77j482n16J817L43k222L75J635
$$ -822 -716 735 -51 -1028 -1 1099 -120 -1535 110 987 -495 -1011 806 1149 -1073 -698 937
1755I37l23j354N04J371o92j368N47J360n78j227Q37J041j074j156Q93J085q83
$$ 937 614 -740 -236 1135 443 -925 -378 982 404 -823 14 1055 -19 -1175 -282 803 -80
1772h0j018J335P41j736m29J957O6j600J67J452m85j512R21J214q85q26J012P35
$$ -80 -1098 237 978 -758 -1187 770 836 -764 -597 855 370 -1142 -221 993 108 -718 294 1029
1790A029j153o11J065O24j128n23Q45O03j167m91J549P7j395j77J496j79j710
$$ 1029 -124 -735 330 954 -174 -697 148 751 -416 -907 642 719 -676 -853 643 464 -1246
1807a246P12J500o93j400J007J198j516o89J587O13j376m18J389M9j140k54J368
$$ -1246 -534 966 273 -1127 -120 1078 -438 -1127 460 1073 -303 -721 668 717 -423 -677 691
1824F91R8j472J09J407q7j667K85J496k86j765Q03J513j264j096J264R20j375
$$ 691 789 -683 -574 833 746 -921 -636 860 574 -1191 -388 1125 -139 -1235 29 949 -426
1841d26p03J537M22j324k23J459l43j184M61J106m51j124P23O76m22j066Q12J111
$$ -426 -1129 408 830 -494 -717 742 399 -785 -324 782 331 -793 -70 606 184 -882 -70 1041
1859A041j051q23J145O21j551m72J708O8j395k21J573p0j954P34J664m77j528
$$ 1041 -10 -833 312 933 -618 -1090 618 686 -709 -930 643 573 -1381 -647 1017 540 -988
1876i88P36J020n70j080Q76J006r11q05P07R56j052p27J334M90j530l22J514o8
$$ -988 -252 768 198 -882 -6 1000 89 -716 -9 947 -105 -832 502 992 -538 -860 654 586
1894E86j372L05J360n51j507P75J507j084j144R98J201j252q08J120Q62j445m31
$$ 586 -786 -481 879 328 -1179 -404 1103 19 -1125 -127 1074 -178 -986 134 996 -449 -880
1911h80J394L76j368k34J352O1j322o6J612l83j462N99J232o67j196Q74J045j177
$$ -880 514 890 -478 -712 640 701 -621 -687 925 542 -920 -321 911 244 -952 -78 967 -210
1929b10p64J249M63j357l07J407J29j221k45J472r5j361L86J481n52j273M26J435
$$ -210 -974 275 738 -619 -926 481 610 -611 -856 616 521 -840 -454 1027 475 -798 -372 1063
1947A063q88j084R27J084j260p18J225N48j184n93J409L01j469o9J414k99j301
$$ 1063 175 -909 18 1102 -158 -876 349 897 -287 -880 529 830 -639 -708 706 407 -894
1964h94M37J231p79q47N74J166j094p94J238O98j502l35J362M57j543k17J697
$$ -894 -457 774 -5 -852 -278 888 -206 -1000 238 936 -566 -901 461 918 -625 -842 855
1981H55R6j651M8J491l44j430N13J544n92j597O41J101m46j166Q55J132j348q46
$$ 855 951 -700 -652 839 495 -935 -422 1122 530 -1067 -426 675 229 -937 -82 1050 -298 -1144
1999a144J244O64j318j13J372mj528K17J340l78j214R48R77q35j129P72R09q90
$$ -1144 100 764 -554 -667 705 701 -827 -610 730 352 -862 86 1063 228 -901 -129 780 -110
2017a10o43J125O39j395o53J196O62j216k71J225J78j716K5J481k50j043O38J070
$$ -110 -753 372 1011 -384 -1037 159 821 -395 -666 559 737 -979 -954 527 277 -766 -128 942
2035I42q62j199J042R90j027m37R72N41j423o01J343M79r61q9J145m40j160Q4
$$ 942 80 -1119 -77 913 -114 -551 421 962 -461 -1062 281 760 -201 -290 855 415 -745 -661
2053f61J425j28j110J71J122r38j269J233J266j099r11J207O09j557l95J626J06
$$ -661 764 636 -474 -303 819 -119 -1388 -155 1111 12 -899 308 917 -640 -1035 591 697
2070F97j147N5J072l73j257O88Q65j87o76R0O09o38o45P71J116r51p86Q40O69
$$ 697 -450 -395 677 304 -953 -265 600 413 -263 -173 436 -202 -847 -76 1040 89 -697 143 812
2089H12j579j37J668K82j525j08J183n71j155P77J351o73j158P36P06r53l64R31
$$ 812 -767 -904 764 1046 -479 -587 596 25 -1130 -353 998 325 -833 -97 609 -344 -708 223
2107B23O00o69p06O39L22r23L6Q70N11j252l85J140k11j051O22J336o57j317O97
$$ 223 823 154 -552 87 409 -514 -478 392 903 -349 -734 406 195 -856 -234 1102 445 -872 -175
2126a75P62j029m87J589M11j375m82R00J95r07K57J240r0j247k07R33L5q48L79
$$ -175 587 -442 -929 660 1071 -304 -786 114 309 -598 -341 899 809 -438 -645 288 323 -525 -146
2145a46J150n24j185M85Q56o90n56J091M61j404n65J098K69r78L40J059m48r17
$$ -146 1004 480 -705 -220 636 -54 -610 481 942 -462 -1027 71 340 -638 -298 761 313 -604
2163f04l7R92K2p97N58N94n97q14M49J035o85o06P77N81j167o40J016O15r34j90
$$ -604 -641 351 373 -424 134 728 131 -683 -234 801 116 -490 287 868 -299 -939 77 692 -242 -432
2183d32J068k28j276J43J232j86p65L47P68q56p29P88P14o10l04P24nq44l07J053
$$ -432 636 408 -868 -725 507 321 -444 -97 671 -185 -914 -126 588 -22 -326 398 393 -451 -758 295
2203B95M08r71k72J130q6j179L57Q89j32r60N13N32o42n46Q56O22q84l32N50J51
$$ 295 703 -268 -540 590 504 -675 -318 571 439 -521 -8 524 -118 -664 192 814 -70 -402 148 299
2223B99q32K7Q60J33o88n8M60j00o93K91R87l78p29K20P50n19p99R75N04q21n11
$$ 299 -533 -506 354 487 -201 -259 201 101 -592 -301 686 308 -421 -201 549 30 -769 206 710 -111 -622
2244f22O52L65r09k6J118j96q52l9O58k9m79J55O94k93o46J68N96k29p40Q63O57
$$ -622 30 395 -514 -540 578 382 -470 -509 149 120 -359 -204 490 197 -449 -281 315 86 -654 209 866
2265H66r93m45P83J04o36qR08L3j141J83P82j26q89M55O83m30n52K45R23p07m72
$$ 866 -127 -572 211 315 -321 -329 579 612 -529 -346 436 310 -579 -124 559 129 -423 -178 745 38 -434
2286d34M69N07o24o62P02N04o67j42O20Jo48q4Q53k52l99P5O14l20n20L29M92
$$ -434 35 542 -82 -744 -42 462 -205 -347 273 274 -374 -458 395 143 -256 -181 433 113 -407 -78 414
2307D14m70j78M87J74o61r9L91L56n29k16O81r8n51n0O78m0p18K23O21l88n13
$$ 414 -56 -234 253 427 -234 -333 58 414 -115 -331 350 252 -299 -349 329 289 -429 -206 415 27 -486
2328d86M10O19o69k48N98J96n07l39Q42o3m49j57M95j02l40m7N36o4o26K00N94
$$ -486 -76 543 -126 -374 224 420 -87 -426 416 353 -96 -253 242 140 -200 -247 289 225 -401 -201 393
2349C93n50j82L84M20n00m65P06K59o35r0N57om85j20M77O4l57p5N37J48q70K87
$$ 393 -157 -339 45 465 -35 -500 206 465 -170 -260 297 291 -194 -314 163 227 -130 -205 332 480 -390 -103
2371a03O11k25p90N60K36n03j13L80L14n71j06L42L09n67j07O10j19m73K49L21
$$ -103 508 283 -507 53 289 -214 -327 53 367 -204 -310 32 341 -226 -333 277 158 -315 -66 255
2391B55L3n15K01L38k15k99K7O07l97m35M15M94m66n17O44J51p00R4O08n4o59
$$ 255 288 -227 -26 312 97 -202 -175 432 35 -400 15 509 43 -474 170 321 -379 -285 323 269 -390
2412c90J13N18k0m33J87K96l70k44L78K02j18m77M53K56l69l64N26K4l48l15Q37
$$ -390 -277 241 221 -212 -25 271 -99 -343 35 237 119 -358 95 351 -18 -382 144 168 -180 -495 342
2433C42J18n45j08O54l05n80L22L17pm78J68M49j92l48R7M26k50l55K10K40k28
$$ 342 460 -85 -193 461 156 -424 -102 215 208 -270 -102 347 155 -193 -96 330 80 -275 -65 175 -53
2454e3j44L55K04n78m0N47m5n63J32N84j07o19M53L11n56l44P00J31o13j32N53
$$ -53 -197 158 362 -216 -256 291 246 -317 -185 399 292 -327 126 437 -119 -463 237 368 -245 -377 176
2475A76k2j83k15N25j85l61J04L09qm55L6M58O8m87J60K77j27l69L74K01l97n6
$$ 176 154 -29 -244 281 96 -265 -161 148 140 -315 -279 179 247 -240 -80 197 70 -299 75 276 -121 -177
2497a77L66q5k93K76L20j78m00j0L18l7m03K45N13k11n77K30L55k02l14J92M53
$$ -177 189 104 -189 87 407 229 -171 -181 137 100 -303 -58 455 244 -333 -103 252 50 -264 -72 381
2518C81l06n37K20O91m56j88O36j23m46j53L06j5m2J2J57l0k97P6K60m1j45K00
$$ 381 75 -462 -242 449 -7 -195 441 318 -128 -281 25 10 -32 -20 137 107 -190 -114 146 105 -40 160
2540A60k5j60k01J46K44k15P4L15j4n62k42O82r2l90K32K61j00m29L63M73l38
$$ 160 135 -25 -226 -80 164 -51 23 338 324 -238 -480 202 110 -280 -48 213 113 -316 47 520 182
2561A82m01M96Kk87k55L10J10r4K5J80q6k13k03M54J1k38Q1R3l18j70J09N91m56
$$ 182 -219 277 279 -8 -263 47 157 63 88 268 182 -31 -234 220 231 -7 74 167 -151 -321 -212 379 -77
2584g7n3K16L04n28k86P42J50o52L4N15l02l01J00N63p1n27J85K74k50l37J99
$$ -77 -130 86 390 -138 -424 318 468 -184 -150 365 63 -238 -138 425 354 -173 12 286 36 -301 -102
2605a02J67J35m81K29L12m36k2J29L29k62o0J79m01J34L5M23j88k05R5P0k43j86
$$ -102 65 200 -281 -52 260 -176 -198 -69 260 -2 -62 117 -284 -150 -115 308 120 -85 10 80 -163 -349
2627c49M77L90l73l72K06K18n09R4N79Q1o41J04K20J36n27K34M65j99n17K60J08
$$ -349 128 518 145 -227 -21 197 -312 -218 361 442 -199 -95 125 261 -266 -32 433 234 -283 -23 85
2648H5J0l89M01K21l00k47N0K23j42j09M10M3l82j88L68P8l01K40K27l21l32J99
$$ 85 95 -294 107 328 28 -219 -169 54 -88 -197 213 256 -126 -314 54 132 -169 71 298 -23 -355 -156
2670a56K71p1j61K17J39k70m00K36L52k52M0J12J58n50j0M46K13m12P6K57k61
$$ -156 115 44 -117 100 239 -31 -431 -195 157 -95 -55 57 215 -335 -345 101 314 -98 -22 235 -26
2691b6l62K60L28j91j88K73M4k52j94L49o3J73k17K21p8l54N5M10j02j38P5R7
$$ -26 -388 -128 200 9 -179 94 138 -114 -308 41 -22 151 -66 155 77 -277 -222 188 86 -52 23 120
2713A20j10l82J29L65j20r4J45J2j44k8J54K15l05j61M28k90k9q4N35n9l37l3
$$ 120 10 -372 -243 122 2 -92 53 65 -79 -107 47 262 -43 -204 224 -66 -95 -179 356 297 -40 -73
2735g3K23k08k56R9L63K8n36M91Q8k72j00J74L79m90j73M90p3l98L3M31j04l01
$$ -73 150 -58 -314 -215 148 176 -360 131 219 -53 -153 21 400 -90 -263 227 154 -244 -211 220 116 -185
2757a85K63o9rk43J68K68m1k25N3N9j85j36L79J65l06j96L17J33l30kL64ol91
$$ -185 78 9 0 -243 -75 193 152 -73 -20 39 -146 -282 97 262 -44 -240 77 210 -120 -122 242 236 -155
2780a55J0Q4k4k05L79m6o2l41N50k19l4n7J62J57j82j66J94P6j13p2K29j61j22
$$ -155 -145 -61 -85 -290 89 43 -19 -360 190 -29 -63 -120 42 199 17 -149 45 121 8 -64 165 4 -118
2803a18q3L12j73j71K64Q6j79j93K91o7o8J45J76j85k16K11O5Q0oj03K5o7q8j35
$$ -118 -201 111 -62 -233 31 117 -62 -255 36 -31 -99 46 222 37 -179 32 97 177 171 68 93 26 -62 -197
2827a97L35j45j90J19K98l52J14k6L34m21J24J73j41j43j09L22N2k59M2K46l56
$$ -197 138 -7 -197 -78 220 -132 -18 -44 290 -131 -7 166 25 -118 -227 95 147 -112 -70 176 -180
2848a80P9LJ38K2j62K32k2j58l6J36K20l73l4L24R7l49O4L1K0l00J29J70j11j0
$$ -180 -101 -98 40 62 -100 132 110 -48 -84 52 272 -101 -135 189 286 -63 1 32 52 -248 -119 51 -60 -70
2872g0k7M51m33M9P7J5j24r2K49k6p9j43K71j01n2p6J73J33k29l8K25j81m9m1
$$ -70 -97 354 -79 -30 47 62 -62 -154 95 69 -10 -153 118 17 -35 -111 62 195 -34 -72 153 -28 -77 -118
2896a18K57k40j27L27L5j09r0J4K06r2q2p3L30k89K87j79M4j34j5K15l4j97N4
$$ -118 139 -101 -228 99 134 25 -65 -51 155 63 -19 -92 238 -51 236 57 101 -33 -48 167 133 -64 -10
2919a0PQ0k46J44L53l59j62K63M3k93p3L11k4k48k05M13P0n0Q6P0r1n7l3R3j8
$$ -10 -3 77 -169 -25 328 -31 -193 70 113 -180 -253 58 34 -214 -419 -6 64 14 100 170 79 22 -11 82 64
2944F4j49J75J07k65P1mJ9j66O9J25P8J6k5k7p4r0P3K03j16l49K87M5j66k4L0
$$ 64 -85 90 197 -68 3 -1 18 -148 -79 46 124 140 115 88 14 -76 -3 200 84 -265 22 67 -99 -123 -93
2969i3K80l34q9J83j1J1K0J26N9j94N8M2P9k23J85p7m9Q5o5n7K43j40N0R1l01
$$ -93 187 -147 -236 -53 -64 -53 -33 93 152 -42 16 58 137 -86 99 22 -27 58 -7 -64 179 39 89 180 -121
2994a21R0l9Q7j84J05K16q1j50Q2J31j41p9J13j6P8j04m8J04J0k4q4N3n6jL2K66
$$ -121 -31 -70 17 -167 -62 154 73 -77 5 136 -5 -84 29 13 91 -13 -61 43 53 29 -55 -2 -58 -59 -27 239
3020B39k15k07L01p7p4p1K25j38M6ql1jM2P2n5j38J0J07P9o3l17L87j00Mr0K75
$$ 239 24 -183 118 41 -33 -104 121 -17 29 21 -10 -11 31 103 48 -90 -80 27 106 43 -274 113 13 17 -73 202
3046B02l2j65K4K00M5l16q2J89n8k12M2K46k2o6L7P3j35L6k2J14o8j65K19k2J1
$$ 202 170 5 29 229 274 -42 -124 65 7 -205 -163 83 61 -5 32 105 -30 6 -16 98 30 -135 84 62 73
3071G3k16K41r5nm7K3J45l92K42K84k60J29j03Rj56J10M4P6J6j86K35p0k36kJ13
$$ 73 -143 98 3 -2 -49 -26 119 -273 -31 253 -7 122 19 28 -128 -18 26 102 118 -68 167 97 -139 -141 -28
3096b8o6O5K3r7M9M9k25K77j5l20L41N2j57k14L91Q3j63j55O3J43j81L3J60n5
$$ -28 -94 -29 -6 -103 -54 -5 -230 47 32 -288 53 105 -52 -266 125 208 45 -110 -47 96 -85 -52 108 53
3120E3k40O2L03k32p2L9J28K7k64K09K07k08N2j10K73j12k41R0O2q2o1K32J41
$$ 53 -187 -125 178 -54 -126 -87 41 68 -196 13 220 12 64 -46 227 115 -126 -36 26 -56 -117 115 256
3143B56l52jK06N6j80J07J10j38J4j82J53p8j40K74M7k0j53J25J60l29n0J30J49
$$ 256 -96 -97 109 165 -15 92 202 64 78 -104 49 -29 -169 105 152 132 -21 104 264 -65 -115 15 164
3166A64l4m67L80J2m9JJ63r5p9JJ46q5j40Q0K39k52j01J67k4r8K1J79o3j76J36
$$ 164 130 -337 43 55 6 7 170 75 -4 -3 143 58 -82 -2 237 -15 -116 51 27 -71 -50 129 66 -110 26
3191B6j86K07o1lL3Lj87n9M12j87q9J61m3q3o7Q5K23q6j88P7O1k03k9L6K48k57
$$ 26 -160 47 -14 -17 16 19 -168 -227 185 -2 -91 70 27 -56 -123 -38 185 99 -89 -12 49 -154 -183 -147 101 -156
3217a56J79m8j39Q5R6P4j78K5J28m7J08j75qk6J21q1m2J81r0j37K85J8j01j08
$$ -156 23 -25 -164 -79 17 91 -87 -62 66 19 127 -48 -56 -82 39 -42 -84 97 7 -130 155 173 72 -36
3241c6J52k9j86j1K65r3RJ1J7m0m5J44m4j62q4K18j44rn9J15J83k34%K05k44p0
$$ -36 116 87 -99 -110 155 62 71 82 99 59 14 158 114 -48 -132 86 -58 -67 -126 -11 172 -62 -62 143 -101 -171
3267a71K8K13Q8k33K00k6o7q7J37J2Jj56N0Pj2r3K34r8n4JR2r3j73K16N4M4k10
$$ -171 -143 70 158 -75 125 99 32 -55 82 94 95 -61 -11 -4 -16 -109 125 27 -27 -26 66 -27 -200 16 70 114 -96
3294i6J55M1o3q3J44qk51KJ33O5j22J68P7k38p4N0J63M8k09P9M4j01k5K25pj38
$$ -96 59 100 37 -46 98 90 -161 -159 -26 39 -83 85 162 -76 -150 -100 63 111 -98 -19 25 -76 -101 124 117 -21
3320b1k9P0Ok09R0J32k0k31J60J12r6l0j02L62j63jN3j83K22r7j31K99j02k41
$$ -21 -50 20 26 -183 -93 39 19 -212 -52 60 -36 -66 -168 194 31 30 83 -100 122 25 -106 193 91 -150
3344a50K10Jj26k18K47NP3No0J7j11N6K9l4L6M7N4l8k26L1K04o8j29K55j86M1
$$ -150 60 61 -65 -283 -36 -31 42 47 -13 4 -107 -51 -22 -56 -20 27 81 43 -183 -152 52 -16 -145 110 -76 -35
3370c5q0J74P7j53M0j42L35k44N2J48j34k13J38PK27k02O9J03j92l4l2K05j51
$$ -35 -115 59 136 -17 23 -119 216 -28 24 172 38 -175 -37 -30 197 -5 64 167 -25 -59 -91 114 -37
3393c7r3J13o6N1J36j83J40j76O9J26k80K65k69K18P0j69mK42j00j84J02R0k3
$$ -37 -130 -17 -83 -32 104 -79 61 -115 -46 80 -200 65 -204 14 84 -85 -89 153 53 -131 -29 61 38
3416C8n9J19N0k98K13J11j34k64J83J78k4l65K75K8j13n3J93n8Jk5j47K85k3j72
$$ 38 -21 98 148 -150 63 174 40 -224 -41 137 113 -252 23 51 -62 -115 78 20 21 -4 -151 134 111 -61
3440f1J26k41LJ18K38l8j71L94l65q5k02K51J30l0j39RK70j72l7J7L7j84%J02
$$ -61 65 -176 -173 -55 183 145 -26 368 3 -82 -284 -33 97 67 -72 -63 207 35 -2 15 52 -132 -132 -30
3464c0K44m58J45J54K5k54Q1R2P5j59J79j72O1o5J9J47j95R8%k0O5M1j24J28j4
$$ -30 214 -244 -99 55 80 -174 -93 -1 74 -85 94 -78 -17 -82 -63 84 -111 -13 -13 -33 32 73 -51 77 63
3489F3j26M6O1o5K9O1q8j37J31J00nk97K58P8j97RJ32L1p1m9p0K12k35K1M7J38
$$ 63 -63 -17 44 -21 8 69 -19 -156 -25 75 70 -227 31 109 -88 -79 53 84 13 -36 -106 106 -129 -108 -61 77
3515G7j80jJ65j07p6r6K70k5k79L98N0j03nq4M6j5L2j49J26j06J32K6j1j99K9
$$ 77 -103 -104 61 -46 -122 -218 52 27 -252 146 196 93 88 4 50 35 67 -82 44 -62 70 96 85 -114 -85
3540h5J21q7j40J59J06p5j06J32Q4j14j56K00J55k40k9K14j93J63j23M5n4K3J5
$$ -85 36 -51 -191 -32 74 -1 -107 25 109 -5 -161 39 194 -46 -75 139 -54 109 -14 31 -23 0 15
3563A5J64j84r5K02j12n5k1p4K09k6k32J76O7j07l8J43N9k01R9L07j88l01J37
$$ 15 179 -5 -100 102 -10 -65 -86 -160 49 23 -209 -33 34 -73 -111 32 91 -110 -11 296 108 -193 -56
3586e6J51n9r5j9K43p9M7j19M7r8j84K04J52j97K31q2j16J95k10M4J56q1l86J63
$$ -56 95 36 -59 -78 165 86 133 14 61 -37 -221 -17 135 -62 169 87 -29 166 -44 0 156 75 -311 -148
3610a48J46P5j6j75J58J6K8j25J53j63N7j16M7n1J76P3j95J41j6q8P0m2O3j56
$$ -148 -2 73 57 -118 40 56 84 -41 112 -51 6 -110 -63 -114 62 135 -60 81 65 -23 47 5 68 -88
3634h8l8K86j11o0j35L14j9o9j41J44J04j70k48J61R9j03l0K32j77j9Q0lj69N
$$ -88 -126 160 49 -11 -146 168 149 80 -61 83 187 17 -231 -70 29 -74 -104 128 -49 -68 12 9 -160 -155
3658a55K55Nk25L9OJ51j77L6Q0J4j42Q4J29j03j21O0P8j07Q3P2Q7k37j26K18J23
$$ -155 100 105 -120 -81 -75 76 -101 -65 15 29 -113 -29 100 -3 -124 -64 14 -93 -10 62 149 -88 -214 4 127
3683A27j73m9K74n7j50K3J03j29J3j25K35J9l30K84mn3O7PM7j49j27J65n6l4k3
$$ 127 -46 -95 179 122 -28 -5 98 -31 -18 -143 92 111 -219 65 61 8 75 82 129 -20 -147 18 -38 -72 -95
3708i5J07J65l19L0M7J87k03J6K00k03o8J86J07k62J69j49L21j64j00J51O2k90
$$ -95 12 177 -142 -112 -65 122 -81 -65 135 -68 -136 50 157 -105 64 -85 236 72 -28 123 185 -105
3730a05J27O0Mj60%O2L6j44N4J34n5j41kK63j55m1J1J00J01k33J43k04O4J21l3
$$ -105 22 82 86 -74 -74 -12 24 -120 -66 68 13 -128 -130 133 -22 -63 -52 48 149 -84 59 -145 -81 40 7
3755GN3k30lK94n8j02mL07m7j47q2K41j74p5m7J89j82K1J86p1J2k21K16j14o7
$$ 7 60 -170 -173 121 63 -39 -43 264 217 70 -12 229 55 -20 -67 122 -60 -39 147 76 88 -133 83 -31 -98
3780i8J09L8J2p0J58Ro2k76J13L07k71Q5k8P0J57l74J91P5k28J1j5K99k28J7%
$$ -98 11 49 61 -9 149 158 96 -180 -67 240 -31 54 26 96 253 -121 70 145 -83 -72 -87 212 -16 1 1
3805Am0J47j12J65j85p8J75K4q0%p7J05j33p7J91ojj4k1J32k77K8K24j4l08K04
$$ 1 -39 108 -4 161 -24 -102 73 97 17 17 -60 45 -88 -165 26 20 19 5 -16 116 -161 -133 91 77 -231 -27
3831b7O4k6n7o3M9R2j95J92J25j88N5q1K77k66j36L10J14k82l9K57o7k22J16J37
$$ -27 37 11 -46 -109 -60 32 -163 29 154 -34 21 -60 217 -49 -185 125 239 -43 -82 175 108 -114 2 139
3855A39j65J15o6P3j00J8p6K06j73k00K32J27l65J32K47j41j84K22lJ3j10J26
$$ 139 -26 89 23 96 -4 14 -62 144 -29 -229 3 130 -235 -103 144 3 -181 41 38 51 -59 67
3877F7J47k16kO1J01j29m4m3K45k80J14J4jj63QQ5N0j33J1J39nj01J60K5O1k29
$$ 67 214 -2 -4 57 158 29 -15 -58 187 -93 21 35 34 -129 -121 -36 14 -119 -108 31 26 -75 85 110 171 -58
3903e8J06J00j93k1K05j53R7O8k05O1q5K15j24O8j99oJ05n3j41K96k27J65m6j02
$$ -58 48 148 -45 -66 139 -14 83 151 -54 7 -78 137 13 81 -118 -124 -19 -72 -213 83 -144 21 -25 -127
3927a27J9L55l66P4J47k30K0J3K09n2k33L34j78n2L3nQ5J96l31J25j02p1N4M0
$$ -127 -108 247 -119 -45 102 -128 -108 -95 114 62 -171 163 -15 -67 -34 -39 46 242 -89 36 -66 -137 -83 -43
3951d3K58j55q5J9O5j67J66j00J2J66l63K2K89j0K4j3l44K59J9j9r4M1M1M3k05
$$ -43 215 60 -25 -6 59 -108 58 -42 -30 136 -227 -205 84 74 98 85 -259 0 19 0 -94 -53 -12 31 -174
3976a74J6L36k38J13oJ08j75M7J05k19K9q1L12k28M9j97K51j14L0Q9j22P0O8j74
$$ -174 -158 178 -60 53 47 155 -20 27 132 -87 -58 -139 173 -55 -6 -203 48 -66 -36 53 -69 1 69 -105
4000a05J10L7m3O1l0j12q5K57j08Ll3l3L0j87K41M1j8j5n6J54k31J16J85k70Q0
$$ -105 5 42 -1 60 30 -82 -167 90 -18 -15 -48 -81 -51 -238 3 44 26 11 -45 109 -122 -6 179 -91 -11
4025a1kN8R2j12p1j02Q1J21q1QK30k45J12r8J63k56J68m1R3j17J36p5j04r9J31
$$ -11 -13 45 137 25 -46 -148 -67 54 -27 -19 211 -34 78 -20 143 -113 55 14 107 -10 126 51 -53 -152 -21
4050b1P0L3j85K29j19k5l7J4J70j97J94l2O5k05J76k2j58j95J99J19q1J28k68
$$ -21 49 82 -103 126 7 -18 -55 -41 129 -68 126 94 159 -46 130 108 -50 -245 -46 73 -8 120 -148
4073a48J82j9k25K74j57N9l0k5O7j0j9Q9L1qJ81k25k04K09j47J72q0o6J34m7q
$$ -148 34 15 -210 64 -93 -34 -64 -89 -22 -32 -51 38 69 61 242 17 -187 22 -125 47 -33 -99 35 -12 -20
4098b0L1K12j07O9k89K33j33j65K23Lk4j32K9K63k20JP4j34R1j78J81P2n8j71
$$ -20 11 223 116 185 -104 129 -4 -169 54 57 33 -99 -70 193 -27 -26 48 -86 5 -173 8 80 22 -149
4122a49J27M8j82J81Q5j06j77R7o1R2K4J41j47K7l8P2j03Q6j16J23k0j56p2K34
$$ -149 -22 26 -156 25 110 4 -173 -76 -137 -45 -21 120 -27 0 -38 34 -69 17 -99 24 4 -152 -224 10
4146A0J05k02J21M2p2L0q8J27j36O6N3q0R5N3j84M7K5mJ14q4j04Q0k5K5J57k74
$$ 10 115 -87 34 76 4 34 -54 73 -63 3 56 -24 71 124 -60 -13 12 8 122 38 -66 14 -11 14 171 -103
4172a03J44m3j84J35J41n5j59j4K14n5r4K55j47j93K4Lj19J71R9lk7N6kM7j29
$$ -103 41 -2 -186 -51 90 35 -124 -138 76 21 -73 182 35 -158 -134 -131 -250 -79 20 17 -10 46 44 91 -38
4197c8N0j3j6J10l18rJ85Q9P3j12P6pm2J89J9l89O9J96j31MP8K7r8m4J3J79j61
$$ -38 12 -1 -17 93 -225 -234 -49 40 113 1 77 70 28 217 236 -153 -84 112 -19 -15 63 90 -8 -52 -39 140 -21
4224b1J11p5j48K43k7j50M4N5L4N2j39r8O2J06K1q1n3PJ55j25N0j8j00j3j3K83
$$ -21 90 15 -133 110 83 -67 -23 32 66 118 -21 -119 -57 49 70 -11 -64 -57 98 -27 23 5 -95 -108 -121 162
4250A62k33J12K7L5k85q9L79Ok15J82J51k48K6j01O9k1J00q4N1j57J40K0k19J64
$$ 162 -71 41 68 103 -182 -271 108 114 -101 81 232 -16 10 -91 -22 -43 57 -27 24 -133 7 27 -192 -28
4274b8K1j04K39j76m1K12r8rq7J22p5n7J33j19JJ11k32L42k38P3m0kp7J74J1j48
$$ -28 -7 -111 128 -48 -89 123 25 16 -71 51 -24 -81 52 -67 -66 45 -187 155 -83 -10 -50 -52 -129 45 56 -92
4300i2O0M4j34K51j53l1K51l37J25N7Q8j66j70J22M5oPRK45k55k5N9K5n7nm8J85
$$ -92 -32 12 -122 129 -24 -55 196 -141 -16 41 129 -37 -207 -85 -40 -46 -39 -30 215 -40 -65 -6 19 -38 -43 -91 94
4327I4j77NJ63k17N7O8J02j50n4J64l1L1j32j1M4M4n5J52m9K4q4J17q1k13o1J75
$$ 94 -83 -78 85 -132 -75 -7 95 -55 -109 55 24 55 -77 -88 -44 0 -55 97 48 72 -12 105 24 -189 -250 -75
4353g5P7j53K79nj86Q2p8pJ48j61O2J06j76J03qj09K59l35Q4j2J04J52j02o4j17
$$ -75 2 -151 128 123 -63 19 -59 -66 82 -79 -17 89 -87 16 8 -101 158 -177 -93 -105 -1 151 49 -15 -132
4378a32J44j34J53k30J92J47j02l9%l8k1L7n8N0p4O2J55j12J91l46K07l3M9j25
$$ -132 12 -122 31 -199 -7 140 38 -1 -1 -39 -60 -23 -81 -31 -105 -43 112 0 191 -155 52 19 68 -57
4402e7j8J66o5J06O3k53K1J02o1O7j72M6lQ6kkk8j6J67j71M3J58j55K6j83k2J78
$$ -57 -75 91 26 132 195 -58 -37 65 4 71 -101 -55 -58 28 26 24 -4 -20 147 -24 19 177 22 48 -135 -157 21
4429B1j9Q3j60L5J23k8j7O6o9n8q0K82l54J11rK9r8K3J35QN5K3q9r4J04j25K26
$$ 21 2 85 -75 -40 83 55 38 104 35 -23 -103 179 -175 -64 -73 -44 -142 -119 16 24 79 102 13 -81 23 -102 124
4456A24l9M4j35m1J98j47P7l4qk33K86j27L0Mj17N2J00j54K0R0l9k4N2J38R7p5
$$ 124 85 129 -6 -47 151 4 81 47 39 -194 92 -35 -5 -1 -118 -66 34 -120 -100 -10 -49 -73 -21 117 214 139
4482A39j59o6J60j30M7J49j33RQ0k9o3PP9L4j48J32j44N5%J51j57k5OJ69q7rk1
$$ 139 -20 -86 74 -56 -9 140 7 16 96 67 4 11 90 124 -24 108 -36 19 19 170 13 -12 -6 163 76 67 46
4509D6O4k49J88K1N2j26J16k35J39J07j38m1M0R1r1n9J35m0j20O1K33j44j13O6
$$ 46 110 -139 49 70 122 -4 112 -123 16 123 -15 -56 -16 75 -16 -75 60 20 -100 -39 194 50 -63 3
4533CL7j5j9Q9j41J52k07K84j36R1j50pO5j54Q5O7j36J82r0j26R8j28o4L51o6
$$ 3 40 25 6 95 -46 106 -101 183 47 138 -12 -19 46 -108 -23 44 -92 90 0 -126 -28 -156 -220 131 65
4558F5L4j47K6j11J14J77j88m9P0n7O9l1r6L7P8N7J76l04J2Q1R9o9l0l9M3L1J43
$$ 65 99 -48 -22 -133 -19 158 -30 -79 -9 -66 3 -28 -124 -87 -9 48 224 -80 -68 13 112 43 13 -26 17 48 191
4585A91p2j44N0mj17O8j16J52o8J43m0P7m6K1j63pL4N4%l16L91J19k24k6L5j0
$$ 191 119 -25 25 21 -96 -28 -144 8 -60 83 43 120 74 95 -68 -75 -41 13 13 -303 88 207 -17 -43 -8 -18
4611a8o6j07L2J65m4j5pN5J23j17n8K52k51R1r9k0J22J5n2L6n4J04k47J44J18
$$ -18 -84 -191 -159 6 -38 -53 -60 -5 118 1 -57 195 -56 35 -64 -84 38 53 1 37 -17 87 -160 -16 102
4636A02k67K53j37N0J04o7r1J09j21J26j32L36k58l5N4j7J03j7o5j10J60j21J58
$$ 102 -165 88 -49 1 105 38 -53 56 -65 61 -71 265 7 -28 26 9 112 95 30 -80 80 -41 117
4659A17j33J34O8j24l7l7l7K2j20J41J26n0j51J40q9q0N1nP7m9Qj0R2or1L2L7
$$ 117 -16 118 186 62 25 -12 -49 -27 -147 -6 120 70 -81 59 -30 -110 -59 -64 13 -36 -28 -38 54 48 -43 -11 26
4686B6k35J41J18J86k20K6j53J83N2l12J98M2j1l09L03r0J21n6R8O1l03O1QMj06
$$ 26 -209 -68 50 236 16 42 -111 72 124 -188 10 52 41 -268 35 -55 66 10 108 169 -134 -73 -65 -61 -167
4711a67K19n9J6o3j41N1L74k17J43j95L1r2J33k3J0R3j07K1o5J41j27j32K29p
$$ -167 52 -7 9 -54 -195 -144 230 13 156 -39 -8 -100 33 10 20 113 6 27 -38 103 -24 -156 73 66
4735F6k1JJ28p3l5j14R0M4J53j41r6m9J69k09R0o1J77J05l37p9J18j6J81q4j15
$$ 66 45 46 174 101 66 -48 42 86 239 98 2 -47 122 -87 3 -58 119 224 -113 -192 -74 -90 91 7 -108
4760a08JJ42K9jJ65k34J02j40P6O0J24k39J39j72q1K18l2Ro0r5l8M6J19r8L6k84
$$ -108 -107 35 64 63 228 -6 96 -44 32 92 216 -23 116 -56 -137 81 49 58 -2 -97 -135 -89 30 -68 -32 -316
4786c16L08J2m9J29j13q6L8l2Q4j05M6R5p2J3K2J50j64m8J67l15J72J05k37K6
$$ -316 -8 4 -45 84 -29 -115 -77 -109 -25 -130 -84 11 -61 -48 -26 124 -40 -88 79 -236 -64 41 -196 -170
4810a70L38r7O4q0j1j29J72m8j72J58j69J55j20rK10P0p0j19mJ5N1k1j97K21k24
$$ -170 168 71 135 55 44 -85 87 39 -133 25 -144 11 -109 -118 92 162 92 -27 -31 -16 35 14 -183 38 -186
4835a86L33j84O6J09r6j59K41j28K6J19j01j4Q9j98R8k2r9p7N7R3o2R4J05j54
$$ -186 147 -37 29 138 42 -117 124 -4 22 141 40 26 115 -83 15 -7 -106 -183 -126 -33 -95 -1 104 -50
4859e0J65j44p1O2J2kO0o9K9m5J31j67J54j05J92k06p3J32rO6k6j72J73K8K7j48
$$ -50 115 -29 -100 -38 -26 -28 32 -37 -8 -53 78 -89 65 -40 152 -54 -127 5 -4 62 36 -136 37 65 92 -56
4885e6J99k75J4J76o1J0J62j05q6Qj26J37J7kj24M3M2m8J27j11L7l2M1P2m6L4
$$ -56 143 -132 -118 58 -3 7 169 64 -22 -14 -140 -3 14 12 -112 -69 -27 -75 52 -59 -22 -54 -13 59 13 47
4911D7J1j40J48j43N4l8j41K28j49K35l3J0j0j37J47j88J91k45R9K09m5k17J53
$$ 47 58 -82 66 -77 -23 -61 -202 26 -123 112 79 89 79 -58 89 -99 92 -153 -54 155 110 -107 46
4934D6n8O3K3J2k54J58j7J62j64Q6n9r2J54K1j9j30K33o0j91N2m3J04j22K30k65
$$ 46 -12 51 74 86 -168 -10 -27 135 -29 57 -2 -94 60 81 62 -68 165 105 -86 -34 -77 27 -95 135 -130
4959a30qJ91j4k0q2J04R2j67O8lO0qj03J95j91jQ1j17K01k27Q1M5l04M24j18q2
$$ -130 -138 53 39 19 -63 41 133 -34 34 31 91 83 -20 175 -16 -17 64 -53 148 -79 2 47 -257 167 49 -33
4985c3J33q2j56J25J04l05J41O9qJ44k57L21j33P9q0J92k68J9j5J15jm3L1j96
$$ -33 100 18 -138 -13 91 -214 -73 -4 -12 132 -125 196 63 142 62 254 -14 5 -10 105 104 61 92 -104
5009a04RJ56m8o8L8L5k6J01j71J43j68K55N4k13n4Q1l0J06j43M7j31J83k12J36
$$ -104 -95 61 13 -55 -17 18 -8 93 -78 65 -103 152 206 -7 -61 20 -10 96 -47 0 -131 52 -160 -24
5033b4J5j16J03M7j71K21k7j14J43j35R0m8l2l6J59j45J19P5j84J48j10NO4q7
$$ -24 -9 -125 -22 25 -146 75 48 -66 77 -58 32 -16 -48 -84 75 -70 49 124 -60 88 -22 -17 47 -40
5057d0L2m7o3j0J10n0J6L6M3p4j4J53j06p1J09n5n8Q8n1j38K15P3p2j21N8q7J68
$$ -40 -8 -55 -118 -128 -18 -68 -52 -16 27 -47 -61 92 -14 -85 24 -31 -89 -1 -52 -190 25 98 26 -95 -37 -124 44
5084D4Pp3k2N7j03ON3nj24K58p5J66j17k6k53K96j25N0j09o7J66r3K27j79J75
$$ 44 51 -22 -44 13 -90 -84 -31 -36 -160 98 23 189 72 46 -207 89 -36 14 -95 -162 4 -89 138 -41 134
5109A34n0j90P1J07j7j42J02j56J99o9m0kL0j06jJ55j18J02q0J65Mj24J14L6m1
$$ 134 84 -106 -35 72 55 -87 15 -141 58 -11 -51 -53 -23 -129 -130 25 -93 9 -71 94 98 -26 88 124 83
5134H3j28O6m6Q5j9L3L8m8n3o2J12m5J5l8J43p3m8m6k7N4q1J16R0j67P8j71K47
$$ 83 -45 21 -25 60 41 74 112 64 11 -51 61 16 31 -7 136 63 15 -31 -58 -4 -85 31 121 -46 32 -139 108
5161A08j84J71j43k1N8M7J54j58n2l5L7O0q8n6J57n5j4k9J0J29j35p5K9K9Q8N7
$$ 108 -76 95 -48 -69 -11 36 190 32 -20 -55 -18 42 -46 -102 55 0 -14 -43 -33 96 -39 -114 -85 -56 32 89
5187H9j44J60j11o4J10n4J3q1R8l0J7l0o2M0J02j20n5O4J66p7k4j5P9j51K93j77
$$ 89 -55 105 -6 -70 40 -14 -1 -82 16 -14 3 -27 -89 -49 53 -67 -122 -58 108 31 7 -8 71 -80 213 36
5213C6j86LK17k0R5j34Pn0k1J73j19J02k83L03j51R6l4J54k57l2J17Q9j81J09
$$ 36 -150 -147 70 50 145 11 18 -32 -53 120 1 103 -180 123 -28 68 34 188 -69 -101 16 105 -76 33
5237C3m8R8r2L5n8P3K8j22M3q6J03rq0l0M%J0J95nj43Lj35M5J43K1J4P5k36K51
$$ 33 -15 83 -9 26 -32 41 69 -53 -10 -96 7 -2 -82 -112 -108 -108 -98 97 92 -51 -48 -183 -138 5 26 40 115 -121 130
5266A30k07m7K00rj04J38j44J31j8q1j3Q5j8%j75M03l18M4K4J0P0r1o5J44K2k29
$$ 130 -77 -124 76 67 -37 101 -43 88 70 -11 -24 61 43 43 -132 271 -47 -3 21 31 101 10 -55 89 111 -118
5292a18J14j03M6n9J70j21j46K78j09l5J68j63J94Jj72J52r8j29J49j40o4J38
$$ -118 -4 -107 -61 -120 50 -71 -217 61 -48 -83 85 -78 116 117 -55 97 -1 -130 19 -121 -185 -47
5314d7m8K52l30L50o9n5j49rJ70j3J20k04j06J04J40n5L3r0j29Q2N9J16j28q7
$$ -47 -95 157 -173 177 108 53 -96 -105 65 52 172 -32 -138 -34 106 51 84 -6 -135 -53 6 122 -6 -93
5338i3P8j53K15j69J43j75J40L1P1j2r6p8K8MN8J60m6k08M0j7l9M0J87Oj27n6
$$ -93 -15 -168 47 -122 21 -154 -14 17 88 76 -20 -98 -70 -66 -8 152 106 -102 -62 -79 -118 -78 109 115 -12 -68
5364f8O0N2j70J58l03K03J76r8r9k6P2l4J77j42j40L25k01Q0p3l2P5J14j33P7
$$ -68 -8 44 -126 32 -271 -68 108 10 -89 -115 -43 -77 100 -42 -182 143 -58 22 -51 -83 -8 106 -27 50
5388E0j11j15J39k4L0j23J76J20j68J47j74qRp7J67j8j52R4J93j60R8k68L77j96
$$ 50 -61 -176 -37 -61 -31 -154 22 142 -26 121 -53 -61 -52 -129 38 20 -132 -38 155 -5 93 -175 202 6
5412Fj58R0K02j45Jk0j5N6j57K38Q6k18N9J8j50J05r9j12L04k1l00K23M6j13K4
$$ 6 -152 -62 140 -5 -4 -24 -39 17 -140 98 184 -34 25 43 -107 -2 -101 -213 91 70 -230 -7 39 -74 -50
5437e0k7J67m4P2L5o4Jr5o9J17RJ5j01p3J62m8j2p7P2m4j87L38R1k82J49r7j5
$$ -50 -77 90 46 118 153 89 90 -5 -74 43 52 67 -34 -107 55 7 -5 -82 -10 -54 -241 97 188 -94 55 -42 -57
5464e7J18M3l9j79M9R1j54J93k95K18J19k36K37k39J2M4J78j16nJ59o8m9r9K5
$$ -57 61 104 65 -114 -65 26 -128 65 -230 -12 107 -129 108 -131 -119 -75 103 -13 -18 141 73 24 -75 -50
5488e0J30j69M5M0j43P9J8K1L1j9J25N3k53J43k1K7o8k9k3N4K8J45q5r7j10L19
$$ -50 80 -89 -44 -4 -147 -68 -50 -29 2 -17 108 161 -92 51 30 57 -11 -40 -63 -9 19 164 79 -18 -128 191
5514A91n2l12J61L5q9m9J07r5O7j22K16J4j01O5j3J22j15J28j49K7N9k67K57k61
$$ 191 139 -173 -12 23 -66 -115 -8 -103 -36 -158 58 72 -29 36 23 145 30 158 9 36 95 -172 85 -176
$$ [...]
8191a
##END NTUPLES=NMR FID
##END=
