##TITLE=1H_ABPA2401A
 D2O
 8 sc, 
 25.1.2023
##JCAMPDX= 6.0         $$ Bruker NMR JCAMP-DX V2.0
##DATA TYPE= NMR FID
##DATA CLASS= NTUPLES
##ORIGIN= UXNMR, Bruker Analytische Messtechnik GmbH
##OWNER= root
$$ XWIN-NMR		Version 3.5
$$ Wed Jan 25 14:53:36 2023 Russian Standard Time (UT+4h)  she@DPX200
##.OBSERVE FREQUENCY= 200.13135
##.OBSERVE NUCLEUS= ^1H
##.DELAY= (6, 6)
##.ACQUISITION MODE= SIMULTANEOUS
##.ACQUISITION SCHEME= undefined
##.AVERAGES= 8
##.DIGITISER RES= 18
##SPECTROMETER/DATA SYSTEM= spect
##.PULSE SEQUENCE= zg30
##.SOLVENT NAME= CDCl3
##.SHIFT REFERENCE= (INTERNAL, CDCl3, 0, 15.7039)
##AUDIT TRAIL= $$ (NUMBER, WHEN, WHO, WHERE, WHAT)
$$ ##TITLE= Audit trail, XWIN-NMR		Version 3.5
$$ ##JCAMPDX= 5.01
$$ ##ORIGIN= Bruker BioSpin GmbH
$$ ##OWNER= she
$$ F:/spectra/data/she/nmr/H-F/1/audita.txt
$$ ##AUDIT TRAIL=  $$ (NUMBER, WHEN, WHO, WHERE, WHAT)
(   1,<2023-01-25 14:52:22.73 +0400>,<she>,<DPX200>,
      <created by zg, POWCHK disabled, PULCHK disabled
       configuration hash MD5:
       00 E9 B6 7A A2 85 ED C7 34 08 36 98 17 FE 4E 26
       data hash MD5: 16K
       53 EC 6A 36 6C BB FD 60 02 66 2B 4E FD 31 4A 11>)
$$ ##END=
$$ 
$$ hash MD5
$$ 71 D2 C6 C8 8D B8 A5 EC B4 2D DD E9 95 9C 74 99
##$RELAX= 
##$RELAX= 
##$RELAX= 
##$RELAX= 
##$RELAX= 
##$RELAX= 
$$ Bruker specific parameters
$$ --------------------------
##$DU= <F:/spectra>
##$EXPNO= 1
##$NAME= <H-F>
##$PROCNO= 1
##$TYPE= <nmr>
##$USER= <she>
##$AMP= (0..31)
100 100 100 100 100 100 100 100 100 100 100 100 100 100 100 100 100 100 
100 100 100 100 100 100 100 100 100 100 100 100 100 100 
##$AQSEQ= 0
##$AQ_mod= 1
##$AUNM= <au_zg>
##$AUTOPOS= <>
##$BF1= 200.13
##$BF2= 200.13
##$BF3= 200.13
##$BF4= 200.13
##$BF5= 200.13
##$BF6= 200.13
##$BF7= 200.13
##$BF8= 200.13
##$BYTORDA= 1
##$CFDGTYP= 0
##$CFRGTYP= 5
##$CHEMSTR= <none>
##$CNST= (0..31)
1 1 145 1 1 1 1 1 1 1 1 1 1 1 1 1 1 1 1 1 1 1 1 1 1 1 1 1 1 1 1 1 
##$CPDPRG= <>
##$CPDPRG1= <>
##$CPDPRG2= <>
##$CPDPRG3= <>
##$CPDPRG4= <mlev>
##$CPDPRG5= <mlev>
##$CPDPRG6= <mlev>
##$CPDPRG7= <mlev>
##$CPDPRG8= <mlev>
##$CPDPRGB= <>
##$CPDPRGT= <>
##$D= (0..31)
0 1.2 0 0 0 0 0 0 0 0.06 0 0.03 0 0 0 0 0.0002 0 0 0 0 0 0 0 0 0 0 0 0 
0 0 0 
##$DATE= 1674643942
##$DBL= (0..7)
120 120 120 120 120 120 120 120 
##$DBP= (0..7)
150 150 150 150 150 150 150 150 
##$DBP07= 0
##$DBPNAM0= <>
##$DBPNAM1= <>
##$DBPNAM2= <>
##$DBPNAM3= <>
##$DBPNAM4= <>
##$DBPNAM5= <>
##$DBPNAM6= <>
##$DBPNAM7= <>
##$DBPOAL= (0..7)
0.5 0.5 0.5 0.5 0.5 0.5 0.5 0.5 
##$DBPOFFS= (0..7)
0 0 0 0 0 0 0 0 
##$DE= 6
##$DECBNUC= <off>
##$DECIM= 32
##$DECNUC= <off>
##$DECSTAT= 4
##$DIGMOD= 1
##$DIGTYP= 9
##$DL= (0..7)
0 120 120 120 120 120 120 120 
##$DP= (0..7)
150 150 150 150 150 150 150 150 
##$DP07= 0
##$DPNAME0= <>
##$DPNAME1= <>
##$DPNAME2= <>
##$DPNAME3= <>
##$DPNAME4= <>
##$DPNAME5= <>
##$DPNAME6= <>
##$DPNAME7= <>
##$DPOAL= (0..7)
0.5 0.5 0.5 0.5 0.5 0.5 0.5 0.5 
##$DPOFFS= (0..7)
0 0 0 0 0 0 0 0 
##$DQDMODE= 0
##$DR= 18
##$DS= 0
##$DSLIST= <SSSSSSSSSSSSSSS>
$$ [...]
##$SUBNAM2= <"">
##$SUBNAM3= <"">
##$SUBNAM4= <"">
##$SUBNAM5= <"">
##$SUBNAM6= <"">
##$SUBNAM7= <"">
##$SUBNAM8= <"">
##$SUBNAM9= <"">
##$SW= 18.05172834244
##$SWIBOX= (0..15)
0 0 2 0 0 0 0 0 0 0 0 0 0 0 0 0 
##$SW_h= 3612.71676300578
##$TD= 16384
##$TD0= 1
##$TE= 0
##$TE2= 300
##$TE3= 300
##$TEG= 300
##$TL= (0..7)
0 120 120 120 120 120 120 120 
##$TP= (0..7)
150 150 150 150 150 150 150 150 
##$TP07= 0
##$TPNAME0= <>
##$TPNAME1= <>
##$TPNAME2= <>
##$TPNAME3= <>
##$TPNAME4= <>
##$TPNAME5= <>
##$TPNAME6= <>
##$TPNAME7= <>
##$TPOAL= (0..7)
0.5 0.5 0.5 0.5 0.5 0.5 0.5 0.5 
##$TPOFFS= (0..7)
0 0 0 0 0 0 0 0 
##$TUNHIN= 0
##$TUNHOUT= 0
##$TUNXOUT= 0
##$USERA1= <user>
##$USERA2= <user>
##$USERA3= <user>
##$USERA4= <user>
##$USERA5= <user>
##$V9= 5
##$VALIST= <valist>
##$VCLIST= <CCCCCCCCCCCCCCC>
##$VD= 0
##$VDLIST= <DDDDDDDDDDDDDDD>
##$VPLIST= <PPPPPPPPPPPPPPP>
##$VTLIST= <TTTTTTTTTTTTTTT>
##$WBST= 1024
##$WBSW= 4
##$XGAIN= (0..3)
0 0 0 0 
##$XL= 0
##$YL= 0
##$YMAX_a= 358353
##$YMIN_a= -323594
##$ZGOPTNS= <>
##$ZL1= 120
##$ZL2= 120
##$ZL3= 120
##$ZL4= 120
##$ABSF1= 10
##$ABSF2= 0
##$ABSG= 5
##$ABSL= 3
##$ALPHA= 0
##$AQORDER= 0
##$ASSFAC= 0
##$ASSFACI= 0
##$ASSFACX= 0
##$ASSWID= 0
##$AUNMP= <proc_1d>
##$AZFE= 0.1
##$AZFW= 0.1
##$BCFW= 1
##$BC_mod= 2
##$BYTORDP= 1
##$COROFFS= 0
##$CY= 11.3945322036743
##$DATMOD= 1
##$DC= 2
##$DFILT= <>
##$DTYPP= 0
##$F1P= 2.36226072786647
##$F2P= -0.459571619588291
##$FCOR= 0.5
##$FTSIZE= 0
##$FT_mod= 4
##$GAMMA= 1
##$GB= 0.15
##$INTBC= 1
##$INTSCL= 1
##$ISEN= 128
##$LB= 0.24
##$LEV0= 0
##$LPBIN= 0
##$MAXI= 10000
##$MC2= 0
##$MEAN= 0
##$ME_mod= 0
##$MI= 1.114404
##$NCOEF= 0
##$NC_proc= 0
##$NLEV= 6
##$NOISF1= 3.799351
##$NOISF2= 2.8
##$NSP= 1
##$NTH_PI= 0
##$NZP= 0
##$OFFSET= 15.70392
##$PC= 1
##$PHC0= -19269.63
##$PHC1= 4.600793
##$PH_mod= 1
##$PKNL= yes
##$PPARMOD= 0
##$PSCAL= 0
##$PSIGN= 0
##$REVERSE= no
##$SF= 200.130013532006
##$SI= 16384
##$SIGF1= 3
##$SIGF2= 2
##$SINO= 400
##$SIOLD= 16384
##$SREGLST= <1H.CDCl3>
##$SSB= 0
##$STSI= 0
##$STSR= 0
##$SW_p= 3612.71676300578
##$SYMM= 0
##$S_DEV= 0
##$TDeff= 0
##$TDoff= 0
##$TI= <>
##$TILT= no
##$TM1= 0
##$TM2= 0
##$TOPLEV= 0
##$USERP1= <user>
##$USERP2= <user>
##$USERP3= <user>
##$USERP4= <user>
##$USERP5= <user>
##$WDW= 1
##$XDIM= 8192
##$YMAX_p= 0
##$YMIN_p= 0
$$ End of Bruker specific parameters
$$ ---------------------------------
##NTUPLES= NMR FID
##VAR_NAME=  TIME,          FID/REAL,        FID/IMAG
##SYMBOL=    X,             R,               I
##VAR_TYPE=  INDEPENDENT,   DEPENDENT,       DEPENDENT
##VAR_FORM=  AFFN,          ASDF,            ASDF
##VAR_DIM=   8192,          8192,            8192
##UNITS=     SECONDS,       ARBITRARY UNITS, ARBITRARY UNITS
##FACTOR=    0.0002768,     1,               1
##FIRST=     0,             0,               0
##LAST=      2.2672688,     0,               0
##MIN=       0,             -323594,         0
##MAX=       2.2672688,     358353,          0
$$ Real data points
##PAGE= N=1
##DATA TABLE= (X++(R..R)), XYDATA
$$ [...]
1028i219o36P953O073R40J696P94o499q496q97L679J936L515O499J545n531m837
1044a485j611k823j893M802P040J819r27L68k944p647l495L976L539J410M727
1059D856M709l783q004k649O6k103J697Q848N699l241l796j149m798n843K462
1074g029P704L323L60K103q46o958n688J060K838J089L459N624J69n569l334o48
1090b343l062j802N444O407M42r06N78l565p004j957L746L184K278M155K372m006
1106C961o453k775J03j27K797O651L692k840l550j900l787l389K913O013K389
1121C698L52J209j504n766l783J098J870J282L541M330m05m566l114j239k269
1136e266m31M865N382N04j081n36l471n729j314L920L637J953K922J178m220n885
$$ plain form
1028 -9219 -9855 -1902 4171 5111 6807 7601 1102 -7394 -8291 -4612 -2676 839 7338 8883 3352 -1485
1044 -1485 -3096 -5919 -7812 -3010 4030 5849 4922 5290 2346 -5301 -8796 -4820 -1281 129 4856
1059 4856 9565 5782 -2222 -4871 -4805 -6908 -5211 3637 9336 6095 2299 1150 -3648 -9491 -7029
1074 -7029 675 3998 4358 6461 5615 -1343 -7031 -5971 -3133 -2044 1415 7039 7208 1639 -1695 -2343
1090 -2343 -5405 -7207 -1763 4644 5086 4180 4758 1193 -5811 -7768 -4022 -838 1440 5595 7967 3961
1106 3961 -2492 -5267 -5164 -5291 -2494 4157 7849 5009 1459 -441 -4228 -7617 -4704 1309 3698
1121 3698 4050 5259 3755 -2011 -5794 -4696 -2826 -1544 1997 6327 5922 1356 -1758 -2997 -5266
1136 -5266 -5697 -832 4550 5054 3973 3437 -34 -5763 -7077 -3157 480 2433 5355 6533 2313 -3572
1152c572j659J148N69K325N353K526k991l378j387k765k298K627N096K096k4L65
1168D031j208m675l627R90K501J311K634M048m67n193l112j98j534k38M774M991
1184E028j16k069q68k685m769q68M325L946R57J375P96l639n307p89J843M72J657
1201g11M641K054l199l144q62k087k231K713N213J233r65Q25q36n052l274K084
1217c598K633N95K615L772j521n442k151M67j217rM808M273j087k458m58k394
1233a172m209J64M886K645l82J593J050m217m637P27J697o26K047N009P76l907
1249A444k201k51k344j610L211M547N28j073P88j143m989k293K877K318Q8K778
1265B675K962k713m808o72L81j558R90M904K496j896j500l15k736l241J349M167
$$ plain form
1152 -3572 -5231 -4083 -3514 -1189 4164 6690 3699 321 -1066 -3831 -6129 -3502 1594 3690 3666 4031
1168 4031 2823 -1852 -5479 -4489 -1988 -677 1957 6005 5538 345 -2767 -2965 -4499 -4737 37 5028
1184 5028 4912 2843 1975 -710 -5479 -6347 -2022 1924 2881 4256 5052 1413 -3894 -4683 -2840 -2368 -711
1201 -711 3930 5984 2785 -359 -1221 -3308 -5539 -2826 2387 3620 2655 3480 2644 -2408 -5682 -3598
1217 -3598 -965 -370 2245 6017 4496 -946 -3097 -2630 -3847 -3856 952 5225 4138 1680 1222 -1172
1233 -1172 -5381 -5217 -331 2314 1932 3525 4575 358 -4279 -3552 -1855 -2481 -434 4575 5351 1444
1249 1444 -757 -1008 -3352 -4962 -1751 2796 3324 2251 3039 1896 -3093 -5386 -2509 -191 -103 2675
1265 2675 5637 2924 -1884 -2556 -2175 -3733 -2743 2161 4657 2761 1261 946 -1790 -5031 -3682 485
1281D85J352j27J807J72m185l510R87J286k69K467M018k29l554j542l50k263o98
1298d153L565L433j36m66M76k234m097o03K612J458O21K443J484k630l542o08
1314b377K10q20J217L997J967j814j679m53k082k478J534L496J070J61J139m93
1330B595l691k277P30R88O04K352K502n75k687j567o29j311j58K958K985j42r76
1347A701J01j707l494l65K730J505K53J890J062k439l164n50M99j85J112L207
1363B156J588j634j904o18j387j797J215L213J344l63N40l74l139k298J104J586
1379g68K69J535K622o95l158j255J19j116l31K954K920n48j466J4j206k918m67
1396c495K827J788k03J078J202k176l378j07J233l05O83L249J136k377j450J36
$$ plain form
1281 485 1837 1710 3517 3689 -496 -4006 -3019 -1733 -2002 465 4483 4254 700 -842 -1192 -3455 -4153
1298 -4153 -588 2845 2709 2243 2719 485 -3612 -4215 -1603 -145 476 2919 4403 1773 -1769 -2377
1314 -2377 -2167 -2987 -1770 2227 4194 2380 701 248 -1834 -4312 -2778 718 1788 1949 3088 2595
1330 2595 -1096 -3373 -2643 -1655 -1051 1301 3803 3228 541 -1026 -1655 -2966 -3124 -166 2819 2677 1701
1347 1701 1802 95 -3399 -3764 -1034 471 724 2614 3676 1237 -1927 -2477 -1978 -2163 -1051 2156
1363 2156 3744 2110 206 -412 -1799 -3596 -2381 832 2176 1813 2353 1979 -1160 -3458 -2354 -768
1379 -768 -499 1036 3658 2963 -195 -1450 -1331 -2447 -2778 176 3096 2548 1082 1096 -110 -3028 -3495
1396 -3495 -668 1120 917 1995 3197 1021 -2357 -2464 -1231 -1536 -853 2396 3532 1155 -295 -159
1412a59j642j736J993L054K63m53R17o96l308j585J694J355j72J541K508j031
1428B543l427q90Q53j222m91L424K607j580j451P06j433k997N98K990P78l47J479
1445B140M84k580k386O38O94n73J164L016L70k476q18L69j852j669K490L034n15
1462A530o39J345q47l671r50K327R66m94J893J993j873k873k25M93r64M24K865
1479A300J421j349r88J52j325j939P68K357M30j98J285J91k501j721R55K32o55
1496a585J667K610m81j954j91m25j892l63K337J950j73j48L38j376k508l43J830
1513g07Q45O1J418J074j877k267J81M43q48P48K465N17j337k81O1j503j286R75
1531a318J657L24J50R22q6k115j524O23O36k52J224K224k11k202p84J40j265l70
$$ plain form
1412 -159 -1801 -3537 -1544 1510 1773 1320 2237 1541 -1767 -3352 -1658 -303 -475 1066 3574 2543
1428 2543 -884 -1774 -921 -2143 -2634 790 3397 1817 366 1072 -361 -3358 -2760 230 1008 661 2140
1445 2140 2624 44 -2342 -1704 -1010 -1583 -419 2597 2967 491 -327 42 -1810 -3479 -989 2045 1530
1462 1530 891 2236 1389 -2282 -3232 -905 61 -433 1460 3453 1580 -1293 -1518 -1025 -1989 -1565 1300
1479 1300 2721 1372 384 536 -789 -2728 -1960 397 827 629 1914 2105 -396 -2117 -1162 -930 -1585
1496 -1585 82 2692 2211 257 66 -359 -2251 -2614 -277 1673 1500 1352 1690 314 -2194 -2537 -707
1513 -707 138 199 1617 2691 814 -1453 -1272 -829 -1677 -929 1536 2053 716 435 496 -1007 -2293 -1318
1531 -1318 339 663 813 1735 1649 -466 -1990 -1367 -731 -983 241 2465 2254 52 -732 -592 -1857 -2227
1549b227K218J990l79p91J65j008j889k17J631J074nP05O25j323j872J03N83m29
1567a046L25J838P92j150o92L16j072j562Q18K103K07k24R08L6k309j429Q82P11
1585e48q6J195J811n53k032q32K41n96j83J891J691p32r67L00n54j971M6K038
1603A59N12o53R83R49j721j698P53M25r52M59K120N50j393m64L73j327j431J233
1621a123K159Nn26R44j02k554j132J635O54n17J181J850j243k224J3P07j011p3
1639a357K129J078j262n14O85q55j709M93J589J41m19J114N73j711j286O72K46
1656c93q98P50K165O4j488j86K55j599q18J870J529n87j65R50q90k047j68J355
1674c01K11j50J197R45j291j544K78M35q76J65J778O18j173n8N60j145j496Q92
$$ plain form
1549 -2227 -9 1981 1602 811 976 -32 -1921 -2138 -507 567 562 1267 1892 569 -1303 -1200 -617 -1046
1567 -1046 -721 1117 1909 759 67 383 -689 -2251 -1433 670 877 653 1561 1597 -712 -2141 -1259 -548
1585 -548 -634 561 2372 1819 -213 -1045 -804 -1400 -1583 308 1999 1267 300 600 46 -1925 -1879 159
1603 159 671 18 1001 1950 229 -1469 -716 -291 -1243 -784 1336 1886 493 29 402 -925 -2356 -1123
1621 -1123 1036 1041 515 1459 1357 -1197 -2329 -694 -40 -557 624 2474 1231 -993 -980 -273 -1284 -1357
1639 -1357 772 1850 588 74 759 -96 -1805 -1312 277 418 -1 1113 1686 -25 -1311 -639 -393
1656 -393 -1291 -541 1624 1688 200 14 269 -1330 -2148 -278 1251 664 499 1449 559 -1488 -1656 -301
1674 -301 -90 -240 957 1902 611 -933 -655 -220 -1096 -931 847 1465 292 234 794 -351 -1847 -955
1692i55J410l50J2J325o6j822p28N87p9l13J066J547k99j267k75J2r64m57J542
1711g4J237m86k72O20p70j580L4J121J20n8R86N79j134r94J77L7n20M09J368L43
1731A143o95j96J54r13r64O32J163L8l6Q00m5j537q06O06L03k76Q64J242l62j302
1751a87j63J49p70k57J272J009m45k49K79m88j247q3J106K74k59O85P40r57j297
1770h88K61M22o54K61J535K97j028k34L46q22j024Q73J225j07j93O04Jj473o68
1789a266Q59L91m92N96J268m58j323J1M04q39m00J518R23p38l97O09m99j385K17
1808a001J186j5k83R02O03j277j092M89L00o52M43J555K7j241m2N07r52r07J071
1827c79J148m69k45Q42j15j649k76J102P2o53Q86J140q81j108L73J56r19l1J534
$$ plain form
1692 -955 455 105 117 1442 1376 -446 -1174 -587 -666 -979 87 1634 1335 68 -207 -195 -1159 -1616 -74
1711 -74 1163 677 405 1025 255 -1325 -1291 -170 -50 -108 878 1457 323 -671 -494 -457 -977 -568 800 1143
1731 1143 448 252 406 -507 -1471 -839 324 362 326 1126 1081 -456 -1262 -656 -353 -629 235 1477 1115 -187
1751 -187 -350 -201 -971 -1228 44 1053 608 359 638 150 -1097 -1180 -74 200 -59 626 1366 409 -888
1770 -888 -627 -205 -859 -598 937 1234 206 -28 318 -504 -1528 -655 570 463 270 874 875 -598 -1266
1789 -1266 -407 -16 -508 88 1356 898 -425 -414 -10 -849 -1249 269 1192 454 57 666 167 -1218 -1001
1808 -1001 185 170 -113 789 1392 115 -977 -488 -188 -840 -397 1158 1185 -56 -98 409 -543 -1450 -379
1827 -379 769 300 55 897 782 -867 -1143 -41 31 -622 264 1404 523 -585 -212 -56 -975 -1006 528
1846E28N53q55o6N38p86j170N45J049j96k05R24L18j414p35P47P8o82O95J336
1865A202m18r97L38J73j119m13J163P49m85L8N86m05j236q4R26j47l35R08P91
1884A235r10q93M29N3q69L14J286J59o33K4M10r25o96N54P74k78K2Q99j34j215
1904c94l48O25j08m03P35R39l64q81K17J02q34k88J107O27n10j11N80l97j143
1923h49J26O96n1j45O82M60o49o30J30mm35K41R04L03n68m1J75o05o98N36P33
1944C11j21j03O22j1j074m06N79L7l24O15P80l65o69o0J13m63k16Q14N53m03j46
1965F3M28l20r08O8P03o7k11O56M66p93o17L88P2o31K84J059J22p74O5L72p29
1986c04p28O85Q65k06k75N44mj060l68P50J68m01M36P69m01q99K56L45o32k74
$$ plain form
1846 528 1081 226 160 698 -88 -1258 -713 336 140 -65 859 1177 -237 -972 -225 -147 -829 -134 1202
1865 1202 784 -213 125 298 -821 -1234 -71 678 193 231 817 412 -824 -908 18 -129 -464 444 1235
1884 1235 325 -568 -139 -86 -955 -641 645 804 171 195 605 -320 -1016 -462 312 34 56 955 821 -394
1904 -394 -742 -117 -225 -628 107 1046 682 -199 18 120 -714 -1002 105 732 222 111 691 294 -849
1923 -849 -723 -27 -78 -223 459 919 270 -360 -230 -234 -669 -428 476 779 211 170 345 -260 -958 -422 311
1944 311 190 87 709 698 -376 -782 -203 -166 -490 125 905 540 -129 -189 -76 -539 -755 59 612 209 63
1965 63 491 171 -737 -669 34 -33 -244 412 878 85 -532 -144 -72 -703 -419 640 762 -12 53 425 -304
1986 -304 -1032 -347 518 312 37 581 577 -483 -851 -101 67 -334 102 871 470 -429 -173 172 -460 -734
2006g34R21M64o35n5O35l74j026K05P83k43k66Q52L79q39o35L89J25n51K19J125
2026G39J05q92OL44o81n99Q04P62m06k26N91j91r71L1P20j84k91N50N29n84n54
2047c98M86J14p46n6Q88K55n53J12N10n69q91M22O28l74m9R04J29j007l76N38
2067c3j48m94O24R08l57o67J44J78o35k97R29L91m95k1M79l13p57J16O11k50k85
2088c72N59M32n24l97M06Jp78J39Q63J41m41K28J90o83m72L75M18j35P4N68n0
2109E42p45l35L90O7l00M50O65l37o23J96J52m62j60O94J16l95J30L93l21n34
2129d17Q4L74j52j46N35L24l98l99K38j17m57J15P38J99m79R9J82n15n06M70N13
2150B85k07o5M93r5p21j75M85mk80L87M39k79m21J54J46l81l02N67K97l51OM22
$$ plain form
2006 -734 187 651 16 -39 596 222 -804 -599 184 -59 -325 527 906 67 -568 -179 -54 -605 -386 739
2026 739 844 -48 -42 302 -379 -978 -174 588 182 -44 547 356 -615 -584 136 -48 -339 211 740 156 -398
2047 -398 88 202 -544 -600 288 543 -10 102 612 43 -848 -426 202 -172 -221 683 812 -195 -571 -33
2067 -33 -181 -675 -51 857 500 -167 -23 155 -480 -777 152 543 48 27 506 193 -564 -448 163 -87 -372
2088 -372 187 619 95 -302 104 105 -673 -534 329 470 29 257 447 -236 -708 -333 85 -50 24 592 542
2109 542 -203 -538 -148 -81 -381 69 734 397 -226 -30 122 -340 -500 194 310 -85 45 438 117 -417
2129 -417 -333 41 -111 -257 278 602 204 -195 43 -74 -531 -416 322 521 42 141 323 -192 -698 -228 285
2150 285 78 13 506 411 -310 -485 0 -4 -284 103 542 263 -158 -4 142 -239 -541 26 323 -28 -22 400
2172D00j78o67K2N36j44l03O11L67n40m83L36J7m92K01P53P0n19J19P4m03m12
2193f35M79M86k24j77M64K0p61j20N68J1n00M30M98l21m81L58J47o07o2N66K37
2214C76l98R6M13l65o81J89N74k34k36O12K91o66l97L98J0m89L44P09j65o05K29
2235EL05n89k75N81L20m39oN25k04o57J28M84j97l78M58M95n06l24L58j0n42J0
2257d58P23P1m31J56L56m72n01L73M10m03pN68L6n97j34L12j10k76L26M86k23
2278B05l97K82J07m52j86N39J85l40M4M78l13o03K13L87k96j21N52J76m33j88
2298a61K21j26l24J61M89k4l13J28K13l77l39K37L48k11o4N04l5n55l1K83m9l28
2320c53L64L68k13k48J38N1m14K7L42J59k29M8K90k06m63J27K92j41q1L63J83
$$ plain form
2172 400 222 -445 -423 113 -31 -334 277 644 104 -379 -43 -26 -518 -317 436 506 -13 106 180 -223 -635
2193 -635 -156 330 106 -71 393 413 -348 -468 100 111 -389 41 539 218 -263 95 242 -365 -427 139 376
2214 376 -22 74 487 122 -559 -370 204 -30 -266 346 637 -29 -426 -28 -18 -507 -163 546 381 -224 5
2235 5 310 -279 -554 27 347 -92 -98 427 223 -434 -306 178 -19 -397 61 556 50 -274 84 74 -468 -458
2257 -458 265 336 -95 61 417 -55 -556 -183 227 -176 -183 385 421 -176 -310 2 -108 -384 -58 428 205
2278 205 -192 90 197 -255 -441 98 283 -57 -13 465 152 -451 -238 149 -147 -268 284 460 27 -161
2298 -161 60 -66 -390 -229 260 236 -77 51 264 -113 -452 -215 133 -78 -142 362 327 -228 -259 24 -25 -353
2320 -353 11 379 166 -82 56 107 -307 -280 62 221 -8 40 330 124 -339 -212 80 -61 -142 221 404
2341D04m21j87K32ol04J18M09k5l23J48J96l54k16K18K17j62k6L54N2m67j90L26
2363gmk11J65M36j62l96J83J26l59j28M90J30l10kL44k11m29J50L38j56j88L38
2385A37J57l16k43K46J16m04M3N64j2m18J14L12l75l90M05L24l27r9M76m1m63
2406a94l5L23j19k47L54L59k89k88K31O1m60K7M43Q2l21J08L04k85l86R6M40l05
2428a01q0M23J28m74j39L39j17l36L13M10k03l46K85J13l91j23M12O7l08O7L65
2449C04q9m76P8L32k96j70L83L56m02j78L06k7m42K8N45m7k80K18J41l59k89K61
2471a03K24j77m5L70qm44j5L23j36l25K84L79k19k52K47K8l16o9L30N7k56J01
2493b2L19k23k33N6J19j25n2L18K00l06j24K02j12k85Q0L67k3j85Q5J88l28k69
$$ plain form
2341 404 -17 -204 28 22 -282 -164 245 220 -103 45 241 -113 -329 -111 106 -56 -82 272 324 -143 -333 -7
2363 -7 -11 -222 -57 379 217 -179 4 130 -229 -357 133 263 -47 -49 295 84 -345 -195 143 -13 -201 137
2385 137 294 -22 -265 -19 97 -307 -264 300 288 -130 -16 296 -79 -469 -64 260 -67 -166 310 269 -194
2406 -194 -229 94 -25 -272 82 441 152 -136 95 156 -304 -277 166 248 -73 35 339 54 -332 -236 204 -101
2428 -101 -181 242 370 -104 -243 96 -21 -357 -44 366 163 -183 102 215 -176 -299 113 180 -128 -61 304
2449 304 215 -261 -183 149 -147 -317 66 422 20 -158 148 121 -321 -293 252 205 -75 143 284 -75 -364 -103
2471 -103 121 -56 -101 269 261 -183 -198 125 -11 -336 -52 327 108 -144 103 131 -185 -254 76 133 -123 -22
2493 -22 297 74 -159 -103 16 -109 -161 157 357 51 -73 129 17 -268 -188 179 156 -29 56 244 -84 -353
2515c53K83K12k24k1K98k0l35j5K75j27k28K45K23j42r6Q4P6k25j66K34P1r2M6
2538CK63j16l61K9K16r0q6L28J27k85j97K06j00j75J02K88O0k66L2J21j76j56
2560b33J95K04j71j50K66J19l25k9K26m6k99J36L25r6j68R9J05k79j70K75J74
2581A58j74k0L09j74k83l5L26j23j21L09J16l52j91K58P3k36O4L49j21l21J46
2602d3K82k55j97K67J17l11J6K95M9m13R6K45j74k49K66K94j97k05J49R3l53j9
2624b47L61Q9l14J50K54k53l44J97K42k12r3L38O4l39j9K36Ll29K19K50j70l31
2646b48L30J15l44j33L34P5k77R7K44r4k52M0K01j96j33L37K30l54q0J80q8j61
2668a77l1L71L3k67R5J44k40j47K20J22j86k6K69p8k57J33J05p0k10K30J24j84
$$ plain form
2515 -353 -70 142 -82 -103 195 175 -160 -175 100 -27 -255 -10 213 71 -25 59 135 -90 -256 -22 49 -43 3
2538 3 266 150 -211 -182 34 -56 -142 186 313 28 -169 37 -63 -238 -136 152 212 -54 -22 99 -77 -233
2560 -233 -38 166 -5 -155 111 230 -95 -124 102 56 -243 -107 218 122 -46 53 158 -121 -291 -16 158
2581 158 -16 -36 273 99 -184 -219 107 -16 -137 172 288 -64 -255 3 76 -160 -96 253 132 -189 -43
2602 -43 239 -16 -213 54 171 -140 -124 171 220 -193 -97 148 -26 -275 -9 285 88 -117 32 125 -228 -247
2624 -247 114 203 -111 39 293 40 -304 -107 135 -77 -170 168 232 -107 -126 110 113 -216 3 253 83 -248
2646 -248 82 197 -147 -280 54 129 -148 -51 193 99 -153 -113 88 -108 -241 96 326 -28 -108 72 -16 -177
2668 -177 -208 163 196 -71 24 168 -72 -219 1 123 -63 -89 180 102 -155 -22 83 13 -197 33 157 -27
2690b7o9K32j0l08N4J59k5r8J46J26p9k82R1J02p8l7J90J51k04r6J52p7k09J29
2714f7J67Rj96J39J12k63q6J49J63j49m0J63M4k46K0J73p1j57O8K20r7j26J04
2737C3Q6k23p4J78M2o0LJ73j39j51O9J18j22o3K48O3j84j47K10%j66J3K36k8j88
2762g3J14J32j55j91J15J35m7j54K28K9k13q2K31n9k43K18J98r7j77J56j7j20
2784g2j10K33P9j97N3J84l6l26J24K06j36j59K60P7k71k6K20j0k67P6K74j14j36
2807g4J29J26k15j69K29J13k55L4K47%l15P1J35p7j57K03J87j89j51K10K6k95
2829a87J7K39J4j29L5J45j27k05J48J86k21n3K67O8l04P8J06o7k22J49K09r9j28
2852h1J22J35k79j02K53P3k03O1K01r4k81N7K26j51j30K54J03j90p3J90j2k06
$$ plain form
2690 -27 -96 136 126 -182 -128 31 6 -92 54 180 101 -181 -90 12 -66 -103 87 238 34 -62 90 13 -196 -67
2714 -67 100 109 -87 52 164 -99 -185 -36 127 -22 -62 101 145 -101 -81 92 21 -136 -68 152 55 -71 33
2737 33 119 -104 -178 0 42 -18 -15 158 19 -132 -63 55 -67 -130 118 181 -3 -150 60 60 -106 -93 143 115 -73
2762 -73 41 173 18 -173 -58 77 30 -124 104 133 -80 -162 69 10 -233 -15 183 86 -91 65 48 -72
2784 -72 -182 51 130 -67 -14 170 134 -192 -68 138 2 -157 103 180 -91 -117 103 93 -174 -98 176 62 -74
2807 -74 55 181 -34 -203 26 139 -116 -82 165 165 -150 -79 56 -21 -178 25 212 23 -128 82 108 -187
2829 -187 -170 69 83 -46 -11 134 7 -198 -50 136 -85 -138 129 197 -107 -29 77 10 -212 -63 146 47 -81
2852 -81 41 176 -103 -205 48 121 -82 -21 180 86 -195 -138 88 -63 -193 61 164 -26 -99 91 79 -127
2874a27J4K32q6j01R0Q3j01j38J90K5j59kK05L2k71M6J90j49j32J26J66j13m9
2897b9N8L0j33n4J60O3r3j00K00o3j98R0R4r8p4J61J35j57q8J99m4j23kJ23j7
2922D0o4M0R2r9j29M0J60j49k5K18j8j70j6J23p8r8P8J59m3r9M7R8j66n7J57N
2948D6j04P9N2m1j21O6Q1p1p6R5Q2p8o5Q5Q6j84l2J65N5k13J17Q1r3k04J85J04
2974I7j88K1J77M9j98j2N8Pj91J09J73r0j27J19R6j63o1J98M2j95L4J63n0k58
2998a90J39J73j18j53J56J23j89m5J48O3k04MK28p5p4J6J26j11j31R4R1j48k9
3021a06K80l4k49PJ63m6j34J05J75j60r6J77%k37L6J99n6j36P9J62j27j44J47
3044EQ3j88K5J07P8j63J2J85j02j64Q1J43q9r2J83L0k03r0J88l1k2j4J70ok15
$$ plain form
2874 -127 -113 119 33 -68 22 105 4 -134 56 81 -78 -80 125 157 -114 -68 122 -27 -159 -33 133 20 -29
2897 -29 29 59 -74 -128 32 95 2 -98 102 39 -159 -69 25 -73 -147 14 149 -8 -96 103 59 -64 -66 57 40
2922 40 -24 16 108 9 -120 -80 80 -69 -94 124 106 -64 -80 43 -35 -133 -55 104 61 -38 9 107 -59 -116 41 46
2948 46 -58 21 73 32 -89 -23 58 -13 -89 6 88 10 -55 30 116 -68 -100 65 120 -93 24 105 12 -192 -7 97
2974 97 -91 -70 107 156 -42 -54 4 11 -180 -71 102 12 -115 4 100 -63 -124 74 116 -79 -45 118 68 -190
2998 -190 -51 122 4 -149 7 130 -59 -104 44 107 -97 -93 135 60 -14 2 128 17 -114 -20 71 -77 -106
3021 -106 174 140 -109 -102 61 15 -119 -14 161 1 -95 82 82 -155 -119 80 24 -112 -33 129 2 -142 5
3044 5 88 -100 -75 32 110 -53 -41 144 42 -122 -41 102 13 -79 104 134 -69 -159 29 -2 -24 -38 132 126 -89
3069h9NJ39j02k0J38R8k13p0J15P6j78N9J56r3q8O6Q0j05p0J18K3j38NJ91k6j34
3095e7K4J14j08o2M0J24m3n4P9j0j23m8J55l1m3L2J11o8j32RJ00q0J9J44l2o7
3121gr5J42Jr8K4O8k9p5N7Q9p7p6P9J01j54l3J44K6r4j4O4o1j09J03J59j12q2
3148e9J34j7o9o6J34O1j94J2J59q9j50J37R0j14q4J46J01k12k2J47N1k15n2K48
3172G7m1l4M7P3r8j44J30Q5j76JJ81L6k11J3J28k7j58J14J53j08j38J33L1k01
3196a34L0J55Kj57O4J41j07j36J84J07k25l8J68J9j29j0J53jk15J10Q5o4r9J54
3220E7Q6j80m0Q5N6j27QJ58%k08O4J38j00p7J35M0r9n6J15J9k15O8J72p1l1%O7
3247F4p6p6J18L3j42j6J74M2k24O2J03q4r7N6J57n8q5P8P4j45m2J43k5p5R6M9
$$ plain form
3069 -89 -84 55 -47 -67 71 169 -44 -114 1 77 -101 -42 114 21 -67 -1 79 -26 -96 22 45 -93 -88 103 77 -57
3095 -57 -33 81 -27 -89 -49 75 32 -22 57 47 -76 -124 31 0 -43 -11 100 32 -100 -91 9 -71 -52 92 60 -7
3121 -7 -102 40 41 -57 -33 35 6 -69 -12 77 0 -76 3 104 -50 -83 61 87 -7 -21 43 -18 -127 -24 135 23 -59
3148 -59 75 58 -11 -77 57 118 -76 -64 95 6 -144 -7 83 -31 -115 31 132 -80 -102 45 96 -119 -171 77
3172 77 36 2 49 122 24 -120 10 95 -81 -80 101 137 -74 -61 67 40 -118 -4 149 41 -97 36 67 -134
3196 -134 -104 51 53 -104 -40 101 -6 -142 42 149 -76 -114 54 73 -56 -66 87 86 -129 -19 66 2 -97 57
3220 57 143 -37 -77 8 64 -63 -55 103 103 -105 -41 97 -3 -80 55 95 -4 -60 55 74 -141 -73 99 28 -3 -3 64
3247 64 -12 -88 30 63 -79 -95 79 121 -103 -41 62 -22 -119 -63 94 36 -49 29 103 -42 -84 59 34 -41 55 104
3273A04n2j48J05K7J3j39J14P4j16n5J13j1j26L6J39p4n7R1Q9j39r5J18l4n9m3
3298a25J75K6j09k1J32r6p5J9J86j01j03J70oj41J2O1L6q2Q8O4o2j47J07j2j7
3323b1k6N3Q0j12j8QM8j01M8J06lr9N7R4j32j21R3M0Jo0P2P6j22RO1l8j03M1J59
3352I0r1j17J09J09j69J0R7mj14N4J28m4j63P6O8l5p8J18Kp6k0R6J1j04k2J81
3378A12l9j01L4K6o9l0J07J0j18n2J77J3j54N5O4m2r6J53lp3J0Q5k7r9k8J72n1
3405C6j29J01Q0k4j78J09N8m9o6O6P4j21K7N7kj26pJ61o0p3J00Rn9o5J30M8q3
3432A4l8R0k6j55J18L5m8r9J55Lr4J2P2Mj48M5J62p3o6OJ22j40q7J26M0q7kO0
3460AK0p5N1L3p7m1J24j4q3%M4M4j5p4J03Kj01R3%q3J2k2P1k8k7O0N0r4L7L3J4
$$ plain form
3273 104 52 -96 9 36 49 -90 24 98 -18 -73 40 29 -97 -61 78 4 -53 38 127 -12 -107 11 -23 -82 -125
3298 -125 50 76 -33 -54 78 -18 -93 -74 112 11 -92 78 72 -69 -57 4 40 -42 46 110 48 -99 8 -4 -21
3323 -21 -47 6 86 -26 -44 -36 12 -89 -41 65 62 -37 20 114 -18 -139 -46 -6 -5 -65 7 83 -39 -30 31 -7 -110 -69 90
3352 90 -1 -118 -9 100 -69 -59 38 34 -80 -26 102 58 -105 -29 39 4 -74 44 46 -30 -50 46 57 -47 -69 112
3378 112 73 -28 6 32 -37 -67 40 50 -68 -120 57 70 -84 -29 35 -7 -103 50 47 -26 -16 69 42 -57 -85 87 36
3405 36 -93 8 88 64 -114 -5 53 4 -62 4 78 -43 -16 41 39 -87 -94 67 7 -66 34 43 -16 -81 49 97 14
3432 14 -24 66 40 -115 3 38 -10 -109 46 49 -45 -33 39 43 -105 -60 102 29 -37 -31 91 -49 -136 -10 30 -57 -59 1
3460 1 21 -54 -3 30 -47 -88 36 22 -61 -61 -17 27 12 -62 41 43 -58 35 35 -48 -36 -58 13 -15 -42 18 68 -26 11 44 58
3491E8j43J07rl0k8L7R1r5p7J24N8j70N1Q4Lj41N4J04n2p8L4J21q9q8J40l5p7
3518d6m0L8Q3p4J6P9j3q5O4j1l4p8J38K3q8PJ10m6j17L9O9prK4L8q9p5P7O9j13
3548e1M6L1Nn4o1J17j5j05N1N5kr1P4P9j19m2K02o2r2nN3L3j04O5J9m8o4J14J9
3577D8l1p3J40o2j15J09Qj1j1J2K6n9n1J23Pr2J4P5n1o4L8N1qr9J25k7n6jR2k7
3607C0n4n7J04M1j45Q5J03q1p6M8L9n5o3R9J00r1n2P6k9j08P2J33r1q1N2K9r4
3634f6JJ12Kj25M6R2j12qM6R3r2n0L5J14j42k8J13k4l5j8P5l7k0R4Qj02MN5j9
3663A2j3L5K6J0j01nQ9m9r7Q4NL8q0P1M0o7m6O3on2N8Po7J3O2J7q8kN2M8r3J9
3695a7M0K2q3l0R1K1r5N2M7k9o9N4k3J0L7N0l1j32P5PK8p5K8P4l8J9m2jK0l3k1
$$ plain form
3491 58 -85 22 13 -17 -45 -8 83 -12 -89 35 93 -77 -26 58 61 -80 -26 78 26 -52 -18 103 14 -74 66 31 -46
3518 -46 -86 -48 35 -39 -23 56 43 -42 22 11 -23 -101 37 60 -28 -21 89 43 -74 -35 34 27 18 42 80 -9 -84 -7 62 -51
3548 -51 -5 26 31 -23 -84 33 18 -87 -36 19 17 -74 0 79 -40 -82 120 58 -34 -39 14 47 -57 8 27 -21 -85 29 48
3577 48 17 -56 84 22 -93 16 24 13 2 14 40 -19 -70 53 60 -32 -18 57 6 -58 -20 31 23 -76 49 22 -34 -35 57 30
3607 30 -24 -81 23 64 -81 4 107 26 -50 -2 37 -18 -81 18 118 27 -25 51 22 -86 -14 119 28 -53 -1 28 -66
3634 -66 -65 47 49 -76 -30 62 -50 -58 -12 81 -11 -61 -26 88 -54 -82 31 7 -28 -46 29 -8 -28 66 74 -28 -24 31 12
3663 12 -1 34 60 70 -31 -36 53 4 -93 -9 -4 34 -46 25 65 -2 -48 15 9 -43 15 22 -45 -32 30 47 -41 -43 9 57 -36 -17
3695 -17 23 45 -38 -68 23 44 -51 1 48 19 -50 4 -19 -9 28 78 47 -85 -10 -3 25 -50 -22 52 14 33 -9 -10 10 -23 -44
3726d4M3o8O8M5o5n7N7K8p2J6K4O9m5n2O1l2RK8J7o1lL5P4k9j06R6nj7k0L4Qr1
3758e5jN5J2m1K3N5r6j4J1O8l4oO7mj05L5P7r3j6O3M7o6j9J08j8m3n1R3Mj04N1
3789CR9q5l5P7q7J7k4RJ4m7M9M6k8j6qO2q9qP3pl5k7J08l7p0k0P4nk0RM2m9l3
3822d8P9l4k4m2J13m3k6L4Q6j51j2Q4l7km5J28k3q8M9M%k3K1M7l9j05J31o9l7
3851g2J4L0L9m0j0J01m8p0K3J4J0k9L9j5k0J7N6pm3K7j1k0J7M9m7K0l3N9jj07
3881e8L2J15j02Rq1J22rm8M5m9k1j9N3N7q1L6QN9o1q5J17j4j02J49m1k4m1K8k6
3910c2J9J6QL7n8k3M4L8m6K8ll2k6N3ro3lP5J4m2QK5J7o0l6P2n1MK3M2o5OL8J3
3944C1m7m6M4m2M4n6Q0K2j7MM6r7K5O7k9m8N4LJp3K9N6r0L1K7P9o6p6P6J8r9P3
$$ plain form
3726 -44 -1 -69 -1 44 -21 -78 -21 7 -65 -49 -25 44 -1 -53 8 -24 -15 13 30 -31 -34 1 75 46 -60 36 31 14 -6 28 36 -55
3758 -55 -56 -1 11 -30 -7 48 -48 -62 -51 17 -17 -23 44 40 -65 -30 47 -46 -62 1 48 -18 -37 71 53 10 -41 52 56 -48 3
3789 3 102 17 -18 59 -28 -11 -35 -26 -12 -59 -10 36 8 -8 -16 46 -43 -51 22 15 -20 -47 61 24 -46 -66 8 3 -17 -8 34 -15 -48
3822 -48 31 -3 -27 -69 44 1 -25 9 95 -56 -68 16 -21 -23 -68 60 37 -51 -2 2 2 -21 0 47 8 -97 34 -35 -72
3851 -72 -58 -28 11 -29 -39 62 14 -56 -33 -19 -9 -38 1 -14 -34 -17 39 32 -11 16 5 -15 2 51 4 24 -9 50 49 -58
3881 -58 -26 89 -13 -4 -85 37 28 -20 25 -24 -45 -64 -11 46 -35 1 9 68 7 -78 39 25 -77 72 31 7 -34 -6 -32
3910 -32 -13 3 11 48 -10 -33 11 49 3 31 28 -4 -30 23 14 -49 -52 23 37 -5 3 28 45 -15 -51 21 -30 -26 -3 39 -26 -20 18 31
3944 31 -16 -62 -18 -60 -16 -72 8 30 13 17 63 -34 -9 58 29 -19 35 38 39 -34 -5 51 -39 -8 19 98 32 -44 32 50 -49 24
3976B4N8j22%N1pMp1O0P0j06RL9l9j3M9j5N1l8j2K5n3K7Ok3M8k3K3K7m3%kK1m7
4009b2M8L0n5m9O6m2oO8k8qn7N0K9j6m2j5P3m1J4NPp2O1L9m0j2J8M1j2j5nK3r8
4042f3N5N6n4K4k5M0j9l9N5J3o7L3k9Q8r3m7J23qm9M8M7r0p6Q6K4m4l5l1J11k1
4072A3k6J4J0k1%K4L3k5n7O9l7J1m0M4p1N7k2Q2p5k2Q3p8qPP1Mn3K3k5k0M1l2
4104b6N6j03J05j7m3mK5j8j9K4J2nj7J4L6k4n1jR8m3l9R4j3Km5N2m6lk5P2%o7
4136a9kO4p3mK0L4qk8Q0K6j43L1j7M9o7M3j6j2KJ7O5m4KK0N9j11K1K8o9l6Q0K3
4168A5j4j4N6j4m2n8J02J6q3M0LM2j00O7o5N5p7K6O3j0k5N7qk5Pm0L4k0L2Km5
4199b3rK7O1o7l6J2N2n6L6J4J9j40P9L2K8qj5N6p8M0Pj8j8k7Q1n3k5QO8m9kn8
$$ plain form
3976 24 82 -40 -40 11 4 8 -63 -3 67 -39 -30 9 -30 -43 6 -9 42 4 -8 17 -36 -9 -3 -26 22 -1 22 49 6 6 4 25 -22
4009 -22 26 56 1 -48 18 -24 -30 38 10 2 -55 -5 24 8 -34 -49 24 -17 -3 2 9 -63 -2 37 -3 -15 3 44 32 17 12 35 -63
4042 -63 -8 48 -6 18 -7 33 14 -25 30 43 -24 9 -20 68 -25 -72 51 43 -6 42 89 -1 -77 9 33 -11 -46 -77 34 13
4072 13 -13 1 11 -10 -10 14 47 22 -35 34 -3 8 -32 12 -59 -2 -24 58 -17 -39 44 -34 -42 -35 36 40 -13 10 -15 -35 6 -26
4104 -26 30 -73 32 15 -28 -32 -7 -25 -44 -20 -8 -13 -30 -16 20 -4 -55 -56 42 -1 -40 54 41 43 -2 50 4 1 -24 48 48 -19
4136 -19 -21 43 -30 -34 -14 20 12 -16 64 90 -53 -22 -39 10 -57 -14 -30 -42 -40 -23 42 -2 0 20 79 -32 -11 17 -52 -88 -8 15
4168 15 1 -13 43 29 -13 -71 31 47 -36 4 7 49 -51 16 -49 6 -71 -45 18 8 -17 40 32 7 14 -26 8 -12 20 22 -23
4199 -23 -32 -5 56 -11 -47 -35 17 -39 -3 11 30 -110 -31 1 29 21 6 62 -16 24 31 13 -5 -32 49 -4 -29 -21 47 -2 -4 -62
4231f2J18r4j5L4K6L9m5kQJ1j7oJ9J9k9L3p9N0J9m8k5L5K8q0M8J1M7j05J1P6j0
4262A5L2n4L1m7L2J2k9K1j6PKk1O2m9L4k2k6J3k3j6J2L1Pm6L8M1o0O0p8K5Nk0
4294b7L3J7j14R7l4L1n0N6J6Oq5O6ok2K5j2J9n7O0j8mJ7L8rm2JL2l9j6M3J5q2
4326d5P1k3Nkk8NJ6J0qK6k5ll1M7n8JM4j2J5LJ5m1L3J7J1l4rk0J09q5l2N9Oj0
4360B7k4J6k8mJ8J9J1l2J0j5Ll4P1J4m5k9M9l9j7k0L5K3o3N6J6k0k4K2O0n3l8
4391c5M1J0K3k4Qj1Jp6Q2Pj5rj6k2NQ0Mk9l8J0NlM3p6K4m8O1K3pn4M8m1M7k0R
4426Gm9K4K0Lqj7K4K4j0m8L5k3L5j9Q7p4j7kK6rj3K9l5k3N3k9K9n3MM0M0o7m3
4459e9O2n6j4K4K3j1K6k5K0J2J1l6K6nJ0jM0m4kJ3o6J08n7Om4Q2p0lK5LJk0K4
$$ plain form
4231 -62 56 -38 -53 -19 7 46 1 -1 7 18 1 -5 14 33 4 37 -42 8 27 -21 -46 -11 17 -63 -15 -4 43 -62 -51 25 15
4262 15 47 -7 24 -23 9 21 -8 13 -3 4 6 -15 47 -2 32 10 -16 -3 -26 -42 -30 1 8 -38 0 41 -19 41 -37 -12 -7 -27
4294 -27 6 23 -91 6 -28 3 -47 9 25 31 -54 12 6 -16 9 -3 16 -41 19 1 -3 14 52 43 1 2 34 -5 -21 22 37 -45
4326 -45 26 3 8 6 -22 -17 -1 9 1 27 2 -1 -32 15 -43 -42 2 -10 5 8 23 -18 15 32 43 9 0 -20 89 4 -28 31 37 27
4360 27 3 19 -9 -13 5 24 35 3 13 -2 1 -33 38 52 7 -22 27 -12 -29 -49 -14 9 -54 2 18 -2 -26 -4 56 3 -35
4391 -35 6 16 39 15 23 12 13 -63 19 26 11 2 -14 -36 -31 49 53 24 -14 -4 1 -2 41 -35 -11 -59 2 25 18 -36 12 -29 18 -2 7
4426 7 -42 -18 2 5 -3 -20 4 28 18 -30 5 -18 17 -2 85 11 -6 -8 18 9 -4 25 -10 -33 20 -9 20 -33 -29 11 51 -16 -59
4459 -59 3 -53 -67 -43 -20 -31 -5 -30 -10 2 13 -23 3 -2 8 7 47 3 1 14 -52 56 -1 5 -39 43 -27 -30 -5 -2 -1 -21 3
4492CJ0l4KK6L1o4m1J6M9J1o6J8N8m7K6k0K1k7J7K3k4k4N2kj8k9l0O2j4J9J2J1
4524B7m1M5pk3j6J2M2K0n4lN2n5n3N8Qm7mM1lL3n8Nj7L2k6K2M3n4J7n2O4j5kN6
4558D7l9pl9P1n6P3k8pJ4o3J6lM6j0Ol8M2lk5k7ML6p1N7K9n6M1p4L8N3n7k5K9
4591b6L6n9J6K3QK8Kl7J1l4O6j9k0J5j1k7lj0N2O7n5k4j1jK8J0n3nP0l5J9k9M8
4624D0K4j19PP4j4j7k3L2l3L1pNj4j9N4j5jk0J0L4l2K5k8LlJ9k6J8ol1O4n1j0
4657b9M2kn0N5qL9m3Ql2M0Mj1k3J4LJ2ml2k8K2k1K1k4M5j5M4j6p0M2J5L0o8M7
4690GL0m5L8K2l1j2L8l7m4J9mK5m7M8K6j3nLqJLl3L8j6qj5lM0j8o2R3m2J4PK9
4725C8l7l9M2RrJ8k3ooL0r4R9Qq0O0N5n2k8J4oM7q0L0jROL1p0K1j1Q6q3o%N5j7
$$ plain form
4492 3 13 -21 -19 7 38 -26 -67 -51 -2 9 -57 -39 19 -28 -2 -22 -1 -28 -11 12 -12 -36 16 14 -4 -33 -63 -1 -15 4 16 27
4524 27 -14 31 24 1 -15 -3 39 59 5 2 54 -1 -54 4 12 -35 -39 2 -1 32 -26 -21 -38 -6 -32 -10 33 -21 -4 -56 8 -7 -9 47
4558 47 8 1 -38 33 -23 50 22 15 29 -34 -18 -21 25 15 21 -17 25 22 -3 -30 -26 10 -61 -4 25 -31 10 -64 -26 27 -30 -55 -26
4591 -26 10 -49 -33 -10 -2 26 28 -9 2 -32 34 15 -5 10 -1 -28 -31 -41 11 78 23 -1 -12 -13 15 25 -28 -33 37 2 21 -8 40
4624 40 64 -55 -48 26 12 -5 -28 4 -29 2 -5 0 -14 -33 21 6 5 -15 -5 29 -3 22 -6 -3 -6 13 -13 5 -1 -32 32 -19 -29
4657 -29 13 11 -39 16 8 47 4 12 -20 20 24 13 -10 4 7 19 15 -17 -45 -23 -44 -23 -47 -2 -17 27 11 -59 -17 -2 28 -40 7
4690 7 37 -8 30 52 21 9 47 10 -34 -15 -19 6 -41 7 33 20 15 18 10 11 14 -19 19 3 -5 -20 -23 17 -1 -63 30 -12 2 9 38
4725 38 1 -38 4 13 4 22 -1 -7 -13 17 -77 22 30 -50 10 65 13 -15 -1 -7 40 -40 -10 -11 -2 4 35 -35 -14 -25 61 -22 -28 -28 27 10
4761A0q7Q7k5N7n4J6Oml3M6l9J3%K5o4M2j4N4p4N2M1m7j0L6J0p1L0O3j00M0M2
4792D8k1o9O1m5M7l3J3k1q5J03J1Mj0m8K5L5k8M0m3k9L7K9KK0mk7l1RJ7l4KRJ3
4825cj8J2J2K7L2l7j5m9L6l2L8k0K4K0o7L1L4r0J4O0Nm1M5k0M2r4J9J1lJ4%K1
4857Hj5l2P0m1K3k1J4m7J9J4J9PJk0k2N1l3jK8o0L2J1L5j1p2K7m5M7l0K3k3K1
4889b3M1k4J6j7j4M8m8j5M3JkM7n8J7j4kM1m5k1K4l8K7j3K4K6L2k1k3j2m0O8m9
4921b4J9l1L4K4l4L5k3L6L4n7Rk7j9Q3j55P7N7o5J0K7nJ0l8K6J6%k7Jj2M6QQp9
4954c6J7L4KLm5Oj0%Qj3KJ4oj2R9j16L3K7o3L6j4K6kqL3m1J6rlQ7n6l1N1n8pl3
4990f9R6o8%L2J6j0L7J1j5k8k0O2p9M8nk8kMNKJ8O4l5J4J1j3l7Ln0j3L6k8K0K0
$$ plain form
4761 10 -77 10 -15 42 -12 4 10 6 -27 19 -20 -7 -7 18 -46 -4 -18 36 -38 14 55 8 -2 34 44 -27 3 66 -34 6 48
4792 48 27 -42 19 -26 21 -12 1 -20 -105 -2 9 13 3 -45 -20 15 -13 27 -16 -45 -8 21 23 43 39 12 -19 -10 7 -27 -25 -16 -3
4825 -3 -21 -9 3 30 62 25 10 -39 -3 -35 3 -17 7 27 -40 -9 25 -65 -51 9 14 -27 18 -2 40 -54 -35 -24 -27 -13 -13 8
4857 8 -7 -39 31 -10 13 -8 6 -41 -22 -8 11 18 19 -1 -23 28 -5 -6 22 -38 -6 5 40 29 -43 -16 -61 -14 -44 -21 -44 -23
4889 -23 18 -6 10 -7 -21 27 -21 -36 7 8 6 53 -5 12 -2 -4 37 -8 -29 -5 -43 -16 -29 -5 21 53 32 9 -3 -43 25 -24
4921 -24 -5 -36 -2 22 -12 23 0 36 70 13 22 -5 -24 59 -96 -19 38 -27 -17 10 5 15 -23 3 19 19 -8 -7 -19 27 35 43 -36
4954 -36 -19 15 17 20 -25 -19 -29 -29 -21 -34 -32 -18 -24 -36 63 -53 -20 7 -56 -20 -34 -8 -10 -18 15 -26 -10 -19 -22 65 9 -22 29 -29 -36 -69
4990 -69 27 -41 -41 -9 7 -3 34 45 30 2 -18 44 -35 13 8 -20 -22 -18 -13 -11 7 71 36 50 61 48 11 14 -36 -49 -13 -41 -21 -1
5024ao6N4kRkj9J2N9l9o6Q9l0K1o5M6k1O4qL6k0j2k1j4j3KK6j4m9N6lk7k6J7L4
5058GJ0n7L4J3j1J3j7j6J0M0j0l1P7j13M9L3n1M1pk7L6m4J8lJ8j3j7J6k9P8Lq0
5090c0JM6n1K9N0m4J8m3MJ4m9J9N4q6N5L1Qm3J9J4n8N1k3K6J9rq4PM0M9n0N1r
5123B6l2M9ol3j0MKk3O3k1J2p7R1n1lM5j4pk6o6J05m1NM6q6O0k1k1J9j0m8O3J
5156eK1l1j4K5m4P7m4K9j3l1pK3L0o6K0lJ4M5L7p6mK8pj9J7LK0k1k5K8j9J4j9
5189a7l0L1M4l8O0p8K4k0j0J1N8m9jN3j26Q4M4l3n4pQO5j4j9M3k0Rm9L7N8q0K1
5221ERK0n8k1M3K0o3jJ3K4J6j4J2l7L7j1m1j5J2K8K2l7Q3j4k4K8n9M0m8J1K0l5
5253c5P4p8P2pl2P9r3M4k9mk9M8o8N1R6q4nk2N1n8j2P2j2o4lQm1Q1k7nJ0K3k6
$$ plain form
5024 -1 -67 -13 -15 -6 -8 -27 -15 44 5 -61 28 -2 19 -46 0 -21 43 35 71 51 39 18 4 -9 -7 19 5 -44 12 9 -18 -44 -27 7
5058 7 17 -40 -6 7 -4 9 -8 -24 -14 26 16 -15 62 -51 -2 31 -20 21 14 -13 23 -21 -3 -6 12 -1 -18 -2 -31 47 50 -30
5090 -30 -29 17 -34 -5 45 1 19 -24 -20 -6 -55 -36 18 -68 -13 18 26 -17 2 16 -42 9 -14 12 31 22 -62 -55 -15 34 -16 35 26
5123 26 -6 43 37 4 -6 -2 0 -23 40 19 31 -46 45 -6 -9 36 22 15 -11 -77 28 -13 -8 38 -48 12 -9 -30 -11 -21 -69 -6 -5
5156 -5 16 -15 -29 -4 -48 29 -15 14 1 -30 -37 -14 16 -50 -30 -33 -19 26 63 -13 -17 11 4 -15 2 5 25 4 -21 7 -12 2 -17
5189 -17 -47 -16 28 -10 50 -28 -4 -24 -34 -23 35 -14 -15 38 -88 -4 40 7 -47 -54 -46 19 5 -14 29 9 18 -31 6 64 -16 5
5221 5 14 34 -24 -45 -2 18 -45 -46 -33 -9 7 -7 5 -32 5 -6 -47 -62 -50 -22 0 -37 46 32 8 36 -23 17 -31 -20 0 -35
5253 -35 39 -39 33 26 -6 73 -20 24 -5 -9 -38 10 -58 -7 89 5 0 -22 29 -29 -41 31 19 -45 -48 -40 -81 0 -27 -32 -22 1 -25
5286b5J3Mnj0Pl6L3N5j4n9K3nL3Np9J06j00L3%N6K7p4KL8k2K2k3j9K7n0kj3M6
5319fM5l5Mn1N6l4%j2K7l7j0Q0k5J9J5k4L0o5K3l2O7j5p9M8r1Q6PJ1M5q9Q3o2
5351b1oL7J6l5L2Jj7J1l2nN3o3J7O1r2J8J7m7N1l6M4N0r1O1j5k3k9L7QK3k9Pm5
5384d2M5J0J4j7LJ7K9q0j0L0K1KJRo1L1J1J7j6K7n7j0R5r8jK8jk8P5n4k1M1K7
5417C7l4j4nN9l6l1nO3j7j6j5poL3K5p2n5R3J4Qol9J6j4JJ4NPj7KK8r7P4M2l8
5452cK1k3oM7lk1oJ3Om3N8n8M1J0n2L2j9n5P9Rn4K6L1j6ML8l1l0l2K8j2rM4K3
5486C7p8L0j1LL2J6l6Qm5O3oj8l3M3o%k1K4nk1L7K8n0l8O2O8j38K5Q2%l8J0L2
5519E6j5m7L3l3j0K8l2O9j9o6M5J8n8K5k3N7k3l1K1k4m5P0K6nL6pp5M2pL5n5j9
$$ plain form
5286 -25 -12 -8 -13 -23 -16 -52 -19 36 22 -37 -14 -19 14 19 -60 46 -54 -21 -21 35 62 -12 -10 28 6 28 5 -14 13 -37 -39 -52 -6
5319 -6 39 4 8 -43 13 -21 -21 -33 -6 -43 -53 27 2 21 36 12 42 -23 0 -32 35 20 -59 -11 -102 -16 -9 2 47 -42 41 -21
5351 -21 -27 10 26 -9 23 24 7 18 -14 -19 34 -29 -12 49 -43 -25 -8 -55 -4 -40 4 54 -37 24 9 -14 -43 -6 2 25 -4 3 -42
5384 -42 3 13 27 10 13 30 59 -21 -31 -1 20 22 23 32 -29 2 13 30 14 41 -16 -26 69 -29 -30 -2 -3 -31 44 -10 -31 10 37
5417 37 3 -11 -16 43 7 -24 -29 34 17 1 -14 -21 -27 6 31 -41 -96 -3 11 19 13 -26 -10 -24 -23 -9 -4 3 -14 -12 16 -81 -7 35 -3
5452 -3 18 -5 -11 36 33 12 6 19 25 -18 40 -18 23 33 -19 13 -6 -61 18 27 -27 -1 30 14 18 56 25 -5 -37 -9 -21 -30 14 37
5486 37 -41 -11 -22 -19 13 29 -7 1 -44 19 13 -5 -38 5 -1 -1 -22 2 -3 -24 13 41 -9 -47 15 83 -55 -30 52 52 14 24 56
5519 56 41 -6 27 -6 -16 12 -20 49 30 -36 9 27 -31 -6 -29 28 5 -26 -5 -29 -74 -4 22 17 53 46 -29 13 6 41 -14 -33
5551c3N4kpm1P0o6K4lM8p1L9oK7rm2Q9q6N6o1k9L1K2Kl8L1lL4n4L9j4jM9r4O4
5585A9q9O9p0M1O0l2p8L0N6j8M2j3l5o1O1O9m4Rk5Ok9L0k3K7J4n7N3K3l7Qk4q
5617b6n6J30m3Oj0n9j1R8p6oJ7K7J3k5o6P0L2%m0J1N2m9O2n6k3O3p0P4l8JpRK9
5650C3j5l1J4lp2K3K4Ql3M2j0k7O4k9k2J1K4M3n6J9P9l1r0LM9l7P2p4N0j0n0O5
5682C3l7J6l3l5OK2M1J3k3j4N2o3J7%J4j5K0k6KM6n3J2rN4j3o0J3K8n2J2N5k2
5714AjpO1q7j6L6J6j5l5MO3j5n9Q0l5K3l2K6K4o5L1k1N4l3j4J2j8O0nm2j4k8K3
5747b8R7p3k7J6RqM0k9j0n8M9m7L5K9J9l1l2O7Pj6nJ4m0N2l7N4n2J9L5j7k7LL9
5780D7n2Kj1M2n3L9n9P4j9o0Q4k5J8m1M8j0k0n7L2j0OMM6j0n6oQ9m1k6O0m8J8
$$ plain form
5551 -33 21 19 12 -29 41 -25 -1 -4 44 -27 12 6 33 24 -18 71 -15 41 -20 -49 -18 4 6 -32 -1 -4 30 -24 15 1 0 49 -45 19
5585 19 -70 -1 -71 -30 30 -2 -80 -50 6 -12 30 17 -18 -79 -18 51 7 16 -9 -3 -32 -2 -25 2 16 -41 12 35 -2 6 -18 -26
5617 -26 -82 48 5 11 1 -58 -69 29 -47 -53 -36 -9 4 -21 -87 -17 15 15 -25 -14 38 -11 51 -5 -28 35 -35 39 1 2 -5 4 33
5650 33 18 -13 1 -2 -74 -51 -27 -19 -52 -10 -20 -47 17 -12 -34 -23 1 44 -12 7 86 55 -35 -32 17 -20 52 -22 28 18 -32 33
5682 33 -4 12 -21 -56 -50 -28 13 26 3 -11 41 -22 -5 -5 9 -6 14 -12 -10 36 -17 -5 -14 40 27 -33 -20 8 -44 -32 23 1
5714 1 0 -7 54 -33 -49 -13 3 -12 -47 -43 20 5 -54 26 -9 14 -18 8 32 -33 -2 -23 31 -2 -16 -4 -22 38 33 -9 -23 -51 -28
5747 -28 69 -4 -31 -15 -6 -14 26 -3 -13 -71 -22 -69 -34 -5 14 -17 -49 18 25 9 4 18 -22 30 -7 47 -5 14 49 32 5 8 47
5780 47 -5 -3 -14 28 -25 14 -45 29 10 -50 34 9 27 -14 34 24 4 -53 -21 -31 -25 -21 25 15 -41 -47 42 1 -25 35 -13 5
5812Ej2Jl6M2J9m6L4J4K4kq0LL2KK9k1nn0L5J0M4o6m3P3J7n4L0N0p7j8J07q6k6
5845e1O1m9L2l6Q2l5n8O8qL4q1L5J4LK2K5q2LK0oM0k8o7J16o5qk5M2L9j7r5J03
5877B8k6K6n2L2j4j2M4o3N1l9M5j03R2L8o3K9l4N3o6%j3lN3MN5j13N7k4K9%K3
5908C4Kk1jL0l9k5k6M5K2l4O7lr2N0M6k6mn0K0Pl7M3J1m3L2J0j0l0J8mj6L2jj2
5942eK9k7j7l0K4O8k4Kn2J0K8M6n1k3J9j6J5pRl4LM8l8oj3K3J3J4l1J7J2K2q4
5975e6L4KMJ7Qml3P3m5LL8j06J18J1r0qj6M2M3k0j7k1K8J0l4k5L6NM1J3lo0qN6
6009C6n4k6M3r4P7j7M2L7p9O0l7M0p0M9l9J0l0P4M6n7p4J9Q5m3qj4J4J5K0L3k2
6040C6l3oJ8k3k3j6j8N3JL2m0kO8q3J1K7k7m4M4mR6l5l7Jk0J9lj6N6l7J9J3K2
$$ plain form
5812 5 -7 -6 -42 0 19 -27 7 21 45 43 -37 -34 -2 0 29 8 3 -47 -12 -2 42 -24 -67 6 23 -31 -1 49 -28 -46 61 -25 -51
5845 -51 10 -39 -7 -43 39 4 -54 14 6 40 -41 -6 8 11 33 58 -24 -21 -1 -7 33 5 -62 54 -11 -19 -44 -2 37 20 -75 28
5877 28 2 28 -24 8 -6 -18 26 -37 14 -25 20 -83 9 47 -16 13 -21 32 -34 -34 -47 -50 3 7 62 -51 6 -18 11 11 34
5908 34 36 15 14 44 5 -20 -46 -1 21 -13 54 51 -41 9 55 29 25 -25 -5 2 -35 8 19 -24 8 18 8 -22 -4 -8 -24 8 7 -5
5942 -5 24 -3 -20 -50 -26 42 18 20 -32 -22 6 52 1 -22 -3 -19 -4 -11 -2 -36 -33 15 -23 -29 -42 -19 -6 8 -23 -6 6 28 -56
5975 -56 -22 -20 -16 1 9 5 -28 45 0 3 41 -65 53 64 -26 -34 -50 -8 35 15 -2 -23 5 15 -19 -44 -8 -3 38 51 48 -12 -20 36
6009 36 -18 -44 -1 -95 -18 -35 7 44 -35 25 -12 28 -42 7 -32 -22 -52 22 68 11 -63 -44 41 -2 -10 -24 -10 5 25 58 36
6040 36 3 -3 15 -8 -31 -47 -65 -12 -11 21 -19 -21 47 -36 -25 2 -25 -69 -25 -29 67 32 -5 -4 -24 -5 -8 -24 32 -5 14 27 49
6073D9k3n2L9k7J10r9j2M2MK2Qk2o3L4K7j02mP5J2l1QNqLk8Q4Jkl8j7LK3j4L0
6107C7j7oJ0j7LJ3o2J6ON6k0n5N7n3R3k7p5P8k0n4L0k4K1k8M5Nm2M3Jj0k6jNQ0
6141F2l8l2kj4L2l6M2J0m8O8J9q2K7om4P5k5pj8rO5l2l3J2J1k0J1OM4l7m0J6L4
6174A1l5LK1qk5Q2q7M3l5L1J9mj1l0L6j9k9M1n5J2N5LJ9q6N6jL0q7Q7j9K9r1J03
6207E9l4n2M2j4o7N7K7n5P1k0k0j5P5l2Oq6K3O9p4L7k0J2Ok4K8K5n3K0N6n4lK9
6239A9k5j4K0nL9m7O3n2L2k6m5J01j8n9KJO6m8k8L6m2O4q4M3M0pJ7k6qm8Q9j1
6271C9q2LN2O3o8l6PO1k6k3N5n2L8l4N3J7n0Pk3j0M7k8j5K1o0Q6p1K1O1l5l4M9
6303C3k0QjNl3pkKK5l5PjK6K7m3l3M1l3L9QKo6J09m5n3L9n4O1PRM1p2O7j16Q3
$$ plain form
6073 49 26 -26 13 -14 96 -3 -15 27 31 53 61 39 -24 10 37 -65 -69 6 18 -13 -5 0 -8 -5 -33 51 52 50 12 -5 -2 21 7 37
6107 37 20 14 24 7 10 23 -39 -23 -17 39 19 -36 21 -32 61 34 -41 37 17 -37 -7 -31 -10 -38 7 12 -30 13 14 4 -22 -23 -18 62
6141 62 24 -8 -10 -24 8 -28 14 24 -24 44 63 -19 8 2 -42 33 8 1 -17 -26 39 7 -26 -14 -3 -23 -12 -6 38 1 -39 -23 11
6174 11 -24 -21 0 -8 -33 49 -38 5 -30 1 20 16 5 -25 11 -8 -37 4 -51 -39 16 19 38 -48 8 7 37 -50 37 18 47 -44 59
6207 59 25 -27 15 1 -66 -9 18 -37 34 14 -6 -21 54 22 28 -58 -35 34 -40 -3 -23 -11 -5 -29 -1 24 -29 -9 47 -7 -10 19
6239 19 -6 -20 0 -5 34 -13 50 -2 30 4 -41 60 42 -17 -15 -14 52 4 -24 12 -30 34 -50 -7 33 26 43 17 9 -39 50 39
6271 39 -43 -40 12 75 7 -29 -22 39 13 -10 45 -7 31 -3 50 67 17 24 1 -9 38 10 -5 16 -44 42 -29 -8 53 18 -16 33
6303 33 13 21 20 25 -8 -15 -17 -15 10 -25 -18 -19 7 34 -9 -42 -1 -34 5 13 15 -51 58 13 -40 -1 -55 6 13 22 63 -9 58 -58 25
6338B5n3pJ3jj2J22o4k2J7n2k4P3Qjoj9K5o8K1J9%J7l7RN8l5J6Kn7Q3j0r1mM7
6372hQ0q4J2kRJ5j2J7l1%L2rk1K6L8p0mP0o3J3l0M3l9L2o7P6MK5nm2j0l4K7Kk8
6407c8L3j8R3k2l7L1o3j1pL5j1K7L1k1k0j0RpP4jj09K8m6K2L4M0m7M5ro0L0j7
6439b2J0J5p0J14l4j5k6L9Kn4mO7j9k7JN7n9MM1moM8n9K3Mj3J9j8Pn4K8j5N7R
6473D6m8K2K3m6l1J8j0PlM8k6k8rPM6j1mj8K2k0K1NJ7p3J6O2l3K8koml9P1j4l4
6508@k3L6J7k7mJ5o7P1k0k7M7kj5qj6J8JJ6m1L1p3O8L5r3P4J1j0m2M5K9l9M0l3
6541A4qm8M9J5OL1o8M1j2Ll4M4o5R8k7m1J8m9R7n4j9j4QJ1J2j0j4K3m8K9Jk7m
6574d2L7L2m6M6l9j9pO2K6o3M0n0Q8p8L5m9J3j0NK2K1j5j2L2l7K7J6nj2pJ2k1
$$ plain form
6338 25 -28 -35 -22 -23 -35 87 23 1 18 -34 -58 15 23 22 16 -3 22 -46 -25 -6 -6 11 -26 -17 41 6 22 24 -33 50 40 -51 -55 -8
6372 -8 72 -12 0 -2 7 22 10 27 -4 -4 28 19 -2 24 62 -8 -12 58 -5 8 -22 21 -18 14 -53 23 27 52 47 5 -5 -39 -12 -10 -38
6407 -38 -5 -23 70 48 11 42 -21 -32 -39 -4 -15 12 43 22 2 -8 1 -6 68 67 -42 -14 -60 -38 -4 36 -11 34 25 -35 -5 -22
6439 -22 -12 3 -67 47 13 -2 -28 11 13 -41 -45 22 3 -24 -23 34 -25 -21 20 16 10 58 -1 22 26 13 32 14 21 -33 -5 -20 37 46
6473 46 -2 20 43 -3 -34 -16 -26 -19 -22 26 0 -28 -37 -30 16 5 1 -17 5 -15 6 11 28 -45 -29 33 0 28 26 20 16 -23 48 34 0
6508 0 -23 13 30 3 -1 14 -53 18 -2 -29 18 16 1 -7 -23 -5 -4 12 -29 2 -71 -3 32 -61 13 24 14 -28 17 46 7 47 14
6541 14 6 -42 7 22 28 59 -9 32 20 23 -11 33 -32 66 39 -2 16 -33 64 10 -9 -23 -15 -4 8 -2 -16 7 -41 -12 -11 -38 -42
6574 -42 -5 27 -19 27 -12 -31 -38 24 50 -13 27 -23 65 -13 22 -27 -14 -24 -19 3 24 9 -3 29 -8 19 35 30 18 11 23 2
6606BL0Omo9K8jJ0Qj0m7K4N2jNo3j0jL0NJk3M1n1P1L6r1M2Qok3mK8NJ7m1Mk4L
6644a3K9Lj9Jj4P9q8J8K2q2N7J9J0l1Pk7k1K1L9Oo0P3mj7k7J9o3P4L8l9l7L6J7
6677B6j4J4l1k1K1J2L7o7K1oj3%L8j8mL5j1l0nm4M3K1NRJ0k0m2O8p3j1K9RP2o4
6711dM0pp2M6npl6OO6j0m0L9k5J8k3j6P7k0o6O1oj6J2l8l8L1PLO7l7m8K7j4ll0
6746f1K7K8l%MK3qj6rKJ0J2j2k1O7k8m5P4o3K1J8l7J7Rk7j7L7K5l4Q2q1l7K6K6
6780Ijl4mK4j9j6JM6l4P1j00N2m1K7J6rJ6Rk0O0p7J1L3j9l2L9K9r7O3j8%L6j9
6813BRl7O6l3J9j05P4N4k2l6M3q0O5m5K9PRj5k8L4K2k7J7Rom8j2Q7j7n8P0l1n8
6846d2P6L2n3Ol7kL7m0ON2j4l3M0j2j5L7k0K0m7ppL5k4K0No9P7n4M8p0R4o4m1
$$ plain form
6606 2 32 38 34 -35 -7 -8 2 10 0 -47 -23 29 28 33 -30 -40 -41 -11 -6 -5 -28 13 -38 33 69 -22 20 28 22 -1 -5 23 28 45 4 8 -16 -13
6644 -13 16 19 0 1 -13 66 -22 -4 18 -64 -7 12 22 -9 -2 -29 -50 -29 10 16 -44 29 25 8 -19 0 -63 11 49 10 -27 9 26
6677 26 12 26 -5 -26 -5 7 44 -23 -2 -8 -21 -21 17 -1 -5 30 19 -11 -16 -60 -17 4 9 18 28 8 -34 34 -39 -50 -21 -12 60 -4
6711 -4 36 29 -43 3 -2 -9 -45 -39 27 17 -23 16 -9 9 -14 -30 47 27 -39 22 16 0 12 -26 -64 -33 -26 -23 44 7 -41 -14 -28 -31 -61
6746 -61 -34 -6 -9 -9 -5 18 10 -6 -15 -13 -3 9 -3 -24 43 15 -30 44 -19 2 20 -17 0 9 -18 -35 2 27 -7 75 -6 -43 -17 9
6780 9 8 -26 -30 -6 -25 -41 -40 6 -28 43 -57 -5 -46 -19 -3 -12 4 13 -7 53 -24 -13 20 1 -31 8 37 -60 3 -15 -15 21 2
6813 2 11 -26 40 7 26 -79 -5 49 27 -9 34 -46 19 -26 3 10 19 4 -24 10 32 5 22 31 25 -23 -35 52 35 -23 47 16 -42
6846 -42 34 66 13 19 -18 -20 17 -23 -17 35 21 -12 28 16 1 38 18 38 -9 -16 -23 12 -12 8 13 -56 21 -33 15 -55 39 -25 -66
6879f6J8L9Qj6L0J7j1j5M4L4Jn9jl7j0K2j3N6m8jJ2J2n3Q2n5j0PRJ8n1R7k6o7
6912c3P0Po0K1j5L6k9j9rJ3M4k8p9N1M7N5n0k6N9n7J8jj4Qm5Q9o3L1j1j2l5J4
6944b3j3j0j2L4K9J3j3K9l5k3PM1ok1k2K9m2l0M3P0j5o3kO0Rp8Q1l1j2j1J0M9
6976D2k4m0M0PK0m2K4k5nJJ1k7L0m4M7m9R3n7rK7k8j3L5n2J4M4m2K7ll1j0M1N3
7009E5Npr3k5MM6J9j0l5P0oJ0l2mL9p3J0N5k6k1J3k5K8j4O3nl2l5J4M0k9mm5Q
7043d2P6l3L9m6k3N6k0j4k5N4Nj5K5j1p0M8qK8lQo4P1K6o4O6l2n9M2k7MK1rK1
7076B5k8j8M0j4J9j6L6l1L8n3N0m1m4j4J14r5K7J0kj3k5N1mq8P8L7k8k7q0Q8N5
7107D7n9L6N1q5Mj8Mj8M7m0L8k5oM0j8M1o8O3j8Jj0n5M7k7OK1K2L3k5n2K3J8k8
$$ plain form
6879 -66 -48 -9 -1 -17 13 30 19 4 48 82 83 24 23 -14 -24 -2 -15 41 -7 -8 4 16 -37 45 -10 -20 -13 -4 14 -37 60 34 -33
6912 -33 37 44 -16 5 -10 26 -3 -22 -31 -18 26 -2 -81 -30 17 72 22 -4 55 -2 16 15 1 9 -36 53 -10 21 10 -2 -37 -23
6944 -23 -36 -46 -58 -24 5 18 5 34 -1 -24 -17 24 18 -3 -25 4 -38 -68 -25 45 30 -33 -35 25 34 -44 37 6 -6 -17 -7 42
6976 42 18 -22 18 25 45 3 27 2 -3 -2 9 -18 12 -32 15 -34 59 2 -7 20 -8 -21 14 -38 -24 20 -22 5 2 -29 -39 2 55
7009 55 60 53 -40 -65 -61 -15 4 -6 -41 29 23 33 1 -3 36 -37 -27 28 2 -19 -6 -31 -3 -17 46 41 9 -26 -12 28 -1 -5 -50 -42
7043 -42 34 1 40 -6 -29 27 7 -7 -32 22 27 12 37 26 -44 4 -4 24 21 29 -35 36 62 -2 64 32 -27 15 -12 -8 13 4 25
7076 25 -3 -21 19 5 24 8 44 13 51 -2 48 7 -37 -51 63 -32 -5 5 3 -10 -35 16 12 -76 2 39 11 -16 -96 -8 47
7107 47 -12 24 75 -10 -6 -24 -20 -38 9 -31 7 -18 -24 16 -2 39 -29 34 16 17 7 -48 -1 -28 -22 -1 21 54 29 -23 0 18 -10
7140a0k8J1L6j5k6L1J9l6L9o6R5k8J7k5K5m7J7M6j6l4J5LQ9r3k8L2k9K4rJ6m8
7171b3K9OL1l5k1K0k1pk8l0O5K0j3K0J4n3K3M3J4J7o7j1j5j1M0L7j6n4L3KL1n
7203C5j0l7k8N6L3n6QNn0L5L4j8Ll7J0Ko1Q8jNK0l2L2l0q3P9qN6p5K3J8l6L7%
7237A7OJ3l5k0N6n2J1K4l7J4k0NM6o%k7J8l3K2P2j19L2j0O7o1k8L3J8j9KK7Ko0
7270d2J1O6l8j6%L5o2N2L2j5K5j2l3J1J4j5j8jmJ5N8n4J7l9j7L1L1m3K3M4r7K0
7302b1K5j0K9Ll0l0K4K5qn7Q9Km2L1n5%l6P0J1O0j14Q4o4J1M7mj1m8N5o7L3k3
7334b1N2q2L7K8nL1n0J1ml9M8J2K8m9nL1k3m4M4L8J1n7K4rj9K6Pj3m6P7o5J9L8
7367C1k9j5kN1l4MoN8k8Mk2l8NJ8JJ0M4q1L1k8M0J2m9Om6J05k2J1m7K7j0onk3
$$ plain form
7140 -10 -38 -27 9 -6 -32 -1 18 -18 21 -45 50 22 39 14 39 -8 9 55 39 5 20 23 112 19 -9 23 -6 18 9 25 -23
7171 -23 6 12 43 8 -13 7 -14 -21 -49 -79 -14 6 -7 13 27 -26 -3 40 54 71 4 -7 -22 -33 7 44 28 -26 7 9 40 35
7203 35 25 -12 -40 16 49 -7 1 6 -44 -9 25 7 10 -27 -17 -15 -76 12 11 16 36 4 36 6 -77 2 -6 50 -25 -2 16 -20 17 17
7237 17 23 36 1 -19 37 -15 -4 20 -17 -3 -23 -18 28 22 22 -5 13 -20 2 74 -45 -13 -23 44 -17 -45 -12 6 -13 -11 16 18 -42
7270 -42 -31 35 -3 -19 -19 16 -46 6 38 23 48 36 3 14 28 13 -5 -6 -10 5 63 9 26 -13 -30 1 32 -11 12 56 -41 -21
7302 -21 4 -6 23 26 -4 -34 -10 15 7 -50 39 41 -1 30 -25 -25 -61 9 20 80 -34 50 -14 -3 44 40 29 -19 36 -31 2 -21
7334 -21 31 -51 -14 14 9 40 -10 1 -3 -42 6 18 46 -3 -8 23 0 -44 0 38 49 -8 16 7 -12 14 21 8 -38 39 -26 -7 31
7367 31 2 -13 -15 36 2 6 0 58 30 34 12 -26 -21 -3 -2 8 52 -29 2 -26 14 26 -23 -17 -63 42 20 31 -16 11 1 -5 -10 -33
7401c3O5J5m8O8l1k8k7N4Ln2J3K0n8L2M1m4%N5p4O6o0P6n4J9Pm8J9K6j3PM5n7
7433Dk8K7l5N4J2k2K6m4pk1m2M0K9k2Q4l1J8p0K1M0j9m7N4k9J7kJk6N7n8LM5m0
7466a1nN9k0j4o1OJ00q3K9k5Pl8L6J1J3qj7Q0k5n0O4k6n1M5k2Q0m9l9O9j0n6K7
7498A6n9P4L1o1k3J06p0l9M8p7O6PJ2k7j6jP2o4k1P5o3l2KN5n7L9RK3Jm3P0q6
7530c3N2K8j2m9J5M0l9j4J3jK6J4l3l3LmpP7K3k7p2R1o6qRPj7K5lO0o5j0O3l0
7564B3n3N8l2kL0L1r7K0j3M7J8k6Jj0k6M3N1j6m8n1L8K3l5P5Kp8K2L3l8m0N0l0
7596c0M0l8JJ8O2j04L1qPJ1o2N7K0m9J9L4l0L1m0J1L3n5O1j3M2j6om8L6k3qJr
7629b4P2m9K3o8Q2n6KN1Mo7J7j1N8K9j6m4Lpm5J08m8n0PN1j2%j0Nl9L0K6l1k4
$$ plain form
7401 -33 32 47 -1 67 36 8 -19 35 38 -14 -1 19 -39 -7 34 -10 -10 45 -29 37 -23 53 -1 18 25 -23 -4 22 9 16 61 4
7433 4 -24 3 -32 22 34 12 38 -6 -13 -34 -76 -36 -7 -29 55 24 42 -28 -7 33 14 -33 21 -8 9 7 8 -18 39 -19 -16 29 -11
7466 -11 -16 43 23 9 -52 -46 54 -29 0 -25 -18 -56 -20 -9 4 -4 -21 59 34 -16 48 22 -29 16 -6 74 25 -14 55 45 -11 16
7498 16 -43 31 62 1 -22 84 14 -25 23 -54 12 19 31 4 -12 -13 59 -5 -26 49 -14 -46 -44 11 -46 -7 2 25 26 -17 53 -33
7530 -33 19 47 35 -14 1 41 2 -12 1 0 26 40 7 -26 -23 -27 -34 43 66 39 -33 58 -8 -16 -7 0 -17 8 5 65 0 -10 53 23
7564 23 -30 28 -4 -6 24 55 -42 -22 -35 12 30 4 5 -5 -31 12 63 47 -1 -52 -14 9 -26 49 51 -27 -5 28 -10 -50 0 -30
7596 -30 10 -28 -27 -9 53 -51 -20 -28 -21 -10 -72 -15 5 -44 -25 9 -21 10 -30 -19 14 -41 20 7 49 33 27 -21 15 -8 -16 -15 -24
7629 -24 48 -1 22 -46 36 -20 -18 33 37 -30 -13 -24 34 63 47 3 6 -1 -46 62 14 -36 -29 22 10 10 0 5 -34 -4 22 -9 -33
7662c3O1l4J3oL7m6KL3m5K2L6m8J01q1qqK1j3k0L2Lpm5L8J7l8j5N9J1p6M8m1P2
7695D2n0L5NJ1lq1J27r9jQM5m3j5J0N3LO%m7k1p5J30m8K4M3o1Ok6J6j3J6K9j0
7728A6Kn7O7j4oLj3L8o5j7J05k6PRk5l1n5O7jM0n4M8m4Lj2J3M1k2n6M0J8o1K4
7761a8Om3N3K6n7P9M9j13K9l2mRL0o8lP1j0j9R6o8m0N3j7m4O6J7J6q3Ro3J05%
7793C2k7K3nn4pN1%nL1J6l4J9n5K8m1J3k2lL1J6Lk4JP%JLm2N5k7j6L5J2n2M5J6
7829B4j8pL2m6L1Jn4K5n3P7O4j34P1j7j1k2M2K8M4o2k3K7j4l9OL4J2l5K6rl5j6
7861e1K9K8j9k3J0k8Q7n2M0j1k9M0L7km7n5J7J8J2K0j8%k7M7l9J6K0J8j0o7M6
7892GJ7J4m7M7l4k0K6o1J00r6M2l3N3j6j5QJ1k2K3L3m5r2R0J2k3kO0j11Q8M4n8
$$ plain form
7662 -33 28 -6 7 1 38 -8 -6 27 -18 4 40 -8 93 12 4 -4 17 4 -16 16 19 12 -33 5 22 -16 -31 28 39 -37 11 -30 42
7695 42 -8 27 32 43 40 -41 86 -13 -14 -6 39 -4 -19 -9 44 47 53 53 6 -15 -90 40 -8 16 59 -2 4 -22 -6 -19 -3 26 16
7728 16 18 -39 28 14 8 11 -2 36 -29 -46 59 33 40 49 24 -7 -62 5 4 44 -10 38 -6 -3 -15 -2 39 17 -39 1 19 -42 -18
7761 -18 -12 -55 -2 24 -33 46 95 -18 11 -21 -25 -16 14 -54 -57 14 4 -15 81 13 -27 26 9 -35 31 48 64 -19 -10 -73 32 32
7793 32 5 28 23 -31 -38 13 13 8 39 55 21 40 -15 13 -28 -15 -37 -40 -9 7 10 -14 -13 -6 -6 -5 -2 -44 11 -16 -32 3 15 -37 8 24
7829 24 6 -1 31 -15 16 17 -37 -12 -65 12 76 -58 13 -4 -15 -37 5 33 77 15 -8 19 5 -34 -28 6 18 -17 9 0 -35 -51
7861 -51 -22 6 -13 -36 -26 -54 33 -19 21 10 -19 21 58 56 9 -46 -29 -11 1 21 3 3 -24 23 -16 0 20 38 28 -39 7
7892 7 24 38 -9 38 4 -16 10 -51 49 -47 -5 -38 15 -1 -16 -8 3 -19 4 37 -8 -100 -10 2 -21 -23 37 -74 14 58 0
7923@j6K8L8j8l2j3O5r3K0M7j6LNm3k2k0N9O8j8Jk0l3K5rJ4l0l0O3m8O3l1l0P1
7956D8m5m6j4O3j8j1P4m9J7n6N3l3P0o7N1j5j9OM9n9kpPL5o5M5j1Kk4MlRRM4l9
7991CRk0%j2K8m3R4q1O6n9k1M3p6J14p3L1j7l2O1m4N7k6q2J33o3M3l0%k7K8J8
8022B2l0K6J2n5K7j9KQ7j05K8k4KL3nj5Jj7L7l3O3l9l5P8pm8qO4l6mnl1L1K8k6
8056aqk2Pl9J8J5j0J4Q3j0n3K1jK6k5k1j9K9J8m7l2O9mmr4J04j6pL0m6%J2KK8
8090A7p%j0Jk8%L6J5N5j02N6l1mpj1j5oQJ3J9l8M2lmK3m2K9L5l6l6K3j8P8o0J3
8125EL6m6J2j3k9j2J6K1M3m4K3M4n5k7J3%l4L4m2R7n4lK8L7k3np3P3n2M2Ll9l
8158b7J4ml1J4N3l2L2k5l9MO5n3j1J0L7l4P9l3K1n8PqJ2L2j7lolJK4k1J1l3
$$ plain form
7923 0 -16 12 50 32 0 -13 52 -41 -21 26 10 13 18 -25 -47 -67 -8 60 42 43 23 -10 15 6 20 -10 -40 23 -25 38 7 -23 48
7956 48 3 -43 -57 6 -12 -23 51 2 19 -37 16 -17 53 -14 37 22 3 9 58 -1 -3 -10 -3 32 -33 12 1 3 -21 -17 -20 -11 -2 42 3
7991 3 12 -8 -8 -20 8 -35 59 -22 44 -15 -36 7 -69 45 -28 3 -14 -46 15 -29 28 2 -80 53 -10 33 3 3 -24 4 22
8022 22 -8 18 30 -25 2 -17 -15 72 -33 -5 -29 -27 6 1 -14 -13 -30 7 -26 37 -2 -37 41 34 -14 -22 42 6 2 -3 -34 -3 25 -1
8056 -1 -9 -31 -24 -63 -45 -30 -40 -26 57 47 -6 15 14 40 15 -6 -25 4 22 -25 -57 12 8 4 -90 14 -2 -9 21 -25 -25 -13 -11 17
8090 17 10 10 0 1 -27 -27 9 24 79 -23 33 2 -2 -9 -20 -35 -41 -33 -20 -1 -39 3 0 -4 19 -23 6 41 5 -31 -8 -26 52 -8 5
8125 5 41 -5 7 -6 -35 -47 -31 -10 33 -11 12 56 1 -26 -13 -13 -47 -13 -55 42 -12 -15 13 50 27 22 -51 22 -30 12 15 -24 -27
8158 -27 -13 -17 -48 -34 19 -13 19 -6 -45 -41 24 -29 -40 -30 7 -27 52 19 40 -18 -11 -19 -7 25 8 5 -1 -4 -3 21 0 11 -22
8191b2
$$ Imaginary data points
##PAGE= N=2
##DATA TABLE= (X++(I..I)), XYDATA
0@%%%%%%%%%%%%%%%%%%mJ1j3J4j6J6j6J6k2K9l1L6m0M3n1N6o3P1p9Q7r5J09j20
41f2J32j47J61j77J94k12K34k59K86l13L43l80M21m67N20n82O54p41Q46r76J145
62F20j368J677k130K843m094O704j4122P2444K95779q3116j49529r588j77717
75f1597k61997K2400K10032J38120J02783J03198j7842j62431j98477j22342K652
86b45501J03488J63409J71827O7036q0452j27436j29953j51918m7718J55877J93565
97G2224Q3535N2155J8121j49105k30772q6227N6828P7077J11878J60120Q6590
108B52424o8184j58148j47204q2653q13Q7442J57600J45226L6030p5029j22458
119B4233j33099r5783J3772J10726J25813J07220O0968n7564j55970j21433l9278
$$ plain form
0 0 0 0 0 0 0 0 0 0 0 0 0 0 0 0 0 0 0 0 -4 7 -6 8 -8 8 -8 8 -14 15 -16 20 -20 23 -28 28 -35 36 -43 44 -51 58 -62
41 -62 70 -77 84 -93 101 -111 123 -136 150 -163 180 -200 221 -246 274 -308 346 -395 451 -525 620
62 620 -748 929 -1201 1642 -2452 4252 -9870 62574 358353 275237 125708 116120 -61597
75 -61597 -323594 -301194 -91162 46958 149741 252939 235097 72666 -125811 -248153 -245501
86 -245501 -142013 21396 193223 260259 179807 52371 -77582 -229500 -277218 -121341 72224
97 72224 155759 207914 226035 76930 -153842 -240069 -183241 -106164 5714 165834 252424
108 252424 184240 26092 -121112 -203765 -204578 -117136 40464 185690 221720 146691 24233
119 24233 -108866 -204649 -190877 -80151 45662 152882 213850 156286 316 -121117 -160395
130a60395m837N8176J53171J33363N690p0481q4738j13015j02434r71J08343J40380
142F2252R5341J6727m9132r9996j34955q6509M0518J09949R3278Q5203N2944o2678
154A22942j37301r4752m2194l666Q3721J40507Q2889k170m8656r3272j15171o0344
166a67467L2917R4089J00340O7332K0722m0149j08400j14911l4398L9070O0429
177e0426Q9088J01540K1384q1121r7849o9972n2885K468R2150J17370O1369j137
189A31979m7262r1345r9069m1642L7923Q2813Q5597O2805J4053n6428j01647p9684
201a01907k1861K2028O4137J00933P0745j4577o2443o5491p6001n4379L3128R5939
213i749P5337L8694J5143m2194j01338q2556j1027L4992N6421P8918O8410L53
$$ plain form
130 -160395 -165232 -107056 46115 179478 185168 114687 29949 -83066 -185500 -186471 -78128 62252
142 62252 157593 174320 125188 25192 -109763 -196272 -155754 -45805 47473 132676 185620 122942
154 122942 -14359 -109111 -151305 -154971 -71250 69257 152146 149976 101320 8048 -107123 -167467
166 -167467 -134550 -40461 59879 127211 147933 107784 -616 -115527 -149925 -110855 -50426
177 -50426 38662 140202 161586 80465 -17384 -87356 -140241 -137773 -45623 71747 133116 131979
189 131979 84717 -6628 -105697 -147339 -109416 -26603 58994 121799 135852 79424 -22223 -101907
201 -101907 -123768 -101740 -37603 63330 134075 119498 57055 -8436 -84437 -138816 -105688 -9749
213 -9749 65588 104282 119425 77231 -24107 -106663 -117690 -82698 -26277 52641 121051 121404
225A21404p0259q2285n3970k7518J3375P8577R7738L7330k1973l8452o6730q7225
237i9988k6792N6614O9002N2901N2458J0196o7937q8277m5662r389J7784O1589
249a7501Q4679M5435k1784n5734n7781n8281l3917L6572Q5492O0794K0206K697
261I0877l8539q8111o5003O579L8146M4567O7632N5005j8649p0235n8399l7655
273g3785k3079K4333P6738O9679J8141j7820l7366o3585o4214q949N1291N9196
285A0580M3489L5840K2o2574p5962l0684J848J7596N6472P5326K5735l3300m5261
298A9127m6183n1903j7140M6317O8156M2330J7577m271m5245p2091m3265J0271
310g6320L6510M3739N3411L5618k2655o2320m8982k5926j2536K6199O9232N5103
$$ plain form
225 121404 51145 -31140 -85110 -112628 -99253 -20676 77062 114392 92419 53967 -12763 -99988
237 -99988 -126780 -70166 -1164 51737 104195 114391 46454 -41823 -87485 -96874 -79090 -17501
249 -17501 67178 112613 90829 35095 -22686 -80967 -114884 -78312 7180 67974 88180 90877
261 90877 52338 -35773 -100776 -94197 -56051 -11484 56148 111153 92504 22269 -36130 -73785
273 -73785 -96864 -72531 4207 73886 92027 74207 36841 -26744 -90958 -99907 -48616 10580
285 10580 54069 89909 89931 27357 -48605 -79289 -77441 -59845 -3373 71953 97688 64388 19127
298 19127 -27056 -78959 -96099 -49782 18374 60704 78281 74010 28765 -43326 -86591 -76320
310 -76320 -39810 3929 57340 92958 70303 7983 -40999 -66925 -79461 -53262 15970 71073
322G1073M966k0198l3627n7477m8672O013M6370M6616L8882K5749j3875n5767
334A0053n7267k4623N654K6871N0133N4464J6198l1756m4652l9044l5851p208
346g7028M4048N9694L1505P965r406m3602o0227k8002J5625L3185L9844M3396
358E6997K0216k6063n2789m1563j8751oK8219N5411M3705M99k6393l2974m3097
371c6589l5493Q658M5419M1819K6810J5031j5801n0889m7082j3855J0367K5781
383b5824M4387M2646N923l1885l9412l2311k4788P43M0366N1512K4214k053j4411
396C9107l5356m9704k2367K2196L5563K9611L0765J5053k7537m9721l0992q642
408e2024L558K7333M8118L1676n982k5042k9754l5716k4325J3727M1130L4271
$$ plain form
322 71073 76039 55841 22214 -35263 -83935 -77922 -31552 15064 53946 79695 65820 10053
334 10053 -47214 -71837 -66183 -39312 10821 65285 81483 49727 5075 -33969 -69820 -77028
346 -77028 -32980 26714 58219 66184 56778 13176 -47051 -75053 -59428 -26243 13601 56997
358 56997 77213 51150 -1639 -43202 -61953 -61959 -33740 21671 65376 65875 39482 6508 -36589
371 -36589 -72082 -63424 -18005 23814 50624 65655 49854 -1035 -48117 -61972 -51605 -25824
383 -25824 18563 61209 67132 35247 -4165 -36476 -61264 -60521 -20155 31357 55571 53518 39107
396 39107 3751 -45953 -68320 -46124 -10561 19050 49815 64868 37331 -12390 -43382 -52024
408 -52024 -48466 -21133 26985 58661 52679 27637 -2117 -37833 -62158 -48431 -7301 26970
420B6970J8865Q661j6884m6995l9656l695J5558K0960L7581L7884k227l7494l2508
433a2980k0399j9578L223M1582M4725J2730p911j4188l1527m0913j2858K5155
445c2939L2006K2836K2663Q839k8432m3690k1265k858L706K6674M4532K1081j3732
458C9421k1195k3042l2818j9235K0362L9661K4894J1570O670j7740m5615l2434
470d9501N577J8620J7819L1159K9998p542l6690k7954j4447j1556P829L7069L5270
483C5651P277r408j5927k9507l0132l090K1676K4168K2665K0096j523k9285l1709
496a9048j4992n059O340L0405L7275R941j4899j6527k2197l1298r989K6717L2912
509I581J6866J0732K546k4415l9340j8452Q246J4775J8936K8756J7871j3839k9441
$$ plain form
420 26970 45835 54496 37612 -9383 -49039 -52734 -37176 -16216 21365 59249 57022 19528 -12980
433 -12980 -33379 -52957 -49734 -8152 36573 49303 41392 27204 -4323 -45236 -58094 -32939
445 -32939 -933 21903 44566 53405 24973 -18717 -39982 -42840 -39134 -12460 32072 53153 39421
458 39421 18226 -4816 -37634 -56869 -36507 3154 28048 39618 46288 28548 -17067 -49501
470 -49501 -43924 -25304 -7485 23674 53672 46130 9440 -18514 -32961 -44517 -36688 381 35651
483 35651 42928 33520 17593 -11914 -42046 -45136 -23460 708 23373 43469 41946 12661 -19048
496 -19048 -34040 -39099 -32759 -2354 34921 44862 29963 13436 -8761 -40059 -50048 -23331 9581
509 9581 26447 37179 39725 15310 -24030 -42482 -34236 -19461 -525 28231 46102 32263 2822
522B822k0991j3546p148J4397L3010K3648J964p446j4473k7688k4040K934K1413
535a5144J9233J8204J7276m058k9893k8526r623O71Q658K5374L0978R074j7421
548B4803k2598j7980j7705o188K0972L2997J7070J33o321j8060k8702j6310Q052
561b9837J8385J8991J9366R092j2200k3898j9020j0541r35J4882K5960J8295J656
574C0196q552j5638k3283j8145L847K1270K0472J3739Q896n503k5747k6581o860
587c1889O868J1318K1078K3813M114j7257k0597j6884j1969K532K0103K3370J2685
600B7285K60r104j8493k2051r347R659J5569J4128J6602Q377j5570k4621j1020
613a8326l759m307J1782K8964J6200o831r856r876k1444j7937R013K4483J6056
$$ plain form
522 2822 -18169 -31715 -38863 -24466 8544 32192 34156 26710 12237 -15451 -39491 -36557 -15144
535 -15144 4089 22293 39569 35511 5618 -22908 -32531 -31860 -23202 2172 33150 42224 24803
548 24803 2205 -15775 -33480 -39668 -18696 14301 31371 31504 25183 7123 -21579 -37889 -29837
561 -29837 -11452 7539 26905 35997 23797 -101 -19121 -29662 -30597 -15715 10245 28540 30196
574 30196 21644 6006 -17277 -35422 -31575 -10305 10167 23906 32802 27299 1552 -25029 -31889
587 -31889 -25021 -13703 7375 31188 35302 18045 -2552 -19436 -31405 -28873 -8770 14600 27285
600 27285 27545 18441 -52 -22103 -31450 -21791 -6222 7906 24508 32885 17315 -7306 -18326
613 -18326 -22085 -26392 -14610 14354 30554 23723 13867 3991 -17453 -35390 -26377 -1894 14162
626A4162P655N543p014k4543k2075j335J0481R816J6409K0649N24k1250j7098
639h076q156j0031J325K2658K0835L295j861m494j7834k0961l583J1418J2214
652c251J2509J4478L679j5739k0552r556k555M4J2799K4078J2125p713j1291j0491
666a436j7767j1890J2581K2252J0523M930M814j0322k3758j3432K854O384J0020
679d247J8147J2936n827j6391j2519q368o434M835J8804J6174K199k665m788j6384
693d528j8963n14J3797J0502R535J3027O86j8027j7097n014j948J432J5070K0052
707A8010N792q233j0097j1210j3778m895J2092J7428R459L443L36j0224j9214
720a1091j0596M383P867Q614J4752R952q013j5176q548o806n940P059J7951J1807
$$ plain form
626 14162 21817 27360 20346 -4197 -26272 -27607 -17126 -7310 9099 29748 30272 9022 -8076
639 -8076 -16232 -26263 -24938 -2280 18555 21850 19989 15495 -2339 -23300 -26883 -15465 -3251
652 -3251 9258 23736 27415 11676 -8876 -18432 -20987 -20943 -8144 15934 28059 20346 9055 -1436
666 -1436 -19203 -31093 -18512 3740 14263 19193 24007 13685 -10073 -23505 -20651 -14267 -4247
679 -4247 13900 26836 21009 4618 -7901 -16269 -22703 -17868 936 17110 19309 16644 11856 -4528
693 -4528 -23491 -24005 -10208 294 9829 22856 23542 5515 -11582 -16596 -18544 -17112 -2042 18010
707 18010 23802 15569 5472 -5738 -19516 -24411 -12319 5109 14568 18011 18347 8123 -11091
720 -11091 -21687 -17304 -9437 -823 13929 23881 15868 692 -7856 -14662 -20602 -13543 4408 16215
734A6215J117k689p473j5460j2992J691J2162J0984Q551P400j764j4902j5335
747a2495m403J723L746J2629J6320L273r736r386q576j0939k190J2539J4171O586
761A3262K871j277j1213j5455o870M047Q105R087J0914O399o683j4419r123l472
775a3827k350N918J6180J1293j926n614o212j2391j0750L695J2558Q884O135N477
789A7070l463j4230j2301k213K886M965J1149J2431J353r789r476o259p113j745
803a6735J1373J4444M420j346j112q502j5354n484P937P677N826R919N122r171
817I014j3176n940k376j024P312J4057P848l092o094n860r786q428M633J2864
831d8P042K739M647k775j5133j0782K487L572K178J0843J2139k540j0835o047
$$ plain form
734 16215 17332 14643 7170 -8290 -21282 -19591 -7429 3555 12106 19506 17742 2840 -12495
747 -12495 -16898 -15175 -11429 1200 17520 20793 11057 1671 -6905 -17844 -20034 -7495 6676 13262
761 13262 16133 14856 3643 -11812 -18682 -14635 -6530 2557 13471 19870 13187 -1232 -10355 -13827
775 -13827 -16177 -10259 5921 17214 15288 9674 3462 -8929 -19679 -15984 -3426 5458 11593 17070
789 17070 13607 -623 -12924 -15137 -12251 -7286 3863 16294 17647 7858 -1618 -7877 -14990 -16735
803 -16735 -5362 9082 13502 12156 11044 2542 -12812 -18296 -10359 -2682 3144 13063 18185 9014
817 9014 -4162 -10102 -12478 -13502 -6190 7867 15715 12623 6529 669 -9117 -17545 -12912 -48
831 -48 6994 9733 14380 11605 -3528 -14310 -11823 -8251 -6073 4770 16909 14369 3534 -2513
845b513m848p066Q78J2084J1057K258j209k451q839j2090k636P888O752M782Q490
860A2537L242j0439j1833k340j263k095Q417J4412L539n989l460m380j0832n804
874a6288P898J0749M083K874L444n204j2978p301K461L670L685R139Q374l176
888A1430r630n479l862n377K443J1906Q014k47j2j994j0731r765K058O606L546
903a094O076Q246r11j0371q102k123j427N42Q056J1163K695n854m702l964p849
918i619m206P611R899L165J731J738o007j0689m176K053K730N255Q245L985l655
933H060o497n396m703k360L966R053O526L50j633l146q237p834J468P171M689
948A477M148N429j005r361p788j498N55K139P047P963J452m670n267m693m879
$$ plain form
845 -2513 -7361 -14427 -13549 -1465 9592 11850 10641 8190 -649 -12739 -15375 -7487 -735 4047 12537
860 12537 15779 5340 -6493 -8833 -10096 -12191 -3774 10638 14177 8188 4728 348 -10484 -16288
874 -16288 -8390 2359 6442 9316 12760 7556 -5422 -12723 -10262 -6592 -2907 6232 14606 11430
888 11430 1800 -3679 -7541 -12918 -10475 1431 9445 9198 9186 7192 -3539 -13304 -11246 -4640 -1094
903 -1094 4982 13228 12317 1946 -6156 -8279 -9706 -9164 -1108 10055 12750 6896 2194 -1770 -9619
918 -9619 -13825 -6214 3685 6850 8581 10319 4312 -6377 -10553 -8500 -5770 -515 7730 11715 8060
933 8060 1563 -3833 -8536 -10896 -6930 2123 8649 8999 7366 4220 -4017 -11851 -10383 -3212 1477
948 1477 5625 11054 10049 688 -7100 -8598 -8043 -5904 1143 9106 10558 5888 621 -4072 -8951
963h951r96N773P633L618R10n67n261q269l454K770L108L691P083M234m787p560
979a025l305k520l031L835R983N475j949k294k544p198o749K353P811M602K365
994E809L152j196q462p344J93K673J425N275P555K27o337l883k131m992j165P249
1010a952O804P67M04O52n158q390k172L932K903K757O088M082n220q275k646n58
1026e982j954L323R501M877l508l328j962n982n348L478P736L269J141K262k077
1041E446p912m749J401J574J382N544N575j464m972k525k525m662K92P271N229
1056D905r6P09O30o034p947j39M616J789K663O713J974p260o646n15q40j713N284
1073a907Q511J291l806j796k385n842k806M821N830J544J075K009k727p122l028
$$ plain form
963 -8951 -9947 -4174 3459 7077 7987 7420 2159 -6110 -9564 -6794 -3686 5 7088 11322 6535 -1025
979 -1025 -4330 -6850 -9881 -6046 3937 9412 7463 5169 2625 -4573 -11322 -8969 -1158 3444 5809
994 5809 8961 7765 -697 -8041 -7848 -5175 -3750 1525 9080 9307 2970 -913 -3044 -8036 -9201 -1952
1010 -1952 4852 5619 6023 6675 1517 -6873 -9045 -5113 -2210 547 6635 10717 5497 -2778 -5424 -5982
1026 -5982 -7936 -4613 4888 9765 6257 2929 967 -5015 -10363 -6885 851 4120 5261 7523 5446
1041 5446 -2466 -7215 -5814 -4240 -2858 2686 8261 6797 1825 -700 -3225 -7887 -7595 -324 4905
1056 4905 4809 5518 6148 114 -7833 -7972 -3356 -1567 1096 7809 9783 2523 -4123 -4638 -5478 -7191 -1907
1073 -1907 6604 7895 4089 2293 -92 -5934 -8740 -3919 1911 3455 4530 6539 3812 -3310 -6338
1088f338K189P48P25N801M969k711m657j480k652m168J483O834M040J41L81j150
1104D155n734n636K29M065K909K914M140N6o011n197o23k40R3M789O130K77l163
1121C153j824k330m471j232M164M249J257J338J286k985n832k338J423J078J821
1136a243M866L529k558m360j947k097k811J904O216L767m07q23j520n022m438
1151f944J244M414K610J693K776m31n328m259K9L81M15L947M806K2k950j994j758
1168a327l245j203L560M290J165N16R81k638n912k065K574J543J174M261L002
1183F676k908m617j633j098j814J795N840L400j351j914j245l661l680J640M527
1198d3J812Q12K224l03n098l620P77N53R4L566M570o22l563j174r47l493j102
$$ plain form
1088 -6338 -4149 -3401 -2676 3125 8094 5383 726 -754 -3406 -7574 -6091 743 4783 4924 5305 4155
1104 4155 -1579 -7215 -6986 -2921 -12 2902 7042 7098 1087 -4110 -4733 -4973 -4880 -91 6039 6316 3153
1121 3153 1329 -1001 -5472 -6704 -2540 1709 2966 4304 5590 2605 -3227 -5565 -4142 -3064 -1243
1136 -1243 3623 7152 4594 234 -1713 -3810 -6621 -4717 1499 5266 4859 4036 2516 -2506 -6944
1151 -6944 -5700 -1286 1324 3017 5793 5362 34 -4225 -4196 -3815 -3400 547 5353 5375 2425 431 -1327
1168 -1327 -4572 -5775 -2215 2075 3240 3756 4737 2099 -3813 -5878 -3304 -1761 -587 3674 6676
1183 6676 3768 -849 -2482 -3580 -5394 -3599 2241 5641 4290 2376 1131 -2530 -6210 -4570 -43
1198 -43 1769 2581 4805 4502 -596 -4216 -3439 -2886 -2792 774 5344 4722 1159 -15 -962 -4455 -5557
1215e557M387M112M3J93J033l073n633r02L135J380R04L832K220l679m319o24
1231b548m41j585K180N689J852k555j112l26l757l297K711M044L49Q65K827j187
1247C709n485k324J445J36K18L848L646j397l302p79r38l209k93M722L291p49
1263B539K32Q13l685m754P43K922L68J208L864O89l986l019O4q63j121K820M569
1280C403O13k219m06o85l678k079K888L137K28J171K029j930m749j319J454k5
1296b167N91L758K495j937k522m85j601k487J154M082J894n12L64j83l423l121
1312d100R25K222O17J271K880J35l481k678R5l47n29K558L724J59j911n20j190
1329a70k961q87K530K411O88J043P61k146l309j087R13N60R93K812J917j762k557
$$ plain form
1215 -5557 -1170 2942 2985 3178 4211 1138 -4495 -5397 -2262 -882 22 3854 6074 2395 -1924 -2548
1231 -2548 -2989 -4574 -2394 3295 5147 2592 1480 1154 -2603 -5900 -3189 855 1204 2069 4896 3709
1247 3709 -1776 -4100 -2655 -2519 -2301 1547 5193 3796 494 -285 -1223 -4432 -4725 -3 3288 2539
1263 2539 2771 3584 -101 -4855 -4112 -1190 -822 386 4250 4939 953 -2066 -2002 -2865 -3986 -1166 3403
1280 3403 4016 1797 1391 706 -2972 -5051 -2163 974 1202 2373 4402 2472 -2277 -3596 -2142 -2167
1296 -2167 -1576 2182 4677 2740 218 -267 -1868 -4355 -3201 881 2775 2263 2627 2444 -979 -4100
1312 -4100 -3175 -953 -336 935 3815 3950 469 -2209 -2114 -2461 -2990 -432 3292 3451 1540 1020 -170
1329 -170 -3131 -4018 -1488 923 1611 2654 3415 1269 -2040 -3127 -2214 -1654 -661 2151 4068 2306 -251
1346b51p42q45j813J064L913J572j015jj72k824k663R15K333Q26R87J951k1l008
1364B06k542Q0K52k5J977L029K92k065r64o74k306r75K659K609J56J72R31j709
1382A103l542p48J680N76L92K621J794k000k818l08k64j395Q41L534J594j358
1398A702o02N2k185k624J084K790N54K13J883n9l332j924R26nn19K409K955q21
1416B497j992j53p82k463l66L019K032l91J94J025j906l537k18K309K82q5K803
1433B268J614k859k649O01j18j757J455L625M84j681K4j05k543j639J790J903
1449D13ON88J754n52l262j108J123l71n91K724K713j424k150L79m99k779J17L442
1467E23J519j029M61Q38k398k870O79J807J10M83K146N59k434j748L45k56q65
$$ plain form
1346 -251 -993 -1838 -3651 -2587 1326 2898 1883 1882 1710 -1114 -3777 -2862 -529 297 1284 3235 3214 206
1364 206 -2336 -2256 -2004 -2029 -52 2977 3269 1204 240 -434 -2740 -3715 -1056 1553 1709 1881 2812 1103
1382 1103 -2439 -3187 -1507 -931 -539 2082 3876 1876 -942 -1250 -1514 -2909 -2068 1466 3060 1702
1398 1702 1100 1152 -1033 -3657 -2573 217 771 984 2867 2808 -524 -2448 -1522 -1527 -2046 363 3318 2497
1416 2497 505 352 -430 -2893 -3259 -240 1792 1401 1595 2620 714 -2823 -3041 -732 -450 -535 2268
1433 2268 3882 1023 -1626 -1025 -1143 -2900 -1445 2180 2664 983 1007 902 -1641 -3280 -1490 413
1449 413 419 1007 2761 2209 -1053 -2161 -1038 -1409 -2000 724 3437 2013 -137 242 -257 -3036 -2919 523
1467 523 2042 1013 1474 2312 -86 -2956 -2277 -470 -360 123 2269 2828 394 -1354 -1009 -1265 -2130
1484b130J448K598J22j331J38k18k338j136J913J402k81J016J521j348k737k96
1500a657O49o72M59K646J468j419j305k63j028j482P27K567J153o88J41J35k082
1517f51k038J020J624j70N69J919k66k255q41M67o77n07J667J827j00q26lm86
1535B73j830q50J446J495N0M84J215j014k672o54J078j3K26K177J356j501j652
1552c86k10m23r81O60K176R97p06l88J6j448j478P61J516R4J02J228K16j779j107
1571a140M81k25p67J280K213j35j282J04l07j865q10J868J435j05L72Q15j215
1588G17k324l77J176L69J47J648R70j489j689K33K3j090O00K245N40j332R1N13
1606I71j687j420J262J262n86K03J783o8k080p87O49n10n91J597K012m28j459
$$ plain form
1484 -2130 -682 1916 2038 707 845 627 -1711 -2847 -934 468 187 1203 2724 1376 -1361 -1657
1500 -1657 -1008 -1680 -1221 1425 2893 1474 169 -94 -1122 -2604 -1877 690 1843 1155 1296 1431 -651
1517 -651 -2689 -1669 -45 -215 354 2273 2007 -248 -1089 -622 -1299 -1806 -139 1688 1588 762 759 273
1535 273 -1557 -2407 -961 534 584 1068 2283 1269 -1403 -2057 -979 -992 -766 1411 2767 1266 -386
1552 -386 -596 -1019 -2000 -1340 836 1833 1127 739 755 -693 -2171 -1410 106 200 302 1530 1746 -33 -1140
1571 -1140 -659 -884 -1651 -371 1842 1707 425 529 222 -1643 -2453 -585 850 745 1117 1932 717
1588 717 -1607 -1984 -808 -439 -292 1356 2326 837 -852 -619 -596 -1686 -1086 1159 1699 367 458 971
1606 971 -716 -2136 -874 388 -198 5 1788 1720 -360 -1147 -498 -1008 -1599 -2 2010 1582 123
1623A23O8o8j920n35K372J260p85L06J082j644k343N36J575k81j42J869N68j885
1641A56j115P83l10j215R53J954K7j032M47K44j702j125J234R92n18N22J603n20
1659A378k119m01P25o29l15K063J464j236j093N36o45j681M47K069M17n63N41
1676I58L00j514j528P93J100m22J74J366M08j693o50O84o30r65J163J754l84o96
1694B18O34k92j779l84J190N39j24P19Q89q31j620k30N56k55J4J484J022j056
1712F94r51L49n07j123N18J613K67m94M17J28j314r14N42O62j51L58J067N4j219
1731dn56K82m23n06J013J291j91o17K60k83j381l93J220P41k21L30P48p79j480
1750i49n4P03j73n6J253P29r07q55J91k37p76K39J441L84n98J31L38j051j140
$$ plain form
1623 123 191 123 -1797 -2332 40 1300 515 821 1903 259 -2084 -1548 27 -254 -396 1473 2041 156
1641 156 -959 -176 -486 -1701 -748 1206 1233 201 648 892 -810 -1935 -701 291 -227 295 1898 1378
1659 1378 -741 -1142 -417 -1046 -1361 702 2166 930 -163 373 -272 -1953 -1506 563 980 417 958
1676 958 1258 -256 -1784 -991 109 -313 -139 1227 1635 -58 -708 -24 -654 -1619 -456 1298 914 218
1694 218 852 560 -1219 -1603 -413 126 2 721 1610 779 -841 -1071 -515 -770 -756 728 1750 694
1712 694 -257 92 -415 -1538 -1020 593 860 366 783 911 -403 -1317 -775 -113 -264 94 1161 1215 -4
1731 -4 -560 -278 -701 -1207 -194 1097 906 289 549 266 -1115 -1508 -288 453 232 562 1310 531 -949
1750 -949 -1003 -300 -473 -529 724 1453 546 -309 -118 -355 -1131 -892 549 933 335 466 804 -247 -1387
1769a387O49Q24j90K13J128p5j451m87N26l00n61J075J249l38q34J96p6j150m22
1788a411J361P90n33J45P55o64j528Q7Q92k49k55J377P32j208p95M93l12q85N21
1807f87J449Q5p82M11L18j268r82R19R19n18K92J075k65j568j43O96l85n44J119
1826A41J187o71q53M46j06j295m5J451M63p85M39Q60j041j283M43O89m83J0J384
1845I51L10j277m33N01l60q38P21J260k17n65N03K9j376n07J094N81n89M51R84
1864A223o43j294K35M70n78l00J366O89q63m34M30l94j011K73J163J39n24N37
1882D84M94j040r90N71M57m16K43J224n5j164j41M28n30n83Q96R11l27l95N01
1901E68k09j200j44R62K63m12N16P04o48j073K05L98m45j23J169N17p57n03L47
$$ plain form
1769 -1387 -738 86 -104 109 1237 1162 -289 -776 -250 -550 -1111 -36 1213 875 41 237 161 -989 -1411
1788 -1411 -50 740 207 352 1107 443 -1085 -998 -106 -355 -610 767 1499 291 -504 -11 -323 -1208 -687
1807 -687 762 847 65 476 794 -474 -1456 -537 382 -136 156 1231 966 -602 -745 -49 -434 -978 141
1826 141 1328 657 -196 250 144 -1151 -1196 255 718 -67 372 1232 191 -1092 -649 40 -443 -433 951
1845 951 1261 -16 -449 52 -308 -1146 -425 835 618 53 556 585 -791 -1298 -204 377 -212 239 1223
1864 1223 580 -714 -479 -9 -587 -887 479 1168 305 -129 301 -93 -1104 -831 332 471 -53 484
1882 484 978 -62 -1052 -481 -24 -440 -197 1027 972 -192 -333 95 -435 -1018 -122 789 462 67 568
1901 568 359 -841 -985 -23 240 -172 344 1048 400 -673 -468 -70 -515 -638 531 1048 291 -212 135
1920A35k21q31K67R54J26l73M12K30q38o89L81L65j60K12Q06j4q01l08J69k19
1940c97m21N88R74j93m78L05j42r45k17Q87L27l13L84M55n06q90O7L63j91j8P47
1961C86M51n82n06L55j78o72K27R04L4m21L82K84p92p45N47M04l96K32R12n7r43
1982a74k23M51m14m73P97R42m13n69L26n9q83k01R91L93n28K30N49n85q80L25
2002c98N42m04j53Q49M25q50l11N64k30r26M02R89j42m27M70K76r38o01O20M26
2022A83l88J73Q58q4j130j39N39l28m05Q59Q56p37m74L92q9q93J65R83J0m71L31
2043B11M25p24n62M44L16m05k8Q77J11p93M1L78m83p30O44P92k44l58O50r9r80
2064e17l29Q59J20m13N47O58n43q91K40L41n01l4Q97K54o62k54M65k18o73K02
$$ plain form
1920 135 -86 -917 -650 304 430 57 469 699 -139 -828 -447 -82 -242 -30 776 762 -39 -347 -178 -397
1940 -397 -818 -230 744 551 73 378 236 -709 -926 -39 288 -25 359 814 308 -582 -515 -152 -343 -361 386
1961 386 837 255 -251 104 -74 -746 -519 385 419 -2 380 664 -128 -873 -326 78 -318 -86 826 769 -174
1982 -174 -397 54 -360 -833 -36 906 493 -76 250 191 -692 -893 98 491 -37 193 742 157 -723 -398
2002 -398 144 -260 -413 436 861 11 -300 264 34 -892 -490 499 357 -70 400 676 -262 -863 -243 183
2022 183 -205 -32 826 742 -388 -527 12 -316 -721 138 994 257 -217 175 86 -807 -642 341 351 -120 211
2043 211 636 -88 -650 -206 110 -295 -323 554 665 -128 -87 291 -192 -922 -278 514 270 -88 562 463 -517
2064 -517 -846 13 133 -280 267 925 382 -509 -269 72 -429 -463 434 688 26 -228 237 19 -654 -452
2084d52P22p8l89M01L69o60n17N55J31n30J93Q76o4n90j5K00n89l03O36N32j31
2105B97k05K87j14q00j52N88L05k22J91N09m73p21K48L52l77K9O08J37n41o2L70
2126B54k96n22K60N17j03j63L67J44n00m70K97J81l04K24P30l5o85j07K59l36
2146b88l74O11O41k72l26K28o2o58o5O49J82k49R9L65l34n17J67K79k22k21N59
2167A92K77l87k06L15j54n82J32O99m4l40L40K86o00n14L62K85l43K17O91j40
2187D86o44j17L07k39k91M75N51k87l90K76J14o40j52O73J60m77K65M71m38n75
2207d72L21M14n26j15O41K71n21j29L39k87m83J89P00j51k99L38K85p31m55O03
2227f8K20l96K00O23k23p60J49M19l23k42N11M11n27j29M00r9o81J41O15j14l15
$$ plain form
2084 -452 270 192 -197 204 573 -87 -604 -49 82 -448 -255 621 557 -33 -48 152 -437 -740 -104 428 297
2105 297 92 379 265 -535 -687 -99 206 -16 175 684 211 -510 -262 90 -287 -258 350 487 -54 -116 254
2126 254 -42 -564 -304 213 110 -53 314 458 -42 -512 -215 -34 -338 -114 616 581 -104 -211 48 -288
2146 -288 -662 -51 590 318 -8 220 158 -500 -565 84 266 17 116 481 147 -370 -203 76 -146 -367 192
2167 192 469 82 -124 191 37 -545 -413 286 242 -98 242 528 -72 -586 -224 61 -282 -65 626 486
2187 486 -158 -275 32 -207 -498 -23 528 241 -149 127 241 -399 -551 122 282 -195 70 541 103 -472
2207 -472 -151 263 -263 -378 263 534 13 -116 223 -64 -547 -358 342 191 -108 230 515 -216 -671 -68
2227 -68 152 -244 -44 579 356 -404 -255 164 -159 -401 110 521 -6 -135 265 166 -515 -374 241 127 -188
2248a88L26L60n40l87L36K05m46J02O30N1o36RL86l27m51M48M44k15j93L87J1
2269C12o80o6M95Pl20L94L19l12m60J65K56l53j42N43K95m69o4L58k34n72J94
2290c34N97k45j91M24J31n16j80K42N8k31J34M63n6m37M5K24k95k69L46M59l07
2311F2j27K82N7o07nM14nk38K30L46k64l51J06J32k19n8L88J85k63j26K33j38
2333C4l72P0M19n1q4J87J15l72k81L03J08k68J41L51o4l47j1K22k58k08L47K50
2355B31j68j49K13j1l71n8L36P9j95J60K60k37l23Q2K61l26q6N11J50m19o6K81
2377A55j42m09K41L69j07j42J06K28l68k81K85J60k57L8M02N1n53O1L85k98l60
2398d36M19M12l39j72K77Mm95mM59n5k39K42L09l05l87K12K39l11r3N80M0m61
$$ plain form
2248 -188 138 498 -42 -429 -93 112 -334 -232 398 449 -187 -178 208 -119 -570 -122 322 107 -86 301 312
2269 312 -368 -434 61 68 -252 142 461 149 -311 -146 110 -243 -385 158 453 -16 -80 278 44 -528 -334
2290 -334 263 18 -173 251 382 -134 -314 -72 -14 -245 -111 352 296 -141 -96 128 -167 -436 -90 369 62
2311 62 -65 217 274 -333 -338 76 71 -167 63 409 145 -206 -100 32 -187 -245 143 328 65 -61 172 34
2333 34 -338 -268 151 100 16 203 318 -54 -335 -32 76 -192 -51 300 236 -111 -122 100 -158 -366 -19 231
2355 231 63 -86 127 116 -255 -313 23 102 -93 67 327 90 -233 -151 110 -216 -302 209 359 -60 -126 155
2377 155 13 -396 -155 214 107 -35 71 299 -69 -350 -65 95 -162 -124 278 329 -224 -163 222 -76 -436
2398 -436 -17 395 56 -116 161 165 -330 -334 125 70 -169 73 382 77 -310 -98 141 -170 -263 317 357 -104
2420a04J5L60l07l63K88M07k43j89K88Q8m43j31M06N9l92K45M39k51l65J05K41
2441A53l41j34M17J83l63pL25q3m60L2M88j88k33L82K29m39l15L48O0l25J22M75
2463C26l3m43J22J55k29k72L07L27j72j83K99nm49OK68O8l11K50K86k23l74K41
2485c9J80l38m9L90M8k67K2K97j84l32J56J73o3m0K06J27k40l23K89j1j82J51
2507b9K72l4k59j9J69k39j19K93K00k21j08K54l6l12q2L38m8j29R4K59j90k18
2529a64J97M9k07j11K47K41j73q8J36n7l26J17K22j6j15J96J70l62k14K13P2j33
2551a06R2J93j0k63p7K51k30j9J43K08q8k36J95M8k54JK10J6k03O5L37j71k10
2574a08Q9J06k71n6L34J58k13n1J65j15k88O7L75p6k18K52J35m40j49L19J13l07
$$ plain form
2420 -104 -89 271 -36 -399 -111 296 53 -136 152 240 -203 -334 72 131 -261 -16 423 172 -193 -88 153
2441 153 -188 -322 95 278 -85 -92 233 150 -310 -278 210 22 -211 171 400 -39 -354 -6 54 -271 -149 326
2463 326 293 -150 -28 127 -102 -374 -67 260 88 -95 204 199 -250 -244 24 92 -219 31 317 94 -280 -39
2485 -39 141 -197 -246 144 192 -75 -53 244 60 -272 -116 57 -6 -46 160 287 47 -276 13 2 -180 -29
2507 -29 243 209 -50 -69 100 -139 -258 35 235 14 -94 160 124 -188 -270 68 20 -109 -15 244 54 -164
2529 -164 33 82 -125 -236 11 252 79 -9 127 70 -256 -139 83 67 -48 148 318 -44 -258 -45 27 -106
2551 -106 -14 179 169 -94 -171 80 -150 -169 -26 182 94 -142 53 101 -153 -152 58 74 -129 -64 273 102 -108
2574 -108 -19 87 -184 -240 94 252 39 -12 153 38 -250 -183 192 116 -102 150 285 -155 -304 15 128 -179
2596a79O9L39j23k92J11J78k62r3K70K31l57n6L13kk94n1K65p2k33K84K78k28
2618I6k99J85Q5l04LM51Q9l67o1K77j70l52L28L03j81j48K13%l41n2L10O0k77
2641a52R9L01j86k18J39J85k89j09L14O7k44k4L51r0l77P5K74j81r9K75J62l42
2663f9j25K44l0j90P9L53n9l26N6J49j45k13K83J92j64j05J90k1k26J1K39j26
2685cj81J90J87j54k24K02J06l21NK52J8j11O1J01r7k22K8K24k6j05J32J60k66
2708d4r7J19O3j72R8J76nk59R9J31j81j31K80O3j83j9J48mj78k0J15kj33P7J99
2733A40q4j74J8J42j02p7J79J04j74k5J54p5j75Q7J44o9o4J12J62l02j11K04L8
2756E2j01j06L25M3l02P1J06j04j93J71K01j39j00J48J7j76o4K08K0j89P8K31
$$ plain form
2596 -179 -110 229 106 -186 -75 103 -159 -252 18 249 -108 -164 149 147 -147 -198 67 -5 -238 46 324 96
2618 96 -203 -18 67 -237 -234 217 306 -61 -122 155 -15 -367 -39 264 83 -65 148 148 -193 -245 65 125 -152
2641 -152 -53 248 62 -156 -17 168 -121 -230 84 151 -93 -117 234 144 -233 -158 116 -65 -164 111 273 -69
2663 -69 -194 50 20 -170 -91 262 203 -123 -67 82 -63 -276 7 199 35 -70 120 99 -127 -116 123 -3
2685 -3 -184 6 193 39 -185 17 123 -198 -193 59 77 -34 27 128 31 -191 -163 61 35 -70 62 222 -44
2708 -44 -141 -22 41 -131 -33 143 138 -121 -22 109 -72 -203 77 140 -43 -62 86 82 -96 -116 -1 -3 -136 -59 140
2733 140 56 -118 -100 42 -60 -137 42 146 -28 -53 101 26 -149 -62 82 13 -51 61 223 -79 -190 14 52
2756 52 -49 -155 170 213 -89 -18 88 -16 -209 -38 163 24 -76 72 89 -87 -151 57 77 -112 -34 197
2778A97j29k03J33R5k52J1K12N8k01j7J76p9j69R5K33j58j50K30J03k60j17J99
2800GP6k44Q3K91r1k15P7J21j58j28K33P5j00o5J78k9l53J06K30m3k16K26R5j27
2824B9k40K34Q8k31k0K59Q4k95M8J39j17k03J54K19j78n7J75J43l57mK33k8k43
2847a68J49J65p2j55Q9J43k63j24L61J5k31K8J83k3l42J42K10j37r4J91J01k12
2869d4r0K06m5j55P0J81n8j61J09J00j56j25J03J75j28n9K04m8k39L5J85n1j18
2892a09J45K01j40j97P8J21j87l6K13Kq5o6J65q0j74N5J02j1q9J53J8j15n5Q7
2916dO4k02N4J80Kp5J7J15j76m2Q2J33j40l0R5K1j42j12K15o3q9J23M5jj35J4
2942e1J34j32k1J13O4j17jP6m8j37N6J48q2j04J06M2p1p2J60L2j59K6J32N8k06
$$ plain form
2778 197 68 -135 -2 93 -159 -148 64 122 -79 -96 80 1 -168 -73 160 2 -148 82 185 -75 -192 7
2800 7 83 -161 -78 213 122 -93 -16 105 -53 -181 52 127 27 -38 140 111 -242 -136 94 51 -165 61 156 29
2824 29 -211 23 111 -120 -140 119 203 -92 -44 95 -22 -225 -71 148 -30 -87 88 231 -126 -130 103 75 -168
2847 -168 -19 146 74 -81 8 151 -112 -236 125 140 -91 -63 120 97 -245 -103 107 -30 -124 67 168 -44
2869 -44 -134 72 27 -128 -58 123 65 -96 13 113 -43 -168 -65 110 -18 -77 127 79 -160 -125 60 9 -109
2892 -109 36 237 97 -100 -22 99 -88 -124 89 91 6 -60 105 25 -149 -94 8 -3 -92 61 79 -36 -91 -4
2916 -4 60 -142 -88 92 94 19 36 151 -25 -67 15 148 8 -22 73 94 -48 -160 55 -8 -97 26 71 70 -65 -51
2942 -51 83 -49 -70 43 107 -10 -11 65 17 -120 -64 84 2 -102 4 46 -25 -97 63 95 -64 -38 94 152 -54
2967e4O4N4p3j57J19J68j49m5J68l1j89Q0M6R6j77Q2J60j09j83Q1Q5j01p2K45
2991A08Mj93M3J81j44j85O7K67j07j04Q5J03j74o1J84j1j49j0K40k8j79M1R6o7
3015Gj53J07J62j08l8J73m6k20mJ60k8j41J52J64j53j09R7L7j57j8J82L2j76M0
3039c8R2j1j43P6J35j98L5J51%j66j7J87m3j78M0K08j04j19J35M9j79k9K15K2
3063A20j22ON5p1j42Q8J36r9k9J24K6r7q1J25J4j51pJ78K4j87N6J60j92j2R9M2
3089F3j05rJ19L0j77R1O9m5j43J23J16j17n7L1K5j30J5J43P2j34K3J8qj09R1M0
3115C5k6j2QJ14j56l2M7O2j20J2J21n6p1N5R5k1j71N9J12r4PR3J9j68j0J11K0
3142C3j12N6J56r9q4MQ4j22mJ80k2p1j06J47n8j32R3J49p9p9kJ68q8j22J32K8
$$ plain form
2967 -54 10 64 -9 -166 -47 121 -28 -73 95 64 -125 -45 1 97 -80 2 162 53 -130 -49 36 -65 -137 108
2991 108 112 -81 -38 143 -1 -186 -119 148 41 -63 22 125 -49 -110 74 63 -86 -96 144 116 -63 -22 74 7
3015 7 -146 -39 123 15 -23 150 104 -116 -120 40 12 -129 23 187 34 -75 22 59 -98 -116 66 98 -78 -38
3039 -38 54 43 -100 -24 111 -87 -52 99 99 -67 -84 103 60 -118 -78 130 26 -93 42 91 -88 -117 98 120
3063 120 -2 4 59 -12 -154 -66 70 -29 -58 66 92 -5 -86 39 53 -98 -105 73 97 -90 -34 126 -66 -78 21 63
3089 63 -42 -51 68 98 -79 12 81 36 -107 16 132 15 -42 -11 14 -116 -101 42 114 -20 3 21 13 -96 -5 35
3115 35 9 -3 5 119 -37 -69 -22 40 -80 -68 53 -3 -74 -19 76 55 -116 -57 55 -39 -32 61 80 -88 -98 13 33
3142 33 -79 -23 133 34 -50 -46 38 -84 -88 92 70 -1 -107 40 -18 -150 -57 92 13 -66 -68 100 12 -110 22 50
3168E0j26J1J44k8r6O8P1j20j16J45J08j65O6L0P5k02m0J80Mj48R8J28j46q0J49
3193F0k3n2n0J90p1j58O7J54j08j72J54J34j87j00K12Q8k41o1K84m1k62J37J56
3216A10n4j01RQ8j05r8J00J51j90R5M9oj83R0J33q7j12J49P4j31o2J52o4j10L9
3241f4J12o3r7J18N8k7j95J06J26j32j4J90l6j36MQ0k1j07Q7J14p4o8P5mj43L0
3267h1J65k4o6J7R5n4j56M6J17o3m6J23J8r4n9O9M7j83J16J36j17l1L2P1j05j16
3293a43J46O3j06j4J00l2j49P0J49j00r5J9J72j2r8N3J7j10NJ32jp8j0Q7q5n8
3319g8R1Q3r8rM8k4k1p8J11l0m9kJ34j3j25k5J36n5p2R5K5p0n5P6R3j11%L3K7
3348C7j12QJ28o7p2J06L6j03o9J50M7j43L4Q3l7j31N5J25n0j22J06M6n4n0J13
$$ plain form
3168 50 -76 -65 79 51 -45 23 94 -26 -142 3 111 -54 12 42 117 -85 -125 55 59 -89 9 137 -9 -89 60
3193 60 37 -15 -65 125 54 -104 -37 117 9 -163 -9 125 -62 -162 50 138 -103 -164 120 79 -183 -46 110
3216 110 56 -45 -36 52 -53 -151 -51 100 -90 5 54 48 -135 -45 88 1 -111 38 112 -19 -81 71 7 -103 -64
3241 -64 48 -15 -112 6 64 37 -158 -52 74 -58 -72 118 82 -54 -50 30 9 -98 -11 103 29 -39 36 32 -111 -81
3267 -81 84 60 -6 11 106 52 -104 -58 59 -4 -50 73 91 -3 -62 7 54 -129 -13 123 6 -25 7 78 -27 -143
3293 -143 3 66 -40 -54 46 14 -135 -65 84 -16 -111 -92 80 68 -30 23 40 -70 -65 67 66 -12 -22 65 -20 -78
3319 -78 13 96 -2 -11 37 13 -8 -86 25 -5 -54 -56 78 65 -60 -85 51 -4 -76 19 44 -26 -81 -5 88 -23 -23 10 37
3348 37 -75 -67 61 -6 -78 28 64 -39 -108 42 89 -54 -20 63 26 -105 -50 75 25 -97 9 55 1 -49 64
3373F4K7j43L8R7j7j35M8J56j37j16J21M3m7j36J66L8j24K1N7k7r2J69L2q5j05
3398h7R8P8j73kJ50qj24N7J28j62o7J16O6n2p6R5M2j29j3J36pk10J08J41p6n5
3424b6L8N2j54K1R9l1ml1P0k0p9O4Q6r2r4K23n3o0m8J21m7o5pO9K6p5Q2k4m6m9
3454e4L8M7j5q0J45o4q5LJ42J6j51O4J25j62k1J17l2l3k1N7lp9%Q3J0r5N9plm3
3484d2Q1K0p0qL8N5j79P4P8n0k4L5J0n5oO6L6o4j7N6K0p7j7O6K0j53Q0O1n9k0
3514d5M8O4p7k9J07m9k3J2J4m1m0M1L8k3j7N2N6k4p5KL3q6kJ18j3j13N2L6k5p4
3544h3Q3K6o0J9L2Qp7qQ9k9k5J1Q7p3n4O8J4j4m4J00r5j1k6J49m5j26R4M4o4l1
3574d1R6K7j07K5K5ro3M3L7J6r3K7Q0n7j01J28L2j03L9N4m3l5PO9m1j56J54M2
$$ plain form
3373 64 91 -52 -14 83 66 -69 -21 135 -2 -118 3 46 -1 -137 29 67 -57 -36 21 -6 -98 71 103 18 -87
3398 -87 11 89 -84 -86 64 56 -68 -11 117 -45 -112 4 70 18 -58 37 79 -50 -63 73 66 -144 -36 105 29 -26
3424 -26 12 64 -90 -69 30 -1 -5 -36 34 14 -65 -1 85 -7 -101 122 69 9 -39 82 35 -30 -37 32 58 -17 65 41 -5 -54
3454 -54 -16 31 16 -64 81 17 -68 -65 77 93 -58 6 131 -31 -52 65 33 0 -21 36 33 -46 -46 37 47 -48 11 4 1 -42
3484 -42 39 59 -11 -19 19 74 -105 -31 47 -3 -27 8 18 -37 -43 23 59 -5 -22 34 54 -23 -40 26 46 -107 -27 34 -25 -45
3514 -45 3 67 -10 -39 68 19 -4 8 22 -19 -59 -18 20 -3 -20 32 88 64 -11 -9 24 -62 -64 54 41 -72 -20 16 -9 -83
3544 -83 0 26 -34 -15 17 25 -52 -60 29 0 -25 -14 73 0 -54 14 28 14 -30 70 -25 -36 -62 87 42 -84 10 54 -10 -41
3574 -41 55 82 -25 0 25 16 -47 -4 33 49 -44 -17 63 6 -95 33 65 -38 1 55 12 -23 -16 53 12 -144 10 52
3602E2m3o9P2P8r3p1J20n7k4L9o%N0n7J09p3q1O0R5j14J7K6o6n7J17kl8m9O7J09
3632A11j62K1QM5o7J4P0o1j06J13P8q9l1N8M2q0j3P7Oj5l0M8l5n6M1R1j09pL6
3661bO1q6k6Q7l0j1m4N4L0n3jN9m6k1Q4p2l5N4P9q3j5O3nl1n8N1oKp0J02nj3k9
3694a6O5m1j1kK8Op1P1Jl1m8J4O0oK7m3l3%J6QJ1k9n5Q9Nr7J12j9rMKl2k4P3J6
3729D1m4m0L0J1J5n9N9L3m9k0N2n8kk5M9M4p9P0K2n0j2J00j8k5q3k9Q2m6K6Qm6
3760d3OJ5j8M3q2R6M0n6k4R4l3j34O0R2n8m2LR3n2m2J09K6j11k8M2M4o9K2O0k8
3790B5l0nmnk5L1N3p2j7P6K7r8%P5lq5J59n3r8O0J6m3l3J0P0Lp0MQ8m7q4O5M1
3823C1p1j0R2Qj02K9R4q4k9M2M4j22P3K7Kp5J6O6l9r2J02M9j5r9Q0K4r3L5K8K8
$$ plain form
3602 52 9 -60 12 90 -3 -74 46 -11 -35 4 -2 -2 48 -9 100 27 -54 6 101 -13 4 30 -36 -93 24 22 -16 -65 2 111
3632 111 -51 -30 -22 23 -44 -30 40 -21 -127 -14 64 -25 -56 2 44 -36 -49 28 34 19 -11 37 2 -54 -13 78 -31 -38 -2
3661 -2 59 -27 -53 34 4 -7 -51 3 33 -20 -21 38 -8 -29 55 -17 -52 2 81 -2 -17 46 41 10 -48 3 -3 -1 -71 31 26 13 -16
3694 -16 49 8 -3 -5 23 29 -42 29 30 -1 -49 -35 25 19 46 3 -30 -30 -14 -6 5 -24 -79 10 15 -82 30 11 2 6 8 -24 -48 25 41
3729 41 -3 -43 -13 -2 13 -46 13 46 -3 -23 29 -29 -31 -56 -7 37 -42 28 50 0 -12 88 70 45 -38 -67 15 -31 -5 3 -43
3760 -43 -37 -22 -40 3 -79 17 57 1 -23 71 38 -96 -36 56 -2 -44 -41 52 0 -42 67 93 -18 -46 -4 40 -29 -7 53 25
3790 25 -5 -10 -14 -19 -44 -13 40 -32 -49 27 54 -44 -44 31 28 -57 102 49 -49 11 27 -16 -49 -39 31 34 -36 -32 56 9 -75 -10 31
3823 31 -40 -50 42 50 -52 -23 71 -13 -42 0 44 -78 -5 22 24 -51 -35 31 -8 -100 2 51 36 -63 17 41 -52 -17 11 39
3853C9p1k1J25n8l8k6P9rn4P6j3n0%M8m0j2o7J08j6l1K9J6j3k1L9l0L2pJ6j8p6
3884f4K4P2J1j04N1J8m0k5M4P0n0k5N8k8RQJ8l9p6j3J28op7K6M1q6L4P7m7kj9
3915a2O7p4P4k3k6rl5K1R3j18mM0P2o0l2K0N5q7K1N7p7K8n6R3k3jQm1OKJ9Mr0
3948h8P8K5j7M9m2J3r0K0O2L2n4k3P4j2k5L5k7Mk4LO7o0m7J13K3j77M8K2P3op7
3979b8Q3rn4L1p5N6l6N8m7JRj4jJ6jR1j35O2O7j7n5n2Q7k7k8jK2l7j5R2J6r4M
4012c1L9N3m7KJ1m2m8k7J18l9k8R6o5Pq4J23l6qk1L0oL8l7O0r1j8K3M3M1o8L4
4043B2J5m5J6K6J6n5k0L2k4jK5N4p4rM9k5m3M6J8o1M2m4Q8n5oNRn2P0k6J1j2J1
4076CL4l3o1N6N5p3jL6kq2J09n5j1KL8k5j9L0PK1j5p4R4Np5J9MK0j3kO4n0J8l3
$$ plain form
3853 39 -32 -53 72 14 -24 -50 29 20 -34 42 29 -21 -21 27 -13 -25 -92 16 0 -31 -2 14 1 -20 19 -11 21 14 30 12 -64
3884 -64 -40 32 43 -61 -10 8 -32 -57 -13 57 7 -18 40 12 21 29 47 8 -68 -81 47 41 -36 -10 31 -55 -21 56 9 7 -12
3915 -12 55 -19 55 32 6 -3 -38 -17 76 -42 -46 -6 66 6 -26 -6 49 -38 -17 40 -37 -9 -65 28 5 4 12 -29 -23 -21 -2 2 -88
3948 -88 -10 15 -2 47 5 18 -72 -52 10 42 -12 -35 39 27 2 37 10 14 -10 -7 60 0 -47 66 89 -88 -40 -18 55 49 -28
3979 -28 55 46 -8 23 -52 4 -32 26 -21 -20 -11 -25 -26 -10 -11 80 -55 7 74 57 2 -50 37 10 -18 -19 3 -34 -49 43 59 -35 -31
4012 -31 8 61 14 16 27 -15 -63 -90 28 -11 -39 57 -8 -1 -85 38 2 -6 -27 3 -3 35 -2 58 -33 -51 -28 15 56 -12 22
4043 22 37 -8 8 34 50 -5 -25 7 -17 -18 7 61 -13 -22 27 2 -41 5 23 -38 4 -40 48 -7 -13 -8 1 -51 19 -7 4 -8 3
4076 3 37 4 -57 -1 54 -19 -20 16 14 -68 41 -14 -25 -23 15 -10 -29 1 8 29 14 -60 34 39 -36 -17 -13 7 -6 -8 56 6 24 -9
4110ik4N3n6R3n6M7o8J8J9n9k6N2lrkJ4M0l2L2k0K6m0K4Rj1oMJ3K2l1oK2n6kP1
4145D3p9J7Q1n5j9L5k9Pk8k0K6J8l2N7n0M3j4Qp3M7J1L1m2k2K0L8mj20J03Qm5
4176c9J2Q5j2o6m3N4J0J1pj1m4L8J1J9qn3P9l1j5KL3k4o3L7L0k4j1L0N2r8Q7N
4208D6l4o2P6PJ4p3J9K2J4k3L5k1k6l3M5jl1J4j5N5o5N7j6L4l7L6m9l7jN8M2o5
4240a5j2L9l2J6m8O0l0M0L2p6K6lRJ0l1O9l1j9j1L0K5n2MM7l2J2o9L9pj1Q6r0
4272b5L3j7M1p0M8n7O4K1k7k7rN3o2j6N1k0J0l2Q2j18KR3p4J05m1LK2j0p6L8J5
4303@k2Q5J0o6j6M5l1j1K8N0o0KPKl6k1K6PmOM7l4j4KJJ8p3K6O3p2k8L6L3j9j4
4338b7J8mrQL9k3j5P0m3p0L7K5RL8o5L4J5o2PpL7o7P9k5M5n7R8j32RJ9pL8m0J5
$$ plain form
4110 -9 -33 20 -36 57 1 48 -20 -2 17 -42 -68 -16 -19 -28 -30 -16 24 -8 24 4 30 -10 14 23 12 6 10 23 45 14 8 30 -26 -28 43
4145 43 -36 -19 62 7 -12 23 -6 1 -27 -47 -21 -3 -35 22 -28 15 1 9 -64 -17 -6 25 -17 -39 -19 19 15 -105 -2 6 -39
4176 -39 -27 58 46 -20 -63 -9 1 12 5 -6 -50 -12 -1 18 10 -43 36 5 -10 -8 25 1 -62 -25 5 -19 -30 0 52 -46 41 46
4208 46 12 -50 26 33 47 -26 -7 15 29 6 41 20 -6 -39 6 5 -26 -12 -27 28 -37 20 4 38 1 37 -12 -49 -50 8 50 -15
4240 -15 -27 12 -20 -4 -52 8 -22 18 50 -26 0 -3 6 16 -15 54 23 4 -7 23 48 -4 0 47 15 27 -42 -3 -10 -21 65 -25
4272 -25 8 -9 32 -38 10 -47 17 38 11 -16 -25 28 -34 -50 1 -19 -9 -41 41 -77 -75 18 -56 49 8 11 33 23 -53 -15 0
4303 0 -22 63 73 7 -9 36 5 -6 22 72 12 14 21 23 -13 -34 -8 -1 -5 1 48 14 0 2 3 21 -52 -26 37 -35 -63 -27 6 -13 -27
4338 -27 -9 -13 -22 -14 25 2 -13 57 14 -56 -19 6 15 53 -12 22 37 -25 -18 -25 12 -55 24 -1 44 -13 85 -47 -38 -19 -26 12 -28 -13
4372a3N6j18P5nl7M8l0l4K6Ql8J04mr3P5mlm0K8MK3j9k0O6q3K3Rk8K0%L0l5K8
4405A9m6N7j5m5L8m5J4j6N8n1L6j8N4j0j00N1O5l7J9pj7k2l6R6p4OR6n8l3m2Q0
4436A7j8K5m3K7L5k7j3J2o8%L5KK1rj6j2j8K2L7K1l1NM0m0n4P9o1L2k1RkL%K6
4470A5Ol6K9M9p0j4j9K5M5n1J0J8J9k1K2k7L9n3N6j8l4O8p3K7j6n0M6o1N3L2j7
4501ak6%L4o6J4jM9LKl7M7m1j2K9j9J1k6Q4p3O3k1j2rO7q6OM7l7J08k3j02j8N0
4534DJ7l5K7O0l4n7j9M1%p3O5j5k1M8j1M1j5k9K4o3Q4o1R0n2J9J6n6M2m1J3k5
4565a6J3L1m7M2J2o9J0M1mn1N3N0j12R6m1k9j1L7l6J3L5pn0J0j2j2KN0M3k2k3
4596dm6K2qO0l2j3K5k0K6K1k1J7j7pk2N8l2L1m3l2l1K1P2k6j8PN0j1n6O8m1J5
$$ plain form
4372 -13 43 -75 0 -5 -42 6 -24 -58 -32 -24 -62 42 38 -55 20 16 13 -27 1 5 28 9 -11 55 -28 -5 4 -24 -4 -4 26 -9 19
4405 19 -27 30 15 -30 8 -37 -23 -39 19 -32 4 -14 40 30 -70 -19 46 9 28 21 4 -18 -54 42 -32 -26 70 12 -21 -63 17
4436 17 -1 24 -19 8 43 16 3 15 -53 -53 -18 -16 5 -4 -20 -32 -50 -28 9 30 -1 4 44 4 -50 29 -32 0 -21 -12 -14 -11 -11 15
4470 15 21 -15 14 63 -7 -21 -40 -15 30 -21 -11 7 26 5 27 0 39 -14 42 24 -10 58 -15 12 -4 -54 -8 -69 -16 16 -1
4501 -1 -27 -27 7 -59 -45 -46 3 6 8 -29 18 -23 -35 -6 -25 -14 -40 44 -29 34 13 1 -8 59 -27 -21 26 -11 97 74 -28 -46 4
4534 4 21 -14 13 73 39 -18 -37 4 4 -69 -4 -19 -40 8 -3 38 23 -6 18 -45 39 -22 68 16 35 51 -5 37 -4 9 -16
4565 -16 -3 28 -19 23 35 -34 -24 17 13 -38 15 65 -47 49 8 -21 -32 5 -31 -18 17 10 -40 -30 -42 -54 -52 -2 41 19 -4
4596 -4 -50 -28 -36 24 -8 -21 4 -16 10 31 10 27 10 3 -19 39 7 38 -5 -37 -68 -47 25 -1 -19 -12 38 27 -29 39 -2 13
4628A3l7L3M3q5J2lJ6kJk3M7m5M8k3l3K3K3k8K9l9k3O7l8P7l1Kom0P5o6M1l5J6
4661Il6NN9o6O9l8L1m4nJ2M2p4P5o3L7k5JMj6M2M0n4J5q6L4J6N6k9q0Q2Pl7K8
4694A1lJ3o2L8rM3J2Ln2L4J1J5J7j7o4j7%pM9Nl0Mj8R9o0m7K8n6%O4K1k2L9q2
4728d0N4p5O1M3n4LJ7K6l3Km8M9k8k8N3j2L3n1NM5l2m0N5j3l2O4%p5J12k2m7k3
4760c1RL0J5p0N3j8j5oJ8K6J5m9j1P7J2l0k1L6p1J7L4k3RM8l5p5N8K0q4R2lp3
4792d6O3M1l0Jk0Jk6k0L3L8m0Rm4K7J4k8Nqj2M3k2k3M6j9J4MM2m2k2O1r3M4M2
4825C3m0M2m5j5K2qOP1p4MJ3J2n8K1j1krPO3pq3M8J7o3k3R7J6m1%K7pl1rJ1J8
4860BK2k7j6P3q4N5n9M5l8J3K4l1N0j2L9n5j5L1j8J5L5o7K2J5k9L9m3jP4jp8N9
$$ plain form
4628 13 -24 9 52 -33 -21 -24 -8 -10 -9 -32 15 -30 18 -5 -38 -15 8 -20 9 -30 -53 14 -24 53 22 24 18 -22 53 -13 28 -7 9
4661 9 -27 -22 37 -29 40 2 33 -11 -16 -4 38 -36 39 -24 13 -12 -11 -7 -23 19 59 5 20 -66 -32 -16 40 11 -69 13 20 -17 11
4694 11 8 21 -41 -3 -12 31 43 46 -6 28 39 54 71 54 -10 -27 -27 -34 15 20 -10 -6 -24 75 15 -32 -4 -60 -60 4 25 3 42 -40
4728 -40 14 -61 0 43 -11 -8 9 35 2 4 -44 5 -23 -51 2 -10 23 -28 -23 22 -10 -50 5 -8 -40 24 24 -51 61 39 -8 -31
4760 -31 -22 8 23 -47 6 -12 -27 -33 -15 11 26 -23 -34 43 55 25 4 40 -31 -14 20 -3 6 54 19 -56 2 22 -62 30 27 -46
4792 -46 17 58 28 29 9 10 -16 -36 -3 35 -5 4 -40 -13 1 -27 -22 -30 -42 1 -21 -44 2 -17 -3 1 43 1 -21 40 -53 -9 33
4825 33 -7 35 -10 -25 -3 -11 -5 66 -8 -4 9 21 -37 -16 -27 -29 -38 -31 32 25 -58 -10 7 -56 -79 18 34 -7 -7 20 13 -18 -27 -16 2
4860 2 24 -3 -19 54 -30 25 -34 11 -27 -14 10 -21 29 17 56 1 -14 17 -1 14 49 -18 4 19 -10 29 -14 -15 59 58 -20 39
4892C9L4o2m4M2k2J1L2n1O4p2J3K8nL3o3J6L3l6j6L7Kj8O6l8n3P4Ql5m6K1J8o1
4924e1K6l0K7K8QK6m2L8l5J4J8j02P4J3k0l1qM7l8M1m4O5l7lO3l9J0Nq1O8J0P
4956B7L4q1nM5n7J9QPN5r2P2m5L5k4n5O9l0j2L5k3J4m4N4J3o2M4M2r0P1p3N6K4
4988C1lQn6Pqj6K5M1jk9M7j8M1r5K2J6m5J1L9k7N9k0p9M5l9QL2j6O2Lj6k2K2m7
5022a8K2j7l5M3L4m2j5L2J1Jj3K2l3J0l2J0J7j0O9o7P9n2mj0j7P3m8k8J8j01J21
5053B0mJ5l0L4J0j1qnk9j7mL7Ml4K3q5O5MJ2o3P0J1j6j9m7P6N0n3k4L5Om3K2n1
5087d9J5M3Lk1k8M5L3m0M%K0o1NORM1nm8QJJ4j7kL0L8p6j0L8M6k8j9m4O7J8k3
5122A3Nl4N8k2rl4K9n8L0M3m3J4J8l3L6Kj2l6K7L0j1k3k4J0K3J8j9m3rQ0j8M0
$$ plain form
4892 39 73 11 -33 9 -13 -2 30 -21 43 -29 -16 12 7 40 -23 -7 26 -10 -26 11 13 -5 61 23 -30 44 52 17 -29 -8 10 -51
4924 -51 -25 -55 -28 0 8 34 -8 30 -5 9 27 -75 -1 12 -8 -39 -47 0 -38 3 -41 24 -13 -16 47 8 18 23 -58 10 20 27
4956 27 61 -20 -25 20 -37 -18 -10 -3 52 -40 32 -13 22 -2 -57 12 -18 -30 5 -18 -4 -48 6 19 -43 1 43 -47 24 -49 7 31
4988 31 28 36 -20 -13 -21 -37 -12 29 28 -1 46 28 69 -26 -4 12 -33 -22 17 -10 49 29 -50 -5 -44 -36 -4 -20 42 45 29 7 29 -18
5022 -18 4 -13 -48 -5 29 -13 -28 4 15 16 3 25 -8 2 -30 -20 -3 -13 56 -11 68 16 12 2 -15 58 10 -18 0 -101 20
5053 20 16 31 1 35 45 34 26 21 -8 -25 -29 8 12 -22 1 -84 -19 -15 -3 -66 4 15 -1 -20 -67 9 59 6 -18 17 23 -20 2 -49
5087 -49 -34 9 12 -9 -37 8 41 1 5 5 25 -36 -31 -25 -16 25 20 -28 -20 -19 -5 -22 -24 6 44 -32 -42 -4 42 14 -5 -49 18 36 13
5122 13 18 -16 42 20 11 -23 6 -52 -22 21 -22 -8 10 -23 13 15 3 -33 -6 24 13 -10 -34 -24 -1 17 -2 -45 -54 26 8 48
5154D8o3l8M6k3l8M3O1p6N7k3J3KK0j7k1NK6nj5L4n0L5k1k6K5j2k1NL0k6J7k1
5186b9L5L1k3k9K7rKK6q1O5l2Kk5MM9j6M6n7K3L2o3L9k4L5l0J1rj7K2Kn6M0kK6
5220A5o2K6L7j9k5K3L1l4J6p7P9l5O2k8j3MK5j8qL1j5o4M2NpM7n1K1j9j2k7J9
5252c1P9j11M0O9m0J6Qn3K2J6j3J2noj6k4O6o4L0j0M7k7m8L8k5M8j0J4n4J3O3
5283D4j9l2Qj6j1M8LL0o8M3l9O4j19J9J5O7m3P9r3PM7k2nj1J1kj7K4Nk2qmL9k5
5317cN0l3K5j2l2ROQl8pN0k3k9M4l8K0K9o1J5j4O7nrj4K2m5n1O2QK8k3k6N9j7
5351B2%K0o9O3k9J8n8J0l6P9k0j3k1K5L2j1Ok6J8PQOo8oL5L5ln5M8p2M1J9m1%
5385c6J3K0k1J6M7o1P5n3k0Q5o0kK3jj4J9k7Qj2L3l7jL5ml9Oj9J1M1ml7J7l6O2
$$ plain form
5154 48 -15 -53 -7 -30 -68 -25 36 -40 17 -6 7 9 29 12 -9 -4 22 17 2 36 -14 21 0 -26 -1 -13 -34 -29 1 -25 -8 -29
5186 -29 6 37 14 -15 12 3 5 31 -50 15 -17 -15 -40 -36 13 -3 43 -14 9 41 -22 17 -7 28 -2 9 0 -17 5 7 -49 -9 -11 15
5220 15 -47 -21 16 -3 -28 -5 26 -8 8 -69 10 -25 37 9 -4 0 25 7 -1 30 15 -49 -7 -2 -9 38 -13 8 -11 -23 -50 -31
5252 -31 48 -63 -23 46 6 22 30 -23 -1 15 2 14 9 3 -13 -37 29 -35 -5 -15 32 5 -43 -5 -30 18 8 22 -32 -19 44
5283 44 25 -7 1 -15 -26 22 25 55 -13 30 -9 55 -64 -45 -30 37 -6 73 -20 -13 34 12 7 -4 7 5 -12 12 17 -5 -13 -17 22 -3
5317 -3 47 14 39 27 -5 4 10 18 -20 -27 23 0 -29 15 -23 -3 26 -35 -20 -34 33 28 19 5 27 -18 -69 -7 1 29 6 -20 39 22
5351 22 22 42 -27 36 7 25 -33 -23 -59 20 0 -13 -34 -9 23 12 18 -8 10 17 25 31 -37 -43 -8 27 24 -31 17 -55 -14 5 -36 -36
5385 -36 -23 -3 -24 -8 39 -22 53 0 -20 65 5 3 26 25 11 30 3 11 -1 32 -5 -6 29 25 -14 -8 -27 -16 25 21 -16 1 -35 27
5419B7l2Nk5O7m0J1jK4k7l5M9Rnq4M1J8j0K8m1J8qL6ll8K3qM3o1ln6K1Q3o6O4
5453B4l2J7k4O2m9j5K6K0l7k0Ok3O9o2O5k5l3J9J4J9Ll1K4k6rKK4l9N2J6k6k8
5485a7l5j1N9k9LP6l4MkoJJp5J03kM0n5l1J0j7L3pKrKk6k9N3J5m9O1k1lJ9J6r
5521C1j7JOp7N0j8J3Q3n2j2jm3L8j4L7m4j9L0k8L8j5pL7j2J8j5L5m1j4K7J0n2
5553b7J0M8l7k1L8j0j3k6P6j16P5kPM0J7q7R9Np1jJ4p8O5j1n3M0%L9k5j6N1m6
5585a6N6Rj23Q1m1J6J9O7p3jL6o0j1O5K9p9L1l8P4k2m6j8L5m4N3M3j4Ll6PMm9
5617d3K0L7K0j7qL6n0j4K4k5k3L2Q6j01M1j9M1p8K2k1O3%l7K2l1MJ0K1mj4%ql
5650a7K8m1J00j34J06j9m2k8NL8m3R1o6M1m3nrQ1l1m4N5j6%j0o3J10o1L4K3Ln2
$$ plain form
5419 27 -5 0 -25 42 2 13 12 36 9 -26 23 32 27 -57 -16 2 -8 20 -21 -3 -11 25 22 -16 7 -1 42 -19 -22 -78 -57 26 -40 24
5453 24 -8 9 -15 47 -2 -17 9 29 -8 -28 -22 -45 24 -38 27 2 -31 -12 2 21 24 -7 17 -9 -18 -16 8 -31 21 37 11 -17
5485 -17 -52 -63 -4 -33 -30 46 12 16 14 8 9 10 -65 38 36 76 21 -10 0 -17 16 9 11 2 4 -22 -51 2 17 -32 29 8 5 24 40 31
5521 31 14 15 21 -56 -6 -24 -11 72 20 8 7 -36 2 -12 25 -19 -38 -8 -36 2 -13 -20 17 5 23 8 43 2 -12 15 25 -27
5553 -27 -17 31 -6 -27 11 1 -12 -38 38 -78 -3 -5 2 42 59 -28 71 76 5 4 18 -60 5 -6 -59 -19 -19 20 -5 -21 30 -16
5585 -16 40 49 -74 7 -34 -18 1 68 -5 -6 30 -30 -41 24 53 -26 5 -33 41 19 -27 -45 -10 -54 -1 42 28 31 -5 2 6 -43
5617 -43 -23 14 34 17 9 45 -5 -19 5 -20 -43 -11 75 -26 15 -4 37 -41 -19 -40 23 23 -14 8 -23 -19 -9 12 8 -6 -6 -14 -17
5650 -17 11 -30 70 -64 42 23 -19 -47 -42 -4 -47 44 -22 19 -24 -29 -38 43 12 -32 23 7 7 -3 -66 44 -17 17 40 43 -9
5681iL4m0j8K1L7o8J31l6k5m6K9Nl2J9K9K4k0rm7N0l9K7pp3Q2m1M2j4Nl3J1K1
5713A0k8L2Jk4K9m6L8NpJ5m7k2L8M6n9l1N7m0j3N6l0L3l1J0Mj9L2o5R4J1o9Rk
5746a3J8j8L%k7qQ3j09L6L7l9j4M3k3K3N5m9K1pj8j6L7m3NL9l6K6K8l0K5p7M5
5778cJ5lL3jRM1q6j8K3k4k9K3M6m8PL5p8L8l4L9K5m7QK5m7k4Q3Qj0m1P1l7kn6
5812e9Q9l2L9j1k7J5o3O7k7Qmm1P9j7J7pq2L9J4Qm1L0pLK9n7M2Oj1J9l5j6M2j1
5846bnlk0M8Mo7K6J8j1l2O5m6K4k1OM7j6k5J9l9L8J3Rl9k3L8j0o6N2j1P9kn6n0
5880e8R3l3%oJ5Jm9J6J2Mp9J16p3L6n5J43j11K5LM8p2L2M4o2K0J6L1m1n9Q0m8
5911a1L3l3J4O0l1n3j5J6L0o0Q2n9j9Q8q3J7qN9lo1rL2M2Rl5RRJ5n1M4l5k0j2
$$ plain form
5681 -9 25 -15 -33 -12 25 -43 88 52 27 -19 10 15 -17 2 31 55 35 26 -21 29 -10 17 10 -63 19 -22 20 6 11 -22 -11 10
5713 10 -18 14 15 -9 20 -26 12 17 10 25 -22 -44 -6 40 -19 -50 7 -33 -46 10 -20 13 -18 -8 -4 -23 9 -56 38 49 -20 -11 -13
5746 -13 5 -13 -10 -10 -37 -45 38 -71 -35 2 -37 -51 -8 -31 -8 47 -2 19 12 -6 -22 15 -28 -23 16 -20 6 34 4 29 -48 -3
5778 -3 12 9 42 41 50 91 5 -13 10 -14 -43 -20 26 -22 -15 20 -58 -20 -54 -15 10 -37 -29 -4 -51 -75 8 16 6 -35 36 -1 -3 -59
5812 -59 30 -2 37 26 -1 14 -49 18 -9 -1 -5 -46 33 16 33 26 -56 -17 -3 5 -36 -6 -13 -10 19 -38 4 10 -1 18 -17 -33 9 -2
5846 -2 -7 -10 -30 18 22 -45 -19 -1 -12 -44 21 -25 -1 -22 -16 31 15 -10 9 -30 8 21 30 -9 -32 6 -4 -70 -18 -29 50 48 -8 -58
5880 -58 35 2 2 -4 11 12 -37 -21 -9 -5 -84 32 -41 -5 -60 83 -28 -3 0 48 -24 8 52 -10 10 26 57 16 -43 37 -11
5911 -11 22 -11 3 63 32 -21 -36 -20 10 -50 32 -27 -46 42 -41 -24 -32 27 24 -37 -46 -14 28 37 2 11 20 35 -16 28 -7 -27 -39
5944c9O1k5m3Q9p8M8k0M2m4J7ojl3K0J5M4n9Q2m6j2n1N0L3n2M4n2L6k6J3Pm6N4
5976B2k6L7l6kJ2j9K2p0N6J4m1K0J1m5K1PL8k5J7J8l6K8m3N4j2j1k6M1k5J5l7
6007b1M7l3lO7o4K9k5l6J6MN4k8Op1Q2N4p8KK0l9J8o2Q6l0j0RN5o2K0Pm7Q1o3
6040a5J4J8k9L7j3Jo4L4M8Po9K3rl0K3L0k3K0k7L3J5l5k6K4O5j18Q5jj8k1L8m
6072A3kkM9J4o5J8Kk2j8M4K4r9M7J2J1l6Ok2k0Q6m6k9L5J7RrOrl2O2p9K7J6l4
6106b6oO2q1qJ30l7m4l7N4k3J8Jm4J05q4K9j1J7k3J6Rl4k7K9J5k7oK9QL3p3J5
6138b1j2KRJ3J2Mm1M9Qok8m5N8Ok9Jj1J3l7M6JRm6R9k6j9J9k0l0jNM3o9K4N1q2
6174e1R9j1RMr4O0j9ll1Po2Q1k7J2R2j28R0j9J9kn7R2n6l2jm0Q0m9N4l8O9Lo2
$$ plain form
5944 -39 22 -3 -46 43 -35 13 -7 35 -9 8 2 1 -32 -12 3 47 -12 70 24 12 -39 11 44 -8 36 -16 20 -6 7 14 -32 22
5976 22 -4 33 -3 -5 7 -12 10 -60 -4 10 -31 -11 0 -45 -24 -17 21 -4 13 31 -5 23 -20 34 22 11 -15 26 1 16 -21
6007 -21 26 -7 -10 57 -7 22 -3 -39 -23 -19 35 7 13 -58 24 78 0 2 22 -17 1 -61 25 -5 -15 -6 49 -13 7 14 -33 48 -15
6040 -15 -1 17 -12 25 12 13 -51 -17 31 38 -31 -8 -17 -47 -24 6 -17 3 -24 9 24 -11 -37 -13 52 -66 19 18 0 -21 17 13
6072 13 11 9 58 72 7 25 27 5 -13 31 55 -44 3 15 26 -10 -4 -26 -46 40 -6 -35 0 17 26 17 23 14 -18 44 -35 -8 8 -26
6106 -26 -32 30 -51 -59 71 34 -10 -47 7 -16 2 3 -41 64 -20 9 -2 15 -8 8 17 -17 -44 -15 0 -27 -33 -4 4 37 -36 -21
6138 -21 -33 -31 -22 -9 3 7 -34 15 23 17 -11 -56 2 8 -21 -20 -31 -18 -55 -9 -8 1 -45 54 28 9 28 8 -22 -23 -18 25 -44 -20 31 -51
6174 -51 48 37 46 50 -44 16 -3 -6 -37 -30 -92 -11 -38 -26 66 -62 28 9 28 26 -31 61 5 -27 -28 -68 12 -37 17 -21 48 51 -11
6207a1M3j02P5M6o7rJMJ4j5O9j03J11m6m1L8J7o2NM0n1O5m6J7kpmJ1J7Ok6l6O9
6240B0j8l3jJ02m7o7J00l5l0l7Q3k4k6M2J7J8l4l6K9r4P1O0o0j8Pk5N2K5m0nN7
$$ plain form
6207 -11 32 -70 5 51 -16 -25 -24 -20 -6 -21 48 -55 56 10 -31 7 24 -38 -33 7 -44 21 -25 -8 -10 -17 -21 -10 7 13 -13 -49 20
6240 20 2 -31 -32 70 23 -44 56 21 -9 -46 37 13 -13 29 46 64 30 -6 23 -71 0 60 0 -18 -11 -36 16 41 1 -4 53
$$ [...]
8191a8
##END NTUPLES=NMR FID
##END=
