##TITLE=1H_ABEL3105
 CDCl3, 8 sc, 
 1.06.2021
##JCAMPDX= 6.0         $$ Bruker NMR JCAMP-DX V2.0
##DATA TYPE= NMR FID
##DATA CLASS= NTUPLES
##ORIGIN= UXNMR, Bruker Analytische Messtechnik GmbH
##OWNER= root
$$ XWIN-NMR		Version 3.5
$$ Tue Jun  1 11:36:02 2021 Russian Standard Time (UT+4h)  she@DPX200
##.OBSERVE FREQUENCY= 200.131506
##.OBSERVE NUCLEUS= ^1H
##.DELAY= (6, 6)
##.ACQUISITION MODE= SIMULTANEOUS
##.ACQUISITION SCHEME= undefined
##.AVERAGES= 8
##.DIGITISER RES= 18
##SPECTROMETER/DATA SYSTEM= spect
##.PULSE SEQUENCE= zg30
##.SOLVENT NAME= CDCl3
##.SHIFT REFERENCE= (INTERNAL, CDCl3, 0, 15.7039)
##AUDIT TRAIL= $$ (NUMBER, WHEN, WHO, WHERE, WHAT)
$$ ##TITLE= Audit trail, XWIN-NMR		Version 3.5
$$ ##JCAMPDX= 5.01
$$ ##ORIGIN= Bruker BioSpin GmbH
$$ ##OWNER= she
$$ F:/spectra/data/she/nmr/H-F/1/audita.txt
$$ ##AUDIT TRAIL=  $$ (NUMBER, WHEN, WHO, WHERE, WHAT)
(   1,<2021-06-01 11:34:43.53 +0400>,<she>,<DPX200>,
      <created by zg, POWCHK disabled, PULCHK disabled
       configuration hash MD5:
       00 E9 B6 7A A2 85 ED C7 34 08 36 98 17 FE 4E 26
       data hash MD5: 16K
       13 11 61 10 9A 0E 15 9E 46 FB 0B 0A 13 A7 3C 0B>)
$$ ##END=
$$ 
$$ hash MD5
$$ 44 FD B0 3E 19 62 FF 6C 64 A8 13 47 CE 96 18 57
##$RELAX= 
##$RELAX= 
##$RELAX= 
##$RELAX= 
##$RELAX= 
##$RELAX= 
$$ Bruker specific parameters
$$ --------------------------
##$DU= <F:/spectra>
##$EXPNO= 1
##$NAME= <H-F>
##$PROCNO= 1
##$TYPE= <nmr>
##$USER= <she>
##$AMP= (0..31)
100 100 100 100 100 100 100 100 100 100 100 100 100 100 100 100 100 100 
100 100 100 100 100 100 100 100 100 100 100 100 100 100 
##$AQSEQ= 0
##$AQ_mod= 1
##$AUNM= <au_zg>
##$AUTOPOS= <>
##$BF1= 200.13
##$BF2= 200.13
##$BF3= 200.13
##$BF4= 200.13
##$BF5= 200.13
##$BF6= 200.13
##$BF7= 200.13
##$BF8= 200.13
##$BYTORDA= 1
##$CFDGTYP= 0
##$CFRGTYP= 5
##$CHEMSTR= <none>
##$CNST= (0..31)
1 1 145 1 1 1 1 1 1 1 1 1 1 1 1 1 1 1 1 1 1 1 1 1 1 1 1 1 1 1 1 1 
##$CPDPRG= <>
##$CPDPRG1= <>
##$CPDPRG2= <>
##$CPDPRG3= <>
##$CPDPRG4= <mlev>
##$CPDPRG5= <mlev>
##$CPDPRG6= <mlev>
##$CPDPRG7= <mlev>
##$CPDPRG8= <mlev>
##$CPDPRGB= <>
##$CPDPRGT= <>
##$D= (0..31)
0 1.2 0 0 0 0 0 0 0 0.06 0 0.03 0 0 0 0 0.0002 0 0 0 0 0 0 0 0 0 0 0 0 
0 0 0 
##$DATE= 1622532882
##$DBL= (0..7)
120 120 120 120 120 120 120 120 
##$DBP= (0..7)
150 150 150 150 150 150 150 150 
##$DBP07= 0
##$DBPNAM0= <>
##$DBPNAM1= <>
##$DBPNAM2= <>
##$DBPNAM3= <>
##$DBPNAM4= <>
##$DBPNAM5= <>
##$DBPNAM6= <>
##$DBPNAM7= <>
##$DBPOAL= (0..7)
0.5 0.5 0.5 0.5 0.5 0.5 0.5 0.5 
##$DBPOFFS= (0..7)
0 0 0 0 0 0 0 0 
##$DE= 6
##$DECBNUC= <off>
##$DECIM= 32
##$DECNUC= <off>
##$DECSTAT= 4
##$DIGMOD= 1
##$DIGTYP= 9
##$DL= (0..7)
0 120 120 120 120 120 120 120 
##$DP= (0..7)
150 150 150 150 150 150 150 150 
##$DP07= 0
##$DPNAME0= <>
##$DPNAME1= <>
##$DPNAME2= <>
##$DPNAME3= <>
##$DPNAME4= <>
##$DPNAME5= <>
##$DPNAME6= <>
##$DPNAME7= <>
##$DPOAL= (0..7)
0.5 0.5 0.5 0.5 0.5 0.5 0.5 0.5 
##$DPOFFS= (0..7)
0 0 0 0 0 0 0 0 
##$DQDMODE= 0
##$DR= 18
##$DS= 0
##$DSLIST= <SSSSSSSSSSSSSSS>
$$ [...]
##$SUBNAM2= <"">
##$SUBNAM3= <"">
##$SUBNAM4= <"">
##$SUBNAM5= <"">
##$SUBNAM6= <"">
##$SUBNAM7= <"">
##$SUBNAM8= <"">
##$SUBNAM9= <"">
##$SW= 16.9725357007746
##$SWIBOX= (0..15)
0 0 2 0 0 0 0 0 0 0 0 0 0 0 0 0 
##$SW_h= 3396.73913043478
##$TD= 16384
##$TD0= 1
##$TE= 0
##$TE2= 300
##$TE3= 300
##$TEG= 300
##$TL= (0..7)
0 120 120 120 120 120 120 120 
##$TP= (0..7)
150 150 150 150 150 150 150 150 
##$TP07= 0
##$TPNAME0= <>
##$TPNAME1= <>
##$TPNAME2= <>
##$TPNAME3= <>
##$TPNAME4= <>
##$TPNAME5= <>
##$TPNAME6= <>
##$TPNAME7= <>
##$TPOAL= (0..7)
0.5 0.5 0.5 0.5 0.5 0.5 0.5 0.5 
##$TPOFFS= (0..7)
0 0 0 0 0 0 0 0 
##$TUNHIN= 0
##$TUNHOUT= 0
##$TUNXOUT= 0
##$USERA1= <user>
##$USERA2= <user>
##$USERA3= <user>
##$USERA4= <user>
##$USERA5= <user>
##$V9= 5
##$VALIST= <valist>
##$VCLIST= <CCCCCCCCCCCCCCC>
##$VD= 0
##$VDLIST= <DDDDDDDDDDDDDDD>
##$VPLIST= <PPPPPPPPPPPPPPP>
##$VTLIST= <TTTTTTTTTTTTTTT>
##$WBST= 1024
##$WBSW= 4
##$XGAIN= (0..3)
0 0 0 0 
##$XL= 0
##$YL= 0
##$YMAX_a= 267807
##$YMIN_a= -297980
##$ZGOPTNS= <>
##$ZL1= 120
##$ZL2= 120
##$ZL3= 120
##$ZL4= 120
##$ABSF1= 10
##$ABSF2= 0
##$ABSG= 5
##$ABSL= 3
##$ALPHA= 0
##$AQORDER= 0
##$ASSFAC= 0
##$ASSFACI= 0
##$ASSFACX= 0
##$ASSWID= 0
##$AUNMP= <proc_1d>
##$AZFE= 0.1
##$AZFW= 0.1
##$BCFW= 1
##$BC_mod= 2
##$BYTORDP= 1
##$COROFFS= 0
##$CY= 11.3945322036743
##$DATMOD= 1
##$DC= 2
##$DFILT= <>
##$DTYPP= 0
##$F1P= 15.9154993809931
##$F2P= -4.1035820241983
##$FCOR= 0.5
##$FTSIZE= 0
##$FT_mod= 4
##$GAMMA= 1
##$GB= 0.15
##$INTBC= 1
##$INTSCL= 1
##$ISEN= 128
##$LB= 0.24
##$LEV0= 0
##$LPBIN= 0
##$MAXI= 10000
##$MC2= 0
##$MEAN= 0
##$ME_mod= 0
##$MI= 1.114404
##$NCOEF= 0
##$NC_proc= 0
##$NLEV= 6
##$NOISF1= 3.799351
##$NOISF2= 2.8
##$NSP= 1
##$NTH_PI= 0
##$NZP= 0
##$OFFSET= 15.70392
##$PC= 1
##$PHC0= -11276.47
##$PHC1= 9.600991
##$PH_mod= 1
##$PKNL= yes
##$PPARMOD= 0
##$PSCAL= 0
##$PSIGN= 0
##$REVERSE= no
##$SF= 200.130013532006
##$SI= 16384
##$SIGF1= 3
##$SIGF2= 2
##$SINO= 400
##$SIOLD= 16384
##$SREGLST= <1H.CDCl3>
##$SSB= 0
##$STSI= 0
##$STSR= 0
##$SW_p= 3612.71676300578
##$SYMM= 0
##$S_DEV= 0
##$TDeff= 0
##$TDoff= 0
##$TI= <>
##$TILT= no
##$TM1= 0
##$TM2= 0
##$TOPLEV= 0
##$USERP1= <user>
##$USERP2= <user>
##$USERP3= <user>
##$USERP4= <user>
##$USERP5= <user>
##$WDW= 1
##$XDIM= 8192
##$YMAX_p= 0
##$YMIN_p= 0
$$ End of Bruker specific parameters
$$ ---------------------------------
##NTUPLES= NMR FID
##VAR_NAME=  TIME,          FID/REAL,        FID/IMAG
##SYMBOL=    X,             R,               I
##VAR_TYPE=  INDEPENDENT,   DEPENDENT,       DEPENDENT
##VAR_FORM=  AFFN,          ASDF,            ASDF
##VAR_DIM=   8192,          8192,            8192
##UNITS=     SECONDS,       ARBITRARY UNITS, ARBITRARY UNITS
##FACTOR=    0.0002944,     1,               1
##FIRST=     0,             0,               0
##LAST=      2.4114304,     0,               0
##MIN=       0,             -297980,         0
##MAX=       2.4114304,     267807,          0
$$ Real data points
##PAGE= N=1
##DATA TABLE= (X++(R..R)), XYDATA
$$ [...]
1246c008N361k469k139N240m555O58L734n549L414J231m890N020j615k961N398
1261B870l964k92M374n281K449K066n108M513o82l606N317l202j140M644m877
1276a919J665K644n081L896L3l891M947k487j740M692m347Q97L122m884L116P68
1292A431m048M445j674k252M541l533%L474m454K207J513m040L699p78k675M191
1308B047k568q76L540l711J269K126l910K809K83l138L774j588j739L712k928
1323h98Q9K837l832J976J429l592L151n79k576L970k290j007L396l492J244K158
1339A984m056K803L92l173L956j968j786M195l399M25K722m380K897J054l969
1354b303L863j416k120M584l531k29L277m137K634J156m503M047q43k304M274
$$ y = [-3008, 2353, -116, -2255, 2985, -1570, -912, 2822, -2727, 687, 1918, -2972, 2048, 433, -2528, 2870, -1094, -1386, 2988, -2293, 156, 2222, -2886, 1627, 945, -2661, 2656, -546, -1686, 2958, -1919, -254, 2390, -2691, 1205, 1238, -2653, 2294, -193, -1933, 2759, -1588, -691, 2431, -2453, 663, 1431, -2617, 1828, 154, -2098, 2443, -1090, -1090, 2384, -2070, 137, 1650, -2390, 1309, 531, -2144, 2047, -521, -1397, 2143, -1568, -299, 1827, -2083, 726, 1009, -2129, 1645, 57, -1682, 2030, -898, -809, 2028, -1804, 172, 1601, -1991, 1160, 581, -1995, 1975, -315, -1322, 2074, -1418, -174, 1984, -2072, 731, 1123, -2050, 1906, -62, -1848, 2347, -1052, -627, 2095, -2285, 612, 1666, -2303, 1560, 144, -1976, 2608, -923, -1152, 2125, -2012, 622, 1778, -2725, 1322, 479, -1825, 2449]
1369B449l678j73L886m209K014J044m031M277p55k860L889l036K37L521m432J637
1385b20J431l161L631j298k616L873k147J02K232l921K084J546k769K275j334
1400b92j331L534k028n44J433k160K082O92k659J450l03j60J764k049l12J417
1416E34n24O74o06j197J302M42k46m76o32O43P09q4r27m64J090K19M5m85j283
1435a266J656N21j224O30j367N90K368k440J3O83j435K905j053k562K825j371
1451e27O38J828m217J923J816k685K808k181j771M804k807l01K082m203L764J136
1467B107m573L662j717j117N049m863N6L333m072L792k53m864N260j484j585M130
1483B861n340J605L952n167L140m72l725O212k809k285M318m448K401K784o070
$$ y = [2449, -1229, -1402, 2484, -1725, 289, 1333, -2698, 1579, 824, -2036, 1853, -1183, -946, 2575, -1857, -220, 1211, -1950, 1681, 383, -2233, 1640, -507, -405, 1827, -2094, -10, 1536, -1233, 1042, -292, -1623, 1911, -117, -661, 772, -1388, 694, 1386, -1273, 177, -126, -286, 1478, -571, -883, 534, 10, 684, 78, -1119, 183, 625, 379, -97, -729, -86, 623, 539, -388, -852, 238, 457, 502, 17, -1266, 390, 911, -313, 317, -1050, -460, 1908, -532, -519, 164, -1271, 1634, 581, -1981, 844, -527, 111, 1939, -2278, -355, 1461, -1224, 1584, -597, -2368, 2436, -371, -672, 1410, -2793, 971, 2107, -2466, 1196, -521, -1638, 3411, -1452, -1396, 1937, -2135, 1657, 1404, -3460, 1800, 316, -1269, 2861, -2479, -874, 3078, -2089, 1051, 579, -3146, 3066, 257, -2028, 2290, -2158, 243, 3027, -3043]
1498c043L721K41l017N118l876j371M938m158J788J549n093M552m1l264L973l308
1514a291n7M304m463J222J518l499M038r14l162L868k166O5K671m054J603J742
1530A425k807K515j110j874L456j737n25J733k479J629J014k441J521k52q97K026
1546A197j479n10J416j072O75K84j356R48L36o88N44m70k09Q31k64l48K00j8k8
1565a1M20n23l38Q91m66j43N86r11M50P63j395R33M3j115J693r81o56J679j525
1584f06M90J127k242J676J91j866K287j244q14K458k277N28J534k750K127J40
1600G59k395K901j398j022K908k877O94J997l238K350K3k577L422j705j191L160
1616A811l084J041J878l552K590J37k621L390j872j087L265l053Q99J813l474
$$ y = [-3043, 678, 919, -2098, 3020, -856, -2227, 2711, -1447, 341, 1890, -3203, 1349, 1308, -1956, 2017, -1291, -1348, 2956, -1507, -285, 1233, -2266, 1772, 858, -2304, 1564, -602, -537, 2134, -1920, -317, 1425, -1382, 1133, 23, -1851, 1605, -132, -657, 1076, -1403, 226, 1240, -1201, 320, 68, -829, 1197, -282, -792, 624, -448, 227, 511, -845, 103, 439, -249, 295, -175, -384, 447, 183, -165, 35, 17, -11, 409, -114, -452, 439, -27, -170, 416, -495, -45, 718, -677, 256, 299, -816, 877, -104, -760, 919, -606, -116, 1011, -1231, 445, 636, -1230, 1057, -187, -1001, 1457, -820, -292, 1242, -1508, 619, 759, -1636, 1265, -133, -1155, 1753, -1124, -430, 1567, -1671, 679, 702, -1875, 1547, -158, -1349, 1811, -1273, -232, 1646, -1906, 684, 821, -1800, 1590, -282, -1369, 1896, -1157, -258, 1555, -1919]
1631a919K704J06k610L145j650j030L207l004O75J850l095K467Pk554K998j280
1647A7j037K597k626O25J971k887J796L03k356K794j176j117K559k177K54J783
1663A323k580J462N77j956K054p75j146K129j468j54J653k096J007Q25j893J503
1679D65j91j230J789r16n95J588j476L95R47j618J014L65j421J444m42r37J639
1696H20j061k53J279j418N61P36j547J217K1j195J510p15o53J564j291J13J145
1713H33j539Q38N22j517J435l38j043J710j112k33J388j591O17Q14j648J295L0
1730D61j374J713r16n16J661j565L03J156j843J234K09j517J643o17q37J803j455
1747d57Q5J301j782R35N69j662J610l46j176J842j255j76J491j702O83Q18j774
$$ y = [-1919, 785, 891, -1719, 1426, -224, -1254, 1953, -1051, -376, 1474, -1621, 846, 853, -1701, 1297, 17, -1020, 1577, -1049, -424, 1547, -1340, 456, 759, -1597, 1197, 21, -1096, 1463, -714, -460, 1323, -1257, 205, 782, -1174, 880, 105, -1041, 1088, -380, -534, 1119, -977, 30, 855, -1038, 465, 274, -956, 833, -83, -678, 910, -566, -171, 776, -842, 172, 537, -884, 560, 118, -819, 820, -241, -494, 785, -633, -72, 664, -883, 334, 355, -840, 670, -45, -698, 866, -425, -312, 833, -706, 132, 654, -863, 572, 234, -809, 901, -211, -444, 944, -647, -30, 784, -864, 431, 461, -913, 800, -116, -632, 1029, -536, -233, 923, -920, 314, 523, -994, 649, 32, -805, 998, -457, -372, 929, -853, 82, 651, -1011, 599, 253, -923, 919, -336, -512, 979, -723, -40, 778, -996]
1764i96J480k03j215J793j043m80J620j632N02R91j781J284J82j459J685p50o98
1781g20J643j384K58J046j686J087L21j485J625o18q62J682j282N1J216j609Q52
1798A35N29j563J413k92r49J547j050j91J229j349N82O14j463J152n3r28J248
1815F11p49l92J284j200L00O79j189Q07K63j085R96k92m53J042q60j16Q31q34
1833c57L53L90j034Q40J29q53Q73m21l80J048o99j94P47q88N05N40j248P64J72
1852B87q38J102n92o17J314q74oQ68j397Q45O44j512J161k59r37J764j085n31
1870f63J524j482P12Q41k051J495J30j439J964j289n92K108j900N40J053k251
1886a300J947Q2j996K275j265n70K439k523M79J562k448K116j98k206K757j324
$$ y = [-996, 484, 281, -934, 859, -184, -664, 956, -676, -174, 817, -964, 320, 502, -957, 728, -22, -720, 923, -461, -203, 843, -843, 244, 565, -920, 705, 87, -775, 907, -375, -324, 892, -717, 135, 664, -899, 514, 222, -727, 820, -230, -421, 808, -541, 41, 655, -808, 344, 291, -637, 611, -138, -530, 754, -446, -146, 533, -656, 151, 414, -671, 325, 33, -420, 622, -238, -354, 477, -357, -4, 386, -648, 192, 321, -532, 341, -80, -460, 588, -111, -305, 442, -446, 59, 599, -649, 115, 287, -551, 551, -41, -658, 656, -218, -224, 644, -753, 92, 736, -776, 385, 126, -811, 953, -132, -663, 861, -621, 91, 932, -1119, 376, 506, -933, 1031, -258, -850, 1258, -642, -102, 951, -1300, 647, 729, -1267, 1008, -257, -827, 1612, -911, -432, 1130, -1318, 798, 600, -1606, 1151, -173]
1902a73o84K357k722Q59J766k789K021j89k109L139j530r95K520k693J170J511
1918A459l125K235j07j849K990j973p24K597k508J087J122k846K453j78j957K704
1934A380j986k58K459k620J046R62k472K444m99j729K443j676j0J929k542J149
1950B0P61j932J992p18j177K137j459J10J184j874J127N09j520J479o76o26J535
1967H72j225J45P53j202R84n4q32R27n22j46P77p79L13K58n60O40k40m15N83l55
1987g8J99l9l28M01k73J57J72m59L62j77N6M02o72K56K36n68P03l90k63Q33q61
2008c31L03N41j193R21O9r06J222q93j91J280j316M80N66j430J527l93j067J605
2026G94j135oJ317j805Q20P36j677J711o33j098K011j431L6J392k044J160N94
$$ y = [-173, -857, 1500, -1222, -363, 1403, -1386, 635, 446, -1663, 1476, -54, -1049, 1471, -1222, -52, 1459, -1666, 569, 462, -1387, 1603, -370, -1094, 1503, -1005, 82, 1204, -1642, 811, 633, -1324, 1380, -606, -864, 1595, -1025, 21, 983, -1489, 955, 456, -1273, 1170, -506, -516, 1413, -1129, 20, 781, -1151, 841, 123, -1054, 1083, -376, -266, 918, -956, 171, 680, -840, 639, -37, -663, 872, -353, -208, 545, -657, 327, 273, -559, 368, -154, -300, 477, -302, 11, 269, -291, 349, 109, -306, 277, -78, 121, 82, -246, 155, -118, 39, 211, -248, 114, -63, -7, 395, -277, -21, 215, -353, 350, -40, -303, 530, -331, -28, 513, -680, 241, 310, -596, 626, -267, -458, 822, -494, -14, 552, -878, 649, 256, -811, 794, -341, -347, 970, -835, -15, 721, -956, 755, 122, -976, 1035, -396, -360, 1032, -1012, 148, 742]
2043G42j709J731q17q36K104j668M2J366j955J409K87j863J853o81p68J906j785
2060f42J77J420j814J255N9j641J950o97q13J637j554M10J223j825J061J73j323
2077i44J702o81p89J413j218M35R22j668R76K93j088J281p36n63J405j006J74
2094i2O49j208Q73K07r33Q79m23l52R94p78l1N53o77N04K01q50O29nl93O14m64
2115a03j50N74l85L3K15m81L74J98n06K09L9k34M41j14m07N37k94j7L20m98R4
2136a55M29m88K39J21m92N66j10l81N79m89jO14p25K50L44p55P11p6o79Q49m20
2157f9k11P39q04K51N68r45O93l6p01R99n33k84Q48q11J88N76r79O25J89q12Q94
2178C85l83m23R22p86R1P26r84N46K63q81R63l92n60J053p93qP76r46M81L46r31
$$ y = [742, -967, 764, -53, -889, 1215, -453, -411, 955, -1000, 409, 696, -1167, 686, 5, -763, 1143, -642, -465, 955, -859, 396, 455, -1186, 764, 67, -746, 891, -663, -253, 970, -855, 206, 379, -944, 758, 77, -712, 701, -517, -82, 840, -828, 148, 441, -647, 634, -102, -665, 740, -266, -92, 557, -651, 222, 429, -504, 375, -48, -400, 594, -184, -215, 338, -339, 165, 366, -484, 145, 140, -253, 361, -103, -253, 321, -64, -31, 184, -297, 77, 275, -231, -22, 17, -217, 224, 110, -297, 240, -54, -71, 249, -249, -155, 274, -214, 25, 146, -346, 220, 110, -271, 308, -181, -182, 432, -293, -43, 301, -454, 257, 181, -498, 351, -69, -280, 459, -345, -94, 474, -471, 222, 186, -515, 484, -49, -333, 515, -296, -108, 468, -511, 114, 303, -509, 385, 2, -421, 501, -285, -194, 532, -452, 94, 357, -524, 439, 47, -513, 540, -253, -261, 515, -431, 50, 396, -535]
2199e35Q35j49n95R78o77j55Q55r50L84M89j054Q17l8o95R59n62k29Q58q96K42
2219a18N62r44O77Q5p87Q90l76m27R55q04N4P17r72N40L00q80Q25k23n29R58o97
2240a94q0P46q55M52L49q90P42j35n82R72o73o4P62r19M08L82q69P09r4n95Q05
2261C77n12j15P41p91K45M52q44O05Kn75P33l38k11O01o04J17M28o33M35N9n25
2282c53O53k62k46N30m73R8L04n08K70J61m73M16m5l11L42j28j06K99k47l5L15
2303B01l24O7K08k48J08J46l30J70Q5k74L88j94k26M30l48J27K63n32L19K97n62
2324b29M12j06l79O60m28j38N88p05K81M03p95O56o8n80R15o46k07Q17p91L55
2344A5M04j069Q74j4o64Q96o35j51R97j031L13M41r78R63r2p47R05n92j66J041
$$ y = [-535, 300, 151, -444, 534, -143, -298, 557, -393, -9, 480, -574, 243, 205, -490, 469, -93, -322, 536, -360, -118, 444, -500, 177, 262, -525, 365, -11, -438, 517, -287, -233, 484, -488, 52, 352, -528, 297, 74, -455, 503, -194, -274, 472, -383, 69, 418, -472, 270, 135, -447, 525, -148, -212, 550, -369, 39, 421, -448, 261, 167, -428, 377, -135, -250, 491, -300, -55, 397, -447, 158, 160, -415, 318, -20, -231, 370, -234, -117, 311, -322, 113, 172, -353, 300, 38, -208, 322, -151, -53, 251, -257, 13, 174, -299, 117, 72, -239, 103, -25, -131, 168, -79, -114, 201, -123, -56, 152, -96, 12, 158, -172, -2, 83, -191, 197, 3, -223, 207, -141, -14, 249, -283, 36, 333, -229, 183, 77, -302, 358, -70, -208, 380, -325, -44, 359, -436, 220, 152, -428, 487, -159, -366, 451, -340, 15, 419, -650, 224, 210, -454, 442, -193, -344, 653, -378, -65, 376, -602, 361, 269, -478, 427, -165, -331, 710]
2364G10j179M43M75r78R29l28o87J147o22j36P75j135O11M64r38P58m06k93R46
2383E56o41k00P60j013Q88R9r25O31j50k57O39o53l0O91n58L58m0o03P04j60j34
2404c8K62m46K29L02m42Q2K0n2K85j32j72P2L7K03j54j32J7J6K25j57j56J36j03
2427i8K82m3m51M25j00j14L60n83K24M03n61M45j46m56Q44n07j98O48q10N35L05
2448D04r84P83j02n93J158q88j42Q97j071Q25K01j100J058m81m77J230j099K20
2466a61R93j384Q25K8j184J512n79o09J344j225K25R94j541R21K66j204J484p65
2484f0n65J465j308L22Q44j560J162J16j173J481q51m20J373j328M15P29j401
2501g59J141j05j017J471r05k79J275j361N00N87j264J035j11q08J224q22j29
$$ y = [710, -469, -26, 449, -529, 400, 72, -615, 532, -90, -226, 549, -586, 25, 489, -449, 309, -97, -390, 556, -85, -285, 475, -538, 350, 449, -476, 155, 5, -252, 387, -266, -296, 395, -163, 195, 155, -448, 256, 96, -38, 224, -222, 7, 309, -133, -51, -31, -83, 202, 70, -102, -30, 7, 210, 56, -76, -59, -43, 182, 25, -131, 5, -98, 184, 141, -310, 115, 15, -99, 261, -322, -98, 305, -256, 189, 43, -413, 431, -76, -274, 374, -436, 99, 404, -580, 203, 101, -492, 666, -222, -364, 533, -538, 287, 488, -612, 446, -35, -512, 718, -381, -161, 832, -552, 273, 301, -883, 629, 50, -559, 785, -440, -215, 779, -762, 159, 425, -779, 705, -60, -625, 840, -468, -146, 698, -862, 300, 416, -757, 724, -127, -547, 826, -502, -87, 642, -759, 382, 277, -740, 731, -174, -453, 822, -539, -39, 548, -716, 319, 208, -600, 624, -198, -327]
2518c27R64j040M29L65r99R60j82o97J005o11j87P74q38L48L26o75O47j71m63
2537c72O59l52j02M71n63K34K21o04M84j17j24M45j95l54K48k47L46Q2k64o5N45
2558C76l58R2j84k41N55J6o20M08p9k47M67q1k61J89j74j04L74m27J82L7o1K93
2580A52j54l83M63j80l0M28l63J02K39n59K57J2k06M32l40j52N56m90K47K36o90
2601d23N65m1l19N12m49j81P98p50L57J00o59O79q9l72K87Rj67N68q10L44L77
2622C36o26L75J47n27M29j84J86J4l87j0N43o29L30K82m32P01l88n48Q27n85J57
2643A1M27n49Q4J73l87M39j64l18O54n05J4L90n13K16K93n11L89j02k41M26k77
2664e1j55M43l41J7K46l78K34J29l67L50j03k38M28k92o8M02m35J25K67m43L02
$$ y = [-327, 637, -403, 26, 391, -608, 352, 170, -527, 478, -133, -320, 454, -384, -36, 290, -385, 262, 91, -372, 287, -65, -167, 304, -259, -25, 196, -408, 76, -41, -165, 280, 85, -269, -21, -268, 78, 160, -104, -169, 376, 18, 110, -74, -315, 240, 256, -364, 44, -35, -282, 185, 104, -157, 32, -142, -246, 128, -299, -117, -80, -141, 152, -2, -385, 78, -102, -132, 296, -67, 35, 274, -285, -28, -16, -222, 210, -130, -282, 274, -216, 31, 267, -423, 142, 101, -218, 294, -155, -336, 462, -288, 69, 169, -490, 189, 100, -272, 15, 24, -143, 425, -385, -41, 336, -290, 85, 232, -295, 134, -50, 136, 150, -237, -247, 296, -333, -3, 279, -153, 548, 160, -388, 439, -146, 11, 438, -111, -27, 146, -241, 198, 34, -284, 370, -135, -121, 269, -244, -28, 265, -246, 143, 41, -200, 226, -51, -206, 237, -104, -87, 159, -219, 15, 144, -223, 127, 24, -214, 214, -78, -146, 256, -179, -54, 213, -230, 72]
2685G2P7m25N09k64j33M69l79J2L16m72J62K04l83L74j64l05N48j33j31L79n05
2706a72J82K88p22N00O7n51P70l39k08N52o56J22N12p06M98K36o62N34j85l06
2726b46O48n53L8M48o25M54J04o35O06j60m03O94n26l6N62o55L05K28o12O25j99
2747F2m21P35n06j04O55p40L23K97o92N45j6n36P36m14j61O28o21J75L93o29M78
2768A87kn16O20l30j93N82n19Q9L61o01M33N9m75N82k93k18N34m43M4L97n79L29
2790D8J81n10M74r1l16M42l04p7M53n00J73K67m68L41l3l09M80l13j00M50m46
2811a58J03K67m68L18J11l95L25r4k00L54k73j3L25l64J39K07m17K83nk84L97
2832A58j84j68L79k94L6K99l34J12K49l71K17j9l30N20l28k87N88l91q4N49k77
$$ y = [72, 149, -276, 233, -31, -164, 305, -74, -62, 254, -218, -56, 148, -235, 139, -25, -330, 218, 85, -46, 333, -172, 10, 298, -424, 76, 143, -408, 362, 23, -185, 367, -289, -167, 345, -361, 137, 373, -289, 245, 60, -246, 402, -151, -113, 335, -290, 164, 268, -367, 239, 79, -324, 370, -156, -192, 370, -285, 20, 248, -364, 261, 62, -359, 376, -130, -234, 421, -319, 4, 301, -391, 154, 138, -398, 338, -76, -237, 391, -230, -55, 338, -291, 187, 185, -331, 289, -41, -234, 348, -171, -82, 279, -322, 111, 170, -305, 277, -16, -234, 300, -143, -99, 298, -281, 48, 229, -281, 193, 102, -214, 228, -76, -153, 300, -200, -27, 240, -228, 113, 80, -229, 251, -62, -162, 288, -158, -55, 212, -256, 62, 173, -222, 103, 9, -191, 163, -110, -123, 202, -162, -23, 184, -233, 50, 45, -239, 158, -26, -194, 185, -109, -73, 226, -108, 4, 253, -118, 99, 80, -250, 270, -58, -345, 243, -148, -232, 317, 40]
2853D0k60M06l24M78k35n98N83PK67j05j54J00K33q30M96j46k16M56j65O2K33
2874C28m14j3L82m94N75l28k60P83m67l56O67o83J77M54m69N13l79k45N18l31
2894d2j88L46l14K29J49n41N11j34k00L84k64K7K81m83J99M24n45M20r6m09M12
2915A66j47p6L54l63j81N22n73K29J99m03M30L8m33M79k62m7K81m47R0K36l10
2936b18M65j68l02L98k22N7J09m57L34K09l56K72j49k27M81k20j98K11k38K57
2956C8J38l38J36Ql6K72l65n5L17j19J4M1k55K28J51k42J22j17pK71k16n5k5j
2980i5J05M8j53M2mJ51L6j81q6J81J52k53l0j23J75J91r4l04K13N1l8K82l45Q1
3004BJ91j93J81n7l64L19m1j34lj81J86L56n11L24o7l7J95k91K87J5k2k47J61
$$ y = [40, -220, 186, -138, 340, 105, -493, 90, 97, 364, 259, 105, 205, 438, -392, 104, -42, -258, 198, 33, 95, 328, -86, -99, 283, -211, 364, 36, -224, 559, 92, -264, 403, -280, -103, 351, -118, 395, 16, -229, 289, -42, -230, 116, -198, 31, 180, -361, 150, 16, -184, 200, -64, -37, 244, -239, -40, 384, -161, 259, 163, -246, 166, 19, -57, 297, -66, -247, 275, -298, -69, 130, -273, 157, 195, -238, 241, -21, -68, 213, -234, -144, 92, -218, 247, 79, -223, 175, -47, 10, 119, -338, -4, 205, -151, 121, -28, -255, 226, 6, -192, 19, -219, 38, 176, -162, -26, -18, -54, 218, -147, -202, 115, -4, 10, 51, -204, 24, 175, -67, 55, -62, -69, 202, -14, -69, -94, -95, 10, 58, -95, -53, -57, 94, 130, -51, -137, 44, 196, -57, -87, -210, -35, 156, 62, -242, -29, 22, -16, 266, -79, 2, 193, 0, 181, 124, -240, 79, 38, -96, -99, -280, -94, 262, -249, 75, 8, -29, 166, -125, 162, 177, 155, -92, 69]
3027F9n99O02J67j87L42p99L15M40l70J14Kn37R52m44j73J13n30N44K22l69K44
3048A18J51l68L23m24j02L47k59p3M48n15M58k24K06j34J78m56N38l43j93M65
3068A41n66N02K23m27K66l27j02O32n37R8L88m58L07Q3m55K76N0k71K04Jl3P7
3090G2k28K42R3k39K53k28o6K39j86m2K97k64QK92l57J98j77J6o3K38j91O5k81
3113c09J33K97m4L5J83m94M08j97j66K78n9l9j57J7O5K62m93o8J83J23rM7o0K66
3137B02q8j91J15l60M00j22oJ65j11l6pJ2n3K18j96l9K34l77K61Q7k76K62o4j19
3161h9Q0rj11K42k80K09M4m8q4P8j28K51j50J2N4r3J9O0j97K20j8j29m1J4n9K39
3187H6N0m83O04l37NO5p2J83j97p4K00L2q4j5k8O8J56n42L75J74l62L84j08j28
$$ y = [69, -530, 72, 239, 52, 394, -405, -90, 350, -20, 94, 96, -441, 511, 67, -106, 7, -523, 21, 243, -126, 118, 269, -99, 224, -200, -302, 45, -214, -287, 161, -354, 104, -120, 86, -48, 130, -326, 212, -131, -324, 141, -425, 77, 300, -127, 139, -188, -290, 342, -195, -97, 291, -167, 140, 223, -232, 44, 94, -177, 27, 28, -5, 72, -156, 86, 179, -60, 193, -35, -101, 138, -48, -90, 207, -57, -49, 243, -114, 84, -93, -77, -140, 98, -93, -28, -309, -176, 121, 77, 112, 295, -199, 209, 12, -154, 124, 65, 26, -131, -114, -49, 213, -280, -348, -165, -42, -51, -4, -64, 202, 114, -77, 38, -322, 78, -44, -50, 115, 4, -32, -39, -27, -80, 138, -58, -97, 137, -240, 21, 108, -168, 94, 30, -89, -9, -18, -129, 113, -167, 42, 86, 38, -46, 32, -96, 155, 5, 17, 71, -22, -3, 57, -140, 80, 62, -67, -108, -94, -153, 86, 136, -347, 257, -80, -75, -10, -82, 101, -96, -170, 30, 62, -22, -37, -65, 3, 159, -383, -8, 166, -196, 188, 80, -48]
3211d8L4j07Q5R1q2m6j0j29J46J47j25K79k43l3J40k58K72J20k57J22l16K24M2
3234D8n2J4j55J29R3kk20J93J11l48K85j46MN1j25K12Q8j93K6o4o4J90k02P3M
3259e0J06j78J61l42M27k59J0K63o51M0L78J33k37J42j38K80j2k89L24l30L35
3280A13k11L02j78q2N4n2J17J5j46oJ29n6O9j39pK52j59lJ5j12K07q8j15J58j14
3305c7l5K21k62P7J31j95J81q2j44K90k16K5J77k45J03J59l02L09j10k39L86k14
3327b2m9K70l56K13J30l84K93r6j37L22l10M3K63l00J64M4l86L99j9k31L04k90
3349a35K8K82l47K18M3l25L67q9j77K88k77O8K46k96J45P0k75L70j68j55K55k10
3371g4Q6J63l33K10M7k15K44j66j00K68j78N6J04k69K02J03k50J47j31L0K12j23
$$ y = [-48, -14, -121, -36, 55, -27, -73, -83, -212, -66, 81, -44, 235, -8, -41, 99, -159, 113, 233, -24, 98, -218, 6, 48, -4, 10, -145, -16, 77, 75, -145, 48, 159, -189, 96, -50, -46, 5, -120, 92, 180, -13, 13, -51, -115, 75, -127, -54, -50, 56, -122, 39, -303, 124, -135, -125, 138, -513, -473, -95, 38, -199, -57, -195, 85, 73, -216, 108, -222, 113, -98, 204, 26, -56, -2, -54, 63, 78, -68, -74, 55, -1, 68, -71, -78, 174, 15, 12, 27, -85, 122, 34, -81, 77, -37, -72, 149, -113, -36, 95, -100, 81, -1, -145, 145, -71, -46, 131, -114, -11, 148, -154, 155, 45, -194, 192, -22, -71, 199, -157, 56, 186, -198, 95, -1, -138, 184, -126, -83, 180, -120, 44, 88, -298, 101, 82, -149, 155, -135, -107, 175, -172, 46, 89, -236, 131, 42, -135, 153, -124, -56, 190, -106, 39, 109, -166, 204, 36, -119, 136, -74, 12, 175, -158, 52, 99, -116, 128, -38, -138, 130, -48, 8, 112, -157, 45, 148, -102, 45, -86, -56, 156, 33]
3393C3q5Q0j23J47O6l08K02K8n6J23j77j3J70r1N6j0j08J14L9r8L2q9M8J54j15
3418A9j02N2kJ06N6k69M2J04O2K2j53q1K11Oj01lj04J15J88k04J0k2o5L08j09
3443H6k28J33O0jQ9k99J17J27n2P8j56j02K82J7j83K7j47J96J73k65KJ8J6K41
3467B29k45j91K05%J29jl08J10K13j34Q8k34J5L16m7j78J7p3J86J10l70J64l3
3490c2K9K05k04j13J64o9J09K7l60K85J14k11J56k69KK82j18j5K4j38K81k3l25
3513a99K16p7Q4J94l19k6K01j40J71j10k18K70N1r9L7r3M2K10j97Nm2q8K71p3
3537G1j28P2m7O7Q8k10j7J56k9P9r8j13K40q7r7M7m9lJ79o6j08J06j93J57m1j21
3563a45K09j04Q0J05o7q3R5n1j16Q3j15J66Qj07J46j45K0J59j72PN8o6J34j08
$$ y = [33, -52, 28, -95, 52, 118, -190, 12, 40, -16, 107, -70, -83, 87, -4, 52, 42, -66, 48, 87, -11, 21, -68, -20, 134, 19, -83, -31, -33, 73, 129, -140, -98, 6, 68, 90, -63, -144, 67, 73, -28, -31, -135, -20, 168, -36, -26, -48, -113, 195, 86, -142, -9, 51, 50, 139, -160, -43, 84, 32, 110, -46, -148, 134, 151, -32, -5, -152, 44, 217, -48, -46, -28, -12, 229, -16, -207, -2, -2, 127, 126, -182, -72, 141, 7, 95, -139, -124, 192, 145, -33, -16, -89, 97, 207, -163, 1, -32, -3, 202, -2, -115, 49, -20, 89, 116, -244, 41, 155, -56, 100, -169, -167, 115, -3, -18, 6, -132, 149, 126, -199, 17, -60, 24, 218, -101, -127, 74, -66, 105, -5, -223, 47, 98, -1, 36, -57, -15, 195, -2, 3, -39, -127, 144, 71, -57, 15, -32, 35, 123, -87, -104, 52, 23, 102, 4, -109, 131, 44, -53, -6, -55, -58, 121, 55, -53, 53, -140, 17, -24, -145, 64, -40, 40, 145, 78, -5, 90, 39, -77, 6, -109, 57, 65, -42, 104, -41, -21, 138, -34, -27, 31, -35, 99, -9]
3587ir9J65o2J6N3j51N2M6k8N8p9J4R2p2p0J04o0MJ22j41N2Q1j98J54l4o2J34
3614H2p9j2J03j34J2Q0j00P7j4n9J34o8o8Q8j28R4K1o0k4P8p9M7M9j27J54k8p9
3641d0J03n3j3Q1j46Q0R2j48J23lj60J41j25Q4N3j30R3J5j05Q2K1j29J75j38%
3666d7J03j08L3R0j52J77j04r4K44j60q1J38j18M2R1j24J30oj65K13q0q3J56j55
3690f0K6J05j52R7M0j59K05o6j34J88j49k5K20k19N2J01j83K03o3j02J70j88R2
3713aR3j99Q8O3j42J64k3j59K28j94J06O5k29J31P3j29J41l5o5J10j09k6J35k09
3737a23J30O4j61J62q1k5P6p1K2R0k17J64l3j03J82j05r5J67n0LL1j08M0O8m6
3762a9M0Jl2M2m5K1O0j01O1L2n4LJ9q8O6K2r9P4r2J08l2lj0Q7l3%j49J56J09k48
$$ y = [-9, -108, 57, -5, 11, 64, -87, -35, 11, -17, 41, -38, -24, 68, -4, -74, 30, -30, -26, 96, -45, 7, 88, -110, 44, 10, -52, 82, 3, -9, 94, -40, -28, 52, -48, 29, 15, -44, 90, 22, -46, 42, -86, 8, 29, -31, -55, 23, -56, -9, 40, -87, 67, 39, -40, 63, 10, -3, 78, -68, 12, 104, -44, 79, 76, -84, 57, -68, 16, 69, -61, 32, 47, -58, 24, 45, -84, 91, -47, -47, 56, -52, -19, 71, -81, 96, -8, -102, 142, -18, -99, 39, -79, -37, 54, -70, 60, 54, -111, 102, 22, -61, 95, -60, -34, 71, -81, 16, 56, -103, 102, 36, -98, 90, -59, -84, 136, -83, -31, 70, -113, 90, 27, -75, 95, -93, -1, 92, -107, -19, 44, -98, 66, 43, -116, 112, -82, 24, 89, -140, -9, 64, -65, 76, 41, -24, 86, -23, -49, 86, -123, 7, 71, -90, 72, -9, -34, 42, -29, -7, 83, -134, 30, -3, -106, 76, -29, -124, 43, -7, -4, 27, -81, -41, 27, -19, 21, 22, -10, 32, -13, 8, 68, -33, 28, 60, 6, 9, 28, -60, 6, 28, -71, 3, -89, 19, -13, -16, -26, 61, 28, 28, -121, 35, 144, -104]
3792a04R7N2j08K01R0n84M69m6L5j32L0j0P1q4j6O1j0k2M0l2qQ2j50O8N5j20J09
3819C4o3o5J56r5K5R9k30J40K0l8O0r1j6J28r2oQ3j20J15k8p7J11n8j0J17j51
3845e2L8R6r4J4Jj08J35m3RK6p4K7P4o6N6o9p3J68n7k1k4q5P5J08j79J20k9JL7
3874A1jn5P7l2K6Lp6N5L9j3l1j6n4R4m3l2j7N5L8L3q4lK0Q1k9r4%N0J8l7j3j9
3906d9J01K3q3q0L5R0l7M6q2j2J15m6M1j42LJ12L1p5nk7P1K4m6J9j3OJ1L9j61
3935i1J02L1q%j18R5L1l5K6j06L7J20m4m4K9j7K7K4j39P6K3l2J01j85L7M4L3O5
3963H2j09l8M7L4J6oq6O1J04j20M5m5MP7l1q2M1j5K3M9j58Q2K9rO2n9j03J79m9
3992B5j0JOl8M4r5M9k1L6M8o9o5J05J1j2M9j30N0K5m9M6j3oO5n5pK8l0O5l2o7
$$ y = [-104, -7, 45, -63, 138, 228, -356, 113, 67, 102, -30, 0, -10, 61, -23, -39, 22, 12, -10, 30, -2, -10, 72, -78, -10, 45, -75, 34, -29, -94, 62, -33, -8, 91, -139, 1, 21, -17, 43, -48, -64, 64, -28, -34, 49, -71, 44, 16, -61, 50, -8, -18, 99, -52, -14, 82, -12, 2, 3, -105, 30, -13, -4, 22, -52, -25, 49, -17, 39, -30, -103, 65, 8, -13, -37, -122, -47, 61, -118, 2, -27, -26, 11, 10, -45, 32, 0, 26, 29, -47, 8, 47, 34, 3, -13, -67, 27, -16, -48, -65, -10, 28, 61, -23, -26, -6, 75, 46, -48, -48, 2, 20, -17, -30, -49, 52, 75, -8, -88, -53, 37, 0, 46, -36, -48, 67, 21, 62, -80, -77, 35, 66, -9, -14, -41, 30, 54, 8, 27, 14, 20, 31, 70, -91, 11, 42, 34, 34, -84, 11, 42, 7, 33, -73, -36, 84, 40, -4, 25, 8, 35, 59, -80, -4, 19, -13, 88, -97, -60, -16, 17, 82, -27, -65, -18, 16, 32, 26, -60, 1, 105, -15, 30, -15, -11, 66, 35, -47, -6, -21, 2, 51, -107, -25, 4, -5, 57, -2, -105, 74, 25, 15, 16, 22, -16, 28, -67, -18, -39, -3, 45, -24, -89, 16, 27, 15, 64, -66, -16, 9, -40, 6, -7, -13, 52, -3, -10, 18, -12, 53, 21, -46]
4023d6O2j8k1K8K0o7qL0N0Nr2R6Lq4K1j8L7Mj8j5j5O2N0m4p4Q3J8q1L6m0mM7L7
4056D4n7o3KN8K9j1R0j05k1J25j36m8J3K15k14L4J12j70jJ12P4j73J70j24M06
4081C61l44M6j31Q7J7J22n6l38M4K93Q9k18K78m81K51n4j71L08k03J77k37j75
4103c35L30o2j09J25L6j73K88k72M4p0O6n5k68K29M92m79n2L56l0l18L13J95L
4126B54j78K6k04J12j2O0k08JJ97p0k27K66j21J29p7J22J58l41K6O3P6j03j83
4149b34L89j58J2j14J61j63j92J56J99j45J64o6J94k67N5O3J19j64Lq3J75K75
4171C79j41r6j94K53l1n2O2k74J79j12K93o8O9m18J17J97l7m74Q3K78K7J51o2
4194A29j03l90N24Q8j40k84O7J37n3J63k68R7K02j86O7O1j64J01M8j82QJ09j01
$$ y = [-46, 16, -2, -23, 5, 25, -42, -50, -20, 30, 35, -57, 39, 42, -42, -21, -39, -2, 2, -16, -31, -46, 16, 66, 22, -52, 31, 49, -32, 4, -36, -40, 7, 44, -13, -76, -74, -16, 13, 2, 92, -13, -34, 91, -45, -93, -80, 135, -79, -45, 67, -103, -104, 8, 82, -91, 79, -45, 361, 17, 63, -68, 19, 36, 158, 102, -236, -192, 101, 190, -28, 250, -231, 20, -34, -205, 103, -100, 77, -160, -335, -5, -67, -176, -51, -15, -188, 100, -172, -128, -198, -132, -187, -455, -226, 266, -213, -265, 91, 61, -257, 56, 251, 254, 76, 102, -102, 10, -2, 58, -150, -149, 48, -22, -249, 17, -104, 25, -52, 70, 228, -113, -87, -24, 52, -51, -234, 155, -3, 9, -105, 56, -107, -299, -143, 56, -89, 75, 9, 203, -64, -9, 54, 173, 9, 12, -71, 104, 379, 238, 142, -52, 201, 170, 118, 180, -94, 85, -27, 266, 198, 267, -151, -34, 163, 126, -348, -265, 13, 40, 191, 129, 26, -364, 160, 248, 108, -176, -109, 28, -25, 138, -130, -33, 169, -17, 50, 111, -53, 48, 96, -86, -78, 31, -70]
4217g0J17m0J7N2j01j2L6k0k2J15p0q5J62o5K3q0L5rM6p9P3m4K0j1kN1p0m3J43
4246F7j51P6N5r1K3Q1j57J62r8J15o2m5OQ9l1m6L8r5M8M7Mm8K6l8O7j12M7K8L1
4275C6q1N0j2l5Q9j03QK5j9L1L2j2J7n2j1J03q9kL7l0M3m6P9J4q1M9Jl8K3mk3
4306aj9n1M1O5j17J10k5J9n6J10j09N9L1m3ol8o7J61m5J0j32Q6R3k05J27L4pJ2
4334C7M0P0j01q6q8J12o3K1M6q7M9P0j52J45j03K33j31J3J10mm06K05n3P0R7q0
4360c6K81k49J82k7k45R1M8l94K84j14L30o9j11K92mn56K76Q2R5O7j05m68P41
4383C91k96j24q6J01k89R6M98j61o4j76J04m11P03k94O4j29L7J2q9R7K9j00q2
4406a69R8L5j63J10J27j31J74o8K2NoOj4l3rk1O3j02J18k7n0n6J66k1j12O5K5
$$ y = [-70, 47, 7, 24, 76, -25, -37, -1, -21, -43, 72, 2, -83, 79, 14, 37, -43, -8, -17, 29, -50, 23, -21, -1, -12, -14, 37, -33, -76, 67, -84, -8, 47, -44, -21, 60, -97, 65, -33, 82, 20, -25, -19, 70, 39, -7, 31, -64, -16, 31, 35, -13, 13, -25, 42, -70, -23, 5, 36, -45, 5, -7, -42, 47, -56, -48, -23, -42, -11, 21, 9, 26, -26, -37, 66, -23, -25, 12, -18, 25, -21, 58, 72, -9, 40, 41, 3, 26, 22, -1, -20, -71, -30, 35, -82, 28, 3, 22, -34, 76, -33, 26, 57, 14, 8, -30, -97, 64, 19, 29, -103, -17, 76, -129, -2, 32, 25, 37, 77, 147, 46, -40, -128, -16, -79, -58, -12, -99, -50, 20, -132, 13, -90, 143, 12, 25, 135, 131, -275, -70, -123, -53, 44, -36, 245, -4, 178, 151, -94, -3, 45, -349, -65, -179, 151, 82, -29, 263, 259, -297, -21, 61, 156, 223, 118, -350, 391, 95, -29, -115, -14, -303, -207, 291, 130, 66, -110, -6, -417, 286, -8, 56, -73, -36, -24, -113, -16, 13, -87, -169, -71, -36, -199, -89, 38, -93, 81, 13, 35, 40, 34, 40, 26, -7, -16, -37, 26, -76, 42, 15, -35, -91, 75, 54, -58, 7, 32]
4433C2k0n1%j5pn7J73m3Lo8J43k7l0K3q4K0k7LK7M8m1kL5n6l1Q2M7q5K5L6Rll3
4466B6l3j3mO2k3m4N7pr0PR7m9J7n3J6K2j6J2M9j6jj3K5p7O1j4JL2j9j8L3j0R
4499B6m0j1L2l8P5q1K2j4L3l2M8l3j2l4N9ok4l8J00o4N4jl8k6P4L4q2j2L5L9k6
4530A9J6oj0m7M3l7R1p4Mj0L9k9L4r7J31q9L5o8P4j4%j2mK7j1j3J3n5PL7l8N5
4562A1L2j04Q5m1K8K7j04P7m8k1O6Ql2N3J4n0j3K6pkl0M9mj0l4K4j2M1m4Pn0M1
4594a7J0Nl6N3J7q0R6q4K8pO2m0J4Nj2j3ml3K2J4Qk4M0l0N4o0K0o2qR9k4O2q2
4627gJ6n0K1J4M6m4K6k1L5m2LL9o5M8m5L0J1M9p7J4Pqj6j1K3j7M7rj8J1mJ3k0
4660an5M5lRRk6K6K0o0M5N3o5Kj3%O6o1k2N7m5m0Q6j2j5j5PM5Jj1j4k1M1lm7K9
$$ y = [32, 12, -39, -39, -54, -61, -118, 55, 12, 15, -53, 90, 63, 33, 56, -28, -8, -35, -32, -5, 43, 2, 0, 35, -21, -52, 30, 77, -8, 17, 53, 62, 59, 26, -7, -20, -24, 38, 15, -29, 28, 21, -69, -62, 35, -14, 3, -50, -34, -12, -28, -16, 33, 17, 16, 3, 28, -49, 12, -2, -1, 31, 12, -6, 27, 17, 26, -14, -25, 7, -31, 44, -37, -15, -29, 4, -28, 20, -13, -25, -59, 0, -6, -30, -68, 32, -32, 22, 21, -17, -43, 31, 65, -17, -29, 6, 45, 19, 35, 29, 19, -28, 15, -22, 69, -5, -1, -11, 28, -1, 33, -64, 67, -22, 13, -55, 19, 5, 5, -7, -11, 16, 5, -8, 5, -50, -43, -6, -44, 11, 43, -61, 24, -17, 11, 38, -66, 11, -37, -58, 8, 16, -16, 37, 51, 1, -12, 14, 7, 5, -25, 24, 20, 10, -24, 0, -12, 29, -15, -8, -58, -17, -7, -2, -38, 15, 32, -48, 48, -36, -8, -15, 47, 7, 21, 26, 14, 1, -3, -36, -14, 0, 8, -16, 24, -6, 48, -12, 8, -54, -62, 37, 13, 75, -7, 9, -41, -20, -6, 40, -4, 22, 1, 36, -6, -3, 36, -29, 19, -26, 4, 15, 64, -13, 1, 8, 0, -16, -27, -4, -21, 26, 17, -1, 10, 6, 19, -1, -56, -11, -14, -5, 4, -22, 4, 24, -36, 9, 62, -3, -1, -14, -14, 52, -9, -31, 26, -19, -59, 27, 15, 0, -15, -8, 37, 38, 27, 13, -8, 33, 30, -17, 12]
4695A2m0J4LM7j9k5K7M2r8N3k0j5J6J1k4QN2j01P4o1J4P8l8l6PK1m1K6K2k2N7
4726D4r0M8kML3l9J7k8k2O3K4o8O0r0M1L2j1OkMk3J1l9L1J6n5R0l0J5l3rJ0Lj
4760A0k8kQj3N4j7KK8kj5n9L0M7j4nk6M1j0k5Lqj7O3ln3L3k1Jn3P5l7PN1l8J6
4795B3Rn3R6o8o2M9j2Nj8RL3J6m5lN1o0Q1o8J3Nn1P9pl4K4m0P1k4j4k2J4KJ5l3
4829a9k2L2N6m2l0J03p6Qn8L5l8N3qj7m6R3kj2j3l8QN8J8o6rJ0L7nJ9o5L6N3p0
4862a7l6L0L3J6n4rk1P2J8K1j8j2l0KJ2j1lRK1K4m8oj4Q2n5rl7N0K2o3J1J4PP
4896HK6Pl8%l0Q2k5%qL8p6jK3mmJ4k1j7K9j2J3p8J9P0p2O3r3Q6N0l3%j0n2R1j1
4931C4J2n1n6J5J12j40Q6J1N1Mj39O7N4qM8k16J36o5j45N5J79P9p6j1j48J84j33
$$ y = [12, -28, -14, -11, 36, 17, -8, 19, 61, -37, 16, -4, -19, -3, 8, -16, -8, 44, -57, 17, -44, -30, 48, 10, -26, -19, 2, -39, -13, 9, -13, 44, -46, 2, 0, 4, 37, -2, 15, -13, -35, 28, 52, -16, 44, -46, -5, 27, 16, 22, 20, 24, 1, 12, -27, 4, 20, -35, 55, 25, 40, 7, -2, 8, 11, 10, -18, -20, -12, -25, 29, 12, 14, 42, 40, 25, -34, -4, 43, 29, 24, -2, 39, 29, 4, 7, -1, -18, 45, 42, -11, 22, 1, 2, -51, 24, -13, -6, 45, 7, 23, 32, -21, 75, 7, -55, -6, -18, -13, -31, -22, 11, 27, -18, -21, 30, -30, 51, -17, -4, 1, -50, 29, 22, -12, 12, -28, 43, 19, 5, -17, -3, -1, 14, -19, -41, -9, 47, 5, -25, 78, 2, 10, -48, -13, -51, 2, -6, -23, -69, 24, 22, 10, -3, -41, -33, 25, 43, -23, -32, -22, 15, 10, 29, -36, 0, 53, -17, -53, -23, 10, 26, -28, -37, -58, 14, 32, 53, 35, 23, -7, -5, 7, -4, -7, 2, 23, 47, -1, -7, -21, 61, 6, -3, -40, 10, 32, -31, -20, -6, 1, 8, 34, 41, 3, 3, -27, 55, 30, 30, 22, 60, -16, -17, 6, 2, -2, 12, -9, -26, 3, -9, 4, -74, -55, 15, -57, 6, -87, -1, 49, 16, 16, 6, -46, 45, 34, 46, -5, -61, -46, 66, -74, 12, 23, 74, 78, -61, 6, 60, 52, 100, -116, 20, -45, -190, -135, 44, 123, 47, 36, -112, 72, -61]
4958f1m2Kk5J68J49k0j56J18j29M4p0J49k27J59O0j98j8J64n2j96ljJ56M3j95
4983a81J92J46j58j0j48J12K92j48N4r5O5o9q6J86l20J72j94K97K89n96N56m62
5005a06J93K5l49K02Pj52R2L17K1J7m97J68j65L13j33k39J30M60j22k96J82J08
5027A76l00J04k1J69j49L6OO9j13L0j8L4J37n7p3o9j9J2J3qO8o2R9j03Q1j0k7
5054EJ2J6j7K2n9JPM8l3K7K2k5J1k7n1N1j7J9m2M2j0j5k6K1J5LJ3Kk9OOK2n1J5
5088a6O5n3PKL0m3j1L3j3K4k7RK0l9J6J7k9j4N0Pp7K9J6J7j8%L8o3O9l8L1j4j5
5121A0q4J39j40Q2n4O6M9j53j5J60rJ3pm7Q5j21L2k2Q8l6rl6K9K0K9n8Kp0Q6m0
5151a1K5%k7L8Lp0J8O9k0k3%j0n0O4j7M4L0o2K6m0L9l0M3l8K8j1l0M2j8L4n4L6
$$ y = [-61, -103, -101, -126, 42, 191, 171, 15, 133, 4, 48, -22, 127, -100, 59, 119, -79, -97, 67, 15, -181, -184, -185, -29, 14, -181, 11, 157, -1, -11, -159, -47, 245, 97, 151, 56, 121, 52, -34, 152, -168, 4, -190, 107, 396, -200, 356, -106, 87, 112, -237, -35, -28, -180, -88, 229, 250, 267, -230, -62, -227, 86, -47, -286, -156, 304, 182, -114, 68, 176, -124, -20, -41, 128, -21, 15, 21, 90, -23, 7, -11, 23, 160, 103, 30, -39, -58, -46, -33, -41, 27, -35, 64, -39, 42, 32, 5, 17, 33, 16, 38, -21, -20, -13, 35, 2, 29, 51, 26, 37, 10, -41, 10, -7, 12, -30, 12, 2, -13, -39, -18, -3, 0, 13, 15, -14, -8, -2, 20, -31, -16, 49, -4, 3, 5, 35, -8, -19, 14, 1, 25, -2, 7, 27, -12, 4, 21, -8, -22, 28, 35, -42, -13, 3, 20, 2, 2, 40, -23, 46, 8, 39, 25, 10, -74, 65, -75, 7, -47, 19, 68, -85, -100, 60, 51, 64, 57, 10, 95, -26, 6, -16, 72, 36, 27, -9, 20, 40, 69, 11, 13, -57, 29, -11, 14, 14, -13, 25, 28, -42, -24, 45, 25, 2, 2, -8, -58, 6, -11, 33, 63, 1, 27, -13, 26, -4, 39, 1, 29, 18, -12, 30, 12, 46, -8, 28]
5183B8l0J6j4J6pn5L9QJ7j3k5k4LK4l2P4j0L0m1n2L7K9nq1O2K7j3k6M0k2jK5K9
5216E3j4l4mLJ2NK3k6k5M5k7j6N6mm7m4Q1ol7K4l0nM2l8K1J6Kj1o5K0J4K6J9k2
5250Go8R2j3o1P4ml0JK7p1O0k2p%J8LJlJ2o%j5K4lJ3J9o0j0N3k0m1QmRKO5j2l9
5288aM6Ok5k0J3K5k2n0K9LKQPm5L9oLJ1n1L4j3J7qk2N5m3M0J1n5J0J6k4K6qK6
5323C4l6J1l3N5l4K4m3N1p5J2M6k8M7k4j2Qm9N6k1lM4k3k7k6J5O1m0q2J94r9l4
5354c1M5M1j18N0p8j19M48l84N7J02R5r4k00K68j02M14m71N8J98K6k14o2j17J67
5378b1M6J78k49P2O5p3K1j86K84J4k06r6K33j50O5nn0J02k9OM7k50L7K20j66J83
5404I2j72J79o3N5nj01qk8N6J9o9J29j47nj24J62o8KJ75k83K18o4J54j27k5J64
$$ y = [28, -2, 14, 0, 16, 9, -46, -7, 1, 18, 5, -20, -44, -41, -17, -49, 25, 15, 45, 4, -48, -11, 18, 13, -68, -6, 21, 8, -18, 22, 0, -1, 24, 53, 39, 5, 1, 4, 16, 21, 44, 18, -7, 38, 11, -5, 51, 47, 0, -44, 37, 31, -6, 18, -12, -17, 25, -13, 8, 24, 26, 15, -50, -30, -16, 10, 29, 7, -61, 31, 18, -43, 31, 27, -3, -2, 25, -46, 14, -8, -15, -15, 3, 6, 7, 4, 16, 10, 10, -5, 19, 16, 29, 48, -12, -22, 31, 11, -30, -22, -26, -17, -15, 50, 38, -1, 45, 51, 26, 6, 19, 44, 22, -28, 1, 4, 6, 14, 21, -24, 15, 9, 12, 23, -28, 6, -7, 10, 2, -20, 35, -8, 32, 43, -12, -2, 14, -10, 16, 8, 34, -2, 9, -24, 31, -3, 21, -22, 29, -46, -34, 12, -16, 31, 7, -5, 3, -46, 10, -11, -14, 30, 7, -20, -46, -31, 30, -10, -92, 102, 3, -31, 14, 55, -63, -13, -91, -210, 238, -146, -89, 13, 108, 14, -186, 82, -20, 394, -77, -19, 179, 205, -9, -71, -188, -21, 25, 203, -46, 26, 91, 18, 39, -147, 137, 151, -55, -151, 82, -68, -3, -8, -58, 44, 15, 21, 68, -182, -145, 75, -91, 92, -80, 99, 36, 91, 86, -15, -23, -51, 5, 24, -45, 84, -63, -68, -192, -30, -98, -96, 79, -204, 14, -50, 104, -23, -48, 116]
5430A16k62J71j37K7J67O5l8j24J90j64J65k62K59k36O8R6j11L9l1P1o3P4q1J30
5454A29o8o8L3m1J6L5o5K0j2L7K2l6%K0k1oj0Qo0J38n4rk8M9j8j5N3o0O7J1l4
5485C3oM4r3Rjl0J26r8R3l6O5j52N0q0J71j0j6m0j36J7J49j06JJO8NJ4l9K0K9
5515E2n6L0m7K2rm0K5R6l7N4n7k7L2m0K2L4m0qK2Jp1K0J3J4j6J1NJ01n9l9j2K7
5547B3L1n1oK0j0l0M8l6K8j5m1K1RO6l0l2l7L4M7m3lO8o2m5M9J4J8l1J0k3M2m1
5579hj2L8M5o2J7Rm2j5O0Rj4j4j8N1l7O6o7K0j1K9l2J7n8M4k0j0L8OKJ8Pm8k2
5612a4K4rK6m3K1J%K1j3%rl9P5o1l4O5l5J8J0j6j6J8l3L1J7o0O3nl3K3oK6j3P
5646GJ7k1lj5mM8l0M1k7LJ0j4l7L6k5QL8m3K1k2pO4rnM7j06N7j5K0p5KM6j5J9
$$ y = [116, -146, 25, -112, -85, 82, 147, 109, -15, 175, 11, 176, -86, 173, -63, 5, 101, -10, 29, -2, 69, 6, 80, -1, 129, 61, -7, 26, -15, 1, 36, -29, -9, -21, 16, 38, 2, 2, 22, 1, -5, -15, -7, -67, 71, 17, 8, -20, 29, 11, -4, 49, -11, 56, 67, 33, 27, 71, -22, -13, -14, -44, 82, -16, 77, 41, 106, -46, 4, -76, 95, 85, 69, 29, -107, -90, 59, -47, -46, -45, 23, 28, 42, 3, 23, 52, -4, 26, -21, 1, -8, -48, -23, 73, 36, 90, 33, 6, 38, -2, 20, 54, 14, 6, 28, 29, -42, -22, -9, 5, -11, 0, 5, 106, 47, 8, -4, 23, 54, 3, -3, 17, 7, -23, 25, -11, 17, 2, -39, -18, -9, 57, 27, -5, -42, -8, 39, -4, -7, 61, -1, -46, 3, 17, 35, 4, 14, -9, 33, -8, -20, 18, 63, 1, 18, 27, -15, -30, 30, 39, 25, 11, -7, 44, 7, 73, 6, 26, 15, 44, 12, 29, -29, 15, -5, -15, 23, 29, 31, 49, 56, 8, -14, 10, 1, 27, -16, 5, 6, 6, 27, 14, 14, 5, -34, 41, -20, -54, 11, -24, -6, 4, -12, -28, -10, -43, -12, 5, -55, 8, 3, -30, -7, -13, 13, 0, 7, 24, 3, 0, -15, -19, 29, -1, 40, 13, 16, 26, 12, -25, 11, -14, -6, 32, -11, 10, -12, -19, 45, 36, 31, 78, -28, 29, 14, 34, -41, -39, 7, -8, 11]
5680A1n6oJ22j7m4l4J0K3l3K6n2P0l5N2j1j6mrK8MJn1M6oj7K5m6L9o9nL5j3k3
5713e5K5J2l3O7l3J5N2o1o1J13Kn1J6J0l3N1m1L8o2N8n2J3M6m2M4j7M5m3L9k8
5743C4n5J7jM3j12P3K4m0qk6P1j0j4M6o4L6RK0n7jJ3n6L1RK9Pk4J4M2m3J0k3J9
5776A3m2P6l5K3o0L6k0L6o2L1L9k8p4O1k7L8Kp8N5o3J38r8K4j4L0lM4K8r6l2J01
5807D3j6K3P0j90Q5o9J33J30k51Q6r3Q4rmj58J77L6R4p6M0j16J67m09M28l96L95
5833B04j29pk51K18j90j02o5K28K09k10O4j92K67l11K34R7jk16J79n2N3J1ml9
5857ej4J4K8k8jqL6m5L1j6l2N3m9K8%m5K1M5l1L0K6r6P2o5K7L7Nn0P7r0P3m2K2
5890HJ9JJ0l0j6K8%j5M3q3Q8p9K9L4k2L8k6Ln4m0J05l7L6M0j21O5Oj4mm3N4m1
$$ y = [11, -45, -51, 71, 54, 10, -24, -14, 9, -24, 2, -50, 20, -15, 37, 26, 10, 6, -3, 25, 29, 30, -21, 25, 19, 2, 27, -19, 20, -49, -54, -19, -32, -55, -30, -18, -51, 16, -17, -2, 50, -11, -72, 41, 43, -8, 8, 18, -15, 36, -5, 33, -29, 29, -23, -10, 36, -6, 38, 21, 66, 23, 62, 34, -21, -4, -5, 38, -74, -1, 23, -17, -25, -51, 20, 10, -4, 42, -22, 14, 23, 43, -14, -15, -2, -58, -27, -18, 11, 18, -6, 8, 50, 7, 17, -6, 13, -29, 47, 12, 35, -25, 11, -9, 27, -35, -4, 35, 7, -67, -6, -33, 5, 7, -71, -16, -79, 59, -39, -15, -29, 1, -2, 42, 70, -26, -58, 43, 27, 50, 120, -70, 15, -54, 79, 209, -42, 44, -49, 35, 26, 22, -136, 41, 77, 171, 95, 135, 19, 186, -223, 205, -191, 204, 75, 68, -183, 35, -155, -257, -322, -94, 115, -95, -31, -223, 44, -267, -33, 64, 63, -153, 26, -26, 27, 38, 34, -5, -19, -5, 23, -5, -6, -14, 22, -23, 8, -8, -40, 13, -36, -8, -8, -53, -32, 13, -18, 12, 38, -58, 14, -51, -24, 13, 18, -32, 45, -45, 28, -14, 8, 27, 28, 38, 8, -8, 20, 20, 5, 48, -35, 53, -26, 3, 37, 15, 53, 27, 30, -24, -64, 41, 4, 40, 80, -41, 24, 30, 16, 12, -31, 23, -18]
5922a8%j5K8k0N5%k9J7J8m5L8pn1M3k8j7qO0m0M8l1OL5m5K3j5QNk8k0M1l7K9j9
5956a9M3m6P5q3jQ1q7J5JJ4J4j1M8j3m8J6qJ9J8l4L8p2J0L8JM2j6On4J4j6mJ6
5989cN1j9l1K8pk8j0J5l9L3K7K8k5k4j4j6lk5Q0nK4l1k7kK5m7P5k8j2M8l2k0N
6022iNQJ1l6N6k0l2N6k8Mln0k4O6l4J4L8NJ7n2M1m7J9Lj6J9K1q1Q2l7m6Q5M0r1
6056a6P2J15k94j20K28L5j9l64L34r5QK7L5O1j09J95j94M81n42L80l86J2J80J10
6080A34P3l89j59M09k30O3K1J35j29P9k11N35j1n27O13m41K45j92Q5o10N28j92
6102a71M74m44q3L64m8m7j02L6j40o8M77m34L39Q1k77K18k26j49N2%J09j35j01
6125b75K45K1j50L9kK27j68K93j05j74k03K62L06k28K4j77K5q4L43k27k73L41
$$ y = [-18, -18, -33, -5, -25, 30, 30, 1, 18, 36, -9, 29, 22, -29, 14, -14, -31, -39, 21, -19, 29, -2, 4, 39, -6, 17, 2, 10, 15, -13, -33, 8, -29, 0, -19, 24, -22, 53, -30, -31, 50, -37, -22, -21, -7, 7, -4, 44, 31, -17, -1, -9, 10, 28, -6, 32, -40, -30, 8, 9, 51, 35, 41, -13, 1, -15, -19, -3, 48, 29, -2, 26, 19, -9, -19, -4, -43, -10, 17, 45, 20, -4, -18, -34, -37, -62, 18, 13, 37, 6, -21, -23, 2, -45, 30, 2, -10, 38, 6, -14, -9, -4, 4, 15, -21, 35, 15, -17, 39, 11, 15, 12, -38, -62, 4, -30, -16, 22, 27, 44, -8, 33, -14, 5, 8, -8, 11, 32, -49, 33, -4, -50, 35, 75, -16, 56, 171, -123, -243, -15, 20, 1, -363, -29, -124, -116, -89, -54, 7, -102, 93, -101, 380, -162, 218, -168, -156, 24, 134, 207, -182, -341, 68, -162, -99, -78, 57, -72, 7, -204, 331, 320, -207, 406, -35, 210, 18, 103, -507, 21, -171, 303, -141, -224, 140, 92, 45, -57, -21, -161, -229, 248, -186, 153, 234, -43, 175, -51, -200, -148, -148, -39, -174, -275, -30, -9, -159, -120, -122, 105, -63, 230, 125, -49, -252, 10, 316, 88, 112, -65, -40, -124, 219, -8, -281, 60]
6147F0P6m48O94j08n62K25j4L60j59R5l48J65j94J97p4J63j10l21N37r2o1qJ10
6170A83l61L43J0j82M2m5P7N4O2l14J56J07o8N6k49R8J56M7p5j29R5k3m7O3J30
6195A86j57R0j66K4j24J78K5j74J10J31j11P2r0j12J10k8K8P9j31P7n3J57j49
6218b8J23n0or0Q6n6R3n8n0%J34r3qp1J26%j38K33j89r5K28l8K12k96K51l2m75
6245b87J62l02L20J23L05o23L01J21l19L49j96j15J13J57k63J23K5M3K19k16K4
6266F4N1j54l7J24l45M99m4k27N4j7J61k97R5K34j25N6j33J3J45j56j54K03J98
6289B08J9k46kK48k16j09J88J73j77o46P10k25K97j20k5Q3l96l6O7J30K73k45
6311d7L7o9J39L1j13M3l2Rjn0J2NP8q2N3k3%o9R1j9L1j2pj9M5l6Qm5M7J7K9m7
$$ y = [60, 136, -312, 382, 274, -288, -63, -77, 283, 124, 219, -129, 36, -158, 39, -35, 128, 18, -303, 234, 142, 81, 73, 183, -178, 165, 175, -7, 35, -10, 67, 121, 183, -131, 25, 132, 64, 120, -129, -31, 125, 172, 97, -32, 63, 40, -7, 56, 186, 29, 119, -47, -23, -147, 31, 56, -118, -8, 123, 12, 84, -6, -118, -8, -36, -8, 71, -60, 17, -36, 121, -28, 95, 45, 39, -51, 35, -21, 72, 14, -36, -36, 98, 5, -3, -74, 52, 52, -86, 147, -42, -137, 91, 53, 265, -31, 220, 188, -287, -125, -427, -107, 16, 321, -302, -1, 120, -199, 150, -46, -161, -48, 109, -154, -31, -6, 37, 256, 40, 64, 115, -39, -76, 48, -297, 202, 158, -69, -15, -32, 129, -168, -73, 161, 36, 92, -41, -28, 117, -39, -193, 10, 208, 227, -19, -21, 227, 11, -98, 90, 263, 86, -560, 150, -75, 222, 102, 77, 160, -236, -272, -205, -75, 198, -47, -10, -79, 60, 91, -22, 21, -11, -2, -3, -53, -41, -36, 42, -40, 13, -10, -10, -79, 12, -7, 24, 12, 5, -14, 31, -5, 3, -42, 5, 22, 51, 4]
6343Dk6M2jo5J02j70j1R5K12j56J31o9j86nP4j5m2j63K54R1l73L00m8l9n9K91
6369A68k61O7Mp1J08j06J6M8M2j07J69R6j23K6m4q9P0J2n8j21J88LK8L6l1o9Q6
6396H7m0l8J04j14J51L5j23o5N1o3lJ5j9P6l5Mjm8J4J2l7J05j47J9J51j15O0O
6424D2k6Ook2M1o3L1J7J5m5M9j6l4QJ9n3O9n4N2j1m5lJ3jJ0k6J18q4l2J11pj86
6456a13J43m3J59j86J75l30J93l0N0O5R3r5k95K25N0l74J70L57J5l24r0Q1j02
6479b06L42l1j15N8n4J8J59k00J12j40O9R1j67L1j3J08j35J54j23J14m0Q1n5N0
6503A08p5J2Lr8J84n0l2k0o3QJ9NK6l8L6j8j9%J8K5k2o3J7L4pP1n7jj4k9N5k7
6535a2J7PL8l4M2m0k1M9ok5L9j4p5N5j4j0NL3L1m4K4l6jOj7L1l7M2j5m0j9J7l8
$$ y = [4, -22, 20, 19, -46, 56, -114, -125, -30, 182, 26, 157, 88, -98, -103, -29, -44, -86, -249, 5, 96, -277, 23, -25, -64, -123, 168, -93, -26, -22, -93, 15, -91, -75, -27, 15, -92, 77, 173, 50, 76, 32, -57, 13, 25, -33, -154, 34, 37, 65, 101, 70, 1, 87, 47, 9, 113, -1, 150, 185, 62, -3, 48, -15, -18, -3, -22, 54, 19, 23, 22, -26, -12, 0, -37, 68, -79, -60, 91, -24, 36, 42, 16, 22, 16, -6, 35, -28, 3, 20, 35, -10, 39, 23, -11, -3, 16, -37, 32, -22, 30, 19, -26, -29, -16, -17, -7, -33, 85, 1, -31, 80, 73, -113, 30, -13, 146, -40, 135, -195, -2, -32, 18, 83, 176, 81, -214, 11, 61, -313, -143, 214, 229, -95, -185, -104, -206, 136, 105, -10, 48, -6, 12, 171, -29, 83, -57, 12, 103, -64, -33, -46, 62, -73, 81, -42, 72, 32, 113, 58, 108, 33, 45, 48, -50, 134, 84, 52, 32, -31, -23, -4, 1, 27, -11, 25, 7, -12, -12, 6, 31, 9, -54, -37, -3, -10, 61, 4, 3, -11, -40, 15, -12, 5, 12, 50, 16, 58, 18, -3, 46, 40, 15, 54, 40, -35, 20, 6, -4, 1, 34, 65, 21, 45, 9, 8, 14, -3, 28, -9, 33, 18, -22, -41, -24, -62]
6568f2P0N5o8j4N7l2j4N3l3M1l1l6L2JL2q4l3J12m2MM9lo7QJ2L5m6O9j03M5J8
6599B5m2k3P1l1rJ1K9l8J2JJ4l2k0O5l0L4l5Rl9qL5K9o2K5M1O8j04L5k8j5J0M2
6631D0o5jN7l7%P3n2n2J7QjN2o4M6nq1J1P0J6nn4K3O1n8j7O3m6j4M1k1j0j4N7
6664C8l5L3m1kQ4p4Jj7J0J4J5k2j1Mk4Q0q5M6j9MOm0O1o7pK3k9J4NK7K7qoQl5
6699b2J2oN1q2N6k7O5k9k5J2j1KJ9j5J1MK8m3lm8P3l8PM2rK2pL4m2m1p2R0k9Q9
6733F8j26J40m3m3K9l0M7J5n2L3n7RO0n9J3qN8n4J3K5j4n8o0m3N7K5mN6n7QM5
6764gK5K9m1J2l1j2k6J03j51J16O1o8L0j3o7QN4K0m9L6j7Q9q5K8l6k7J0l5M8k0
6794a6k0K9M9k3K3n8M5k6l4L4j5mJ1O5o8NL7o7N5k9JpPJ2j9J7RM2k3j4J2j4j3
$$ y = [-62, 8, 63, -5, -19, 38, 6, -8, 45, 12, 53, 22, -14, 18, 19, 51, -33, -66, 46, 4, 8, 57, 54, -13, -5, 7, 42, -4, 65, -38, 7, 25, -17, -40, 31, 0, -9, 2, 31, -7, 5, 6, 20, -12, -32, 33, 3, 37, 2, 11, -28, -36, -1, 28, -34, -9, 32, 100, -4, 31, 3, -12, -2, 40, -25, -26, 31, -6, -6, 67, 15, -37, -20, -12, -13, 39, -25, 21, 16, -65, -54, 16, 32, 27, -27, -4, 57, -1, -18, 45, -1, -15, 26, 5, -5, -19, 38, 3, 36, -5, -7, 77, 3, 4, -13, -3, 11, 26, 4, -7, -3, -27, 53, -32, 14, -5, -1, 5, -35, 26, -41, -48, -25, -54, -40, -35, -8, 19, 11, 5, 13, -22, -10, -16, 35, -47, 9, -18, 47, 18, -7, 5, -6, -4, 15, 0, 11, 15, 43, 0, -3, -51, 22, -16, -9, 33, 24, 46, 39, 73, 31, -10, -82, 8, -21, 68, -58, 82, 39, -4, 25, -5, 42, 57, 5, 38, -19, -10, 50, -9, 4, -4, 54, 0, 13, 38, 24, -34, -94, -137, -80, -55, -59, -3, -60, -52, -7, 18, 47, 6, 18, -13, -25, -51, 52, -99, 17, 78, 10, 40, 27, -40, -32, 22, 42, -7, 29, 12, 101, 16, 44, 8, -19, -9, -44, 4, -16, -36, -7, 42, 19, 42, -16, 29, 3, -31, 3, -12, -16, -5, 60, -8, -3, 34, -33, 22, -7, -6, -13, -6, 6, -13, 4, 13, 55, 32, 18, 30, 16, 3]
6827CO4n8J4l2KjPj7N4o0k0R0k4J0rPl4l8N7j4K6kl3k2L7k7N4l5oJ0l7M1L1K4
6861F2l6m7L2j5K1k4k9J3JL0m6ON5k3k5O0m7Qk4K0M7p5R9n8J5rmj7k4M5k5N0K9
6894F5o1j5j4L0RM0m0l2N5l0k1L9o0O6kJ5j1k5n1P5pk2M4k3l5JLj2N4l6j5PL1
6927B2j2o3O1o8M3RL2o9M0jk0K2P2k9l7lP9p7M0l8J5k6N6o5P4l2K4j8k8j5L5k8
6959ej2K3m8J9M2q%M5m8J3%L1p1j4N3OQJ5%p7L8Qm7M1M2n6k4K8k2M8m7J4pN9o0
6994a3K8knl7O2m2K1j7m7N1N3r1O0j9K1nK4o0k9O3Pk5M1k1J4j2J0l6N3n2Q6n0
7026C1m5L0K1n2Nj6PK4Qk7Q4j20P1j4m1N2N9m8j9k0J6Jl0J6k0L1M5n0k7O3Pk0
7058B2n5M8K3l2K0K1m1K8j2j3m5K1K6mL8n1Opm1K0N6r3N6lK2j7Rk9k5P8n4K9J7
$$ y = [3, 67, 9, 23, -9, -7, -8, -1, -18, 36, -24, -44, 46, 22, 32, 23, 30, -4, -42, 15, 1, 27, 25, -8, -30, 7, -20, 34, -1, -7, 3, -34, 7, 38, 62, 26, -21, 11, -4, 17, -7, -36, -23, -22, 8, -38, -32, 23, 0, -25, 35, -12, -4, -28, -8, 39, -36, 63, 5, 20, 11, 7, -10, -34, 11, -14, 36, 65, 4, -11, -25, 5, 14, 54, 14, -18, 37, 7, -14, 25, -35, 31, 29, 44, 33, 8, -43, 32, 25, 3, 47, 24, -11, -10, -7, -19, 35, -1, -16, -9, 22, 10, -53, 8, -60, -17, -8, 24, -45, -5, -6, -26, -4, 68, 39, 2, -1, 78, 1, 41, 3, 18, -8, 48, -17, 57, 25, 49, 31, 3, -12, 23, -5, -17, 6, -42, -23, 19, 11, 11, 56, 8, 21, 21, 52, -19, -33, 20, 26, 34, 49, 49, -28, 10, 18, -29, 12, 54, -2, -26, 2, -20, 28, -19, -5, -12, 47, -13, 15, 13, 8, -29, 33, -9, 12, -5, -52, -1, 52, -39, 21, 2, 23, 18, 42, -18, -47, 16, 23, -2, 39, 18, 32, 20, 30, -6, 47, -5, 81, 31, -14, 16, 37, -15, -10, -26, -19, 5, 13, -14, 70, -50, 21, 7, -34, 18, 77, 29, 10, -10, 6, 7, -23, -7, -27, 4, 49, -1, -28, 35, 42, 22, -33, 15, 38, 6, 26, 47, 6, 34, 22, 9, -36, -15, 11, 7, 45, -6, 0, -7, -48, -28, 28, -65, -9, -12, 10, -7, 2, -27, -52, 26, -28, 1, 18]
7091A8l4J1L3jk1k6J1O1j6j4l5M3m%Lj8Nl5O3j0L3q4N5k3Q5j00m4j4O0J02k7j24
7123d7qk2J18j6Q7j1l66M94l40p7L86O2m24L7K40k10J55J7l3j6J2Ml0O1r1O0l3
7150IK2j6LQl2J3j7l2N4j2N2o4O1p7L9k5j3k4O8Ql1Pm4jjQ3n5M1k5NK5k8J4J%
7185A6l1QM5r9P0k8N8k1lP4o9l1L3KK1m6k1J0p1O2K8j2k5P3n8K4m9Q2n2oM4m4
7217a6L5k5J6J4J7k6m0J9K1M3k4n2PL2k7J1JNl6L9lK0j7J0m0j8P4p3P9n3o%M3
7250C0k4J3L9l8mK8n0J6K2m6M1ml8N2k7K5l9nO6m7Nk3N2k8l6j6K5j5L2pj2J0q
7283a1M8n8mJ8pJ6KLQlkk9M0j6MKm2N1k6K4n1K7J2L4j6J4m7L0L2j3qm9RJ5%k5
7319a8M6o2j0R8p3K3Ll9K1L1j6j8j6M0Kl7J0jrm2J29p6P0k2k6M2n1K3j5jP9j10
$$ y = [18, -16, -5, 28, 27, 6, -20, -9, 52, 36, 22, -13, 30, 26, 26, 29, 11, 16, -19, 44, 34, 67, -17, 38, 15, 100, 0, -44, -58, 2, 104, 77, -47, -55, -77, 41, 25, 112, 101, -265, 229, -111, -188, 198, 260, -164, -127, 113, -97, 58, 75, 42, 26, 38, 42, 12, 73, -18, 42, 9, 31, 15, 18, 26, -6, 7, -10, -42, 12, 0, 52, -12, 49, -28, 11, -14, -27, -51, 17, 25, -6, 1, -43, -44, -45, 38, -17, 24, -1, 4, 29, 1, 15, 16, 16, -15, -7, 38, -61, 9, -19, 39, 18, 15, 89, 20, -11, 22, 24, 45, -1, -22, -12, -83, -21, 7, -5, -30, 43, -15, 9, -40, 42, -10, -16, 28, -16, 19, -6, 10, 24, 41, 15, -25, -6, 15, 58, 34, -18, -11, 21, -6, 5, 6, 11, -25, 14, 11, 31, 14, 24, -16, -34, 40, -33, 46, -7, -13, -13, 30, 6, 19, 58, 20, 16, 44, -6, 10, 32, -14, 27, 23, -15, 37, 10, 35, -4, -9, 57, 10, 15, -8, 44, 16, -20, -36, -11, -26, 6, -1, -13, -3, -11, 37, -21, -25, -7, -14, 2, 4, 7, 15, 12, 10, -19, 21, 5, 9, 11, -31, 20, -6, 18, -33, -6, 6, 40, 24, 38, -9, 21, 53, 40, 32, -17, -8, 7, 7, -18, 28, -34, -44, 54, -19, 4, 7, -32, -11, 20, 4, -14, -30, 10, 12, -25, -15, -16, -25, -67, 62, -14, 56, 34, 8, 50, -1, 22, 7, 6, 85, -25]
7351b5L3k5O5o1nJ2q%KK9qo3RK9P6p9K4k9L8KL7K3j22Kk2M8J63j0j01j10Q7pL5
7384C9M5o4k3J3l2k8O2L9n3N8qn0J8j1N8ml5n0J22j41M9j2Q0j49J3M8Q9k7kO6
7414A10m2J44j54j92Q3P6j09J59j08jL2m4K9k0J21K0j38N9l3L2k8J5k3n7L8L1
7440@K1KO%r3P1jl1K8L3m5Q2j3l5k3J0l9k1K6m7KP1j5O2o3R2j16P9k3K6J1p1o6
7473h0R8L8n5J2kLl0M2k7l3J4MJ8l9j1O9ok7rN8k1J8rj2K1k9N3k1n4J8K8oJ5n2
7507a4O8Kp1J4mJ5QP1nJ1j76J88Oj15j42J36J25j53j6Qn3P1l31K85j61K80n4K15
7535B08Kl15K80j38R2l69R4O6K16m42L68k77K76m4J79k47q5J42j51l8K04o3K08
7558A66k13L1P2k00J94k0l5N9o8M4n6J8N0m0j4O5p7kJ8J1M0o4N7j6J7l4L8J8m6
$$ y = [-25, 8, -17, 48, -13, -18, -6, -14, -14, -12, 17, 9, -54, -45, -16, 60, -19, 5, -24, 14, 16, 53, 76, -46, -44, -66, -18, 145, 135, 34, -76, 11, 4, 39, 84, 20, -3, 10, -22, -50, 12, 51, -2, 56, 48, -2, 16, 5, 63, 59, 24, -26, 96, -45, 4, -8, 72, -77, -64, -16, 73, 46, 44, 110, 68, 212, 58, -134, -51, 25, -84, 75, -33, -34, -2, -46, -17, -37, 84, 104, -34, 25, -8, 24, -4, 11, -12, -69, -31, 0, 21, 23, 29, 29, -64, 7, 6, -25, 3, 36, -9, 73, 60, 25, 2, 12, -27, -48, -22, -69, -67, 4, -11, 51, -12, 80, -36, 43, 20, 46, 57, -14, -80, 18, 56, 1, 13, 11, 14, -16, 26, -1, -34, -20, -16, 2, -37, -48, 21, 15, -12, -21, 37, 16, 34, 25, 13, 34, 5, 58, 37, -17, 1, 29, 23, 38, -14, 54, 56, -15, -1, -5, 10, 18, 89, 84, 95, -81, 107, 113, -2, -144, -8, 117, -36, -52, -44, -97, -26, -357, -72, -233, 47, -7, 208, 210, -105, 175, 37, 129, -240, -146, -80, 136, -306, 62, -215, 61, 17, 196, -51, -136, 6, -145, -183, 21, -42, 166, -47, -16, 56, -144, 50, 30, -5, 54, -14, 30, -26, -8, 42, 2, -12, 53, -24, -26, -8, 3, 43, -21, 36, 20, 37, 3, 41, 59, 13]
7587A3n8O2M3m4K3k7J6J7j2n2j9P4j0K0q1L3L9R8j5j5k05L2O7P1l1l5l2K40m3
7616A69m7j28N1Kj11j12p2K02K68l47o0L74l21L73n65J67j10J80J03l9j0P5K5
7639F7J48l73P8O0p1M9J2J6L0p4N5J6Oj6k8N7J7p5J5Q6p7P1n7RK9p3lM7L1m7R
7670A4l8J2J4mJ0Jl3j1O6J3n1PK0k0M4n3J1mJ3n5K3N6m4LJ8kJ8k3mLj1K4k4kj0
7705a9L5J8K7l7J4J6n1P1q1rL8Lk9l0%L2J1Qk7K6K0l9J0J9l7K2l8Rj6K9l0N4J
7738B0l2K4O0r6k2M4NKRJ9LPl7j7NJ5k2N3n2K8k1j5O0k3m0kjL0L7q2O2K5k8l3
7772a5LMNj0L2l5L4Lm4L3N7J1j6n1K6lM0m9l2M2Ml3j4N6n7oJ8n9Q0n1K9J9rL8
7806E0n6L1j3l5L5J6nj6Om0L0j0J1J6o8K5N2m8N6j5kl0J5K8o3O3j2J3k5J2k9J9
$$ y = [13, -45, 17, 60, 16, 39, 12, 28, 45, 33, -19, -38, 36, 26, 46, -35, -2, 37, 135, 120, 105, -100, -68, -1, 70, 39, 4, -28, 212, 169, 122, -6, 45, 47, -64, -176, -248, -46, 222, -125, -185, 189, -132, 241, -324, -157, -267, -87, 16, -23, -33, 42, 67, 215, -158, -80, -20, -91, -42, -30, -14, 16, -58, -3, 13, 19, 3, -25, 32, 49, -26, -11, 75, -2, 69, 12, 21, 50, -23, -26, 21, 52, 5, 14, -24, -12, 2, -2, 8, 9, -24, -35, 31, 44, -7, 0, 20, 0, 44, -9, 2, -2, 11, -44, -21, 35, -9, -6, 12, 10, 28, 5, 1, 4, -7, 17, -7, -9, -19, 16, 34, 61, 24, 38, 54, 3, 74, -7, -16, 22, 25, -4, -34, -34, -2, 9, 17, -10, 16, 36, -3, 7, 26, -11, 11, -27, -18, -34, -5, -35, 19, 20, -12, 12, 72, -24, -46, -2, 3, 5, 14, 33, 36, 43, 6, -11, -6, 9, -13, 40, -12, 16, -5, -20, 40, 17, -23, -25, -26, 4, 41, -41, 21, 46, 18, -15, -12, -8, -3, -13, 19, -16, 18, 21, -23, 10, 67, 78, 62, 11, 37, 34, 74, 25, -7, 35, 39, 6, -8, 48, -9, -15, 3, -56, 24, -27, 2, 21, 12, 50, -6, 25, 12, -23, 12, 28, 23, 7, 13, -27, 3, -7, 4, 20, -48, -23, 29, -19, 37, 22, 20, -10, 5, 33, -30, 33, 21, 34, 9, 21, -8, 11]
7838A1K3mj2%j6Ppn5O2LN1q2%L9LJ3o1pP9n9L1n3M3l1L4Rk7PKK8l4K9rPl4R6o1
7875B5%K7j2o9M6%%lL3p7mQ3n9oj6K9QO5k9k9nK4qJ2j8j1m3M2N7n3M6k4k5K6j1
7910B1m0L1j5M7qn9L5K4K2m9l8L5M7p5K6l0%L4j0j0J4M3m0N5m8n9P0j9K5l9oJ3
7942ckL2L6m2k5L9j7nj4K0j0KJ5l7M2kk9qKjK2mo3L4K0pj1J0l8Q7n4j2P0o1J4
7977@K0m4O2q7J8qN4oplL6n5Kj5K2L2m1N3j7k8PL2n3Rj1J3j6J9M1Jlj1l8L5%J8
8013C1j3K8l0l0M8K0n1O6p3j4KN6n5L3qM0pn9L4K6k3N0o2J5J3rq4J01k1n5N8m7
8045b0mLNk9R0q1O4pm4N1l5LnK5l9J1M3n4j0L5O9l6j0pj2mPJ2k2oJ3o8L5O1m8
8080a4NN5n0K4l6j1L0lj9K1K4o4J3K8J0O7j05L4nM6k6j4M0j05O4LJJM0l6m3L1
$$ y = [11, 34, 30, 18, 18, 2, 9, 2, -53, 9, 12, 63, -19, -19, 20, 23, 36, -25, -32, 47, -12, 19, -34, 9, -22, 12, 21, -6, 1, 3, 31, -3, 26, 17, 24, -10, 86, 25, 25, 52, 40, -29, 17, 17, 17, 14, 47, -30, -34, 49, -10, -16, -32, -3, 5, 70, 41, 12, 7, 31, 23, 35, 17, 6, -37, 5, 62, 9, 55, 31, 6, 32, 21, -19, 12, -3, 44, 36, -23, 12, 36, 58, 9, -29, 6, 53, -22, 4, -26, -26, 8, -2, -12, 2, 45, 5, 60, 12, -47, 23, 4, 29, -10, -16, -3, -5, 27, 63, 21, -4, 35, 18, 13, -1, 19, 9, 11, 26, -11, 31, 29, 0, -8, -6, -7, 15, 11, -52, -18, 2, -5, -16, -6, -44, 43, -11, -23, 47, -14, 0, 20, -24, 38, -49, -31, -39, 15, 9, 2, -1, 35, -20, -18, -33, -11, 21, -20, 33, 16, -12, -5, 27, -26, -17, -28, -15, -31, -12, 29, 30, 27, 16, -22, 13, 13, 31, 18, 46, 16, -14, 34, 54, 3, 69, -4, -18, -16, 40, -15, 18, 10, 50, 43, -16, 18, 44, 21, 71, 9, 24, 37, 28, -56, 45, 24, -31, 27, -20, -24, -21, -16, -45, 45, -36, 28, 21, -23, 28, -7, -4, -9, 16, -23, -12, 31, -23, -33, 2, 71, 35, 25, 18, 6, 2, 9, 21, -1, -7, 6, -62, -27, 34, -14, -9, 46, -4, 20, -16, -27, 3, 0, -19, 2, 26, -38, -25, 3, 13, 80, -25, 9, 4, 50, 24, 10, 50, -55, 9, 12, 13, 14, 54, 18, -25, 6]
8112FK2K6qOn8LM0l7QQl3J2J2J6k6lj6L8pK8m1l6K2K0K0K3l4Kj7k0O2o0O6N5p0
8147B9%mk5J0j5N3l0l7K7K5J7q6J6O2m0j1qJ6l1L0M3o6M4j4K0m0k2K3j0KL7l5
8179b0L3j6J7NMm6P4n2j9K2j9K2
$$ y = [6, 28, 54, 46, 52, -6, -3, 37, 0, 8, 16, -17, -5, 7, 23, -3, -6, -22, 16, 9, 37, -4, -40, -18, 2, 22, 45, 11, 13, -4, -24, 38, -22, 44, 99, 29, 29, 25, 0, 10, -5, 48, 18, -19, 8, 33, 50, -36, -20, 42, 2, -9, -17, -1, -32, -2, 41, -25, 19, 5, 25, -15, -37, -14, -24, -22, 15, -20, 13, -3, 14, 19, 23, -23, 51, -1, -20, 2, -17, 5]
8191E
$$ Imaginary data points
##PAGE= N=2
##DATA TABLE= (X++(I..I)), XYDATA
0@%%%%%%%%%qJ6j6J6j6K4l2M0n4O2p2Q8j04J28j55J79k08K46k86L28l79M37n01
32b67N71o49P33q26R29j045J173j309J459j623J801j998K214k447K702k981L286
49A723l619L986m391M837n334N887o502P198p994Q907r969J1224j2731J4582j6921
64i117J9977k4166L0306m0285O0113j62692K69599o3502k08062L49619m54501
75b32711J88102K92325m21417K27755J259k66042M52277k58665j69140L43870
85A57613k71719J49292J57561m37247K74429N9090k06558K99784k48615r2936
95a59306L48532k56071N9649R9841k80476K78488K0051k45753K09278j36423J42
106f2048K47170k58629J8661J19385j60413J85168l8639j81478J95412n7188l8829
$$ y = [0, 0, 0, 0, 0, 0, 0, 0, 0, 0, -8, 8, -8, 8, -8, 16, -16, 24, -30, 32, -40, 48, -56, 72, -83, 96, -112, 134, -152, 176, -203, 234, -267, 304, -345, 388, -438, 491, -554, 619, -690, 769, -854, 947, -1051, 1163, -1284, 1418, -1563, 1723, -1896, 2090, -2301, 2536, -2798, 3089, -3413, 3785, -4209, 4698, -5271, 5953, -6778, 7804, -9117, 10860, -13306, 17000, -23285, 36828, -125864, 143735, 80233, -127829, 221790, -232711, -44609, 247716, -173701, 54054, 55313, -210729, 241548, -17117, -186257, 157613, -114106, 35186, 192747, -244500, 29929, 89019, -117539, 182245, -66370, -159306, 189226, -66845, -7196, 92645, -187831, 90657, 110708, -135045, 74233, -62190, -62048, 185122, -73507, -54846, 64539, -95874, 89294, 50655, -130823, 64589, 7401, -31428]
117c1428J13635j73147O2881J26351j32857N1055k4155p4407J54193l4513p9603
128d1995N8120n6296L8521O6197r6152O371M1094k5592L6370k0714n6283N5975
140E616K7164l4010P182k7070j0641P1467k1136m6628L7041k8314J7860M9436
152D7967q5391J9980N0196n8493N7239k3150p4416J07384k9156l7356P4319r9565
164e0442L1926Q4076j12164O1139J0049r0369J24066n2357o5312J20478r4495
175c3405K2043Q3104j45574Q1538L7773j09831J25278o1162p0605J46506j05166
186b9501N503R4677j43571Q8823L8712j31044J24388m2848o6730J42317j11948
197c1222n029J04633j31178P8209L6429j29806J22150l1035p3793J30733r9847
$$ y = [-31428, 82207, -90940, -28059, 98292, -34565, 16490, -7665, -82072, 72121, 37608, -41995, 16125, -40171, -1650, 64547, -31605, -25234, 15860, -9732, 26638, 5924, -50359, 5616, 32780, -1230, 5952, -21118, -31759, 39708, 18572, -28056, 8985, -19329, -1469, 47967, -37424, -17444, 32752, -25741, 31498, 8348, -66068, 41316, 12160, -25196, 49123, -50442, -18516, 65560, -46604, 14535, 24584, -65785, 58281, 5924, -59388, 61090, -33405, -11362, 71742, -73832, 7706, 45479, -64352, 60926, -236, -70841, 75665, -29501, -23998, 70679, -72892, 15931, 54643, -76401, 47987, 5139, -61591, 80726, -31222, -36251, 68382, -62796, 15413, 51842, -77964, 44186, 13151, -60642, 70091, -29756]
208b9756n996J07985j27120N9148M3141j19526J13561k0871q1904J20189p9947
219b1096j5266J03438j14171M2553N3308j09569R0687p590q0354J08102n7997
230g955k9447R3791r2989K5552N9800r8682O6863R372p7899R0586l6480m2140
242c9628Q7047o9589L792O4540q4377M2571K7436p5801O8879j2156n1783P6757
254C7688m6101j7301O6872o7794K0468M1943p2492M9508P967o0103O8672k6038
266C289l4797O9854n4745j368N5867o9428L3282K7772o8170N8019o800m9919P0822
279C3678l9309j9511O4148o3766J5769M2944o9895M7914R623o0735O6524k5954
291A430l3201P0086n5116J248N2661p0106L6058K4239o5909O1237j2423m6300
$$ y = [-29756, -35752, 72233, -54887, 4261, 47402, -72124, 41437, 20566, -61338, 58851, -21096, -36362, 67076, -47095, -4542, 48766, -60803, 29884, 22294, -58060, 50042, -7955, -37402, 56389, -36600, -11048, 48752, -49930, 16933, 26305, -51594, 38992, 2512, -39628, 47419, -22170, -18378, 46162, -38215, 4356, 31792, -44009, 24870, 12714, -39069, 37688, -8413, -25714, 41158, -26636, -6168, 35775, -36717, 12791, 20758, -39345, 29327, 3289, -31508, 38346, -16399, -17767, 38100, -31328, 1954, 29726, -38444, 19575, 12775, -37144, 33678, -5631, -25142, 39006, -24760, -8991, 33953, -35942, 11972, 21595, -39140, 27384, 1430, -31771, 38315, -16801, -15553, 37108, -32998, 3060, 27299, -38610, 22627, 10204, -36096]
303c6096P0238m4376j2045O1134o5159K2192L5405o8427N2170K394n3346O6795
315C0879l3255k5475O4310n7104J0620M4844o7641M1514J2511n8710O3299k0908
327D884l5450O6783n1176k268N2884o4529L1353K5812o4571N5141p507m5453O6510
340C2413l8676j5459N7702n9994J8027L6343o3596M6706M187n2416O1856k8690
352a597k5148O2199n2861O143M3357o3441L7365J6444n6856N7095j6960l5689
364b9949O1699m4436m381N0725n9028K5918K4021n9158N1460n457m1739N9862
376B9537l7301j3450N4328n5247J7675L2055n8842M4298J717m7627N7789k6372
388a440k0360N4149n0775P913L8722n4527L4779R154m8567N1613j6929k7301N0469
$$ y = [-36096, 34142, -10234, -22279, 38855, -26304, -4112, 31293, -37134, 15036, 17430, -35916, 30879, -2376, -27851, 36459, -20645, -10025, 34819, -32822, 8692, 21203, -37507, 25792, 4884, -30566, 36217, -14959, -17227, 35657, -28872, 2481, 28293, -36278, 18863, 11356, -34097, 32413, -6263, -21722, 35980, -24014, -5987, 30356, -33240, 13466, 17653, -34763, 27093, -1597, -26745, 35454, -17407, -11264, 32093, -31348, 6017, 22461, -34395, 22700, 5740, -29949, 31750, -12686, -17067, 33658, -25370, 548, 24569, -34589, 16871, 11414, -30325, 29537, -7764, -21214, 33114, -22133, -4458, 27597, -31245, 13053, 14770, -32857, 24932, -1440, -21800, 32349, -18426, -10513, 28209, -26318, 8461, 17615, -30952, 20661, 3732, -23569, 26900]
401B6900l9579J760L9050m9918K2329J6755m2303M2195r528l1799M4805k6825
413f158n645L6769m2596J3837K3640l9710K8851n12l1269M0923j5590j7907L2727
426A7360k9197N700K7992l6893J4210J1681k8173L0244p043k5522L3175j4653
438a119p889K6452l1291O733K6073l1177J5125N114k8805L3835m475k5875L0033
451A2734j8765m071L3054l5757M470K4245l1585K5210J169l6302L8612p365j9407
464a3758L4120l4818K325L8490m1178J5379J1538l8154M4443p572l5770M3148
476A8193k6143k020M0833n2807J4865K8228m3007L9325r649m0265N6538k3911
488A80j4733M1129n1623K1153L4075n5362L4741k629l5473N9610l1840k3035M8476
$$ y = [26900, -12679, -10919, 28131, -21787, 542, 17297, -25006, 17189, 7661, -24138, 20667, -6158, -11803, 24966, -17630, -3793, 19847, -19863, 8988, 8476, -22793, 18130, 2540, -15367, 17360, -11837, -6137, 21855, -15038, -828, 10853, -17320, 12924, 5881, -19641, 13534, -1119, -9008, 17444, -13847, -7114, 18959, -12218, 2907, 8021, -20784, 13051, 8576, -17299, 12734, -6031, -10102, 22952, -12805, -8335, 15910, -15675, 9535, 10704, -25598, 13014, 5649, -13758, 20362, -14456, -12131, 26359, -14819, 560, 12098, -26056, 18387, 10815, -24955, 18193, -7950, -9970, 30863, -21944, -7079, 21149, -21858, 17467, 7818, -32447, 24091, 180, -14553, 26576, -25047, -3894, 30181, -25181, 9560, 6931, -28542, 31068, -772, -23807, 24669]
501B4669m3725K0215K7794o1626L8931P654l6627M9577l4252j7723N5143m1553
513a1523Q076K2697n0332M2748O262m1834M0354k3930p997M6140m4669M553K6340
526A6885l7330L4338k773l7839M1136j3816j0215L0730l8430R597K6962l1837
538a2592J9570l875k2683L6035j3209j3696K0324k1139J1923J4853k7702J1744
550d47L731j0225J9050j3623r074J6913o857K154K929j3107Q197O751o964P45
564A73k656n71O976M78p576k96N513j769L378k425r361J1063J365q018Q649j0068
580e145J98J6947j7044K865P429j6125J9463l115j9051K2648j1990k880K1471
593A5671k8571R836J6269k7303K3343n378k2418L5098j8913q184K8104l3302J5254
$$ y = [24669, -19056, 1159, 28953, -32673, 6258, 13912, -22715, 26862, -7390, -25113, 30030, -11523, -3447, 19250, -31082, 11666, 17928, -23906, 16448, -7482, -15479, 30661, -14008, -9455, 16885, -20445, 13893, 11120, -26719, 14417, 601, -9614, 21116, -17314, -7717, 19245, -12592, 6978, 3103, -19580, 16455, 3246, -10450, 9874, -11265, 658, 15511, -12191, -447, 3284, -6941, 12109, -1514, -10588, 6325, -532, 1622, 4551, -8556, -359, 6392, -572, 173, -2483, -3054, 3922, 4400, -3176, -3472, 2041, 272, 3650, 1225, -8136, 2927, 4292, -3726, 4923, -5145, -4947, 12000, -5044, -2179, 5250, -10875, 8588, 5473, -13578, 9070, -2920, -5800, 15671, -12900, -3064, 13205, -14098, 9245, 3867, -18551, 16547, -2366, -10550, 17554, -15748, -494]
606d94J7990l7105K8562l768k3998L9353k5684q418L3934l6025J6631J6406m0949
619b3565L4275l127k7142M0189k7672o606L7277l9116J4583J7697l9736L5392
631A2449m039k9640M0454k5026o310L5281l9550J4675J9011l8305L2730m634k8038
644b0942M0234k3566p805L3141l6501J3831J8848l6871K8893k191k6077L6550
656A7544k0550r500L1110l1016J0276J7730l3114K4092J282k4305L0275j5614
668a790j0180K8160k5192N036J7394k7456J8093M369k2898K4233q808j2136K4225
681A3050j8666k80J8179k2313J0575Q307k0891J8073k106j4588K0271j1540n228
694g157J7976j7115L908J1626j8670J2191L228j6233J7182n499r817J7888j2998
$$ y = [-494, 17496, -19609, 8953, 5185, -18813, 20540, -5144, -13562, 20372, -15653, 978, 17384, -23565, 10710, 7583, -19559, 20630, -7042, -13648, 23629, -15487, -904, 16793, -22943, 12449, 8410, -21230, 19224, -5802, -12112, 23169, -16381, -1706, 17305, -21000, 11730, 7096, -20942, 19292, -4274, -12079, 21062, -15439, -1608, 17240, -19631, 9262, 7071, -19006, 17544, -3006, -12506, 18604, -12412, -2136, 15594, -17520, 6572, 7854, -16451, 13824, -1790, -11970, 16190, -9002, -3966, 13428, -14028, 4065, 8434, -14464, 9769, 961, -11175, 13050, -5616, -5896, 12283, -10030, 545, 8852, -12039, 6034, 3928, -10660, 9611, -1929, -7157, 10819, -6296, -2388, 9238, -9432, 2759, 5987, -10246, 6936, 1437, -8380, 9508, -3490]
707c490j690J5180j7082O538Q708j7700J3699L67j4213J7553q055p052J7142j4891
721d986J568J2937j8001J0247M950j6827J6520m441j1002J8554j2684k329J5751
734A0257j7831P080Q792j8404J4903p10j4138J8878j0017o069J7758j6723L822
747b402J1828j9467J2880K732j6257J8239p161q881J8376j4979J183J3903j8837
760h843J0356N217j6879J6124m220j0879J8484j2561k378J5103j7132P378Q081
773G851j7580J4290q08j2730J6822r047n020J5548j5074L886R949j6100J0969
786B956J841j3505J5503o477p083J5476j2693O15J1863j5688Q324M882j4449J3440
800E005k871r660J5184r778k508J2859j3973N081P228j4232J1012L28j1185J3879
$$ y = [-3490, -5180, 10000, -7082, -544, 8164, -9536, 4163, 4530, -9683, 7870, -185, -7237, 9905, -4986, -3418, 9519, -8482, 1765, 6715, -10112, 6408, 1967, -9035, 9519, -3165, -5494, 10257, -7574, -494, 8298, -10106, 4797, 4087, -10051, 8827, -1190, -7259, 10499, -6224, -2402, 9426, -10041, 2839, 5571, -10686, 7553, 392, -8489, 9887, -5092, -3909, 9994, -8843, 1513, 6730, -10149, 5975, 1755, -9124, 9360, -3201, -5579, 9524, -7608, -230, 7851, -9729, 4561, 3753, -8977, 7845, -1202, -6222, 9326, -5748, -1862, 8087, -8013, 2956, 4797, -8708, 6795, 318, -6765, 8711, -3982, -3367, 8496, -7192, 1132, 6014, -8435, 5005, 2134, -7526, 7658, -2120, -4628, 8231, -5742, -661, 6567, -7665, 3347, 3675, -7510, 6369]
814F369o979m842J3076j1887K233Q925j3696Q414K558j1339J1875l753o861J2214
828F307q600j240J0260j1533M485N283j1180Q921n0q726J0864n108m237J0470
842E916q948R21P634j0441N618L408r927Q928j307p275J0602n990l126J0019r477
857c445J897P174j1059O758K962j0706J0487k573p424J2319q175k258J1141j2052
871d954M305O949j3597J0398O01j1338J4199p121n606J4826j3220J979J0743j6429
885h265J0521L531j5482J6281n639r005J7996j4385j27J4522j8518J0025N706
898G161j8497J8212m719j1709K0137j5311o44J6973k1075J0228P196k0142J9938
911G748n097j3627K2144j5719r95J7922k2683J0798Q268k0815J9973n773j3520
$$ y = [6369, -610, -5452, 7624, -4263, -2030, 6895, -6801, 1613, 4171, -7168, 4707, 954, -5907, 6307, -2293, -3533, 6727, -4806, -321, 4962, -6218, 2703, 2653, -6073, 4791, -317, -4554, 5916, -3032, -2111, 5523, -4918, 700, 4108, -5819, 3109, 1802, -5473, 5129, -861, -3987, 6032, -3445, -1548, 5626, -5433, 1325, 4287, -6419, 4068, 1495, -5929, 6390, -1785, -4043, 7098, -4954, -649, 6300, -7297, 3101, 3702, -7636, 6563, -558, -6164, 8662, -4558, -2579, 8164, -8265, 2256, 5787, -9695, 6586, 947, -8058, 9938, -4447, -4574, 9948, -8570, 1455, 7161, -11336, 6876, 2157, -9552, 10585, -4726, -5370, 11603, -9472, 756, 7952, -12190, 7748, 2651, -10976, 11168, -4551, -5546, 12376, -10307, 491, 8759, -12056, 7917, 2144, -11376]
924a1376K3204j5890j291J7027k2345J2008P638k0772J8963n676j1430K1884j6093
937d149j455J6267k0060J1770N426j9422J8122m562r922J8391j5368K08J4587
950I833j7254R294L417j5188J6345m507q676J4084j1915K076J0945j4860P100
963F94K705r867J2412n355o538J0992p360J685N665j0685N942K934o168N844m134
978a234k184P159m020o77J770l521L953Q74l613P91O5J067J031j433j724N93K954
995A851j269j141M55k331M155R17n732L694j106p96O238p418k80O328o271N240
1011B534l66q857J0446k279m665Q469j0255L182R130j2541O704N68r279J4570
1025G361o769o987J2864j1377M772Q299j7164J0778K253j1261J5596j0294n785
$$ y = [-11376, 11828, -4062, -5353, 11674, -10671, 1337, 8975, -11797, 7166, 1490, -9940, 11944, -4149, -5604, 10663, -9397, 2373, 7799, -11623, 6499, 1937, -7985, 10406, -4962, -4754, 9833, -7421, 1873, 5290, -9898, 6447, 1940, -6736, 7348, -4567, -2491, 8454, -6406, 694, 3399, -6468, 5944, 589, -5949, 5043, -2317, -632, 5033, -5652, 290, 3224, -2944, 2900, -1234, -3418, 3741, -279, -956, 814, -2707, 1246, 2120, -1493, -702, -637, 430, 1461, 28, -1696, -1103, 1851, 582, -559, -104, -2435, 1720, 2637, -3095, 599, -507, -1303, 4935, -2483, -2763, 3565, -2706, 2534, 2168, -6689, 3757, 1478, -3187, 5282, -4973, -1791, 7339, -5202, 1502, 2070, -7209, 7361, 592, -6395, 6469, -4908, -136, 8163, -9001, 1777, 4030, -7231, 8365, -1929, -7714]
1038g714J7176j3915L823P584j7517J5036Q70j3977J5951j0384k780J7275j7837
1051f409M203R394j6517J5542k528j4303J8355r469k746J4757j8745P045R597
1064H176j6996J4227l678j1432J9092j1105l291J3283j6288Q918O993j7084J3468
1077D283k803q788J6646j2481k028J3114j4065P759L962j4634J3635k448p953
1090e801J2794j0701L19J0972j2701N822L019j0294J1421l443o632J0233p590
1103b582J033P157j0223M943K669p117P592l109m361P860n074R5M213o467L867
1118D96J894m925M006j488k009M454l022n87K526k573J500P75k366J373M18j042
1134e70R67l79q81J086M24j053P11k54j136J878n87j453K573j755l90K631l324
$$ y = [-7714, 9462, -4453, -630, 6954, -10563, 4473, 5343, -8634, 7317, -3067, -5847, 11428, -6409, -2206, 7188, -9329, 6213, 3685, -10618, 7737, -1732, -4478, 10279, -8466, -1421, 8176, -8820, 5407, 1729, -9703, 9389, -1716, -5007, 8276, -8012, 906, 7899, -9185, 4283, 1480, -7308, 9338, -3143, -5171, 7943, -6122, 1637, 5599, -9035, 4600, 2152, -5801, 6993, -3708, -3389, 7583, -5118, 704, 3723, -6571, 4850, 1407, -5225, 5008, -2582, -1549, 5608, -4615, 328, 2997, -4120, 3472, 363, -3998, 3862, -1212, -1117, 3096, -3371, 496, 2390, -2535, 1471, -17, -2026, 2428, -594, -1181, 1345, -1228, 272, 1047, -1319, 54, 472, -570, 397, 18, -863, 223, 647, -406, 305, 51, -1085, 793, 206, -1247, 1326, -429, -819, 1812, -1512]
1151a512J195J981l602L029k85l147M542k535j339M435m628J532K975n531M134
1166A244J70m534N975l262j860N867n863J746L665o431M711L85n559P014l136
1181A32l027O852o298J629M123p089N006O25n802P058l400k711O861o213J318
1196i36M493p287M784J079o032O732k794l127O914n728N57M778o839M112J572
1211B278o000O119k019l519O560m824k05M978o187L086K109n812N311r83l964
1226c072O034l804j041N153n540J931K985n713M436N3m507N557k587k161N405
1241C129m783P10L824n559L333J208m833N019j573k963N438m061k61M373n311
1256b310K443K114n172M547o73l719N458l278j240M775m976J659K815n247L919
$$ y = [-1512, -317, 1664, -1938, 1091, 806, -2341, 2201, -334, -1673, 2762, -1866, -334, 2641, -2890, 1244, 1414, -3120, 2855, -407, -2267, 3600, -2263, -517, 3148, -3283, 1428, 1813, -3746, 3268, 132, -2895, 3957, -2341, -712, 3411, -3678, 1328, 1953, -3849, 3209, -191, -2902, 3959, -2254, -936, 3557, -3730, 1054, 2133, -3899, 2833, 39, -3088, 3826, -1902, -1345, 3433, -3406, 706, 2278, -3722, 2397, 378, -3141, 3419, -1405, -1610, 3368, -2819, 267, 2376, -3436, 1875, 892, -3072, 2962, -842, -1883, 3270, -2270, -339, 2646, -3067, 1369, 1422, -3085, 2472, -115, -2276, 3129, -1654, -944, 2880, -2679, 654, 1862, -2971, 2048, 475, -2488, 2950, -1111, -1372, 3001, -2310, 133, 2247, -2925, 1622, 949, -2770, 2688, -590, -1830, 2945, -2031, -372, 2443, -2804, 1115]
1271A115K09m176N157k462j972M924m401Q25L289n052L205Q86m354M680j703k465
1287b295M889l792P7L617m700K434J551m371M003p87k924M588k940p70L859m146
1303a707J497K144m127L158P1l239M002j908j463L796l378M85K656l767K226R15
1319A361l501L513q17k393L783k515n28L266l513J114J938l647K850J60l175L702
1335A598j658j417L687l400L92K910l914K282Q73l772L975j083k430M070l179
1350a066o0L589m404J870J653l994L929q49l120M516k678m97L511m506J816K346
1366B056m241L424p85k945M835k631j186L558m045K028K145m599L162k02k491
1381a917M317k937j173L807l329J480J315m073L432K01k567L088k588j80L348
$$ y = [1115, 1324, -2852, 2305, -157, -2129, 2795, -1606, -781, 2508, -2544, 661, 1547, -2807, 1873, 170, -2295, 2594, -1198, -1121, 2496, -2204, 230, 1781, -2590, 1413, 626, -2298, 2290, -650, -1420, 2439, -1707, -210, 1934, -2193, 965, 1036, -2203, 1799, -109, -1572, 2224, -1154, -669, 1987, -1780, 446, 1361, -2140, 1373, 556, -1837, 1946, -569, -1097, 2169, -1344, -230, 1708, -1939, 911, 1071, -2104, 1598, -60, -1477, 2210, -1190, -798, 2112, -1802, 480, 1353, -2419, 1556, 473, -1957, 2113, -1066, -1126, 2463, -1941, -71, 1582, -2412, 1517, 668, -2452, 2064, -614, -1111, 2400, -2106, -290, 2056, -2185, 1239, 454, -2491, 2344, -287, -1473, 2085, -1960, 68, 2213, -2386, 776, 574, -1917, 2400, -537, -1710, 2097, -1232, 248, 1563, -2510, 922, 1123, -1444, 1644, -944, -1124, 2224]
1396B224l143P87Q84k452L061n20k427K345j250L82J797k977P74J331j216J442
1412A042j168j214K107l48l51Rj167J251P53r06l71k99O53P20l96q17l00J111
1430C09L75p48j15q01J096J211j855K05J0l72K369j745j327J995j274J366N12
1447A211l390K365O77j587K310k972j8L762l109Q51N91l272M452o62l243L433
1463A399k707Q21L592n308J770J786l322M416k237l192N347k933J88K837n624
1478c167L488K080m626L933k274j890O054m510l29L248m740M211O04n410M867
1493A539j588j435M802n367O90L972m698L424m56m231N692j983k035L958m534
1508b250J850L169n104K935r4k833M986k828j854L968l336J625J761m612L232
$$ y = [2224, -919, -132, 752, -1700, 1361, 841, -1586, 759, -491, -109, 1688, -1289, -515, 816, -400, 1042, -126, -1340, 767, 419, 68, 77, -1090, 161, 914, 8, -363, -662, -9, 711, 315, -502, -802, 309, 684, -64, -179, -980, 116, 1327, -528, -323, -313, -685, 1684, -61, -1388, 607, -667, 699, 1211, -2179, 186, 863, -724, 1586, -1386, -1404, 2358, -751, 100, 691, -2581, 1871, 1209, -2034, 1399, -1308, -487, 3105, -2203, -433, 1353, -1969, 2447, 210, -2982, 2365, -568, -380, 2457, -3167, 321, 2401, -2225, 1708, -566, -2456, 3598, -912, -1241, 2007, -2733, 1478, 2082, -3328, 1539, -49, -1484, 3318, -2049, -1359, 2613, -2085, 1339, 883, -3348, 2344, 361, -1674, 2284, -2250, -400, 2769, -2335, 600, 506, -2327, 2659, -169, -2023, 1945, -1391, 234, 1995, -2617, 615]
1523F15M07k531L342k603p34L609k970O71J166k885K925j3k551K493j381p7K195
1540A678k609N26J259j693J557l88j539J923o13l74R46j265L96R38j003K97N0
1557H6m77P66j47n57K51K08k00L26j82n57P41K0o52O76m61k03J138j166Q9R01
1577F00j277J036R2j516J727n88q92J880j730K45J628k312J406L94k047K396r89
1594E3j281K597k103K44J970l013J848O91k639K857j207j470L262k642K09K241
1610A617l239K149O16l057L217j182j522L307k913L57K471l442K152N19k984L442
1626A508j364j534L257k900N67K288l446J965O63k733L173j370j556L221k564
1641h25L75K112l275J906P36k585K681j001j446K930k213N8J923k657J639O49
$$ y = [615, 1022, -1509, 1833, -770, -1504, 2105, -865, -194, 972, -1913, 1012, 999, -1552, 941, -440, -517, 1678, -931, -405, 854, -839, 718, 330, -1209, 714, 101, -273, 673, -592, -196, 742, -261, 36, 86, -391, 375, 228, -329, -78, 130, -70, 256, 74, -483, 258, 278, -374, 302, -159, -362, 776, -390, -301, 600, -677, 359, 451, -1065, 662, 74, -818, 1062, -668, -423, 1205, -1107, 299, 693, -1354, 1042, 53, -1228, 1369, -734, -490, 1480, -1533, 315, 1006, -1633, 1224, 17, -1453, 1809, -833, -624, 1617, -1622, 527, 1143, -1914, 1303, 121, -1401, 1906, -1007, -650, 1821, -1621, 531, 1050, -1934, 1508, 144, -1390, 1867, -1033, -466, 1822, -1624, 341, 1004, -1729, 1444, 74, -1482, 1739, -825, -450, 1662, -1613, 293, 1029, -1556, 1125, 124, -1322, 1608, -605, -547, 1376, -1281, 358, 1007]
1657A007k438K265n29j492K462j878r8J951k254J110P52k131J882k03j444J956
1673I18j251l03J759j854N41R76j750J339J67j496J615o11p67J627j343P6J252
1690H95j493O53O26j536J320j20j092J503q36m69J454j381K74J005j533R35L26
1707E31j369J415l56r47J538j139j12J344j551O41O90j559J342p2j281J642q66
1724a09n26J548j441K68J088j753J148L49j511J605o59p89J682j382M6J291j717
1741h62J012M87j638J527l62j068J831j272j91J454j656O67Q63j687J373j38j291
1758i51J775j026m69J633j561M47J004j805J268K44j494J679p39o76J671j501
1774e01K05J238j765J028M77j650J579n02r10J718j340M1J313j675P83O35j601
$$ y = [1007, -1431, 834, 305, -1187, 1275, -603, -701, 1250, -1004, 106, 858, -1273, 609, 406, -1038, 918, -333, -636, 1123, -731, -190, 786, -964, 375, 542, -954, 661, 50, -717, 910, -433, -357, 895, -598, 55, 681, -855, 465, 345, -747, 756, -80, -549, 905, -476, -202, 803, -730, 205, 531, -838, 577, 221, -726, 812, -327, -439, 905, -646, -5, 685, -874, 468, 396, -885, 757, -109, -635, 913, -528, -260, 828, -925, 223, 572, -939, 666, 7, -782, 900, -482, -436, 855, -862, 150, 637, -1001, 526, 164, -904, 927, -345, -536, 918, -738, -71, 792, -895, 478, 340, -951, 824, -202, -671, 962, -599, -152, 852, -953, 315, 559, -935, 744, 5, -671, 1000, -501, -296, 942, -823, 205, 682, -968, 611, 109, -801, 917, -423, -382, 931, -744, 39, 674, -927]
1791i27J481l49j105J752j104k16J308j502O11P06j517J287j72j063J503p59m69
1808e35J269j254L07R72j410Q61R3j017J293n51o70J243r63J21Q38j152N33M74
1826D52j020R23k24p74J109n56k81Q80q97K06P12r44M23K64p98R14k10p02R87
1845D64n16k47R53j033J02Q50r65N65J62j099J247j03r79J193r21j5J257j448
1863e33L45Q46j460J342j19j430J651o52n49J544j735M16J399j954J234J00j696
1880a251K228p99j150K019j822N06J620k564J413L98j844K426j201j275K623j983
1896f56L70J522k739J802O51k303K409j238j022K849k380K13J745k715K174K73
1912I55k590K739j254q92K820k789M42J967k745K036M1k440K958j273r16K429
$$ y = [-927, 554, 205, -900, 852, -252, -468, 840, -662, -51, 655, -862, 425, 253, -810, 693, -66, -535, 734, -520, -213, 759, -651, 210, 303, -714, 579, 28, -642, 601, -362, -241, 597, -555, -22, 452, -568, 355, 131, -643, 466, -90, -371, 509, -388, -182, 530, -414, 9, 273, -525, 389, 179, -523, 464, -52, -299, 654, -379, -277, 573, -392, 173, 335, -764, 483, 380, -599, 594, -327, -342, 915, -533, -188, 658, -802, 540, 421, -1009, 642, -10, -559, 985, -750, -334, 1065, -889, 345, 445, -1251, 977, 178, -972, 1047, -775, -269, 1351, -1213, 200, 598, -1246, 1180, -21, -1296, 1327, -656, -286, 1236, -1503, 299, 950, -1353, 1056, -182, -1204, 1645, -735, -522, 1223, -1492, 682, 955, -1635, 1104, -150, -1042, 1778, -1011, -569, 1398, -1347, 689, 730, -1710, 1248, -25, -941, 1488]
1928A488k574Q03J841k887J896r0j968K915j559r07K386k302R99J239k759K014
1944E35o2j657K480j642n05K135k045P89Q15k141J942k13j396J835j334o2J565
1961A039j797P72M72j413J568n12r21J418r22J14Q89j330O75J89p13Q28m71j75
1979b90O07n08K70j0n63N80m6j77K61k39J45Oj32L82m61J57K19n03M41k78j02
2000b41N96o74M61J08p92R81l06m91P80p72K23P61j139P47mr43J399o87n69J292
2020G30j315N25Q46j710J229O2j161J649j168l22J616j678P20O88j837J667j63
2037C78j270J798j331j05J693j950P83O27j722J856m81j360K003j356LJ614k187
2054a007J012P85j772J759p47j090K145j413q3J334j881J124O49j764J550n40
$$ y = [1488, -1086, -283, 1558, -1329, 567, 477, -1491, 1424, -135, -1042, 1344, -958, 41, 1280, -1479, 535, 473, -1184, 1296, -346, -851, 1284, -761, 28, 843, -1298, 644, 431, -965, 870, -464, -526, 1039, -758, 14, 486, -927, 641, 129, -792, 626, -296, -182, 707, -623, 52, 241, -472, 356, -115, -290, 317, -191, 79, 69, -494, 86, 40, -137, 124, -115, 30, 36, -96, 286, -175, -18, 201, -302, 139, -139, -241, 355, -319, 142, 250, -542, 439, 133, -358, 422, -350, -127, 634, -505, 242, 238, -705, 694, 7, -562, 730, -585, -60, 786, -924, 305, 367, -794, 855, -313, -635, 981, -697, 23, 711, -1126, 541, 378, -892, 906, -425, -530, 1163, -787, -4, 623, -1099, 757, 276, -1084, 919, -437, -434, 1180, -1007, 5, 790, -982, 777, 30, -1060, 1085, -328, -411, 923, -958, 166, 815, -949, 601, 61]
2070F1q89J913j450o3J238j594J056L23j584J495l75p26J489j354J05J157j368
2087e66P93J68j123J229k69p66J071q62R8R18j128L95L42p98R27k79o52R04n12
2106a10n4O10q47K94M10n82N23j82m55O38j79l65M75l53Q0L91m91O2K53l17K77
2127G8Q4m68L69M9k80L32k46j76N78l70n2L70n77L22K34o42N40n3m11P17m45k47
2149b94P11p00K18M38p84N17J78o63P95l86m18R35p54M2N98r08O39K13r04Q62
2169C35l23l82R32q04R1O62j007O03K36r15R35k53n26R51p41k5P31r14M39L21
2189C46r10Q70j90n88R62o22k21Q44q89L46M43r44Q05l0p86R58m55l26Q98q82
2209c71K41O18r56O08K13q95Q83l27m17R27p61K4P39r84N42K99r55R06k29n41
$$ y = [61, -828, 1085, -365, -428, 810, -784, 272, 595, -989, 506, 131, -595, 894, -460, -355, 802, -566, 227, 395, -728, 501, 232, -534, 537, -325, -227, 691, -437, -42, 300, -498, 429, 150, -502, 402, -110, -164, 446, -401, -107, 303, -279, 244, 62, -393, 245, 66, -299, 176, -177, -97, 294, -197, -135, 118, -199, 78, 162, -306, 63, 112, -168, 164, -82, -258, 320, -50, -102, 268, -309, 13, 247, -395, 145, 92, -319, 398, -47, -294, 417, -283, -65, 373, -411, 106, 284, -379, 416, 30, -388, 547, -207, -165, 433, -475, 164, 377, -527, 335, 12, -370, 562, -242, -151, 511, -496, 107, 343, -572, 363, 110, -416, 535, -206, -231, 500, -414, 25, 346, -564, 306, 116, -472, 490, -132, -353, 491, -398, -52, 391, -553, 252, 222, -564, 394, -61, -387, 511, -371, -130, 488, -468, 140, 353, -542, 341, 14, -403, 524, -237, -213, 526, -458, 84, 383, -572, 334, 105, -436]
2229d36R46o43j27P94r38M07M14r19P80j01o43R30n95k10Q70r03L02N05q96O77
2249B14ro60R14n31k17Q30q69K58N15r92P33P7p97R57m33k89Q03p30J33N05q28
2270d16N38Q3o23P41l19l35P06n63J6M79o55L88J59n03M92j78k21M87l64n5L88
2291B45m00J76J74m12K78Q6k90K65j06j57L15j78j24K35j35m3K56k90M1K21k35
2312g8J65L3l70L99j04j97L83l50pM31m59J90K25o15N92m9o23P14l08k23P28p57
2334b80J38N40p74N92m0p35R00l79k64P84q72K89O14j025O37K6p22J125o02l98
2354d46R53r16M17N47j198Q18M0p19J036o62l32J077r39L51L15r91Q86M5p50R90
2374E22p04o4Q44r78L10M60q68R46k10q11Q91l53K8M70r18K76O78p82N00k55m47
$$ y = [-436, 510, -133, -260, 534, -404, 3, 417, -502, 278, 177, -466, 464, -131, -341, 529, -374, -72, 433, -463, 214, 205, -455, 459, -72, -289, 541, -328, -70, 445, -547, 186, 263, -534, 423, -10, -299, 504, -226, -93, 412, -416, 122, 205, -418, 323, 4, -331, 375, -188, -172, 307, -348, 40, 199, -304, 188, 10, -211, 276, -88, -143, 245, -155, 21, 195, -217, 61, 147, -143, 122, 16, -141, 174, -4, -128, 107, -28, -71, 185, -105, -64, 157, -78, 87, 120, -250, 149, 45, -152, 231, -119, -126, 305, -154, 36, 261, -354, 238, 189, -434, 280, -28, -251, 477, -280, -142, 398, -376, 216, 176, -559, 341, -38, -302, 482, -390, -101, 513, -512, 125, 151, -571, 554, -48, -446, 507, -409, 8, 555, -643, 175, 215, -504, 532, -130, -462, 615, -324, 27, 342, -649, 237, 282, -468, 522, -182, -246, 598, -380, -70, 390, -478, 468, 258, -553, 338, -15, 13, 483, -435, -159, 519, -263, 237, -18, -465]
2395d65Q54m18o1L20o20N84J19n73L38j62o5M88l87o9K29k64L40j41l07K40M5
2416B5M5n2j88J00O2J07o6k42K35kN3P6m30K36K39l17K92k70j57O15m60m5L38
2439A94n80O28K9p04O93m22q2Q15r39K73N05r01P33qq34J159p01j36R55j287M11
2460a99O34j062J060k85q97J562j015l01J061j319R25L26j216J101k22q41J458
2477G70j068j72J328j507P95L39j356J489n50p26J474j294J79J111j577R75K18
2494D28j253J430o94n59J429j242K85Q90j429R83R4j150J401p10m17J249j229
2511d94L50P25j222Q88M2r36J214o64k78R78j019L15N29r88P60K1p38R65n54k00
2531c06P58o95K63K76o83N88O1n64N30k85k32O49m65J06O7l08K90Q6m77O10l03
$$ y = [-465, 389, -29, -90, 230, -390, 194, 313, -260, 78, -84, -149, 339, -48, -117, 112, -152, 188, 47, -260, -20, 25, 70, 18, -170, -70, -8, 99, 33, -209, 26, 24, 77, 153, -277, -41, 198, -119, 173, -97, -254, 361, -99, -144, 194, -386, 242, 271, -433, 260, -162, -244, 571, -368, -95, 410, -491, 242, 234, -600, 559, -142, -278, 677, -610, -199, 435, -627, 433, 148, -749, 813, -202, -503, 558, -761, 164, 490, -726, 375, 153, -688, 770, -298, -470, 858, -649, 146, 485, -871, 618, 68, -658, 816, -478, -299, 812, -765, 210, 428, -825, 605, -89, -648, 781, -461, -176, 714, -715, 268, 362, -788, 613, -97, -514, 735, -494, -144, 581, -641, 247, 289, -647, 567, -97, -375, 603, -416, -101, 428, -560, 200, 221, -517, 448, -106, -306, 452, -243, 20, 296, -387, 201, 262, -302, 228, -57, -289, 360, -105, 1, 68, -240, 50, 136, -341, 269, -34]
2552c4j11N16m72j01M27m45Q4M45k97m27L54q1M6L8m5K67k40o9K72K3j95J69k25
2575a01M3M09n73K98l3l07L89k25r8N30l67rL71n44J54L33n10L70qm88O34k15
2597E3k28M83o20J77N51q14M53K8m21P48m25k4L45o18K46N11q87N21K86p30N87
2618B22m91j67J026m68m76N92o85M56L88r14R13n51J0N32l66j42M88r26O13K79
2638C33q07O21K9m93N68m78n4O13n81K47K37n75M18K8m44N58k23j62M90n71J50
2659i6L31m68K52J22l86M01j30k06L76l10O2K95m58J70J95m53L98R9m43M33k00
2680a6j62M35m09K3L26l75J52K29n20M88j17k48M91l65j8L73m28J01J60m44N22
2701A98k3n98O56k52l18O48n52K13K36n31K74L23o46O33j67m67O40n10O0N26o38
$$ y = [-34, -145, 371, -101, -202, 225, -220, -136, 309, 12, -415, -61, -142, -96, -58, -103, 164, -76, -145, 127, 150, -45, 124, -101, -58, 351, -222, 76, 43, -264, 125, -100, -198, 332, -35, -44, 327, -217, -63, 270, -240, 130, 122, -366, 268, 53, -175, 308, -312, -135, 416, -398, 55, 83, -338, 410, -15, -39, 306, -312, -66, 445, -442, 79, 365, -365, 222, -269, -436, 590, 122, -354, 238, -447, 9, 397, -517, 396, -155, -145, 387, 21, -121, 367, -559, 54, 333, -474, 147, 176, -317, 251, -227, -281, 332, -249, -2, 235, -340, 78, 106, -338, 220, -3, -165, 325, -246, -96, 235, -233, 19, 141, -245, 156, 26, -180, 196, -114, -52, 243, -215, -45, 150, -303, 95, 194, -249, 184, -16, -178, 257, -152, -129, 197, -178, -26, 203, -317, 171, 54, -194, 297, -68, -86, 287, -141, -40, 120, -324, 198, 175, -423, 233, -19, -337, 311, -241, -28, 208, -323, -49, 274, -372, 261, 94, -373, 267, -243, -183, 343, -295]
2722b95K13L42o23N52m4n15P63m95j77O63o94L56K29p06O22m4n00O92m09j35N64
2743C59o44K77L17p21N81J2n62P01l84j91O38o42J88M04p15N32M3n38O56l23k63
2764b75O28n64J13L38n29L69J22n34N80k48k41N85m81J0L79n12K75K05n14M65
2784A71j29l01N56l87j08M68m98K59K21n46M42m8m38N30k61r1M19m22Q7K66m01
2805b11K28J36m06M51k04j44L19k82k2L50l70J48J77m26L91m5k97L62k12n1L54
2826B46l56J3K66m05K88Q0l09L05j02k02L72k90p5L38k25J7K49n19M82N9m94N70
2848C08l84RL41n47J47M38o77K75N34p15K80l9j03M75k78l6j42J4J42No73N30
2870i6L70m61K41k51j2L52o32J33O35m14J88J34o63P67m10j99N77l55j84M12o64
$$ y = [-295, -82, 260, -363, 189, 145, -370, 393, -102, -279, 384, -310, 46, 275, -431, 191, 147, -353, 339, -70, -205, 359, -285, -8, 309, -412, 169, 181, -381, 320, -64, -255, 383, -259, -71, 333, -382, 150, 193, -345, 311, -12, -275, 353, -211, -98, 240, -289, 80, 202, -332, 248, 0, -241, 344, -137, -127, 252, -260, 15, 220, -294, 171, 42, -259, 297, -90, -198, 270, -228, 31, 252, -294, 148, 100, -338, 192, -69, -160, 259, -163, -76, 190, -211, 17, 153, -253, 198, -6, -150, 169, -113, -135, 215, -155, -7, 170, -256, 135, 90, -207, 155, -57, -108, 246, -110, -97, 169, -236, 52, 132, -177, 128, 26, -176, 196, -94, -169, 169, -56, -39, 210, -309, 173, 232, -262, 308, -76, -67, 274, -273, -126, 312, -365, -90, 444, -271, 9, -30, -133, 342, 64, 28, -114, -100, 42, 47, -626, -96, 274, -187, 54, -197, -209, 143, -489, -356, 279, -135, 53, 187, -476, 291, -119, -318, 259, -96, -280, 132, -532]
2891e32P39O3n58M53r8m82O33n69J99O77q60M26L0m56O17k54k27N35m14j42L66
2912A46l38K06K40m78L56k27j96O10m38J2J93l02M35k0n99P68k86P5J01l89j07
2933b38N05l39pK26m06M41m2k97K82l08R4L92l97P9J31l00L64r8k93L19j66M0
2955a8K02l76N0L23k34K12j82k91M25J7k25J14k26J71K07k60J1J03j80K77j20
2976@j55K02p7J20n4j18M9P0O9j03ln8J31j6l8j22j2K46nq5k01N8J61q0N6j01
3002f6j5K00j02j90J17r9J27J36k38n7K47P6J83m45J01N8J14J04k33l41K65J5
3024d3j16L75l28K94j76r1L28k61l52P92m70R0K22m47J03O1m75Q26l70M4N91q89
3046b92K7L94m92K84J26m04M66r8m8N05o15j54P66o05J57K79n38N22k0o16O18
$$ y = [-532, 207, 270, -288, 165, 67, -415, 218, -351, -152, 525, -335, 91, 121, -335, 282, 28, -199, 336, -78, -220, 146, -192, 14, 254, -224, 132, -95, -291, 319, -119, -107, 86, -216, 219, 199, -400, 368, 82, 157, 258, -131, -238, 267, -72, -79, 147, -259, 182, 140, -157, 125, -183, -89, 303, -94, -15, 116, -184, 180, 82, -211, 108, -58, -18, 184, -192, -142, 181, -53, 159, -23, -314, 111, 128, -97, 17, -209, -38, 169, -91, -80, 23, -157, 120, 0, -155, 47, -30, 90, 36, -82, -33, 37, 106, 3, 0, -58, 73, 57, 19, -103, -115, 131, 126, 41, -160, -102, 59, -21, 35, -66, -81, 119, 17, -173, -56, -155, -28, 108, -130, -187, 60, 136, 319, -126, -25, 33, 147, 251, 18, -323, -58, -43, -159, 216, -112, 182, 6, -85, 243, -18, -370, 422, -48, 42, 264, -183, -80, -19, -494, 332, -38, 6, 597, -292, -265, 129, -363, -79, 47, -357, 109, 11, -37, 468, -147, -301, 465, -140, 17, 296, -242, 280, 260, -356, 262]
3067B62m41n1O67o92K05K38j76j4q3j92N09j94n6L28n49K28J37l74K29K24l13
3088a08L62j39n01O46k70r5J25j55OJ43L1Q8m4k58M89l53L11m1m06J40R8l06P4
3111a63O9O7L3n0j41J74J63j45q8Q6K51k44l49N39j66j09K03j91L88j16m99J52
3133a36L41j70J37k79L2L73k78j87M01l65L23Qm08L17j40K3L9J10j94j20QK84
3155A19l5j89QK01j80J36Nj10L9J3j49J67j24PR4j13J22M6k36J58K15j56O2j44
3179d4l7J79q2pp9J0K32O7k11J18o8Pp5j17R2K70k64J28L4k25L06q7k24K15j62
3204b4p5L39j86P5l5k27L10L8l19L25k90J28J20l84J11L41k66J00k06j16M07k99
3226a33J99q2k19K47L5m04O03j08j09r2j30K5J99j19M3K85k66J54r7k48O01l54
$$ y = [262, -179, -230, 437, -255, -50, 188, 12, -2, -85, -277, 232, 38, -18, 310, -239, -11, 126, -248, -19, 205, -108, 254, 115, -386, 260, -10, -105, 20, -135, -129, 14, 45, 133, 89, -169, 320, -33, 278, 237, -169, -29, 69, -237, -163, -94, -27, 6, -44, -185, -11, 152, 7, -81, 5, 256, 12, -337, 202, 36, -73, 130, -61, 327, 211, -288, -136, 205, 35, 172, -107, -75, 298, 20, -167, 234, -131, 192, 200, -208, 109, -31, -8, 31, 141, -53, -173, -165, 119, 84, -105, -97, 104, -76, 60, 65, -45, -6, 7, -142, 25, -99, -92, 2, -111, 11, 57, -179, -21, 194, 38, 100, -44, -81, 98, 16, 9, -70, -60, 172, 239, 28, 146, 78, 85, 10, -107, -15, 255, -9, 119, 153, -72, 234, 147, -77, 138, -24, -99, 240, 54, 129, 94, -133, 177, 215, -104, 221, -69, 59, 179, -205, -94, 247, -19, 81, -125, -241, 166, -133, 66, -16, -235, 12, 47, -357, 246, 138, 29, -63, -193, -168, 31, -88, -45, 240, -26, 128, 31, -217, 384, 30]
3248C0KK27l01O2P3k62J92R3k08K83l62J50N1j53p8K65l04j06M16m53K68m9Q7
3271g7J99r4L4j42J52m2j08P6j32j07J68l8J33J80j46j02p2J89k8r7N2nj22K11
3295H2j04n0J14o7L1O6k25J93M8j41J93j86q0K60j90N5M9k49K78j9j94J99j18
3318e5j8L16l67R1J19l03L08o0k00L08k07j2L27m26J76Q0k35K65j20j61L08k03
3340f9j8K45l56K04J04k97K94r6k45M69l05j5L06l77J64J49l74L31r9j96M14l01
3362f8j8K29k95K36L5l28K91l8j69K90k74K6K26k54J32M2k20K88p5j23J53j94
3384a08O0K24k81Q6P4j33K11j14j48J64l3l5J72l06Q6J58q4M9j05r1K55L6j25
3407A2j5m8L3R0q8m3Q3o0J55j01q8L6M3K1R2j72q4K45j11J3n2j39K44R1k30M6
$$ y = [30, 32, 259, -42, 20, 93, -169, 23, 116, -92, 191, -171, -21, 30, -123, -201, 64, -240, -346, 70, -383, -115, -164, -77, 122, 28, 62, -80, 72, 30, -78, -2, -134, -241, -73, -111, 22, 202, 56, -46, -118, 71, 43, -54, -2, -7, -129, 82, -22, -72, 42, -25, 6, 72, -153, 40, 88, -53, 140, -46, -126, 134, -56, -1, 48, -201, 77, 58, -136, 63, -55, -73, 243, -124, -33, 86, -217, 91, 31, -169, 139, -68, -80, 247, -179, -3, 77, -158, 107, -13, -174, 134, -69, -87, 158, -198, 6, 110, -187, 107, 11, -234, 235, -70, -85, 221, -156, 8, 157, -217, 114, 15, -181, 233, -68, -86, 143, -152, 84, 119, -209, 82, 44, -125, 165, -109, -83, 143, -111, 21, 63, -157, 131, 56, -67, 86, -108, -48, 176, -105, -19, 55, -78, 133, 19, -129, 35, 2, -33, 139, -167, -81, 77, -7, 42, -63, -154, 101, 137, 12, -3, -51, -18, 72, -16, -59, 24, -36, 119, 18, -70, -34, 9, 30, 122, -50, -134, 111, 0, 13, -39, -178, 66, 157, -73, -27]
3433b7m0N9J77k30p4J21lJ61j11k32J58J31q4O7k34L9K80j47k6jj15K35L2j78
3457d2K3q8J14J48k36kO3L1J10p6k99K72J03j24M0k12M2L41j94n2l0p5L23m1k50
3482a11P0j5R1J18k70L1P3PJ30j27j83K39O4p6M3k43J25K31k50R4p0j42L41r1
3506G9k06Q5k3R5J45l08M8J47j18K13k16r4K57p1p0J14k88K35J33k78J64j14O
3529f5K09j65q0J24l0O3L7k29J21Q4q7J31j66o8K23m1j09N4r9J24P5j71k4J11
3553B2r1J43j04m3J78j91J33k1k49K94K6o5O3r7nR3k7p1j59M4J47Kp4K2M3n8J52
3580A07j28k0O3n8O1j4j01J18K5j12J21n8n5J46p1k6P5j60J08J3j55J42j0k1R9
3605H9j32QJ44j87M0J06j70J24j2r7J41q2J0Q9j44J10n3m9R7l3p5J64n7p9J29
$$ y = [-27, -67, -8, 169, -61, -135, -14, -17, 144, 33, -199, -41, 90, 6, 73, -161, -122, 158, 11, -15, -16, -131, 104, 136, -42, -19, -107, 7, 155, -81, -83, -20, 11, 121, 45, -254, 18, 121, -3, 37, -175, -133, 208, 14, -38, -68, -143, 180, 139, -111, -41, -56, 35, 153, -117, -86, -13, -6, 124, -3, -186, 53, 117, 41, 84, -159, -34, 197, -53, 41, -29, -171, 170, 79, -127, -42, -65, 30, 175, -133, -85, 62, -56, 157, -59, -153, 104, 33, -37, 77, -211, 24, 157, -121, 43, -71, -65, 144, -21, -101, 23, -7, 56, 93, -136, -15, 69, -18, 113, -53, -121, 102, 61, -48, 6, -93, 31, 106, -65, -89, 22, -69, 74, -30, -73, 105, -86, 47, 26, -223, 71, 97, 32, 95, -2, -7, 86, 59, -12, -171, -127, 20, 22, -52, -30, 13, -45, 107, -21, -41, 22, -36, 25, 11, -90, 28, 53, -59, 62, 4, -51, 95, 24, -2, 73, -87, 21, 34, -121, 21, 11, -10, 89, -43, -35, 109, -78, -38, 68, -102, 22, 10, -87, 54, -28, -18, 71, -73, 37, -16, -65, 32, -1, -76, 88, 31, -48, 81]
3630H1j48J8J39j65lR1j03J06L6j61K02r3n8J12j64P0R6q7K2kq6J08j3n0R4j17
3656g5L0R1j43R9O7j14J07r0q3K05j01r8J59p1l2J14j75J44k3j32J62r9o0K25
3680A07j18p5J87j67Q8K1j22J34k6j46K18j06o3J57k04R3Q3j91J60j2q9J87j97
3703h1L5J23j51K5R3j54J96l0j32K28j52j5J18j58K3J28j59J04j7j31J45j05M5
3726b2J39k03J16N7j68J58o1r7J26p9jJ05j35Q6L7j27J11m4n0J24j04OO0j18J39
3751E5k9j40Q6R9j73J98j54O5j0qL7L5j17J25l2q9Q3j5Qolj2R5j56M0O7pk3m8
3780b9k6J1K3m0J73j59M2j28J49k4l5m6N7l5Q6k15K97k59j82L84k23L15j66nn6
3805i1J18q3R1j05J42j13j0Q6k4m7P6j03R3mo9O1l1l5J15j00QJ47k20J42o9m7
$$ y = [81, -67, -49, 90, -75, -78, 13, -90, 16, 52, -109, 93, 0, -58, 54, -110, -40, 56, -31, -9, -11, -97, 11, -2, -52, 42, -75, -45, 46, -97, 2, 69, -45, 62, -28, -111, 94, -7, -105, 54, -17, -49, 65, -110, 34, 11, -121, 41, -58, -118, 107, -11, -86, 101, -66, 22, 43, -79, 55, 29, -117, 101, -5, -68, 89, -115, -22, 61, -130, 30, 18, -71, 116, -81, -46, 77, -74, -49, 44, -110, 86, 56, -76, 152, 0, -15, 103, -55, -32, 96, -63, 41, 24, -107, 38, -67, -22, 117, -86, 30, 87, -81, 77, 16, -81, 45, -34, -35, 70, -65, 21, 58, -69, 42, -2, -52, 72, -32, -26, 34, -84, 55, 26, -114, -28, 71, -102, 96, -58, 7, -3, -11, 26, 61, -56, 69, 37, -52, 31, 16, 24, 18, 15, 3, 98, -58, -18, 49, 42, 19, -29, -55, -44, -21, -61, 112, -47, -5, -133, 16, -8, -43, -89, -32, -67, 19, -196, 101, -158, -340, 44, -179, 136, -30, -35, -91, 27, -56, 35, -70, 72, -41, -51, 35, 11, -36, 40, -63, 30, 26, -43, 18, -13, -48, 67, -33, -25, 122, -98, 44, -25, -72]
3831g2J58o4j23J91j07PJ15j65K8N7o7P7qq8J29r4OO2j56J45Pj9L6q2RP9p1j7
3859b7M8j30J93l8o9J5j3L8N2j40JM4QM3n1k9Q0j7l7J7o3N7L7n5O7lRl8K7o5l9
3890g8M6O9Mn7JNJ8Jn3NN0M7l2m4L1m9J16q4l2lM2J8l0m8M1J14m7n8m7J4O0j8
3922BK1k7p2L8J24r5p5Q8j8L8K4j14N8M1Nj2r5L8Q2p5j6n3L8J03k8p3M2l6Q1J4
3952D8j74O1M3K1J08q4j59J62k9L1lp4nJ34p1J7m8j8J30p1p0L3j0J24n2r0K1L9
3980A4o5J15j58L2R8l3L6l5q9J70n8o4j5QL8N8k4m4L6p2J56j62J4P8k8mK2p1J8
4009b9O7m7Po2m1J58o0j7k7M9M9lp3l3M6j6M4j2l3L1L2n4N9m7P8q1K9j1l6N2M1
4040F0J0n4j3JL4L3j50K8Q5l3j3%L0K8j9j0J2K0j11J15j31J1J0J78k07J77p6j2
$$ y = [-72, 86, 22, -101, 90, -17, -10, 105, -60, -32, 25, -42, 35, 27, -61, 68, -26, -20, 42, -114, 31, 38, 19, 55, -27, -18, 61, -10, -27, 21, -109, 84, 46, -23, -8, -21, 17, 69, -71, -70, -26, -18, 25, -26, -55, 25, 8, -29, -12, -75, -18, 19, -36, 31, 28, 37, -1, 26, -39, -78, -32, 37, 41, -16, -15, -10, 8, 9, -44, -39, 11, 58, 26, -18, 13, -36, 80, -4, -36, -39, 3, 21, -9, -57, -16, 98, 51, -7, -54, -40, 20, 2, 23, -4, -76, -38, 86, -9, -84, 4, -14, 24, 48, -66, -8, 33, 38, 26, -69, -31, 51, -24, -40, -93, -55, 48, 20, -53, -11, -47, 34, 48, -126, -65, -22, -1, 107, 23, -136, 26, -3, 28, 25, -49, -54, 80, 9, 26, -22, -40, 90, 19, -51, -18, -28, 96, 44, -46, -25, 14, -51, 64, -94, -62, 36, 3, 39, 4, -85, 85, 27, -37, -52, -44, -6, 52, 28, -16, 20, -52, 104, -58, -44, 34, 6, 2, 24, -47, -29, 38, -9, -2, -64, -105, 53, -7, -24, -51, -2, 47, 44, -29, -62, -16, -32, 12, 0, -33, -2, 30, -24, 35, -12, 66, -15, 14, 3, -33, 19, 60, 70, 16, 3, 4, 38, 71, -79, -51, 34, 1, -12, -12, 18, 46, 27, 17, 29, 49, -62, 53, -78, -67, -57, 121, -86, 91, 15, 3]
4068CK8k72J56K02j2R8k55J5J63k80L7k18L31j34L3p4Q7O7p4K34j30K49l90PJ19
4093a0J00K06l52J03P4p7j52L90k72k80K50J77j93K78j22m28L76k1J26j45J00
4114A28j23L07o61M47K24n59K54k23K55m2L10l78j21K73J7o9j2j00J75k16K42
4135A28J13l08J10l82O48k79K8k49L34r1L25n14j66L04K53k75ql4L08l01K52m04
4157b08K9R5rK95k88k3K02K0K2j93o0J06n1k2K94j38J31q3n3K62j51M7p1k80J07
4182b0l8P0k84J47K73j54p1K37P0l32J21KJ66j34k7l3j4j24J57%oJ40j37o1Q2
4207C0m0L7J47k90mk6J30K3k7n1J18j41R3m0L6l5J03m0L6o8l1J17j7np9L1QJ0
4235B5l3m0M3K2J00j06Pj0rr1Q4m3j2J30m2mK4p3M6l4l8P8l2O9p1K0J3l2k4J9
$$ y = [3, 31, -241, -85, 117, 105, 203, -52, -37, 126, -154, -117, -335, -4, -138, -105, -179, -92, -25, -99, 135, 5, 254, -136, -129, -10, 90, 296, -56, 47, 121, 44, -108, 282, 10, -270, -20, 157, -36, 242, 120, -308, 68, 47, 173, 28, 128, 5, 312, -349, 98, 322, -237, 17, -206, 49, 7, 317, -61, -182, 91, 108, 39, 27, -73, 102, -114, 128, 241, -67, 43, -339, 309, 30, 58, -191, 143, 52, 377, -137, -303, 1, 254, -21, -29, -63, 245, -56, 196, -208, -179, -84, -93, 202, -86, -109, 93, 113, 135, -58, -118, -12, -63, -85, 209, 71, 202, 119, 66, 328, 177, 224, 153, -127, -20, -58, 12, -272, -125, 148, -6, -77, 160, 230, -102, 19, 21, 187, 53, 26, -7, -21, -145, 12, 12, 6, 146, 9, -52, 30, -10, 27, 174, -116, -120, -146, -16, 7, -20, -71, 47, -94, -1, -41, -5, -40, 63, 23, 59, -9, -40, 77, 60, 55, -24, 7, 15, 25, -8, -48, -5, 17, 117, 11, 18, 8, -1, -92, -8, -51, -63, 67, 25, 21, 45, -28, 18, -16, -54, 24, -8, 61, -10, 10, 23, -9, -33, -14]
4265a4l3P4L4o9mO2q1L2nk7N7l2MO1j03K5O8o2j3O7m9MK5%Jl5K5K8o4K8J6o9P9
4298C0J0n5jmNP0r0O5J1j1j1l5%n2L1L2qqL4j9O5o1rn0J02j82J08Q7p7mL4l1l7
4331f1J58j16O0Qj10P6k2K0J10l5o9Or3J10Mm5J6J76j82K0J16k53j8M4j9KQ2k53
4359b68K99j4K0l10N1K35Q2n28L56P8L8O8J05r6r1J66k66J55K6P1k70K51k07N
4383d4K23j20J9o6j4J06N2j44J71k77R3j20J40q5p5J00J7L4qJ60k74P4J33L0j75
4408e0K92l04K3J23k96J94J12l30J58J62m2m6k6P6J30j99M5oj06K16j04p2N4o3
4432e9O6lm2jM0p2M1M7j1l3%q6L3J10O9j55O6n3j1R6m7J9l3k3N4NJ5jl9N4r7Q7
4464C6l9j1j1J9j7K3l5K8J2K2q1N5J2ojK1j9njMnn0O3k4K1k9J5j7N3k8qRpM6J
$$ y = [-14, -47, 27, 61, -8, -12, 50, -31, 1, -4, -31, 26, -6, -2, 59, -44, -19, 49, -13, -26, 41, -8, -4, 21, 21, 22, -13, 12, 40, -24, 4, 20, -49, 30, 40, -15, -16, -20, -15, 55, -35, 30, 41, 30, 19, -16, -16, -68, -37, -5, -13, -21, 13, -6, 59, -2, -11, -61, 41, -141, -33, 54, -23, -27, 7, -24, -61, 97, -19, 41, 49, -61, 15, -7, 13, 123, 88, 19, 25, -68, 42, 46, 1, 17, 193, 11, 31, 147, -106, -124, -80, -99, -97, -15, -268, 31, 17, 37, -273, -222, 13, 95, -433, -77, 1, 39, 107, 212, 116, 25, 191, -75, 80, 106, 177, -93, 158, -49, -44, 179, 59, 78, 12, -2, 104, 156, 12, 183, -94, -1, -121, 19, -66, -141, -41, -24, 10, 2, 162, -112, -38, 95, 125, -50, 242, -62, -39, 84, -212, -18, 94, -236, -78, 84, 42, -4, -30, 46, 176, -23, 22, 16, -90, 126, 22, -50, 4, -59, 7, 4, -38, -39, 1, -71, -30, 17, 6, -27, -27, -113, -80, 30, 99, -56, 10, -43, -54, 42, -5, 14, -19, -42, 12, 17, 32, 31, -8, 46, -51, 36, -3, -14, -25, -6, -23, 0, -35, -7, 5, 27, -54, 1, 13, 7, 6, 27, 8, 3, 2, 6, 1, -49, 14, -10, 11, -18, -3, -20, 33, 5, -3, 6, -1, 45, 46]
4499D6o2MK0J5no8M0M7q4N2n4K0L8j3k0O7n5M8Kp6L7Ol5R3m0l3Mm3R3Ml4LJ0q9
4533f2J01m6k8M4l2J0K0nooK0nLk1K1n3L5N1j13J16n5LJ8%jjo0J8O7rk3k9LM0
4567A5k1k1M6rLm5PL7j6J6L5l5MOk6k6Pk9O7m%n9J1L6rl4N2k1K0J6k6J8j0j2R
4602BK0n9R5m2k3kJ3n5N0k5j4Q5l4j4ol1L1J4k4O0m6%J6j0M0k0K0k8OMn4K1l4
4635d4lJ20j17N1J1k7%n0L7kL6m8K1k3Q3l0lj2m3N6k6K4l8Q3m1l6k4J2N0M4j2
4666D9k5j9J3rn7J7L4k2LmL6OOk5jJ1K6j0m5J6K4l4J1l4L5K4ql1pO0j1n7M6k0
4700bk4L9J3l5L4kn5N5j5j5pL2l0K2k0l4j0L5M1o7O0Po0OO7m4lmk6P1n3K1j2N
4734a0J4l3lN5l6M1K9q2J9j8L4RQm9J5Lj3N6n5Pl3O6l6L9J1l7L7Jk3o8N7lKj0
$$ y = [46, -16, -12, 8, 23, 18, -50, -10, 37, -47, 5, -49, -29, 9, -4, -24, 43, -12, 36, 38, -38, -1, 5, -30, 63, 23, -10, -6, -49, 44, 48, 14, 17, 27, -62, 39, -7, -35, 9, -23, -13, 7, 2, -4, -10, 10, 5, 8, -13, 8, -45, -10, 41, -72, 44, -11, -8, 10, 10, 9, 8, -52, -34, 33, 24, 1, -28, -25, 15, -6, -27, 19, 10, 13, -32, -25, 12, -4, 12, 47, 12, 16, 22, -4, -30, -23, -52, 15, 11, 11, -48, -37, -1, -10, -44, 8, -13, 7, 23, -3, 15, 5, -7, 2, 22, -37, 58, 16, -7, -9, 4, -51, -1, -26, -40, 45, 11, -3, -9, -40, -9, 5, -19, 41, -5, -5, 11, 1, 41, 21, 41, 13, 19, 23, -31, -10, -44, -47, 73, -44, 7, 18, -9, -9, -59, -22, -24, 12, -36, -15, -38, 45, 15, 12, 0, -43, 13, -13, 11, -27, 56, 15, -21, -45, -33, 17, 61, 49, 24, 5, 18, 9, -48, -31, 3, -19, -16, -20, 16, 22, 28, 3, 2, 13, 39, 29, -16, 0, 24, -10, 1, -33, 2, 26, 18, -13, -20, 40, 29, -28, 18, -2, -26, 13, 26, -9, 25, 23, -32, 23, 8, -7, -14, 18, -12, 10, -10, -44, -54, -19, 22, -45, 15, 22, -38, -32, 35, -9, -12, -16, -42, 29, -24, -3, -15, -10, 4, -29, -32, 23, -13, 28, 57, -25, -6, -24, 10, 19, 27, -22, -7, -4, -17, 39, -16, -9, -42, 24, -12, 27, 38, 1, 38, 39, 16, -52, 5, 2, 4, -6]
4768fJ9j0%JJ0jk6Kj6k7P9qJ9m5nk1L1Rk9J6m0P6k5oJ6k4L5Jn1J8J3RM7r8JO6
4804C0m4N2l2K7p8L3M0l3Jj5M8m6LK4rk4J6N3m0k6L6jlj6j3M6o1M5k4J9L6k2j1
4837A1j06J16k3l4lp8J30o6M8Oo1N7L4m1J7J2m1M2mk7k0L0NJ1m7J2L5k0j8k2K2
4868b3j1K7N4r3P6m8K5l2N4n0j3P5l1j9RK7KJ6n3NLKk5K2k9K0K1j1l4L7j0N2o3
4901a8K3j5Qk5j4K6M6j9Nm7K5P2m9oj0k8k8O2%rJ7N7l5p3N8Q5r4k7J3n1L7m0J02
4934D8Qm2L1R4o3j69K72o8j09J3l3o1Q9O4j25OJ71k09O9Lj62MJ88R5j97L5j19
4961a67K15J48j09k54K34Kj31J9o4l9L60l09p1ML7J59j62M5j16J5M07j81q1J84
4985A45q8O9l09J40j19L67l85J36J41Q4j09J01k38J0j0J25m1k24K58M1k10M83
$$ y = [-6, 13, 3, 3, 4, 14, 13, -13, -11, -27, -54, 25, 17, 36, -9, -14, -35, -4, 5, -24, -8, -48, 28, 3, -3, 13, -11, 24, 25, -26, -8, 5, 14, 61, -37, -36, 30, -14, 38, 6, 33, -45, -12, 28, -5, -4, -19, 29, -17, -14, 10, 1, -23, -7, 46, 6, -20, 16, 15, 12, -4, -17, 29, -32, 13, -11, 8, 44, 22, 11, -95, 21, -2, -36, -39, -117, 13, -53, -5, 1, -60, -3, 31, -10, 7, 19, -22, 20, 16, -11, -31, -1, 4, 15, -32, -20, 15, -5, -23, -45, -23, -34, -7, 47, -46, 30, -18, 7, -25, 29, -21, -34, 41, 10, -9, 0, 27, 29, 45, -8, -3, 0, 2, -23, -1, -30, -10, 11, 0, -34, 3, -7, 45, -18, 5, -10, -2, -27, -41, -15, 31, 12, 17, -30, -5, 67, 18, 12, 2, -26, -54, 8, 8, -1, 16, 73, 38, -35, 23, 108, 14, -13, 0, -51, -14, -54, 48, 56, 14, 45, 139, 76, -93, 179, 111, 2, 15, -18, -79, 10, 74, -51, -45, 126, -83, -14, -11, -173, -169, 19, 114, -83, -48, -167, 48, 196, 87, -167, 67, 69, -62, -43, -107, -146, 214, -95, -166, -162, -125, 34, -128, -83, -199, -184, 223, 42, -39, 145, 57, 126, -183, -43, -162, 205, -180, -44, 97, 181, 72, 173, -65, -55, -65, 60, 19, -205, 53, 94, -116, 367]
5007C67k04n86M56J06k55n8L59m32L99L4p8Qk24o7o1J84L64l26L51l11n4k25K89
5030C6j19l1J97m9R4l60K51k9J6n3M2k6Rj0Q7n0j8O0j00L5J0k8K3k0K4J8l6K1
5058fJ4N4m3j9K0l3K1mLpM9mp3l1N5j0J7m5O0n9N2J1j9K4n0K2K5m9l3N0j2kj1
5091c3P7n9J7L2p5K5%K2J0NJ7j8J0m3L4j8Okqk5L3Nj7l5KK0K4k8Jk3O9k1L9k2
5125B1Lk9n4K6O6n6L2pm8L5J39j41j5M0p3N1M9j3m3k0m4J10k6Ql2L3p9O5k8L2
5155Bp2J50m8l2oJ5k7J7oL8l2J9k9K9l0N0n6jL2p9Q1r4O9L3m1M7K1o5k1M4j2J
5187cjlj1K1p0N9mK5o1L2M2k8J5pPJ0n0N3k6j9J3l8N3l6N9m8JJ8m2M1LM1pm7m
5222a2LJ6k9M1qn3M8K5l2k3M0%j6k2J8J2J0m3OM7m1L2m7l2K8L0l1N0Qo7J6M7l
$$ y = [367, 163, -423, 33, 139, -116, -174, 185, -247, 152, 186, 108, 116, -108, -175, -236, -52, 312, -14, 337, 26, -28, -253, 36, -83, -114, 83, 34, 128, -232, 19, -10, 6, -47, -5, -31, -22, -32, 55, 5, -13, 47, -53, -18, -8, -36, -13, -33, -9, 9, -27, -6, 8, 62, 19, 0, 20, -13, 8, 4, 7, 0, 49, 45, -28, -59, -4, -14, 3, -42, 18, -41, 11, 22, 3, 27, -23, -1, 24, -25, -58, -8, -20, -22, -33, 44, -15, 2, 34, -41, -16, -16, 6, 16, 21, 38, 20, 30, -13, 21, 3, 9, 7, -1, -26, 7, 12, -5, -40, -38, -18, 6, -22, -21, -44, 25, 4, 43, 21, 24, -5, -59, -33, 33, -23, 9, 2, -46, -11, 128, -13, -28, 12, -61, -10, 39, 26, -17, -37, -81, 29, 3, 11, -21, 12, -67, -2, -30, 2, -70, 80, 32, 0, -6, 9, -18, -1, -7, 31, -1, 18, -11, 18, -12, 38, -18, -19, 13, -66, 15, -79, -10, 23, -18, 29, 50, -15, -36, 8, -4, -3, -4, -7, -18, 3, -67, -8, -12, 13, -48, -16, 26, -2, 13, 6, 13, 23, -27, 26, 0, -19, -6, -44, 9, -27, 32, -16, -15, 3, -39, 2, 5, 46, 39, -8, -12, -9, 7, -22, 19, 11, -42, 6, 31, -1, -24, 16, 16, 0, -22, -4, 8, 18, -25, -19, 28, -13, 19, -28, -60, -32, -2, -33, 17, 25, -42, -26, 21, 18]
5255A8m2K9Nj2NM0p1O1l4J0Pk7L3rk9k0M4K4Jj6%K0o7L8j7K8j6M9n7Rr%lj0M7
5290B9m8jM0n8j4J10k2m5K2J5l3L5qm2NN7m4j1K1J6l9l4O0oJ8j4k9kL3k0l4O8
5322B5o1M2k6j3M9m1L1mJ8L8k9m0J4Rl2N3n8O5j7kj2L1r7J10m6K9n3l9J00Q8j38
5353fO4L5j92P6P9Q2j02N4j72K68j83QN4J47k26K15k98K29j94K08J02p8R9j49
5377A20k37J45J45j65N3J10k37k54L77m5J4N1r9l3J02N3n1oq9k4J5R8N3j30rJ07
5403F4j68m9J4K91m1j17j4M2j2q3j68K52n5J16l2L6q4j21J09P4J3o6J33j90J57
5428A01l3P7k08mL29j69l5PJ44J0k25K27l95J77o6l8L5J13r8Q2j1oMm8K6J06n7
5455D5l8J8l3K8l9N8oq5M1K2M0J1l4k7pl4J0N1k5j6J4mON0m3J6k6N4j69Q6Kl7
$$ y = [18, -24, 5, 10, -2, 3, 43, -28, 33, -1, 9, 16, -11, 22, 13, -16, -36, 8, 32, 33, 17, 17, 37, -30, 8, -9, 19, 3, 52, -5, 4, -5, -5, -8, -18, 29, -19, -20, 20, -38, -52, 58, 36, -9, 13, 28, -5, 30, 22, -20, -15, 42, -2, -13, 8, 24, -15, -49, 11, 5, 23, 9, -20, -22, 11, -9, -43, 25, -36, 6, -20, -33, 16, -25, 6, 2, 20, 58, 29, -11, 3, 12, -20, 33, -25, 40, 23, 21, 9, 40, -57, 53, 7, 36, -17, -56, 44, 132, -6, 58, 93, -99, -23, 56, 138, 36, 90, -82, 186, 3, 11, 65, 212, -14, 201, -97, 132, -62, 146, 248, 170, 269, 120, -117, 28, 173, 8, 61, 171, -66, -320, 57, 12, 26, 77, -22, -55, 47, 100, 49, 43, -46, -70, -55, 43, 96, -34, -43, 64, -104, -153, -139, 152, 111, -6, -20, 22, 10, -73, -241, 11, -44, 72, 40, 76, -8, -129, -20, 54, 67, 1, 134, -56, 101, 68, 145, -63, -67, 262, 93, 58, 65, 209, 219, -6, 221, -174, 3, -63, -101, -66, 47, -51, 31, 20, 14, 18, -30, -4, 102, 45, 7, 25, -8, 20, -19, 39, 33, -52, -11, 11, 51, 62, 28, 1, -6, -40, -30, 21, -4, -20, -6, -10, -4, 46, 3, 19, -7, 47, -122, -36, -34, -71]
5487g1l5R0Q5J7j30p2K3R5p6OJ68r5J2J5n7j16J59Qj39J35k8j8R1r3R9o3Q5j61
5515f6P7M8Lo3j0lmL7l4L0l8M9Lm0L7Qqm7RK9l3K2k0J0L0lo0Q5n9MK0M3p5J4K3
5550A8n1J9J3J8L6n1opJ6j6lKj5N7j0l4nM0k1k2K8j0K8l3K9n0R2m0j4k7L4Mj3
5583FJrK2o0Q7r5P5m7L5k8k1L5Q1r1j0mNJ5j4qL6mJ0k2j9J2j1o2M2P8m0K7n2J0
5617b0M3q0Q5k0l0k5ML0K7k4JJ4K6j5o5L6OK4k8qL0Rj1j4N1p4Rj6ML3Nqrk0jM0
5653IRj6J1kl4L9J5l3j2K6n4L0OoP7n3j1l7K7J1K1q0M7MK5k4pk3L3j0qK5kl7K9
5688eM1l4l9J6N4k4J3k0k0L2k9JJ2l5M7KnlJ1lmj5rL8l8JPJ0j8Nk4k9J00n0J9
5723EOj1J0k4JJ3M5l1K1p7M8j3mJ6Nl3L7Jk6N7oro4N5K8o9N9o8OJ1N1n0KKoK1
$$ y = [-71, -106, -16, 69, 86, -44, -116, -93, 2, -74, -68, 100, 5, 17, 32, -25, -141, 18, 26, -113, 22, -6, -24, 67, -26, 73, 10, 95, -66, 11, 59, 62, -1, -11, -14, -18, 19, -15, 15, -23, 26, 29, -11, 26, 34, 26, -21, -12, 17, -16, 6, -14, -4, 26, 23, -37, 48, -11, -7, 13, 56, -19, -5, 18, -33, -14, -1, 17, 53, 2, -4, -11, 5, -11, -14, -12, -27, 30, 20, -14, -19, 21, 0, -22, 6, -4, 24, -9, 20, -30, 62, 22, 8, -19, 15, 19, 6, 7, -2, 20, -40, 47, -48, 27, -20, 15, -13, -34, 1, 82, -9, -19, -23, -18, -3, -17, -25, 11, 7, 17, -5, -24, -12, -23, -85, -43, 35, -5, 22, -30, -20, 23, -57, 28, 8, -22, -47, -43, -13, 14, -10, -9, 5, 31, 16, -49, -13, -7, 17, -11, -19, 11, 20, 9, -5, 46, -28, -19, -35, -31, 2, 7, -1, -10, -30, -31, 9, 18, 2, 13, 11, -23, 16, 31, -2, -14, 12, -42, -12, -6, -12, 65, 12, 1, -36, -9, 2, 23, -57, -10, -6, 19, -5, -12, -35, -2, -12, -20, 5, 3, -34, -5, 36, 2, -37, -21, 33, 9, 22, 2, -18, 14, -15, -14, -2, -37, 10, 12, 7, 4, 15, 12, 8, -7, -16, 22, -16, -15, -8, 2, -16, -11, -35, -64, 36, -14, 5, 11, 0, 10, -14, -13, 0, 45, 14, 35, -42, 6, -7, -11, 5, 10, -23, 14, 15, -11, 46, 40, 31, -33, 22, 50, -19, 40, -28, -22, -11, 40, -10, -8, -6, -12, 9]
5759Ijj5mL8L2p1p3M0J9N4l6J8nm0J8J2K4km0J6K6L3r6O1j5M%m7L0j2J1m1P1j
$$ y = [9, 8, -7, -11, 27, 59, -12, -85, -45, -26, 28, -8, 10, 5, -35, -17, -5, 19, 17, -23, -7, 19, 52, -44, 17, 2, 6, 6, -41, -11, -23, -12, -53, 18, 17]
$$ [...]
8191C9
##END NTUPLES=NMR FID
##END=
