##TITLE=1H_ABDP3105
 CDCl3, 8 sc, 
 1.06.2021
##JCAMPDX= 6.0         $$ Bruker NMR JCAMP-DX V2.0
##DATA TYPE= NMR FID
##DATA CLASS= NTUPLES
##ORIGIN= UXNMR, Bruker Analytische Messtechnik GmbH
##OWNER= root
$$ XWIN-NMR		Version 3.5
$$ Tue Jun  1 11:43:00 2021 Russian Standard Time (UT+4h)  she@DPX200
##.OBSERVE FREQUENCY= 200.131506
##.OBSERVE NUCLEUS= ^1H
##.DELAY= (6, 6)
##.ACQUISITION MODE= SIMULTANEOUS
##.ACQUISITION SCHEME= undefined
##.AVERAGES= 8
##.DIGITISER RES= 18
##SPECTROMETER/DATA SYSTEM= spect
##.PULSE SEQUENCE= zg30
##.SOLVENT NAME= CDCl3
##.SHIFT REFERENCE= (INTERNAL, CDCl3, 0, 15.7039)
##AUDIT TRAIL= $$ (NUMBER, WHEN, WHO, WHERE, WHAT)
$$ ##TITLE= Audit trail, XWIN-NMR		Version 3.5
$$ ##JCAMPDX= 5.01
$$ ##ORIGIN= Bruker BioSpin GmbH
$$ ##OWNER= she
$$ F:/spectra/data/she/nmr/H-F/1/audita.txt
$$ ##AUDIT TRAIL=  $$ (NUMBER, WHEN, WHO, WHERE, WHAT)
(   1,<2021-06-01 11:42:03.32 +0400>,<she>,<DPX200>,
      <created by zg, POWCHK disabled, PULCHK disabled
       configuration hash MD5:
       00 E9 B6 7A A2 85 ED C7 34 08 36 98 17 FE 4E 26
       data hash MD5: 16K
       BF A2 29 4F CD 26 E4 B9 02 D3 9F 7C 55 04 AF 2A>)
$$ ##END=
$$ 
$$ hash MD5
$$ 08 7A E2 DC 49 53 6E E6 A6 F0 AA 50 C7 9E 65 0A
##$RELAX= 
##$RELAX= 
##$RELAX= 
##$RELAX= 
##$RELAX= 
##$RELAX= 
$$ Bruker specific parameters
$$ --------------------------
##$DU= <F:/spectra>
##$EXPNO= 1
##$NAME= <H-F>
##$PROCNO= 1
##$TYPE= <nmr>
##$USER= <she>
##$AMP= (0..31)
100 100 100 100 100 100 100 100 100 100 100 100 100 100 100 100 100 100 
100 100 100 100 100 100 100 100 100 100 100 100 100 100 
##$AQSEQ= 0
##$AQ_mod= 1
##$AUNM= <au_zg>
##$AUTOPOS= <>
##$BF1= 200.13
##$BF2= 200.13
##$BF3= 200.13
##$BF4= 200.13
##$BF5= 200.13
##$BF6= 200.13
##$BF7= 200.13
##$BF8= 200.13
##$BYTORDA= 1
##$CFDGTYP= 0
##$CFRGTYP= 5
##$CHEMSTR= <none>
##$CNST= (0..31)
1 1 145 1 1 1 1 1 1 1 1 1 1 1 1 1 1 1 1 1 1 1 1 1 1 1 1 1 1 1 1 1 
##$CPDPRG= <>
##$CPDPRG1= <>
##$CPDPRG2= <>
##$CPDPRG3= <>
##$CPDPRG4= <mlev>
##$CPDPRG5= <mlev>
##$CPDPRG6= <mlev>
##$CPDPRG7= <mlev>
##$CPDPRG8= <mlev>
##$CPDPRGB= <>
##$CPDPRGT= <>
##$D= (0..31)
0 1.2 0 0 0 0 0 0 0 0.06 0 0.03 0 0 0 0 0.0002 0 0 0 0 0 0 0 0 0 0 0 0 
0 0 0 
##$DATE= 1622533322
##$DBL= (0..7)
120 120 120 120 120 120 120 120 
##$DBP= (0..7)
150 150 150 150 150 150 150 150 
##$DBP07= 0
##$DBPNAM0= <>
##$DBPNAM1= <>
##$DBPNAM2= <>
##$DBPNAM3= <>
##$DBPNAM4= <>
##$DBPNAM5= <>
##$DBPNAM6= <>
##$DBPNAM7= <>
##$DBPOAL= (0..7)
0.5 0.5 0.5 0.5 0.5 0.5 0.5 0.5 
##$DBPOFFS= (0..7)
0 0 0 0 0 0 0 0 
##$DE= 6
##$DECBNUC= <off>
##$DECIM= 32
##$DECNUC= <off>
##$DECSTAT= 4
##$DIGMOD= 1
##$DIGTYP= 9
##$DL= (0..7)
0 120 120 120 120 120 120 120 
##$DP= (0..7)
150 150 150 150 150 150 150 150 
##$DP07= 0
##$DPNAME0= <>
##$DPNAME1= <>
##$DPNAME2= <>
##$DPNAME3= <>
##$DPNAME4= <>
##$DPNAME5= <>
##$DPNAME6= <>
##$DPNAME7= <>
##$DPOAL= (0..7)
0.5 0.5 0.5 0.5 0.5 0.5 0.5 0.5 
##$DPOFFS= (0..7)
0 0 0 0 0 0 0 0 
##$DQDMODE= 0
##$DR= 18
##$DS= 0
##$DSLIST= <SSSSSSSSSSSSSSS>
$$ [...]
##$SUBNAM2= <"">
##$SUBNAM3= <"">
##$SUBNAM4= <"">
##$SUBNAM5= <"">
##$SUBNAM6= <"">
##$SUBNAM7= <"">
##$SUBNAM8= <"">
##$SUBNAM9= <"">
##$SW= 16.9725357007746
##$SWIBOX= (0..15)
0 0 2 0 0 0 0 0 0 0 0 0 0 0 0 0 
##$SW_h= 3396.73913043478
##$TD= 16384
##$TD0= 1
##$TE= 0
##$TE2= 300
##$TE3= 300
##$TEG= 300
##$TL= (0..7)
0 120 120 120 120 120 120 120 
##$TP= (0..7)
150 150 150 150 150 150 150 150 
##$TP07= 0
##$TPNAME0= <>
##$TPNAME1= <>
##$TPNAME2= <>
##$TPNAME3= <>
##$TPNAME4= <>
##$TPNAME5= <>
##$TPNAME6= <>
##$TPNAME7= <>
##$TPOAL= (0..7)
0.5 0.5 0.5 0.5 0.5 0.5 0.5 0.5 
##$TPOFFS= (0..7)
0 0 0 0 0 0 0 0 
##$TUNHIN= 0
##$TUNHOUT= 0
##$TUNXOUT= 0
##$USERA1= <user>
##$USERA2= <user>
##$USERA3= <user>
##$USERA4= <user>
##$USERA5= <user>
##$V9= 5
##$VALIST= <valist>
##$VCLIST= <CCCCCCCCCCCCCCC>
##$VD= 0
##$VDLIST= <DDDDDDDDDDDDDDD>
##$VPLIST= <PPPPPPPPPPPPPPP>
##$VTLIST= <TTTTTTTTTTTTTTT>
##$WBST= 1024
##$WBSW= 4
##$XGAIN= (0..3)
0 0 0 0 
##$XL= 0
##$YL= 0
##$YMAX_a= 153247
##$YMIN_a= -258479
##$ZGOPTNS= <>
##$ZL1= 120
##$ZL2= 120
##$ZL3= 120
##$ZL4= 120
##$ABSF1= 10
##$ABSF2= 0
##$ABSG= 5
##$ABSL= 3
##$ALPHA= 0
##$AQORDER= 0
##$ASSFAC= 0
##$ASSFACI= 0
##$ASSFACX= 0
##$ASSWID= 0
##$AUNMP= <proc_1d>
##$AZFE= 0.1
##$AZFW= 0.1
##$BCFW= 1
##$BC_mod= 2
##$BYTORDP= 1
##$COROFFS= 0
##$CY= 11.3945322036743
##$DATMOD= 1
##$DC= 2
##$DFILT= <>
##$DTYPP= 0
##$F1P= 15.9154993809931
##$F2P= -4.1035820241983
##$FCOR= 0.5
##$FTSIZE= 0
##$FT_mod= 4
##$GAMMA= 1
##$GB= 0.15
##$INTBC= 1
##$INTSCL= 1
##$ISEN= 128
##$LB= 0.24
##$LEV0= 0
##$LPBIN= 0
##$MAXI= 10000
##$MC2= 0
##$MEAN= 0
##$ME_mod= 0
##$MI= 1.114404
##$NCOEF= 0
##$NC_proc= 0
##$NLEV= 6
##$NOISF1= 3.799351
##$NOISF2= 2.8
##$NSP= 1
##$NTH_PI= 0
##$NZP= 0
##$OFFSET= 15.70392
##$PC= 1
##$PHC0= -11278.73
##$PHC1= 13.60099
##$PH_mod= 1
##$PKNL= yes
##$PPARMOD= 0
##$PSCAL= 0
##$PSIGN= 0
##$REVERSE= no
##$SF= 200.130013532006
##$SI= 16384
##$SIGF1= 3
##$SIGF2= 2
##$SINO= 400
##$SIOLD= 16384
##$SREGLST= <1H.CDCl3>
##$SSB= 0
##$STSI= 0
##$STSR= 0
##$SW_p= 3612.71676300578
##$SYMM= 0
##$S_DEV= 0
##$TDeff= 0
##$TDoff= 0
##$TI= <>
##$TILT= no
##$TM1= 0
##$TM2= 0
##$TOPLEV= 0
##$USERP1= <user>
##$USERP2= <user>
##$USERP3= <user>
##$USERP4= <user>
##$USERP5= <user>
##$WDW= 1
##$XDIM= 8192
##$YMAX_p= 0
##$YMIN_p= 0
$$ End of Bruker specific parameters
$$ ---------------------------------
##NTUPLES= NMR FID
##VAR_NAME=  TIME,          FID/REAL,        FID/IMAG
##SYMBOL=    X,             R,               I
##VAR_TYPE=  INDEPENDENT,   DEPENDENT,       DEPENDENT
##VAR_FORM=  AFFN,          ASDF,            ASDF
##VAR_DIM=   8192,          8192,            8192
##UNITS=     SECONDS,       ARBITRARY UNITS, ARBITRARY UNITS
##FACTOR=    0.0002944,     1,               1
##FIRST=     0,             0,               0
##LAST=      2.4114304,     0,               0
##MIN=       0,             -258479,         0
##MAX=       2.4114304,     153247,          0
$$ Real data points
##PAGE= N=1
##DATA TABLE= (X++(R..R)), XYDATA
0@%%%%%%%%%%%%%qJ6j6J6j6J9k7L2m0M8n4O2p2Q4r2J04j22J42j62J82k04K31k61
36a38K93l27L62m02M46m93N48o07O69p39Q14q96R86j084J195j317J452j603J772
55I31j966K189k446K748l109L545m088M786n711O995q891J1943j7563L0905j11336
70i1068p4579K46964k49835J31609J02650k46949K24816n0484j29512K55734j90410
81g1064R259J54169k35581J52081L6550j82557K10205j15002o7036K00485j82978
92i1469O6188R4071k10073J56099k7455j25596J89783j40018k3783J38034j76486
103a50705J03311M6638j53822J53370p3059o5191J54309j39122M1274P3326j54044
114a63715J22491j3503q2640J50318j04250l007J07376j30768R1939K6285j12621
$$ y = [0, 0, 0, 0, 0, 0, 0, 0, 0, 0, 0, 0, 0, 0, -8, 8, -8, 8, -8, 11, -16, 16, -24, 24, -30, 32, -40, 44, -48, 56, -66, 76, -86, 96, -108, 123, -138, 155, -172, 190, -212, 234, -259, 289, -318, 351, -388, 426, -470, 516, -568, 627, -690, 762, -841, 931, -1035, 1154, -1292, 1456, -1653, 1892, -2196, 2590, -3121, 3874, -5017, 6926, -10637, 20268, -91068, -165647, 81317, -168518, -36909, 65741, -181208, 43608, -6876, -136388, 119346, -71064, -61805, 92364, -143217, 8864, 45414, -137143, 73062, -41940, -108976, 91509, -91469, -25281, 68790, -141283, 14816, -12639, -138235, 51548, -88470, -112253, 25781, -150705, -47394, -756, -154578, -1208, -74267, -139458, 14851, -124271, -82997, -9671, -163715, -41224, -54727, -137367, 12951, -91299, -94306, 13070, -117698, -25759, 526, -112095]
125a12095J25527o0054l4706J21278j07267M3613N6117j09947J04430j6109n9414
136d8627J10828q8295Q025P3964j03541P8875M342q2612J04781o2109j5229R2653
148G3055j02745M7502L0931r7137R6037l3611m9049R4662q8123J7063N9195r6146
160d8366P4278o066p0167R4097o4922q145P5346r6056M9525K0860q3495R1953
172B8842l8317l8651Q8839q4764K4095N2590r2779P3653q265o4374R2138o0621
184b7614p464P2350q8241M8507K1826p6139Q4710l5977l2816Q0506p6304K3610
196a3046M5666q3644O9964r533n6302Q6419n8459m672O6027q3044M6447K0094
208B5917p2016P7755l2543l2289P5240o9415J9830M2531p6077O1351p930n0283
$$ y = [-112095, 13432, -46622, -81328, 39950, -67317, -23704, 32413, -77534, 26896, 10787, -48627, 62201, -26094, -18069, 55895, -47646, 31229, 35571, -47041, 57740, -4369, -19598, 73055, -29690, 17812, 48743, -48394, 47643, 14032, -35017, 59645, -28478, -11415, 47780, -48366, 25912, 19846, -50321, 43776, -21146, -29291, 46055, -50001, -476, 20384, -63111, 28842, -9475, -48126, 40713, -44051, -19956, 32634, -60145, 13508, 5243, -59131, 33007, -27614, -35078, 37272, -50969, -2462, 19364, -56775, 27935, -8042, -40858, 39648, -36656, -13046, 32620, -51024, 18940, 9407, -46895, 39524, -18935, -23607, 42420, -40624, 5823, 25917, -46099, 31656, -887, -33176, 42064, -27351, -7521, 35010, -41067, 20284, 12354, -37929]
220c7929P5887n2607l944N7917p4633M3043J6279o4603P1060l1531k7717O8769
232C9991o4721J9453L7762o9133N6127o946m4790O7192m6134l073M9689o3772
244b8355L8211J1575n2988O0807k9719j9574N6473n6880K0847K8642n9420N2037
256B1656j1397l6530O0272m5260J297M2608n8914L7214P721m7492N6115k9551
268b261j5893N0466n3393K2144K2680n3155M9679j4811k9763N5684m5761N983
280h401L7722n6815L9494L342m4157N6315l1373j3138M8902n2308K2606K1448
292B3637n0914M7632j4161k7971N1700m2194O433L3314n1414L6671J909l8874
304b4232N1001l0305j0155M3578m8783K2348J7873m6787M4821j3632k5610M8096
$$ y = [-37929, 37958, -14649, -18593, 39324, -35309, 7734, 24013, -40590, 30470, -1061, -28778, 39991, -24730, -5277, 32485, -36648, 19479, 12533, -32257, 34935, -11199, -14272, 35417, -28355, 9856, 21431, -31557, 29250, -469, -20043, 36430, -20450, 397, 29039, -30381, 21656, 10259, -26271, 34001, -11259, -9962, 32646, -26268, 10946, 18667, -28825, 27290, -2261, -18154, 32312, -21081, 1063, 23743, -29412, 20267, 5456, -24307, 31377, -14384, -8401, 29321, -27494, 12000, 15342, -28815, 27500, -3873, -17011, 31891, -20417, 2189, 23637, -27277, 20355, 6194, -21777, 29923, -12271, -5838, 27476, -23938, 12733, 14642, -24232, 26769, -3536, -13691, 29887, -18896, 3452, 21325, -25462, 19359, 5727, -19883, 28213]
316B8213l9200N074L0917m7193L2787K684l5632M6027k7761q469L9102m4481K2000
329D068J5213m2511M2411j5177k2079M5131l8891P415K8224m5756L3917nl3447
342b1487M4425k6607p989L7111m2535K0364J3868l8820L8820j4502j8866L9758
354B3540l5654Q296K4611m0884L0856j059l0019M1044k6128o009L3825l9230J9313
367B502J3190l6945L6103j1418j9531L7742l2292N948K3802l7981K7593k84k7452
380a9023L7150k2833n215L0301l6079J8007J0860l3261L4500j3364j6925L4780
392A8898l1221P408K1316l5248K6475j493k4471L4333k1970l485K6450l2923J7897
405A966P854k7683L1178j3945j1936L0047k8584J0151J6565l1537K6424m812k0107
$$ y = [28213, -10987, -5913, 25004, -22189, 10598, 13282, -22350, 23677, -4084, -12553, 26549, -17932, 4068, 19281, -23230, 19181, 4004, -18075, 27056, -11835, -4420, 23804, -21952, 11965, 11960, -21487, 22938, -3669, -11658, 25453, -17082, 3282, 17150, -21670, 17150, 2648, -16218, 23540, -12114, -3818, 20793, -20091, 10765, 9706, -20313, 20731, -5397, -11406, 22419, -16811, 2502, 15692, -21253, 14850, 3432, -16099, 21643, -10649, -4701, 19101, -18880, 8713, 8429, -19023, 18127, -4706, -9921, 20380, -15699, 2308, 13168, -20093, 14407, 1043, -15882, 18898, -12323, -4915, 16401, -18847, 7628, 6135, -18336, 15997, -5973, -9458, 16992, -15931, 1966, 9820, -17863, 13315, -630, -12566, 17481, -11103, -952, 15613, -15924, 10500, 5688, -14419]
418a4419L2592k2505n09K3618l1760J9097O609k6001L0027j4610j0962K8346k8084
431h561J0509J4331k9848K5399n943j8181L1206k3721P24K1826l2247K0590M222
444A0306k5891L0275j6282j0527K8816k8432J0323J4233k9854K4697n350j7570
456a5256K9806k2212P0K0605k9481J9034M477k4032K8438j5286r023K7477k6738
469a2121J0286J3129k8809K4284m203j7345K8721k0525j303K1642k7501J6235
481B490O152k3472K5777j2010j0036K5385k3501P427J3254k5738K1220k052j7232
494a2336K6055j8442k275K0218k4299J3705O640k1794K1617r054r683K2571j9804
507f881M844J2468k1853J6134j24j4420J9942j3689k389J6082j8616J0126N239
$$ y = [-14419, 18173, -4332, -4841, 18777, -12983, 6114, 12723, -13278, 16749, 2139, -8823, 19523, -8561, 1948, 16279, -13569, 11830, 5887, -12294, 18912, -4809, -4085, 17741, -14506, 6084, 10306, -15585, 14690, -1592, -12119, 16697, -11735, -1412, 12821, -17033, 7664, 2314, -15256, 14550, -7662, -7592, 13013, -16468, 2566, 7043, -16989, 11449, -3837, -12860, 14617, -12121, -1835, 11294, -17515, 6769, 2566, -14779, 13942, -6583, -7886, 13756, -13745, 2490, 8642, -14830, 10947, -1063, -11099, 14286, -9215, -1788, 11466, -14272, 6948, 4896, -12336, 13719, -4723, -6998, 13220, -11079, 2626, 9266, -12528, 9089, 35, -9648, 12923, -6881, -2037, 10431, -11422, 4712, 4588, -9832, 10110, -3579, -5968, 10114, -8502, 1624, 6863]
520F863j7675J7543o498p838J7392j5490L380R994j6748J2462n08j1166J5393
533G104j0301j481J1735j4360Q462K404j1815J3210o856l220J1599j2778N395
546i02M746j1940J2351m809n692J2290j1037K644P172j2719J0297j412q140J2551
560E400r414N66R015j2905Q737P31r865J3234q052k383J1575j3314O910M359j3035
575h441J3617m964o555J4300j2757K957R096j4690J1319m28j0913J5267r521j827
589c540J2466j5145Q046M256j3855J4673n928o838J5394j4197L277R641j6378
602h128J2511p13j2293J6556j0213k845J3788j6140P357N647j5219J4681m988
615Aq189J5496j3216K216R976j5686J1286K37j1914J5631r159k861J3412j5084
$$ y = [6863, -10812, 6731, 233, -7605, 9787, -5703, -2323, 7671, -9077, 3385, 2877, -8289, 7104, -3197, -4678, 7057, -7303, 1159, 3563, -8252, 4958, -1898, -5118, 6481, -6297, -902, 3844, -8096, 4255, -554, -6246, 6044, -4993, -2349, 4823, -7896, 2401, 989, -7151, 5400, -4014, -3448, 5567, -7338, 1399, 2130, -7735, 5499, -2553, -4936, 6639, -6675, 235, 4594, -8441, 5176, 212, -6343, 7957, -4800, -1843, 7253, -7437, 3882, 3454, -7459, 7808, -1713, -3540, 8926, -6219, 1827, 6083, -7772, 6901, 973, -5865, 9529, -4668, -1391, 8250, -8128, 4383, 3670, -8623, 7933, -2280, -5125, 8663, -7477, -120, 5527, -9692, 4989, 1, -8188, 7308, -5908, -3692, 6284, -9402, 1884, 2121, -9793, 5838, -3321, -6182, 7230, -7854]
629g854O881N787j4166J3931m042q015J4811j1762J659J0058j4460J0010J090
642C928j0952J4122p857k804J1960j3129O011N075j2532J2443m030p004J3348
655H579j1114J911Q644j3574R402M45j0140J2926p588k688J0838j2287N399M343
669E096j1292J0886l991n780J1288r907K139O833j1715Q787m73q276J1601p477
683b281j482R252j1182N836L384j0114J0392l988m836J0579r460K460O178j0693
697e955Q493r34p005J0781p470n41Q270j0712O500K165r423J0658n098l745J0287
712F271r988L214N555j0690Q835j306p009J0749p589l95Q041j0443O180J938q836
727e473J0011m750l543R554r432L235N128j0199Q595j372o628J0298p307n22P925
$$ y = [-7854, -973, 4814, -9352, 4579, 537, -7478, 7333, -4429, -2770, 7288, -7172, 2838, 3928, -7024, 7098, -759, -3563, 8397, -4732, 1279, 6354, -6178, 6265, 2235, -4769, 8579, -2535, -624, 8020, -5554, 3848, 4293, -5847, 7079, -509, -3197, 7641, -4646, 753, 5096, -6196, 4690, 699, -5081, 6207, -3700, -1561, 5272, -6443, 2344, 1871, -6405, 5196, -2281, -3763, 5489, -5693, 143, 3527, -6587, 3805, -183, -5019, 5560, -3900, -1440, 4738, -5955, 2538, 1604, -5401, 5380, -2090, -2631, 5639, -5073, 1427, 3592, -5831, 4827, -271, -4016, 6271, -3717, -503, 5052, -5638, 3197, 1891, -5118, 5631, -1958, -2353, 5688, -4755, 1425, 3363, -5473, 4538, -212, -3755, 5799, -3633, -398, 4730, -5469, 3126, 1754, -4874, 5424, -1883, -2405, 5520]
742E520j0090N699K289q657R407m152l622R042q658K743M655r136P724j280n991
757d507R286o725j01O887r277N610J577p679Q730m232l026Q171q040K669M273
772C616q380P080j371n113Q305o205K40N730q063N286Q85o472P941m240k115P133
788D257p604L198L321p567O930j808m346P702n976N30N274p636N134O14n866P352
804C509m134j618O288p010L255K642o737O601k268l616P172o124J117M650p569
819c842N375J63n373P202m467j278O045o891L284K323o307O264k336l098O425
834C489n689J232L999o616N129l70m594O691m316q17N425o540L346J968n952O234
850B619k580k604O059n563J481L459o078M933n88m112O229m364l30M771o290L812
$$ y = [5520, -4570, 1129, 3418, -5239, 4168, 16, -3606, 5436, -3222, -479, 4176, -4960, 2764, 1484, -4507, 4779, -1946, -2047, 4840, -4437, 1173, 2750, -4929, 3801, -431, -3457, 4714, -3326, -657, 3616, -4764, 2316, 945, -4168, 4137, -2068, -1828, 3902, -4161, 1125, 2010, -4462, 3479, -761, -2876, 4257, -3347, -149, 3172, -4395, 2535, 727, -3619, 4083, -1893, -1363, 3911, -3725, 1409, 2023, -3843, 3509, -625, -2243, 4045, -2965, 290, 2932, -3805, 2796, 528, -3088, 4084, -2040, -923, 3727, -3842, 1533, 1696, -3677, 3525, -942, -2220, 3825, -3066, 218, 2541, -3766, 2498, 162, -2936, 3489, -2200, -968, 3031, -3585, 1544, 1174, -3420, 3271, -1045, -1862, 3563, -2977, 369, 2337, -3615, 2619, 39, -2565, 3494, -2069, -588, 2871, -3207, 1726, 1138, -2974, 3255, -1109, -1439, 3332, -2958, 854]
866H54J125n349O077k885k307N922n673J716L306o089M944p16l955N943l956m69
882a512M634n806L301J105m886N458k491k069N336n067J715K788n430M699q17
897I58l645N495l782j67M047n195L082R76m371M840k320j561M552m518J633K080
913B104m480M047j074k684M706l570K27L196m675L098K98l534M394k478j009L797
929B363m241J879J606l982L808j422j881L956l487Q77K263m016L215l44k722M052
945A924k860j55L129m108K545P14l445L986j926j356L769l709J341J949l936L423
961A285q02k219L984l230L58K729m038K976R3l213M287k579p88L720m255K032
977C40J532m109L989j294k264M388l685N60K839m537L392n9l377M520k808p43
$$ y = [854, 1979, -3370, 2707, -178, -2485, 3437, -2236, -520, 2786, -3303, 1641, 925, -3030, 2913, -1043, -1512, 3122, -2684, 617, 1722, -3164, 2294, -197, -2266, 3070, -1997, -282, 2506, -2924, 1775, 958, -2687, 2808, -974, -1141, 2906, -2289, 793, 1769, -2602, 2238, -82, -1643, 2909, -1609, 24, 2104, -2376, 1671, 597, -2087, 2619, -951, -724, 2472, -2203, 895, 1193, -2341, 2053, -425, -1434, 2363, -1878, 1, 1607, -2375, 1433, 11, -1870, 2086, -1401, -524, 1739, -2277, 938, 594, -2128, 1924, -936, -1091, 2038, -2070, 475, 1189, -2256, 1730, -196, -1552, 2217, -1492, -151, 1798, -2138, 1285, 483, -1736, 2248, -982, -624, 2105, -1933, 1043, 1136, -2077, 2210, -369, -1157, 2563, -1692, 340, 1872, -2237, 1752, 458, -1806, 2582, -1103, -543, 2296, -2241, 1151, 1092, -2285, 2235, -573, -1316]
993a316L823m496K243J376m224M301j609k198M627m017P11K968m835L535J27l681
1009b665M673k700r77M159m569J988J735m361M268j315k443M592l791N47L130
1024B271m717L257M08l782M708k567j135M229m470J734J996m342L931q46k718
1039b043M341l231J07L098m281K688N63l412L986k012j234L682l749J367J802
1054A672l804L405p38k380L756k814O0K750l655K179N14k944L438j657j133L095
1070A744l091J158J438l048K722o94j763L044k439L27K066l108K173R1k229K943
1086A334j682o37K526k812J286J025k580K514q39j376K644k297O33J405k522K059
1102F81k06j817K708j827j14K012k711J555O33k346K546j147j001K427k239O95
$$ y = [-1316, 2507, -1989, 254, 1630, -2594, 1707, 98, -2100, 2527, -1490, -779, 2189, -2646, 889, 1016, -2665, 2008, -692, -1669, 2490, -2079, -91, 1644, -2717, 1551, 236, -2207, 2385, -1406, -859, 2271, -2446, 811, 1219, -2563, 2145, -422, -1557, 2672, -1798, -64, 1932, -2410, 1521, 675, -2043, 2298, -933, -826, 2272, -2009, 679, 1242, -2170, 1816, -196, -1430, 2252, -1497, -130, 1672, -2132, 1273, 535, -1845, 1911, -903, -843, 1907, -1748, 431, 945, -1999, 1439, -218, -1351, 1744, -1347, -189, 1249, -1799, 923, 229, -1534, 1510, -929, -602, 1464, -1644, 529, 620, -1609, 1334, -348, -985, 1541, -1271, 15, 1040, -1540, 974, 135, -1241, 1403, -894, -261, 1144, -1378, 681, 475, -1342, 1366, -461, -575, 1437, -1274, 281, 914, -1432, 1114, -33, -1034, 1393, -846, -151]
1118a51J300k499K039l66j548K521j902Q3J808k582J678L47k068K501j437n91
1134h67K232k410J066J002k475K264n73j433K531k012J50J750k469J683J43j906
1150a324K400j388n22K058k238J057Q39k326K274p85j181K412k002K84J559k413
1166a296J702J43j851K351j333n13K036k231J027P95k085K063p02j075K203j912
1182f78L99J394k207J666p7j604K238j371k72J762k129J067O99j964J951p45q92
1199g63J999j767L79J193j947J521j71j319J977j425r3J512j943J150L61j708
1215a044J918r29o46J761j792O25R11j829J561l66j107J889j404L8J276j864J235
1232B33J60j442J819j070l60J590j771Q01O50j724J745n96r34J881j570K37J296
$$ y = [-151, 1149, -1350, 689, 323, -1225, 1296, -606, -523, 1285, -1297, 381, 728, -1340, 1161, -276, -867, 1365, -1045, 21, 1023, -1452, 812, 239, -1194, 1337, -675, -525, 1225, -1244, 439, 582, -1324, 1076, -312, -834, 1224, -1014, 43, 882, -1444, 830, 45, -1136, 1276, -726, -442, 1117, -1296, 406, 549, -1302, 1049, -284, -797, 1239, -992, 35, 830, -1255, 808, 106, -969, 1234, -678, -279, 1115, -1092, 574, 497, -1107, 1131, -240, -512, 1250, -879, 188, 887, -1077, 874, 129, -763, 1236, -531, -152, 1041, -906, 615, 444, -875, 1102, -323, -416, 1096, -847, 303, 664, -1044, 874, -55, -701, 1060, -732, -107, 804, -1025, 536, 170, -937, 952, -452, -414, 862, -1002, 233, 393, -1049, 770, -300, -660, 930, -841, -40, 610, -1114, 631, 35, -899, 982, -588, -351, 945]
1249I45j961J391M0j414J888j063l52J569j972J165N90j685J493o70p20J909j738
1266e85K19J393j778J304P0j440J762j047j82J107j702R36P24j767J609n21j078
1283i76J865j585Q81N64j501J196k05r43J510j301M9J292j677Q95M24j429J514
1300E73p15n49J520j420J82J045j625J371k16r83J529j101n8J166j524R98K55
1317D48j308J548p71m63J414j490N93O97j493J333k26r78J544j145k1J162j504
1334f60R57K21j225J467p49l87J272j406N94O02j414J356m29q09J431j198J66
1351b11R77j452R95O9j125J462q62k77J197j484P81L89j214J283n04o12J294j220
1369e14L43Q94j485J071o9j022J484r21j50J070j384P71L42j219J393o28n95J392
$$ y = [945, -1016, 375, 415, -999, 889, -174, -526, 1043, -929, 236, 826, -859, 634, -36, -756, 1153, -585, -366, 1027, -751, 553, 623, -817, 945, -102, -284, 823, -879, 57, 781, -986, 623, 102, -976, 889, -696, 185, 749, -752, 444, 239, -704, 806, -495, -446, 846, -831, 64, 488, -941, 573, -142, -691, 829, -591, -409, 636, -989, 382, 166, -817, 712, -389, -447, 719, -805, 193, 448, -860, 688, -83, -546, 868, -622, -29, 668, -825, 508, 282, -696, 848, -297, -318, 844, -660, 297, 518, -707, 760, 11, -376, 896, -510, 84, 686, -728, 628, 199, -610, 821, -377, -211, 766, -686, 309, 378, -747, 715, -147, -424, 773, -711, 70, 459, -755, 528, 24, -588, 706, -514, -171, 723, -762, 309, 240, -782, 702, -219, -369, 701, -683, 88, 430, -789, 604, -24, -619, 773]
1387G73j294M59P31j497J192j92q54J362r64n3J067j411Q21L31j226J372o97n38
1405f18J376j293M29O90j401J128k12p64J333r44j16J061j356Q87K51j215J307
1422E43n84m87J272j232M12P03j412J111j06q37J309q51k16J047j254O62M02j149
1440f67J196n74m94J159j030L14O21j184R60j05p85J210q50j47Q73j053O62K62
1458C68r70J026m92l71J038r36K06N75j021Q64j77n67R99p49n4P35r45O42J52
1477C23q01Q92n01j90P94p79K43L10p47P08j45m85Q68p24J05N13p98O47n5n53
1497c75P28m61j25N86o91L70J76o53P19l35k25O65p89L05L52p64P12j55m28P41
1517C53o04J06N33q70O13j5n83P83m48q6O44q18M98K28q22Q50l49l69Q22p74K21
$$ y = [773, -521, -62, 669, -828, 364, 172, -682, 680, -284, -337, 730, -681, 140, 471, -755, 617, -80, -618, 758, -535, -106, 584, -817, 311, 99, -665, 668, -276, -392, 669, -687, 200, 451, -764, 543, -41, -528, 744, -488, -76, 627, -785, 326, 220, -617, 692, -159, -375, 672, -582, 80, 482, -667, 529, -45, -539, 620, -410, -96, 525, -659, 301, 196, -589, 621, -229, -376, 497, -556, 106, 368, -602, 424, -68, -439, 599, -337, -131, 444, -577, 287, 110, -457, 542, -207, -261, 474, -471, 171, 323, -478, 414, -87, -277, 517, -262, -19, 291, -456, 252, 107, -378, 490, -234, -129, 384, -414, 233, 178, -375, 353, -108, -233, 353, -338, 32, 208, -445, 274, -61, -286, 379, -410, -105, 247, -517, 195, 40, -388, 353, -251, -145, 388, -482, 131, 116, -467, 316, -132, -218, 426, -392, 106, 334, -488, 362, 13, -356, 466, -308, -87]
1538h7N11q84P75o5o32Q15n64n3P02q80M82K65q36Q23l53l50Q21p66K55M77r43
1559d87O62k9o75R94o57p9P59r44N13K09p56P85k61m94Q89q57L48M86q96P27j52
1580H5o11R60o43k8P01q67N10K02q04Q07k56l54Q18q28K85M39q66O81r5n16Q20
1601D40n38o6N84p67M73J41o20P49l90k76P42p43K80L47p13O00j24m40P58n58
1621a21j1N67q26N23P4n61O93m12j57O01o38L06K87p06O18k38l03O81n40L4M92
1642C63p40M76N8n46P17m31j39O42o98L53K13o70O85k32l41O73o09J07M50p15
1662c84N75n0n33P68m67j06O14p32L87J90o88P33l50k68O96n68R5M43o71M77M
1683A65n23P38m55j02N73p39M13J60o31O70k79l31P33o23J31M60p27N51n0m90
$$ y = [-87, 424, -460, 315, 250, -382, 433, -131, -184, 518, -362, 120, 385, -451, 372, 19, -331, 490, -276, -21, 456, -487, 175, 146, -529, 465, -192, -271, 488, -456, 57, 266, -490, 295, 34, -460, 429, -428, -80, 406, -490, 237, 85, -526, 434, -209, -237, 464, -403, 107, 309, -495, 312, 56, -298, 520, -308, -23, 416, -450, 231, 136, -380, 440, -98, -164, 420, -347, 126, 267, -353, 396, 6, -270, 472, -271, 9, 356, -357, 243, 119, -321, 437, -121, -132, 435, -391, 132, 206, -355, 338, -74, -231, 370, -268, 38, 325, -381, 237, -1, -304, 377, -163, -129, 363, -377, 99, 157, -389, 328, -103, -242, 400, -298, 55, 268, -402, 283, 51, -290, 383, -226, -119, 331, -384, 191, 141, -392, 376, -91, -197, 417, -315, 72, 262, -426, 307, -43, -311, 385, -183, -88, 355, -316, 161, 165, -358, 380, -75, -177, 396, -343, 70, 230, -401, 269, -10, -341, 392, -231, -100, 360, -367, 184, 134, -356]
1703c56O87m18n1N09o82L72J87o46P00l01l10O56n58J20L12n41M64j04l41O19
1723C18m44k2M74o77M25J49o18O84l25k32O31o13K46K60n51M23k9m46O33m34k9
1744a77M63o06M32N3m83N76k83j80N17n40J95K42n36N11j48l23N61m64J22K92
1764B24n19M16J0m52N56l19q6M71m78J95K09n32N23k61k32N87m46J12K46m82M19
1785A61j0m05N89l94m3M87n61K03J84m79N55k27j98N20m90KL79n38M37o8l72N38
1807B70l72l5M10n60L07J45n29N72k58k44M91m83K09K25m96M17m1l54M31k32n8
1828a85L99n23L18J82n02N10k43j53M53m15J01K69m75M20l8l67N09l61o1M62m63
1849a63K29J86m90N32k84j28M68l80j2M58o08L57o9l71L85l86j17N80n98M61J88
$$ y = [-356, 331, -87, -138, 371, -311, 61, 248, -398, 302, 1, -309, 347, -211, -91, 221, -320, 144, 40, -301, 318, -126, -148, 326, -351, 74, 223, -395, 289, -36, -268, 363, -250, -4, 256, -295, 128, 99, -347, 286, -148, -177, 286, -320, 112, 165, -318, 258, -25, -205, 312, -228, -33, 209, -327, 184, 36, -287, 274, -190, -68, 224, -295, 121, 131, -321, 235, -84, -170, 301, -177, 18, 227, -305, 218, -43, -275, 312, -134, -22, 224, -258, 161, 151, -254, 335, -59, -102, 385, -176, 27, 211, -268, 287, 60, -138, 382, -108, -106, 273, -265, 172, 104, -268, 270, -102, -137, 273, -287, 20, 165, -364, 208, -50, -294, 197, -286, -77, 148, -348, 69, 28, -326, 105, -127, -185, 214, -309, 9, 191, -311, 199, -44, -197, 256, -159, -58, 211, -264, 156, 118, -249, 260, -101, -162, 300, -163, 66, 252, -238, 294, 10, -118, 350, -30, -42, 416, -192, 165, 96, -275, 110, -276, -393, 187, -411, 50, 238]
1870B38m76M31k57n1K70l42N4L43n03L71j08j84L77k64l1M26n61L55o7k51M59
1891B29j58j16M45k70j84K59m27M12l08J21J58l24K80k00k13N32j85k74M60k61
1911b4o7L08k81Q6K02m51L94j74j75M08l27L3K50m17L51r1k80M29l09k3M29m90
1933b19K33J49m76M97k30j57M21l74J23K53m49L87j2l44M73l40J1K96m07K91O1
1954A87l52M80k97j96N17m86J22L02m66M23j49k18L86k94n6L93m56J39K47n11
1974b85M86j86k87N05m27R4L18m68L45k0l17M71k68j23L74m84L59N5m44L71j07
1995c8j87L90l10M1L25m47K86J8l32M47k53j16M00l54J46J54m23M14j46j81M08
2016B42l01j5K70m16L54k6l07L92k24q4L43m11K06J50l87L66j24j87L44k59M6
$$ y = [238, -238, 193, -64, -115, 155, -187, -133, 210, -293, 78, -30, -214, 163, -101, -132, 294, -267, 88, 21, -230, 229, 71, -45, 400, 130, -54, 205, -222, 190, -118, 3, 161, -163, 117, -83, -296, 236, 51, -223, 237, -24, -91, 217, -64, 22, 224, -227, 167, -7, -182, 226, -101, -68, 182, -235, 116, 25, -255, 174, -135, -158, 271, -219, 14, 163, -313, 184, -46, -203, 218, -156, -33, 220, -229, 158, 146, -198, 275, -65, -54, 242, -165, 126, 187, -165, 315, 18, -178, 339, -147, -25, 277, -189, 234, 85, -133, 253, -41, -97, 296, -160, -21, 226, -285, 201, 15, -272, 233, -194, -100, 218, -250, 95, 75, -242, 229, -39, -162, 212, -272, 87, 142, -302, 69, -38, -225, 165, -145, -104, 221, -226, 60, 78, -254, 193, -60, -176, 224, -130, 16, 170, -253, 161, 15, -166, 242, -59, -74, 196, -220, 134, 108, -199, 193, -31, -115, 228, -183, 23, 173, -214, 152, 28, -159, 185, -74, -28]
2037b8K41l46K87k9l31L80k20lL04l77J43R3l28L63j01k07L43k79P1K08l91L32
2059A25%k98L70k24j7K68l52J75J13l45L44j02k09L56l36O3K13l14K43j7k65L63
2081A54k59L6K41l66K18L5l15L47j54j35L75l61J89J82l57K84j30r9L31k52nK11
2103A70k90J58O9l50L94j02j10L10l29J20J48l14K42l7k04L53k38PJ75l07J90
2124E5K6k26L10j77n0K26k38J33N1k61K55j9k42K91j96qK30l07J93L6k37K61j75
2147f9r0K72k74J48J02k94K77n8k44L84k40%J15j72J55Q0k53K43j10j24K15k40
2169a77J47L2j60K67q1k04L21k50O3J51k30J64L2j94K63j61p3K81l00J42L6j53
2191h4K24j11p6K29k06J00J33j22J09R8m32M17k22k25M09m23J05K66l32K86j53
$$ y = [-28, 213, -133, 154, 125, -206, 174, -46, -49, 255, -122, 21, 114, -214, 149, 48, -159, 184, -95, -24, 184, -207, 125, 125, -173, 197, -27, -44, 224, -128, 47, 160, -185, 159, 57, -152, 204, -132, -69, 144, -170, 73, 56, -209, 154, -105, -69, 172, -194, 24, 59, -256, 91, -63, -198, 177, -184, 5, 187, -170, 114, -16, -115, 216, -36, -41, 170, -120, 38, 107, -243, 151, 49, -61, 249, -80, 40, 188, -126, 116, 79, -125, 228, -10, -3, 172, -135, 55, 81, -145, 165, -12, -62, 164, -74, 59, 110, -151, 104, 85, -157, 134, -62, -70, 160, -147, 46, 82, -155, 106, -69, -159, 113, -161, -13, 89, -205, 72, 14, -230, 154, -86, -86, 29, -143, 12, 92, -161, 82, -28, -152, 63, -177, -30, 2, -158, 109, 28, -176, 145, -105, -42, 109, -121, 43, 75, -119, 144, -17, -90, 191, -109, 33, 69, -84, 140, 29, -47, 182, -24, 76, 209, 87, 196, 294, -138, 279, 57, -168, 241, -182, -77, 189, -143, 143, -10]
2212a0k5K22l20J15L03l59J59p7j58J13l1k0K18l39J59P1j61K36j17j25K83k46
2234a09L4K20l09K15J2j99K52k02M3J58j82J26L7k05K17j20n5K48k47M7J27k33
2256a25J80Rk02L24j89jJ71k76J23J29k39K50j63m0K08k09J08J05k54J71m9j52
2278a21K65j59k9J90k82J45M4k06K55j30q6K27j55K9J03k71K14Pj54K04j47K0
2300c7J98l25J99J5k00K32j13o8J74j29M2P7j66J32L2k20K68j91Q2R6j99J59k5
2323C3j20K16k09K2J80k23J08M4j32K34j75p6K20j72l9J86j86J52m6j24K03j13
2345a7o1J80j71Q3O6j91K06n3n2J12j87N9J56k71K20l5j85K28j18j8K23l03J19
2368a0O6j63K12q2r9J97j75QJ54k64K21L1k37K39j34jJ10j64O3J30k34K06l5j52
$$ y = [-10, -35, 187, -133, -18, 285, -74, 85, 8, -150, -37, -68, -88, 130, -209, -50, 21, -140, 96, -21, -146, 137, -109, -75, 145, -164, 51, 63, -136, 116, -86, -43, 115, -67, 59, 96, -109, 108, -12, -67, 181, -66, -19, 108, -125, 55, 64, -138, 186, -3, -4, 167, -109, 14, 143, -96, 154, -9, -49, 159, -50, 58, 163, -91, 80, 31, -121, 144, -15, -44, 146, -136, 9, 53, -153, 102, -28, -114, 113, -42, -13, 90, -181, 33, 40, -114, 90, -57, -37, 161, -164, 35, 50, -150, 82, -31, -99, 75, -54, -12, 65, -101, 31, 63, -157, 111, -80, 2, 98, -101, 58, 33, -87, 129, -80, -58, 122, -101, 7, 51, -81, 153, -22, -98, 122, -50, -89, 97, -89, 63, 17, -107, 96, -17, -78, 102, -69, 14, 80, -111, 95, 42, -10, 102, -85, -26, 130, -141, 79, 44, -141, 87, -31, -49, 174, -129, -10, 56, -107, 105, 23, -76, 121, -54, -46, 108, -156, 65, 96, -141, 98, -36, -37, 73, -91, -28, 102, -132, 74, 39, -113]
2392a13K69j81QJ81k85K06l1j85K37j57RJ65k32J20O4j73K07q8r7J82j55mJ34
2415H1j51L5O9j27J87q5qJ09k19J05M8j31J26pj30K24j45k6J77j92L7N3j18J98
2439A10j09q5K25k27J39L9j20J06l7p4J30j20KJ12j73P8P8j55J24n4l6J41j26
2462c2M0O0j24J59j17k3J16j74J16O9j63J16k8r1J34j15J6J25j49J0N9r8J05m0
2486b9n9J41j52J07j1j31J06N3j85K40j39j5J54j57J02J9j32J72j39%J92j99P8
2509A6J12k04J58j2j70K06r9k2J19k04J22R0j88J34l8n9J94j97M0R1j57Q0L1r9
2533e6J72j40J8J36j71O4J6j25J40j22p8K76k56J21L5j31J71l0j02J32j21j2J46
2556H3j74J37Jj37J34r5K5M7k4j5J38k35J30K0j32J96j24%J71k07R4Lp8J59j17
$$ y = [-113, 156, -25, -17, 164, -121, 85, 54, -131, 106, -51, -42, 123, -109, 11, 75, -98, 109, 21, -76, 106, -49, -53, 81, -70, -35, 34, -93, 94, 9, 1, 110, -109, -4, 44, -87, 39, 32, -98, 126, -19, -45, 132, -60, -23, 30, -88, 110, 1, -84, 141, -86, 53, 92, -28, 78, 41, -33, 97, -23, -21, 91, -82, -4, 74, -81, 43, -11, -47, 94, -32, 8, 68, -56, 103, -14, -37, 79, -95, 21, 90, -73, 43, 15, -76, 58, -57, -41, 84, -65, -55, 4, -94, 11, -29, -88, 53, -99, 8, -3, -134, -28, 25, -160, 80, -59, -74, 80, -77, 25, 44, -88, 84, -55, -55, 137, -62, 16, 128, -76, 82, 70, -100, 106, 7, -15, 104, -100, 22, 112, -76, 58, 20, -39, 155, -42, -2, 89, -68, 12, 43, -56, 116, -24, -6, 130, -41, 23, 39, -86, 54, -68, -146, 130, -126, -5, 30, -101, 70, 40, -62, 70, -51, -63, 83, -91, 46, 47, -90, 44, -51, -26, 21, -3, -18, 120, -115, 15, 35, -97, 99, -25, -25, 146, -61, 33, 36, -42, 117, 0]
2581@j9J33j50j6J18j00N9J2o8J59j42J0J01j42Q1pj10J61p4l4R9j48OJ07j43
2606a07J47l4q5J37o3q0J72j54M6N8j10J58o6p4J25j56J12K9j15Q4j6k7R0j23
2630e2l6J37j12J13L5j11P4m6q3J08p2M1J14j84J34q2m0J11q2J6N0j17R4J3r6
2655g3J47j46J06N6j81N3N9q9J17p0k2Q8j15K6J45j52J12o2q9J52p7n7J84j31
2679a9nQ9j23J16p1l5J11q9%M3j10J26l3o0J10p6jJ05j61P1M4j27J43l4q5R7r9
2706g3Q3J04j93J30l1j08J33j06L8P9p9K0P7j47J54r7n7J58j98Q1P5j06J08o2
2730a7n2J64j47KJ09j23Q3L6j37J36k7o7O8q1K6O0j32J74k7j08J79j28J5J2RM9
2756G6l4j31J11O7o2P9j17J10Mr4q8M8J43o8k04j55L67l18L65l7j63Q8k06O6j03
$$ y = [0, -19, 114, -36, -52, 66, -34, 25, 37, -31, 128, -14, -4, 97, -45, 36, 29, -81, 80, 6, -28, 71, -77, -71, 36, -107, 40, 6, -79, 58, -5, -85, 87, -67, -21, 37, -73, 85, 19, -55, 70, -86, 26, 55, -60, 24, 8, -19, 71, -52, -88, 49, -63, 50, 85, -26, 48, 2, -81, 27, -45, -4, 110, -74, 60, -22, -62, 49, -33, -17, 33, -84, 10, 23, -73, 74, -72, 34, 90, -91, -38, 21, -68, 49, -21, -43, 45, -70, -44, 101, -51, 61, -1, -90, 62, -15, -72, 112, -19, -24, 65, -58, 58, -13, -48, 63, -26, -26, 17, -93, 33, 0, -60, 50, -26, -27, 78, -83, -12, 32, -95, 48, 14, -71, 26, -73, 10, 114, -79, 51, 20, -88, 45, -61, -23, 56, -23, -3, 74, -73, 81, -16, -73, 85, -113, -32, 43, -63, 45, -17, -69, 95, -52, -50, 59, -64, 19, 55, -82, 54, 27, -40, 28, -53, -27, 33, -99, 75, 48, -60, 119, -9, 6, 18, 27, 76, 42, -89, 22, 89, 27, 106, -11, 99, 103, 9, -79, -31, 112, 44, -160, -315, 52, -266, 99, 62, -101, -13, -219, -153, -256]
2781b56K79J0N1j63R5m8M5L3p3k9K24j95P9l0j52J58k0j8R5j74O5R8j74J00k9
2806b9k1J07j35N6P9q8M0L2q7R3j4p8N3o0P5N4j50R3N7j70J68n7n0N6r1J16rj35
2834i5J58j04K0O1r8P7k5K0L8m9p5J35p6oP7n9j3O3q9P8j3m7Q7j48O8M1j17J19
2862B8M0p9L4j3k6O2n2OKK4n4L0L1j5n3P3lq3J00n1J3J0p1O4k8k6Q8r7k6J08p3
2893c7J5R8j16O0k0q0J12p6J2L5m4L6J8q3J69p3o2J00j34Q2N3j47R4M3j03R9m3
2920Hl6J23j51N8K5j09J36Lq8R4r8M4O2j53Q4J5q0J09l9m6J00o7J5Op6J23l4n3
2948b5N7m2mJ17j55P9N4j60J44n6l8M7m9K8M7j11R6l5oP5j10RR3p7O6Lp7Q5m4
2977A1o9Q5m3J2L6r7J08o9MK7n9K0P0p4M0L8j15J80j14o9J03q8Q6L8p4L5J6j37
$$ y = [-256, 23, 33, 84, -79, 16, -32, 13, 46, -27, -56, 168, -27, 52, 22, -130, 28, 8, -10, 85, -89, -24, 74, -100, 0, -29, -50, 57, -78, -22, 57, -31, 9, 41, -46, 47, 33, -45, 8, -52, 23, 77, -73, 20, 77, -93, 75, 18, -32, 24, -67, 49, 40, -95, 63, -41, -21, 40, -58, 19, -6, 14, 52, 3, -72, 63, -13, -19, 58, -1, -14, 49, -40, 38, 25, -22, 65, -83, -15, 26, -91, 28, 68, -11, 23, 10, -16, 46, -6, 0, 2, 26, -28, 2, 33, 18, -35, 38, 35, -48, 52, 1, 14, 24, -47, 17, -11, -37, 51, -46, -72, 36, -37, -22, 76, -40, 20, 0, -80, 32, -44, -32, 3, -41, -5, 13, -70, 99, 26, -36, 64, -70, 12, 65, -82, 12, 55, -48, 51, 8, -28, 95, -56, 2, 27, -82, 54, 57, -31, 63, -35, 9, 71, -82, 2, 17, -63, 46, 7, -39, 61, -6, 9, 15, -61, 62, 28, -25, 32, -10, -14, 103, -52, 27, 81, -79, 65, 9, -29, 18, -31, -3, 44, -67, 29, -6, -12, 63, -47, -38, 55, -22, 44, 47, -30, 55, 11, -58, 27, -16, -4, 32, -65, 43, -26, -22, 5, -54, -34, 36, -38, 2, 40, -75, 105, -9, -78, 25, -63, 23, 61, -13, 22, 38, -99]
3005i9J57r2K8N9j69J43rj01J57m2j00P7mj2j2j6J31p4q3R6p8M1R1j02j4P2p3
3032b8O5J17k38J70M3lj19j5L6j3J20p0R8j38K18l15K19j4k48K54k16J26j24J12
3056C7k45lJ42K58J04m15K27O1K14l96n8M15l27R5RN3k37j24KO1N92m60p1J20
3080E4k16L09l46N6O1k9J29N3q1Q7J6J1r9j4kj9k7P8m7k7J21j36J6N8l6J12m2
3107D0j01J05j02K5J24j20N2L5j08J20p2k5R8r1J6J6j15J40l9l6J10j23JO5p9
3132f4Q4j7n5Q8m6k6N5n2J6N0p2O1k8PN2j01P3O7j09J3M7o8P5r8M5L4o5O9j3o4
3162d2Q1p3J8M3o0J4P4j29P2Pm3R5n4m1M3m5P6l1n3M8M6o9K9N6o4O2p2k3O0p0
3192d5J11o3l0O3r7O8K4j2k3Pk9nJ7J1Ro6P1k3MN3m4%Q4j92P5M9k8J3K9p9O8l1
$$ y = [-99, 58, -34, -6, 53, -116, 27, 18, -83, 74, 32, -68, 9, 5, -7, -19, -35, 96, 22, -61, 35, -43, -2, 89, -13, -27, 45, -28, 37, 154, -84, 86, 129, 126, 7, -8, 28, 15, 135, 65, 163, 25, 243, -72, 147, 133, -115, 139, -77, 49, -75, 37, -208, -211, -69, 189, 293, -122, 105, 166, 380, -16, -74, 341, 14, 109, 118, 171, -66, -190, -188, -127, 465, 5, -66, 54, -162, 147, -199, -143, -82, -111, 18, 71, -10, 77, 93, 104, 5, -9, -11, -30, -57, 21, -26, -53, 68, -68, -52, 6, -30, 82, 40, -61, 44, -58, -33, 91, -29, 23, 58, -50, 70, -2, -27, 71, -20, -4, 12, -103, 37, -2, -38, 72, -51, -50, 15, -64, 20, 3, -52, 36, -10, -36, 19, -33, -17, 33, -39, 22, -6, 1, 53, -48, 25, 92, -17, -4, 43, -25, 50, -48, -3, 31, -34, 35, 22, -42, 39, -34, -16, 27, -33, -19, 55, -74, -2, 5, -38, 57, 3, -38, 5, -40, 36, 5, -48, 0, 46, -23, 6, 62, -2, 60, -12, -35, 25, -45, 66, 3, -27, 36, -61, 7, 31, 19, -4, 3, -26, -31, -14, -3, 6, -60, 11, -12, -8, 45, 1, 1, 85, -107, -32, 17, -11, 2, 31, -48, 20, -11]
3224a1PL3n6O2m7l5P5m9j1Q0q4QJ8o9Q1M2n2K5k7m3J01j23O0N1j09R0o1L5O7j28
3254g0P6K2n7M8jq7J19r8O3N3j46J36l8l5J00p0o4O0q1Q7Ql9O2o0k0R9j18P7%
3283B6r5J24n1jM5l9pKq5P0N8j03N5N1m3M8j18J6J16j42J07n5m0J01n4j6K7l2
3311c5NQ5o4O8q4J2Q8j17O2K3j37J14n7M5j8J71M6k27M7j8K2J5J33k05m9K37j3
3338A49k97K34m11K50J77j80K31Q3k44K00r5Q0Rj28K4k30L9M77k34q6j59K02P3
3361A64k11k0K21j63j08K19k28L68k35L8R3j06k24P7J5J04KJ14j18R8j27L4J1
3384A8N8j32qJ7J35n1O6k14Mp3K01o4J44Kj05L33m20K73Nj70j6M9J12j37LJ17
3410A47j92K18Q7k14R7l23L22m7j02P2K00p86M31L6R2M6K08l28j87L94k30N6p4
$$ y = [-11, -4, 29, -27, 35, -12, -47, 28, -21, -32, 48, -36, -28, -10, -79, 2, 44, -8, 17, -10, -53, 48, -75, -15, 36, -73, 17, -44, -9, 58, -70, 6, 28, -29, 19, 18, -69, 50, -48, 15, 68, -78, 58, 20, -15, 85, 15, -49, 11, -70, 17, 25, -14, 48, -12, -32, 67, -51, 26, 26, -69, 55, 4, 3, 48, 9, 2, 4, -81, -11, 47, -56, -1, 50, 7, 55, -63, -47, 69, -73, 34, -21, -61, 40, -14, -30, -3, -35, -30, 55, -9, 59, -25, -13, 75, -42, 20, 43, -94, 20, -37, 8, -10, 161, 207, -20, 27, 9, 31, 46, 179, -26, -75, 162, 149, -148, 86, -325, -75, 102, -78, 153, 236, -8, 192, 97, 177, 186, 58, 82, -148, -109, 368, 134, 48, -111, 91, 164, -47, -67, 154, -9, -117, 102, -126, 242, 7, 45, 138, 32, -192, -115, -100, 4, 6, 120, 2, 100, -27, 7, 18, 76, -56, -64, -47, 88, 37, 103, -111, -107, -180, 21, -43, 101, 103, -2, 331, -89, 184, 189, 19, 3, 52, 164, 27, 30, 147, -45, 173, 260, 46, 143, -180, 142, 95, -7, 65, 265, -521, -90, -54, 38, 84, 292, -36, -223, 171, -59, -3, -77]
3433g7K26j33p1j5N4m6J62k33J36m8J9N0Q2j55Q4o5J4Ol4M4J2l2M2k0n6R7r6N0
3461cL4n9rL2nN6qJ8m3l5N1N5r8oN8o0N6l8pM8l4m5Q3o0Q0q7KM6m0K7L3K7m4k3
3495Bm6P0j02P6K1r9O3J3k0rk7K4O0n1K4J9m2O1o7J8K6lj2L6j06M7L7J9J6j03
3525e5P4K5k6J8l7n0J07m3m4L2l1K0K3l8K6J7m3L4k1j4P1r3J3M2n2J03o4k7J5
3554a8L1k4K0JK6l8l7J04l5j9L2n5k1N2m0O2lp3L0k2N8kj06J15o5OP4l5m2R1p0
3585coRK3L2ln8K1m5M6j9J0K5J3p3Q2p8MN8o7L2K1n7L5j1l6M9l2J6OQM7p8OL0
3619Gl2K4L5k9o0O0p6J29n5OK3p5P2k8K5ml3l0J6L3k0Ql4M7L7p5M7lp2Q0k9K0
3651A4ln2JM1j4K7n6K3O0j08M0j3rN6M2l3J2m5M4J5l9L3q1M9J12r1n4J03r9K8
$$ y = [-77, 149, 16, -55, -70, -16, -62, 100, -133, 3, -45, -26, 24, 106, -49, 35, -30, -16, -10, -44, 0, 12, -20, 22, 2, -54, 43, -53, -3, 31, -28, -37, -5, -10, 46, 38, 56, 13, -22, 29, 84, -14, -20, 38, -22, 34, -4, -11, 37, 3, -42, 41, -19, 61, -26, -24, 22, -18, 9, 42, 69, 25, 2, -44, 26, -76, 0, 21, -78, -15, -2, -22, -31, -58, -34, 26, -25, -1, 18, -24, 37, -30, -12, 14, 11, -1, 35, -71, -24, 13, 32, 48, -55, 19, 44, 18, 36, -1, -51, 56, 13, -31, 1, -30, -10, 13, -25, 1, 18, -25, 9, -12, -26, 45, -48, -35, 7, -45, 58, -6, -33, -18, 13, -11, 9, 10, 36, -2, -39, 65, 30, 11, 43, -12, -33, 19, -21, 41, 38, -35, -5, -27, 31, 29, -77, 38, -27, -21, 53, 18, -24, 67, -3, -9, 0, 23, 55, 52, -6, 15, -30, 16, -3, 7, 32, 45, -28, 54, -24, -20, 38, -29, 3, 24, -33, 2, -9, -45, 4, -28, -12, -6, 2, 49, -29, -23, 7, -25, -1, 34, 5, -55, 5, -71, 58, 3, 9, 32, -43, 29, 1, 26, 22, -11, -41, -25, 8, -12, -4, -38, 9, 46, -29, 18, 15, -57, 23, -6, 14, 11, -41, -40, 1, -13, 14, -42, -19, 41, -67, -27, -40, -49, 7, 49, 16, 28, -17, 27, 42, 3, 36, -45, 4, 116, 25, -29, 74, -25, 3]
3681Ck7J4KoL7J6j06M5OO0J6k6j7k3J0l5M0o4M7j8M2J33j60o3j03J39R7K2j48
3710f7M78o6k42m21L85j82K30r8k51Q17n13K19j36k48j89M32j05J74k14Q1p6J6
3732B4j7N0j90K1Q9J9O3j03n7J76j6k8K6K8j04j22J62kj5M2j27P8j0KM6j4m0M8
3760B9o0L4J5m3J6O6q4O9k8l0K1L7j9j7j6oLk6Q6n8J4K2k5jPj4m6N6pL7n6rJ2
3793b1L7k5O0k6L1j08O9K8qn2%k4L1Oj9O0o6J2J6n%M6n8Lk7K8m0L0kM7r2Q5k4
3826hm5P5k9K0K7j7mk1j5J0k5RO5l7M5r1KJ10o8NO1p8L9j5k5L3j6j2P4m8n1J2
3858a8j3O3n7J9L6l4j3L9p9N3Q5j02K1J4j7Q7j16K3L2kPl2M8n1L0m8P7n9k0K1
3888fjJ0j5LO6j07m9Q8l7J02j1q6k4J36r0M6p7j3P8k6L6J9O1j68J08j07p3L9J39
$$ y = [3, -24, -10, -8, -14, 23, 39, -67, -22, -16, 44, 60, 34, 17, -6, 4, -31, 9, -55, -8, -26, 16, 149, -11, -74, -177, -38, 59, 81, -67, 411, 345, 103, -318, 67, -115, 115, 17, -234, 583, 70, 289, 153, -95, -284, 148, 43, 217, 3, 84, 8, 24, 7, 57, -133, -112, -23, -4, 59, -44, -101, 75, 59, 31, 57, 85, -19, -141, 21, 19, 4, 46, -81, -3, -13, -11, 35, 21, -19, 29, -31, 3, 18, -25, -9, 57, -27, 42, 14, -16, 5, 42, 23, 6, -10, -16, -13, -39, 47, -11, 3, 25, 0, -1, 6, -8, -54, 2, -5, 32, -24, -33, -21, 16, -9, 51, 25, 56, -52, 17, 45, 37, -15, -15, -39, -8, -2, -21, 39, -27, -15, 1, -4, -4, 42, -16, -13, -40, -12, -52, -22, -24, 23, -69, 16, -8, -53, 22, -7, 13, 40, 23, 19, -2, -17, -7, -32, -23, 42, 5, 50, -41, -39, 71, 3, 8, 69, -9, 30, 15, -10, 23, 7, -5, 69, 21, -30, -18, -31, 32, -25, -6, 30, -4, -17, 22, -57, -4, 81, -21, 0, 14, -3, 84, -32, -9, 23, 21, 28, -4, 44, -7, 23, -25, 52, -7, -27, -6, -7, 3, -12, -9, 57, -50, -99, -11, -48, 54, 43, -43, -67, 69, -21, 25, -52, -65, 13, -13, 23, 42, 103, -65, 43, -64, -137, -98, 41]
3917D1j57K42j31l1N4K45k79M7O6k35K11j56K00k50LMO0K13j29j24J40J58n8N7
3941A91l49J58J5p1J12k5p3N4M6l7K9n8K7QJ6l8J7k1J8oJ4l1K7l4M6J8n0k0m3
3970f0P1qJ7K8ok5n3K9o1P5k9K5lNm3K8qL2l4NN4o1O8m5k1M8k4l2O1m5oJ4K6j5
4004GKn5Q7p2%N3n6L7pROj0j6Pk4R0q9N5jq5M5K4o5Q0J9p1N0k4j6M6j5KK8%m5
4039dN0p0K6l8N2Km1K7kk1O0o5J7QL3k0j2k8M3LK3jn5j7M6l3J9n9K7RJ6j7P0k8
4073B0j0K3l9QmJ1J3j0P2M5j92J59j80MK53k62Q1l6jN2J2q4Q2k1rNj3K1qPL9p0
4105c2L6K4m0n9M2L9l3L1m1J2L4l3k5L0MLk9J04l3j02M6Q0j8l5K6l4j39J04J2
4134b6ojlP5Jp9j50K42n6op3J39o7n3k2O0L4j03J69k12R7Jj11K89j44n6K2J65
$$ y = [41, -116, 126, -5, -36, 18, 263, -16, 31, 97, -138, 73, -83, 117, -133, -130, -126, -66, 147, 18, -106, 34, 192, 134, 191, -158, 0, 15, -56, 56, 31, -42, 12, 58, 21, 50, -8, 19, 27, 43, 5, 22, 1, 19, 13, 27, -4, 23, -11, 35, 53, 3, -17, -60, 11, 3, 20, 48, 42, 17, -36, -7, -68, 7, -22, 3, 0, 5, -38, -10, -18, 14, -20, -15, 39, -22, 46, 1, -20, 28, 4, -28, 33, -12, -18, -4, 22, 7, 9, -46, 41, -31, -31, 22, -34, 3, -4, 5, 11, 1, -15, -8, -32, 58, -31, 24, 23, -62, -17, 7, -58, 22, 41, -30, 20, -4, -20, 26, 11, 13, 41, 41, -4, 46, -24, 2, -36, 16, 18, -23, 4, 2, -19, 41, -24, -7, 1, 34, 14, 2, -26, 17, 20, 43, 42, -13, -30, 16, -17, 2, -57, -30, -21, -5, -22, 48, 20, 10, 33, -6, 2, -2, 9, 22, 12, 84, 129, -63, 96, -84, -80, 173, -89, -8, -44, -45, 7, 19, -65, 17, -4, -13, -8, -21, 0, -8, -1, 38, -32, 4, 28, -12, -71, -29, 10, -23, 8, -33, -21, 13, -20, -45, -15, -11, -8, -37, 67, 34, -68, -22, 58, 40, 5, 31, -3, -142, -38, -26, -32, -33, -36, 39, 40, -39, -189, 53, -3, -9, -82, 57, -10, -63, -85, -25, 9, -94, 75, -137, -40, -39, -150, 139, -5, -61, -39, 126]
4162A26j06j6m5l8m0J21J30q5K01k65O6m3n9J70o1k30K60q9j48J60k01J08K30
4185A46L8K5n01J06K6R3PK06o7M1j95M02m04J21q5K36J48k45Q6P1k05k24K09J
4209C6L11l33J92k64l1M3N6l3K04j15j75L55l22J59nm14M66O6k16L73n15M07j48
4232I7q8J08J07j94N8J5ml5mj35N0j21J76n6N2m0J21j25j0K0m4J20Qj0j07l8K88
4259B09l84J53J28j40P9L0j21j1J64n2j4j69K4J78m9j6j61J44q8o4O0J31k92K31
4283c0K15l16N55m77r2J46k34J62Q3j16r6J65J21O9j51o0j97l1L41Q0k28QJ43
4306F0J8P6k25K23o2Q7j05j73Q8J21m3N9j69J99l0p3r5J71j80K63j42K18j72P8
4330A92R2j43Q6l16J58k08M74p9n60L65J02k42j52L54j39pK51l29m7K09P0l30
$$ y = [126, 20, 4, -41, -79, -119, 2, 132, 47, 248, -17, 49, 6, -53, 117, 56, -174, 86, -3, -151, 9, -192, -84, 146, 184, 209, -292, -186, -160, -67, -60, 146, 79, 120, -75, 327, -77, 44, -41, 195, 343, 98, 184, 255, 50, -174, 35, 36, 347, 14, 206, -58, -89, -46, 10, -23, 181, 66, -109, 246, -76, 83, 78, -336, 130, 196, -20, 353, -162, 245, 97, 9, 117, 224, 30, 88, 103, 99, 64, 60, -75, -25, -146, 30, -26, 26, -14, 107, -18, -28, -8, -52, 68, 76, 66, -41, -79, 209, -175, -22, 106, -34, 45, 75, -46, -57, 107, 55, 41, -128, -104, 74, 25, 9, -152, -8, -96, -160, -100, 31, -261, -30, 185, -131, 424, -53, -145, 1, -233, -71, 12, -104, -200, -35, 86, 155, 4, -56, -253, -284, 57, 137, -91, -83, 60, 78, 154, -71, 152, 90, 177, 72, -101, -13, 108, 65, 124, -45, 154, 124, 51, -44, 127, -53, 210, 68, 286, 114, 192, 284, 141, 227, -89, 69, -139, 335, 256, -304, 61, 163, -79, -231, 123, -16, -23, 228, -101, -148, 61, 131, -199]
4352a99M17o8k23p1R8Qn9J41K77m43j77K46J59k26J77N6k60L18j37j6N5j41L0
4375c8J43j57J22l2o6N7l6Rn5N1k6L8J4J1j9k6N8j15R2kK1j9J4k1j4rn5N6Pn%
4406bLPM6rj1p5Qk1N3J4ll1qM8o3N9J1j6nKJ8j7J7l2Jk4J13n5%k5RM9k8j5Ol7
4442a3K2M3l8J6j8l7j9N6j01O2L4kj2M2L1o5M3o3J6o5L6K9j3kNK6n7M1M2m5L2
4473B6j4M1kp8K3J0L3l8nO0l4k%n1k7j9K00p4L6l5M8j22K1K24j84k5K8Jl39L15
4503A7K5P3m06K33m3j06Q1L16k07O1o1j37K18j39O3o9J40l2mmk7j1K6J0j6R5o8
4530B8j48N6O9k3Q2Q3j49n9m3k1K36M5k02P8n7J24k5j29MJ81j71j0J15m1l2K9
4556B0j05J60q7L6o8Q8j6n6R7j30L7J62j21m6J7L6m0n4N7J3j4j0L5j8ll0%Q3p0
$$ y = [-199, 218, 150, -73, -144, -46, -38, -97, 44, 321, -122, -299, -53, 106, -120, 57, 113, -147, 171, 34, 18, 73, -68, -38, 105, -52, 70, 38, -28, 29, -7, 2, -53, -2, -28, 10, 24, 35, 16, -10, 48, -67, 25, 23, 44, 25, 39, 18, 4, -5, -60, -4, 3, -2, -2, 1, 8, 54, 45, 34, -41, -33, -54, -1, 13, 10, -21, -29, 19, -44, 15, 26, 10, 5, 7, 25, 8, 25, -7, -6, -30, 83, 28, 28, 3, 12, 61, 33, 18, 24, -13, 9, 52, 14, 30, 12, -25, -44, 12, -89, -27, 7, 5, -7, 35, 66, 1, 44, -19, -3, -68, -32, -3, -16, -18, -13, 13, -44, -3, 39, -6, 26, 12, 53, 51, -27, -4, 6, 39, 1, -4, 56, 22, 20, 20, -31, -58, -77, 123, 49, 85, 50, 98, -24, -3, 221, 37, 12, 40, 41, -298, 17, 42, 115, -291, -58, -101, -207, -126, 190, -17, 44, -17, -154, 64, -75, -12, -81, 59, 27, 23, 19, -8, -19, 7, 17, 1, 96, 28, -120, -64, 5, -18, 64, 147, -2, -61, -104, -125, 111, 156, -46, 32, -25, 99, 74, -55, -51, 130, -41, -51, 64, 23, -9, 20, -85, 75, -12, 24, -44, 44, 28, -28, 69, -61, -24, 138, 17, -29, -12, 24, -16, -70, -13, 0, -14, -24, 11, -7, -10, -40, -40, 43, -27]
4585b7L9j7M2j4p6N6M6j4m9M1P4p7j5J41j30O6j15j28L44k42J45P2k78N2L8ml9
4612f9P6K0lp4Q3k4k0M9o5J9j0J5K6M6l8m8qO7M8j31M4M5L7Lq4j7L3J5r6K3P3
4643C5n3N1l6L9j8j9l9L0rj3M4n4kkN9k2K0L1q5OoQJ7K6JJ0k5L0qJ5l5p8R2nl7
4678c2L0K5jj4J7k3rj5M2L1m1lkl7R5n6J8j0J8j2m8M1k6pK6Jn4M3j7%N9m1K5r
4712A4r9K1L3l5mO9N7j41K1Q5M1O1j15j1O5j17K4p5O1J87o5jj12J16N7k5m5Q4
4740A51k94K73o6k7J23k00q3J01J32J9n2j68KN2R9k52J87L2n7N8k3l1P5N2j16
4765a3R5j41J00m7N5n8j3LJ4Rm9M4PJ3m0mJL5j7PK0l0lnK4k2j8K8j2j6J8L6m3
4798b2K3J9n9N1oj7J0MN8p0M2m3N5J4p1p5J07n4M2j3oK6j1j8O9j8k6j1k5k5K5
$$ y = [-27, 12, -5, 37, 23, -53, 3, 49, 35, -14, 27, 101, 24, 9, 150, 20, 86, -29, -157, 187, -55, 90, 162, -116, -64, -26, -30, -69, 7, 27, 24, -50, 33, 9, -11, 38, -27, -8, -18, -3, 23, 69, 31, -17, -25, 42, 90, -41, 3, 48, 85, 88, 4, -13, 20, 35, -61, -38, 35, -18, 33, -3, 36, 18, -1, -40, -10, -19, -32, 12, -42, -44, -46, 13, -9, 11, 42, -43, -37, -43, -35, -18, 8, 9, 19, -6, 24, 16, 31, -4, -82, 10, 5, -32, -2, 23, 22, 8, 25, 2, -7, -22, 20, 51, 10, 7, 5, -32, 63, 7, 25, 15, 33, 21, -27, 14, -12, -19, 7, 8, -46, -3, -20, -20, 39, -2, 23, 14, -85, -64, -31, -66, -70, -1, 56, -85, -64, 21, 62, 123, 8, -3, 62, -55, -31, -106, -45, 142, 77, 76, -36, 80, 137, 112, 67, 151, -143, 130, 64, 37, 160, -40, -123, -22, 110, 129, 77, -91, -89, -37, 62, -190, -3, 29, -28, 30, 7, -24, 51, 103, -13, 82, -59, 41, -6, 49, -9, -22, -19, -5, 4, -45, -1, 6, 19, -21, -25, -24, 11, -6, 1, 21, -9, -12, -17, 7, -15, -33, -5, -17, -33, -15, 21, -22, 1, 20, -39, 12, 6, -11, -1, 3, 61, -9, 33, -10, 45, 59, -12, -87, 20, -34, 8, -5, -11, 15, 4, -14, 55, 37, 11, 0, -25, -50, -25]
4829b5L6k5M4QJ6ok8pqM3m4OkJ1j5%M2o3K2l4L1%K1l3L0n0M8m8K5J9j6kK5n2O8
4864C7m1j5j9kN5JoQql4L9L%k3K4j7L1lK1j4o1K1J1l3K1K2Ml%j3j0n1J0L2K4n4
4900d3MQLM6j5m1pM6k5LO1m4j0j4N0l9L3m5K8%lK0mOk5N3n9L1K7j09P7j6kmK0
4935A1j7NL4J5n8k2P2k9Oo4K3j0R6n4J9qL3l1k6j3N6Lk9Nl3P9m8j6qN3m9K0rM
4969A0J6m6O5j4n4M6K8n9J3l5M5J0j2k2M2n7J1N1n3j7K2O3p1j9P5l9J3K7ol1m8
5000d6K1N9k4J6Ml8K5j9RqK2JN0n5m9N2JN4r6kk5N8k5l2L3J18j25N8l0J30j92
5031e5J74m5k1k4l45L27R8q5Q6l21J63k4l0O6R0p9O9Lk17J08J74R3k27n7O1L6
5057A8j2O6j03j4M0l1O3J5m6J7j1K2m0K3J9qn0K6MK2ork3O7k8J3k3m8N2K4j0k1
$$ y = [-25, 11, -14, 30, 38, 54, 48, 20, 13, 5, 48, 4, 10, 8, 19, 4, 4, 46, -17, 5, -29, 2, 2, 23, -10, 20, -30, 18, -30, -5, 14, -2, -4, 21, -31, 37, -4, -19, -38, -40, 15, 16, 10, 18, 10, -24, 15, 18, 18, -5, 19, 2, 33, 30, 51, 37, -24, -3, 8, -25, -4, 18, 22, 19, 19, 6, -4, -55, -45, -13, 11, -43, -39, -31, -28, 18, 3, -38, -45, 1, -24, -21, 40, -4, -14, -28, 22, -17, 16, -29, -1, -1, -4, 16, 12, 18, -7, 46, -13, 18, 45, -64, 13, -3, -5, -9, 11, -6, -1, 33, 48, -10, -32, 40, 11, 17, -47, -24, -34, 62, 8, 27, 19, 52, 21, -5, -18, 38, 41, 12, 17, -16, 63, 15, -1, -9, 44, -5, 15, 6, 10, 26, -20, 45, 31, -23, 23, 51, -8, 5, -30, 15, 25, 13, -9, 33, -24, -13, 38, -15, -32, -10, 53, -18, -37, 38, -1, 12, 39, 33, 2, -46, -25, 34, 10, 26, 30, -8, 17, -2, 7, -1, 21, 22, 72, 17, -32, 20, 21, 75, -21, -23, -48, 10, -15, -47, -14, 104, -21, 37, 7, 137, -55, 119, 74, 53, 29, -316, 11, 109, 24, 110, -211, -48, -72, -102, -36, 54, -25, 44, 47, -170, -62, 112, 205, -22, -79, -18, 18, 6, 72, -31, -45, -5, -36, 27, 42, -4, 13, 2, 24, -16, 7, 26, 18, -32, -6, -2, 20, 14, 5, -18, 49, 21, 34, 11, -37, 15, 39, 29, 8]
5089Hj1L3n7L7m0K1M6n6K7k0K2M8Lo5J4L7oj8m5L6pj0k0M4Qj8Pj6j4P4p6k9N6
5122A3ORMl0o0N4J5l2J7N0k5k3K2n8J6J1K0k3J2j5NJ1O6o2O%L5j7lj4q2M3L2j3
5156a0j4K2K2n1O2p6J2O7l2n7J05o4K4J5j1j2pPKkK3m3k3Q9k2j0n5M8o7R3n4M4
5188B5k4m1N4j4k2N9L0j12Q5q2JO5j10K29j23j2N9Jm0Np1O9j32Q7J30J2j9o3r8
5217e2L3k5O8p6L71o58M9O28m00o6j08mO82p19J51J00L41k13k11K07k51MK14j54
5241h9pJ35r9j6M3J30j35J21O2j44j96J3J04J51mm1J51k25j31N2J42p3p5R3PQ1
5267E0J04l3l43J54J77o4m4k86L63j59m4K5N8N9L3j36J7Q3mJ43o9k88K31k0j10
5292a03l0L4kJ58j01O1j7L9n0l8k5j31K44kn6O1m1J0j73Q4J71o8M3L5l7k05L54
$$ y = [8, -3, 30, -27, 10, -30, -9, 37, -19, 8, -12, 10, 58, 61, -4, 10, 47, 41, 23, -22, 14, 7, -3, -23, 21, 29, 11, 18, 2, -12, 62, -14, -43, 13, 19, 28, 32, 2, -58, -4, 11, -21, -4, 46, 21, -2, 20, -38, -22, -11, 9, -14, -2, -17, -12, -1, 65, 3, 9, 9, 44, 27, 24, 10, -72, -29, 3, -10, -24, -2, 20, -31, 31, -45, -33, 34, 2, -55, 50, -14, 10, 25, 14, 2, -5, 2, 4, 2, 25, -18, -41, 48, 26, 16, -39, 9, -58, 35, -19, 25, 1, -40, 14, 0, -22, 37, 67, -45, 40, -42, -41, 24, -86, 143, 20, 8, 67, 68, 28, 33, -38, 31, -101, -14, 116, 128, 109, 46, -52, -19, -44, 24, -52, 319, -339, -290, 338, -62, -128, -236, -240, 442, -277, -126, -26, 315, 102, -109, 98, -153, -149, 65, -89, -96, 39, -60, -76, -33, 97, -38, 83, 145, 1, -195, -182, -78, 73, 69, 28, 179, -46, -177, -125, 17, -56, -131, -38, -31, 50, 154, 121, -222, -68, 109, 45, 1, -285, 78, -81, -125, -100, -42, 17, 50, -86, -69, 14, 10, 153, 84, -204, 27, 7, -103, -133, -99, -101, 57, -44, 17, 0, 39, -11, -49, -74, -205, 39, 37, -19, 42, 1, 11, -162, -78, 93, 25, 68, 103, 66, -139, 215]
5319B15j60j7J98l29L8J12k88K42J05k71J20K59k45R7m5l5j30N9Q5q0N6k8P4j33
5343a01J44j00L1l2O1%m5RK8k0J9mj2L3lLL1K8n6m7QK0N3n2K9k9J2j4k3QJ4j8
5375b5kN0m0J8p8J01n1J2JJ0K6j9m8K3PM5J0l9jk5j6P1n4P0j9l2j1M6k4l0M5m0
5407a9L6m9MP4k5l5kn6J01J0m1M9j03N7JJ4l8K2%M3p3jL7k1j2L4K0j2j3m5J3N2
5439B2oj9nK7%o5O6k0QK0J3k9J8j0k8Ll1L0Pj0k7M5j2K3l9J2j8rkK5k1L2kj2M3
5474B9l3K9m7J9J1NPl5J1j9QL5O4p6J1J5jk1j3n3O9l2o1Q2o5K7RM7l6K3j0NKm
5508Bl4M6n5J2J4NpkJ5J2MJ7j2m3J2k2L2pQpk6N6k1k8N7k1n1L4K0kj0L2o3m0J38
5543F5o3k2L7mm1M6J1j12R6o9M3LLL4j9k6M6n1L5pJrj0j6L8J5j8k5K2K1l3kjk0
$$ y = [215, 55, 38, 236, -93, -55, 57, -231, 11, 116, -155, -35, 224, -21, 76, 31, -4, -134, -75, 10, -70, -14, -42, 32, -101, 43, -57, -26, -58, 3, 3, -42, -33, -5, -25, -6, -10, -22, 11, 8, 11, 42, 70, 14, -33, -25, -5, 48, -4, 25, -4, 8, -6, -29, -21, -7, -25, -27, 23, -17, 1, -77, 24, -27, -15, -14, -4, 22, 3, -45, -22, -15, 30, 40, 1, 0, -25, -41, 30, -24, 46, 27, -5, -16, 30, 6, -24, 21, -19, 17, -32, -28, 46, 21, -14, -16, -72, 29, 39, -2, 47, -56, 1, 2, 16, -22, 0, 0, 43, -30, -31, 6, -15, -27, 7, 27, 15, 2, -43, -30, 22, 16, -3, -8, 19, 19, -46, 20, 0, 8, 28, 41, 12, 30, 20, -8, -5, -36, -6, 1, -9, -36, 9, -3, 20, -19, -7, -25, -34, -36, -11, -32, 0, -2, -14, 29, -4, 25, -22, -3, 8, 13, 20, -15, -4, -23, -15, 20, 84, 8, 19, 34, 33, 12, -1, -54, 15, -17, -78, 4, -61, -34, -25, 22, -14, 9, -1, 4, 6, 2, -32, 14, -41, -29, -15, -10, -17, -19, -4, 8, 12, 29, 17, -26, -14, -36, -4, -11, -3, -10, -36, 20, -1, -29, 28, 7, -44, -10, 10, 8, -2, 30, -33, -73, 65, 2, -20, 17, 13, -28, 18, 29, -83, 13, -56, -13, -10, -7, 27, 8, -18, 28, -23, 12, 5, 6, -3, -13, -29, 9, 24, 6, -19, 3, 24, -9, -11, -12, -32]
5577c2QM7l0nk1N5m5J5pk0K6k1J4l4RjJ3N5j7k1k3K5K6k8J0N9j14nR8k0N3jj78
5610a10P7j01J40J61j37j06K01k02R9rkq1j62k1J58j3L60k97L05k05L4k56K11
5633D4Q3j27L8l2M7l1N0n1j83R7L19m5l02J21k38j9J14PL78l52P1j16K09k11K17
5658H8j31J01Pj95K04j01l9P0jk1l4L7L9k9J2l7M2O0o1J3qj5k5mN5K9k0m7L6l
5688B2J3p0N3k7J8k2M9k7j5jPJ7l7J6K3pm1PK6L7j00n4J73j18J66l52L05o3j22
5717a24J91j06K0p6J95J86l54o1L25q9j67k3p0J91j03j13J01J93m9k00N8M1m0
5740g4M7k2L6l4l6R3l5qM2J6l5L5n6M3l3L8l9qj8L4L2k7J0K1Lk4K8l2K6p8O7k1
5772iOn6N9j1j7K8m2KK1MkK0j0jOPn6M7qoj1PJ0M2rj7M6m4J2J0l6M2k4jK3l4K1
$$ y = [-32, -24, 23, -7, -12, -33, 22, -23, -8, -15, -35, -9, -30, -16, -50, -41, -42, -29, 26, 9, -12, -35, -10, 16, -12, -2, 57, -57, -62, 36, 16, 69, 68, -110, -33, -134, 6, 167, 30, -76, 125, -77, 22, 13, 11, -70, -232, -253, -95, -108, 252, -45, 260, 55, 89, -167, 44, 127, 0, 38, 6, 53, 22, 72, 21, -162, -65, 254, 209, -93, 28, -210, -229, -115, -108, 270, -82, -11, -127, 82, -129, 88, -43, 58, 65, -130, 74, -27, -66, 4, 3, -18, -52, -15, 24, -5, 7, -30, 12, 72, 11, 24, 16, 1, -24, -28, 27, 56, 36, -11, 25, 22, 35, -35, 18, -9, 9, -13, 36, 9, -6, -7, 0, 17, -20, -4, 19, 12, -29, -22, 4, 41, -59, -113, 60, -58, 108, -244, 61, -2, -124, 67, -39, -19, -95, 100, 286, -68, -129, 196, 107, -60, -83, -153, 38, -65, -178, -77, 116, 67, -133, -75, -34, -74, -27, -49, -13, -47, -83, 10, -25, -33, 9, 25, -10, 25, -31, 12, -21, 17, -22, -30, -48, -14, 18, -9, 1, 22, 25, 1, 29, -3, 23, -55, 12, -9, -3, -59, 0, -11, -28, 0, -42, -40, -19, -15, -17, 3, -7, -8, -2, 5, -51, -4, -12, -18, -29, -22, -12, 30, 21, 4, 50, 6, 18, 28, -8, 34, 10, 9, 32, -2, 19]
5809A9L2n5mn1P6k9qK0mk7kQqk4L1LL1j1Nk8K8KK2k5OK4l7L9l0K5qj0k5M9n8N5
5845C1K4l6J1l6J9p5J09j5o2Q7j20Q2m8J2M1n0M4j7j3lL7J1j0r4Q1K1J4o4L8j20
5875a01N2N6K7o5J25j08R5O7k11J52q0lj3L5K10k08m7l4qKr3K54j42J05q6J51
5901A32j79K4Q6q6N1m9KN8o7n0J69j23jQ7l2J10o2M1j42R0p3j11J02R3r2o2J24
5928D0M3j49P8j4k9Q2l1N4j30N6R0j28J69j15o1OJ4M5r2P6k6L8o8P0q3J01k28
5955a92J79LrL7m6Q1o4j5K8O3q9J10q6L5j2jl0P2r9O2j41J80L2j43kL6P7r3J2
5984a5j3L4j4j1L0k9lL1j7j6j2M1L3m3Kk8oK8k1K6j2J07m8l1NJ1Jj18N1%M4nm
6017bk7mL5k4L6k4j1J5np5J35j11N3k3N1J0o6N9k4K3J1n7J5K2J8k1l8L2L0j3k4
$$ y = [19, 51, -4, -8, -59, 17, -12, -20, 0, -4, -31, -33, -25, -33, -57, -26, -23, 8, -3, 2, -26, 2, 4, 26, 1, 7, 31, -6, 33, 3, 28, 20, 10, -15, 34, -24, 31, 55, 19, 30, -6, 13, -62, 47, 32, -30, 57, -63, 19, -29, -17, 24, -26, 18, 1, -12, -15, 22, 33, 23, -71, 10, 31, 45, -19, 19, -101, -49, 7, 34, -31, 94, -14, 81, 148, -63, 89, 9, 6, -7, 28, 238, 30, -17, -51, -59, -57, -150, 104, -38, 67, -19, 132, -47, -23, 63, -23, 28, -21, -19, 39, -28, -78, 91, -32, -33, 54, 22, 132, 70, 111, -31, 59, -14, -125, -23, 70, -22, -84, 40, 83, -66, 12, -2, -31, 51, 20, 74, -56, 0, 90, -38, 131, 16, -45, -39, -25, 20, -72, 4, -22, 16, -52, 18, -65, 36, -192, -13, -10, -19, 18, -28, 53, -11, -26, 2, 65, -24, 86, 0, 35, 23, 22, -8, 64, -35, 27, -114, 66, 98, -45, -47, -11, 66, -27, -15, -28, 6, -8, -19, 11, -18, -21, 10, -7, -23, -35, 6, 39, -4, -2, -30, -36, -8, -29, -3, -15, 92, 44, 13, 18, 29, 30, -88, -37, -37, 7, 2, -2, -29, -33, 2, -22, 14, -10, -21, -6, -11, -86, 49, -62, -9, -32, 19, 29, -37, 22, -2, 21, 32, -25, -10, 12, 30, 9, -29, 3, 33, 20, -4]
6048dR9j16J3N2n2l4K3O0j8k4k6L2oN3p0pj7J1O1k7K%L1pq5R8k5l2P4m5K8l3j8
6081ijK6j0Qo6J06o1lL2Nm3L3qJ4n5K5Rm6L8l5L9k9QOO5o1M6j5k8j7K7J2j1Kj8
6116a5J2lJ1M7l2Qm1J1L8p0P2J7n9J6k5nJ4j5M8Ll1K3l4L7oj0nj6N0m8J2J4l9
6149b1O3k7jJ4k3pm9R4m6J2j7rl4M0j8K2K6l1RK4l7J2Jl1N8rrROj5k8%j4L9J6
6184A9l6L8q2L7pK1j3J3j8j3L0J0KL0l4j0K9j0J6J2j6mmNm6M1N1o8K2J0K3o6K4
6217Fk8L1N8p7j1L8J1o8O5m7k8J00l0o4K5m4K5NO5n6m5J05l8P6k3n8Jj31J52l5
6247b0r4K36j73l7J90j17J77j78n0K07j86m5J31k21J68O6q4k0J01n5J5R0m5k07
6271a51MK16k20m1j04K80j79j14J75L5N9r4L24J62m67K15N3m06L21j56K5J82P1
$$ y = [-4, 95, -21, -8, 44, -8, -42, -19, 41, 23, -1, -27, 5, -1, 52, -18, -25, -42, -31, 30, 3, 5, 5, 36, 29, -56, 42, 17, -15, 59, 14, 42, 9, -9, -10, 16, 6, 14, -52, 54, -7, -10, 22, 27, -16, 17, 9, 23, -32, -7, 2, -44, -6, -41, -2, -31, -23, -17, 48, -13, 33, 18, -10, -27, 0, 12, 1, 3, -15, -3, -6, 5, 52, 20, 28, -13, -2, 36, -34, 38, 55, -4, 12, -13, -18, -4, -19, 29, 32, 1, 24, -10, 27, 21, 11, 6, -10, 40, -8, 4, 18, -21, 42, 15, 14, 28, 5, -2, -51, 43, -3, 9, -8, -17, -51, -11, -29, -7, 19, -12, -3, 21, -16, -4, -3, -34, 24, 15, 6, 15, 21, 6, -22, -22, -36, 3, 19, -17, 21, -61, -24, -31, -10, -23, -10, -28, -41, -11, -1, 1, 31, -3, -13, 16, 6, 22, 34, 18, 14, 10, 15, -31, 10, 61, -7, 15, 25, 48, -18, 6, -22, 9, 67, -10, -21, 17, 28, -40, 25, -22, -50, 50, 20, -44, -19, -63, -38, -33, 32, -24, -69, 36, -2, 74, 51, -7, -6, -137, 15, -20, -114, 122, -51, -88, 102, -15, 162, -16, -66, 141, -45, -90, 41, -180, -12, 54, -30, -50, 51, -4, 11, 101, 56, -151, -147, 69, -151, -192, -296, -16, -195, -309, -134, -99, -40, -134, 190, 352, -115, 100, 153, -253, 68, -88, -63, 119, 190]
6294A90k81l2K30J1p8K1o4j46J17k02K29o2M4M6pOJ4q6Q1l5RJ7l8N4l8O6l9jn9
6323c3L8MJ8l3j0LP1m2j7p9O2O1J3q4K2l0j3P4rl6L5l8J9L0m8NL9o0L6OmM7q1
6356c4P2m7L4j6O1l8l4M0l7K5%k7MoK2j4NK6l4L4m4l4lN4L7k2m2M5RNk2j5lm2
6390d1L8J1JK3r4P0j4LL4k8j2L5j0l9K9k3L3k0jlO9q8K2o3J12o0k9J1N2m3K8j4
6422a1qMKK3k6NJ4mj6M9j9k7K6l0kN9l6L5k8J3n9N9l9QJ7m4N7k9mjK0j8M1Rp3
6457c3M5qk7KkK3M3pj9q1L9RL3j7j6N4m9K1K0m2PL9k6k7N0Nk8l7K2ll9N1l5M5
6491A2m4M2l5J6J2j1J9n0K5k6L9KK1n2M6j3n0L7N3n4Om8J9K5J6l9J7J1m8L7K9
6522A4l3J1L8l9N5l2K4l8L7j9k7l6J8K1K5m1O3k0o0M3j0pOJ9o6N1NJ6k5J8rpM4
$$ y = [190, -91, -123, 107, 118, 40, 61, -3, -149, -32, -234, -5, -67, -23, 23, 16, 22, 36, -50, 31, -4, 5, 22, -16, 38, 0, 66, 27, 26, -33, 5, 9, 27, -6, -16, -13, 58, 16, -1, -80, -18, 43, 56, -28, -6, -36, -49, 25, 16, -20, 15, -23, -4, 26, -22, -17, 22, -38, -2, 4, 0, 47, -34, 38, -9, 25, 9, 70, 32, -2, 38, 1, 26, 26, -1, 3, -3, 19, 5, 10, 36, 2, 36, -8, -42, -45, 9, 46, 24, -18, 27, 36, 41, 19, 4, 1, -41, -3, 8, 9, 32, -62, 8, -6, -3, 31, 3, -9, 26, 16, -23, 6, -17, 16, -4, -5, -8, 61, -27, -5, -68, 44, -16, -45, -34, 18, -25, 3, -11, -19, -15, -13, 10, -16, -11, 3, -1, -17, 32, 13, -14, 12, -18, -20, 39, 3, 38, 10, 23, -36, 23, -16, -8, 9, -35, 22, -7, -11, -12, 8, -10, 31, 40, -33, 12, 4, -23, -21, -23, 0, 43, 36, 17, -64, -25, -16, 17, 0, -16, 38, -11, 10, 30, -12, -5, 34, 8, -19, 31, 36, 8, -29, -7, -10, -49, 2, -33, 12, -32, 10, -25, -9, 3, -8, 11, -39, -14, -40, -1, 1, 22, -30, 16, 3, -47, -10, 43, -11, -5, -53, -34, -9, 7, -32, -15, -4, -52, -15, 14, -19, -8, 30, -9, 46, 14, 38, 0, 37, 18, -9, -45, -27, -6, 19, -22, 41, 21, -39, 4, -6, -13, -7, 12, -54, -3, 2, 18, -7, 11, 2, -5, 39]
6555C9jo5K9nL2m8Q0o2k1J2J1%M5n2l4PM2j6K9l7j2j1L8o4Q8j4LKJ6K9p0j3kL6
6589A1j8k7NK2J2k2L1J4q3O7p3M1N8j6j7k8%K7M1n8K9K9o0P5r1K4J9n1M3kM4n4
6621hk0J0%K8j1l2OqK1N4n6J0O4r4J0L5j6M3Mq1K6NK9L8q9P2Oq4L8KK2q5R0j8
6655A1oM4p5Q6m2LK4p6K7KL0l5J6n8R1n3O5np8J7M3n9K4Q1j40N5NM1J3l1L5o7
6687a2l5J85n0q3j28P3J30p8l3j9O5o2m6O8O0r8J21J01k6j71J38%p3j78J78on9
6714c8n6R0m7R3r1j05R6o3o0J78j65J50j66J71M3q1O0j01K13m4n4rk7J10j47Q6
6740C6m0kk8J3L3MJ1k0l0L3K7o9K2J4OM2p7N6kk4mJ2k1kN6p9N9K8l9J3l6k3QN4
6774C1l2om6O5L2l1pl8J8k1L0J6N1m5j7NK5l8K6j9M5np9L1lJ4Q%l9l3N4L2k9k1
$$ y = [39, 38, -27, 2, -3, 29, -19, 61, -1, -22, -10, 1, 1, 46, -6, -40, -33, 9, -7, 22, -15, -27, -38, 0, -64, 24, 10, 13, 15, 31, 60, -10, -23, -25, 11, -7, -34, -29, -7, 5, -17, 14, 28, -55, 12, -61, -20, 38, 22, 5, -23, -23, 4, 45, -13, 16, 45, -15, 60, -31, -7, 12, -39, 4, 2, 46, -8, -28, -18, -18, 10, -1, -33, -27, -35, -14, 40, -16, -6, 58, -36, -26, 9, -7, 36, 40, -41, -15, -10, 19, 57, -32, 40, 46, -38, 0, 2, 24, -61, 29, 11, 5, 49, -26, 60, 18, 21, 45, -31, -4, -2, 28, -7, 9, -49, 42, -11, 54, 49, -29, -12, 31, -28, -4, 77, -63, -8, -3, 38, 51, 20, 55, -12, -47, 138, 88, 5, -123, -50, 80, 2, -31, -50, 15, -47, -93, -25, 35, -63, 58, 159, 133, -38, 100, 100, 27, -151, 27, 21, -38, -94, -4, -51, 42, -49, -154, -58, -121, -181, -3, -168, -18, -184, -13, 30, -51, 9, -92, 121, 77, 23, 14, -13, 97, -50, 36, -4, -6, -34, -21, 12, 16, 27, 7, -23, 10, 37, -32, -10, 4, 10, 52, -25, 31, 29, 5, 1, 13, -8, -10, 46, -33, 26, 54, 15, 28, -8, -31, -23, 31, -1, -7, -53, 12, 44, 13, 6, -32, -14, -35, -5, 11, 62, 17, 0, 5, 30, -8, 18, -1, 44, 39, -40, -9, -12, 2, 10, 10, -29, -62, -8, 24, -5, -26]
6808b6L7Oqllk7k3N1k1J3p4M6O4l1j5Rj4N3p8N2j2j7K4K4j8m6O4m9Kj3K5M9k8
6841A3%ln1P4m9J1K1K3n8K9n9L4M1pm1K6NMn6K8j9J1pM2l1K6k9k4O0m7N8m5N3
6874C3m9K7JL3l5Lk0K8J8m1j9K4l8qJ24m8o3K8L4k4N8l0k9jj5L3j6Jj4l3N7k3
6906dJ4j4j0K7ol1K3M8p6mK6M2l0k4k7Q1l7mOl3P1K6r7K0L3j3K3J8o9J9Pj8RJ
6940cn5O2J5Nk9Mj2lj4j0M5k5O8p5K0j2M7m6rk0M2j1L8M3p7O7q0M4j3k9KjK5n3
6974e0N6J5m7j5L5%k4L4Ll0K0NK4o5R2o1L3l0m0P7j0mp4O7j1J2mK7k0rk3lN7k8
7008Io7K8O6k2rj4j5k8J13j00J8K0jJ8j2m4L4ml1M8k0J3J7Rl3K6K1kLn8M0Qj7
7041A4m8K7p%k6K3L5j9k6O1Rm5oJ0lk8K9kk8l1OK2j4Q2n7Rj7J4P2o2K7p5Q8o9
$$ y = [-26, 11, 17, 9, 6, 3, -24, -47, 4, -17, -4, -78, -32, 32, 1, -14, -5, -19, 34, -44, 8, -4, -21, 3, 27, 9, -37, 27, -22, -20, -33, -8, 41, 13, 13, 10, -41, 33, -16, -5, 16, 39, -19, 10, -49, -15, 26, 19, -22, 4, 9, 13, -43, -15, -34, -23, -30, 12, -19, 7, -22, -46, 14, -33, 25, -20, 33, -16, 11, 12, 45, 10, 13, -7, 21, 39, -2, -21, 3, -35, -43, 81, 33, -30, -2, 32, 8, 66, 36, 7, 6, -9, 24, 8, 9, -5, -38, 19, -4, 10, -4, -14, 13, 7, -24, -1, 47, -29, -33, -7, 35, 5, -19, -46, 35, -2, -6, 0, -33, 38, 64, -33, -13, 20, 7, 30, 48, -21, -2, 5, -13, -4, -3, -58, 4, 19, 24, -5, -1, -13, -16, -30, -40, 5, -20, 48, -27, -7, -19, 28, -18, -27, -47, -5, -16, 22, 65, -12, 55, -25, 19, 6, -23, -21, -22, 3, -50, 6, 21, -26, -41, -6, -6, -30, 4, 7, -23, -3, 2, 26, -39, 53, -8, 25, -5, -45, 32, 22, 18, -56, 11, 0, 12, 8, 35, 15, 6, -17, -20, 37, 9, -58, -30, 36, 14, 5, -9, -24, -52, 61, -39, -21, -1, -2, 16, 4, -40, -6, -10, -41, 7, -13, 0, 17, 26, -7, 19, 40, 38, 41, -17, 23, 31, 14, -34, -7, -14, -14, -40, -17, 18, -1, -27, 34, 43, -2, -8, 2, -1, -29, 0, -2, -30, -61, -55, -33, -47, 35, -22, -13, -30, -16, 56, -6, 21, -54, 34, -35]
7075c5J0M7k2k1K3k0QK4l6O8j5%kq0R1n9J5k1qrM4N8q2L1l5kQJL0Mk6Pj5j8M3
7110Fl8j7R5k1l3K0l2J18q7Nj6lMk0J2l0L4QK1k5Qk1jrJ3J9j8N7q1L9J0kl5ok5
7145e1N9J0nRMj2p0R3j2n9PkO3q8J1M8k6J0j8M2L0j6k1M4l1k7j6K7J4%j6KL5K2
7179F0q4J0L4l2K1oK7k0o3J6N7j6k0q1R6K9m0L8m0L7Nn7N3L0ln8j6M1q5N1RMk4
7212b7MnM6j9L9j6m4k5J0j2K3J0j6L4JM3k8m6lP0n2nNM4kl8K3L5l9k9K8J5n1O9
7246D2n8O5l8KK9o4K2qJ7j7k1J3m0P6m7k2L0qQK8l4J2L0p4P8m7O2l0K4l9mJ6o
7279cj2K3k7K8Jl1J7j4J5m1L5M0mk0l6N3m1M0k3rk2j2M3k5m6N4Nk5R0j03R5q3
7311c8L1Ml1J1J3MK2o3J44j13L2l6jJ88j69K8q8P0M5j51j02K76r4m0M0N3J7n3
$$ y = [-35, -25, 22, 0, -21, 2, -18, -10, 14, -22, 46, 31, 31, 29, -51, 40, -19, -4, -25, -33, -42, 2, 60, -22, 9, -26, -28, -20, -19, 11, 15, -11, -4, -19, -37, 6, -32, -49, 46, 25, -8, 12, -20, 98, 11, 16, 0, -3, 1, -19, -7, -37, -3, 5, 26, 1, 9, -12, -13, -22, -9, 10, -8, 49, -32, 7, 17, 15, -20, -26, -51, 8, 18, 13, 22, 26, 14, -56, 37, 25, -34, -27, -29, 34, -54, -43, 5, -21, -11, -29, 13, 43, 27, 6, 50, 19, -8, -24, 3, 17, 17, 1, 3, 38, 60, -24, -14, 20, -12, 9, 3, 30, 10, -53, -37, 20, 4, -16, -97, -1, 28, -12, 26, -14, 23, 28, -29, 24, 54, 51, -7, -23, 18, -67, -16, -7, -3, -27, -23, -28, 18, -1, 38, 22, -22, -47, -37, -49, -26, -16, -32, 2, 3, 46, 18, -28, -31, 39, -13, -18, -13, 31, 29, -9, 14, 49, 10, -19, 9, 24, -27, 42, -16, 49, 11, 13, 42, -22, 0, -8, 9, -8, -29, -16, -56, 20, -27, -49, -19, -27, -19, 9, -25, -13, 17, -57, 21, -26, 36, 6, 30, -9, -13, 3, -3, -15, 8, -19, 9, 10, -21, -4, -18, -3, -44, -9, 31, 27, 7, -29, 24, -17, 23, 0, -9, -31, -43, 0, -25, -71, -17, -12, -37, 53, -50, 45, -38, -7, -3, -34, -23, -10, -6, 16, -47, 97, -16, 16, -20, -21, 167, -2, 26, -62, 8, 53, -98, -200, 76, -18, -58, -18, 35, 52, -1]
7339aj25j50K93L3r8J22q5k9K24k42J87l00K38p8N9l42L25J3n9K12J8k13j88L74
7363A88Nj26j21j05L01k81n9J61J93k59R2l8K30p5j02j34J16j99J81K08j72N1
7385E5K5j27J42j2n2pj00l6Q5Q0J2j89R3lj25J59o7J98P4k63M4j57J99k1r2P1
7411a4k22J67m4J49J65k51P4j6J3J10j71m0K55k15j2N9o5Q1j48K75j92k56K55
7434d3J7j47K01q4k0O3m5K8N4Q8j77n1j5J59q1O1M4q9J12p4k0K2L4m0K0j6Jj3
7462a1LK8m7rM5NL4n7j2O1j0l5Pj1K8kj9L0Pm3jK3p5Q4o6K5L0j0k4j3K4L5p9O4
7496Ik1rN2jk6oQkp8P4Rn2L4j6M6k0rjK7m2J7J0K1%M8q3jM8m2jJ8J3m2J2L5p7
7532d8O8j1jj2J8m1O7n0N1l6M2p1M5j6M1l2l7%oRJ8j9%K7jj4J6oN6l6QQJ9p4Q
$$ y = [-1, -126, -276, 17, 50, -48, 74, -11, -40, 184, -58, 129, -171, 67, -11, 48, -294, 31, 44, -15, 197, 215, 2, -186, 188, 193, 67, -54, -159, 142, -139, -198, -37, 156, -103, -11, -49, 181, 106, 4, -130, -14, -213, -32, 176, 4, 55, 80, -47, 95, 83, 31, 24, -76, -112, -27, 53, 65, -124, -31, -34, -159, 0, -67, 131, 205, -58, -14, -171, 28, 7, -85, -14, -236, -69, -113, 36, 201, -50, 24, 8, 21, 131, -40, -80, 175, -40, -52, 7, -58, 23, -125, 150, -42, -298, -43, -26, -173, 28, -56, -76, -13, -58, -30, 24, 112, -65, -116, -131, 28, -53, 8, 52, -37, 75, 1, -19, 3, 37, -3, 17, 1, 2, -11, -8, 20, -27, -36, 9, 14, 48, -9, -21, 40, 30, -5, 2, -9, 19, 17, -2, 28, 35, -8, -9, 14, -61, 23, -43, -18, 12, 2, -22, -35, -11, 24, -55, 9, -12, -21, 31, 30, 4, -2, 6, 4, -74, 0, 9, -43, -9, -25, 21, 1, -8, -9, 18, -24, -7, 3, 24, 24, 72, -11, -12, 36, -6, -7, 11, 24, -18, -6, 29, -48, 20, 9, 8, -4, 14, -27, 40, -10, 41, 5, 47, -24, 21, 5, 46, 14, -23, -23, -29, -20, -2, -21, -21, 6, 5, -9, 7, 1, 57, 21, 29, 37, 56, -18, -10]
7567a0K5Nk3J1N1m6J9l6qM1qK3n2K0m4L1M2l7l3L2oj3%J4K8j7k8R1j00K1M1l7
7599cL0l4k8M6J0ol6qK3L1rk0Qj5j8Q0o5J5P5o7nj9l0K9%M5n5J3l4N8K5n3L6l9
7633b0J7M4l9j6%K2j8nP4%m2k6L7k3mqK1kl6M2j4pj1M3k3m0J7K1n0k5K2J18j19
7666e0Q6K2p5N2j1k4O2q9k2O0Lq1R1j8nJJ8j5n3N4K3o0N5lj2l3K9LQk5K5m8oR6
7700E8o8L7k0K7n0L2l8K0oM1l3j2j2Nj8J3P4l6J8k8J0oplj4k2n8J16mj4J2n6L4
7733hPk6J5L9j6k8ROj8LLOl7Q%M7n0M9M5o6M5%l7kM7k4j9Om9N8k3J5l5O6k6l7
7769b7RLK6L8l0Jk5L0j4nR%mk8j1k3M9k0k5L3j8PRk0M9N0r5l1P5jk4PL9m2M3m5
7805a1N4l3km8K2J6Pj1j1MP3j12O5l3L7On1M6j5j5M5p0K4J1jL0k8L1oj9j8LM3
$$ y = [-10, 15, 20, -3, 8, 59, 13, 32, -4, -12, 29, 21, 44, -8, 12, -32, -1, 41, 4, -29, 3, -3, -16, -16, -2, 26, 9, -19, 72, -28, -7, 34, -3, 27, -7, -35, 11, 21, 15, -21, -29, -6, 25, 16, -4, 4, -11, -29, 51, -14, 1, 76, 9, 4, -15, -45, -16, -16, 29, -26, -13, -47, 11, 36, -17, 19, -20, -3, 41, 2, -14, -14, 8, -10, -15, 59, 59, 17, -9, 28, 5, 1, -7, 14, 12, -24, 18, 4, -3, -14, 29, 6, -34, -17, 4, -46, -71, -49, 69, -50, 36, 58, -17, 35, 24, 0, 62, -27, -49, 11, 14, -67, 24, 6, 1, 2, 20, 5, -48, 6, 29, -31, 24, 21, 9, -24, 5, 8, 16, -9, 16, -32, -38, 58, -10, 27, 7, 34, -16, 16, -22, -2, -8, 33, 0, -12, -24, -19, -37, -24, 50, 14, 32, 4, 14, 8, 1, -2, -16, -38, -96, 20, 16, 2, 14, -42, -8, -1, -27, -12, 27, 11, -17, -8, -2, -20, -17, -14, -8, -45, -37, -37, 10, -40, 9, 54, -12, 33, 33, -4, -6, 41, 17, -2, 4, -45, 13, -10, 5, -30, 36, 10, -27, -18, -15, 11, 49, 19, 20, -5, 25, 11, 6, 15, 15, 11, -17, -28, -51, -2, -22, -47, -14, -32, -25, -16, -36, 13, 63, -32, -63, 12, 11, -13, -6, 33, -9, 34, -11, 43, 10, 8, -40, -18, -2, 5, -6, -17, -13, 60, -52, 13, -20, 17, 23, -28, 18, 3, -12, 33, -37, -13, -2, -3, 27, -1, 30, 24, 5, -13, -10, 33]
7838C3nj1Mk7L2l0j1k9N7J4M4r9M7krqk7lQ9o4j3M8n4M1l0jN9q2J2j0LPP5l7m4
7873c1K4o1R7p3P0nk7Mj9kL9J1J4o5j1J5L6m0J1kM9l8j2O3p1pk6k0R9l6M5n5P2
7906D8p9O1r4l4J67q6J58j97K6j4J13o0j20J96j80N0J09K2q9n5J35J37j92J95
7930B17J70m03K84m35J83J49j10p2Rk3K3rm6L5J6Q7j40J51j49Q9J1J1l3n9Q2k00
7956a62K29K7k18K28k21J28mJ2N3j06j30J22L0O6P2n5j8m0p0J27J4r6J01j27K7
7981a1j0R2j68L2P1m1J4L5k3J3m1K9q9N2j4J12n4L3n4J08j51O7J2l0PKRK3Nn5
8011b5JM9q7K1N2l5ON2l1L3p1P1j23L9j1J09o4M7j49K63Or3O6j55k47K78J21m6
8039G7m79K61O00o99M30k60J84l02k76N82J30m14M11l61J94M1J9k27K23JM2j97
$$ y = [33, 28, 17, 21, -6, 26, -4, -15, -44, 13, 27, 71, -28, 19, 17, 8, 0, -27, -30, 59, -5, -18, 30, -24, 17, -13, -14, 45, -37, -25, -35, -32, -25, 50, 13, -31, -7, -68, 29, -44, 26, 21, -6, -2, -21, -23, 16, 27, 41, -24, -35, -20, 16, -24, -13, -15, 34, -4, -16, 47, -24, -31, -57, -77, 22, -14, 31, -24, 48, -31, 30, -64, -98, 69, -17, 141, -56, -30, -44, 69, 9, -111, 85, -95, -45, 64, 86, -3, -58, 77, 214, 22, 217, 387, -16, 268, -167, 16, 165, 55, -17, -8, -31, -8, -17, -63, -28, -12, 75, -65, 86, -63, 26, 37, 48, 15, -44, 38, -162, 67, 94, -124, 104, -117, 11, 7, 19, 72, -34, -164, -42, -12, 54, 126, 71, 53, 13, -57, 70, 84, -12, 89, -38, -11, -21, 71, -97, -65, 6, -35, -21, 14, -9, 4, -37, -8, -97, -45, -59, 53, -1, 32, -22, 86, -65, 2, 14, -16, -9, -7, 2, 25, 30, -25, -24, 25, -62, -41, 11, -24, -18, 34, 3, 36, -35, 36, -87, -48, -59, 50, -14, 33, -116, 147, 153, 60, 126, -29, -276, 2, 123, 77, -402, -141, 459, -240, 190, -70, 114, -188, -464, 118, 248, -166, 245, -116, 78, 119, 138, -89, 134, 135, 177, -20]
8061b0J08k34J16K7J8j47J31j7L0K1J6m8Pp3L2M9l7l6L7K5k3L5rj0l1rK8O4p3
8090b3M6m9j3L4L5j9k4J7Oj8k1Pm8M1J4k8OL8j3L7m9J8n1P9j7l5K2j4K1K1l1J3
8122BRJ9n2qj2K2K6JJ6k6K4m1L6n8O3mJ4Qq2M9pk9L4k3L2n9RM4m6M3J3Nk1M3r9
8157e5P8l4J5kK3n3K1j3j0M8J4l3k6N8p8M5J0m1N1kK1l2M1n7M3J0k0o0L2K0LQ
8189B5n3N3
$$ y = [-20, 88, -146, -30, -3, 15, -132, -1, -18, 12, 33, 49, 1, 8, -65, -33, 16, -21, -57, -20, 5, -18, 17, 8, -2, -33, -42, -14, 50, -23, 23, -26, -39, -5, 30, 11, -13, 4, 10, -8, -29, -22, -70, -29, -15, -43, -37, 1, -12, 25, -24, -6, -57, 22, 5, -30, -8, -22, -1, 20, -11, 2, 11, 30, -22, -30, -42, -20, 6, 7, 23, -3, 21, -20, 16, -42, 21, 17, 31, 39, -43, 6, -1, -30, 4, -19, 13, -46, -37, 7, -39, 4, 17, 22, 1, 44, -55, 23, -11, 4, 2, 25, -28, -7, -20, -30, 18, 32, -1, -27, 31, -47, -2, 8, -33, 18, 16, 37, 5, 46, -11, 32, 42, 22, -38, -6, 14, 17, 25, -28, 25]
8191B5
$$ Imaginary data points
##PAGE= N=2
##DATA TABLE= (X++(I..I)), XYDATA
0@%%%%%%%%%%Qj6J6j6K2l0L5m3N5o3P2q8J09j32J54j79K07k42K81l24L72m25M84
33B57n48O19o98P87q83R88j105J233j373J524j689J870k066K281k518K775l055
50a601L365l707M083m502M971n495O087o762P539q444R515j0806J2400j4426J7096
65I313k0798K6332l5634N5399j73222M9109o0976j08002K71660k70338J09328
76a47829J20149k21297K04626k6813j64633K49226j65966J7131J86313k10099
86a59192J28520N9806j78693K25415p5373p7592J91947j78534M6907J27156j87701
97g7334J54478p843j36188J90843j02361j9953J51605j75116P5630N0425j51183
108d6997J52049n5524p9008J42860j37358L2711R1042j42619J10076j7641j06021
$$ y = [0, 0, 0, 0, 0, 0, 0, 0, 0, 0, 0, 8, -8, 8, -8, 14, -16, 19, -24, 31, -32, 40, -48, 61, -71, 83, -96, 111, -131, 150, -174, 198, -227, 257, -291, 328, -370, 417, -466, 522, -583, 650, -723, 801, -888, 982, -1084, 1197, -1321, 1454, -1601, 1764, -1943, 2140, -2362, 2609, -2886, 3201, -3561, 3978, -4466, 5049, -5757, 6643, -7783, 9313, -11485, 14847, -20787, 34612, -138610, -89501, -150477, -258479, 13181, -257157, -147829, -27680, -248977, -44351, -71164, -235797, 13429, -152537, -135406, 50907, -159192, -30672, 29134, -149559, 75856, 483, -77109, 114838, -63696, -16789, 110367, -77334, 77144, 69301, -66887, 123956, 21595, 1642, 153247, -21869, 53761, 104186, -46997, 105052, 49528, -29480, 113380, -23978, 8733, 99775, -42844, 67232, 49591, -56430]
119e6430J40170r2188j2726J02586j41431O7459L1572j10203J23302n1433n0389
130d9711J11172j05311L4121O2847j11740Q8867k0229o9560J11981p6737N448
141a8852P5559j08015P0551J5475q1216J06992n8598k9479R1480r8257M5079M2883
153E3602r7790Q8901k7139n1970J00649p8010J1393O1566r9299O8204K452p0786
165c8227R5082o0569j7718P8989r1084M7401L0282q8750Q6459l2324m4764R2907
177E7684q0538J4648N6634r4270O8413J654o7244R0484n5865j5608P4918q5111
189c4201M3014K7122p9655P9547l0269l8315Q3793p3509J6977N0317q4943O5469
201B5347j484o1540Q4703n3300j2482O9811q0308L9511K6526p3902P3136k5662
$$ y = [-56430, 83740, -8448, -21174, 81412, -60019, 7440, 39012, -71191, 52111, 678, -49711, 61461, -43850, -9729, 53118, -58622, 30245, 10016, -59544, 52437, -24300, -18852, 56707, -51308, 19243, 34718, -46498, 60494, 1896, -27583, 63897, -34360, 10719, 53602, -44188, 44713, 17574, -34396, 66253, -11757, -364, 61202, -38097, 30107, 32559, -38227, 56855, -3714, -21432, 57557, -33527, 13874, 44156, -44594, 41865, 9541, -35223, 57684, -22854, -8206, 48428, -45842, 22571, 24225, -43019, 47465, -8400, -24008, 50910, -34201, 8813, 35935, -43720, 35827, 5558, -32757, 51036, -22473, -5496, 44821, -40122, 25347, 23863, -37677, 47026, -6274, -18756, 51055, -29253, 10258, 36784, -37118, 36018, 10356]
213A0356l7207P6195o5639J3125M6267p6270N7470k028n4548P5166m8284j0052
225a5449O1411p3554L7347K2125o7643O8321k5644l3317O9182o0634J2928M1453
237C6526o8671N1033j851m7763O5977m2318p336N1262o2276L4051J5592n4562
249c0336N8844k5378k4061N8200n4381J6042L2685o0090M9049o263l9661N9613
261C4263m1019l467M5258n7701L3082J1893m9152N4784k5986j9332N1825n1857
273a7409J8402K6169n4595M7652j0867l3899N6578m3267R20M1104n6934L6002
285I856Q160m7115N4506k7171j7098M9383n0091J8230K4922n1691M5201r850l1018
298b3776N2057l9668K525L5764n0991L3173O277m1462M9716k6385j4248M5137
$$ y = [10356, -26851, 49344, -16295, -3170, 43097, -33173, 24297, 22269, -32279, 42887, -5397, -15449, 45962, -27592, 9755, 31880, -35763, 32558, 6914, -26403, 42779, -17855, -4927, 36526, -32145, 18888, 17037, -30726, 35251, -7067, -14403, 36859, -25417, 8634, 24226, -30336, 28508, 3130, -20931, 37269, -17112, -1070, 31615, -28475, 20574, 14311, -25350, 34263, -6756, -10223, 35035, -22666, 10416, 22309, -26843, 27941, 1955, -17377, 34448, -17409, 993, 27162, -27433, 20219, 9352, -24547, 32031, -11236, -10316, 30788, -26146, 9856, 18016, -29099, 25407, -1764, -18862, 30521, -19570, -1340, 23582, -28109, 17092, 7242, -23776, 28281, -11387, -8862, 26902, -24089, 9084, 15361, -26101, 23615, -2770, -17018, 28119]
310B8119m6653J8159K2153m8244M2321r474k9122M7975l6501J417L3656m6679
322b2873K9844N608l7486M5534k4676j1777M0256m3067J8588J7997m3723M1176
334A5401j1830k5543M5673l6473M032L1002m5142L0070M427l4714M2643k3845
346d299j0930L7867m0426J7912J6348l9283L6872j1499k1180M0245l3178M390
358g161K6842m1340K8521L566l2518M0204k2586r798L5560l7771J5764J6476l7463
371b1704L3665q704k1682L8367k9766K826K5630l7308K5752K826k8593L6626k1136
384c201q308L2206l5258J6183J3710l4766L2840j0100j8316L5595k9136L788K2603
397A7840l4854K4397J323k5867L2974k0377n829K7588l1425J5988R157k9474K9909
$$ y = [28119, -18534, -375, 21778, -26466, 15855, 6381, -22741, 25234, -11267, -9850, 23806, -22873, 6971, 12579, -24907, 20627, -4049, -15826, 24430, -18637, -49, 17948, -25775, 15401, 3571, -21972, 23701, -12772, -8740, 22262, -22880, 7190, 11617, -23097, 19546, -4299, -15229, 22638, -17788, 124, 16472, -22811, 14061, 2562, -18618, 21627, -11551, -7161, 19681, -21659, 6862, 10428, -22090, 18114, -4472, -14270, 21290, -16481, -717, 15759, -21704, 11961, 3257, -18425, 19942, -9824, -6998, 18632, -18676, 7076, 9902, -18691, 17935, -3201, -11509, 20697, -14561, 1622, 15332, -19434, 13406, 3306, -15010, 20585, -8551, -4763, 17840, -17014, 7383, 8706, -17161, 15813, -4564, -10393, 17195, -14230, 1758, 10915, -18559, 11350]
410A1350j1692j3781L0652k8523O654J8222l1912K5580j779k2383L1530k1006
422g088l066K5927l0558J6305P681k7596K9415j1600j2210K9163k7265P983J6250
435A3341k9512K5805l223k1199L0696k2121j063K4832l1496J7384O926k7624L0362
448A3108j2503j2217K9004k7917P365J6679k9429K4033l532k0398K9729k0835
460f913j203K2920k9510J6008O181k5700K8693j1968j1776K7173k6454P633J6706
473A1790k8813K2398j861k0299K8676j7640l627K3233k7418J3440P972k4329K5608
486I130q883j2073K4941k2256N410J5695k5008J9000j092j8920K5828j5137l690
499g055K0623k4501J1422Q640k1678K1408o580j2121K1699j7761K359J4495k0929
$$ y = [11350, -342, -14123, 16529, -11994, -5340, 12882, -19030, 6550, 4771, -17612, 13918, -7088, -10154, 15773, -14785, 1520, 9201, -18395, 11020, -580, -12790, 16373, -10892, -2909, 13341, -16171, 9634, 6411, -14788, 15908, -6213, -7276, 17556, -13940, 3444, 10370, -17254, 13108, 605, -11612, 17392, -10525, -3160, 13519, -15910, 8123, 4591, -15807, 13922, -6913, -8116, 14804, -14706, 1302, 7483, -18217, 10476, -1492, -13268, 13905, -12549, -4916, 11790, -17023, 5375, 3514, -16785, 11891, -5749, -9376, 13857, -13561, -121, 7851, -16478, 9130, 247, -11826, 13115, -9141, -3731, 11964, -13044, 5956, 4864, -14056, 11772, -3365, -7055, 13568, -10933, 489, 9129, -12549, 8859, 2279, -9842, 11857, -5904, -3545, 10950, -9979]
512i979J4405K83j5462K0297j1069m027J6243j8701Q514O892j6975J6419n356
525A484r323J7153j3970K239J0674j6334J1395K33j1298J4965r063j956J1380
538G579j4119P719L198j1337J2784o602m172J1993j2252N309M906j2365J2168
551D809m183o196J2472j1008K690P245j2726R817q34q569J2882r399m15R597j2923
566f741Q447J448j0839J3376p467l354J2167j3627O113N643j3725J3092m138p725
580g330J4809j1993J573R885j5052J0672J049j1584J5159q861l009J3303j4787
593f166P191N594j4499J4441m677q094J6165j3141J954J0778j6622J1708J308
606E940j2949J6221q971m275J4651j5266O034O915j5601J3824l582r172J5765
$$ y = [-9979, 4426, 4709, -10753, 9544, -1525, -5552, 10691, -8010, 504, 7396, -9579, 6840, 1484, -7839, 9314, -4656, -2417, 8257, -8077, 3318, 3551, -7747, 7218, -1845, -3801, 7579, -6540, 1179, 4377, -6960, 5824, -778, -4950, 7043, -5209, 100, 5006, -7359, 4809, 626, -5570, 6902, -4106, -1416, 5829, -6897, 2920, 2086, -6483, 6399, -3000, -3415, 6182, -6741, 1706, 3154, -7685, 5691, -1776, -5130, 7037, -6590, -477, 5166, -8559, 4533, 395, -7330, 7479, -4514, -2941, 6944, -8108, 2564, 3613, -7971, 7188, -1673, -4682, 8621, -6166, 1025, 6619, -7880, 6561, 1884, -6210, 9955, -3186, -1232, 9546, -7076, 4632, 5940, -7009, 9212, 241, -4034, 10617, -4649, 1385, 8300, -7301, 6523, 2941, -6231, 9534]
619I534j2376P12J0654j5857J0286J717j2727J5147q412m508J3937j4425N386
632i32O745j4831J2728k699q897J4727j1015J10J0534j4296R020K073j1422J3620
646E465p028l861J2420j2478N177N878j3093J1948k722p581J3489j0399P07R468
660G390j3118Q673J594j0483J2518o527l489J1234j1539M643M870j1447J0460
673D779k975o299J1348r432J130P593j1677Q163M25q975J1407o779k356R805j0951
688d794M772M106j0406R920l152n596J0618r005J672O662j0737Q105k84p707J0778
703D952o919j257Q888j0781N802L005r831J0387m180m609J0503r430K247O345
717E122j0708Q266m78p615J0689o930j134Q427j0273N557K671r245R791l976m352
$$ y = [9534, -2842, -2130, 8524, -7333, 2953, 4670, -8057, 7090, -1322, -5830, 8107, -6318, -932, 5813, -9018, 3710, 1011, -7886, 6841, -4174, -4064, 6470, -7826, 1194, 3267, -8155, 5465, -1563, -5424, 6996, -5482, -305, 5573, -7520, 4428, 1706, -5875, 7614, -2785, -2078, 7390, -5728, 2945, 4539, -5944, 6574, 47, -3442, 7792, -3747, 896, 5766, -5681, 4779, 1804, -4495, 6853, -2579, -1449, 6144, -5533, 2630, 3055, -5920, 5487, -1292, -3648, 6157, -4794, -22, 4084, -6322, 3598, 446, -5150, 5468, -3537, -1865, 4797, -5940, 2165, 1881, -5826, 4952, -1967, -3224, 5664, -5117, 685, 3690, -6141, 4246, 66, -4543, 5960, -3470, -1223, 5122, -5586, 2680, 2202, -5413, 5276, -1654, -2788, 5639, -4634, 923, 3594, -5651, 4140, 164, -4188]
732d188R899r107K327N930j0350Q017n15p302J0250o508j344Q265r719M892L008
747C555q884R071l513m191R095q125K066N222r159P226n90o418R348o287q05P347
763D958r060M875K372p978Q413l473l699Q395p582K005M672q308O661q27n430
778d006Q111n696l51O105p931M699J490o822P766l718k722P401p314K480L833
793C325p626O561j250m762P688n593n9N671p555M720R91o080P241l757k012O492
809C995o861K870L083o988O457j815m091P328n814N69M991p258M846O76n755O960
825C193l643j941O140o558K793K659o489O116j888l413O581n605Q65M372o735
840c553M777J38m888O721m064j358N693o351L055K285n913N803j906l119O119
$$ y = [-4188, 5711, -3396, -1069, 4861, -5489, 2528, 2013, -5289, 4961, -1547, -2891, 5374, -4345, 547, 3555, -5329, 3742, 229, -3962, 5133, -2992, -926, 4296, -4863, 2363, 1773, -4645, 4703, -1584, -2389, 4958, -4102, 773, 3145, -4833, 3580, 107, -3592, 4803, -2779, -774, 3898, -4410, 2251, 1424, -4006, 4105, -1591, -1942, 4163, -3768, 931, 2421, -4401, 3365, -353, -3075, 4326, -2988, -508, 3325, -4301, 2260, 1010, -3752, 3936, -1657, -1716, 3955, -3600, 1120, 2111, -3969, 3272, -485, -2497, 3995, -2866, 4, 3087, -3901, 2556, 741, -3350, 3978, -1836, -1267, 3724, -3534, 1312, 1988, -3767, 3193, -450, -2391, 3749, -2809, -16, 2643, -3846, 2270, 382, -3031, 3550, -2055, -1190, 3182, -3553, 1224, 1362, -3526, 3195, -869, -2227, 3466, -2885, 170, 2455, -3458, 2345, 439, -2680, 3439]
855C439n239J220L598o090M673p8m500O299m210m81N135o346L282J690n619N891
871B664k221k617N661n157J089L721n990M338r9m319O078l894r80M818n649K892
887C35J705n329N414k206k426N391m878J319L150n626M211j91l873N322l311p13
903a706M309n034K644J261m282M610j921j959M521m109J316K397m646L901o00
918G02k911M597l405P9L405m669K943O64l677M372k265j280L913l971J565J782
934A844l988L719j101k165L979l373N93K508l959K983j36k875M082k694m68L279
950B228m080K201J037l611L841j619j604L747l568J007K170l949L370p18k537
965b085M159l113J58K856m181K790M84l475M264k267j153L910m180J683J894m253
$$ y = [3439, -1800, -580, 3018, -3072, 1601, 1523, -2977, 3322, -888, -1369, 3766, -2580, 702, 2392, -3227, 2664, 443, -2174, 3487, -1670, -581, 3140, -2850, 1488, 1389, -2930, 3148, -746, -1726, 3092, -2557, 335, 2040, -3289, 2125, -81, -2507, 2884, -1994, -675, 2475, -3151, 1060, 869, -3004, 2318, -993, -1706, 2603, -2431, 213, 1474, -2808, 1802, -119, -2078, 2443, -1666, -350, 2047, -2599, 1302, 702, -2209, 2388, -1017, -938, 2467, -2202, 741, 1405, -2272, 2100, -165, -1445, 2468, -1503, 62, 1844, -2144, 1575, 474, -1691, 2288, -1085, -492, 2016, -1943, 1040, 904, -1971, 2111, -583, -1051, 2228, -1852, 349, 1386, -2225, 1616, -3, -1607, 2140, -1428, -421, 1749, -2200, 1170, 452, -2085, 2074, -1039, -881, 1975, -2206, 584, 1068, -2407, 1857, -410, -1563, 2347, -1833, -150, 1744, -2509]
981b509L889j000k588M494l481L19L064m517L072M13l599M557k609j089M049m406
997a941J956J836m483M239j233k607M684l705L42L322m828L105N97l823M693k452
1013b98j482M320m405J694K161m624M085r42k823M754l563N3L417m701K934P97
1029A377l960M533k168j638M362m135J291K347m474L648m61k830M294k964k77
1044a055L188m076K390R25l506L830j740j502L740l546J085K113l831K992k92
1059G15k522L787k537m31K908l498J899Q87l069L217j388j282L055k847R40J477
1075A311l056K577m47j911L100k324nK230l033J970M12k456K855j416q86K556
1091A477k564J039J150k555K336o16j394K546k144L86J615k598J984m2j934K671
$$ y = [-2509, 1380, 380, -2208, 2286, -1195, -876, 2188, -2329, 743, 1156, -2443, 2114, -495, -1584, 2465, -1941, 15, 1851, -2632, 1607, 374, -2233, 2451, -1254, -912, 2410, -2418, 687, 1284, -2539, 2154, -298, -1780, 2540, -1865, -171, 1990, -2634, 1451, 509, -2314, 2440, -1123, -1070, 2347, -2354, 580, 1377, -2583, 1950, -218, -1856, 2506, -1629, -338, 2009, -2465, 1183, 722, -2108, 2186, -778, -1055, 2133, -1943, 447, 1372, -2134, 1696, -44, -1546, 2194, -1352, -267, 1846, -1985, 1007, 715, -1807, 1980, -557, -988, 1920, -1578, 321, 1208, -1861, 1356, -32, -1314, 1741, -1106, -166, 1311, -1745, 832, 385, -1526, 1574, -750, -755, 1475, -1558, 412, 824, -1632, 1223, -193, -1079, 1477, -1087, -48, 1102, -1453, 883, 267, -1127, 1419, -725, -339, 1276, -1322, 662, 620, -1314, 1357]
1107A357j735l26K215k632J338P42k342K446r26j154K417k199N40J438k484J951
1123F46k14j680K503j762j12J963k533J470M98k200K533j231q56K399k413Q03
1139a86J274k430K103l74j593K528j838kJ779k417J539L89k025K341j219o42K104
1156A331k282R52J072k355K160n40j459K495j914Q6J735k367J471L44j969K297
1172A057j148p11K103k116Q54R23k158J920n25j169K191j789J63J527k248J534
1188D08J17j699K163j223n17J888k026R24P87j947J821n69j006J972j684L28J209
1205I46j909J398%j376J912j263k25J589j949J136M60j740J859p80q04J851j684
1222e79M49J098j933J494j64j251J868j286j02J363j850J147K72j563J826r73
$$ y = [1357, -378, -704, 1511, -1121, 217, 959, -1383, 1063, 137, -1017, 1400, -799, -259, 1179, -1305, 646, 432, -1248, 1255, -507, -619, 1344, -1189, 281, 779, -1421, 1112, -119, -975, 1424, -989, -186, 1088, -1342, 761, 387, -1206, 1322, -516, -518, 1261, -1156, 383, 772, -1253, 1088, -131, -773, 1331, -951, 1, 1073, -1282, 878, 338, -1121, 1374, -540, -454, 1281, -1086, 385, 729, -1240, 1057, -91, -802, 1301, -815, 39, 962, -1196, 724, 199, -970, 1221, -568, -405, 1122, -1126, 408, 525, -1174, 989, -234, -751, 1137, -889, 35, 822, -1125, 696, 127, -879, 1093, -591, -263, 946, -963, 435, 435, -941, 971, -292, -517, 1072, -877, 259, 719, -1021, 838, 58, -746, 1105, -579, -130, 968, -965, 529, 365, -886, 982, -304, -406, 957, -893, 254, 526, -1037, 789, -184]
1238a84m88J691j852P17R31j935J687l85j160J966j499P6J334j852J186K43j574
1255a098K070j161m88J629j635P94N57j711J326l20q67J735j340J07J239j698
1271h61J333P9j467J674j186l28J722j202L66N37j785J672n55p02J634j583M98
1288a54Q70j769J373n2j101J666j013m06J472j537P15N22j622J671o08m67J374
1305I34j507L82R28j604J189k8j123J545j021j02J196j573Q27M33j405J491o00
1322c8n77J426j436M73Q80j573J257j80j023J596j093k2J090j438Q70K70j192
1339g10J354o61m31J302j342N38O36j437J295l39q69J489j178Q2J063j502R43
1356B33J85j194J437q56l29J227j266N44M25j252J271l49p35J351j207K20Q69
$$ y = [-184, -672, 1019, -833, -116, 815, -1120, 567, 182, -978, 988, -511, -435, 899, -953, 233, 476, -1098, 972, -189, -677, 952, -683, 111, 668, -1043, 283, -37, -904, 831, -509, -402, 837, -861, 472, 551, -916, 758, -428, -756, 966, -236, 130, 667, -1118, 554, -1, -703, 931, -652, -154, 716, -1053, 320, 268, -833, 833, -180, -586, 886, -651, 64, 586, -1036, 635, 27, -440, 934, -573, -191, 737, -867, 322, 294, -829, 716, -305, -407, 789, -784, 43, 476, -929, 562, -38, -615, 811, -625, -152, 728, -845, 412, 232, -791, 805, -288, -310, 780, -658, 212, 482, -710, 644, -17, -448, 854, -488, 50, 686, -751, 544, 205, -664, 825, -353, -271, 792, -710, 233, 418, -776, 661, -195, -524, 703, -563, -19, 406, -846, 425, 76, -659, 692, -515, -295, 574]
1373E74j399J091oj150J457q80k11J268j424O36N38j347J320m53o57J356j205
1390d92K58Q55j416J147n9j032J400q87j71J222j434P24L94j318J313m09o38J371
1408H28j270K04R41j330J057j48r58J374q79k03J161j315O48M11j298J325m55
1425I3n90J244j212K66Q48j317R97k9j032J341p95k17J116j307N87M50j188J165
1443D20m28n69J184j071K83P00j161Q36j8q91J240o82j04Q61j115N65L19r60J025
1462D34m09n31J028q99K21O32j039Q46r3p06J008o32j3O70r84N48K40p45Q90m68
1482bk79P60p46K67M10q52P39j40n31Q04n49M5N18p90N49K3n55P61m84j29O51
1503D70p66M25J89p02P31l88k21O90p36K28L50p50O55j60m43P75o10O7N13p87
$$ y = [574, -825, 266, 260, -890, 567, -313, -524, 744, -680, -44, 494, -853, 467, 14, -643, 713, -492, -234, 621, -795, 352, 293, -739, 661, -226, -397, 825, -609, 115, 509, -809, 504, 95, -543, 828, -442, -238, 703, -627, 430, 282, -676, 698, -181, -384, 777, -538, 110, 521, -777, 548, 93, -497, 747, -465, -199, 649, -668, 329, 300, -732, 609, -186, -403, 713, -594, -7, 443, -745, 420, -8, -577, 607, -464, -181, 519, -642, 194, 176, -715, 525, -157, -261, 600, -515, 50, 369, -591, 434, 25, -506, 522, -377, -156, 476, -563, 283, 190, -516, 492, -140, -153, 517, -467, 81, 321, -424, 466, -2, -281, 479, -267, 0, 410, -442, 297, 157, -374, 430, -119, -74, 444, -346, 203, 226, -329, 432, -52, -181, 470, -296, 129, 318, -384, 347, -41, -262, 428, -308, -80, 270, -480, 175, 15, -428, 347, -263, -196, 317, -470]
1523d70N80Pn97P81m96j24O86q22L82L38p61P62k68m34Q70p47J85O28r64O61l0
1544A67o11R51n95j01P34q28M04K55q19Q37k78m24R05p53K09N29r56P01j9o72
1564c64R14n98j29P84r16M39L12q97Q34k98m26Q73q05J81N00r07O68K5o09Q42
1584D23n66j86P89r41M76K84p79P47l50l75Q11o71J39N31q23N66k4n35P60m65
1604a89p6N80p19M16K08o66P57l39l02P93p34K31M02p35O32p8n42Q36n44q5O37
1625D83p66M65J45o64P14l91j72O27o33K02L38o52N97j43m42O59n06lN77p66M64
1646A33J28o33P11l82j84O17o82K95L23p77P04j90l96P00o05J07M18p20N24M3
1666A34n37O84m06j38N90o66K67K90o92O73j62m71P83o35R3M62o84M99M5n27O95
$$ y = [-470, 110, 117, -480, 301, -195, -319, 367, -455, -73, 265, -496, 266, -2, -436, 434, -313, -128, 500, -464, 197, 167, -444, 507, -88, -189, 545, -283, 121, 376, -443, 394, 116, -308, 597, -156, 53, 582, -374, 327, 308, -364, 550, -48, -177, 607, -309, 130, 442, -455, 379, 81, -345, 528, -277, -96, 404, -503, 165, 190, -419, 423, -143, -329, 460, -481, -5, 279, -500, 247, -103, -478, 333, -338, -199, 332, -491, 75, 51, -484, 276, -189, -265, 315, -404, 12, 220, -446, 311, -28, -330, 463, -271, -40, 362, -373, 259, 181, -361, 475, -69, -154, 483, -283, 182, 327, -337, 377, -14, -186, 441, -192, 10, 348, -304, 293, 150, -292, 367, -139, -142, 435, -331, 133, 261, -372, 339, -43, -227, 390, -292, 3, 326, -451, 253, 63, -333, 367, -238, -131, 287, -433, 91, 134, -403, 281, -125, -263, 327, -339, -72, 218, -474, 199, 37, -434, 349, -286, -193, 269, -415, 84, 129, -398, 297]
1687B97m43j19O45p17L05K37n89P04k84l42P18n95J39L89o69M71L7n10P07m16
1707c5j63N58o23L09K54n89N85k61k58N67n33J32M08o47M72j1m84O59l99r1N27
1728C77o27L09K14o35O69l06k64N65n07K07K57n70M67m8m16O01m64L1M12o24L83
1749C1J09n20O07k72k01M91n16J71K96n91N66j36m20O64m59J2L90n59M29L9n18
1770c87O21l25j72N42m89J95K27n25M76j22l02N43m22L7L70n77M16M3m05N31k83
1791hj60M93m97K20K52n39M78k13k54N77m35K5L84n79M23M8m38N40l90j8M18n31
1813b04K80J58m96M75j77k50N03m60J08L03n83L74N8m35N85l79q9M74n47K77Q6
1834F1m14N15k20l02N86m17M0K95m52L28Ql33N35l38r1M52m88K55J67m17M23q8
$$ y = [297, -146, -265, 380, -337, -32, 205, -384, 320, 36, -306, 412, -183, -44, 345, -324, 147, 184, -326, 381, -35, -198, 360, -263, 46, 300, -289, 296, 35, -223, 344, -189, -57, 351, -296, 176, 165, -319, 340, -59, -150, 377, -250, 59, 273, -362, 307, 1, -263, 302, -205, 2, 259, -311, 156, 108, -308, 293, -171, -140, 272, -352, 31, 140, -380, 227, -45, -246, 245, -271, -100, 196, -395, 171, 35, -385, 279, -180, -168, 222, -337, 92, 131, -387, 234, -91, -263, 279, -210, -15, 212, -313, 163, 41, -261, 282, -140, -103, 267, -310, 106, 149, -256, 275, -8, -168, 325, -172, 48, 300, -239, 239, 26, -228, 349, -86, -61, 323, -256, 167, 215, -223, 317, -73, -91, 327, -204, 76, 234, -262, 213, 36, -214, 289, -171, -63, 240, -343, 31, 89, -346, 239, -140, -229, 245, -302, -25, 61, -353, 162, -58, -360, 226, -191, -151, 144, -308, 20, 28, -305, 230, -108, -199, 253, -235, 20, 187, -230, 193, 105]
1856A05k74N39m58O1L50n47L27O4j10M25n31o7M14l02R9J45l55K56m4k81M54l62
1878i2J35J69m03L68n7m06M46l25m8L31l66J38K47m62N33j63j37L16m83L77r9
1899A9l14L00M05q29Q10n30j58K85o8K34q3k76L89j64k50M91m04J89J28m01M00
1920A73r3k43M07k87j3L31m84L34kk76M12k86o1L21m27J90J65l40M18k26j49L60
1942B24l74P9K77m17L09o6l36O22m58l5M90n32K00J59m65M87j76k05M03m03J70
1963d7K40n33N22p3l67M80k46j40M50m85J53K65n14N14j94k50N13l89K8K93m63
1984b43L10O5m11N33k93j60M27m18J72J35l36L59j64k23M74m19O5L35m28K53K9
2005F2l52L75r9j85M04l71J02K46l97L60r4k18L72k63%L11m27K27J5k27L38j60
$$ y = [105, -169, 370, -88, -27, 323, -224, 103, 167, 57, 482, -49, -116, 298, -4, 95, 240, -115, 141, 97, -184, 270, -92, 43, 212, -191, 177, 120, -286, 160, -165, -213, 118, -248, -110, 137, -325, 208, 45, -92, 224, -259, 118, 19, -295, 5, 410, -419, 391, -139, -297, -12, -80, 154, 71, -205, 184, 20, -230, 261, -143, 46, 174, -227, 173, 80, -163, 244, -43, -56, 275, -209, 125, 123, -153, 259, -27, -88, 233, -194, -4, 161, -179, 239, 13, -136, 224, -150, -71, 206, -211, 98, 32, -304, 318, -140, -175, 315, -217, -17, 142, -323, 164, -12, -217, 186, -217, -47, 193, -340, 182, 109, -258, 222, -24, -164, 286, -199, -46, 219, -295, 219, 25, -225, 288, -101, -73, 220, -243, 67, 132, -279, 254, -39, -199, 228, -190, -18, 117, -219, 140, -24, -247, 227, -192, -127, 208, -220, 33, 62, -290, 85, -14, -199, 205, -166, -64, 182, -215, 145, 51, -167, 205, -58, -58, 253, -174, 53, 68, -159, 179, 19]
2027A9j37L24l42J72J66l38K50j00k57M58l13O0K11l73K88m7k01L02k50j0K98
2048A80k81J30J19l22K98q0k49L56k44P6J73l25K45M5k76L91k34n6K56k93J40
2069D9R8k64K40j11j11L07l04L2K15l35K58Kk22L32k19o2L06l51J36L1k67M57
2091B17l34j1L31l72R5K57l56K99j41j83L47k48jK54l12J92Q1k98L05j45j28L28
2113A77k83L4J80k83K40r2j38K82j75rK21k89J72L6k60L55j62j08L08k82R7J56
2135A77l22K38m6k04L46j75q2K77l51J33N7j66L17j45j32K91l02O3J47k50K37
2156A08k9j73K35k29P5K14l64J11Q7k06K46j64k2K35k81J70R8k90K24l2j50L12
2178A75l06J00K09l24K02K3l00L98k29o2L26l80K04O2l28K37j2o9K03j54q0J96
$$ y = [19, -118, 206, -136, 36, 202, -136, 114, 14, -243, 215, -98, -38, 173, -200, 88, 41, -160, 142, -108, -118, 180, -101, 29, 148, -174, 124, 44, -205, 151, -93, -17, 156, -169, 76, 121, -155, 236, 2, -54, 202, -91, 49, 147, -117, 123, 12, -99, 208, -96, -64, 151, -184, 74, 76, -146, 186, -33, -95, 211, -140, -4, 27, -240, 217, -117, -128, 203, -169, -74, 183, -173, 126, -15, -198, 149, -99, -100, 154, -158, 34, 115, -183, 122, -23, -151, 177, -106, -72, 108, -175, 65, -27, -165, 117, -58, -67, 154, -135, 37, 73, -187, 168, 6, -102, 206, -76, 21, 177, -145, 93, 47, -157, 189, 14, -68, 209, -142, -9, 48, -118, 199, 54, -78, 213, -89, -26, 121, -129, 108, 79, -94, 141, -88, -13, 201, -163, -52, 35, -171, 75, -89, -111, 124, -157, 13, 111, -179, 45, 13, -137, 175, -131, -31, 178, -146, 56, 79, -221, 177, -52, -114, 212, -168, 36, 98, -230, 7, -5, -74, 129, -25, -105, 91]
2200I1O2L5l66J30Q6r2M7J99l56J43K9j88M17k30j51L87k56pJ93l25K13J3j47
2223g3K50j08j43J94j59L2J23k85K46j16r5L02k63Q8J17k69J59M3k13K53j52n5
2245a24K18k79J73J02k62K06n4r7K66k29P0R5k41J61N7k04K49q8p3K37k40M3J31
2268A17k25K23r3p6K39k37N3R6j73J36pj83K61k27K9K22k80J35J25k37K09j08
2290ar3J90j80O2J01k42K57l5j54K06j48l0K44l12J66J9j64J74m8p0K00k05m6
2313a09J71k49K21nj53J98j52K7J14k19J53K3j47J86m1j46K62k40J15O2j93K03
2335H1r0n9J86j56l0K11k48J69lj57K18j40m8K54k85J52L3k46J80l1j43L00k52
2358a04L5J71k52J95k3k14K87j71l0K49k66J02R3k18K16pj89K37k00Q7J33k59
$$ y = [91, 153, 188, -178, -48, 38, -54, -7, 192, -164, -21, 8, -180, 237, 7, -144, 243, -13, -20, 173, -152, 61, 74, -73, 177, 69, -74, 120, -39, -7, 116, -169, 77, -39, -134, 168, -95, -7, 110, -159, 0, 43, -170, 83, -69, -124, 94, -185, -12, 90, -172, 34, -20, -117, 149, -80, -10, 85, -156, 5, 62, -142, 107, 19, -54, 183, -57, -14, 117, -108, 115, 22, -54, 185, -52, 1, 97, -76, 60, 53, -130, 131, -96, -67, 155, -125, 10, 135, -102, 107, -1, -94, 96, -84, -22, 79, -163, 94, 59, -95, 111, -37, -67, 177, -135, 31, 50, -114, 60, 12, -58, 142, -63, -109, 62, -187, 34, 29, -124, 74, -78, -51, 63, -156, -3, 20, -127, 59, 18, -128, 134, -106, 9, 71, -122, 81, -9, -68, 118, -38, -68, 143, -105, 64, 61, -96, 122, -18, -66, 188, -97, 55, 88, -158, 22, -9, -152, 148, -104, -69, 102, -150, 45, 22, -192, 95, -76, -106, 143, -123, -21, 72, -146, 70, 63, -126, 111, -89, -2, 131, -128]
2380a28J97Ok20K73j17m4J10j93Q9J53k54J72l8j27K25j39m0K38k92J54Q2k01
2402i4K02j45r3K22j98R4J37k52J72j7j87K63j33M2J16k21J51J2j59J61q1k1J40
2425A11j78PJ11j68J32M9j56J59j18k1J33j86O6J32k07J85p3r9J88j48O7M6q1
2448d9M7J6r4J32j14j5J84k29J10O3j76J72n2l3J25j74R4N2j54J74o4l1J33j30
2472a3J3J02j37N0oo9J48j03m9J51j80O0J13j37R2m5o3J71j52K5J05j70P0%r4
2497a18J43n4l0J00r1N1L0j47J61j00qJ96j43o4J47j57J04L3j34J47j31QJ12j34
2521g9M9J09k06K01o1p8J47j34K4J06j30Q8K6j03J86j28n7J58k09J52L3j42J98
2544A50j09m3J06j19M9M9j61J05L3r7Q3q0m2J34j20M4M0j20J48p5j7J02j02m2
$$ y = [-128, 69, 75, -145, 128, 11, -33, 77, -116, -27, 126, -128, 44, 6, -121, 104, -35, -75, 163, -129, 25, 107, -94, 108, -37, -130, 92, -106, -12, 125, -127, 45, 28, -159, 104, -29, 13, 129, -92, 59, 71, -88, 73, -8, -29, 111, -67, -60, 51, -117, 15, 64, -92, 67, -51, -72, 61, -125, -59, 73, -134, 51, -22, -121, 67, -81, -14, 32, -49, -2, 14, -80, 52, -62, -77, 107, -122, -12, 51, -125, 47, -5, -38, 87, -87, 7, 59, -95, 79, 15, -16, 117, -13, 0, 102, -35, 15, 9, -60, 88, -15, -64, 87, -93, -33, 80, -57, 35, -10, -73, 98, -54, -29, 76, -94, -24, -24, -118, 25, -29, -59, 41, -50, 1, 31, -116, 45, -55, -63, 133, -10, -74, 73, -84, 20, 53, -81, 66, -65, -57, 55, -79, -30, 79, -127, 74, 13, -65, 82, -52, -28, 78, -52, 36, 62, -41, 145, 17, -40, 118, -91, 61, 94, -48, 150, 41, -2, 104, -15, 34, 83, -78, 27, 60, -37, 46, -34, -76, 58, -62, -18, 22, -98, 50, -25, -42, 60, -42, -84]
2568h4J31j61J55n2j06J95j42K7J26j28P1Lo8R3l6o6J26p3j0R2j66J08J2r7J51
2593A01j10K7O0j48J21l0q3J42o3m2J31k00J14O2j56P4N4j50J46j03n3J54j00
2616e2N3j7m6J47q7o8J62j18J7O5j52J67m3j10J29o7j5J05j44J21L0j07J26j00
2640do1J78j61K5O0j13J50n0j05J23m9n9J52j64J07O4j37J16r6j1J02j04N1P5
2664H9j79J19J9r2Q0p6JJ04j00P1jr2Q4l7o2J31j15M4J5j03J34j8j66J79j32N4
2690d9R7j57J29K1j15J15k7m3J10j06pO8r1P7N0o0J11j45K9P0j35J04L2j30J08
2715E6q2rJ53k19J08Pj19J76p8l3M6j11J08J05k16J17Mo8J07q3j0N5p8N5N7j24
2741g6J44l4l2R7j34L4P5o9K6mj30J61q4J4J7k2nj0J6J5j04j5P7M9r5M9p2L98
$$ y = [-84, 47, -114, 41, -11, -117, 78, -64, -37, 89, -39, 32, 35, -33, 60, 24, -42, 84, 11, 1, 93, -73, 35, 47, -50, 101, -9, 18, 78, -70, 51, 21, -62, 80, 17, -25, 106, -94, 20, 82, -74, 0, 54, -96, 50, -53, -106, 48, -52, 1, -16, -62, 85, -2, -70, 92, -26, -9, 56, -96, 71, 28, -82, 47, -20, -35, 70, -74, 47, 77, -30, 96, -4, -65, 113, -48, -23, 37, -76, 74, 24, -81, 42, -7, -66, 86, -78, 29, 93, -44, 72, -24, -35, 67, -37, 14, 89, -90, 29, 48, -44, 36, -40, -39, 65, -35, 36, 35, -57, 27, -10, -72, 59, -56, -12, 3, -100, 34, 16, -150, 29, -103, -49, 48, -109, 20, 41, -74, 41, 14, -29, 81, -25, -32, 36, -55, 22, 72, 12, 123, -22, 7, 77, -58, 46, 78, -52, 56, -26, -35, 118, -101, 7, 14, -105, 71, -7, -40, 6, -105, 3, 108, -108, 9, 13, -55, 52, -31, -41, 14, -64, -9, 48, -76, 68, 34, 2, 99, -35, -1, 74, 5, 31, 27, -103, 58, -26, -12, 5, -17, -22, -32, -16, -1, -105, -120, -43, 6, -89, -40, -112, 286]
2769B86k13k9r6R4k1K62l78P4P9k74L31q3j5r9j3J31j4m9J85o1k44J97O6k24J11
2794Cq6J8J62j95J29r6pR5o1j8J14j34P3j8o7J45q0M1oq0Q8J1q6Q4n8PQ5j36M3
2823c0J03j34J08k2o3N5l6m4J71j50L9J15j55P9q3%J34q4l7P0r1L2N0q1Q3j9%
2850A0L6o5j3P1o3N3n8QQ1o8O4n1l9J08r4J7P8r5O0l0o0P7J8r5R2n7l0J10j18
2879e3M9Qk5L6ko9O9n3mN2j18R6j3j2P7r6L6J11j46M5L0o0N4j1m3J18j00L3N5
2908F4j41P3n3O0jln6R9j27P0Nm7R1l4n4J06o4L6L3j54J33Oj36J54j06J8O5r0
2936e3Q8m2n5J38q1j7N9m6J8M9j22P4K3r5J24m9n4R9r9L9k8j5L1N0r2J16j22R1
2964B9n6l4J03m0j6R4r9J8O5j18L3K4jP9r7k0J09j49P8M0j00O1k1j8Q8l7n0J03
$$ y = [286, 73, 44, -52, 42, 21, 283, -95, -21, 58, -216, 115, 32, 17, -82, -95, 36, 22, -27, 158, 97, -147, 50, 116, -108, 3, -83, -65, 97, -98, 31, -65, -72, 23, -38, -56, 58, -76, -3, -21, -88, 57, -23, 18, 12, -68, 20, 31, -55, 29, -29, -22, 63, -73, -30, 73, -61, 47, 25, -38, 17, -19, -63, 108, -42, -3, 112, -43, 36, -47, -47, 87, 3, -34, 36, -55, -23, 27, -54, 29, 10, 10, 46, -19, -32, 39, -24, 29, -29, -21, 60, -8, 56, 5, -34, 74, -20, -3, 75, -20, 40, 10, -50, 27, 45, -50, 42, -15, -45, 65, -53, -4, 4, -21, 15, 13, -56, 13, -40, -44, 8, -110, -14, -27, -39, 38, -58, -22, 89, -57, -12, 18, -42, 12, 1, -42, 76, -24, 9, 64, -77, -4, -57, 3, 2, -1, -57, 42, -85, -15, -10, -57, 34, 0, -54, 52, -12, 24, 57, -97, 36, 42, -94, 60, -46, -28, 37, -53, 35, -7, -62, 76, -5, -22, 37, -9, 9, 58, -64, 10, 33, -62, 62, 13, -41, 58, -41, -2, -30, -45, -14, 36, -56, 60, -62, 29, -27, -61, 42, 2, -14, 80, -19, -1, 64, -54, -21, 3, 2, 81, -16, -36, 73, -76, 2, 42, -58, 3, -18, -36, 52, 15, -35, 68]
2992F8j11K0P0j32R5Qm4J5m6M7Nj00J05rq8J35q0QM6q2J04l1n1P5o7n1R8r2M0
3021d5K8J3N2k7r0R7nO5j32n3j8L46k66J90k60J01O1p5q3O0j75Q1R5r7K22j78
3047i3j8lJ45k31K77k16M28n38j07O55n61J72N4K20m79L30J08j30k58M55N2k22
3069D0J35k57K42K7j37l6pK48l66L27k47l3K15k28m4J52k8O3k22J53o5mJ42J7
3093H7j51N1k0N5M5j68Q8K1r6J65q1N4Rm1ok5m1J33j00j6P1r3K6M5n2R0o0p3J29
3122D6j13L8L5m1R9n9n0Q4r5J3P7o8L2J9r5J00j8l0N8p8qQ8p2P6nm8M5m6lN7r9
3153f1O7K6p6M1J5j3O7j28P3O2p4nJ6p4J22j05j4R2q7M2L4n9O2m1k0Q5l1k2J8
3182A2j8Lj4L8K4j26M6Q5l6n3Q8q0R5q6n8J11q1J3N6j3jp8nJ35j07K9R7j70Q3
$$ y = [68, -43, -23, 47, -85, 10, 18, -26, -11, -57, -10, -5, -105, 0, -9, -97, 38, -42, -34, 12, -70, 34, 3, -48, 27, -40, -91, 7, -85, -45, -17, -4, 48, 21, -69, 28, 23, 88, -44, -97, -115, 231, -35, 155, -105, -4, 57, -18, -101, -41, -216, -135, -40, -137, 85, -93, -111, -114, 31, -200, 77, -139, 289, -249, -356, 299, -262, -90, -36, 184, -295, 35, 143, 13, -245, 210, 262, 40, 175, -82, 160, 187, 50, 14, 7, 255, -111, 216, -31, -64, 151, -77, -121, 31, 3, 66, -156, -3, -68, -72, 70, 87, -64, -13, -33, 22, 67, -101, -13, 8, -88, 77, -4, 50, 59, 18, 12, -13, -54, 79, -21, -37, 34, -59, -33, 12, -40, 50, -10, -83, 46, -67, -29, 6, -35, 64, 5, -45, 39, -56, -43, 34, -34, -2, 17, -78, 22, 4, -26, 32, -46, -54, 34, -38, 38, 33, -15, 30, -16, -19, 38, -61, 6, 32, -44, -3, 12, -1, 66, -62, 11, 73, -1, -6, 10, -64, 58, -47, -61, 31, -56, -14, 20, -39, 23, -18, -38, 47, 16, -6, 12, -6, -3, -17, 21, 45, -81, -35, 50, 14, -39, 49, -31, 64, -22, -80, 31, -50, -37, 19, 6, 5, -73, -78, 57, -50, -21, 76, -94, -11]
3211a1J6j7L6n5qJ44j09J3L2j12J00j2n1J01j06K4L9m4P4k2o0P1r2KJ03j30P8
3238DK2o2R2l1k7L3o0J4M3l6L1oq9R5m6pQ9j01N1N1j31J08k8j6N7p7M5l3k9N7
3268A3Jo6R9k9J2O2j13j4N9r9R7j5m8Q5n8J4L7n4lK5k4jj2L6L3j5K5l3K4qk4r5
3300h9J55o0j8J14j25P1m7k4M5k6J3L5p2R1n7J9m9m2Q0K3o3J0Q6j29R5l1m0P6
3328D1J8j32j7L9RJ83k91L21Kk67l9o1J4L99n67M54L32p86M58j59l17L16j78K54
3352B6j99R2L89P8m68K46k96J49L0p4M5P2k61J14J36k76L10k06J16j3k36K90P
3375G1nj62p9L6J53n9j7Q0l6N0j32L5K11k0j16O6j89O1L13nj38j56N1j5K2O2m6
3402C6l6J45j14j80p8K62q4J24J1m9K1j46J59l09%M65o87O25j50K21m57mJ99L8
$$ y = [-11, 5, -12, 24, -31, -39, 105, -4, 9, 41, -71, 29, 17, -34, 67, -39, -15, 24, -20, 54, 32, -28, 43, -49, -47, 56, -74, 4, 26, -36, 56, 25, -2, 31, -29, -15, 28, -8, 23, 17, -72, 23, -23, -30, 59, -42, 9, 60, -71, 37, 9, -7, 50, -27, 18, -15, -44, 13, 14, -52, 47, 18, 30, 92, -21, -35, 24, -75, 22, 7, -41, 44, -14, 0, 37, -17, -20, 5, -19, -20, -32, 4, 37, 22, 47, 14, 38, 30, 6, -89, 66, 6, -12, 102, -23, 48, 1, -23, 22, -4, 9, 44, -28, 63, 6, 25, -24, -66, 14, 37, -26, -16, 70, -59, 36, 5, -35, 41, 59, -73, -90, -51, -42, 141, -150, 171, 173, -94, -133, -194, -180, 219, -348, 106, 438, -348, 110, -49, -366, -50, -228, 26, -173, -81, 308, 386, -82, 164, -132, 17, 47, -27, 18, 90, -171, -57, 79, -197, 113, -93, 23, 10, -226, 64, 71, 66, -96, -175, -139, 14, -45, -62, 18, -18, 32, -100, -65, 146, 126, 10, 76, -113, -52, 261, 256, 118, -38, 13, -2, 20, 82, 36, 0, 145, 31, -149, -227, 35, -49, 75, 86, 37, 58, -88, 71, -238, -238, 227, -460, 165, 15, 236, -221, -225, -26, 12]
3426A2k41M21j27j00K20j50k0k4N0Q1m6j08M7j2m4O7j24J86j5j75J07j09P8K6
3450@Pl2M2OoJ6l0O2o8l2N3n0k9J22r5O1L8p8L6j4m7P5k8MM3l9rj9QJ3m9J0O0
3483C1r2M8L6r6R0n1R5j5j07O7m2J4K3Qo1P9q0k8J07o8N5Ro3Q2l9l8N1o5M8N3
3513E1n5K1l2pM0j0J6k3n8K5J4l0Q3k5k7J7l7N2lp0J09m3n7O1k3J5O3j03J16k8
3543E2k6J1n1K8N2j01J00n5n1R7k7qj2n0l2J50j08K6jm1L4L8o9M9l4j5N5q6R0
3572A5j8m6P9o3L4M7r5N4J1k9P2p1lR0j34R7k1q1J41m7p7J9qL7OkJ3K1l1L6o3
3603a7%L7j01O0K8k3J4Kk8L8j4j9O1m6QJ4j5K0k1k7M0m1JQ0j04O9j4qpk0k7P8
3635A8r0P4j5jL2o5J4R0o5M8l2r9J10n2K9L7l0Lj9LOJ2l5k1N9qoo6P9J9K6p2J04
$$ y = [12, -229, 192, 65, -35, 185, 35, 15, -9, 41, 122, 76, -32, 15, 3, -41, 26, -98, 88, 73, -102, 5, -104, -26, 0, 7, -25, 17, 23, 17, 33, 3, 65, -3, -35, 18, -32, -61, 61, -34, 27, 65, -13, 23, 9, -38, 37, 9, 13, 56, 17, 8, -11, -3, 10, -39, -29, 31, -61, -13, 23, -73, 17, -34, 61, 46, -61, 6, -36, -22, 1, 9, -52, 27, -53, -81, 26, -42, 13, 22, -41, 41, 2, -36, 15, -50, -2, 51, -4, 17, -15, -22, 18, 8, 24, 1, -57, -32, -18, -48, 35, 10, -17, 0, -37, 15, 12, -58, 51, 8, -49, 12, -11, 4, 67, -36, 80, 52, 26, 37, -14, 14, 66, -35, 65, 10, -41, 56, 29, 21, 9, -41, -73, 77, -31, -5, -6, -47, -13, 25, -44, 5, -29, -44, 11, -75, 15, -3, -49, 30, -33, 1, 48, -47, 7, 18, -11, 61, -10, -13, 77, -57, 40, 19, -62, 79, 32, -45, -26, -34, 3, 9, 7, 20, 41, 10, 46, -17, -17, 20, -81, -21, 7, -16, -2, 0, -28, 10, -4, -23, 38, -8, 0, 14, -1, 19, -2, -29, 11, -30, -29, 51, -53, 16, 2, -6, -13, -33, -60, 18, -72, 2, -13, -14, 18, -47, -33, 57, -8, 40, 8, -91, 19, -33, -4, 33, 3, 6, -13, -10, -4, 8, -27, -48, 11, 3, -3, -69, 10, 29, 55, -17, 87]
3668H7r5L8n6J0P3j31Q8kl4Q8m3m6M2k6M0k4m8O2n2K4M7rj35j1Q5L6l1oJ05p8
3698bNoL0j4R3j58L3k28J59Q1p9R0J29q6J34k20j66N23m36k20L99j34K46O4m47
3723b10m5N83k10r3k0R2P9k10o4J90k44P1L81m06jQ1q6k6J02J11q4O8r6l5K01
3748A29o2q2k6K3lP7q8Q3m0%m6K2MPj6mP4r9L5L8p3Q0n6rN4m2J1K1m3M0mj5K5
3781A5l7j5P9q0L9N1m8M1n0J5J8j5j0j0J2Njm0Q3p8M1K1n4M0j5j5K7Ko0P7l0m7
3813c9M2j8RM7n4M1l2L0nn2O4L1k2K3J4k0l4Lom2k4M7L1k8j4nPL5k1J3k3k7J7
3846a2K8n2P1j1j0K8o9M6l0j9L6LMJ7k3j8j6k4Q0K6p4L1L0J4n7j8P3k1j6J0p4
3877d7O1%k8%j8J6Ol1J3L0kJm6LJ4oN5M1j61P0R6r8P6pj4ok9P2l4l8p3J27r5K11
$$ y = [87, -8, 30, -26, -16, 57, -74, 14, 12, -22, 66, 23, -23, 19, -7, 33, 9, -39, 23, -29, -5, 42, 33, -102, -113, -28, 8, -23, -29, 76, -2, 3, -3, 27, 13, 106, -52, -19, -247, -88, -7, -86, 4, 133, 47, 181, -39, -205, 318, -118, -338, 61, -73, 173, 237, -210, -255, 328, 118, 25, 5, 97, 176, -34, -98, 92, -152, -81, 300, -106, -107, -26, -112, -138, -36, 75, -9, 59, -37, -72, 129, 67, -15, -41, -18, -21, 56, -32, 51, 11, 11, -35, -13, -9, -2, -18, -22, 52, -47, -12, 26, -47, 33, -23, -32, 22, -20, -9, 12, -31, 9, 5, -10, 15, -22, -37, 42, -38, 1, 52, 4, 45, -5, 10, 28, 13, 3, -7, 5, 10, 9, -31, 52, -26, 15, 36, -18, 22, 7, -8, 19, 21, -39, 38, 8, -39, 3, -15, -6, 41, -13, 28, -4, 26, 21, -31, 33, 64, 42, 65, 79, 59, 25, 28, 22, -20, -44, 3, 34, 6, -8, -13, -6, 29, 8, 21, -2, -29, -12, 16, -36, 35, 24, 14, 42, -27, 19, -11, -30, 6, 9, 13, 30, 7, -11, -27, -51, 29, 55, -19, 12, 42, 56, -1, -19, 54, 33, 17, 27, -47, 14, 14, -14, -14, -32, -16, -10, -41, -28, 2, 0, 1, -45, -42, -28, -34, 21, 62, -99, -29, 67, -31, 45, 38, 24, 18, -11, 61, 27, -11, -84, 43, -52, 159]
3911A59j93O5o9J42q9Q8j25Q8K7j36K40k47p6O8J13l21J37k14K56L9K7J84j91
3934b8lM86o71M49O4k48N6j35N4j45K68n9m9l4l6J06j33L3M0k5k2m9J03k9l7K6
3960a8L2j8k2J3k4O2j03N1j5OP6j23Q0j4k2N2ok3J9K4m9N0o9L7OjqK9j3%%K1J
3993C1o6pK4PK0l1j3P2n4L1k3k7O2n8J9K5J3j00Q6k0n9P8MN5j15N8l8rN5j4j7
4024a1N3n1l6M4K1j1L0n8L2L4q2L3L0n8Q1o2k9J8jO2m2l6OK2L1qm5M4n1J0l8L8
4056c0rJ9J1QrJ4J9k2M6m1lj7K7k2mP3l8J9p2PL2j9K8o9L6m3q4J43P0k61Q0K35
4088A24j23j8J1K1j9j0q8K3O3N2j6l6j3K3J1K8j9n3O7m9O0k2j2j1qM2m8J8oM7
4118C9q4N9m5K6L1m6p8N3j9P3j3K2kp9K2l0O8P8j41j5J38o6j3q7J08lqJ19j25
$$ y = [159, -34, 31, -38, 104, 15, 103, -22, 66, 93, -43, 197, -50, -126, -58, 55, -266, -129, -343, -87, -48, -21, 163, -28, -31, 455, -216, 233, 297, 49, 105, -30, 24, -121, 147, 88, 39, 5, -31, 75, -58, -25, 15, -10, -32, -81, 22, -7, -44, -18, 14, -4, -26, -13, -37, 25, -78, -27, -42, -36, 40, -83, -3, -17, -39, 13, 7, -16, 3, 27, -22, 28, -41, -4, 2, 1, -7, 22, 9, 9, 9, 30, 31, -35, -42, -18, -11, 9, -22, -35, 37, -17, 14, -9, -36, 26, -32, -13, 12, 25, -75, 11, -9, -68, 10, 14, 69, -46, 12, -26, -35, 20, 6, -11, 42, -9, -45, -1, 20, 9, 39, -19, 13, 47, -35, -2, 28, -30, 51, -11, -40, -22, -23, 39, -3, -39, -33, -11, 20, 12, -33, 11, -40, -30, -68, -30, -39, -20, -9, -1, -10, 4, 23, 1, 47, 6, 3, -14, 13, -9, -13, 60, 22, 41, -31, -24, 8, -11, 17, -52, -16, -59, -143, 0, 70, -191, -111, 124, 1, -17, -6, 15, -4, -14, -102, -79, -16, 36, 20, -16, -29, -6, 5, 33, 14, -39, 28, -21, 39, 17, 5, -6, -14, 28, -20, -2, -8, 39, -45, 14, -31, -5, 26, -20, -98, -45, -64, 9, -4, 18, 16, -63, -41, -71, -3, 75, -66, -81, 57, -9, -22, -109, -1, -4, -12, 107, -18]
4147a8J7J14L4j30p6M7J04j55j48K04K06k79J76k0o5m7J33k3j2o4m8M4J94j9o8
4172A01p4q3J19k41K60R0o0q2l29J35k69K75L08K64m54p1J91J12M42p31Q0K9j9
4195gm8L28j54L2l17m8J33K18k64J69Ok77L27n1k79K26j31L0J35j35J32K7L8Q8
4219A78k35Q6Q7J1j68R7l2j9o4l5K22N2n1j32Q1P9j15j36K44j50P1JJ33k13J01
4244I3j56R1k6n5l8k4J66j39J00q1J44j36Q5K3K6n5j4M8j14j99L65j56J48l8r6
4269c8O8J27K9l89J98j32K16l3m33K96J64l54K10J63n0j68J76J01m06M61m81K42
4291c3l8k16N08l94J06R8jK08l36J07K17n65J72K80l75J95M2N2J41j28j31K0p8
4314a49K8R8j79L76l55J3J01J94q9j30p2J05Q2k68K82j25J86l43J71p3J9o0L78
$$ y = [-18, -1, 113, 147, 17, -59, -12, 92, -63, -211, -7, 199, -80, 96, 76, 11, -36, 97, 74, 62, -2, -50, -6, 188, 169, 101, 27, -56, 63, -178, 82, 172, 112, 30, -299, -164, -433, -158, 150, 414, -40, -111, 80, 192, 634, -97, -17, 12, -7, -55, 273, 119, 151, -166, -214, -81, 137, -127, 42, 48, -229, 98, 47, -232, -6, -137, -107, 28, -107, 25, 52, 90, 178, -57, 29, 116, 127, -41, 56, 24, 5, -59, -94, 128, 180, 129, -3, 78, 157, 42, -94, 150, 0, 71, 72, 205, -8, 93, -63, 28, 2, -53, -91, -115, 51, -88, 12, -69, 75, -61, 24, 47, 73, 18, 4, 52, -62, -261, 104, -52, 96, 58, -38, 30, 157, 186, -203, -5, -137, 79, 46, -387, -91, 73, -281, -71, 92, 42, -126, 50, 151, -255, 206, -275, -33, -71, -287, 221, -173, -67, 31, 30, 238, -98, 9, 226, -339, -167, 113, -262, -67, -25, 27, 168, 40, -91, -71, -149, -121, -23, -202, 174, -181, -168, -67, 127, 38, -92, -164, -59, 23, -245, 37, -88, 98, -245, -74, -147, -128, -188, 190]
4337A90J59j90p1j10M8O4P7O9k32k04L19j50q2M11j72o8P9j82K90m40L96l48Q5
4360f2j4j96J06J52k0o4J33j68J23l5k9J26J40j81n3Q5M3l0m5%L1j9m8J1k9J8
4386b5O9l9Pj5j3P6n9j0K0RlLJ3j6m%n3L7lj2j4L4j3L0m2j8N7k6J9l4lM4Qlk5
4421dk0M8J3J0k6J9o4K1L5n1O6o4K6OrL9j0pm7K5l2jN8k3k2j5J7n0J3O2k5J4%
4454BL3k1k4J9m7M2j4O3Ql3l8l1P4L0o8L6l6mjj8N3j9nL6l6J3M1r1R6r6K8O8o1
4487aQ4j40JK8l3J32j58K47k05N7q2j21K44j00K27k26j19K55j54o9K99r6O9j48
4511iL9K0Mj11M7j8P5o4lM8k6O8j07l7P3K6j7jN3q3J8K2J09j38j23J72J88k00
$$ y = [190, 349, 159, 88, -22, 26, 90, 167, 236, 4, -200, 119, -31, -113, 298, 126, 58, 137, -45, 245, -195, 201, -147, -62, -76, -272, -166, -14, -34, -98, 35, -133, -10, -45, -74, 52, 192, 11, -42, 43, 86, 56, 11, 11, 42, 23, -25, -14, -43, -25, 44, 5, 12, -3, -16, 60, 1, -9, 11, 20, 17, 20, 33, 17, 13, 13, -40, -3, -6, -18, -32, 2, -11, 19, -23, -41, 16, -10, 9, -25, -28, 16, 24, 21, -4, -24, 24, 37, 47, 21, 40, -24, -3, 32, -19, 47, -17, 9, 15, 6, 45, 35, 28, -19, 6, -26, -27, 31, 8, -14, -29, -12, -62, -49, 13, -12, 2, 2, 35, 14, -10, 9, -38, 4, -10, 53, 61, 28, -10, -41, 33, 63, -5, 31, -5, -9, -10, -28, 25, 6, 1, 37, 1, 14, 55, -36, 60, -36, -8, 60, -1, 83, -57, -56, -28, -61, 71, -87, 160, -45, 12, -70, -191, 53, -47, 180, -46, -165, 90, -64, -133, 166, 70, 139, -9, 30, 50, 54, -57, -10, -28, 47, -17, -20, 28, 2, 70, -37, -74, -1, 25, 8, 7, 60, -23, -5, 17, 126, -12, -135, 37, 225, 25]
$$ [...]
8191A4
##END NTUPLES=NMR FID
##END=
