##TITLE=1H_ABDP2209
 CDCl3, 8 sc, 
 23.9.2020
##JCAMPDX= 6.0         $$ Bruker NMR JCAMP-DX V2.0
##DATA TYPE= NMR FID
##DATA CLASS= NTUPLES
##ORIGIN= UXNMR, Bruker Analytische Messtechnik GmbH
##OWNER= root
$$ XWIN-NMR		Version 3.5
$$ Wed Sep 23 08:39:23 2020 Russian Standard Time (UT+4h)  she@DPX200
##.OBSERVE FREQUENCY= 200.1315066352
##.OBSERVE NUCLEUS= ^1H
##.DELAY= (6, 6)
##.ACQUISITION MODE= SIMULTANEOUS
##.ACQUISITION SCHEME= undefined
##.AVERAGES= 8
##.DIGITISER RES= 18
##SPECTROMETER/DATA SYSTEM= spect
##.PULSE SEQUENCE= zg30
##.SOLVENT NAME= CDCl3
##.SHIFT REFERENCE= (INTERNAL, CDCl3, 0, 15.7039)
##AUDIT TRAIL= $$ (NUMBER, WHEN, WHO, WHERE, WHAT)
$$ ##TITLE= Audit trail, XWIN-NMR		Version 3.5
$$ ##JCAMPDX= 5.01
$$ ##ORIGIN= Bruker BioSpin GmbH
$$ ##OWNER= she
$$ F:/spectra/data/she/nmr/H-F/1/audita.txt
$$ ##AUDIT TRAIL=  $$ (NUMBER, WHEN, WHO, WHERE, WHAT)
(   1,<2020-09-23 08:38:03.20 +0400>,<she>,<DPX200>,
      <created by zg, POWCHK disabled, PULCHK disabled
       configuration hash MD5:
       00 E9 B6 7A A2 85 ED C7 34 08 36 98 17 FE 4E 26
       data hash MD5: 16K
       D6 2B 9F 03 FA EF DA 35 86 36 E4 55 B1 4C 77 98>)
$$ ##END=
$$ 
$$ hash MD5
$$ BB 3B 10 D3 E1 A5 B5 02 21 8F 97 8D 55 47 06 3F
##$RELAX= 
##$RELAX= 
##$RELAX= 
##$RELAX= 
##$RELAX= 
##$RELAX= 
$$ Bruker specific parameters
$$ --------------------------
##$DU= <F:/spectra>
##$EXPNO= 1
##$NAME= <H-F>
##$PROCNO= 1
##$TYPE= <nmr>
##$USER= <she>
##$AMP= (0..31)
100 100 100 100 100 100 100 100 100 100 100 100 100 100 100 100 100 100 
100 100 100 100 100 100 100 100 100 100 100 100 100 100 
##$AQSEQ= 0
##$AQ_mod= 1
##$AUNM= <au_zg>
##$AUTOPOS= <>
##$BF1= 200.13
##$BF2= 200.13
##$BF3= 200.13
##$BF4= 200.13
##$BF5= 200.13
##$BF6= 200.13
##$BF7= 200.13
##$BF8= 200.13
##$BYTORDA= 1
##$CFDGTYP= 0
##$CFRGTYP= 5
##$CHEMSTR= <none>
##$CNST= (0..31)
1 1 145 1 1 1 1 1 1 1 1 1 1 1 1 1 1 1 1 1 1 1 1 1 1 1 1 1 1 1 1 1 
##$CPDPRG= <>
##$CPDPRG1= <>
##$CPDPRG2= <>
##$CPDPRG3= <>
##$CPDPRG4= <mlev>
##$CPDPRG5= <mlev>
##$CPDPRG6= <mlev>
##$CPDPRG7= <mlev>
##$CPDPRG8= <mlev>
##$CPDPRGB= <>
##$CPDPRGT= <>
##$D= (0..31)
0 1.2 0 0 0 0 0 0 0 0.06 0 0.03 0 0 0 0 0.0002 0 0 0 0 0 0 0 0 0 0 0 0 
0 0 0 
##$DATE= 1600835882
##$DBL= (0..7)
120 120 120 120 120 120 120 120 
##$DBP= (0..7)
150 150 150 150 150 150 150 150 
##$DBP07= 0
##$DBPNAM0= <>
##$DBPNAM1= <>
##$DBPNAM2= <>
##$DBPNAM3= <>
##$DBPNAM4= <>
##$DBPNAM5= <>
##$DBPNAM6= <>
##$DBPNAM7= <>
##$DBPOAL= (0..7)
0.5 0.5 0.5 0.5 0.5 0.5 0.5 0.5 
##$DBPOFFS= (0..7)
0 0 0 0 0 0 0 0 
##$DE= 6
##$DECBNUC= <off>
##$DECIM= 32
##$DECNUC= <off>
##$DECSTAT= 4
##$DIGMOD= 1
##$DIGTYP= 9
##$DL= (0..7)
0 120 120 120 120 120 120 120 
##$DP= (0..7)
150 150 150 150 150 150 150 150 
##$DP07= 0
##$DPNAME0= <>
##$DPNAME1= <>
##$DPNAME2= <>
##$DPNAME3= <>
##$DPNAME4= <>
##$DPNAME5= <>
##$DPNAME6= <>
##$DPNAME7= <>
##$DPOAL= (0..7)
0.5 0.5 0.5 0.5 0.5 0.5 0.5 0.5 
##$DPOFFS= (0..7)
0 0 0 0 0 0 0 0 
##$DQDMODE= 0
##$DR= 18
##$DS= 0
##$DSLIST= <SSSSSSSSSSSSSSS>
$$ [...]
##$SUBNAM2= <"">
##$SUBNAM3= <"">
##$SUBNAM4= <"">
##$SUBNAM5= <"">
##$SUBNAM6= <"">
##$SUBNAM7= <"">
##$SUBNAM8= <"">
##$SUBNAM9= <"">
##$SW= 16.880792210976
##$SWIBOX= (0..15)
0 0 2 0 0 0 0 0 0 0 0 0 0 0 0 0 
##$SW_h= 3378.37837837838
##$TD= 16384
##$TD0= 1
##$TE= 0
##$TE2= 300
##$TE3= 300
##$TEG= 300
##$TL= (0..7)
0 120 120 120 120 120 120 120 
##$TP= (0..7)
150 150 150 150 150 150 150 150 
##$TP07= 0
##$TPNAME0= <>
##$TPNAME1= <>
##$TPNAME2= <>
##$TPNAME3= <>
##$TPNAME4= <>
##$TPNAME5= <>
##$TPNAME6= <>
##$TPNAME7= <>
##$TPOAL= (0..7)
0.5 0.5 0.5 0.5 0.5 0.5 0.5 0.5 
##$TPOFFS= (0..7)
0 0 0 0 0 0 0 0 
##$TUNHIN= 0
##$TUNHOUT= 0
##$TUNXOUT= 0
##$USERA1= <user>
##$USERA2= <user>
##$USERA3= <user>
##$USERA4= <user>
##$USERA5= <user>
##$V9= 5
##$VALIST= <valist>
##$VCLIST= <CCCCCCCCCCCCCCC>
##$VD= 0
##$VDLIST= <DDDDDDDDDDDDDDD>
##$VPLIST= <PPPPPPPPPPPPPPP>
##$VTLIST= <TTTTTTTTTTTTTTT>
##$WBST= 1024
##$WBSW= 4
##$XGAIN= (0..3)
0 0 0 0 
##$XL= 0
##$YL= 0
##$YMAX_a= 171947
##$YMIN_a= -176897
##$ZGOPTNS= <>
##$ZL1= 120
##$ZL2= 120
##$ZL3= 120
##$ZL4= 120
##$ABSF1= 10
##$ABSF2= 0
##$ABSG= 5
##$ABSL= 3
##$ALPHA= 0
##$AQORDER= 0
##$ASSFAC= 0
##$ASSFACI= 0
##$ASSFACX= 0
##$ASSWID= 0
##$AUNMP= <proc_1d>
##$AZFE= 0.1
##$AZFW= 0.1
##$BCFW= 1
##$BC_mod= 2
##$BYTORDP= 1
##$COROFFS= 0
##$CY= 11.3945322036743
##$DATMOD= 1
##$DC= 2
##$DFILT= <>
##$DTYPP= 0
##$F1P= 16.9975609425685
##$F2P= -3.02152046262296
##$FCOR= 0.5
##$FTSIZE= 0
##$FT_mod= 4
##$GAMMA= 1
##$GB= 0.15
##$INTBC= 1
##$INTSCL= 1
##$ISEN= 128
##$LB= 0.24
##$LEV0= 0
##$LPBIN= 0
##$MAXI= 10000
##$MC2= 0
##$MEAN= 0
##$ME_mod= 0
##$MI= 1.114404
##$NCOEF= 0
##$NC_proc= 0
##$NLEV= 6
##$NOISF1= 3.799351
##$NOISF2= 2.8
##$NSP= 1
##$NTH_PI= 0
##$NZP= 0
##$OFFSET= 15.70392
##$PC= 1
##$PHC0= -9968.852
##$PHC1= 10.4009
##$PH_mod= 1
##$PKNL= yes
##$PPARMOD= 0
##$PSCAL= 0
##$PSIGN= 0
##$REVERSE= no
##$SF= 200.130013532006
##$SI= 16384
##$SIGF1= 3
##$SIGF2= 2
##$SINO= 400
##$SIOLD= 16384
##$SREGLST= <1H.CDCl3>
##$SSB= 0
##$STSI= 0
##$STSR= 0
##$SW_p= 3612.71676300578
##$SYMM= 0
##$S_DEV= 0
##$TDeff= 0
##$TDoff= 0
##$TI= <>
##$TILT= no
##$TM1= 0
##$TM2= 0
##$TOPLEV= 0
##$USERP1= <user>
##$USERP2= <user>
##$USERP3= <user>
##$USERP4= <user>
##$USERP5= <user>
##$WDW= 1
##$XDIM= 8192
##$YMAX_p= 0
##$YMIN_p= 0
$$ End of Bruker specific parameters
$$ ---------------------------------
##NTUPLES= NMR FID
##VAR_NAME=  TIME,          FID/REAL,        FID/IMAG
##SYMBOL=    X,             R,               I
##VAR_TYPE=  INDEPENDENT,   DEPENDENT,       DEPENDENT
##VAR_FORM=  AFFN,          ASDF,            ASDF
##VAR_DIM=   8192,          8192,            8192
##UNITS=     SECONDS,       ARBITRARY UNITS, ARBITRARY UNITS
##FACTOR=    0.000296,      1,               1
##FIRST=     0,             0,               0
##LAST=      2.424536,      0,               0
##MIN=       0,             -176897,         0
##MAX=       2.424536,      171947,          0
$$ Real data points
##PAGE= N=1
##DATA TABLE= (X++(R..R)), XYDATA
$$ [...]
$$ plain form
1878 519 -413 448 408 -546 865 -152 -146 882 -690 429 239 -362 933 34 -503 1223 -161 -131 777
1897 777 -961 794 340 -837 718 -193 -496 581 -423 -94 470 -1044 512 -147 -658 685 -410
1914 -410 8 137 -406 245 33 -561 354 -425 -359 506 -728 398 89 -452 459 -440 -327 564 -491
1933 -491 45 551 -815 594 35 -619 821 -247 57 705 -685 359 554 -876 1280 -150 -307
1950 -307 1080 -236 23 505 -801 485 430 -156 904 -235 -78 883 -977 190 545 -567 275
1967 275 -32 -279 724 -438 -111 549 -750 422 -106 -584 892 -601 -52 329 -770 329 120
1984 120 -573 402 -362 -551 781 -857 -182 648 -1094 196 -29 -965 654 -221 -574 635 -635 20
2002 20 254 -729 319 -117 -397 538 -290 -127 375 -705 313 211 -786 653 -313 -10 729 -268 287
$$ packed form
1878E19r32Q61m0r54J411j017OJ028j572J119j90o01J295q99n37J726j384L0R08
1897G77j738J755m54j177J555r11l03J077j004L29N64j514J556o59n11J343j095
1914d10M18J29n43O51k12n94R15p79O6Q65j234J126l09n41R11q99J13Q91j055
1933d91N36N06j366J409n59o54J440j068L04O48j390J044J95j430K156j430j57
1950c07J387j316K59M82j306J286n5n86J060j139J57R61j860J167L55j112Q42
1967B75l07k47J003j162L27O60j299J172n28m78J476j493N49L81j099J099k09
1984A20o93R75p64j89J332j638O75Q30j742J290k25r36J619q75l53J209j270O55
2002B0K34r83J048m36k80R35q28J63N02j080J018j02r97J439r66L03P39r97N55
$$ plain form
2021 287 188 -313 468 43 -157 752 -643 355 565 -598 682 62 -195 785 -436 142 661 -636 311
2040 311 556 -721 609 -268 -434 808 -768 -71 628 -409 15 324 -586 374 -441 -444 632 -430
2058 -430 276 61 -443 197 -69 -472 288 -613 76 469 -448 496 -213 -605 607 -434 -18 243 -401
2077 -401 339 245 -606 496 -272 -236 352 -490 167 213 -497 434 -3 -348 606 -506 -208 751 -710 333
2097 333 20 -589 674 -122 -360 500 -191 -108 552 -491 285 166 -399 411 -307 -45 392 -542 172 206
2117 206 -6 464 -125 75 530 -682 265 136 -626 582 -5 -136 378 -323 -140 199 -883 174 -179
2136 -179 -680 304 -483 -332 537 -590 15 419 -887 24 69 -725 478 -428 -229 155 -389 -57 28 -76
2156 -76 345 -129 -250 293 -253 318 296 -342 513 23 -165 370 -174 -79 329 -304 402 273 -263 624 -247
$$ packed form
2021B87r9n01P81m25k00R09j395R98K10j163J280o20k57R80j221N78N19j297R47
2040C11K45j277J330q77j66J242j576O97O99j037M24L09r10R60q15lJ076j062
2058d30P06k15n04O40k66m03P60r01O89L93r17R44p09l92J212j041M16K61o44
2077d01P40r4q51J102p68L6N88q42O57M6p10R31m37l45R54j112K98R59j461J043
2097C33l13o09J263p96k38Q60o91Q3O60j043P76j19n65Q10p18K62M37r34P14L4
2117B06k12M70n89K00M55j212R47j29p62J208n87j31N14p01J83L39j082J057l53
2136a79n01R84p87J51Q69j127O05M04j306R11M5p94J203r06J99L84n44L32Q5j04
2156g6M21m74j21N43n46N71k2o38Q55m90j88N35n44R5M08o33P06j29n36Q87q71
$$ plain form
2177 -247 66 614 -387 375 172 -411 460 -95 -467 591 -529 148 727 -708 407 -107 -512 227
2195 227 -40 -470 377 -566 342 411 -626 4 -374 -382 356 -446 -219 150 -160 -142 -58 -641 284 -151 -335
2216 -335 277 -370 220 -11 -533 483 -79 -481 312 -506 -51 422 -760 590 3 -312 503 -426 -114
2235 -114 333 -423 -83 529 -592 645 -11 -138 537 -366 71 601 -483 342 250 -423 299 68 -250
2254 -250 319 -336 532 313 -148 245 23 54 413 -172 138 347 -245 554 -260 -318 479 -388 30 404 -415
2275 -415 261 281 -538 513 -26 -412 313 -624 -4 -1 -330 367 -255 -451 240 -145 -355 527 -536 50
2295 50 59 -604 200 31 -284 59 -135 2 332 -469 363 -309 -195 116 -317 185 90 -220 200 160 -309 424
2317 424 91 6 520 -408 226 252 -194 361 -9 -42 357 153 14 327 -248 140 165 -402 611 -72 -214
$$ packed form
2177b47L13N48j001P62k03n83Q71n55l72J058j120O77N79j435J115n14m05P39
2195B27k67m30Q47r43R08O9j037O30l78qP38q02K27L69l10J8Q4n83R25m35j84
2216c35O12o47N90k31n22J016n62m02P93q18M55M73j182J350n87l15Q15r29L12
2235a14M47p56L40O12j121J237o56j27O75r03M37N30j084Q25r2o73P22k31l18
2254b50N69o55Q68k19m61L93k22L1L59n85L10K09n92P99q14n8P97q67M18L74q19
2275d15O76K0q19J051n39l86P25r37O20Ll29O97o22j96O91l85k10Q82j063N86
2295E0Ro63Q04j69l15L43j94J37L30q01Q32o72J14L11m33N02r5l10M20m0m69P33
2317D24l33q5N14r28O34K6m46N55l70l3L99k04j39L13n75L88K5n67J013o83j42
$$ plain form
2338 -214 434 -263 75 233 -452 305 124 -342 269 -303 -130 304 -124 387 -173 -329 480 -232 -627 492
2358 492 -127 61 -111 -85 63 -280 -532 80 -143 -192 308 -596 206 103 -299 490 -631 -132 208 -506
2378 -506 -6 41 -40 267 161 -244 628 -253 -56 387 -287 357 228 -350 165 46 -83 526 -84 -71 366
2399 366 -334 464 160 97 313 220 -51 35 -185 39 299 -42 362 -285 103 246 -494 295 278 -323 128
2420 128 -199 -275 212 -297 -45 326 -414 67 184 -413 325 -247 -114 244 -41 -186 400 -530 82 203
2440 203 -303 433 -167 -111 146 -117 -244 237 -625 74 -123 -201 549 -386 112 362 -58 292 -56 44 130
2461 130 -180 63 221 -341 279 150 -164 214 -41 -123 438 -181 270 333 -158 377 184 -196 408 -403 268
2482 268 247 -382 228 242 -126 172 -72 -171 297 -22 124 321 -227 129 -159 -194 291 -71 29 -44 -337 -5
$$ packed form
2338b14O48o97L38J58o85P57j81m66O11n72J73M34m28N11n60j56Q09p12l95J119
2358D92o19J88j72K6J48l43k52O12k23m9N00r04Q02j03m02P89j121M99L40p14
2378e06N00M7q1L07j06m05Q72q81J97M43o74O44j29n78N15j19j29O09o10J3M37
2399C66p00P98l04o3K16r3k71Q6k20K24K60l41M04o47L88J43p40P89j7o01M51
2420A28l27p6M87n09K52L71p40M81J17n97P38n72J33L58k85j45N86r30O12J21
2440B03n06P36o00N6K57k63j27M81q62O99j97p8P50r35M98K50m20L50l48J00Q6
2461A30l10K43J58n62O20j29l14L78k55q2N61o19M51O3m91N35j93l80O04q11O71
2482B68k1o29O10J4l68K98k44r9M68l19J46J97n48L56k88l5M85l62J00p3k93L32
$$ plain form
2504 -5 -84 -339 135 -269 -72 -248 -278 -120 76 -232 -81 -49 -91 220 -353 119 165 -336 105 -53 -361 152
2526 152 -23 -244 102 -150 156 205 -536 301 44 -179 290 -194 125 279 148 246 104 -93 457 -46 -23
2547 -23 -41 -193 -90 368 -114 114 -14 -19 287 -113 267 175 -220 134 -17 -87 313 -245 -5 154 -229 0
2569 0 107 -571 247 -152 -378 280 -512 18 -22 -355 -91 49 -185 311 -526 -110 34 -190 -88 125 -272
2590 -272 209 -130 -162 287 -307 -176 198 -372 95 -100 -31 -24 -42 117 291 230 200 129 -81 189 -63 212 -52
2613 -52 -377 -89 165 -293 305 -24 -152 486 26 -130 478 -352 272 115 38 16 -125 -251 402 -171 173
2634 173 82 -368 27 88 -254 164 -186 130 73 -63 33 91 -142 218 -212 29 206 -342 117 81 17 45 -86
2657 -86 72 -172 -88 2 -28 -200 -71 134 -464 486 50 -130 19 -245 42 -16 -304 -21 208 -95 377 -171
$$ packed form
2504ep9k55M74m04J97j76l0J58J96l08J51L2m2L11n73M72M6n01M41j58l08N13
2526A52j75k21L46k52L06M9p41Q37k57k23M69m84L19J54j31R8j42j97N50n03K3
2547b3j8j52J03M58m82K28j28nL06m00L80r2l95L54j51p0M00n58K40J59l83K29
2569@J07o78Q18l99k26O58p92N30m0l33K64J40k34M96q37M16J44k24J02K13l97
2590b72M81l39l2M49n94J31L74n70M67j95O9Pj8J59J74o1l0p1k10K70k52K75k64
2613e2l25K88K54m58N98l29j28O38m60j56O08q30O24j57p7k2j41j26O53n73L44
2634A73r1m50L95O1l42M18l50L16n7j36R6N8k33L60m30K41J77n48M59l6o4K8j31
2657h6J58k44Q4R0l0j72J29K05n98R50m36j80J49k64K87n8k88K83K29l03M72n48
$$ plain form
2679 -171 11 178 -245 78 -18 8 128 222 94 245 -330 131 43 70 234 -165 47 390 -42 248 327 -198
2701 -198 209 -28 83 529 -65 51 80 -301 311 36 -293 169 -80 -86 299 -198 -55 157 -150 104 -55
2722 -55 -223 146 -191 15 156 -469 -113 135 -284 186 0 -45 -43 -259 -285 -16 -116 135 97 -298 51 -231
2744 -231 -390 105 -228 197 -97 -5 228 -428 -247 256 -201 -77 73 -343 150 -130 1 229 -51 55
2764 55 -39 -158 32 297 84 197 33 95 291 -79 -20 180 90 18 47 37 78 -91 90 194 -273 33 24 -43
2788 -43 106 -258 -125 20 -18 104 138 -93 290 -122 -196 139 -218 141 -276 -273 96 -78 -196 264 -221 20
2810 20 92 -60 -83 -135 -111 -74 234 -233 130 -93 233 116 -260 265 -174 -228 147 114 23 129 -214 -63 -82
2833 -82 -134 74 49 -81 -32 -175 19 42 18 29 -23 -173 148 -120 76 140 -363 99 202 -77 122 -5 193
$$ packed form
2679a71J82J67m23L23r6K6J20R4j28J51n75M61q8K7J64l99K12L43m32K90P9n25
2701a98M07k37J11M46n94J16K9l81O12k75l29M62k49oL85m97J43K12l07K54j59
2722e5j68L69l37K06J41o25L56K48m19M70j86m5Kk16k6K69j00K51l8l95L49k82
2744b31j59M95l33M25k94R2K33o56J81N03m57J24J50m16M93k80J31K28k80J06
2764E5r4j19J90K65k13J13j64O2J96l70N9K00r0p2K9j0M1j69J81J04m67L06ro7
2788d3J49l64J33J45l8J22L4k31L83m12p4L35l57L59m17LL69j74j18M60m85K41
2810B0P2j52k3n2K4L7L08m67L63k23L26j17l76N25m39n4L75l3r1J06l43J51j9
2833h2n2K08k5j30M9j43J94K3k4J1n2j50L21k68J96O4n03M62J03k79J99j27J98
$$ plain form
2856 193 178 -89 84 169 -213 -10 52 -325 334 -226 -210 128 -217 -39 9 -63 1 189 -298 376 -250 -304 159
2879 159 -312 140 -89 10 283 -116 -164 -9 -252 -75 -118 -116 130 -260 -291 134 -325 84 236 -234 181 -59
2901 -59 -179 216 -315 183 294 -136 67 -208 -67 125 207 36 173 -138 -79 327 60 -12 183 56 171
2922 171 105 181 118 189 -88 121 9 216 -113 75 160 -264 114 -56 -139 153 -99 42 107 -184 -48 212
2944 212 -206 108 17 -333 179 -112 -151 1 -101 -157 48 -341 -114 -144 -100 119 33 -105 139 -163 -138 -117 -321
2967 -321 199 71 -26 178 -287 71 -100 -285 189 59 -160 9 163 217 245 374 279 -11 -74 27 -181 -171
2989 -171 120 67 -127 1 -12 344 165 -304 -25 -193 341 109 -85 160 118 -111 129 23 -331 359 -263
3010 -263 -72 98 -159 143 -99 -19 -51 66 -3 359 -498 -82 12 -268 82 -173 -37 141 -88 -106 -5 -337
$$ packed form
2856A93j5k67J73Q5l82K03O2l77O59n60J6L38l45J78M8p2O4J88m87O74o26n4M63
2879A59m71M52k29R9K73l99m8J55k43J77m3KK46l90l1M25m59M09J52m70M15k40
2901e9j20L95n31M98J11m30K03k75J41J92Q2j71J37l11N9M06k67p2J95j27J15
2922A71o6P6o3P1k77K09j12K07l29J88Q5m24L78j70q3K92k52J41O5k91J36K60
2944B12m18L14r1l50N12k91l9J52j02n6K05l89K27l0M4K19q6j38K44l02K5K1k04
2967c21N20j28r7K04m65L58j71j85M74j30k19J69J54N4K8J29r5k90o3J01k08J0
2989a71K91n3j94J28j3L56j79m69K79j68N34k32j94K45m2k29K40j06l54O90o22
3010b63J91J70k57L02k42Q0l2J17o9L62q57M16R4k80L50k55J36J78k29j8J01l32
$$ plain form
3032 -337 21 -171 -206 -43 -253 -203 97 -387 -49 14 -74 143 70 -252 86 -225 239 -52 -154 236 -244 -41
3054 -41 308 107 248 374 -35 -144 266 -60 205 107 -57 157 46 121 104 157 -54 416 -67 211 -117 -35
3076 -35 166 -77 -121 129 -110 207 158 98 82 -138 138 165 -214 76 -170 -253 100 -303 -125 121 -32 -51 65
3099 65 -5 14 -232 -7 78 -101 67 -58 -86 102 -150 -226 55 -122 -81 -91 -251 288 6 -30 -13 -123 151
3122 151 -91 60 -36 110 -45 151 -159 214 160 -230 -32 73 -86 48 18 10 71 89 38 252 -114 152 67
3145 67 -17 263 -63 -95 254 -265 -55 104 -342 103 -124 -328 -44 -172 -80 90 -16 61 -167 -262 -17 177
3167 177 -138 10 139 -92 -156 -121 355 -155 183 55 -107 176 119 -119 81 2 -199 -34 -251 -160 -61 68
3189 68 184 40 -80 161 -111 224 207 -132 -159 94 -10 -154 27 -39 111 -201 -64 234 -136 97 27 -180
$$ packed form
3032c37L58j92l5J63k10N0L00m84L38O3q8K17p3l22L38l11M64k91j02L90m80K03
3054d1L49k01J41J26m09j09M10l26K65r8j64K14j11P5j7N3k11M70m83K78l28Q2
3076c5K01k43m4K50k39L17m9o0j6k20K76K7l79K90k46q3L53m03J78K46j53j9J16
3099F5p0J9k46K25Q5j79J68j25k8J88k52p6K81j77M1j0j60N39k82l6J7j10K74
3122A51k42J51r6J46j55J96l10L73n4l90J98J05j59J34l0qO1J8n1K14l66K66q5
3145F7q4K80l26l2L49n19K10J59m46M45k27k04K84j28R2J70j06P7k28r5K45J94
3167A77l15J48J29k31o4L5M76n10L38j28j62K83n7k38K00p9k01J65k17R1R9J29
3189F8J16j44j20K41k72L35j7l39k7K53j04j44J81o6J50l12J37K98l70K33p0k07
$$ plain form
3211 -180 -39 10 -313 174 118 25 -5 -36 29 118 132 63 13 39 61 99 -46 114 -95 44 128 -119 -139 -81 -160 41
3237 41 0 296 28 56 -61 101 -21 204 -26 -216 18 -170 -28 -165 -107 95 -14 54 59 -6 26 160 -308
3260 -308 -70 -127 350 141 -142 -31 174 135 -54 78 -183 29 -119 215 -28 -185 -34 111 122 145 -100
3281 -100 80 315 -110 44 217 -94 400 -211 69 47 101 -55 -42 -213 59 -56 -26 -29 -118 80 54 16 186
3304 186 304 64 106 -20 62 58 -108 -41 47 -151 22 -208 46 -131 -195 107 103 -213 89 35 -160 160 53
3327 53 -228 100 -163 -20 -11 -130 -87 -66 47 156 -39 -123 115 -167 102 41 -87 28 103 102 246 -95 -175 96
3351 96 -326 15 -32 -165 85 -32 208 106 -112 7 -28 -64 157 -79 -152 26 -250 106 234 140 117 -75
3373 -75 69 -2 33 -120 326 -68 166 24 -23 25 -40 -125 263 -60 225 98 -262 -165 -30 -163 -97 -152 24
$$ packed form
3211a80J41M9l23M87n6r3l0l1O5Q9J4o9n0K6K2L8j45J60k09J39Q4k47k0N8p9K01
3237D1m1K96k68K8j17J62j22K25k30j90K34j88J42j37N8K02j09O8No5L2J34m68
3260c08K38n7M77k09k83J11K05l9j89J32k61K12j48L34k43j57J51J45J1K3k45
3281a00J80K35m25J54J73l11M94o11K80k2N4j56J3j71K72j15L0lq9J98k6l8J70
3304A86J18k40M2j26Q2mj66O7Q8j98J73k30K54j77o4L02ml16L02n4j95L20j07
3327E3k81L28k63J43Rj19M3K1J13J09j95q4K38k82K69o1j28J15P5jJ44l41q0K71
3351I6m22L41m7j33K50j17K40j02k18J19l5l6K21k36p3J78k76L56J28r4k3j92
3373g5J44p1L5j53M46l94K34j42m7M8o5q5L88l23K85j27l60R7J35j33O6n5J76
$$ plain form
3396 24 30 89 0 -32 -87 3 -125 -6 86 -134 -55 -146 161 148 -159 -50 94 65 -2 -163 77 -14 247 -23 109
3421 109 64 169 80 -67 -93 287 172 132 75 -48 181 67 -70 276 -29 78 -69 -99 166 -10 -87 417
3443 417 -36 -298 62 -217 267 -68 14 147 53 -148 69 67 52 218 -312 78 5 151 41 -8 111 30 -152
3466 -152 64 84 -64 67 -21 -67 -215 -203 -50 -114 -25 320 -37 244 -24 202 158 307 -24 270 -246 -136
3488 -136 340 -122 17 -119 -57 -262 75 172 409 -61 -39 123 -177 50 -61 146 13 15 -193 -78 4 105
3510 105 -56 -3 98 -88 132 -32 2 -166 131 22 260 128 -84 -54 38 -73 407 129 11 346 44
3531 44 59 13 33 94 -129 -316 -59 -209 -183 -58 -102 115 57 32 -154 61 132 257 -245 -169 177 -227 -160 84
3555 84 -133 73 -64 -11 73 -228 -108 -128 -25 -63 -270 19 180 32 125 -124 -124 -107 -167 -147 -25 -36 344 31
$$ packed form
3396B4ON9q9l2n5R0j28J19R2k20P9r1L07j3l07J09J44k9o7j61K40r1K61k70J32
3421A09m5J05q9j47k6L80j15m0n7j23K29j14j37L46l05J07j47l0K65j76p7N04
3443D17m53k62L60k79M84l35Q2J33r4k01K17kj5J66n30L90p3J46j10m9J19q1j82
3466a52K16K0j48J31q8m6j48J2J53o4Q9L45l57K81k68K26m4J49l31K94n16J10
3488a36M76m62J39j36O2k05L37R7K37m70K2J62l00K27j11K07j33Kk08J15Q2J01
3510A05j61N3J01j86K20j64L4j68K97j09K38j32k12L0R2j11M80k78j18L35l02
3531D4J5m6K0O1k23j87K57j50K6J25m4K17n8k5j86K15P1J25n02P6L46m04O7K44
3555H4k17K06j37N3Q4l01J20k0J03l8k07K89J61j48R3k49%J7o0K0J22j1L80l13
$$ plain form
3579 31 -128 188 -24 -271 87 -136 -19 153 -18 -117 40 -82 -11 -35 152 139 -51 207 75 180 -103 166
3601 166 -51 48 -197 -30 136 -32 -231 -80 -40 -83 -198 -213 -37 -309 131 123 -14 1 -122 66 218 -149
3623 -149 -119 118 204 126 130 -251 -87 -136 -122 -66 -116 154 154 -7 151 -125 -118 254 -62 -37 64 68 -191 -126 161 -1
3649 -1 -148 40 106 175 122 -72 241 -12 -5 -28 81 -110 -35 11 -26 218 -41 96 52 69 149 -40 85 245 -107
3674 -107 -77 98 7 -13 96 69 -281 63 -200 -240 5 50 75 66 -49 -127 -134 -288 79 -169 32 -14 -238 -158 97
3699 97 49 -219 -104 82 199 371 -14 -40 -91 125 18 248 -138 -20 37 10 83 77 -189 9 -201 -84 258
3722 258 126 2 87 19 -74 98 -236 243 25 111 -68 120 -323 208 -120 68 210 -12 154 -180 -14
3743 -14 -219 -4 -111 198 140 -52 -19 63 -5 107 -5 60 -134 33 117 54 15 -96 151 -126 -128 51 77 -135
$$ packed form
3579C1j59L16k12k47L58k23J17J72j71r9J57j22P1k4J87j3j90K58j32J05k83K69
3601A66k17R9k45J67J66j68j99J51M0m3j15j5J76k72M40qj37J5j23J88J52l67
3623a49L0K37Q6p8Ml81J64m9J4N6n0K70%j61J58k76PL72l16K5J01Mk59O5K87j62
3649aj47J88O6O9n3j94L13k53Pk3J09j91P5M6l7K44k59J37m4J7Q0j89J25J60l52
3674a07L0J75r1k0J09k7l50L44k63m0K45M5K5rj15p8pj54L67k48K01m6k24Q0K55
3699I7m8k68J15J86J17J72l85k6n1K16j07K30l86J18N7k7P3ok66J98k10J17L42
3722B58j32j24Q5o8r3J72l34M79k18Q6j79J88m43N31l28J88J42k22J66l34J66
3743a4k05K15j07L09n8j92L3Q2o8J12j12O5j94J67Q4o3l9j11K47k77kJ79K6k12
$$ plain form
3767 -135 124 -98 -143 -202 51 -317 228 -158 -226 71 -73 18 -73 -81 142 -162 -161 -246 66 -14 -113 -129 72 50 -51
3792 -51 256 -81 -31 -156 -16 -14 5 52 -27 -28 73 188 -46 275 -25 76 28 -207 -88 60 195 328 39
3815 39 -137 268 -25 67 269 61 -197 100 -42 -146 188 16 -86 59 -268 154 49 -127 134 -40 111
3836 111 -134 42 -142 -184 257 -19 45 84 -112 -110 -76 -217 71 158 -35 -93 142 -77 -120 -152 -21 -7 -135 18
3860 18 -142 12 74 178 42 55 70 -10 211 -23 279 142 75 -57 170 -10 11 175 -121 17 67 78 -167
3883 -167 -38 159 137 169 -2 55 44 -154 79 158 25 -52 58 1 -162 -31 277 -138 95 -35 -185 125
3905 125 322 -36 -16 28 -96 -40 -1 -114 -154 54 -214 -198 -127 -5 -313 -75 -131 -226 221 -156 40 -93 253
3928 253 -40 -45 -99 123 9 -33 171 -31 22 -94 -152 -58 -271 -254 -14 115 -59 89 -29 44 -60 239 176
$$ packed form
3767a35K59k22m5n9K53l68N45l86o8K97j44R1r1qK23l04Jq5L12q0r9j6K01k2j01
3792e1L07l37N0j25J40KJ9M7p9jJ01J15k34L21l00J01m8k35J19J48J35J33k89
3815C9j76M05k93R2K02k08k58K97j42j04L34j72j02J45l27M22j05j76K61j74J51
3836A11k45J76j84m2M41k76O4L9j96KL4j41K88Q7j93n8K35k19m3l2J31J4j28J53
3860A8j60J54O2J04j36J3J5q0K21k34L02j37o7j32K27j80K1J64k96J38N0J1k45
3883a67J29J97k2L2j71N7j1j98K33P9j33p7J10n7j63J31L08m15K33j30j50L10
3905A25J97l58K0M4j24N6L9j13m0K08k68J6P1J22l08K38n6r5M47l77J96j33L46
3928B53k93nn4K22j14m2K04k02N3j16n8R4k13J7K40J29j74J48j18P3j04K99o3
$$ plain form
3951 176 134 262 53 351 102 150 85 -61 294 351 -21 13 125 58 -98 -84 90 58 -15 -2 39 182 -67 55
3975 55 -89 -59 -29 33 -18 118 -114 56 -14 -124 -170 23 225 -323 -100 -113 -240 -27 -251 105 48 -285 -73
3998 -73 -251 50 -82 -38 -285 135 -5 -145 2 -8 187 -24 -124 -104 -44 -291 82 16 151 73 119 87 46
4021 46 -41 0 -96 -71 -67 29 -146 -69 66 46 296 28 -30 -81 136 119 44 -38 -26 -71 355 389 2 -356 159 69
4047 69 53 6 -181 -115 -411 -79 209 -93 -53 107 21 -31 -85 99 -109 151 195 -110 58 29 163 -154 -27
4070 -27 -170 -86 41 49 -76 -59 -179 -117 -122 -150 -5 -148 129 -27 303 -221 -107 268 -191 -64 -105 191 -107
4093 -107 138 -126 46 -159 -20 112 125 217 21 -149 111 -195 -82 41 -6 188 129 -199 181 176 -98 -59
4115 -59 4 3 148 -83 -70 166 -106 243 115 -11 -175 -201 233 -175 89 -2 69 -21 -85 37 -10 72 -214 7
$$ packed form
3951A76m2J28k09K98k49M8o5j46L55N7l72L4J12o7j56J4J74l2p3J3M1J43k49J22
3975E5j44L0L0O2n1J36k32J70p0j10m6J93K02n48K23j3j27K13k24L56n7l33K12
3998g3j78L01j32M4k47M20j40j40J47j0J95k11j00K0O0k47L73o6J35p8M6l2m1
4021D6q7M1r6K5MR6j75P7J35k0K50k68n8n1K17j7p5q2J2m5M26L4l87l58N15r0
4047F9j6m7j87O6k96L32K88l02M0J60q6n2n4J84k08K60M4l05J68k9J34l17J27
4070b7j43Q4J27Qj25J7j20O2nk8J45j43K77j56L30n24J14L75m59J27m1K96k98
4093a07K45k64J72k05J39J32J3R2j96j70K60l06J13J23m7J94n9l28L80nk74L9
4115e9O3jJ45k31J3K36k72L49j28j26j64k6M34m08K64r1P1r0o4J22m7Q2k86K21
$$ plain form
4139 7 -56 -137 -104 -50 -286 74 56 245 127 -214 -31 28 17 -71 63 -74 129 -94 6 69 62 -95 40 18 190
4164 190 -30 56 97 11 -60 169 56 -18 65 96 -34 49 13 -33 -48 54 115 124 -51 68 75 77 -187 -82 48 -135
4190 -135 -19 -20 146 60 -74 3 -32 -47 72 42 -234 -111 -85 -125 -98 -69 1 -57 -267 100 41 33 252 289 -76 -17
4216 -17 16 -251 166 -126 143 180 -142 -173 -5 -105 59 -7 247 204 -229 52 131 152 98 -100 83 -204 -140
4239 -140 -19 -37 -40 200 -124 -204 29 -50 -15 197 -29 151 -80 -228 104 -194 120 -166 40 -19 -428 -241
4261 -241 176 97 53 0 12 74 -3 43 151 -49 109 120 -123 -93 -194 -179 -102 42 173 28 -205 183 -148 20
4285 20 -115 -214 -14 -52 231 -59 -173 -134 -143 43 -42 94 -6 -175 95 118 6 -119 -121 -57 74 72 52 52 -66
4310 -66 -32 148 34 -106 112 -300 14 210 173 259 -55 125 -36 -75 -51 -219 68 -37 40 32 -152 -46 -44 13
$$ packed form
4139Go3q1L3N4k36L60j8J89j18l41J83N9j1q8J34j37K03k23J00O3pj57J35k2J72
4164A90k20Q6M1q6p1K29j13p4Q3L1j30Q3l6m6j5J02O1Rj75J19PKk64J05J30j83
4190a35J16jJ66q6j34P7l5j5J19l0k76J23K6m0K7K9P0n8k10L67n9qK19L7l65N9
4216a7L3k67M17k92K69L7l22l1J68j00J64o6K54m3m33K81P9K1n4j98J83k87O4
4239a40J21j8lK40l24q0K33p9L5K12k26J80k31j48L32k98L14k86K06n9m09J87
4261b41M17p9m4n3J2O2p7M6J08k00J58J1k43L0j01J5P7J44J31j45k33L88l31J68
4285B0j35r9K00l8K83k90j14L9rJ86q5J36j00j69K70K3j12j25kO4J31kk0%j18
4310f6L4J80j14j40K18m12L14J96l7Q6l14J80j61l9K4j68K87j05P7qj84J06KN7
$$ plain form
4334 13 57 -99 64 139 166 -244 13 62 5 205 -11 108 -125 -170 -133 -51 133 -101 -86 90 123 -40 -38 73
4358 73 -53 16 -132 -81 5 7 -7 99 -299 18 116 -240 -187 -63 -3 -30 -251 182 -103 -95 -89 -187 -72 241 166 -28
4384 -28 16 84 150 103 391 -83 -64 128 258 110 55 151 142 -23 -4 -170 234 -116 -72 208 -97 70 1 162
4408 162 79 -180 -54 -1 -57 57 -46 115 32 89 164 89 47 2 -138 -56 -57 75 64 267 141 -106 20 -163
4432 -163 -169 -30 -22 11 18 -9 139 -107 94 -151 15 187 -100 42 35 -300 -49 223 -43 -14 24 264 -30 100
4456 100 -37 44 -80 226 5 -105 224 58 -158 42 -4 80 25 228 -108 -99 114 -96 104 157 -367 115
4478 115 139 -23 74 40 -65 7 78 -22 -104 -250 25 -39 -51 106 -181 53 155 -113 -60 100 -250 48 -283
4501 -283 -40 -119 -5 -110 174 291 -20 -76 -147 -129 -249 39 -329 -36 88 127 -163 197 103 53 123 -63 156
$$ packed form
4334A3M4j56J63P5K7m10K57M9n7K00k16J19k33m5L7Q2J84k34J5J76L3j63KJ11
4358G3j26O9j48N1Q6Kj4J06l98L17R8l56N3J24O0k7k21M33k85QOr8J15L13p5j94
4384b8M4O8O6m7K88m74J9J92J30j48n5R6rj65J9j66M04l50M4K80l05J67o9J61
4408A62q3k59J26N3n6J14j03J61q3N7P5p5m2m5j40Q2jJ32j1K03j26k47J26j83
4432a63oJ39QL3Pk7J48k46K01k45J66J72k87J42pl35K51K72k66K9L8K40k94J30
4456A00j37Q1j24L06k21j10L29j66k16K00m6Q4n5K03l36RK13k10K00N3n24M82
4478A15K4j62R7l4j05P2P1j00q2j46K75o4j2J57k87K34J02k68N3J60l50K98l31
4501b83K43p9J14j05K84J17l11n6p1J8j20K88l68K93J24L9k90L60r4n0P0j86K19
$$ plain form
4524 156 -86 -169 75 17 -122 294 110 -53 -185 103 -18 56 -136 -11 -223 23 66 -53 4 54 -82 197
4546 197 121 -193 -43 208 33 59 -48 -137 -29 198 58 -60 268 103 271 -84 -5 307 -142 103 -91
4567 -91 -25 -127 -54 -49 -60 -195 298 7 -186 -104 -23 -153 100 201 -105 -32 -213 274 185 270 18 35 170 -118
4591 -118 265 -87 254 -76 -144 -82 64 -56 -68 -53 93 109 175 139 -157 112 -102 -174 119 -249 83 2 -102
4614 -102 5 99 113 -62 136 -133 138 -53 188 -16 -63 -15 61 -112 -274 -62 -84 168 -31 36 3 137 -14
4637 -14 -115 117 217 -18 47 -13 -109 -231 207 49 -38 9 45 -63 -43 -97 82 -261 -141 -42 149 -293 -99
4660 -99 79 -163 -46 132 -118 269 -249 -60 -141 68 -100 -211 179 -237 160 28 322 -44 -11 118 -96
4681 -96 -11 170 -66 -97 -204 -13 210 -184 -14 43 1 50 34 -193 110 -86 -92 117 -226 -159 -55 23 15 144
$$ packed form
4524A56k42q3K44n8j39M16j84j63j32K88j21P4j92J25k12K46M3j19N7N0j36K79
4546A97p6l14J50K51j75K6j07q9J08K27j40j18L28j65J68l55P9L12m49K45j94
4567i1O6j02P3Nj1j35M93k91j93Q2Q1j30K53J01l06P3j81M87q9Q5k52J7J35k88
4591a18L83l52L41l30o8O2J46j20j2J5J46J6O6l6k96K69k14p2K93l68L32q1j04
4614a02J07R4J4j75J98k69K71j91K41k04m7M8P6j73j62K12k2K52j99O7l3J34j51
4637a4j01K32J00k35O5o0r6j22M38j58q7M7L6j08K0n4J79l43J20R9J91m42J94
4660i9J78k42J17J78k50L87n18J89q1K09j68j11L90m16L97j32K94l66L3J29k14
4681i6Q5J81k36l1j07J91K23l94J70N7m2M9j6k27L03j96oK09l43O7J04P8qJ29
$$ plain form
4705 144 129 213 -25 109 57 67 -135 -20 162 -37 9 46 197 110 77 -106 33 -46 15 163 240 -172 203 -251
4729 -251 42 -199 107 -153 38 122 121 -23 -29 33 -68 -133 -226 -85 -24 -243 33 28 20 -3 -149 -62 -220 19 -41
4754 -41 13 -164 -128 -82 -16 -5 -61 16 144 289 128 -50 56 49 -27 -166 -106 -101 94 -80 25 -85 -49 99 70
4779 70 -174 -115 -182 108 -42 -141 2 123 217 -234 -169 131 120 -182 113 -205 26 -43 -119 -79 -13 -104 -264 97
4803 97 104 -176 -51 41 -7 34 -294 59 81 -155 111 230 -101 47 -169 105 130 -4 240 -29 -16 -21 -64 -2
4827 -2 -235 -36 -218 137 22 -191 -166 221 25 -20 5 -147 165 -280 -137 -40 117 16 -145 28 -191 26
4849 26 -213 -166 59 -102 67 30 3 -23 53 -34 75 16 -62 161 227 -236 69 178 -174 -65 128 -77 -85 -70
4873 -70 -80 -21 -49 -28 21 116 412 -26 43 28 160 -196 55 7 -212 236 -115 -21 -58 263 109 -153 -161 -194 181
$$ packed form
4705A44j5Q4k38J34n2J0k02J15J82j99M6L7J51q7l3j83J39p9O1J48P7m12L75m54
4729b51K93k41L06k60J91Q4jj44oO2j01o5r3J41O1k19K76nqk3j46Q7j58K39o0
4754d1N4j77L6M6O6J1n6P7J28J45j61j78J06pp6j39O0NJ95j74J05j10L6J48k9
4779G0k44N9o7K90j50r9J43J21R4m51O5L00j1l02K95l18K31o9p6M0O6r1j60L61
4803I7Pk80J25R2m8M1l28L53K2k36K66J19l31J48k16K74K5j34K44k69J3nm3O2
4827bk33J99j82L55j15k13K5L87j96m5K5j52L12m45J43R7J57j01j61J73k19K17
4849B6k39M7K25j61J69l7k7k6P6q7J09n9p8K23O6m63L05J09l52J09J93k05qJ5
4873g0j0N9k8K1M9R5K96m38O9j5J32l56K51m8k19M48l51R4l7L21j54k62ql3L75
$$ plain form
4898 181 -7 154 -4 -63 -54 -203 -127 181 -140 201 -151 -11 -84 -177 4 47 -155 76 -150 137 54 70 118
4921 118 -8 94 -178 126 -179 -72 7 -235 47 -25 -50 -63 -29 5 28 -236 -75 -40 -88 129 -131 -323 28
4944 28 57 13 1 55 -39 -241 -126 10 40 -159 -21 78 151 -107 -29 75 -28 36 -44 -96 -5 76 -138 2 -48
4969 -48 -78 -195 -17 -7 -136 9 -326 48 103 69 -152 91 98 -118 152 123 115 145 -262 -50 47 -79 32 -181
4993 -181 182 94 -148 196 -26 39 124 213 -59 80 180 78 54 -93 -16 175 204 50 -16 -15 -145 -78 -63 -21
5017 -21 -76 -173 -69 -117 154 99 -170 67 15 63 -103 60 -339 -234 -157 103 -110 -244 -69 -22 -90 76 54 -322
5041 -322 28 -96 -60 -50 69 43 44 78 106 158 42 -222 -55 -287 -38 93 54 150 33 -75 346 -174 -211 138
5065 138 -68 20 197 41 -24 -152 89 93 -45 247 -55 51 -86 -193 14 -104 136 -77 230 37 -7 150
$$ packed form
4898A81j88J61j58n9Rj49P6L08l21L41l52J40p3r3J81M3k02K31k26K87q3J6M8
4921A18j26J02k72L04l05J07P9k42K82p2k5j3L4L4K3k64J61L5m8K17k60j92L51
4944B8K9m4j2N4r4k02J15J36L0j99J38R9P3k58P8J04j03O4q0n2R1Q1k14J40n0
4969d8l0j17J78J0j29J45l35L74N5l4k21K43Pk16K70k9qL0m07K12R7j26J11k13
4993a81L63q8k42L44k22O5Q5Q9k72J39J00j02k4j47P7J91K9j54o6Jj30O7J5M2
5017b1n5r7J04m8K71n5k69K37n2M8j66J63l99J05P7K60k13j34J75M7o8J66k2l76
5041c22L50j24L6J0J19k6JL4K8N2j16k64J67k32K49J31l9R6j17j08M21n20l7L49
5065A38k06Q8J77j56o5j28K41Mj38K92l02J06j37j07K07j18K40k13L07j93m4J57
$$ plain form
5087 150 -10 33 192 -118 145 -73 -149 131 137 -93 -51 -6 -21 107 37 38 89 170 -66 -47 25 22 8 -222 -74 107
5113 107 84 -64 57 49 -266 131 2 79 -104 -114 79 48 -181 -97 -125 -134 -94 118 -32 -94 -194 -1 -12 5 -107
5138 -107 29 -143 -357 -142 -60 75 274 -53 -39 92 110 -32 -190 -87 290 -197 -125 137 18 152 -26
5159 -26 124 -29 0 142 119 35 85 -31 -133 112 56 -150 137 -12 102 217 -138 236 80 -23 13 124
5181 124 42 -101 -427 -136 214 42 2 31 361 29 -120 -69 118 -33 126 6 -47 43 -66 -53 -21 143 -155
5204 -155 -63 109 214 -28 -146 -21 -110 -108 27 40 -202 -76 -66 81 -32 -16 -39 -22 158 141 1 76 -123 118
5228 118 -183 127 -77 -81 31 8 -17 28 -79 160 -1 45 134 -70 -199 15 230 -142 -220 156 -93 304 42
5251 42 41 -167 -86 -54 17 65 -205 -165 67 14 -100 250 -134 57 102 138 168 219 -41 -1 -3 -230 -120 -106 48 285
$$ packed form
5087A50j60M3J59l10K63k18p6K80Ok30M2M5j5J28p0JN1Q1k36J9P2lj4k30J48J81
5113A07k3j48J21ql15L97j29P7j83j0J93l1k29Q4k8rM0K12j50o2j00J93j1J7j12
5138a07J36j72k14K15Q2J35J99l27J4J31J8j42j58J03L77m87P2K62j19J34j78
5159b6J50j53K9J42k3q4N0j16j02K45n6k06K87j49J14J15l55L74j56j03L6J11
5181A24q2j43l26K91L50j72m0K9L30l32j49N1J87j51J59j20n3R0j09J3L2J64k98
5204a55R2J72J05k42j18J25q9KJ35J3k42J26J0J47j13J6k3J7J80j7j40P5j99K41
5228A18l01L10k04mJ12k3k5M5j07K39j61M6Q9k04j29K14K15l72p8L76k49L97k62
5251D2jk08Q1L2P1M8k70M0K32n3j14L50l84J91M5L6L0N1k60M0kk27J10J4J54K37
$$ plain form
5277 285 -47 -43 159 -158 -141 -52 -77 -20 90 -108 -53 -125 -199 111 139 24 -63 219 36 4 -124 147 -3 76
5301 76 -233 166 -90 142 61 -44 43 -41 -55 90 65 -96 35 50 59 -3 -118 -277 112 -109 -190 107 18 84
5325 84 -9 -89 104 -59 -110 -88 111 -85 117 44 128 47 158 -206 -18 112 131 12 -162 -193 -154 218 46 -64
5349 -64 68 -159 -19 -136 -173 -117 54 158 54 -144 151 228 -69 95 51 -137 -241 -90 -85 112 285 -152
5371 -152 -35 -16 4 -167 -81 -174 -46 -52 -29 183 92 87 -17 149 173 52 -50 -157 251 135 -52 316 -262 173
5395 173 385 104 -71 118 334 -285 -181 -18 150 25 -77 251 282 325 6 -98 30 -10 -37 78 147 -51
5417 -51 17 -108 -42 -80 231 43 136 -92 -72 17 -108 -87 -99 22 -23 -86 54 -146 -171 28 -174 -29 64 -8 321
5442 321 34 -82 -125 38 46 -75 69 63 -137 -18 153 -81 249 -93 187 57 -19 96 -226 -42 -44 -91 -64
$$ packed form
5277B85l32MK02l17J7Q9k5N7J10j98N5p2p4L10K8j15q7K82j83l2j28K71j50P9
5301G6l09L99k56K32q1j05Q7q4j4J45k5j61J31J5Ro2j15j59L89k21q1K97q9O6
5325H4r3q0J93j63n1K2J99j96K02p3Q4q1J11l64J88J30J9j19j74l1L9L72j72j10
5349f4J32k27J40j17l7N6J71J04j04j98K95P7k97J64m4j88j04J51NJ97J73m37
5371a52J17J9K0j71Q6r3J28oK3K12r1nj04J66K4j21j02j07M08j16j87L68n78M35
5395A73K12k81j75J89K16o19J04J63J68j25j02L28L1M3l19j04J28m0k7J15O9j98
5417e1O8j25O6l8L11j88R3k28K0Q9j25K1j2J21m5o3J40k00k5J99k02J45R3p2L29
5442C21k87j16m3J63Qj21J44ok00J19J71k34L30l42K80j30p6J15l22J84km7K7
$$ plain form
5465 -64 -36 -26 205 -88 12 -51 146 116 -124 -44 26 -78 121 11 -28 224 -34 -45 293 -179 -191 -20 122
5488 122 -104 268 46 -147 73 -316 -12 -267 -62 206 269 49 -74 357 -126 96 -228 -211 120 44 -33
5509 -33 43 77 -136 -15 106 -177 -137 26 136 -139 -71 -15 62 -147 -125 34 233 3 -162 115 -143 -169 -135
5532 -135 -284 155 86 93 -44 71 -100 -3 54 -281 207 26 -95 -40 35 98 56 -38 89 -20 100 -53 -118 -170
5556 -170 -12 -149 -258 -113 120 116 -204 102 25 -46 17 -22 -60 46 216 142 -241 -80 -204 -29 -118 21 -203
5579 -203 -235 -167 -146 -18 112 -54 -46 110 67 50 186 238 49 -5 -35 -107 65 -28 33 163 -72 73 109 189 168
5604 168 50 61 57 94 -193 119 143 126 174 -39 19 -96 114 -217 117 163 -30 -3 116 -86 -228 -28 -81 114
5628 114 50 -104 67 -139 -89 47 -49 -21 -357 19 82 -135 -101 -128 -171 -159 -60 153 -241 -11 136 172 86 -75
$$ packed form
5465f4K8J0K31k93J00o3J97l0k40Q0P0j04J99j10l9K52k58j1L38m72j2J71J42
5488A22k26L72k22j93K20l89L04k55K05K68O3k20j23M31m83K22l24J7L31p6p7
5509c3P6L4k13J21J21k83M0J63J10k75O8N6P7k09K2J59J99k30j65K77k58k6L4
5532a35j49M39o9Pj37J15j71R7N7l35M88j81j21N5P5O3m2r4J27j09J20j53o5n2
5556a70J58j37j09J45K33ml20L06p7p1O3l9l8J06J70p4l83J61j24J75q9J39k24
5579b03l2O8K1J28J30j66QJ56m3j7J36N2j89n4l0p2J72r3O1J30k35J45L6Q0k1
5604A68j18J1mL7k87L12K4j7M8k13N8j15K10l31L34M6j93K7J19k02j42K00n3J95
5628A14o4j54J71k06N0J36r6K8l36L76O3k17L4k7m3J2R9K13l94K30J47L6q6j61
$$ plain form
5652 -75 -179 114 -197 160 -150 66 -62 217 180 -261 -135 141 83 -112 -329 -26 76 102 -101 -202 3
5673 3 -126 -30 101 15 39 79 105 138 -88 97 175 22 147 -224 -55 97 -117 64 124 -29 11 -57 30 -40 51
5698 51 195 -83 52 8 -257 73 -134 -153 63 -90 -24 -41 180 -22 -168 -223 90 12 -140 32 -7 -23 122
5721 122 56 72 42 156 71 -190 -187 137 84 121 -152 -113 106 -71 167 -98 -20 60 264 -94 56 -5 3 -17 95
5746 95 111 -244 -103 3 126 -214 -49 -71 280 -10 24 57 -86 -152 25 -311 -72 61 280 -16 156 11
5768 11 -32 72 110 172 226 217 -138 -199 -90 89 -3 -253 -75 -7 35 -38 -213 -247 119 59 -79 -16 0 44 -342 1
5794 1 -81 48 14 99 155 -14 51 108 14 263 -160 -85 11 -74 34 -83 163 94 102 264 60 -108 57 129 131 181
5820 181 -115 -25 83 178 411 -83 51 51 -127 -98 161 79 60 -22 26 126 -297 10 -218 -139 286 -84 -132 151
$$ packed form
5652g5j04K93l11L57l10K16j28K79l7m41J26K76n8j95k17L03J02K6k03j01K05
5673Cj29R6J31q6K4M0K6L3k26J85P8j53J25l71J69J52k14J81O0j53M0o8Q7p0R1
5698E1J44k78J35m4k65L30k07j9K16j53O6j7K21k02j46n5L13p8j52J72l9j6J45
5721A22o6J6l0J14q5k61LL24n3L7k73L9K19j77K38k65P8Q0K04l58J50o1Qk0J12
5746I5J6l55J41J06J23l40J65k2L51k90L4L3j43o6J77l36K39J33K19k96J72j45
5768A1m3J04L8O2N4rl55o1J09J79r2k50J78O8M2p3j75l4L66o0j38O3J6M4l86L43
5794Aq2J29l4Q5N6j69O5N7r4K49m23P5R6q5J08j17K46o9QJ62k04j68J65P2KN0
5820A81k96R0J08R5K33m94J34%j78K9K59q2j9q2M8J00m23L07k28P9M25l70m8K83
$$ plain form
5844 151 -165 147 42 27 -180 30 102 103 -82 65 63 -26 89 -82 244 -21 -55 -76 -193 57 76 25 -61 74
5868 74 176 -141 -133 -123 -84 198 20 91 47 -153 197 -153 -306 -63 -31 108 175 -171 -161 -4 19 56 -5 55 -400
5893 -400 25 55 182 77 -38 162 163 133 -112 68 -128 -50 -44 167 115 11 -228 -119 -9 -177 10 -93 2
5916 2 -60 -121 -74 161 164 195 112 8 -26 77 180 105 -87 -1 78 116 71 -16 52 17 -306 68 -105 -330 -197 -114
5942 -114 -53 31 53 -107 -142 -37 126 53 -81 -111 -124 38 16 -68 -92 -76 -64 139 115 125 134 88 -307 130 123 175 132
5969 132 -89 80 1 -8 -165 91 -157 -38 -292 138 162 54 -43 58 186 23 92 -98 -239 74 -314 -69
5991 -69 27 212 83 -127 -49 -152 -124 17 10 -100 -88 18 -35 33 -174 70 197 -61 -68 -10 165 -162 -41 -8
6015 -8 115 -7 -65 -121 138 23 90 91 61 -193 57 -160 -6 10 -106 71 -56 -18 167 -239 71 -213 -29
$$ packed form
5844A51l16L12j05j5k07K10P2Jj85J47kq9J15j71L26k65l4k1j17K50J9n1q6J35
5868G4J02l17QJ0L9K82j78P1m4k00L50l50j53K43L2J39O7l46J0J57K3L7o1O0m55
5893d00M25L0J27j05j15K00Jl0k45J80j96P8OK11n2j04k39J09J10j68J87j03R5
5916Bo2o1M7K35LL1q3j04l4J03J03p5j92Q6P9L8m5q7O8l5l23L74j73k25J33Q3
5942a14O1Q4K2j60l5J05J63p3j34l0j3J62k2q4k4J6J2K03k4J0Rm6l95M37pN2m3
5969A32k21J69p9rj57K56k48J19k54M30K4j08r7J01J28j63O9j90j41L13l88K45
5991f9R6J85j29k10P8j03K8J41pj10J2J06n3O8k07K44J27k58pN8J75l27J21L3
6015hJ23j22n8n6K59j15O7Jl0k54K50k17J54J6j16J77j27L8J85m06L10k84J84
$$ plain form
6038 -29 -69 -34 31 -48 -15 217 15 -129 -227 101 103 50 -124 118 79 48 -146 -59 124 -184 160 -57 125 44 156
6063 156 28 -88 128 -46 -59 33 143 119 -121 -163 -3 105 43 79 -196 -35 -97 -229 -46 264 -147 -144 105
6086 105 -1 -131 67 -71 -224 107 156 -139 95 23 -136 80 36 33 36 -26 150 145 196 244 289 69 228 146 -79
6111 -79 -192 11 93 64 -264 -118 -92 89 -174 -68 161 -41 -79 142 11 9 -113 -2 -121 -42 191 -120 170
6134 170 -51 29 -165 250 -42 -28 195 -30 -158 -356 42 144 -134 -15 197 170 29 -9 -54 -132 -5 78
6156 78 -8 -131 -96 -33 -49 96 167 21 5 156 108 -73 3 -60 14 104 -56 6 264 87 -48 236 -140 13
6180 13 18 147 132 218 94 142 -4 24 41 38 -68 346 42 -61 177 -130 -33 146 -120 -65 140 -175 19 -15
6204 -15 -161 -101 165 -80 74 -40 89 190 193 146 -15 -54 -130 343 -72 109 -10 134 2 -63 5 92 201
$$ packed form
6038b9m0L5O5p9L3K32k02j44r8L28Kn3j74K42l9l1j94Q7J83l08L44k17J82q1J12
6063A56j28j16K16j74j3R2J10k4k40m2J60J08o2L6k75J61o2j32J83L10m11LK49
6086A05j06j30J98j38j53L31M9k95K34p2j59K16m4lLo2J76nN1M8M5k20J59q2k25
6111g9j13K03Q2k9l28J46K6J81k63J06K29k02l8K21j31kj22J11j19P9K33l11K90
6134A70k21Q0j94M15k92J4K23k25j28j98L98J02k78J19K12k7j41l8m5p8J27Q3
6156G8q6j23L5O3j6J45P1j46j6J51m8j81P6o3P4R0j60O2K58j77j35K84l76J53
6180A3NJ29j5Q6j24M8j46K8J7lj06M14l04j03K38l07R7J79k66N5K05l15J94l4
6204a5j46O0K66k45J54j14J29J01Lm7j61l9p6M73m15J81j19J44j32o5O8Q7J09
$$ plain form
6227 201 -97 -64 16 -124 -136 90 -66 129 143 -76 -1 -84 -86 4 -92 29 159 188 39 302 125 -33 167 88
6251 88 148 -68 94 72 86 102 -198 96 -60 136 -188 28 17 113 -24 -365 151 67 206 -3 32 -60 -37 -112
6275 -112 29 -139 128 -120 98 -21 -44 -130 99 235 54 122 221 -134 -225 -157 -248 0 107 92 21 -202 100
6298 100 -40 226 -124 242 141 215 169 107 183 104 -159 4 -149 -211 134 -358 79 82 45 118 -122 68 -8 -2
6322 -2 67 -36 38 220 -42 220 -215 -225 214 233 112 -45 24 37 148 174 143 124 -16 -16 -84 33 -154 18 -164
6347 -164 36 -22 4 189 -79 69 -416 -206 -20 205 38 -78 26 58 194 215 139 99 -339 -31 -49 -170
6369 -170 -23 -57 190 -8 95 115 140 79 -28 -130 165 -15 -123 -140 103 100 -87 -149 -86 111 112 153 47 -211
6393 -211 -11 -82 66 179 69 -46 -13 17 33 22 26 56 -3 -96 -39 120 97 -52 45 -201 17 -275 177 118 106
$$ packed form
6227B01k98L3Q0j40j2K26j56J95J4k19P5q3kR0r6J21J30K9j49K63j77j58K00p9
6251H8O0k16J62k2J4J6l00K94j56J96l24K16j1R6j37l41N16q4J39k09L5r2K3p5
6275a12J41j68K67k48K18j19k3q6K29J36j81O8R9l55r1O8r1K48J07j5p1k23L02
6298A00j40K66l50L66j01P4m6o2P6p9k63J63j53o2L45m92M37Ll7P3k40J90p6O
6322bO9j03P4J82k62K62m35j0M39J9j21j57O9J3J11K6l1j9j40%o8J17j87J72j82
6347a64K00n8K6J85k68J48m85K10J86K25j67j16J04L2J36K1p6m0m38L08j8j21
6369a70J47l4K47j98J03K0K5o1j07j02K95j80j08j7K43lj87o2O3J97JM1j06k58
6393b11K00p1J48J13j10j15L3L0J6j1ML0n9r3N7J59k3j49R7k46K18k92M52n9j2
$$ plain form
6418 106 11 -99 43 -239 135 172 -45 81 90 -53 -74 -96 41 -126 77 147 -132 -4 -299 80 -16 338 -51
6441 -51 15 260 -83 -53 59 -54 50 -62 -54 -123 128 199 6 121 -73 193 -3 -133 -14 61 74 -371 58
6464 58 35 -361 -247 5 -54 24 138 165 -86 0 72 -98 169 -48 -211 88 -124 198 133 -126 -181 24 -11
6487 -11 -68 -75 -134 173 105 71 4 -261 63 160 -109 -32 260 218 -15 -169 -143 -101 -97 26 -179 -112 96 -43 104
6512 104 5 54 -47 73 125 35 -159 -12 124 -53 -21 169 107 -16 203 -72 98 -23 -307 -236 -58 -28 -93
6535 -93 31 -115 -191 -113 -58 -73 -39 -10 -97 73 176 196 -6 -240 -50 34 -80 165 -21 67 -4 -125 80 53
6559 53 146 -35 65 150 25 -35 84 4 106 321 158 -271 -140 -248 -106 87 -15 227 1 56 149 24
6581 24 48 -155 -199 89 115 37 326 12 -89 -3 -7 105 271 183 54 134 -239 -36 210 -135 -28 60 -159 11
$$ packed form
6418A06r5j10J42k82L74L7k17J26Rj43k1k2J37j67K03P0k79J28k95L79r6L54l89
6441e1O6K45l43L0J12j13J04j12Qo9K51P1j93J15j94K66j96j30J19P5J3m45M29
6464E8k3l96J14K52n9P8J14K7k51Q6P2j70K67k17j63K99k12L22o5k59n5K05l5
6487a1n7pn9L07o8l4o7k65L24R7k69P7K92m2k33j54K6M2MJ23k05O7K08j39J47
6512A04r9M9j01J20N2r0j94J47J36j77L2J90o2j23K19k75J70j21k84P1J78L0o5
6535i3J24j46p6P8N5j5L4K9q7J70J03K0k02k34J90Q4j14K45j86Q8p1j21K05k7
6559E3R3j81J00Q5j25o0J19q0J02K15j63m29J31j08J42J93j02K42k26N5R3j25
6581B4K4k03m4K88K6p8K89l14j01Q6mJ12J66q8j29Q0l73K03K46l45J07Q8k19J70
$$ plain form
6605 11 95 -292 150 -157 137 41 -73 -80 4 219 131 228 45 -118 -94 234 202 132 -41 -163 -110 -177 28 -134
6629 -134 150 17 142 -88 90 149 179 -15 262 123 32 107 -110 27 70 -89 105 65 -73 240 -65 -24
6651 -24 127 21 40 30 43 179 -199 -10 -89 -163 -304 57 -26 -105 -85 163 57 -37 -49 199 -130 -32 118 -41
6675 -41 -69 -30 -11 -30 -209 265 136 -192 -172 -166 36 62 -105 -56 6 -145 23 -107 -64 -79 218 52 -128 69
6699 69 -146 208 -10 -251 -129 -233 241 -186 88 59 52 219 91 141 -22 -133 -11 14 12 134 -54 -71 199
6722 199 86 -54 264 -23 -130 -177 41 7 -105 61 -215 239 82 72 -168 57 93 -14 155 -60 73
6743 73 -9 -53 51 -81 -16 67 -138 -114 -80 -9 72 130 -186 66 229 -68 113 74 166 -183 40 -338 -277 19
6767 19 39 100 123 58 229 -125 -280 0 -81 -6 188 -248 101 -246 -40 16 -38 -9 149 -206 203 76 -18 163
$$ packed form
6605A1Q4l87M42l07K94r6j14pQ4K15q8R7j83j63K4L28l2p0j73j22N3o7K05j62
6629a34K84j33J25k30J78N9L0j94K77j39r1P5k17J37M3j59J94m0j38L13l05M1
6651b4J51j06J9j0J3J36l78J89p9p4j41L61q3p9K0K48j06r4j2K48l29R8J50j59
6675d1k8L9J9j9j79M74j29l28K0OK02K6j67M9O2j51J68j30M3j5K97j66j80J97
6699F9k15L54k18k41J22j04M74m27K74k9pJ67j28N0j63j11J22K5kJ22j88j7K70
6722A99j13j40L18k87j07m7K18l4j12J66k76M54j57j0k40K25L6j07J69k15J33
6743G3q2m4J04j32O5Q3k05K4L4P1Q1N8l16K52J63k97J81l9R2l49K23l78O1K96
6767A9K0O1K3o5J71l54j55K80q1P5J94m36L49l47K06N6n4K9J58l55M09j27r4J81
$$ plain form
6791 163 0 -169 -51 -72 110 71 193 14 88 -181 -37 143 -81 205 -1 -193 204 -141 -177 -31 137
6812 137 -31 -92 9 43 54 -17 177 64 61 -60 1 -173 -83 187 157 67 -297 -42 173 -131 -210 -67 171 -243
6836 -243 -159 -151 -42 -83 151 64 -83 -223 -211 90 -21 -35 -49 -9 43 -151 -171 92 -103 -72 -60 -195 -37 -6 -241
6861 -241 -82 -297 -19 96 -21 21 224 43 -147 12 67 -208 34 31 -83 136 -164 -272 -179 81 164 8
6883 8 24 -123 188 50 306 35 32 -247 46 46 98 -22 -7 50 117 11 62 86 81 -208 67 64 -180 -91 38 -27
6909 -27 -45 -106 155 -104 -138 91 221 -6 137 -122 -27 -15 6 -7 99 -188 -114 -51 299 204 -72 -291 136 75
6933 75 -113 9 -101 204 -48 50 -90 -117 -160 27 -113 0 110 -116 -98 -77 -14 -30 -123 57 -9 -200 40
6956 40 39 -5 -177 -5 -70 25 -293 16 15 77 11 129 -242 55 -20 -11 -40 -135 -76 -4 -74 -226 258 -58 146 -197
$$ packed form
6791A63j63j69J18k1J82l9J22j79P4k69J44J80k24K86k06j92L97l45l6J46J68
6812A37j68o1J01L4J1p1J94j13lj21O1j74R0K70l0r0l64K55K15l04p9J43K38m14
6836b43Q4QJ09m1K34q7j47j40J2L01j11j4j4M0N2j94k0K63j95L1J2j35J58L1k35
6861b41J59k15K78J15j17M2K03j81j90J59N5k75K42lj14K19l00j08R3K60Q3j56
6883HJ6j47L11j38K56k71lk79K93%N2j20J5N7O7j06N1K4nk89K75lk44Q9J29o5
6909b7j8o1K61k59l4K29J30k27J43k59R5J2K1j3J06k87P4O3L50r5k76k19M27o1
6933G5j88J22j10L05k52R8j40k7m3J87j40J13J10k26J8K1O3j6r3J80o6j91K40
6956D0jm4j72J72o5R5l18L09jO2o6J18l71K97p5Rk9r5N9P2p0j52M84l16K04l43
$$ plain form
6982 -197 -40 -12 -202 43 13 109 104 146 -141 -127 71 -330 35 -65 -130 -135 -116 37 179 188 -17 60 -134 -50 43
7007 43 -17 -164 133 -45 57 -89 25 -183 75 107 51 -14 55 231 68 92 -157 35 11 78 -233 -104 -91
7030 -91 118 -9 57 -62 179 -62 26 -35 -146 75 90 46 118 130 -144 164 -100 -55 -77 -166 -144 -156 -226 -64 -39
7055 -39 -107 -26 46 49 -82 -235 11 79 -79 -62 -26 -36 -23 -22 -79 17 -34 -159 -32 112 119 144 -118 -209 -24 180 -123
7082 -123 -125 156 90 -90 -89 -280 -73 -217 132 -74 81 -72 -161 44 48 -63 -279 -21 33 -99 81 -77 -96
7105 -96 218 -207 52 97 58 -200 83 72 -281 -99 129 42 50 -163 5 -140 -12 83 -172 -259 -20 151 -189
7128 -189 93 134 68 -65 -28 -138 -59 -84 -31 110 -124 -9 -166 233 30 97 -309 -343 3 1 -99 -82 -92 -163
7152 -163 52 9 -141 122 -16 -156 110 -38 56 -6 8 -155 116 -10 -86 18 -95 -7 -170 -29 -34 -279 -270
$$ packed form
6982a97J57K8j90K45l0R6nM2k87J4J98m01L65j00o5nJ9J53J42Rk05P7j94Q4R3
7007D3o0j47K97j78J02j46J14k08K58L2n6o5O9J76j63K4k49J92k4O7l11J29J3
7030i1K09j27O6j19K41k41Q8o1j11K21J5m4P2J2k74L08k64M5k2q9K2j2p0J62K5
7055c9o8Q1P2Lj31j53K46O8j58J7L6j0J3Jn7R6n1j25J27J44PK5k62r1J85K04l03
7082a23kK81o6j80Jj91K07j44L49k06J55j53q9K05Mj11k16K58N4j32J80j58j9
7105i6L14m25K59M5l9k58K83j1l53J82K28q7Qk13J68j45J28R5k55q7K39J71l40
7128a89K82M1o6j33L7j10P9k5N3J41k34J15j57L99k03O7m06l4L46kj00J7j0p1
7152a63K15m3j50K63j38j40K66j48R4o2J4j63K71j26p6J04j13Q8j63J41nk45R
$$ plain form
7175 -270 36 -130 178 -263 -150 -9 34 -114 -108 40 -93 59 221 -222 187 21 -124 -106 96 -33 154
7196 154 129 -23 -110 -243 154 -174 -108 251 -93 -40 -111 -142 -105 -109 -118 -19 -18 -185 92 27 -159 171 157 -147 118
7221 118 -10 -173 81 121 168 169 92 35 113 11 104 69 95 -144 3 25 -207 70 183 -86 95 259 26 -5
7245 -5 153 -49 -110 -33 -21 99 -16 215 -197 -197 -140 -28 15 198 -41 217 -121 107 -185 -104 34 -56 -258 44
7269 44 -164 -60 72 5 -100 65 120 71 -80 85 -17 235 -157 -109 25 21 39 -82 98 -123 40 -35 10
7292 10 117 -104 38 -59 168 51 -78 -288 68 246 27 91 89 21 33 92 31 157 -168 57 56 -179 143 219
7316 219 -106 -38 -66 -79 -131 -173 5 214 199 -85 -121 8 74 -96 -99 7 100 121 99 -27 68 428 308 -32 -154
7341 -154 -14 -79 111 -143 -32 -89 -99 21 160 50 -193 -114 15 140 -186 -41 -71 -9 -45 -150 146 79 -176
$$ packed form
7175b70L06j66L08m41J13J41M3j48OJ48j33J52J62m43M09j66j45J8K02j29J87
7196A54k5j52q7j33L97l28O6L59l44N3p1l1L7mrR9Jj67K77o5j86L30j4l04K65
7221A18j28j63K54M0M7Jp7n7P8j02R3l5K6k39J47K2k32K77J13k69J81J64k33l1
7245eJ58k02o1P7J2J20j15K31m12%N7J12M3J83k39K58l38K28k92Q1J38r0k02L02
7269D4k08J04J32o7j05J65N5m9j51J65j02K52l92M8J34mJ8j21J80k21J63p5M5
7292A0J07k21J42r7K27j17j29k10L56J78k19O4ko8J2N9o1J26l25K25jk35L22P6
7316B19l25O8k8j3n2m2J78K09j5k84l6J29O6j70lJ06R3K1k2j26R5L60j20l40j22
7341a54J40o5J90k54J11n7j0J20J39j10k43P9J29J25l26J45l0O2l6j05K96o7k55
$$ plain form
7364 -176 42 8 124 -248 -127 178 -48 -98 106 24 -111 -86 74 -30 58 -231 -18 -200 -115 -68 -70 -88 -185 -69
7388 -69 119 -157 5 45 49 -104 142 -186 142 125 -157 -54 -270 45 129 282 -47 -79 -233 -296 158 39 46
7411 46 -190 102 -227 154 -45 -20 175 34 -74 178 -13 -2 155 -254 120 5 114 -11 166 -6 294
7432 294 -9 -187 42 78 95 71 233 -158 13 -251 130 47 -361 12 68 1 20 80 -17 -206 -134 113 123 249
7456 249 -123 -31 6 88 138 38 93 122 179 26 19 -1 73 42 -306 -8 202 35 91 -26 30 6 112 -31 -131
7481 -131 19 317 218 -5 -54 -90 -24 99 -124 -278 337 188 64 -123 37 101 -192 -144 158 36 0 23 -81
7504 -81 -92 17 -18 45 -22 82 -120 -110 352 -193 -101 50 129 21 14 -25 112 -154 63 62 -21 91 -34 -124 16
7529 16 164 198 -139 12 38 18 -2 29 -63 -35 61 10 -326 -117 -87 -93 -36 -229 186 144 147 -18 201 148 -8 137
$$ packed form
7364a76K18l4J16l72J21L05k26n0K04q2j35K5J60j04Q8k89K13j82Q5M7kj8r7J16
7388f9J88k76J62M0Mj53K46l28L28j7k82J03k16L15Q4J53l29l2j54o3M54j19P
7411D6k36K92l29L81j99K5J95j41j08K52j91J1J57m09L74j15J09j25J77j72L00
7432B94l03j78K29L6J7k4J62l91J71k64L81q3m08L73N6o7J9O0r7j89P2K47J0J26
7456B49l72R2L7Q2N0j00N5K9N7j53pk0P4l1l48K98K10j67N6j17N6k4J06j43j00
7481a31J50K98r9k23m9l6O6J23k23j54O15j49j24j87J60O4k93M8L02j22l6K3j04
7504h1j1J09l5O3o7J04k02J0M62n45R2J51P9j08pl9J37k66K17jq3J12j25r0J40
7529A6J48L4l37J51K6k0k0L1r2K8R6n1l36K09L0oN7j93M15m2Lj65K19n3j56J45
$$ plain form
7555 137 -97 -57 128 -35 -13 -172 55 -120 -78 -23 -173 60 12 141 -93 -26 -63 215 107 -81 -13 189 200
7578 200 -323 -48 -32 165 -84 79 23 -298 -65 -91 26 -70 -103 -51 -154 -212 -6 65 11 -60 57 -207 -69
7601 -69 -119 -96 -57 -8 143 -171 33 196 -83 -150 56 -40 -162 -67 74 -108 -199 60 -91 90 -91 45 27
7624 27 2 112 -151 22 68 6 147 109 -25 -19 89 -70 -101 6 185 -136 -70 -40 -147 -37 4 -65 -10 -158
7648 -158 -184 -245 -108 -7 -26 119 -191 229 -170 58 -132 51 302 -81 -167 168 138 -34 -280 8 -101 30
7670 30 198 8 -115 58 66 165 116 -14 -129 12 -78 47 -224 -18 91 -137 -25 -211 -65 -149 -58 -53 -98 -162
7694 -162 11 118 70 -85 -36 -11 35 -12 60 -121 226 351 -19 -7 20 -198 183 -36 -19 -50 177 -146 48
7717 48 -7 -53 -106 17 33 -236 12 -49 -113 236 138 -72 -6 39 77 33 -34 -13 -91 186 104 6 -74 -20 41 168 79
$$ packed form
7555A37k34M0J85j63K2j59K27j75M2N5j50K33m8J29k34O7l7K78j08j88O8K02J1
7578B00n23K75J6J97k49J63n6l21K33k6J17r6l3N2j03n8K06P1n4p1J17k64J38
7601f9n0K3L9M9J51l14K04J63k79o7K06r6j22R5J41j82r1K59j51J81j81J36j8
7624B7k5J10k63J73M6o2J41l8j34OJ08j59l1J07J79l21O6L0j07J10M1o9N5j48
7648a58k6o1J37J01j9J45l10M20l99K28j90J83K51l83q6L35l0j72k46K88j09J31
7670C0J68j90j23J73QR9m9j30j15J41r0J25k71K06J09k28J12j86J46q4R1Nm5o4
7694a62J73J07m8j55M9K5M6m7P2j81L47J25l70J2K7k18L81k19J7l1K27l23J94
7717D8n5m6n3J23J6k69K48o1o4L49r8k10O6M5L8m4o7K1p8K77q2r8q0N4O1J27q9
$$ plain form
7744 79 -35 130 -133 76 -71 -15 367 151 80 137 -192 30 24 38 196 45 -94 -144 165 -267 -90 45 19
7767 19 -89 -100 -52 11 -20 113 -113 -12 -83 -221 -144 -180 133 35 -6 -141 33 36 -43 96 14 -116 58 388 66
7792 66 -39 -49 76 -115 -29 -86 169 -47 -95 -251 -174 -53 224 -68 -17 -99 -64 132 -63 217 -140 107 -47
7815 -47 40 80 454 -224 -34 -198 -30 -286 -22 -112 -7 227 143 84 -71 -116 3 66 -66 127 -170 66 -75
7838 -75 43 -228 -63 -141 -78 -80 -19 -30 91 18 173 -9 -237 -166 -7 291 -49 -52 146 -67 -6 2 205 -144 -127
7863 -127 103 -10 -193 -40 38 95 25 -143 -100 -80 -144 120 50 -128 -106 202 128 -86 -4 -11 -161 36 -271 -111
7887 -111 177 79 3 -97 -111 -9 9 -254 -42 -256 76 -139 67 -185 -76 72 -83 -75 145 -89 35 136
7909 136 -114 -79 -59 -107 47 -23 -23 197 -172 -24 -33 -86 -78 -94 -188 28 403 165 -13 -164 58 -133 -114 113 160
$$ packed form
7744G9j14J65k63K09j47N6L82k16p1N7l29K22oJ4J58j51j39n0L09m32J77J35k6
7767A9j08j1M8O3l1J33k26J01p1j38P7l6L13r8m1j35J74Lp9J39q2j30J74L30l22
7792F6j05j0J25j91Q6n7K55k16m8j56P7J21K77k92N1q2L5J96j95K80l57K47j54
7815d7Q7M0L74o78J90j64J68k56K64r0J05K34q4n9j55m5J19O3j32J93k97K36j41
7838g5J18k71J65p8O3kO1j1J21p3J55j82k28P1J59K98l40lJ98k13O1QK03l49J7
7863a27K30j13j83J53P8N7p0j68M3K0o4K64p0j78K2L08p4k14Q2pj50J97l07J60
7887a11K88r8p6j00j4J02J8k63K12k14L32k15K06k52J09J48j55QK20k34J24J01
7909A36k50L5K0m8J54p0%K20l69J48rn3Qj6r4K16L75k38j78j51K22j91J9K27M7
$$ plain form
7934 160 -165 157 -13 -56 -194 105 -175 7 127 92 90 76 198 77 -14 136 262 -30 -132 22 -234 -150
7956 -150 80 24 -214 165 188 88 -136 -41 -132 -56 37 124 117 -224 -201 77 136 -75 100 10 42 35 60 -30 27 197
7982 197 379 -34 196 -36 155 5 56 71 87 19 3 -61 31 197 20 -126 87 20 -100 -53 61 49 -227
8005 -227 -45 35 19 -133 26 -160 142 90 42 -117 -130 -107 -36 93 -29 0 -83 78 75 204 -36 -36 -1 -116 -154
8030 -154 20 -45 -66 -20 265 340 100 -2 -36 -123 -58 91 -31 269 -48 -138 -146 261 135 9 -130 -24 52 161
8054 161 -42 -65 43 223 -142 -3 130 296 34 97 -118 -71 47 77 -114 -147 8 53 -6 -125 61 2 70
8077 70 22 -73 -106 99 -318 220 -147 -76 -120 -317 -72 -120 84 -56 196 38 -316 -18 -64 -26 0 43 116 -32
8101 -32 27 145 25 -286 154 -116 7 -126 55 77 135 174 112 -2 102 -60 -7 -113 7 -28 -159 -8 -43
$$ packed form
7934A60l25L22j70m3j38K99k80J82J20l5kj4J22j21r1J50J26k92j02J54k56Q4
7956a50K30n6k38L79K3j00k24R5r1P6R3Q7pl41K3K78N9k11J75r0L2pK5r0N7J70
7982A97J82m13K30k32J91j50N1J5J6o8j6o4R2J66j77j46K13o7j20M7J14j2k76
8005b27J82Q0j6j52J59j86L02n2m8j59j3K3P1J29j22K9q3J61lJ29k40%L5j15l8
8030a54J74o5k1M6K85P5k40j02l4q7O5J49j22L00l17r0qM07j26j26j39J06P6J09
8054A61k03k3J08J80l65J39J33J66k62O3k15M7J18L0j91l3J55M5n9j19J86n9O8
8077G0m8r5l3K05m17N38l67P1m4j97K45m8K04j40K52j58l54K98m6L8K6M3P3j48
8101c2N9J18j20l11M40k70J23j33J81K2N8L9o2j14J04j62N3j06J20l5j31J51l5
$$ plain form
8124 -43 152 -195 217 -149 -167 166 15 -222 168 -127 -19 104 271 -167 -114 117 19 100 63 -60 -137 -39 -45
8147 -45 -25 129 -159 -112 27 -15 189 22 -119 -187 120 52 -2 31 215 272 110 48 -210 24 55 145 -192 -96
8171 -96 -15 -121 244 106 -154 -50 296 53 135 84 19 -99 -277 -130 8 -165 -348 -90 -74 312
$$ packed form
8124d3J95l47M12l66j8L33j51k37L90k95J08J23J67m38N3K31r8Q1l7j23p7R8o
8147d5K0J54k88M7J39m2K04j67j41o8L07o8n4L3J84N7j62o2k58K34L1R0l37R6
8171i6Q1j06L65j38k60J04L46k43Q2n1o5j18j78J47J38j73j83K58J6L86
8191C12
$$ Imaginary data points
##PAGE= N=2
##DATA TABLE= (X++(I..I)), XYDATA
$$ plain form
0 0 0 0 0 0 0 0 0 0 0 0 0 0 -8 8 -8 8 -16 16 -16 24 -28 32 -40 48 -56 64 -72 88 -97 112 -129 148 -168 190
34 190 -214 241 -270 302 -338 376 -420 464 -516 571 -630 695 -768 847 -932 1026 -1130 1245
52 1245 -1372 1516 -1675 1856 -2059 2296 -2572 2895 -3287 3765 -4373 5166 -6252 7826 -10329
67 -10329 14918 -26045 109856 107110 2646 171947 -28520 51823 138234 -24242 109798
78 109798 78770 -55612 125324 -1718 -7428 116873 -61962 28595 70165 -66345 90540
89 90540 18114 -56956 81735 -48901 -5193 95948 -54073 62268 41068 -61168 89658
100 89658 1069 -5004 111198 -25419 47740 91732 -31309 99742 47677 -13623 122211
111 122211 10654 46760 122619 -11650 76933 70908 -19887 111518 39137 14744 113725
$$ packed form
0@%%%%%%%%%%%%qJ6j6J6k4L2l2M0n2O0p2Q8j04J20j36J60j85K09k41K77l16L58
34A90m04M55n11N72o40P14p96Q84r80J087j201J325j463J615j779J958k156K375
52A245k617K888l191L531l915M355m868N467o182P052q138R539j1418J4078j8155
67a0329K5247m0963J35901k746j04464J69301k00467Q0343Q6411j62476J34040
78A09798l1028j34382J80936j27042n710J24301j78835R0557M1570j36510J56885
89I0540p2426p5070J38691j30636M3708J01141j50021J16341k1200j02236J50826
100H9658q8589o073J16202j36617P3159M3992j23041J31051n2065o1300J35834
111A22211j11557L6106P5859j34269Q8583o025r0795J31405p2381k4393R8981
$$ plain form
122 113725 -14077 41279 77860 -28943 74287 32994 -21580 81264 -6272 6505 67943
133 67943 -43195 28582 28276 -40597 62121 -2497 -17088 50029 -41351 7837 36052 -39248
145 -39248 44698 7932 -29616 54805 -24499 4355 47256 -35707 37562 25322 -23429 60479
157 60479 -2212 -5380 57707 -27559 30765 45753 -25901 57311 8970 -15591 59339 -16696
169 -16696 13124 50810 -31085 38298 21745 -30188 52933 -13794 -9040 46891 -33774 19801
181 19801 25731 -38664 35040 -6575 -28686 43404 -30765 1026 30159 -45223 24702 1325
193 1325 -35684 38348 -22716 -13559 36419 -40526 13500 17511 -43436 36499 -10143 -23508 43007
206 43007 -31822 2962 29891 -41552 26745 8288 -34274 44409 -19507 -12208 40629 -38636
$$ packed form
122A13725j27802N5356L6581j06803J03230m1293n4574J02844q7536J2777O1438
133F7943j11138P1777l06o8873J02718o4618j4591O7117r1380M9188K8215p5300
145c9248Q3946l6766l7548Q4421p9304K8854M2901q2963P3269j2240m8751Q3908
157F0479o2691l168O3087q5266N8324J4988p1654Q3212m8341k4561P4930p6035
169a6696K9820L7686q1895O9383j6553n1933Q3121o6727M754N5931q0665N3575
181A9801N930o4395P3704m1615k2111P2090p4169L1791K9133p5382O9925k3377
193A325l7009P4032o1064R157M9978p6945N4026M011o0947P9935m6642j3365O6515
206D3007p4829L4784K6929p1443O8297j8457m2562P8683o3916P299N2837p9265
$$ plain form
218 -38636 15944 20803 -38228 35086 -4510 -25194 41221 -28200 -1329 31606 -40188 24856
230 24856 6724 -32259 36695 -18032 -13001 33880 -33623 10638 17990 -37113 30337 -7191
242 -7191 -22584 35595 -28190 1392 23649 -35736 20572 3807 -30333 33304 -18392 -12470
254 -12470 30643 -36215 10951 12199 -35860 27190 -9267 -22768 30676 -28501 -4414 21467
266 21467 -38648 17982 1547 -31079 29117 -21148 -13511 23950 -33209 6634 11549 -33324
278 -33324 23916 -9198 -21989 28123 -28365 304 18029 -31590 19231 457 -24733 27053
290 27053 -18593 -8325 25857 -29912 14425 10506 -28775 27562 -11629 -15063 28423 -24603
302 -24603 5002 20127 -31031 21563 -130 -24966 30949 -19365 -5077 26292 -29692 12612
$$ packed form
218c8636N4580M859n9031P3314l9596k0684O6415o9421K6871L2935p1794O5044
230B4856j8132l8983O8954n4727N031M6881o7503M4261P352n5103O7450l7528
242g191j5393N8179o3785K9582K2257n9385N6308j6765l4140O3637n1696N922
254a2470M3113o6858M7166J248m8059O3050l6457j3501N3444n9177K4087K5881
266B1467o0115N6630j6435l2626O0196n0265P637L7461n7159L9843M915m4873
278c3324N7240l3114j2791N0112n6488K8669J7725m9619N0821j8774k5190N1786
290B7053m5646J0268L4182n5769M4337l919l9281N6337l9191l434M3486n3026
302b4603K9605J5125n1158N2594k1693k4836N5915n0314J4288L1369n5984M2304
$$ plain form
314 12612 9336 -30108 24835 -9070 -17854 29891 -25699 1888 17671 -32844 18209 -1857
326 -1857 -24152 26509 -17707 -9171 22222 -31283 8265 7244 -30784 23728 -11853 -16424 23783
339 23783 -27695 -383 13277 -31902 16802 -1390 -24583 26161 -20649 -8554 20733 -30666
351 -30666 11097 8036 -26189 23566 -8094 -16724 25922 -23280 1610 19282 -27100 20250
363 20250 2378 -20358 25536 -13638 -6117 23526 -21954 10466 12820 -23389 22915 -5990
375 -5990 -13385 24472 -18485 4047 16249 -22198 15150 783 -19097 22055 -13607 -4510 19819
388 19819 -23652 10480 5046 -21770 19163 -9380 -11469 20920 -19688 2717 12625 -25444 15644
401 15644 -3027 -17315 22233 -15280 -3504 16489 -23579 8418 5759 -21946 19817 -8596
$$ packed form
314A2612l276l9444N4943l3905q784M7745n5590K7587J5783n0515N1053k0066
326a857k2295N0661m4216Q536L1393n3505L9548j021l8028N4512l5581m571M0207
339B3783n1478K7312J3660m5179M8704j8192k3193N0744m6810J2095K9287n1399
351c0666M1763l061l4225M9755l1660q630M2646m9202K4890J7672m6382M7350
363B0250j7872k2736M5894l9174P521K9643m5480L2420K354l6209M6304k8905
375e990p395L7857m2957K2532J2202l8447L7348j4367j9880M1152l5662R097K4329
388A9819m3471L4132n434k6816M0933k8543k089L2389m0608K2405R908l8069M1088
401A5644j8671j4288L9548l7513J1776J9993m0068L1997k659k7705M1763k8413
$$ plain form
413 -8596 -11992 20386 -20924 2999 10527 -22822 13978 -1775 -15523 19936 -14415 -4973 15555
426 15555 -23112 10542 4622 -18676 19425 -10366 -9298 17968 -19167 4609 11271 -21604 17371
439 17371 -2525 -14530 22600 -16363 -787 16557 -21275 13262 6263 -18968 21106 -8998
451 -8998 -9983 22537 -19109 6251 13253 -22396 16634 -1274 -15585 21073 -13347 -4747 17837
464 17837 -21625 9023 6644 -21590 17228 -8452 -11634 18101 -17216 422 10435 -22073
476 -22073 10916 -498 -17182 18126 -13844 -5850 13847 -20573 6522 4486 -19111 14041
488 14041 -6566 -11860 17497 -16953 291 10359 -20900 12162 -113 -14489 16784 -10778
500 -10778 -5854 15075 -16803 6374 7810 -17473 15093 -4215 -9544 16589 -12025 640 10939
$$ packed form
413h596l396L2378m1310K3923P528l3349L6800j5753j3748L5459l4351R442K0528
426A5555l8667L3654n920k3298L8101k9791J068K7266l7135K3776O662l2875L8975
439A7371j9896j2005L7130l8963J5576J7344l7832L4537o999k5231M0074l0104
451h998r85L2520m1646K5360P002l5649L9030j7908j4311L6658l4420Q600K2584
464A7837l9462L0648k379k8234L8818k5680l182K9735l5317J7638J0013l2508
476b2073L2989j1414j6684L5308l1970P994J9697l4420K7095k036k3597L3152
488A4041k0607n294K9357l4450J7244J0068l1259L3062j2275j4376L1273k7562
500a0778M924K0929l1878K3177J436k5283L2566j9308n329K6133k8614J2665J0299
$$ plain form
513 10939 -14623 9590 3373 -12068 14630 -7037 -3792 13246 -12010 6318 5697 -11285 11227
526 11227 -2210 -5900 12442 -8921 1819 8437 -11685 9737 -280 -7514 12005 -7622 -280
539 -280 9197 -10979 6463 3135 -10399 11789 -5335 -3880 11371 -11120 4191 5025 -11247
552 -11247 9410 -1886 -7346 11212 -8557 -453 8303 -11913 7533 620 -8877 10236 -6342
565 -6342 -2485 8836 -9788 4168 4211 -10183 10425 -3765 -4446 11319 -9263 3868 6533 -9224
579 -9224 9941 514 -6029 12742 -6538 701 11585 -10851 9654 4112 -8912 13810 -3955
592 -3955 -2658 13904 -9183 4592 9064 -12057 12138 92 -8389 14680 -8554 -271 11404
605 11404 -12189 6724 4380 -11837 11961 -3948 -6290 12935 -11595 2554 7178 -12623 9258
$$ packed form
513A0939k5562K4213o217j5441K6698k1667L245J7038k5256J8328o21j6982K2512
526A1227j3437l690J8342k1363J0740O618k0122K1422j0017p234J9519j9627P342
539b80R477k0176J7442l328j3534K2188j7124J455J5251k2491J5311Q34j6272
552a1247K0657j1296n460J8558j9769Q104Q756k0216J9446o913r497J9113j6578
565f342L857J1321j8624J3956M3j4394K0608j4190o81J5765k0582J3131K665j5757
579i224J9165r427o543J8771j9280P239J0884k2436K0505n542j3024K2722j7765
592c955J297J6562k3087J3775M472k1121K4195j2046q481K3069k3234Q283J1675
605A1404k3593J8913k344j6217K3798j5909k342J9225k4530J4149M624j9801K1881
$$ plain form
618 9258 -426 -8748 12115 -7364 -2038 10762 -12192 6544 3635 -10776 12489 -4357 -4391 12062
632 12062 -9972 2859 8010 -11891 10360 461 -8771 13876 -8061 -1125 10639 -12127 6204
645 6204 4254 -11298 10959 -3575 -7123 12582 -10787 1243 7787 -12409 8120 -347 -9447
658 -9447 10277 -6599 -3214 9446 -10682 4114 4150 -10585 10097 -3561 -4543 10150 -7730
671 -7730 2003 6803 -9247 7701 854 -6705 11261 -5841 -98 9263 -9308 6471 3069 -7819
685 -7819 10148 -3208 -3811 10547 -8791 2298 6297 -10725 8541 -1247 -7011 10078 -7018
698 -7018 -1745 7776 -10260 4087 2495 -10212 8715 -4699 -4945 8399 -9626 1223 4029
711 4029 -9971 6046 -1377 -7373 8570 -7240 -1745 6624 -10247 5174 791 -8063 8487
$$ packed form
618I258r684q322K0863j9479N326J2800k2954J8736k909j4411K3265j6846l4J6453
632A2062k2034J2831N151j9901K2251r899r232K2647k1937O936J1764k2766J8331
645F204j950j5552K2257j4534l548J9705k3369J2030O544k0196K0529q467r100
658i447J9724j6876L385J2660k0128J4796L6j4735K0682j3658r82J4693j7880
671g730R733M800j6050J6948o847p559J7966j7102N743R361j8571J5779l402j0888
685g819J7967j3356o03J4358j9338J1089L999j7022J9266r788n764J7089j7096
698g018N273R521j8036J4347j592j2707J8927j3414k46J3344j8025J0849K806
711D029j4000J6017p423n996J5943j5810N495Q369j6871J5421m383q854J6550
$$ plain form
724 8487 -4622 -3590 8141 -8658 2544 4879 -9955 8335 -1645 -5862 9803 -7289 41
737 41 7047 -9283 5486 2401 -8285 10003 -3716 -3319 10041 -8463 3519 5432 -8829 7599
751 7599 -209 -6039 9492 -5407 -923 7934 -8990 5453 2152 -7362 8417 -3483 -2919 7811
765 7811 -7071 1738 4267 -8470 6798 -1111 -5581 8324 -6769 -65 5126 -8606 4444
778 4444 753 -7831 7158 -4499 -3967 7438 -8940 1983 3234 -8830 6218 -1968 -5678 7330
792 7330 -6167 -1293 6077 -8743 4414 1702 -7483 7526 -4000 -2547 6856 -6512 1920 3821
806 3821 -7062 6026 -364 -4838 7937 -5138 782 5389 -6380 5172 1063 -4665 6949
819 6949 -3129 -1205 7079 -6127 3731 3166 -6611 7121 -2148 -2876 7149 -5502 1460 4985
$$ packed form
724H487j3109J032J1731j6799J1202K335j4834J8290r980m217J5665j7092P330
737D1P006j6330J4769l085j0686J8288j3719L97J3360j8504J1982J913j4261J6428
751G599p808n830J5531j4899M484Q857j6924J4443l301r514J5779j1900N64J0730
765G811j4882Q809K529j2737J5268p909m470J3905j5093O704N191j3732J3050
778D444l691q584J4989j1657N32J1405j6378J0923J251j2064J5048q186l710J3008
792G330j3497M874P370j4820J3157k712r185J5009j1526J453R403j3368Q432J901
806C821j0883J3088o390m474J2775j3075N920M607j1769J1552m109n728J1614
819F949j0078J924Q284j3206R858n65r777J3732r269p28J0025j2651O962L525
$$ plain form
833 4985 -6986 5176 870 -6183 7870 -4547 -1546 6250 -7080 3238 2812 -6860 6155 -1565
847 -1565 -4594 7153 -5789 209 4953 -7611 4773 -174 -5623 6191 -3793 -1829 5401 -6784
861 -6784 2124 2460 -7037 6156 -2804 -3386 6070 -6006 952 3718 -6717 4634 378 -5724 7019
876 7019 -4303 -1244 6191 -7007 3771 2357 -6031 6530 -1518 -3043 7301 -4835 1030 5458
890 5458 -6634 5529 1006 -4391 7012 -2658 -1065 6423 -4791 2532 3577 -5467 6015 -820
904 -820 -2884 6492 -4286 1106 3783 -5136 3887 736 -3930 5558 -3186 -1111 4895 -6073 2952
919 2952 1016 -5332 5122 -2387 -2378 4848 -5099 707 3091 -6154 4187 -740 -4311 5544 -4489
934 -4489 -855 3913 -5655 2550 1520 -4803 4846 -1885 -2827 5112 -4865 1371 2605 -4859 4110
$$ packed form
833D985j1971J2162m306p053J4053j2417L001P796j3330J0318m26r672J3015p720
847a565l029J1747j2942N998M744j2564J2384m947n449J1814r984J964P230j2185
861f784Q908L36r497J3193q960n82R456j2076O958K766j0435J1351m256o102J2743
876G019j1322L059P435j3198J0778j414q388J2561q048j525J0344j2136N865M428
890E458j2092J2163m523n397J1403r670J593P488j1214P323J045r044J1482o835
904h20k064R376j0778N392K677q919R023l151m666R488q744K075O006j0968R025
919B952j936o348J0454p509RP226r947N806K384r245J0341m927l571R855j0033
934d489L634M768r568Q205j030o323R649o731r42P939r977O236J234p464Q969
$$ plain form
949 4110 -529 -2914 4927 -2845 -284 4058 -4910 3585 1260 -3608 5409 -2490 -521 4568 -4107
964 -4107 2585 2748 -4317 5439 -997 -2182 6132 -4407 1862 4057 -4989 4610 487 -3652 6337
979 6337 -2557 -957 5716 -5547 2966 2808 -5527 5884 -1364 -2932 5746 -4333 372 4447 -5721
994 -5721 3576 851 -5062 5776 -3376 -1663 4710 -5498 2048 2233 -5426 4770 -1396 -3757 5568
1009 5568 -4726 371 3453 -6196 3976 20 -4562 5789 -3022 -1869 5503 -5719 2243 2806
1023 2806 -5784 5879 -1444 -3326 6553 -4014 435 4928 -5758 3828 1995 -4948 6628 -2182
1037 -2182 -1945 6348 -4731 2126 3519 -4811 4641 636 -3140 6065 -2624 -476 4760 -4872 3286
1052 3286 1725 -3993 4962 -1791 -1600 4880 -3754 1403 2968 -4754 4298 -776 -2953 5111 -3397
$$ packed form
949D110m639k385P841p772K561M342q968Q495k325m868R017p899J969N089q675
964d107O692J63p065R756o436j185Q314j0539O269K195r046R599m123m139R989
979F337q894J600O673j1263Q513j58q335J1411p248j568Q678j0079M705M075j0168
994e721R297k725n913J0838r152J713O373j0208P546J85p659J0196o166k361R325
1009E568j0294N097L082r649J0172l956m582J0351q811J153P372j1222P962N63
1023B806q590J1663p323j882R879j0567M449M493j0686R586j833o943J1576q810
1037b182K37Q293j1079O857J393q330R452m005l776R205q689K148N236r632Q158
1052C286j561n718Q955o753J91O480q634N157J565p722R052n074k177Q064q508
$$ plain form
1067 -3397 96 3516 -4872 2649 1212 -4561 4464 -2232 -2036 4657 -4901 1373 2285 -5014 3597
1082 3597 -428 -3263 4533 -3131 -989 3998 -4806 2504 1040 -4083 3948 -1985 -1776 4041 -3207
1097 -3207 724 2205 -3864 3136 -472 -2467 4069 -3183 519 2444 -3386 2551 550 -2616 3960
1112 3960 -1614 -1009 4061 -3866 2015 1478 -3382 3922 -907 -1745 4572 -2547 347 3253 -3849 2784
1128 2784 629 -3310 4492 -2373 -781 3720 -3636 1417 1727 -3977 3159 -598 -2630 3919 -3392
1143 -3392 -40 2224 -4029 2262 7 -2983 2939 -2064 -1318 2633 -4012 972 1063 -3962 3202 -1515
1159 -1515 -2100 3038 -3236 92 2089 -3884 2360 -3 -3378 3797 -2620 -704 3296 -3894 1782
1174 1782 1538 -3546 3289 -815 -2231 4160 -2946 394 2940 -4031 2792 528 -2648 3529 -1309
$$ packed form
1067c397L493L420q388P521j437n773R025o696J96O693r558O274R12p299Q611
1082C597m025k835P796p664K142M987q804P310j464n123Q031n933K09N817p248
1097c207L931J481o069P000l608j995O536p252L702J925n830N937k001l166O576
1112C960n574O05N070p927N881n37m860P304m829q38O317p119K894K906p102O633
1128B784k155l939P802o865J592M501p356N053L10n704P136l757k032O549p311
1143c392L352K264o253O291k255k990N922n003P46L951o645M984R1n025P164m717
1159a515n85N138o274L328J997n973O244k363l375P175o417J916M000p190N676
1174A782k44n084O835m104j416O391p106L340K546o971O823k264l176O177m838
$$ plain form
1189 -1309 -780 3428 -2819 1286 1926 -3119 3591 -449 -1588 3320 -2241 802 2402 -2815 2337
1204 2337 592 -2259 3362 -1957 -555 2628 -3352 1905 487 -2789 2879 -1024 -1860 3092 -2876
1219 -2876 244 1951 -3645 2383 -540 -2727 3071 -2120 -834 2684 -3143 817 1271 -3367 2948
1234 2948 -1384 -1839 3044 -2808 487 1621 -3020 1712 171 -2268 3001 -1727 -804 2432 -2838
1249 -2838 1913 786 -2427 3024 -1239 -1018 2591 -2265 870 2022 -2809 2829 -294 -1625 3246
1264 3246 -2159 254 2562 -2826 1739 1280 -2812 3404 -839 -1204 3519 -2676 1038 2152 -2909
1279 -2909 2436 369 -2125 3265 -1384 -741 2871 -2871 1624 1251 -3058 2615 -900 -1170 2351 -2202
1295 -2202 362 1560 -2855 1792 -324 -2305 2524 -2570 -318 1733 -2877 1316 295 -2718 2691
$$ packed form
1189a309N29M208o247M105O40n045O710m040j139M908n561L043J600n217N152
1204B337j745k851N621n319J402L183n980N257j418l276N668l903q36M952n968
1219b876L120J707n596O028k923k187N798n191J286L518n827L960M54m638O315
1234B948m332m55M883n852L295J134m641M732j541k439N269m728R23L236n270
1249b838M751j127l213N451m263K21L609m856L135J152m831N638l123j331M871
1264C246n405K413K308n388M565m59m092O216m243l65M723o195L714J114n061
1279b909N345k067k494N390m649O43L612n742M495l73m309N673l515k70L521m553
1295b202K564J198m415M647k116j981M829n094K252K051m610M193j021l013N409
$$ plain form
1310 2691 -1342 -1603 2481 -2977 638 1515 -3245 2438 -735 -2143 2742 -1732 -535 2223 -2764
1325 -2764 1338 1059 -2757 2617 -890 -915 2396 -1805 596 1463 -2105 2090 644 -1854 2967 -1196
1341 -1196 262 2135 -2055 1808 485 -1584 2391 -902 -377 2624 -2137 1045 1214 -2124 2637
1356 2637 -737 -1150 2432 -1822 142 1668 -2405 1357 358 -2470 2836 -1546 -1042 2176 -2622 740
1372 740 771 -2459 1783 -389 -1841 2124 -1905 -511 1829 -2843 1171 254 -2153 1954 -1099 -1025
1388 -1025 1795 -2257 544 982 -2362 1905 -579 -1201 2498 -1780 246 1534 -2308 1352 258
1403 258 -1944 2877 -1267 -466 2617 -2278 1639 1329 -2138 2559 -191 -1143 2866 -1397 275 2568
1419 2568 -2539 1980 781 -1768 2634 -944 -513 2450 -1652 399 1621 -2262 2012 112 -1651
$$ packed form
1310B691m033k61M084n458L615Q77m760N683l173j408M885m474J197K758m987
1325b764M102k79l816N374l507k5L311m201K401Q67l568M195j446k498M821m163
1341a196J458J873m190L863j323k069L975l293N25L001m761L182J69l338M761
1356B637l374m13L582m254J964J526m073L762r99k828N306m382N04L218m798L362
1372G40L1l230M242k172j452L965m029J394K340m672M014r17k407M107l053P4
1388a025K820m052K801M38l344M267k484o22L699m278K026J288l842L660j094
1403B58k202M821m144Q01L083m895L917l10l467M697k750r52M009m263J672K293
1419B568n107M519j199k549M402l578M31K963m102K051J222l883M274j900j763
$$ plain form
1434 -1651 2529 -1485 -187 1527 -2138 850 572 -1750 1902 -659 -1008 1957 -2190 568 705 -2143
1450 -2143 1726 -491 -1252 1915 -1825 -358 1284 -2200 1064 256 -2246 2202 -1189 -849 1802 -1867
1466 -1867 412 1319 -2058 1513 76 -1640 2399 -1119 -8 1997 -1485 1072 674 -1086 1645
1481 1645 -93 -774 1850 -894 871 1208 -1274 1589 306 -569 1565 -489 86 1411 -1014 1666
1497 1666 553 -986 2031 -713 -118 1869 -1248 1003 446 -1142 1651 -362 -830 1874 -1495 66
1513 66 1072 -1921 1148 339 -1200 1625 -935 -535 1501 -1549 417 541 -1497 1369 -569 -842
1529 -842 1147 -1106 126 749 -1066 694 286 -984 1326 -946 -237 1001 -1358 1079 272 -1073
1545 -1073 1385 -421 -317 1474 -1445 587 1093 -1564 1794 -394 -754 1768 -848 286 1404 -1154
$$ packed form
1434a651M180m014J298J714l665K988k78k322L652k561l49K965m147K758J37k848
1450b143L869k217p61L167l740J467J642l484L264q08k502M448l391L40K651l669
1466a867K279R07l377L571j437j716M039l518J111K005l482K557l98j760K731
1481A645j738o81K624k744J765L37k482K863j283q75K134k054N75J325k425K680
1497A666j113j539L017k744N95J987l117K251n57j588K793k013m68K704l369J561
1513F6J006k993L069q09j539K825k560M00K036l050J966J24k038K866j938k73
1529h42J989k253J232O23j815J760m08j270K310k272P09J238k359K437q07j345
1545a073K458j806J04J791k919K032N06k657L358k188l60K522k616J134J118k558
$$ plain form
1561 -1154 919 545 -1549 2001 -416 -447 1991 -1390 870 1033 -1344 1357 357 -759 1753 -779
1577 -779 -81 1498 -1457 789 348 -1080 1174 -419 -328 1328 -1051 458 924 -1643 1109 -302
1593 -302 -997 1564 -1299 64 754 -1549 587 207 -1293 1157 -674 -806 1452 -1662 460 624
1609 624 -1716 1170 -217 -1141 1399 -958 -632 1266 -1590 727 417 -1372 1130 -407 -555 1281
1625 1281 -1244 199 1081 -1093 879 -73 -955 1329 -702 167 936 -1077 860 -49 -733 1001 -642
1642 -642 -298 1338 -1227 900 493 -1476 1392 -315 -601 1252 -691 412 1188 -1352 789 265
1658 265 -1037 1590 -705 -248 1296 -1145 419 610 -1629 932 -245 -1135 974 -947 -456 602
1674 602 -1247 676 -288 -1117 670 -718 -703 773 -1253 59 124 -1471 832 -840 -626 744 -1157
$$ packed form
1561a154K073l74k094L550k417l1K438l381K260J63k377K701j000j116K512k532
1577g79O98J579k955K246m41j428K254j593R1J656k379J509M66k567K752j411
1593c02o95K561k863J363O90k303K136l80j500K450j831j32K258l114K122J64
1609F24k340K886j387r24K540k357L26J898k856K317l10j789K502j537j48J836
1625A281k525J443Q82k174J972r52q82K284k031Q69P69k013J937r09o84J734j643
1642f42L44J636k565K127m07j969K868j707k86J853j943J103P76k540K141n24
1658B65j302K627k295M57J544k441J564J91k239K561j177q90K109j921M91J058
1674F02j849J923r64q29J787j388J5J476k026J312O5j595K303j672K14J370j901
$$ plain form
1691 -1157 64 618 -1167 812 -131 -1177 1294 -857 -368 1198 -1506 593 428 -1086 1087 -46
1707 -46 -676 1312 -827 118 1148 -1264 1132 74 -871 897 -478 -549 1060 -891 415 663 -1172
1724 -1172 1284 -274 -576 945 -372 -10 748 -788 582 63 -929 1088 -702 -355 813 -1215
1740 -1215 478 77 -1123 947 -715 -725 770 -1066 52 689 -1454 501 -389 -1031 858 -1020
1756 -1020 -382 695 -1145 48 483 -1267 575 -655 -953 974 -1043 -66 538 -1097 414 -42
1772 -42 -797 782 -530 -284 883 -922 559 169 -686 1095 -294 75 1079 -875 489 624 -926
1789 -926 1104 -140 -229 1476 -883 499 831 -932 786 320 -667 1075 -388 -403 1200 -973 211
1806 211 551 -898 744 -84 -1042 395 -553 -494 698 -1017 323 402 -1052 898 -741 -374 393 -798
$$ packed form
1691a157J221N54j785J979r43j046K471k151M89J566k704K099j65j514K173j133
1707d6o30J988k139R45J030k412K396j058r45J768j375p1J609j951J306K48j835
1724a172K456j558l02J521j317L62P58j536J370n19r92K017j790L47J168k028
1740a215J693m01j200K070j662j0J495j836J118O37k143J955q90o42J889j878
1756a020O38J077j840J193M35j750J842j230k98J927k017R77O04j635J511m56
1772d2p55J579j312K46J167j805J481l90q55J781j389L69J004j954J364J35j550
1789i26K030j244q9J705k359J382L32j763J718m66r87J742j463j5J603k173J184
1806B11L40j449J642q28r58J437r48N9J192j715J340P9j454J950j639L67P67j191
$$ plain form
1824 -798 -47 258 -871 442 -33 -700 885 -870 -174 518 -992 536 -180 -787 799 -553 -433
1841 -433 595 -931 286 576 -1099 1027 -313 -654 1107 -577 -54 806 -779 695 645 -949 1124
1858 1124 -115 -225 1294 -444 441 465 -681 532 346 -646 679 -562 -181 613 -640 462 28
1875 28 -436 444 -373 -157 587 -715 183 274 -828 782 -211 -314 484 -941 -64 452 -898 219 84
1894 84 -699 761 -851 -494 595 -763 420 -65 -492 517 -119 -552 574 -686 -273 561 -979
1911 -979 515 -118 -480 672 -141 41 335 -378 251 124 -610 622 -177 -151 833 -468 385 315 -592
1930 -592 842 -32 -387 941 -544 239 939 -691 796 210 -541 721 -291 -441 805 -629 312
1947 312 888 -998 765 134 -549 953 -445 62 476 -780 183 426 -639 728 -203 -433 874
$$ packed form
1824g98P51L05j129J313m75o67J585j755O96O92j510J528p16o07J586j352J20
1841d33J028j526J217K90j675K126j340l41J761j684N23Q60j585J474n0j594K073
1858A124j239j10J519j738Q85K4j146J213j86r92J325j241L81P94j253J102m34
1875B8m64Q80q17K16P44j302Q98R1j102J610r93j03P98j425Q77N16j350J117j35
1894H4p83J460j612L57J089j358J183m85m27J009o36m33J126j260M13Q34j540
1911i79J494o33l62J152q13J82K94p13O29j27p34J232p99K6R84j301Q53p0r07
1930e92J434q74l55J328j485P83P00j630J487n86p51J262j012j50J246j434R41
1947C12N76j886J763o31o83J502j398N07M14j256R63K43j065J367r31k30J307
$$ plain form
1964 874 -676 393 242 -617 421 -253 -628 371 -508 -270 357 -800 204 7 -315 722 -666 -284
1982 -284 337 -606 304 370 -1024 551 -70 -693 871 -718 128 448 -809 632 313 -576 962 -46
2000 -46 -281 945 -628 386 636 -618 722 479 -87 730 -186 -241 783 -516 414 180 -468 677
2018 677 -169 67 646 -465 325 142 -485 243 -64 -434 680 -540 208 424 -627 463 -181 -462
2036 -462 763 -179 -166 523 -734 44 374 -970 863 260 -316 531 -400 -121 255 -770 200 156 -821
2055 -821 634 -334 -199 463 -591 231 74 -612 244 96 -314 294 -350 2 259 -557 549 -229 -234 448
2075 448 -92 -135 444 -530 308 381 -522 902 -222 -136 719 -433 339 615 -489 441 204 -344 806
2094 806 -261 -317 669 -462 167 266 -267 571 -169 -320 423 -320 -148 302 -662 276 77 -408 377 -427
$$ packed form
1964H74j550J069j51q59J038o74l75R99q79K38O27j157J004j97l22J037j388L82
1982b84O21r43R10O6j394J575o21o23J564j589Q46L20j257J441l19q89J538j008
2000d6k35J226j573J014K50j254J340k43n66Q17r16n5J024j299R30k34o48J145
2018F77q46K36N79j111P90j83o27P28l07l70J114j220P48K16j051J090o44k81
2036d62J225r42J3O89j257P78L30j344J833o03n76Q47r31K79L76j025R70m4r77
2055h21J455r68J35O62j054Q22j57o86Q56j48m10O08o44L52K57q16J106p78nO82
2075D48n40m3N79r74Q38P3r03J424j124Q6Q55j152P72K76j104R30k37n48J150
2094H06j067n6R86j131O29R9n33Q38p40j51P43p43J72M50r64R38j99m85P85q04
$$ plain form
2114 -427 -114 442 -397 103 -191 -572 450 -237 -89 409 -511 47 213 -510 87 -226 -435 582 -323
2133 -323 93 264 -927 414 363 -399 705 -254 -173 416 -467 235 548 -476 213 73 -530 767 -249
2152 -249 -39 439 -166 -61 305 -145 300 308 -459 564 -216 287 120 -595 382 -16 -239 398 -302 38
2172 38 484 -418 372 -113 -177 357 -291 18 500 -320 1 218 -390 325 -17 -579 596 -528 -168 529
2192 529 -567 369 58 -558 382 -225 -215 419 -459 -29 257 -455 246 -131 -156 158 -122 -263 -15 -230
2212 -230 20 -13 -245 556 -250 -37 389 -346 211 56 -193 685 87 -151 673 -385 305 457 -431 450
2232 450 391 -258 561 -119 -63 640 -298 61 442 -511 361 18 -431 519 -25 38 320 -309 285 260 -388
2253 -388 116 -421 -315 181 -349 178 49 -368 307 -62 -352 473 -286 -303 254 -553 -21 -334 -471 165
$$ packed form
2114d27L13N56q39N00k94l81J022o87J48M98r20N58J66p23N97l13k09J017r05
2133c23M16J71j191J341n1p62J104r59Q1N89q83P02L13j024O89j40o03J297j016
2152b49K10M78o05J05L66m50M45Qp67J023p80N03j67p15R77l98k23O37p00L40
2172C8M46r02P90m85o4N34o48L09M82q20L21K17o08P15l42n62J175j124L60O97
2192E29j096R36l11o16R40o07J0O34q78M30K86p12P01l77k5L14k80j41K48k15
2212b30K50l3k32Q01q06K13M26p35N57j55k49Q78n98k38Q24j058O90J52q88Q81
2232D50n9o49Q19o80N6P03r38L59L81r53Q72l43m49R50n44O3K82o29N94k5o48
2253c88N04n37J06M96n30N27j29m17O75l69k90Q25p59j7N57q07N32l13j37O36
$$ plain form
2273 165 -212 -44 204 -601 111 143 -439 359 32 -498 415 -513 189 294 -452 195 31 -595 476 -140
2293 -140 -113 605 -404 293 184 -201 324 84 -54 308 83 -86 421 -161 186 -2 -23 297 -213 165
2313 165 381 -490 84 350 -587 699 -160 -117 529 -192 202 167 -403 277 -60 -362 518 -472 -37 402
2333 402 -600 57 182 -382 394 -205 -209 63 -553 -299 315 -551 181 105 -295 327 -501 -304 224 -352 44
2354 44 58 -262 283 -285 -177 124 -181 186 23 -337 192 -269 -229 368 -444 -73 490 -387 402 284 -310
2375 -310 330 -250 -155 381 -244 109 381 -541 551 33 -225 449 -362 -176 241 -181 151 452 -136 246
2395 246 43 -271 294 -213 -41 236 -397 261 -101 -156 85 -65 -186 86 -179 143 97 -72 326 -298 -97
2416 -97 164 -393 -13 102 -348 47 -101 -386 271 -233 5 201 -251 109 3 -261 43 -188 -227 247 -182
$$ packed form
2273A65l77J68K48q05P12L2n82P98l27n30R13r28P02J05p46O47j64o26J071o16
2293a40K7P18j009O97j09l85N25k40j38L62k25j69N07n82L47j88k1L20n10L78
2313A65K16q71N74K66r37J286q59M3O46p21L94l5n70O80l37l02Q80r90M35M39
2333D02j002O57J25n64P76n99mK72o16K54O14q66P32p6m00O22q28J97N28n76L96
2354D4J4l20N45n68J08L01l05L67j63l60N29m61M0N97q12L71N63q77P89j18n94
2375c10O40n80R5N36o25L53K72r22J092n18k58O74q11J86M17m22L32L01n88L82
2395B46k03l14N65n07J72K77o33O58l62n5K41j50j21K72k65L22m6j69L98o24K01
2416i7K61n57L80J15m50L95j48k85O57n04K38J96m52L60j06k64L04k31l9M74m29
$$ plain form
2437 -182 -227 326 -278 212 294 -147 454 -175 -85 174 -69 63 186 -38 219 -54 -143 354 -302 359 195
2458 195 -237 362 -150 -23 431 -267 127 400 -180 386 267 -339 371 -146 -37 135 -167 -120 38 -241
2478 -241 164 229 -453 485 -431 -82 195 -309 -173 264 -341 86 140 -451 12 -353 110 -201 -50 233 17
2499 17 -89 106 -226 -112 54 -268 238 -240 -154 346 -235 14 -49 -166 69 243 -113 142 -37 -179 517
2520 517 -307 395 343 -338 118 273 -100 399 -90 -19 335 -110 68 314 -75 280 35 -208 348 -105 115
2541 115 167 -245 329 140 -115 292 21 -127 150 -158 10 -145 -86 78 -111 -199 40 -343 -141 165 -401
2562 -401 340 -122 -168 109 -210 18 272 -417 2 178 -421 130 -272 -113 135 43 36 -20 -276 -163 136 -269
2584 -269 353 -219 59 144 85 -108 -181 -91 -24 38 51 265 -200 225 342 -321 242 136 -80 334 115 -23
$$ packed form
2437a82m5N53o04M90Q2m41O01o29R0K59k43J32J23k24K57k73q9M97o56O61j64
2458A95m32N99n12J27M54o98L94K73n80N66j19o06P10n17J09J72l02M7J58k79
2478b41M05O5o82R38r16L49K77n04J36M37o05M27N4n91M63l65M63l11J51K83k16
2499A7j06J95l32J14J66l22N06m78Q6N00n81K49o3j17K35J74l56K55j79j42O96
2520E17q24P02n2o81M56J55l73M99m89P1L54m45J78K46l89L55k45k43N56m53K20
2541A15N2m12N74j89k55M07k71j48K77l08J68j55N9J64j89q8K39l83K02L06n66
2562d01P41m62m6K77l19K28K54o89M19J76n99N51m02J59K48r2pn6k56J13K99m05
2584b69O22n72K78Q5n9j93p3R0O7O2J3K14m65M25J17o63N63j06k16M14k19j38
$$ plain form
2606 -23 280 -262 156 74 -184 403 161 -153 243 -252 64 342 -137 183 -94 -50 379 -102 -127 340 -390
2627 -390 -67 293 -270 147 47 -292 57 -270 -23 63 -429 205 126 89 -6 -310 69 146 -409 85 29 -149
2649 -149 257 -282 61 42 -270 439 -154 -427 249 -124 31 78 -37 32 289 -196 315 80 -132 311 -11
2670 -11 -63 366 -225 108 415 -200 182 245 -81 195 128 -64 88 -236 -41 365 -216 333 113 71 434 -92
2692 -92 240 86 -45 -91 -83 40 56 -168 -159 147 -355 160 -1 -40 248 -183 -147 270 -221 -158 9 -178 151
2715 151 26 -65 120 -425 125 296 -283 -13 173 -313 335 260 -139 106 -217 137 230 -284 96 -64 -115
2736 -115 302 50 2 134 -99 18 10 64 173 -174 347 124 -328 166 21 -169 76 166 -144 224 -107 -38
2758 -38 231 -85 452 170 -191 294 -303 -75 237 -66 103 162 -214 244 42 -295 -172 82 77 -18 -102 -406
$$ packed form
2606b3L03n42M18q2k58N87k42l14L96m95L16K78m79L20k77M4M29m81k5M67p30
2627c90L23L60n63M17j00l39L49l27K47Q6m92O34p9l7r5l04L79P7n55M94n6j78
2649a49M06n39L43j9l12P09n93k73O76l73J55M7j15O9K57m85N11k35k12M43l22
2670a1n2M29n91L33L07o15L82O3l26K76o7j92J52l24J95M06n81N49k20m2L63n26
2692i2L32j54j31m6QJ23J6k24RL06n02N15j61l9K88m31L6M17m91O3J67j87L29
2715A51j25r1J85n45N50J71n79K70J86m86O48p5l99K45l23L54R3n14L80j60n1
2736a15M17k52m8J32k33J17qN4J09l47N21k23m52M94j45j90K45R0l10L68l31O9
2758c8K69l16N37k82l61M85n97K28L12l03J69N9l76M58k02l37J23K54nr5q4l04
$$ plain form
2780 -406 56 -337 318 -111 -221 -12 -258 -81 -236 -257 90 -136 -159 18 -193 -127 84 -455 248 -124 -176
2801 -176 124 -44 -201 230 -28 -64 121 -283 119 -58 -99 35 -200 384 18 40 36 -262 27 187 -239 98
2823 98 189 -233 336 372 -30 -100 321 12 127 -33 -104 318 -160 -180 -144 323 43 -148 160 -99 136 -21
2845 -21 26 -58 24 -67 -187 495 -147 61 -25 -86 186 -29 -65 -80 -237 -42 310 -262 -71 109 -96 29 -170
2868 -170 -267 66 -198 -317 262 -209 55 109 33 -52 -293 201 214 128 -107 43 79 29 -254 -1 245 -279 47
2891 47 -73 -140 171 60 234 74 -136 21 297 -149 97 -67 37 41 -11 196 207 53 243 234 -120 271 3
2914 3 -273 197 -21 229 245 -138 -7 115 -78 -112 -111 -259 183 -25 171 -122 -113 138 90 54 -103 -328 131
2937 131 -166 -67 -28 -89 50 78 -61 -138 90 -230 289 74 -110 21 166 -143 -27 -40 -51 42 -243 293 -1
$$ packed form
2780d06M62l93O55m29j10K09k46J77j55k1L47k26k3J77k11O6K11n39P03l72n2
2801a76L00j68j57M31k58l6J85m04M02j77m1J34k35N84l66K2mk98K89J60m26L37
2823I8R1m22N69L6m02p0M21l09J15j60p1M22m78k0L6M67k80j91L08k59K35j57
2845b1M7q4Q2r1j20O82o42K08q6o1K72k15l6j5j57J95L52n72J91J80k05J25j99
2868a70r7L33k64j19N79m71K64N4p6q5k41M94J3q6k35J50L6n0k83K53K46n24L26
2891D7j20o7L11j11J74j60k10J57K76m46K46j64J04Mn2K07J1j54J90rl54L91k68
2914Ck76M70k18K50J6l83J31J22j93l4Jj48M42k08J96k93RK51m8l6j57k25M59
2937A31k97R9L9o1J39K8j39p7K28l20N19k15j84J31J45l09J16j3j1R3k85N36k94
$$ plain form
2960 -1 -14 113 -44 -142 313 -131 66 139 -221 373 218 200 269 30 -133 36 -55 -48 -1 50 134 58 175 37 -6
2985 -6 262 -27 -198 73 -253 -54 130 36 138 -102 -91 292 -129 -112 81 -184 -199 -93 -291 120 -136 -222
3007 -222 168 -187 -264 -16 -219 -141 -154 -196 -146 76 -470 234 279 93 134 -158 -85 -91 -150 -199 202 -271 26 -94
3031 -94 107 136 -60 -35 13 -176 126 -73 236 50 -143 112 -144 144 251 -72 -68 341 -98 295 13 46
3053 46 162 76 -86 -93 49 -37 113 -101 41 33 -59 135 209 -58 -169 -135 -67 -78 43 -111 35 69 146 -225 213
3078 213 4 -95 -39 -145 -174 30 60 127 8 -218 173 21 -33 138 21 -106 129 -199 27 168 -130 31
3100 31 26 -60 -26 -104 -223 239 -6 222 -115 -110 18 126 150 67 306 -51 69 -23 180 -102 184 78 -31 52
3124 52 300 -91 39 41 -145 178 -134 -77 -97 -19 -127 189 -192 81 -93 -179 31 -499 124 109 -219 4 -74
$$ packed form
2960aj3J27j57r8M55m44J97P3l60N94j55j8O9k39j63J69r1PM7N1Q4p6J17j38m3
2985fK68k89j71K71l26J99J84r4J02k40J1L83m21J7J93k65j5J06j98M11k56q6
3007b22L90l55p7K48k03P8j3m2N0K22n46P04M5j86M1k92P3on9m9M01m73K97j20
3031i4K01K9j96K5M8j89L02j99L09j86j93K55k56K88J07l23MM09m39L93k82L3
3053D6J16q6j62pJ42q6J50k14J42qr2J94P4k67j11L4O8j1J21j54J46L4P7l71M38
3078B13k09r9N6j06k9K04L0O7j19k26L91j52n4J71j17j27K35l28K26J41k98J61
3100C1nq6L4p8j19M62k45K28l37NJ28J08K4q3K39l57J20r2K03k82K86j06j09Q3
3124E2K48l91J30Kj86L23l12N7k0P8j08L16l81K73j74q6K10n30O23j5l28K23p8
$$ plain form
3147 -74 -207 220 -88 -41 85 -91 -271 222 -175 219 -91 -192 37 -117 -313 41 79 -74 -155 -322 9
3168 9 -142 170 -143 153 130 -72 39 138 71 245 196 -62 125 31 -106 227 -249 64 172 -233 171 394
3190 394 -258 -59 226 -99 111 218 -39 285 72 174 -141 -123 -2 71 15 41 114 -365 69 -101 -352 43
3212 43 38 20 -152 -245 175 20 -200 -107 86 -396 48 -12 46 -253 -176 80 -136 -32 54 -122 156 -37 -464
3235 -464 99 -386 51 -52 -19 15 -133 -277 32 113 96 84 -231 400 320 -87 123 -130 -69 325 46 -191
3257 -191 -253 57 181 2 -196 -28 30 116 36 59 320 -57 3 -41 245 127 282 -274 268 7 139 122 95
3280 95 -81 -86 -14 -245 55 -111 -28 74 -101 94 13 -267 11 -188 211 127 -280 -262 117 -377 213 -97 -13
3303 -13 67 59 131 352 -187 -323 103 -250 -25 255 -213 41 -21 -117 -175 -170 -105 -227 -140 130 -227 69 2 -135
$$ packed form
3147g4j33M27l08M7J26j76j80M93l97L94l10j01K29j54j96L54L8j53q1j67L31
3168Ij51L12l13K96k3k02J11R9o7J74m9k58J87r4j37L33m76L13J08m05M04K23
3190C94o52J99K85l25K10J07k57L24k13J02l15J8J21P3n6K6P3m79M34j70k51L95
3212D3nj8j72r3M20j55k20R3J93m82M44o0N8k99P7K56k16J04Q6j76K78j93m27
3235d64N63m85M37j03L3L4j48j44L09Q1j7j2l15O31q0m07K10k53O1L94k79k37
3257a91o2L10J24j79j98J68N8Q6q0K3K61l77O0m4K86j18J55n56N42k61J32j7k7
3280I5j76nP2k31L00j66Q3J02j75J95q1k80K78j99L99q4m07J8L79m94N90l10Q4
3303a3Q0qP2K21n39j36M26l53K25K80m68K54o2r6n8NO5j22Q7K70l57K96o7j37
$$ plain form
3327 -135 97 -271 151 320 -94 152 -97 -151 -84 109 7 -22 -135 192 245 97 141 -225 -118 -5 55 -236
3349 -236 196 -34 -78 17 267 181 125 -236 230 23 57 -74 173 -49 -118 -299 -121 1 -94 47 -347 -377 43
3372 43 -52 14 -187 -238 226 -186 -184 -124 -150 -101 -94 34 57 -24 -126 230 -91 72 287 -315 28 45 -151 -135 -212
3397 -212 -187 -120 -81 -118 147 -276 2 -50 56 138 -40 217 114 51 225 18 47 -29 -63 -16 -97 149 15 32
3421 32 -69 317 96 -292 94 78 52 198 90 172 81 -68 242 -234 161 89 -113 182 205 -22 -122 -59 12
3444 12 156 -132 235 245 -278 170 -10 -159 -173 -30 -59 -205 147 -175 -108 -122 355 3 -104 -17 -134 -25
3466 -25 88 -396 63 -27 -123 159 -117 185 -147 -274 115 124 -19 220 106 -135 319 -144 -73 71 129 105 -192
3489 -192 186 -55 -48 24 -19 227 -29 66 -273 71 -107 -44 58 176 -35 -38 -88 29 345 -91 -46 247 -122
$$ packed form
3327a35K32l68M22J69m14K46k49n4O7J93j02k9j13L27N3j48M4l66J07J13O0k91
3349b36M32k30m4R5K50q6n6l61M66k07L4j31K47k22o9j81J78J22r5J41l94l0M20
3372D3r5O6k01n1M64m12KO0k6M9PJ28K3q1j02L56l21J63K15o02L43J7j96J6p7
3397b12K5O7L9l7K65m23K78n2J06Q2j78K57j03o3J74k07K9p6l4M7q1K46j34J7
3421C2j01L86k21l88L86j6k6J46j08Q2r1j49L10m76L95p2k02K95K3k27j00O3P1
3444A2J44k88L67J0n23M48j80j49j4J43k9j46L52l22O7j4M77l52j07Q7j17J09
3466b5J13m84M59r0r6K82k76L02l32j27L89Rj43K39j14k41M54m63P1J44N8k4k97
3489a92L78k41PP2m3K46k56R5l39L44j78O3J02J18k11ln0J17L16m36M5K93l69
$$ plain form
3512 -122 84 -86 -13 -7 -170 98 62 39 158 51 95 -104 50 -109 -131 -122 35 -130 -138 -127 -169 -129 86 -225 -235
3537 -235 181 -189 -64 -147 96 21 47 93 -181 -167 -114 -151 -295 204 103 6 17 5 19 -10 -86 27 -165 -147 332
3562 332 8 -99 74 41 278 6 -97 -82 -144 78 300 56 179 -148 -163 153 -209 250 -37 -152 5
3583 5 96 31 -17 127 -326 13 76 143 -55 -326 118 -217 -22 86 41 19 -55 -91 -74 -33 -111 65 166 162 95 -230
3609 -230 -83 -139 -287 146 -370 -107 80 139 111 -114 -52 160 180 47 -65 -40 123 149 -35 -219 -20 -92 126
3632 126 -154 -2 97 -57 78 91 130 -183 151 -23 -113 171 -114 94 -32 209 -208 107 152 96 -35 -232
3654 -232 184 -70 -191 -37 -150 31 138 11 -112 32 -31 -20 47 -90 -153 -4 -123 -209 -18 -232 -15 -274
3676 -274 -75 109 -143 -328 272 198 -31 150 -40 71 106 3 -34 -206 56 54 -7 53 109 149 -146 -162 -64 110
$$ packed form
3512a22K06j70P3Oj63K68l6k3J19j07M4j99J54j59k2RJ57j65qJ1m2M0K15l11j0
3537b35M16l70J25q3K43p5K6M6k74J4N3l7j44M99j01r7J1j2J4k9p6J13j92J8M79
3562C32l24j07J73l3K37k72j03J5o2K22K22k44J23l27j5L16l62M59k87j15J57
3583ER1o5m8J44m53L39O3O7j98k71M44l35J95J08m5k2p4l6J7M1p8J76J01mo7l25
3609b30J47n6j48M33n16K63J87N9k8k25O2K12K0j33j12K5J63K6j84j84J99p2K18
3632A26k80J52R9j54J35J3L9l13L34j74r0K84k85K08j26K41m17L15M5n6j31j97
3654b32M16k54j21J54j13J81J07j27j23J44o3J1O7j37o3J49j19q6J91k14K17k59
3676b74J99J84k52j85O00p4k29J81j90J11L5j03l7j72K62ko1O0N6M0k95j6R8J74
$$ plain form
3700 110 -93 120 66 118 -7 -7 265 48 26 203 -35 47 137 379 196 317 -190 -111 88 -98 -66 -58 16 96
3724 96 -25 168 -73 -259 -130 204 17 -192 61 -251 173 37 -217 57 -116 -92 74 -11 -99 -119 13 -43
3746 -43 100 -229 2 92 74 264 -279 4 -193 -112 -32 -71 -170 -6 72 11 -92 127 109 -169 -142 81 137 -24
3770 -24 -8 -254 -147 60 -93 201 -19 164 194 387 86 -31 280 237 4 -150 11 -161 -100 101 337 155
3792 155 -88 -288 243 180 25 82 7 122 -26 -93 207 -237 130 218 -195 -134 -118 50 -3 94 17 -10 -212 -111
3816 -111 -166 -318 7 -111 155 52 -37 65 24 -169 -32 29 -327 -162 -102 35 36 -76 -80 -86 -285 -1 1 63 297
3841 297 -127 -6 98 -24 142 34 -162 116 243 -230 63 -106 34 297 -187 371 -92 -91 -85 75 72 219
3863 219 -89 -109 -50 -78 77 74 -318 220 -81 62 -181 -109 157 -83 79 21 -83 -115 330 -23 23 254 -32
$$ packed form
3700A10k03K13n4N2j25%K72k17k2J77k38Q2R0K42j83J21n07P9J99j86L2QP4Q0
3724I6j21J93k41j86J29L34j87k09K53l12M24j36k54K74j73K4J66q5q8k0J32n6
3746d3J43l29K31R0j8J90n43K83j97Q1Q0l9r9J64P8o1j03K19j8k78K7K23N6j61
3770b4J6k46J07K07j53K94k20J83L0J93l01j17L11m3k33j54J61j72O1K01K36j82
3792A55k43k00N31o3j55N7p5J15j48o7L00m44L67Q8m13O1J6J68n3R7p7k7k02J01
3816a11n5j52L25j18K66j03q9J02m1j93J37O1l56J65O0J37Jj12moj99K84KO2K34
3841B97m24J21J04j22J66j08j96K78J27m73K93j69J40K63m84N58m63JOJ60lJ47
3863B19l08k0N9k8J55ll92N38l01J43k43P2K66k40J62n8j04l2M45l53M6K31k86
$$ plain form
3886 -32 -26 -108 68 -244 260 -22 -38 -41 -63 22 -51 -87 -281 205 2 28 -49 50 -136 -53 15 -78 20 -217 157 155 40
3913 40 189 -37 41 -168 -6 -88 -51 48 86 -38 -199 117 -36 124 38 166 -119 24 287 -14 92 162 12
3936 12 12 -24 96 113 46 64 -234 62 21 23 134 -21 -68 135 -125 -53 121 9 -48 104 -147 66 -165 129
3960 129 178 -110 -54 -1 61 -69 -147 -138 -30 -98 92 18 -231 180 -134 -138 101 -84 24 86 109 -191 -115 -8 48
3985 48 -90 -152 -51 -66 -227 -59 120 122 -150 50 86 155 -121 -129 88 39 120 -197 -37 -64 -230 -25 12 -90
4009 -90 -1 -90 348 -83 174 139 -141 -16 128 -175 -75 164 -175 -79 -166 -27 82 -101 115 -8 171 108
4031 108 -72 -175 -5 -22 36 82 -22 172 188 -288 90 -36 11 122 -153 162 -29 129 -92 -86 -137 46 -51
4054 -51 242 -3 -61 75 -199 91 78 -21 95 -142 -25 270 -104 71 75 -193 -25 62 111 -30 263 -63 154
$$ packed form
3886c2Oq2J76l12N04k82j6lk2Q5p3l6j94M86k03K6p7R9j86Q3O8r3R8k37L74kj15
3913D0J49k26P8k09J62q2L7R9L8j24j61L16j53J60q6J28k85J43K63l01J06P0j50
3936A2%l6J20J7o7J8k98K96m1KJ11j55m7K03k60P2J74j12n7J52k51K13k31K94
3960A29M9k88N6N3O2j30p8RJ08o8J90p4k49M11l14mK39j85J08O2K3l00P6J07N6
3985D8j38o2J01j5j61J68J79Kk72K00L6O9k76qK17m9Q1l17J60k7j66K05L7j02
4009i0Q9q9M38m31K57l5k80J25J44l03J00K39l39R6q7J39J09j83K16j23J79o3
4031A08j80j03J70j7N8M6j04J94J6m76L78j26M7J11k75L15j91J58k21On1J83r7
4054e1K93k45n8J36k74K90j3r9J16k37J17K95l74J75Mk68J68Q7M9j41K93l26K17
$$ plain form
4077 154 -20 -56 40 2 48 -9 58 166 70 90 276 360 -74 2 184 70 -193 -45 123 137 -84 243 125 61
4101 61 70 130 -149 -31 -37 93 122 96 29 -188 -29 51 -148 -61 98 -75 22 -135 -318 -2 -84 71 -104 121
4125 121 -51 148 268 60 -242 -168 260 38 161 44 155 -62 89 53 28 -79 -132 5 -28 45 -9 -10 81
4148 81 31 87 -74 11 402 54 34 -163 -101 -9 62 -182 82 174 56 218 -115 -65 87 11 192 206 -98 160
4172 160 -32 25 2 34 -215 -27 -183 -51 -53 225 -48 35 -128 -63 163 -144 157 79 -179 -90 187 102 -123
4195 -123 74 111 96 83 -230 -120 90 -334 -25 39 -137 -24 -219 48 -79 -270 126 -256 69 -142 50
4216 50 40 41 -84 -24 52 -62 -75 -27 -79 103 116 -53 109 362 -91 -240 176 112 -14 -76 73 40 104 -106 15
4241 15 56 -77 -220 7 35 313 -72 196 47 243 48 276 -169 -44 -48 -46 -102 -53 199 8 -134 -123 103
$$ packed form
4077A54j74l6R6l8M6n7O7J08r6K0J86Q4m34P6J82j14k63J48J68J4k21L27j18o4
4101F1RO0k79J18oJ30K9k6o7k17J59Q0j99Q7J59j73R7j57j83L16q2J55j75K25
4125A21j72J99J20k08l02P4M28k22J23j17J11k17J51l6k5j07n3J37l3P3n4jR1
4148H1n0N6j61Q5L91l48k0j97O2R2P1k44K64R2j18J62l33N0J52p6J81J4l04K58
4172A60j92N7k3L2k49J88j56J32kK78k73Q3j63O5K26l07L01p8k58Q9K77q5k25
4195a23J97L7j5j3l13J10K10m24L09O4j76J13j95K67j27j91L96l82L25k11J92
4216E0j0Jj25O0P6j14j3M8n2J82J3j69J62K53m53j49M16o4j26o2J49l3O4k10J21
4241A5M1j33j43K27K8K78l85K68j49J96j95K28m45J25mKn6M9K52j91j42J1K26
$$ plain form
4264 103 57 -5 -4 113 -57 125 -175 244 122 -104 183 100 7 -5 -66 54 -210 -310 200 142 159 40 -243
4287 -243 68 72 64 50 -71 18 302 -50 307 111 -138 -31 -32 -54 133 72 201 161 3 -63 -42 0 276 57 24
4312 24 388 292 -43 87 28 -98 66 -196 -57 -193 59 99 -38 181 -181 -85 109 -70 -20 153 -73 92
4334 92 -191 52 301 197 19 93 -37 -37 -9 34 -21 20 -292 128 36 -158 195 -226 14 -35 14 -114 -14 -197
4358 -197 143 -33 103 41 -108 -240 -289 65 -20 -77 14 -106 44 31 122 -308 125 255 90 -187 6 145
4380 145 -35 97 35 142 35 14 -28 392 145 60 -114 142 166 355 -217 65 -87 -45 -118 81 39 -82 129
4403 129 -71 195 55 -158 133 57 -211 215 -14 -71 82 -65 214 158 -44 -23 64 133 54 -46 -73 -83 -136
4426 -136 77 -78 -59 -208 217 0 -169 41 -9 -187 -114 16 33 -154 -39 -82 84 18 40 43 107 -62 -103 -44
$$ packed form
4264A03m6o2JJ17j70J82l00M19j22k26K87q3r3j2o1J20k64j00N10n8J7j19k83
4287b43L11Mqj4j21Q9K84l52L57j96k49J07jk2J87o1J29m0j58o6K1M2K76k19l3
4312B4L64r6l35J30n9j26J64k62J39j36K52M0j37K19l62R6J94j79N0J73k26J65
4334I2k83K43K49j04j78P4j30%K8M3n5M1l12M20r2j94L53m21K40m9M9j28J00j83
4358a97L40j76J36o2j49j32m9L54q5n7R1j20J50j3R1m30M33J30j65k77J93J39
4380A45j80J32o2J07j07k1m2M20k47q5j74K56K4J89n72K82j52M2p3J99m2j21K11
4403A29k00K66j40k13K91p6k68M26k29n7J53j47K79n6k02K1Q7O9p9j00k7j0n3
4426a36K13j55J9j49M25k17j69K10n0j78P3J30J7j87J15m3J66o6K2LO4j69m1N9
$$ plain form
4450 -44 285 282 -56 -18 127 -208 -170 178 111 -60 48 -18 -71 -158 276 -217 -116 -42 -114 119 -37 19 61 112 50
4475 50 -56 -33 -22 -297 105 178 30 -3 -29 56 -15 -230 97 -127 -159 -47 147 -124 67 -33 -179 -199 78
4498 78 -32 -76 -57 46 217 201 179 6 76 190 -36 -127 -208 96 30 -31 102 -11 121 120 96 -52 202 59
4522 59 -239 287 294 -89 -51 152 74 164 119 93 59 141 -1 -27 17 184 97 99 72 91 28 -209 288 -168 -161 -164 103
4549 103 253 113 73 -18 -33 72 -41 -141 56 -154 -2 58 92 -50 223 -174 88 -245 -183 -108 54 -96
4571 -96 -48 -160 86 -58 -63 -154 142 -22 62 -161 -193 -81 -103 40 -46 249 178 -29 262 -222 288 -199 -13
4594 -13 -122 -79 -102 -58 -340 121 123 113 251 111 48 -65 247 148 104 -83 171 -61 274 143 22 -350 -108
4617 -108 -102 88 -18 -89 -69 -102 -90 76 -46 133 -31 -124 341 68 -300 -73 -340 -101 31 -38 143 -158 -105
$$ packed form
4450d4L29ll38L8J45l35L8L48o7j71J08o6n3q7M34m93J01P4p2K33j56N6M2N1o2
4475E0j06K3J1k75M02P3j48l3k6Q5p1k15L27k24l2J12J94k71J91j00j46k0K77
4498G8j10m4J9J03J71j6k2j73P0J14k26r1q1L04o6o1J33j13J32jk4j48K54j43
4522E9k98N26Pl83L8K03p8R0m5k6l4Q2j42k6M4J67q7Kk7J9o3k37M97m56PlK67
4549A03J50j40m0r1j5J05j13j00J97k10J52O0L4j42K73l97K62l33O2P5J62j50
4571i6M8j12K46j44nr1K96j64Q4k23l2J12k2J43q6K95p1k07K91m84N10m87J86
4594a3j09M3k3M4k82M61Kj0J38j40o3j13L12r9m4j87K54k32L35j31j21l72K42
4617a08OJ90j06p1K0l3J2J66j22J79j64r3M65k73l68K27k67K39J32o9J81l01N3
$$ plain form
4640 -105 251 43 -92 71 -39 -98 66 -129 78 31 -40 -32 25 -84 17 -9 -40 -154 34 -102 -4 81 -30
4663 -30 -137 -143 89 -44 120 20 40 -168 -12 224 -41 -163 274 73 -21 -110 -187 -73 -152 -199 23 77 248
4686 248 423 234 -74 9 183 189 273 75 97 59 -126 -293 51 -53 -95 55 -110 -81 -165 -35 -182 71 -87
4709 -87 122 -15 -35 293 -215 -10 -53 -74 119 3 -23 -46 -187 7 33 13 94 47 117 -18 -53 170 25 12
4733 12 -12 -49 3 34 -369 -140 -54 -113 -11 -185 174 248 38 -257 -35 -9 -143 -239 -77 71 59 -153 68 106
4757 106 18 144 130 136 -80 47 -17 204 267 -78 -121 -1 -96 58 81 69 322 102 238 3 -100 -1 -14 -362
4781 -362 29 13 46 -155 120 -248 77 -42 -38 -32 135 60 335 -146 23 9 119 222 -187 -30 -11 -169 -127
4804 -127 83 64 260 183 -18 -60 257 105 -101 170 -234 -111 97 12 -65 -50 39 -62 -107 71 -80 143 56
$$ packed form
4640a05L56k08j35J63j10n9J64j95K07m7p1QN7j09J01k6l1j14J88j36R8Q5j11
4663c0j07oK32j33J64j00K0k08J56K36k65j22M37k01r4q9p7J14p9m7K22N4J71
4686B48J75j89l08Q3J74OQ4j98K2l8j85j67L44j04m2J50j65K9q4J30j47K53j58
4709h7K09j37k0L28n08K05m3k1J93j16k6k3j41J94K6k0Q1m7P0j35l5K23j45j3
4733A2k4l7N2L1m03K29Q6n9J02j74L59P4k10k95K22K6j34r6J62J48j2k12K21L8
4757A06q8J26j4Ok16J27o4K21O3l45m3J20r5J54K3j2K53k20J36k35j03R9j3l48
4781c62L91j6L3k01K75l68L25j19MOJ67p5K75m81J69j4J10J03m09J57J9j58M2
4804a27K10j9J96p7k01m2L17j52k06K71m04J23K08q5p7J5Q9j01m5J78j51K23q7
$$ plain form
4827 56 144 28 30 12 -53 -144 -8 100 50 188 -168 81 183 -214 72 -207 139 -34 311 99 19 193 310
4850 310 124 -103 76 277 -46 -23 19 265 -97 -35 164 169 101 -191 51 -127 -117 259 77 -228 10 138
4872 138 68 -92 26 174 151 -56 168 56 -211 35 164 -57 -122 -85 -16 -83 -26 132 -21 -99 100 -270 20
4895 20 -190 173 65 76 -11 -91 -184 26 -65 -39 -81 24 35 65 -154 63 101 179 17 114 -78 38 56 20 146
4920 146 -37 115 100 -49 -176 -113 -228 -206 -274 48 14 -143 -35 16 98 20 119 -3 -136 -139 -340 -37 128 138
4944 138 230 290 -7 160 101 87 -112 84 -31 -19 -21 160 -53 -54 245 -47 -37 -5 98 85 -94 31 -274 -11
4968 -11 -192 -169 -74 125 197 -5 -170 -74 43 -22 -9 -82 -85 -15 -143 42 17 105 -24 364 152 24 -128 138
4992 138 41 68 -81 33 -19 -103 343 -73 101 -51 110 52 115 -176 48 112 198 88 71 -61 -150 113 6
$$ packed form
4827E6Q8j16Kj8o5r1J36J08n0J38l56K49J02l97K86k79L46j73L45k12q0J74J17
4850C10j86k27J79K01l23K3M2K46l62O2J99No8k92K42j78J0L76j82l05K38J28
4872A38p0j60J18J48k3k07K24j12k67K46J29k21o5L7O9o7N7J58j53p8J99l70K90
4895B0k10L63j08J1q7q0r3K10r1K6m2J05J1L0k19K17L8P8j62R7j92J16J8l6J26
4920A46j83J52j5j49j27O3j15K2o8L22l4j57J08N1Q2p8R9j22j33lk01L03J65J0
4944A38R2O0k97J67n9j4j99J96j15J2kJ81k13jK99k92J0L2J03j3j79J25l05K63
4968a1j81K3R5J99P2k02j65R6J17o5J3p3lP0j28J85k5Q8j29L88k12j28j52K66
4992A38r7K7j49J14n2q4M46m16J74j52J61n8O3k91K24O4Q6j10j7j32q9K63j07
$$ plain form
5015 6 -302 110 -49 200 -32 -48 -97 -84 131 -23 -37 -24 -52 80 0 -119 144 14 72 144 -95 118 139 3
5039 3 -95 98 20 -188 153 98 127 -155 66 66 -106 43 12 -99 -124 -175 194 120 -202 -30 71 33 0 -72 42
5064 42 70 -98 74 149 76 94 127 79 108 -244 -95 112 -34 14 -133 -129 94 -67 159 -145 36 82 -160 -39
5088 -39 -143 -194 -105 -116 -44 88 -5 83 -93 226 26 -117 18 -36 -29 212 -28 83 79 10 -86 -138 -15 -95 -85 -106
5114 -106 -188 -130 -185 -95 121 11 99 -27 -89 -4 -76 130 42 -45 -39 -97 -46 8 134 -14 166 15 -1 157 -56
5139 -56 67 -141 -146 19 17 -3 102 68 95 104 -93 -216 -255 180 -247 -182 14 -297 -138 -192 -57 50 -71 -134 -109
5164 -109 43 -177 -167 -138 1 34 -117 113 -222 -135 -17 -44 -70 -175 -8 -5 -27 -48 -21 -96 -18 -170 -71 -194 -70
5189 -70 155 -93 -145 -105 -181 -49 0 255 70 21 195 103 -150 -194 1 20 -60 67 61 -233 71 -115 193 -155
$$ packed form
5015Fl08M12j59K49k32j6m9J3K15j54j4J3k8J32q0j19K63j30N8P2k39K13K1j36
5039Cr8J93p8k08L41n5K9k82K21%j72J49l1j11k5n1L69p4l22J72J01l8l3p2J14
5064D2K8j68J72P5p3J8L3m8K9l52J49K07j46M8j47MK23j61K26l04J81M6k42J21
5088c9j04n1Q9j1P2J32r3Q8j76L19k00j43J35n4PK41k40J11mo9r6n2J23q0J0k1
5114a06q2N8n5R0K16j10Q8j26o2Q5p2K06q8q7On8N1N4J26j48J80j51j6J58k13
5139e6J23k08nJ65kk0J05l4K7Rj97j23l9M35m27O5J96l11J59n4J35J07j21o3K5
5164a09J52k20J0K9J39L3j51K30l35Q7J18k7k6j05J67Lk2k1K7p5P8j52R9j23J24
5189g0K25k48n2M0p6J32M9K55j85m9J74r2k53m4J95J9q0J27ok94L04j86L08l48
$$ plain form
5213 -155 -215 149 54 256 -127 -56 10 66 88 -126 108 -15 19 -22 162 -3 -53 97 60 -11 -86 88 -41 -304
5237 -304 13 171 -165 150 -46 -12 -84 45 -178 30 -46 -4 90 165 -145 -117 -150 -57 25 17 -84 -162 12 -90
5261 -90 -176 -63 -67 64 -217 -72 48 23 -56 178 -46 191 73 73 198 -229 59 322 296 71 -4 54 39 86
5285 86 190 -95 -151 165 -38 194 238 149 -30 -5 -102 -57 -20 124 -29 -2 -129 55 -78 196 99 -64 246
5308 246 122 -157 68 -96 -191 -13 -118 235 -80 -8 -104 62 85 -78 -180 106 -119 173 3 328 -156
5329 -156 0 75 94 35 72 -32 254 -103 -24 188 -46 -6 -191 65 82 106 47 101 9 -16 2 -22 -76 12 -232
5354 -232 115 80 -105 -60 -185 45 -17 -173 38 99 -47 210 -118 163 -44 233 -28 56 -1 -24 -44 74 -101
5377 -101 101 -30 -247 -165 -67 11 -194 -29 -74 -137 -41 -144 -240 -108 -16 -128 7 89 -79 -128 -151 12 -69 142
$$ packed form
5213a55o0L64r5K02l83P1O6N6K2k14K34j23L4m1J84j65n0J50l7p1p5J74j29k63
5237c04L17J58l36L15j96L4p2J29k23K08p6M2R4P5l10K8l3R3Q2qj01p8J74j02
5261i0q6J13mJ31k81J45J20k5p9K34k24K37j18%J25m27K88K63k6k25p5N8j5M7
5285H6J04k85n6L16k03K32M4q9j79K5r7M5L7J44j53K7j27J84j33K74r7j63L10
5308B46j24k79K25j64r5J78j05L53l15P2r6J66K3j63j02K86k25K92j70L25m84
5329a56J56P5J9n9L7j04K86l57P9K12k34M0j85K56J7K4n9N4r2k5J8k4n4Q8k44
5354b32L47l5j85M5j25K30o2j56K11O1j46K57l28K81k07K77k61Q4n7k3k0J18j75
5377a01K02j31k17Q2R8P8k05J65m5o3R6j03r6J32R2j12J35Q2j68m9k3J63q1K11
$$ plain form
5401 142 -158 16 40 -96 -3 -50 -99 -26 6 103 53 84 132 298 27 -168 179 138 40 -222 -173 -42 97 -49
5425 -49 -36 162 -77 -35 29 29 179 5 98 129 119 -127 -90 -138 128 -129 32 71 -153 98 -61 -213 -143 -184 109
5450 109 -180 -15 5 184 -29 -77 93 119 69 68 -52 -77 100 106 -7 -12 -76 99 58 -50 -19 -12 233 -233 -33
5475 -33 42 -103 222 -90 -70 194 39 -33 -137 -25 -163 145 -121 -39 92 12 78 159 -90 -343 52 207 -104
5498 -104 271 58 131 -109 15 -17 -140 145 13 227 -100 -70 29 16 -230 -244 -18 75 82 -120 -141 95 -19
5521 -19 80 -111 7 85 -210 -205 203 -190 57 -118 46 210 -38 59 39 185 -58 -20 -25 -179 107 -156 -152 -124
$$ packed form
5401A42l00J74K4j36R3m7m9P3L2R7n0L1M8J66k71j95L47m1r8k62M9J31J39j46
5425d9J3J98k39M2O4%J50j74R3L1j0k46L7m8K66k57J61L9k24K51j59j52P0m1K93
5450A09k89J65K0J79k13m8J70K6n0jj20k5J77Oj13no4J75m1j08L1PK45m66K00
5475c3P5j45L25l12K0K64j55p2j04J12j38L08k66Q2J31q0O6Q1k49k53L95J55l11
5498a04L75k13P3k40J24l2j23K85j32K14l27L0R9j3k46j4K26R3Pk02k1K36j14
5521a9R9j91J18P8k95NM08l93K47j75J64J64k48R7k0J46k43L8nj54K86k63MK8
$$ [...]
8191F7
##END NTUPLES=NMR FID
##END=
