##TITLE=1H_ABDP0406K
 CDCl3, 8 sc, 
 7.06.2021
##JCAMPDX= 6.0         $$ Bruker NMR JCAMP-DX V2.0
##DATA TYPE= NMR FID
##DATA CLASS= NTUPLES
##ORIGIN= UXNMR, Bruker Analytische Messtechnik GmbH
##OWNER= root
$$ XWIN-NMR		Version 3.5
$$ Mon Jun  7 10:51:17 2021 Russian Standard Time (UT+4h)  she@DPX200
##.OBSERVE FREQUENCY= 200.131506
##.OBSERVE NUCLEUS= ^1H
##.DELAY= (6, 6)
##.ACQUISITION MODE= SIMULTANEOUS
##.ACQUISITION SCHEME= undefined
##.AVERAGES= 8
##.DIGITISER RES= 18
##SPECTROMETER/DATA SYSTEM= spect
##.PULSE SEQUENCE= zg30
##.SOLVENT NAME= DMSO
##.SHIFT REFERENCE= (INTERNAL, DMSO, 0, 15.7039)
##AUDIT TRAIL= $$ (NUMBER, WHEN, WHO, WHERE, WHAT)
$$ ##TITLE= Audit trail, XWIN-NMR		Version 3.5
$$ ##JCAMPDX= 5.01
$$ ##ORIGIN= Bruker BioSpin GmbH
$$ ##OWNER= she
$$ F:/spectra/data/she/nmr/H-F/1/audita.txt
$$ ##AUDIT TRAIL=  $$ (NUMBER, WHEN, WHO, WHERE, WHAT)
(   1,<2021-06-07 10:49:52.92 +0400>,<she>,<DPX200>,
      <created by zg, POWCHK disabled, PULCHK disabled
       configuration hash MD5:
       00 E9 B6 7A A2 85 ED C7 34 08 36 98 17 FE 4E 26
       data hash MD5: 16K
       AB E0 2F 57 23 D3 A2 C3 04 6F FC F6 4C CD 67 4D>)
$$ ##END=
$$ 
$$ hash MD5
$$ E5 A0 95 F9 5D 12 BD 6A 18 C8 6D 52 44 52 CD 21
##$RELAX= 
##$RELAX= 
##$RELAX= 
##$RELAX= 
##$RELAX= 
##$RELAX= 
$$ Bruker specific parameters
$$ --------------------------
##$DU= <F:/spectra>
##$EXPNO= 1
##$NAME= <H-F>
##$PROCNO= 1
##$TYPE= <nmr>
##$USER= <she>
##$AMP= (0..31)
100 100 100 100 100 100 100 100 100 100 100 100 100 100 100 100 100 100 
100 100 100 100 100 100 100 100 100 100 100 100 100 100 
##$AQSEQ= 0
##$AQ_mod= 1
##$AUNM= <au_zg>
##$AUTOPOS= <>
##$BF1= 200.13
##$BF2= 200.13
##$BF3= 200.13
##$BF4= 200.13
##$BF5= 200.13
##$BF6= 200.13
##$BF7= 200.13
##$BF8= 200.13
##$BYTORDA= 1
##$CFDGTYP= 0
##$CFRGTYP= 5
##$CHEMSTR= <none>
##$CNST= (0..31)
1 1 145 1 1 1 1 1 1 1 1 1 1 1 1 1 1 1 1 1 1 1 1 1 1 1 1 1 1 1 1 1 
##$CPDPRG= <>
##$CPDPRG1= <>
##$CPDPRG2= <>
##$CPDPRG3= <>
##$CPDPRG4= <mlev>
##$CPDPRG5= <mlev>
##$CPDPRG6= <mlev>
##$CPDPRG7= <mlev>
##$CPDPRG8= <mlev>
##$CPDPRGB= <>
##$CPDPRGT= <>
##$D= (0..31)
0 1.2 0 0 0 0 0 0 0 0.06 0 0.03 0 0 0 0 0.0002 0 0 0 0 0 0 0 0 0 0 0 0 
0 0 0 
##$DATE= 1623048592
##$DBL= (0..7)
120 120 120 120 120 120 120 120 
##$DBP= (0..7)
150 150 150 150 150 150 150 150 
##$DBP07= 0
##$DBPNAM0= <>
##$DBPNAM1= <>
##$DBPNAM2= <>
##$DBPNAM3= <>
##$DBPNAM4= <>
##$DBPNAM5= <>
##$DBPNAM6= <>
##$DBPNAM7= <>
##$DBPOAL= (0..7)
0.5 0.5 0.5 0.5 0.5 0.5 0.5 0.5 
##$DBPOFFS= (0..7)
0 0 0 0 0 0 0 0 
##$DE= 6
##$DECBNUC= <off>
##$DECIM= 32
##$DECNUC= <off>
##$DECSTAT= 4
##$DIGMOD= 1
##$DIGTYP= 9
##$DL= (0..7)
0 120 120 120 120 120 120 120 
##$DP= (0..7)
150 150 150 150 150 150 150 150 
##$DP07= 0
##$DPNAME0= <>
##$DPNAME1= <>
##$DPNAME2= <>
##$DPNAME3= <>
##$DPNAME4= <>
##$DPNAME5= <>
##$DPNAME6= <>
##$DPNAME7= <>
##$DPOAL= (0..7)
0.5 0.5 0.5 0.5 0.5 0.5 0.5 0.5 
##$DPOFFS= (0..7)
0 0 0 0 0 0 0 0 
##$DQDMODE= 0
##$DR= 18
##$DS= 0
##$DSLIST= <SSSSSSSSSSSSSSS>
$$ [...]
##$SUBNAM2= <"">
##$SUBNAM3= <"">
##$SUBNAM4= <"">
##$SUBNAM5= <"">
##$SUBNAM6= <"">
##$SUBNAM7= <"">
##$SUBNAM8= <"">
##$SUBNAM9= <"">
##$SW= 20.0188882624521
##$SWIBOX= (0..15)
0 0 2 0 0 0 0 0 0 0 0 0 0 0 0 0 
##$SW_h= 4006.41025641026
##$TD= 16384
##$TD0= 1
##$TE= 0
##$TE2= 300
##$TE3= 300
##$TEG= 300
##$TL= (0..7)
0 120 120 120 120 120 120 120 
##$TP= (0..7)
150 150 150 150 150 150 150 150 
##$TP07= 0
##$TPNAME0= <>
##$TPNAME1= <>
##$TPNAME2= <>
##$TPNAME3= <>
##$TPNAME4= <>
##$TPNAME5= <>
##$TPNAME6= <>
##$TPNAME7= <>
##$TPOAL= (0..7)
0.5 0.5 0.5 0.5 0.5 0.5 0.5 0.5 
##$TPOFFS= (0..7)
0 0 0 0 0 0 0 0 
##$TUNHIN= 0
##$TUNHOUT= 0
##$TUNXOUT= 0
##$USERA1= <user>
##$USERA2= <user>
##$USERA3= <user>
##$USERA4= <user>
##$USERA5= <user>
##$V9= 5
##$VALIST= <valist>
##$VCLIST= <CCCCCCCCCCCCCCC>
##$VD= 0
##$VDLIST= <DDDDDDDDDDDDDDD>
##$VPLIST= <PPPPPPPPPPPPPPP>
##$VTLIST= <TTTTTTTTTTTTTTT>
##$WBST= 1024
##$WBSW= 4
##$XGAIN= (0..3)
0 0 0 0 
##$XL= 0
##$YL= 0
##$YMAX_a= 7424
##$YMIN_a= -14619
##$ZGOPTNS= <>
##$ZL1= 120
##$ZL2= 120
##$ZL3= 120
##$ZL4= 120
##$ABSF1= 10
##$ABSF2= 0
##$ABSG= 5
##$ABSL= 3
##$ALPHA= 0
##$AQORDER= 0
##$ASSFAC= 0
##$ASSFACI= 0
##$ASSFACX= 0
##$ASSWID= 0
##$AUNMP= <proc_1d>
##$AZFE= 0.1
##$AZFW= 0.1
##$BCFW= 1
##$BC_mod= 2
##$BYTORDP= 1
##$COROFFS= 0
##$CY= 11.3945322036743
##$DATMOD= 1
##$DC= 2
##$DFILT= <>
##$DTYPP= 0
##$F1P= 15.9154993809931
##$F2P= -4.1035820241983
##$FCOR= 0.5
##$FTSIZE= 0
##$FT_mod= 4
##$GAMMA= 1
##$GB= 0.15
##$INTBC= 1
##$INTSCL= 1
##$ISEN= 128
##$LB= 0.24
##$LEV0= 0
##$LPBIN= 0
##$MAXI= 10000
##$MC2= 0
##$MEAN= 0
##$ME_mod= 0
##$MI= 1.114404
##$NCOEF= 0
##$NC_proc= 0
##$NLEV= 6
##$NOISF1= 3.799351
##$NOISF2= 2.8
##$NSP= 1
##$NTH_PI= 0
##$NZP= 0
##$OFFSET= 15.70392
##$PC= 1
##$PHC0= -11281.76
##$PHC1= 13.20101
##$PH_mod= 1
##$PKNL= yes
##$PPARMOD= 0
##$PSCAL= 0
##$PSIGN= 0
##$REVERSE= no
##$SF= 200.130013532006
##$SI= 16384
##$SIGF1= 3
##$SIGF2= 2
##$SINO= 400
##$SIOLD= 16384
##$SREGLST= <1H.CDCl3>
##$SSB= 0
##$STSI= 0
##$STSR= 0
##$SW_p= 3612.71676300578
##$SYMM= 0
##$S_DEV= 0
##$TDeff= 0
##$TDoff= 0
##$TI= <>
##$TILT= no
##$TM1= 0
##$TM2= 0
##$TOPLEV= 0
##$USERP1= <user>
##$USERP2= <user>
##$USERP3= <user>
##$USERP4= <user>
##$USERP5= <user>
##$WDW= 1
##$XDIM= 8192
##$YMAX_p= 0
##$YMIN_p= 0
$$ End of Bruker specific parameters
$$ ---------------------------------
##NTUPLES= NMR FID
##VAR_NAME=  TIME,          FID/REAL,        FID/IMAG
##SYMBOL=    X,             R,               I
##VAR_TYPE=  INDEPENDENT,   DEPENDENT,       DEPENDENT
##VAR_FORM=  AFFN,          ASDF,            ASDF
##VAR_DIM=   8192,          8192,            8192
##UNITS=     SECONDS,       ARBITRARY UNITS, ARBITRARY UNITS
##FACTOR=    0.0002496,     1,               1
##FIRST=     0,             0,               0
##LAST=      2.0444736,     0,               0
##MIN=       0,             -14619,          0
##MAX=       2.0444736,     7424,            0
$$ Real data points
##PAGE= N=1
##DATA TABLE= (X++(R..R)), XYDATA
0@%%%%%%%%%%%%%%%%%%%%%%%%%%%%%%Oj4J6j6J6j6J6j6J6k0K8l2L2l2L6m4M8n0
48b6N7o3O8p5Q3r1J01j14J25j38J55j76K00k29K67l17L84m84O48r45J666o155
70e059p234J6781m250r326J1213K760j1092N134M962q513K657P699q714J61J0245
85G424q288n351J2791k860j0726R051L914j1269L134Q633p666k327P904n597m336
100e569Q134l267n461R237q47r702O308M252j0328J760R532o862m270R042k733
115g74o801P206M15o615N634K047p198L986N046p443L86Q077n622m715Q794p34
131A689o877O665K339p327K994L740n723J460N313m757j178O347l656m874O914
146C069J93o979N003L339o810J357M589m578r65M534l045k390M991j805m204N399
$$ y = [0, 0, 0, 0, 0, 0, 0, 0, 0, 0, 0, 0, 0, 0, 0, 0, 0, 0, 0, 0, 0, 0, 0, 0, 0, 0, 0, 0, 0, 0, 0, 6, -8, 8, -8, 8, -8, 8, -8, 8, -12, 16, -16, 16, -16, 20, -24, 24, -26, 31, -32, 36, -39, 44, -47, 54, -60, 65, -73, 82, -94, 106, -123, 144, -173, 211, -273, 375, -570, 1096, -5059, -12293, 4488, 238, -9088, 2125, 4885, -6207, -1073, 3889, -4624, -1967, 5732, -2982, -2821, 7424, -864, -6215, 6576, 3716, -7010, 2041, 5955, -5314, -2180, 6453, -1213, -3540, 4364, -1233, -5569, 2565, -702, -6163, 3074, 2227, -7475, -1167, 3085, -7243, -5483, 4049, -2813, -7083, 1959, -774, -7575, -369, 46, -6569, -935, 1112, -6086, -2100, 2946, -4497, -4111, 3966, -1656, -6371, 2423, 1689, -5188, 1477, 3816, -3511, -517, 3223, -2500, -1040, 4273, -484, -1662, 4685, 1029, -3845, 3069, 3262, -3717, 1286, 4625, -2185, -828, 3761, -817, -1782, 2752, -293, -2683, 2308, 503, -3701, 1698]
162A698L65o500L810L291o403R44N486m091k015M684j874l416M150l1m038L978
178C8J332n384K983L375n803N76N560l675k647N293o30m362L732J521m495K335
194b51K365m341J800L455m500M7M796l454k724N065j83m866L644K577n153J150
210e73L599l899j22L738l038r97L949k095k686M070n2m507L151K704n153Q82M370
227C341l924j253M354k182k359L737o62l104L171Q21m201K206K952m700K76M683
243C156l625k032M823j516l499L687P35l897K033K226l807P42L456l685p54M422
259B465k622k493M383p49l781L216J434l984J262L059l551l02L764k616j743M090
275A832j472k992L846J50l802K403K124l713M96L381k902j194L929j847k390L693
$$ y = [1698, 2063, -4437, -627, 2664, -3739, -2795, 2691, -1400, -3415, 1269, -605, -4021, 129, 98, -3940, 38, 1370, -4014, -1031, 2344, -3459, -2883, 2677, -998, -3645, 1648, 1018, -3344, 388, 1909, -2586, -251, 2114, -2227, -427, 3028, -1472, -1425, 3371, -83, -2807, 2258, 2075, -2791, 853, 3430, -1723, -573, 3026, -873, -995, 2743, -295, -1292, 2657, 562, -2124, 1946, 1894, -2613, 538, 3242, -1911, -1029, 3341, -583, -1836, 2518, 336, -2023, 1714, 1052, -2052, 1119, 1940, -2261, -55, 2897, -1803, -1527, 3156, -469, -2501, 2322, 806, -2693, 994, 1729, -2168, -135, 2091, -1716, -974, 2482, -1203, -1957, 2465, -157, -2650, 1733, 984, -2797, 419, 1853, -2131, -869, 2190, -1361, -1663, 2101, -515, -2258, 1832, 360, -2632, 1214, 1364, -2438, -35, 2089, -1624, -1128, 2253, -649, -1843, 2086, 239, -2151, 1542]
291A542n07l235L072J017l702J600K759l438m49L686k164k099L730o92l006L031
307A145N17l304K072J549l275P89K864k791j013L657j602k682L544l0l397K525
323E68J259l167J161J995k660n2K609k047j214L149j018k701L182K78l554K167
339d5J853l272M60K704k236r62K679j142j909K628j96k639K501Q18l260J635J971
356A588l166J58K910j990j445K950n21k513K394N56k921J714J585k918Q58K303
372A542k583k42K711j616j717K842j31k755K270J185l057J141K111k698L1K646
388A680k082q47K622r87j965K413L37k865J745J709k960O35K534k546o19K824
404A628j524j600K536j50k391J910J041k777R08K176k724r8K724j916j157K678
$$ y = [1542, 1035, -2200, 872, 1889, -1813, -213, 2546, -892, -1341, 2345, 181, -1918, 1812, 1120, -1886, 1145, 1662, -1642, 430, 1979, -1296, -507, 2357, -434, -1447, 2210, 608, -2074, 1470, 1440, -1957, 568, 1827, -1340, -179, 1816, -844, -896, 1713, -334, -1548, 1601, 583, -2118, 1064, 1342, -2212, -45, 1808, -1464, -1004, 1700, -536, -1498, 1181, 39, -1870, 758, 562, -2077, 424, 1242, -2018, -383, 1588, -1578, -1420, 1490, -500, -1945, 1005, 484, -2029, 365, 921, -2000, -286, 1299, -1619, -761, 1542, -1041, -1283, 1428, -188, -1905, 937, 806, -1949, 321, 1506, -1551, -410, 1701, -997, -966, 1680, -402, -1249, 1373, 386, -1579, 834, 1171, -1694, 51, 1760, -1200, -565, 1969, -577, -1196, 1628, 104, -1496, 1040, 890, -1501, 409, 1450, -1327, -419, 1757, -967, -1065, 1659, -257, -1414, 1264]
420A264r02j995K144M34k509J342J673k694L39K434k249q54K716j252j654K350
436E87m9k155J546R80k416Q01J808k291j16K462j728j148K657q26k078K204M11
453F49k266J200J447k138J14K045j731p81K407j126j340K360l53k099J832P67
469I87k358Q77J814k080l18K380j317j370K284l77j927J875L31j920J230R85j972
486h76M05J675j657o99K324r78j629K285j45k072J591O51k046Q40J342j675j66
503h30J792j263r49K142p14j706K036J14k161J478J103k153L39J808j633o62K076
520H17q31j396J956j38j924J562P13k097R91J310j887N6J724j281r32J972m60
537A55j774J817M45k114J165J134k004M57J495j530m31J805q46j157J762j29j813
$$ y = [1264, 362, -1633, 511, 945, -1564, -222, 1451, -1243, -904, 1530, -719, -1573, 1143, -109, -1763, 587, 538, -1617, -71, 909, -1507, -706, 1102, -1189, -1305, 1157, -571, -1719, 938, 112, -1966, 238, 649, -1617, -417, 1030, -1108, -994, 1051, -680, -1461, 946, -180, -1520, 840, 487, -1612, 220, 987, -1371, -494, 1320, -760, -1078, 1302, -15, -1385, 899, 522, -1405, 470, 801, -1119, 111, 1096, -876, -471, 1204, -453, -1152, 1172, 194, -1435, 850, 705, -1367, 224, 875, -1171, -331, 1011, -664, -830, 962, -301, -1250, 892, 178, -1528, 508, 622, -1539, -61, 1042, -1111, -772, 1036, -597, -1259, 817, -14, -1410, 546, 408, -1516, 46, 759, -1338, -347, 963, -924, -868, 856, -425, -1357, 615, 155, -1619, 198, 643, -1471, -306, 828, -1176, -719, 776, -754, -1185, 620, -226, -1383, 379, 250, -1563]
554a563J583P04k173J036J387j968L3J821j255q52J898m19j576J573M26j893J086
571a52J182k074N13J695j737k91J914j044j154J885j08j853J390R40k086O02J668
588A290j845k17J917j268q06J700m48j422J481L80j884R46J240j940J82J765j539
605d68o11J966q55j255J587J00j638R92Q53j682M00J375j517j77J741j244p93
622a226J782m66j389J434M19j789Q35J230j647l1J658j202p61J834p06j166J523
639C32l4j479J161P12j644M15J492j465m66J840q67j122J639j90j347J218M47
656F42j421N97R72j264j09J402r05o75J538m89j168J480%j388J019O66j380K80
674b03J151j080l54J365o64q55J339k39j149J166J74j291P29P18j277J59J144
$$ y = [-1563, 20, 724, -1449, -413, 974, -994, -961, 860, -395, -1247, 651, 232, -1344, 229, 655, -1238, -152, 1030, -1044, -531, 1164, -573, -864, 1050, 6, -1148, 737, 629, -1224, 166, 1106, -980, -378, 1290, -555, -772, 1145, -123, -929, 771, 323, -1099, 382, 762, -1122, -176, 1064, -876, -694, 1071, -468, -1079, 887, 32, -1223, 364, 464, -1174, -182, 671, -1011, -611, 764, -753, -930, 811, -433, -1226, 556, 90, -1299, 135, 554, -1235, -400, 830, -817, -848, 810, -392, -1153, 681, -25, -1191, 332, 298, -1181, -20, 692, -952, -537, 955, -510, -976, 864, -3, -1125, 514, 324, -1023, 195, 642, -779, -182, 790, -474, -583, 819, -86, -761, 777, 288, -880, 600, 600, -788, 231, 897, -483, -203, 948, -132, -486, 879, 215, -640, 699, 460, -689, 477, 651, -640, 89, 807, -470, -311, 833]
691H33r01o44J429m43j223J328Q8j370R23O09j282L50Q58r02j82J027o07o79J142
710C54j55j125J056K79j338P26P05j128J78R97q57l39J006k94q38R87J27j128
728g87Q45N13j233N44P80j158Q1J071o83o15J184k69j017J061L30j245O06P40
746G48j137K31R02q85j73R75m93o84J021k4j106Q82N24j316M57R97j190n2J112
765G89p12n80J039j57q38Q21J92j004N04O77j152K29J032j004k39J104n98p14
783f11R94J2r75O19N16r92K52Q64j064j5R83p82m05J026l70p34Q91J31j055N76
803a39O50j058J35J021q76l80J207o38n29Q99j49p30O37L57r10L23P95r81j25
822d91J096p41n33J233l29q09Q18J79q75L48P01q74j0R43p46l37J032n38n76R40
$$ y = [833, -68, -712, 717, 274, -949, 379, 467, -903, 20, 629, -653, -303, 555, -347, -529, 498, -109, -788, 354, 199, -926, 130, 409, -929, -203, 502, -626, -448, 549, -308, -647, 359, 65, -773, 214, 341, -787, 58, 571, -662, -118, 662, -496, -415, 656, -27, -642, 542, 273, -744, 317, 647, -598, 8, 748, -389, -158, 744, -141, -314, 661, 168, -516, 505, 481, -625, 257, 781, -535, -78, 919, -271, -323, 789, 77, -503, 536, 379, -459, 362, 554, -450, 54, 731, -421, -192, 840, -164, -403, 701, 103, -611, 383, 395, -580, 39, 555, -437, -185, 679, -385, -400, 583, -199, -604, 422, 52, -682, 209, 340, -715, -139, 511, -547, -412, 609, -267, -647, 560, -78, -607, 292, 143, -587, 50, 407, -503, -180, 615, -366, -491, 605, -136, -669, 564, 235, -574, 244, 423, -452, -104, 597, -277, -287, 656, -90, -427, 605, 67, -509, 431]
842D31j26p72P58K67r29L38P73q49j99R38m87n72R83k88p56Q12J28q66N31L81
862D96p99J44Q08p27l25J005m63p06R57Mr20O63L83r32K87N82p30j26P94m63m72
883e40Q66j61p78P85O8q69O21M51r03J36P08o21l27Q75k33o90P61Op92O66J95
904B24p47M44M65p38N4P22n64l12P99k41p00Q10J26q70M68N40q94K57O46o08k08
925c27P48l08n34P65p3p20O18L13r17M49N09p82Q0O93m23m29O96o2o72N66K60
946D50q11M35L75p79K93O06p38q9P31m73l94P37k5q35O18M12r18K26O94p12q8
967b85O83m62l57O83k23m77N68J69p88L87M70q25K04P23p60k17Q21l57m97O59
987A19L0o21L60M11p37K14O04o94m3P32n46k56P53k91m82N60J36o49L14M69n98
$$ y = [431, 305, -467, 291, 558, -371, -33, 740, -109, -308, 630, 143, -429, 554, 266, -490, 322, 450, -416, 115, 496, -303, -159, 649, -78, -403, 602, 139, -567, 390, 394, -526, 137, 520, -412, -125, 457, -273, -399, 395, -68, -540, 326, 165, -613, 172, 240, -629, -8, 443, -460, -324, 384, -237, -564, 311, 78, -612, 149, 155, -637, 29, 224, -523, -79, 386, -352, -298, 424, -140, -452, 347, 106, -594, 216, 342, -528, -60, 480, -414, -157, 489, -119, -327, 421, 113, -421, 344, 271, -449, 169, 482, -435, 14, 523, -259, -179, 514, 91, -338, 358, 296, -376, 190, 450, -361, 74, 449, -330, -37, 569, -169, -258, 473, 0, -394, 343, 318, -517, 101, 513, -405, -179, 515, -197, -285, 398, -64, -421, 262, 39, -438, 130, 299, -489, -102, 368, -457, -253, 470, -290, -507, 314, -43, -540, 119, 149, -472, -112, 299, -438, -224, 380, -314, -357, 375, -171, -427, 326, 35, -447, 113, 249, -400, -86, 383, -215]
1008b15o2P68n74k38P30l59l51N63l7n11L85K36o09K56M72n82o7P13m75l45O82
1029C80j57n24M99J30n76L64L08n62L7M98m12k51P05l51m36P71k17n79N33J50
1049C10n83K28M42n40j40O85l93l73N84j51m20M89K0n48M31K67o25J43M54m65
1069a85r5N57k59n06O74j06n63N38J38n66K50L72m61m4N12m10k08N74j85m88O21
1090A60K5o25M49L32o43J48N06m05k42N96k19m19N87M8n99L84K20n81L27L62n87
1111a76N4N50l94l15O01r9n20M73J74o43K95L75n05R1L79l98r6M90k45l91N85
1132B85q8n11M26K62o70K66M40n80l4N75m20j98M57q8n15N10J27n30L09K64n99
1153c12K00N14n87j28N73l15l05N06Qn19L28K58n31J54M14n04l5N04l90j28M12
$$ y = [-215, -277, 491, -83, -321, 409, 50, -301, 262, 225, -286, 99, 335, -274, -18, 454, -128, -195, 518, 43, -302, 380, 223, -301, 198, 328, -248, 116, 424, -138, -101, 397, -15, -266, 439, 88, -348, 423, 206, -373, 160, 310, -273, -45, 397, -143, -283, 402, 9, -364, 220, 69, -351, 138, 158, -390, 41, 308, -317, -174, 280, -185, -280, 277, 18, -488, 186, 80, -483, 55, 193, -373, -123, 249, -212, -256, 256, -154, -362, 212, 27, -461, 160, 185, -440, 9, 341, -302, -154, 352, -53, -295, 301, 82, -337, 250, 298, -301, 83, 303, -278, 49, 411, -176, -122, 428, 34, -281, 320, 221, -299, 174, 348, -295, 0, 375, -130, -39, 340, -58, -154, 336, 91, -300, 285, 197, -314, 112, 374, -296, -30, 410, -170, -204, 371, -49, -247, 210, 122, -393, 117, 244, -286, 23, 287, -312, -112, 402, -185, -313, 260, -55, -360, 146, 154, -365, -37, 221, -310, -156, 258, -246, -281, 223, -167, -295, 117]
1174A17j12l61L84J17m73K09L06l97k8N77m43j73M68k35k45M12M2l51K24J83m06
1195a85J34L75m43n3N36l85j74N46k89l36M36J28m73K20L15m06k7M32l35k38N14
1216B92k04l06N34j67l65L96K4l50J27L08l44j52M28k15l01M83j05l39L56j5k20
1237a35J75J35l33P7K58k90j16M60k61k61M63p9m31L48R9l72K16J54k19n3L10
1258A45k17k01M31j73l18M72r5l53L55J40m68J54L10l39o0M11j75l16M38j1m14
1279b84L25J03l64K37J69k64N1K75k59j15L62p4l75L61Q1m54K86K40m43R8L34
1300B90l24m5K48m6k18K75rl37L74O3m79K51K01l63O9K66k51j34L49o7l52K97
1322E8J34l89J66K38m04R5K51k85l2L66k36j82K73K8l57K24K55m18Q2L58m02j8
$$ y = [117, 5, -356, 28, 145, -328, -119, 187, -210, -238, 339, -104, -277, 191, -44, -289, 123, 165, -186, 38, 221, -185, -51, 324, -119, -172, 364, -21, -195, 351, 62, -274, 162, 290, -183, 37, 352, -54, -81, 351, 16, -222, 292, 88, -218, 316, 149, -216, 180, 204, -146, -19, 289, -55, -207, 221, 6, -295, 188, 83, -256, 100, 85, -135, 40, 175, -158, -81, 177, -113, -229, 231, -30, -291, 172, 93, -338, 10, 109, -263, -47, 107, -112, -165, 145, -72, -273, 158, -15, -333, 139, 44, -309, 46, 186, -282, -128, 182, -157, -217, 194, 19, -297, 141, 130, -284, 41, 144, -220, 17, 186, -78, -27, 248, -11, -126, 236, 162, -213, 148, 229, -225, 61, 301, -142, -44, 290, -34, -79, 169, 123, -95, 180, 171, -166, 208, 271, -208, 43, 244, -119, -50, 216, -35, -169, 180, 113, -239, 58, 192, -197, -31, 207, -197, -102, 149, -136, -168, 198, -38, -220, 53, 81, -276, -52, 203, -215, -133, 225, -177, -195]
1344a95L70k48q7K72j10j77J66J32l21J76J75l96J25L13l35n0L96k25k33L08J3
1365F9k60J44J81l10J61J70l12O5L19k85n4L45k31j54L07K3l04J72K07l14QL30
1387B77k76j36M03j37j97K57l3k61K28O0k58J09J96l31PL17k47j18L22p6k84L00
1409A22Mk57J72Q0k05OJ84j75r8L06j83j86L14l5k87K76P7l35J36K39l45pL39
1432A42k17j81L46r7k14K56jk15K79j6k81J14J86j93o2L19j89k68L30O5l00K58
1454F1J0k04Q6J85j99n7K39j41r6K93j21k04K95k2k96K20J06k90J54J71k00q3
1476i3K38m2k00K05m6j54J94O1k59J69J37k75P6K19k20j15K55n4k51K54P0l25
1498a56K07O0k09Q3J16j83l9K25j33j28K76q2k42K49O3l12J75J61l00j7K36j04
$$ y = [-195, 175, -73, -160, 112, 2, -175, -9, 123, -198, -22, 153, -243, -118, 195, -140, -190, 206, -19, -252, 56, 69, -191, -47, 134, -176, -15, 155, -157, -92, 227, -58, -112, 233, 2, -152, 155, 178, -126, 46, 253, -61, -53, 277, 1, -135, 268, 131, -66, 191, 158, -103, 125, 185, -73, 36, 232, -99, -92, 225, -22, -140, 182, 106, -178, 122, 126, -131, 41, 121, -84, -78, 106, -69, -167, 139, -44, -230, 84, 49, -238, 38, 115, -220, -84, 155, -190, -197, 142, -75, -256, 90, -7, -221, 35, 34, -181, 98, 82, -199, -85, 101, -92, -154, 165, -24, -292, 38, 103, -197, 61, 71, -133, -47, 138, -61, -118, 121, -20, -116, 177, 56, -148, 147, 125, -171, 49, 155, -135, 19, 190, -10, -93, 145, 103, -97, 108, 62, -92, 102, 163, -96, 73, 210, -65, 11, 230, 10, -105, 150, 96, -155, 99, 169, -156, 51, 111, -98, -15, 101, -82, -121, 104, -29, -157, 119, 37, -205, 44, 107, -205, -30, 131, -169, -186, 50, -54]
1520e4j55K45k0k16K03L9k44J28J37k52J21J94k32L4J65j45j31K16K5k03J10J88
1542A53l61J30K44k62K3J74j46l9J70q0r8K22l9k43J26K23l31O1K12k23j1K76
1564A81j43r7J85m3q9J15j4j54P8R6k21Q3K09k02l1K08q2j80J72O3k13J03J13
1587A37k12L0K18k01r5K58j86p4J59k4j87K35Qk18J27J37k37l1K36j50j19K97
1609A08j96j28K70j8k03J34R8k18P9J57j97n0K34j43j45L09r6k01K41P4k03N9
1631c5J13q3r6K15j03j47K43j04j20K04k3j83J18L8j17NK13j77m0K33j23j72K64
1654A23j6k13J87J1j73J54N5k24N8J58p5j42L02j35j41J93k9k38J70J39k33M3
1676b6J27j00r5J61m8r3J92m6j74J51Jj67J41N2k10O7J56j47k7J53m0k33J85K4
$$ y = [-54, -209, 36, 16, -200, 3, 42, -202, -74, 63, -189, -68, 126, -106, -72, 93, -52, -183, 33, 58, -145, -35, 153, -208, -78, 166, -96, -73, 101, -45, -84, 86, 6, -92, 130, 91, -152, -26, 197, -134, -73, 139, -84, -95, 181, 38, -59, 126, 83, -6, 109, 95, -59, 19, 115, -106, -23, 186, -16, -47, 161, 79, -101, 71, 134, -79, 24, 137, -75, -45, 173, -28, -123, 135, -51, -125, 34, 10, -177, 58, 66, -152, -25, 112, -125, -156, 80, -70, -189, 108, -88, -216, 54, 36, -167, -33, 65, -153, -74, 83, -114, -164, 70, -73, -218, 91, -5, -206, 35, 109, -94, -35, 78, -5, -101, 114, 11, -136, 107, 3, -117, 87, 64, -119, -1, 37, -80, -75, 138, -39, -79, 154, 31, -141, 123, 107, -106, 81, 92, -81, 73, 128, -96, -38, 120, 45, -97, 205, 70, -71, 122, 93, -145, 25, 164, -69, -26, 101, 1, -94, 67, 19, -74, 118, 72, -102, 49, 50, -117, 24, 76, -134, -67, 89, -58, -85, 68, 28, -205, -20, 4]
1700Dj56J59K8j45M1J32k15P9J06j28k8J17M3j83J47Q9k84J89J07k41O9J20p5
1723b5j07K07n9q1J03M0j46P2J15k43J21R8j97O1J39q1j25J97Pj39K6R9j41k0
1747g9K31j61J3J15j59qJ27n5j01J64l2r0M2P3j65Q3J31j79K3J21n2q6J25m8q6
1772e3P5J7j25R3R1j66K1J64k55lK39j71p3J40M5j96J45Q4j02m7J46j39l1J69
1796F8j23p8J66m2j22J23Kj50J03R2r4l1J62r7n8J12p9k3J61o9p6O7M6j11P8P9
1822A06j19j7J11p5m7J83q6j88J87P5k21J58L4q2pJ05o6p3J60j03p4J14q9p9K05
1847A12m1j75R7J60j33k9P8n1o6J44m0j89K04n7p9O6M1j38R8R0q9r6J77j08n2
1872g6J33Nk05R5P0j33N4R4j37JJ16n0q1J05k8j09J53j3j42J67kj16K4J35j62
$$ y = [4, -152, 7, 35, -110, -69, 63, -152, -73, 33, -95, -123, -6, 37, -146, 1, 90, -194, -5, 102, -139, -70, 50, -25, -132, 75, 16, -65, 38, 78, -68, 4, 119, -124, -3, 95, -102, -41, 98, 17, -108, 89, 96, -43, -17, 82, -59, -79, 152, -9, 4, 119, -40, -48, 79, 24, -77, 87, 55, -35, 7, 80, -85, -2, 129, -50, -27, 94, 42, -44, 81, 33, -53, 22, 39, -86, 7, 98, -68, -47, 117, -138, -141, 98, -73, -146, -6, 39, -157, -12, 72, -30, -77, 69, -70, -101, 68, -55, -133, 33, -9, -131, -8, -6, -156, -53, 39, -55, -86, 76, -21, -79, 33, -46, -69, 92, 23, -53, 14, 60, -51, 27, 106, -13, -30, 81, 6, -41, 142, 56, -132, 55, 130, -91, 67, 101, 19, 12, 117, 51, -22, 138, 35, -39, 75, -14, -93, 112, 71, -104, -7, 153, 20, -9, 69, 18, -48, 96, 56, -133, 71, 14, -65, 1, 42, -96, 2, 92, 3, -93, 84, -24, -76, 57, 62, -143, -48, 22, -111, -57, 37, -100, -99, 17, -33, -114, -9, -37, -146, 7, -6, -148, 19, 17, -99, -75, 60, -102]
1897a02J8Q6mj43J60K8j67J38K8j26O7J19j83P8O5q0%J35q5j37J33K8j06L0J55
1922A35j58J1J08q4JQ4r9j2R5rj35R5N7j11M9J13j98lJ14k8q9P5J4o0j4R3r1Q1
1950C4P0j65K8Q4j03LJ54j14j16J55nj12N7J37j90mJ54j26L5P3j24K8Q6p4m7N5
1976b7K2j33J45j0l6l1J41j29l2J73r5p8P4L6j13J59l7m9j9Q7q7RJ07r2p4J90
2002A01j15p8J57L8j24L5L1n9n5J79n9j12J70l8o7O8p5JR2nj09mL9M0l1M8o5q9
2030h6J38J3j13N4N9j06NM5K7kn5oj4J27m5j02N2k8n7J24K7j07nR6j37L1R7l5
2058cn0P4qp6J07o3p3J03m2m5K3Q8q7l9J00k2j01J06L5j23P1Q7j17K9P6j16O7
2085AK0o7J9N2J9j50J14N5j23O8Q2p2RM5m1j3M7l9l9PN6k0N3k3o6M5O4o5%P3q8
$$ y = [-102, -84, 2, -2, -145, 15, 43, -124, 14, 42, -84, -17, 102, -81, -3, 62, -18, -18, 117, 32, -105, 28, 56, -50, -20, 135, -23, -12, 96, 12, 13, 97, -2, -14, 81, 72, -63, 32, 89, -22, 27, 140, -58, -61, 53, 25, -64, 11, 25, -35, -49, 44, -47, 34, 104, -61, -33, 51, -52, -49, 105, -9, -125, 30, 25, -87, -30, 107, -83, -87, 67, -59, -24, 49, -75, -47, 39, -35, -82, -27, -5, -138, 7, -3, -39, -70, 71, -58, -90, 83, -12, -90, -16, 20, -93, 66, 29, -20, -39, 48, -39, -30, 77, -15, -89, 101, -14, -92, 65, 103, -21, 14, 45, -14, -69, 110, 51, -61, 109, 71, 4, 72, -3, -2, 90, 85, -24, -28, 11, 51, 20, 68, 3, -86, 52, 65, -48, 6, 65, -41, -36, 9, 36, 34, -21, -27, -41, 86, 41, -61, -9, -37, -94, 30, 57, -50, -55, 41, -96, -65, 32, -3, -53, 21, 13, -63, 44, -19, -92, 11, -31, -76, -53, 35, -52, -91, 9, -13, -114, -8, 27, -96, -25, 62, -55, -26, 50, -66, 1, 21, -46, -27, 25, 44, -106, 8, 63, -60, 8, 90, 18, 27, 72, 31, 18, 65, 26, -13, -6, 50, 30, 83, 60, -6, 39, 103, 38, 38, 111, 23]
2116B3m3J3O2j48J39J4j15K8J00p9%L7m8N3j7j6k1OL0j31P9K9j03M9J23j06j9
2143f1J07r0L1K4oo6O9k5n3P8J4m5k7R4q6nJ11p4k8N5nr3O7M3j16O4Q8q6J6%j8
2174b3J6J0l5m2J41n3r5OJ16n3lO9n6k4M4Km1O5k5jL4m0lQN3n2OR1j05K7N8Oj14
2207a3N4oj4M4p6M2j6m5j1K3M6l9k5R3o4p6R0j7m7K0N7k8J9Lj5j07Q8jk8R4k6
2238A9n6O3k6l3l1O5l7J1L3k2o3R7n4k1M4M3l7m4R9j12O1M2m7q2R7jq2J10k3r6
2268h3Q2J5n6l1P3k5m4J22ql7K5pl0oJ7%L2L6o3LL3j9o2O0mk0N6j4r0N5L8n9M4
2301C3J5m7K4J2l0l7M8N3r6K4J3j10Q1qK7j4M0k5p5P9l8n2k%K1J2L8o6MJ06j05
2332g5M0R7m1o8P9o7m5P3O2o3j2Q2p7l3N3K0n2Q1n6MK7k7qJ3P0j42J08po8k5Q3
$$ y = [23, -20, -7, 55, -93, 46, 60, -55, -27, 73, -6, -6, 31, -17, 36, 19, 3, -18, -12, 18, -113, -34, -5, -108, -59, 64, -42, -61, 46, -44, -13, 11, 5, -61, 8, -17, -70, 8, 22, -23, -50, 44, -42, -47, 64, -10, -38, 17, 12, -81, -14, 29, -87, -23, 65, -21, -5, -5, -23, -7, 3, -32, -74, 67, 14, -81, -75, 41, -12, -15, 54, -2, -26, 18, 20, -21, 44, 19, 18, 52, 12, 9, 17, 70, 18, 24, 115, 10, 37, 95, 101, -13, 41, 35, 21, 65, -11, 31, 15, -30, -41, -18, 28, -11, -36, 57, -7, -83, 7, -10, -57, -37, 20, -8, 11, 14, -1, -108, -20, -21, -49, 45, 19, -37, 26, 0, -33, -64, 1, -36, -25, 8, -14, -77, 20, -34, -55, -11, 32, -5, -49, 50, -62, -1, 41, -6, -88, 9, 8, -74, 36, 13, -83, -1, 14, -42, -73, 0, -25, -69, 53, 45, 8, 33, 26, -4, -10, 7, 7, 39, 75, 12, 15, 48, 29, -33, 27, 23, 3, 59, 45, -45, 10, 48, -11, 33, 48, 1, 25, 37, 7, -30, 18, 71, -25, -1, 12, -98, -17, -25, 2, -12, 28, 3, -72, 7, -31, -83, -85, -85, -64, -52, -14, -80, -76, 30, -75, -35, 62, 21, -47, 32, -35, -80, -7, 55, -8, -20, 62, -15, -48, 5, 25, -27, 54, -2, 2, 29, 2, -6, 7, 77, -65, 43, 36, -32, -57, 26]
2363B6n9l0J13p2j4M0M7r4L6P2p7j3O4m9MM4n7NM3j04J05k3L3j4j1M4k9k7L6l1
2393Hl7R9o4RL6m4k9MN6n8J7Q3j30N7K0oj08P7j5k4O6k3jl7L1l8j4J11n2m4ML3
2425a3n8N7k1k8%P4M6r6O5p9K7Q7n1m8N3L5k9Ll2L2M5Pp5m1J8N1o9K6L2p8O0K9
2457B9j28R3j1J1j8P4oo4M8K7j05K3J00j28Q7%q5J03K1n3N0n4J0r%J1o9O4K3o9
2487b5J08l0n6L8K6r3O3N4p8m8J7k8L2j0M3m4l6P8p6O2o3PO2n2oK7pM0q5K8P2
2518B0n0k2O4j7rO9j7n1J6J5l3K5L7n4j4Q8p7NL9j1l2M6o5M5o6J04o8M4l6J4K
2549A1P0p0n7J64j25o4J27n2Mj7j0k7J2P1n5j8J00j00LP0j2p2O7oo2P7k7J3k4
2578iO3k6j8N2k6n3J7Nl0L1l0Kk5K6K2MJ6Nl7J2Pn4N8n5l0R4m6k5k1J8j0K3K9
$$ y = [26, -33, -63, 50, -22, -36, 4, 51, -43, -7, 65, -12, -25, 39, -10, -6, 38, -19, -14, 29, -75, 30, 7, 40, 26, 15, 59, 30, 3, 39, 8, -29, 70, 6, 15, 51, 7, -22, -18, 38, -20, -3, 80, -50, 7, 27, 21, -87, -10, -25, -49, 17, -6, -7, -44, -13, -51, -65, 46, -6, -50, -46, -13, -71, -14, -35, -63, -63, 11, 57, -39, 26, -53, -26, 61, 10, -38, 15, 50, 21, 24, -8, 24, 69, 76, 1, -40, -22, 29, -40, -14, 18, -60, 0, 29, -99, -6, -17, -6, -24, 50, 44, -20, 28, 55, -50, -27, 73, -55, 32, 32, -53, 50, 71, 18, 68, 14, 24, 15, 15, 26, -43, 21, 44, -25, 83, 53, -3, 35, 61, -32, 31, 85, 7, -41, -24, -52, -20, -30, 13, -31, -67, 11, -65, -3, -66, -59, 3, -49, -55, -28, -35, 5, -80, -52, 20, -30, -52, 12, -5, -14, 55, 38, -13, 3, 18, -15, 10, 47, -7, -21, 67, -10, -5, 34, 23, -9, 37, -28, 17, -49, 55, -13, 31, -5, 9, 11, 81, 11, -46, 118, -7, -71, 56, 4, 8, -9, -19, -46, -34, 37, -18, -36, 64, -36, -33, 37, 25, -47, 20, 14, -48, 29, 2, 15, -9, 54, 28, 10, 62, 36, -17, 0, 5, -25, 6, -24, -22, -47, -21, 1, 5, 21, 26, -11, 1, 8, -46, 12, -43, -73, 21, -25, -50, -71, -53, -63, -40, -11]
2611a1mKk4L7p1R6r2J23o3NO6j5J0p3JON8q8O4Rj2m1N1KK3j1m7l6R6j0n3PK8m0
2645gM5mk4k5M1l3J4M3k3l5k3J9LN0l8nj1O0n1jKpqP7k9l0K8K7r1J7M1jJ3K7l1
2680C0q7L1L1j4J1Qk5R6j14k7L6m1L5o2R3l5k3M9m5j6O8K4p1L6LnJ7j1OQO0r3
2712b7l0O8m3lM9kok3P6m3J6L1l1k2j1n3L2K6l5M0nP5j10M9L6o2L5K9o8J5lJ5
2744A5m6N3K3o6K4%rk8L9%n2P3k7M6l9j0rjO7l7n6K4J6N6j00M1l8R4j00mM8k2
2776b5J7K5l3l4P7j3l2k1R1l5r3M2n5P9jNM7o3OkrN9m8j6NK7p0O7L8j9lJj3m3
2810d2R0ll7K3nj5Q3o8k1L7m4j3Q0k6or0O2lMRJ6l2K7k0MqJ2j5rj4QJ3K2m4pM2
2846A0J9q7P3p0j9O3J2l8K9jQl6J5qKM9Ro1J7N4%Qn8j9J6L5j7m0M8N4o1m5O4J9
$$ y = [-11, -15, -13, -37, 0, -71, 25, -67, 56, -7, -2, 64, 49, 59, -14, -13, -7, 51, -37, 27, 36, 24, -17, 34, 36, 59, 48, 1, -35, 61, 51, -2, 5, 33, -7, 38, 34, 10, -15, 26, -7, 7, 50, 27, -8, -31, -12, -9, 41, 3, -2, -13, 47, -4, -5, -3, -10, -18, 59, 30, 0, 28, 55, -36, -19, 22, 21, 34, 61, 30, -57, -26, 5, -9, 2, 10, -15, 81, -33, -60, -24, -65, -30, -92, 1, -34, -57, -8, -53, -69, -1, 23, -48, -12, -9, -14, 3, -8, -2, 6, 66, -27, -57, 11, -32, -35, 14, 12, 6, -17, 59, 16, 32, 63, 32, 10, -1, -54, -22, 4, -31, 9, 4, 79, -31, 18, 54, -8, 27, 56, -12, 3, 0, 15, -31, 22, 45, -21, 3, 3, -6, -34, 5, 5, -47, 26, -1, 45, 6, -4, -13, -14, 53, 16, -40, -16, 0, 56, -44, -3, -41, 53, -47, -51, -3, -25, -8, 17, -16, -50, 27, 14, -18, -39, 52, 17, -76, -34, -89, -10, -11, -6, 41, -22, -16, -18, -27, 32, -16, -32, -27, 0, -70, -3, 35, 16, 13, 14, 1, -42, 48, 45, 8, 31, 26, 11, 94, 26, 5, 42, -2, -15, 65, 39, 33, -57, 5, 2, 6, 15, 31, -1, 26, 6, 10, 2, 14, -1, -10, -24, -16, -3, 19, -25, -32, 10, 29, -58, 15, -55, -74, -11, 1, -37, -8, -9, -1, -37, -22, -30, -28, 21, 30, -31, -14, 40, 40, 48, -10, -29, -13, 22, 5, -35, 13, 67, 6, -39, 25, 44]
2880D4n4M0o7ML3n8M8O7l9m7j2M5k1l5Q0qj4m4L6m8MK9m1Q4L8j37N2k2P1k8L6
2911C6Rm3L6l5L8l6j8N2k6J5J5%l8l1N8Mk4kmk4OM0q1L7L1l2J4j9pL0k6jk4M1
2945ij3NK8k2j9j0pJ7N5oMn3N4K8p5l6P6Ok9K5k7Lk6K2M9j9m9NK7J0q7J14j4P
2979C4p2M8k7p2R7k2K9Pj1J3k6K7M2l0ol8J0o5L8M6k7K9Qp5Q6j0m7QnO8o0J0j2
3012eN5k0O%j2n2OM9n4LM9l2J2J0l6LLnj5%P5j20J5L5M8j4j2JJ7J0m5M8l6l5L7
3047a1k0M1J8k3m0O0m1P2k7m9K0QJ8mm7JnJ5j7O2Qm7j7O8n6l0J3M0Nm4L1l0M8
3080B0rl3N9q4K4K9jk6L0J4k7L0kLQl0K2j8K3J6k3Lj9K8q1P8K7mo9L4rJ0m2P4
3114E5n1lK5k3m9L4K8n0O2m3NQOj0j1m4R8Pn1k3lO0q0j9O4n3%K8J5K4k8L2oK7
$$ y = [44, -10, 30, -37, -33, 0, -58, -10, 57, 18, -29, -41, 4, -17, -52, 28, 20, 6, -38, -2, -50, -46, -17, -58, 26, 64, -73, -21, -43, 28, 0, 36, 45, 2, 38, 3, 41, 5, -13, 39, 13, 28, 43, 43, 5, -26, 32, 36, 12, 10, 6, -18, -12, 28, -53, -16, 15, -17, -3, -22, -29, 1, -25, -26, -50, -9, -22, -17, 11, -11, -30, -40, -47, -30, 25, 19, 23, -30, 24, 52, -23, -59, 17, 23, -6, 19, -8, -5, -31, -9, 40, 21, -28, -23, 4, 14, -73, 41, 27, 34, -38, 10, -17, -89, 8, -14, 15, 22, 11, 24, -2, 25, 67, 37, 31, -7, 3, -62, -24, 22, -5, 24, 32, -43, 43, 33, -14, -6, -11, 57, -3, 7, -5, 50, 30, 36, 36, 24, -28, -22, 27, -27, -24, 25, -7, 5, 15, -21, -18, -15, -20, -35, -35, 40, -80, -65, -30, 18, 4, -8, -7, 10, 20, -25, 23, -13, -48, -11, -31, 10, 28, 5, -35, 25, -16, 56, 29, -20, 0, 8, 26, 22, -25, -24, -29, -14, -31, 31, 39, -8, -25, 43, -13, -43, -30, 10, 15, -29, 2, -28, 20, 11, -22, 37, -47, -23, 6, 5, -21, 9, 23, -4, 26, 24, 27, 35, 5, 27, 9, 32, 48, 25, 28, 9, 37, -44, 34, 61, 57, -12, 22, 13, 23, -19, 55, 4, 1, 26, 3, -46, -12, 16, -34, 28, -15, -10, -2, 4, -6, -17, -61, 37, 44, -7, -30, -33, 27, -53, -72, -8, -61, -61, -33, -18, 6, -22, 10, 4, 31]
3148C1l3LJ9K7m9mPJ8k4L7M4j01P8J9o0j3LO3jqJ8kp1Rj4pN5m9L3Oq1J8L3qn4
3183e8L6P5k3n4LQ5j07L7J2n4Q8l9j7K5p9R1m5L2RjL4Mm8J6j9k9O4m7P1o9L6n9
3215c0L7ol6J6K8l5L6J0o6L4pL1l9L6o3lP3m8J0N8n2K7k9M5n7j4M2K6n7J8K8j3
3247@K5%L2j01P4m3j5O4m8k1M1L4KJj4oLlom3L1M2n5J4j3nL5p0P5p2O8l7J9pM4
3282D5r4N6j6k5O2m7oN8Rp5P6l0k5L8o2L5M5o9L9m9L5n5Q5p1RRJ5l9L8J7m6K6
3314a2QJ2K8l0l3P2j1m3K2j1r2P3%oK7L2l1pk3qL4MK3k2l4N5j7n5K7J6N8n8k6
3347b8K4J5Pl4P4j0l6L2on0J0K9j8J7j7k1N5q1K7j7O2k5%j0J1L5n0%J8j2j4K1
3379Hp1R0p9P9m5m2Q9%m0N6n0J2J9o3L3O1q5N9k0m0JL5jnkoO5o5k3J5K0j5M3o7
$$ y = [31, -2, 1, 20, 47, -2, -6, 1, 19, -5, 32, 76, -25, 53, 72, 12, -1, 2, 65, 64, 56, 74, 72, 1, 10, -4, -11, 44, -5, 28, 34, -47, -29, 4, -4, -58, -22, 53, 30, -24, -21, 64, -43, -6, 6, -48, 40, 1, -16, 9, -70, 21, -24, 8, 17, 16, 50, 54, 6, 22, 3, -26, 38, -9, 62, -7, 29, -30, 7, 1, -35, -19, 9, -26, 10, 20, -46, -12, -19, 12, -27, 9, -54, -57, 16, -32, -22, 36, -16, 11, -18, 27, -30, -44, -2, 24, -33, -15, 13, 0, 25, 25, 57, -44, 30, -13, -28, 36, -12, -33, 8, 42, 44, 45, 31, 25, 28, 25, 19, -24, 7, 49, -6, 8, -5, -10, 25, -45, 30, -42, 26, -11, 8, 1, 45, -49, 7, -9, -34, 28, -19, -25, 33, 42, -33, 43, 13, -12, 26, -36, -1, 44, -25, 14, -35, 0, -55, 30, -41, -32, -23, -8, -47, -9, 8, -38, -12, -4, 8, 36, 6, -27, 45, 34, -9, 13, 2, -90, -17, -17, -23, 4, 36, 5, -2, -25, -33, 1, 5, 28, 6, -28, 27, 10, -45, -18, -2, 56, -2, -28, -4, 11, 18, -16, 58, 48, 12, 44, 38, -12, -2, 27, 9, 26, 9, -12, 43, -38, -11, -28, 34, 9, 9, -1, 10, 45, -5, -5, 13, 1, -13, 8, -63, 27, -52, 27, -18, -60, 29, 29, -11, 45, -5, 7, 26, -37, -4, 57, -28, 31, 11, -29, -28, 7, 6, 1, -1, -7, 58, -7, -30, -15, 5, -10, 33, -34]
3413c4J2KM6k8j9J7j0m4K5K0J1k0K2m1K4OK1k9L5j7K4Rn9O1n4j6P7j7L1K5m4J
3445C7n7O2rl2Kj0Plj1L0l0L5kJ2m1L9n9K4J9k4m0kPQ3n8P6l1oL4o5M3o2J3j4
3479c3j1Q6n1j2P5m8m8L2qJ9j0Q4j08M8Nj5m7K6pL0%J6n7L2l8k3J19Qo3j4Kn6
3511f7O6J2j2Pq6M0nj0N9JrKpLj2k2R2j06Q1p7J02l7L1n0kO1j7n0RK1J4J4np4
3545c3OL0j3K1K9mo2j5L4P4m8qj3J6j15Q5%N3n5K6jl9M5j7J6l5J7rk4m6J00m3
3577b8l2J06m2M1q6LP7m0K6l4QJ0jO3l2k3k6j5K4O9q6OJ0%J8rN2m0K6m6J2k5M9
3610C5j7J3m9J8j7m9J09n3jPK4p2J7M9L3k9ol4L4O5j30Q5n2J6LjJN5r5QO5l2j5
3643a5L6k0m9Q7k3pk4j0LLk9M6m0j2J9L6k4jP4r1PkK1J8j0K5j2Jm6L7Q1o6nJ5
$$ y = [-34, -22, -20, 26, -2, -21, -4, -14, -58, -33, -13, -2, -22, 0, -41, -17, -11, 10, -19, 16, -1, 23, 32, -27, 34, -20, -36, 41, 24, 55, 80, 36, 37, -20, 42, 33, 1, 3, -7, 0, -3, -14, 16, -14, 21, 19, 31, -10, 29, -30, -6, 13, -11, -51, -53, -46, 37, -21, 55, 24, 18, 52, -13, 30, -32, -19, -33, -44, 42, -9, -21, 54, 6, -42, -10, -18, 1, -9, 75, -33, 15, 20, 5, -42, -16, -23, 7, 7, 23, -34, -2, -40, -63, 56, 64, 1, -13, -11, -67, -1, 11, -1, 6, -80, -40, -45, -55, 4, 5, -4, -2, -9, -6, -18, -40, 52, -54, 27, -50, 52, 15, 46, -4, -6, 55, 38, -12, -3, 18, 32, 46, 41, -33, -27, 3, -10, 11, 40, 36, -26, -41, -7, 67, 19, 11, -2, 14, -101, -16, -16, 37, -18, 8, 7, -32, 13, -4, 12, -23, -6, -15, -39, -85, 15, -28, -60, 46, 4, 45, -41, -38, 39, -1, 25, -9, -1, 9, 8, 71, 39, 16, -10, -25, -1, 68, -18, -12, -2, -2, 16, 7, 59, 19, 45, -1, 11, -14, 35, 18, 31, -18, 0, -17, -66, 43, -10, -11, -4, 20, -52, -35, 14, 47, 18, 12, -22, 12, 77, -53, 32, -20, -4, -1, -2, -1, 54, -41, -33, 32, 0, -15, 21, 1, -48, 39, 16, 9, -15, -25, -22, -19, -48, -2, -42, -54, -35, 1, -23, -24, 50, -41, -34, -36, -15, 3, -7, 18, 6, 7, -39, -2, 79, 13, 8, 23]
3677B3O0p1kl5NK3nOlJ5J2Olkl5RQl0QjJ8NoO2j01LJ0N3j00Q1l7K2J2j7L3j2p
3714GPM3j8j1L8l6Mk0j6jkJ0KPl9J7rM6qK6n8P3n9nK0l2l3J01j22N0O0m5M4o2
3748b1P1q3k9K8j5O5K1o0jM3o0Qk4M1m5P5J1m0J9j9Q3p0K2j7J4K3M1j04K8lJ0
3779A2L7l3J6L4m1Jl3pO8n6k7Q8j02%M3k2K7kr%J5Nj6jl3j8R5q3J1O8Mm2L9m9
3813a1L5k8M1j1m3qL4Pk3M2l0J9j6J5L3o9oN7m0j8l3M8M8m4k0n6M0L8l3NL5j8
3845a0L2PM4j05l6P7Mk9PM1q0M5k0R5j07k0R2n4K6M3o0j2M0L5l0kk4J7Lqj6j4
3877a9L6L1j5j4k7M9k8K7k7k0%N7p1OLpmPkj4L9n5N1klK4m1MM9j3n9K1K9J9Nm4
3913hM4n2Rn4N0N0o0OM1qpL5Kq6L5J2o0M4kpO9n9J6j0M0n3pK3m1K7p3Q8pr8J10
$$ y = [23, 83, 12, 10, -25, -20, 3, -2, 4, 1, 16, 28, 34, 31, 29, -6, 3, 11, -19, -11, -12, 6, 11, 5, 67, -34, -31, -21, 32, -68, 13, -24, -2, 10, -7, 26, 14, 7, 14, 57, 39, 28, 66, 30, 34, 14, -2, -3, -5, 5, 7, 14, -25, -8, -17, 29, 21, 47, -11, 62, 3, -2, 18, -14, -47, 54, -68, -18, 42, -3, 41, -21, 50, -33, -62, -34, -49, 16, 37, -23, -24, 19, -41, -33, -57, -16, -61, 14, 25, -15, 4, -15, 68, -2, 20, 3, 17, 40, 81, -23, 5, 2, 12, 49, 16, 32, 66, 25, 26, -7, -14, 54, -2, -29, 59, -43, -43, 0, -22, 5, 3, -6, -6, 9, 14, -2, -3, -36, -54, 41, -42, -31, 37, 41, -1, 38, -11, 24, -4, 37, 26, -17, -25, 9, 16, -7, 35, 5, 24, 8, 23, 56, -13, -19, 38, -2, -20, -53, -5, 43, -1, -21, -77, -37, 1, -32, -27, 8, -10, 22, 29, 73, -32, -68, 9, 13, -16, -9, 32, -48, -3, -23, 72, -35, -55, 37, -17, 9, 52, -8, -20, 20, 55, 25, 23, -1, 16, 19, 11, -5, -19, 17, 48, 33, 19, -8, 41, 13, 40, 13, -7, -7, 50, -21, -15, -12, -19, -23, -16, -18, -32, 7, -48, 3, 1, -2, 22, -19, -15, 34, 21, -38, -17, 12, 31, 36, -8, 36, -16, -7, -61, -11, 39, -21, -15, 26, 18, 11, 46, 48, -38, -3, 9, -51, -7, -9, -16, 53, -6, 10, 0, 40, -13, -20, 3, -38, -11, -84, 4, -3, -101, 9]
3948Il4jL3m2O0m6J2Qmm3K3K7Rj3n0R2ln9L5J3L9o4M4j9j1L6rl8k1K8q8M1OK8
3982bRn2O9j1J7n9j0N5l0J8J1J9r1J1L5l2j3P7l1kq%M2k9o0P8jM1q5N9l9l1M1
4015dN8p0qM7mj4K6l9qL0m1j6N9k3k9NN5l9LK0m2j4J8j5L1k4JK1NLK2k5J2j7K6
4050A0o6Q7Jl3L0Ml3%L2pj8J5k6j1M1o8N0K9k9N8o1K4j6p7J09m9l8L2mk1O3OJ1
4083D5p7%K8l8JL3J4k7J9L0o2JP3n3L4l5K9k7J5Lk7L4l6K2L1m7Ok5NR3n1m7P4
4116C8k9J7j9n%M4j20O3kJ8J4k4Pk3NJ2r7M6O7k4nj7Rj3K6k7M1nJ5Lp5O1L2l3
4150@RJ7k7L1J9j4o2N6j3L7k8l1M3ok7j0K2o4Q1k8l8K6oL6m0J8n3P4p0L3K5n2
4182d2mL0j3j5oR9k6j8jj3K9K1r2O3M3r9Q4o0N3Npo6N9k3K4ok3Qk5O8l3Jj2Kj7
$$ y = [9, -25, -26, 7, -35, 25, -21, -9, -1, -5, -48, -25, 2, 11, -2, -52, 40, 37, -22, 13, 26, 65, 1, 45, 26, 15, 51, 42, 4, -17, 11, -77, -36, -30, -2, 7, -45, 24, 13, 30, -29, -39, 16, -14, 4, 15, 34, -57, -46, -11, -43, -56, 21, -10, -12, -20, -20, 22, -7, -67, 11, 10, 51, -34, 25, -14, -45, -4, 54, -16, -24, 23, 19, 5, 31, -8, -16, 14, -27, -43, 16, -7, -36, -31, 24, -15, -12, 8, -34, -48, -30, -45, -14, -38, -37, -16, -11, -8, 14, -11, 1, -16, 10, -56, 31, 32, -1, 29, 33, 0, 0, 32, 25, 7, 22, -4, -15, 26, -42, 8, 37, 8, 66, 5, 29, 13, -64, 45, -4, -42, -10, -14, -35, 28, 34, 45, -32, -32, -4, -42, -41, -8, 6, -21, -2, 28, -34, -33, 40, -13, 21, -14, 15, -12, 3, 6, -21, 13, -23, -1, 30, -17, -11, -36, -31, 62, 11, -36, 38, 9, 26, 7, 2, 2, 46, -74, -11, -13, 5, 19, -5, 2, -21, -16, -4, -101, -55, 12, -12, -17, -34, -25, -38, -12, -39, 2, -3, 12, 15, -60, 1, 33, 0, 9, 26, -1, 30, 49, 35, -27, 29, 16, 53, 25, -6, 37, 31, 4, -6, 16, -48, 33, 5, -33, -7, -13, 23, -17, 1, -52, 22, -48, -15, 10, -42, -46, -16, -29, -44, -50, 49, 23, 5, 4, -9, 20, 41, -51, 12, 55, -44, 40, -20, 33, 38, 31, -35, 24, 1, 25, 19, -4, 4, -21, 47, 14, 15, 3, 5, -12]
4217a2Oj3rN8o0j3N1m5O6l6o7Q3m3N9o6M6L0l0Ll4j2L3K0r3R9k1K4m5K6l3P8k6
4249B4j4L2nl8K7kj1J5J8j0jj9j5l3mK4Pk5KK0J6m4K1l1O7kj0j7J4NqL2m1n5Q9
4284B8n4l0K2L3j3K5j9j0O7n5k8K1j7j0L6P1k6m3j4j2O1n0L1k5j3K0M5k9k7j0
4314b5N4J3pn3k1K1%%K5pQn0J0mM5l5J4Oo9P5m6K0M3j0q1Q0J1j4K9n0P4m3Lp3
4348e7O7j9pom7J05p0j1Q2ro4L5k7j2j4L9K5M7p0kn1M9k8QJ3L8l2L2j7mj0MnL8
4382B0k9k5Q0pk9l8L7j0R4o6j1kN3j7j7o5L3j5L3j8j1mK1j9L5Nn3J5lK5p0Q5m5
4415a8l1J9O8k9l0l9M9J1J6l4pk0N8n3L0P6p5L7m6O0l0KJ7j8K9l5LoKJ0k3L2l8
4448a3N8k0k9rJ1oRJ1M0p5j4K3M3q8N8L8k5n6K1K9jj5J0n1M6pL0k8K1k2K2Nm2
$$ y = [-12, -6, -19, -28, 30, -30, -43, 8, -37, 29, -7, -74, 9, -34, 25, -41, 5, 35, 5, 8, -26, -38, -5, 15, -78, 21, 0, 24, -21, 5, -28, 50, 24, 10, 42, 37, -1, 26, 24, 13, 28, 46, 36, 35, 16, 1, -32, -36, -12, -5, -30, -28, -8, 8, -36, -15, -46, 21, 19, 9, -8, 6, 11, 3, 35, -6, -61, 28, -26, -56, -34, -1, -14, 11, -8, -18, 49, -6, -34, -13, -30, -40, -4, 67, 41, -2, -16, -28, 33, -17, 14, -11, -24, -4, 41, 12, -15, -25, 29, 42, 35, -18, -39, -18, -18, -18, 7, 0, 8, -42, -32, -36, 9, -26, -12, -6, -75, 0, -46, -26, 17, 7, -74, 6, 17, 3, 32, -18, 56, 13, 16, -57, 10, -9, -16, -22, -69, 36, -34, -45, 37, 28, -36, -1, -28, -40, -54, -15, 10, 57, -13, -15, -66, -17, -45, -37, -24, 14, -18, 14, -3, -7, -17, -13, -18, 20, -9, -34, 46, 39, 10, -28, 9, -1, 93, 27, 16, 14, 67, 50, 33, -32, 1, -14, 19, 1, -10, -14, 7, -12, 23, 28, -25, -10, -13, 12, -58, 27, -18, -49, -30, 38, 9, -21, -60, -11, 0, 16, -18, -25, -45, 13, -40, -10, 66, -9, 28, -18, 42, 12, 14, 31, 13, 42, 7, 10, 4, 6, 16, -7, 25, -13, 45, 25, -4, -13, -2, -8, 1, 12, 52, -23, -37, -14, 29, -59, -1, 37, 12, -44, -23, 6, 5, -10, 0, -51, -5, -12, 18, -10, 11, -11, 11, 16, -26]
4481b6M2N9m2n5L9%L2m3j2M5J3l4J0k9L4l9M5o2L5l0%K4%k7L5k4J4L0k7L3q0J6
4513b4Lj1M4L6p4j9KM0J8q2Q2n3P5o6Nj1M9j2K0m6P2n6L0o2L7l5LN8k9n5J4J30
4545H3q9j1J7%m3O8k4L2o5J6kJ3k7J6N6m1k4O3k8l8N9p8Q7m1k9nN9o8N2M8o0L9
4577C5m2K4n1M1J1L8m3j9n1N0nJ0M4l4j3K6J0m5J6m3N2k7M6j1o1M1QK2l1n9O0
4608alnK3o3R9n8ol5M1O3j28L8P5k8o9M3L4J6j0j1l7K9Nk5Km0P8k0Kj5jO7p2J6
4642Dn2N0m6OJ00o2nm3M3Pl5N8m0M2p7O8J4j11P0K2L2m8K2rm2M0j1K6P8j54O9
4673A6J3qk0J9Nj9J1pK3j5n8Q5o1J7J7k1k1K8j6N6Rl2j6n0J0K9K2m2J5mN2q5K2
4706b6Rl6N3JJl9M2o3Q5n0K7K6k9j2J1J9K1m8J7M5o9L1Pqj5%J1L2On5J9K%Nk6
$$ y = [-26, 16, 75, 33, -22, 17, 17, 49, 6, -6, 39, 52, 18, 28, -1, 33, -6, 39, -23, 12, -18, -18, 6, 6, -21, 14, -10, 4, 34, 7, 40, -40, -24, -21, -32, 12, 48, -26, -45, -43, -3, 15, -67, 15, -38, 37, -29, -24, -35, 14, 2, 22, -24, 48, -8, 22, -40, -3, -38, -35, 23, -6, -61, -47, 83, -6, -17, 0, 0, -43, 25, 1, 33, -32, -16, -18, -5, -32, -16, 40, -1, -25, 38, 10, -28, 31, -47, 40, -1, -30, -35, 24, -44, 8, 56, -4, 35, -7, 17, -34, 7, 18, 56, 13, -6, -57, -7, -12, -2, 42, 8, -5, 21, 31, -14, 2, -41, 11, -16, 30, 19, -42, -1, 7, 29, -2, -61, -1, -4, -9, 14, -49, 50, -8, -14, -49, -8, 55, -73, -35, 40, 12, -57, -14, 20, 36, 26, 15, -22, 7, 12, -13, -11, -51, 27, 7, 9, -6, -7, 60, -12, 4, -48, 2, -44, -38, 62, 0, -5, -48, -5, 2, -33, 25, -15, 27, -50, 18, 32, -79, -9, 13, 45, -3, 19, 10, -32, 8, -3, 23, 101, -53, 16, 29, 21, 1, 20, 25, 6, 17, 10, 33, 18, -40, 45, -16, 1, 18, -3, -24, 4, -12, 44, 53, 21, 5, -45, -35, -6, 16, -26, -11, -15, 37, -48, -26, -17, -53, 0, 1, 2, -37, 5, -58, 27, -23, 4, 30, 1, -11, 0, 19, 40, -8, 9, 54, -15, 16, 23, 15, 0, 0, 11, 43, 49, -6, 13, 15, 15, 20, -6]
4741fPpK1n5M7l4O2k%o9lRK9j1L0L3m7K4j09P2pN7p2KO0ml0K1j8k1L3j7L2RJl6
4777AM7Oj06O1J1l2M7l3M7l0ol3j7Q1p2MOk1J5K3M3n9N3m6Ro8QP5K1r0P8m1Oj2
4811b4L1j6M7k1m7O7j5j3l7N3l4J5N0j05O1k3N2o2K2oj5M5N%n5L5rNJ9o9L2j2
4843b4L1m6N7mm9J7Mqj1J2J4n0O7N6q4L7n9K2lMJPM7k2qJ7M3j06N8L3j5Mn7M5
4877C0l9M1l7K5m5J6J3p2Q4m4O1m8N9l5n1L6m0J6jK4l2MqL9k4M0J1mk3J5rj0j1
4910a9K6M3l2K5p0kL0j1Kj0M4K9j3lk7J0KK2ron9MK1n4K1P2j04J7M9J1pJ3qL3
4944D0o4LK1j%K1J4j2j8M4j00j5Q5j7qP3j2m3jKM6m2QJ2o4M1N6j5p2K2K1L0k8
4977B7qk0L2j3O6r4j4N8k3n3m7M1O8o7KL5k3Q4m7jkK3o9K5mL5rK8p0ON7Jk9KJ0
$$ y = [-6, 1, -6, 15, -40, 7, -27, 35, 33, 33, -36, -39, -30, -1, -12, 18, 51, 4, 28, -81, -9, -16, 41, -31, -29, 31, 27, -3, 18, 0, -21, 12, -5, 27, 36, 37, 1, 48, 54, -52, 9, 20, -12, 35, 2, 49, 19, 13, -20, -37, 44, -28, -24, -18, -39, -24, -1, 42, -17, 36, -10, -1, -69, -61, 14, 35, -55, 23, -18, -12, -24, 7, -9, 38, 17, -30, 37, 22, 9, -28, 25, -9, 6, 56, -49, 12, -11, 41, -21, 1, -5, -20, 25, 30, 30, -25, 10, 1, 6, 25, -44, -12, -24, 7, -39, 18, 14, -35, -18, -14, -22, -33, -21, -7, -57, 10, 66, -18, 19, -40, -18, -21, -17, -16, -9, 38, 16, 8, 25, 68, -38, 20, 53, 38, 42, -15, 30, -9, 32, -5, 20, -25, -9, 4, -68, 16, -28, 33, -15, 44, 9, -42, -6, -46, -30, -31, -7, -39, -35, -43, -4, -28, 12, 23, 19, -4, 11, 2, -8, -19, 7, 50, 18, 43, -27, -29, 1, -10, -8, -18, 26, 55, 42, 39, 12, 22, 24, 46, 37, 31, -28, -24, -3, -57, -36, 36, -68, -51, -2, 9, 2, 15, 7, 40, -24, -21, 0, -1, -1, 20, 34, 22, 4, 48, -52, -67, 18, 1, -7, 66, 54, 11, 10, 12, 58, 16, 24, 36, -28, 13, 69, 54, -18, 4, 25, 55, 27, 19, -1, 31, 18, 84, -10, -24, 34, 11, -42, -89, -48, 20, -47, -45, -10, -33, 51, 4, 3, 1, 24, -45, -20, -24, 11, 2, 30, -40, -34, 23, 24, -5, -3, 7]
5012GL8k1n6M0M5l8k6l2M8Jlm4J7J5L9l4J3k9M8mOj8l4M9l2OJ0k9k8L0oK8K3m2
5046a3J8j0M1l0k7K9M1m6lj2L7J5n2J3J2l9m2Q6L8o2M1m6L8k2n1N5KMoPK4l2K9
5079C7m8mK5l1j3J8L0m1K9p7M7%L6l7j5K8M7q1L1J5K5k0Jj3%J2j5L6k5K3k5M6
5111D1m1k1K0m3L2J7Rm3KK1m2N9J7J6qk4J4j9k5K6Rl0oj7QQK6J3JJ5j09R5k3O0
5145E8m9o9N3K7j6Rj3OJ4JPm3KkM2jk7M3ol0k6O2q0P6l8l1mL9O0q5L7mk9%J4l
5181fk3K5L6q9K0PL2j6l5N1m0M5Oj0qRRNnJ3m7N1l6M6k5j5M0n8N7k1j8J7qm8K0
5216a9M7m2J6N7o5KJ4k0j8J5j8K1m5NM5ON5p3k3L8KL5k7N0j2j0m5j9K9O2r0R3
5248F6q4L7L9n5RK6l2QkqM3n5M5rr9J0N3ml9N4K2o7J01r1j1K1j9M6m2K0N8k9n3
$$ y = [7, 45, 24, -32, 8, 53, 15, -11, -43, 5, 6, 3, -41, -24, -9, 30, -4, 9, -20, 28, 24, 30, 12, -22, 27, -5, 1, 11, -18, -46, -16, -22, 6, 29, -13, 5, -5, 36, 6, -21, 8, 49, 3, 0, -12, 25, 40, -12, 1, 13, -26, -68, 18, 56, -6, 35, -11, 27, 5, -46, 9, 11, 15, 9, 16, 40, 8, 37, -11, -15, 10, -21, -34, -16, 14, -27, 2, -75, -28, -28, 8, -29, -44, -16, 31, -50, -19, -4, 21, 1, 2, -11, -11, 1, -14, 22, -3, 20, -5, 41, 0, -21, -1, -44, -12, 5, 14, -29, -27, -6, -48, 11, 28, 44, 36, 12, 26, 7, -18, 8, 17, -13, -19, -36, -28, -20, 6, 19, 20, 35, -74, 21, -2, 58, 9, -60, -7, 20, 4, 13, 0, 6, 20, 21, 28, -15, -13, -15, 27, 26, -1, 42, 36, 6, -20, 42, -38, 38, 0, -31, -35, 4, 64, -21, 16, 12, -17, -17, -3, -6, -29, -4, 32, -57, -37, -30, 2, -14, -49, 2, -38, 7, 13, 3, -5, 4, 13, 18, 13, 26, -21, 30, -6, 40, 15, 0, 40, -18, 39, 18, 0, 17, 9, -39, -19, 28, -14, 2, 59, -6, -4, 10, -10, -28, -13, -31, -10, -55, -50, -5, 1, 56, -17, -40, -2, 0, 35, 8, 58, 46, 36, -9, -28, 1, 63, -27, 66, -18, 19, 58, 3, 12, 38, 6, 14, 12, 4, 47, -8, 37, 28, -71, -61, -8, -12, -51, 3, 25, -42, 59, -32, -43, -22, -41, 5, -37, -17, 41, 12, -41]
5281d1N7%l0K8l7j9J7M8l1K6kq2R2m0MM1pll3M0n0P5n1N9o4Rj2oM1m2K8m2l0K0
5315c7J9j5L6nk5Nkkj8Q2J0q9R8o2J8k0K4k1j4j4N8KKj0ok6O1n0k0J7L5o3J2N7
5349C7Krj7L0o0K5o1L5M8m5K3M0k2k4m4M0O4n1J5m8k2L3RJ8n4QK1J4l1Oj7M1k1
5382a7M2n0J0n7M9j1P1j3l5K3n0N9L0J1n3L7m1J5j1K7ol2N8m8K8j6j0pl1O0j2
5413B0p8QJ0R4j9mq3M1ON5j14O6K6l3P1p1Q4o9K0j14J08Lj1j1o0N4N0Lj11K9n
5444c5M0k3K1k2L3K3J8n1Q0p5k6O3p2K9k9l6K2R9o7k6M0l5K7L8k7kPJ9m8L8m6
5475b3K7N0p6j7P6p9NN0j0l9P4%j5jJ8l7l2n3R1K1n5N5n0N1mm2M2k0J7m6L3k6
5507a5Op0P0L4m3%k2j0M4L3l6L8k6mk0M4Jl2P1n7nm4L6K9q4J43r6kN1KLm1no0
$$ y = [-41, 16, 16, -14, 14, -23, -42, -25, 23, -8, 18, 16, -66, 26, -14, -10, 31, 24, 21, -12, 28, -22, 53, 2, 61, -3, 6, -6, -12, 29, -13, 15, -27, -57, -37, -18, -33, 3, -2, -27, -22, -24, -26, -44, 38, 48, -41, 57, -5, 13, -7, 17, -4, -18, -32, 26, 28, 30, 20, 14, -12, 49, -1, -21, -4, 31, -32, -20, 37, 39, 30, 13, 43, -17, 8, -53, -18, 30, -15, 8, 48, 26, 2, -42, -2, 62, 11, 26, -22, -44, -11, -2, 16, -38, -30, -9, 5, -26, -20, -37, 4, -17, 25, -25, -15, -72, -23, -34, 37, 24, -11, 12, -38, 21, 51, 62, 9, 46, 5, 20, 9, 36, 30, -2, 56, 8, 36, 20, 10, 3, -28, 32, 20, -58, -50, -40, 54, 35, 31, -52, -11, -5, 50, -64, 2, 28, -5, 66, -5, 79, 10, 30, -84, 24, 27, 16, 5, -55, -1, 49, 52, -59, -30, -35, 5, -18, 3, -19, 14, 37, 55, 4, 84, 9, -17, 46, -26, 3, -26, -62, -40, 59, -8, -34, 6, -29, -2, 36, 9, 7, 14, 33, -15, 23, -23, 4, 54, -22, -39, 37, -42, -37, 13, 3, -36, 38, 38, 23, 22, 40, 3, -29, -82, 9, 30, -25, 30, -20, 31, 27, -15, 27, 7, 24, -22, 11, -15, -9, -79, -9, 25, -18, -18, -40, -50, -6, 27, -9, 29, 3, -1, -21, 23, 24, -8, 63, 6, 1, -43, -7, 22, -62, 81, -15, -17, 34, 36, 39, -2, -7, -67]
5541f7P3K5j0n4O5l6K4j8N3l7k6j8N6oj6n8MM1lj9k6M4QL0n0K9j0nL9Po4Q7n2
5574A0PL4p7M7j7jL0n0j6L2j9j5M0PQo8J16l5n8M2j6j0N4n5m2N7j1k3j4lN2k0
5606a4k7L2J0kk8J2kK0lLmL6l2N9m6%Ok8lJ6n3N1pK8k8l4jQ6n1lL0l3L1l6j9L7
5642CqJ3j0jj0pJ2j2O0o9qL9j5m3M2K1K1k2Mk4M9p3Q5k2m1O3o7L4k4rP8p0m1N7
5676EK4jlk6l2P3l8Rj2j6R6q8L6o7L7K0Jn3K7l6N2J2l7K5lj7l5oM0qRpqL9qmK0
5713B0Oj1n3pO6l7k6P0l3RkJ8J5K8p4pN3k6k5N0N0m3k8k3j5L8K3oMj2n6m1N8o1
5747g8P8k7M4j0j0j6qO0jj3r9O7j4M9r0N7K0K5l%J1k8l1k7R0J1l2n9L5J1m8J21
5779H5m7l8J9J3Nq9P7o1L1L5o4j0N5kj1PJ7o8N5p6J11n3J9j0k3QRl5L5p2Q8kn9
$$ y = [-67, 6, 31, 21, -33, 32, -4, 20, 2, 55, 18, -8, -26, 30, 24, 8, -50, -46, -5, -8, -27, -53, -9, -1, 29, -21, 8, -2, -7, 32, 39, -25, 62, 10, 17, 51, -26, 21, 4, 3, 33, -17, -33, -1, -20, -35, 5, 12, 20, -48, 68, 33, -25, 17, 1, -9, 45, -10, -52, 5, -6, -29, -43, -46, 6, -14, -41, -9, 1, -1, -29, -17, -19, 1, -2, 1, -3, 33, 1, 60, 14, 14, 20, -8, -11, 5, -48, 3, -4, 24, -4, -38, -39, 47, -4, -7, 23, -10, 21, -15, -34, 3, -5, 8, -2, -3, -13, -20, -8, -20, 40, -29, -37, 2, -13, -56, -14, 7, 28, 6, 10, -14, 35, -38, 47, 25, -16, 47, -20, 14, -10, -19, 59, -11, -52, 5, 29, 28, 25, -1, -33, 40, 2, 11, -1, -17, 79, -9, 27, -40, -3, 17, 18, -35, -8, -44, 8, 20, -17, 8, 5, -12, -47, -53, -13, -21, -12, -19, -27, 12, 4, 0, 20, 26, 15, -38, -45, 21, -16, -42, 28, -5, 4, 2, 20, 35, 63, -11, -18, 35, 9, -16, 34, 84, 41, 13, -10, -25, 13, 36, 30, 34, 22, -34, -75, -17, -78, 0, -27, 17, 7, -3, -19, -27, 33, 32, 19, -80, -13, -27, 22, -68, -11, 9, 34, 31, 31, 42, 14, -17, -44, 46, 57, 25, -34, 1, 12, -36, 85, 38, 0, 19, 32, 37, -52, 25, -36, -5, 30, -34, -44, 11, 9, -2, 5, 22, -46, 9, -67, 44, -9, 10, 0, -23, -15, -6, -41, -6, -78, 10, 8, -51]
5812e1L9M3m5M2k6Nk7M3N5q2n4P0J2K5j7q7J08k9J5n8N7l1kjQpJ2J3p6M4J8k2
5844fj5QK2J5o1M2oQJr8J34m2J8J5lk9L1j8L8l7om4LN2n3K6PJ5Rk3J2L3n9MJ9
5879A2J4k0K0lo4O0P5p2j5m1l3N9N2p8JL9n5M8j6Pk0Q7q9N8J2p7J2L7J6m6PPo
5912a2qNN0o2M8J9%j0n6N8k4M0l2j6n5P7R5j14k4K0l0L7P5p9o1O3j7K9j5o6Q4
5943A9l3J5k2J6LK9j3l6M0N6j45O2QPk9O5J8n9Pk5L4J1m3MM0lL6p9M3L0k3n7L0
5976Fk7N7m1n1N2OJ0jk4L6M1p5O0l3l4%N4n2k8O8o7O1k4jL8l6Jj1M1J8%qkk3j4
6011ck2J16r7lj3K3L0j6L9k0k9J6QJ3k5km6N0k4M7k5o8P1k8J1J5p1P9k6j6K7K8
6043C9m0k3K0l9J08j06J2J3J6Qm4O9pOkk3j3N5l3m6J9J4Qrj2L8k9L8m4M6o2J6
$$ y = [-51, -12, 31, -14, 28, 2, 7, -20, 23, 78, -4, -58, 12, 24, 49, 32, -55, 53, 24, 39, -19, 38, 7, 5, 4, 12, 5, 17, 30, -46, -2, 16, -6, -21, -13, 9, 24, -37, 5, -1, 7, 8, -90, 44, 2, 20, 35, 32, 3, 34, 16, 54, 17, 11, -33, -30, 22, -31, -5, 2, 17, 26, 3, 15, 48, -11, -7, 12, 26, 6, 26, 23, -41, 19, 94, 22, 7, -34, -67, -8, 44, -34, -33, 6, -49, -1, -17, -10, -30, 57, -32, 26, 38, -39, -27, 10, 26, -20, -13, -6, -12, -20, -15, 35, -27, 21, 40, 40, 30, -26, 32, 8, 48, 16, 0, -55, 22, 117, 3, -21, -1, -31, 6, 81, 2, -59, 4, -13, 16, 1, -65, 19, -14, 1, -21, -5, -2, 27, 14, -22, 18, 74, -71, -9, -1, 6, -23, 42, 60, 1, 8, -17, 17, 28, -15, -11, 29, 26, 62, -17, 26, 56, 33, -24, 6, -21, 36, -5, -56, -4, 2, 12, 11, -13, 23, 64, -11, 49, 16, -18, -18, 36, -16, -44, 24, -43, 18, -6, -7, 31, -5, -4, -15, 26, 44, 44, 36, 34, 11, -3, -25, 91, -6, -9, -22, 1, 31, 15, 54, 34, 5, 21, 29, 42, 17, 15, -31, 19, -5, 42, 17, -51, 20, -8, 3, 18, -53, 26, 0, -16, 11, 39, -1, -24, -4, -43, 65, -41, -29, -16, 0, 8, -36, 33, 26, 32, 30, 7, -6, 49, 16, -30, -11, 3, 11, 2, -10, 28, -1, 37, -7, 39, -23, -7]
6075gJ9K5k2k8k5J4ql7N2M2n3J3L6k8m0M3k2J1J9%K2l7l0J9K7K4Rl1l8K5j3j5
6107c4K6lJ5Ko1Q4k1k0P4n0k3K8m5K6K2k2k6N1k8l0%jM6j8j3N6o3K7l0kLK8l7
6140c9m3Q3j5kJJ7kj2R3p9J4K6p2M6K4l2l0j5N8k3K8j7J4j3m1N4k3p2J4J02n7
6171a3j7k5J7rL8j6K2qj1MN0K4n6J9Qq7J22r2K4l8R4ln1M0rj8j6J6j0j7l6K5O0
6204C1k8k8PL3Po1N5M5l1l6M9l2j5kj5K0j5k8M0PL8m7n3Q7k1n2M7l6K7nK6J2p1
6237d5N7K1p1K4K5ok7L8rJ5K1o5M9K5q4O9l5L0LMk9k3J0LJ9kj3J2okm7O0J0j13
6271h2Q2Ll0Rj3L4Lk1o0N8K3mm4L3L8l6K7Jo0N6N6j03M1l1L0j7L4n1K8j9l1M2
6303dO1L8n5nk4J3m3O4p2O1k4KPl1j2Pj1L6j9LL4l9k9N9k8M8m6rM4PML1m2Kj6
$$ y = [-7, 12, 37, 15, -13, -38, -24, -32, -69, -17, 25, -28, -15, 21, -7, -47, -4, -26, -15, 4, 4, 26, -11, -41, -22, 5, 29, 38, 7, -31, -6, -19, -34, -8, -11, 4, 6, -55, 29, 8, -12, 62, 12, -11, 17, -28, -2, 20, -2, -28, 23, -5, -35, -35, -36, 10, -8, -21, 35, -28, -1, -31, -33, -30, -2, -39, -82, 1, -14, -16, -15, 2, 0, -12, 81, 2, 16, 42, -30, 16, 40, 8, -22, -37, 21, -2, 26, 9, 23, 10, -31, 23, 0, -72, -58, 44, -13, -30, -55, -38, -47, -9, -25, -3, -11, -22, -18, 32, 56, 0, 19, 27, -60, 62, -30, -6, -44, 50, 47, -4, 36, 27, 9, -7, 9, -1, -18, -54, -29, 31, 3, -25, -18, 15, 22, -39, 16, 61, 30, -6, 43, 11, -4, -6, -21, -1, -16, -44, -4, 3, 41, -6, -59, 28, 7, -45, 2, -34, -7, -12, 14, 26, -45, 12, 33, -38, -14, 11, 5, -22, 16, 7, 22, 43, -22, 27, 52, -32, 37, 2, 32, 35, 39, 10, -13, -3, 0, 19, 17, 4, 16, 10, 8, -39, 21, 31, -82, 0, 3, -27, -18, -31, 3, 6, -15, -75, -17, 6, 2, -42, -9, 29, -7, 20, 21, -39, 17, 73, -30, 11, -20, 10, -7, 27, -24, 4, -15, -46, -4, 57, 95, 40, 35, 11, 24, -19, 45, -27, 34, 10, 12, 19, -12, -24, -17, -28, 8, -11, -8, 26, -13, -42, 17, -11, 37, -9, -18, 26, 33, 37, 68, 26, 28, 12]
6338A2j2Nk2K9K0k5KK5Lk6N0q2M5p7M8K6Ol0k0M7qJ0o4M5n9N0Rn2O9j5k8L2pK3
6372B9k0Nl3j6J8JMk6K5P7k3p0J1l5L3P0o1M9m9M9ok5j7nP8l2k0j2oK7pnlk0O2
6407D7n5nK5m5NK3pmKK6n7P1Jl5K7l3j7N0Lk7M3n2k1K9pO1lK4j2p3O2o9K6OK1
6442C0l0lqj4ML0%L0l6J4n9R1J8j09P6n5N6j4k0n3N6k5J6n5N3j4K6qLj5L5o4J
6475d3nJ01q4j0M6j9N6m9Kl7P5p4Q6o5J6M3k3L0J0n1L9l3l0L8j6Q4q9J9K0o1m
6506b8m3M8j2OJoP6o2L1mK0o0P5j9kKk7K4jK7k5qj9K5p6N6k4M6J5ol4K2k1P3l0
6541D0l7n4J5M6j7ll5N3l3O7k9l9N1rk5M4n6k5k1J03j8m7Q2j01L0l9P3rl9LK1
6572hnL8nk3qK4K3K3l9m7J7kNj6K2nJ3k7QO0l3M4o0N5l2PJ6n7oJ8m9L2L8m2j4
$$ y = [12, 0, 5, -17, 12, 32, 7, 9, 34, 37, 11, 61, -21, 24, -53, -5, 21, 27, -3, -23, 24, 16, 26, -38, 7, -52, -2, 7, -45, 24, 9, -19, 13, 6, 29, 9, 14, -19, -35, -17, -16, -12, -38, -13, 64, 41, -29, -18, -53, -20, 50, -11, 38, -11, 38, 32, 7, -10, -15, 63, 31, 11, -1, -7, 20, 13, 8, 5, -15, 47, -8, -13, 12, -33, -28, -5, -12, -16, -14, 12, -45, 26, 27, -8, 19, -14, -31, 19, 22, -5, 38, -14, -35, -6, -13, 48, 45, 69, 57, -16, 46, -23, 3, 9, 30, 0, -3, -11, -25, -21, 9, 9, 39, 3, 17, -42, 49, 67, -42, 34, -21, 35, 21, 1, -52, 4, -21, -5, -60, -7, -21, 5, -3, 0, -15, 20, -44, -43, -48, 53, -31, -41, 5, -14, 42, -7, -5, -42, 33, -41, 45, -20, -4, 39, 16, 46, 56, 5, 44, 11, -19, 19, 3, 87, -2, 17, 37, -24, -28, -71, -23, -35, -29, -28, -34, 42, -20, 11, 7, 27, -33, 42, 23, 21, 23, -4, 20, 19, 46, 21, 13, -6, 19, -57, -1, -25, 21, 36, 30, -4, 18, -3, 70, 40, 3, -51, -36, 10, -7, -10, -45, 8, -25, 42, 13, -26, 25, 16, -9, 35, -21, -46, -67, 36, 18, -29, 53, -48, -18, -57, 16, 7, -32, -29, -8, -13, 25, 20, -3, -11, 13, 36, 59, 20, -27, -10, -12, -7, -23, -1, -6, 7, -20, -12, 48, 15, 59, -1, 54, 22, 29, 45, -12, -18, 0, -49, -17, 21, -21, -35]
6607c5k6P9o1M8j5M1m0K4j3k5O0o6M7n6M9kl4M8k4Ml%O3j00O5rl2K8J7j6L6m7
6639EOk9M9m0L3p7N2J1K9l3k2K6l5J2j6%j0j6K4M5K5p5N7m0N2Np0lPM5m0M2k9
6672a0J0O3n4K1nl5L6n2L8K3J8o3l5O1M7mj6k8M1m1jl8K5O7q7lj4J0Oj8rN0J1
6705A4p2Q2k9rO0l1j9n2L4J7LO3k1o9J6J2j6J5l6L3K8n3JM3o2P2J7l8n7P0L3p5
6737b6K7L5Kl2Jll6L6K1M4r1J4j5K0j5m9Q5k9J1l1j4N8M6k4j8k5N2J5m4j3K4k4
6769BJ1L6p4K6K2m1l9N7Q0q0L0pkk5l2nQ1m7k5Q2j07L9M8l9k1jN1k1j2L3l2pO9
6802E0j06L4l6M5J6Mp2JQ6o7Q6Lo7J4J1NJmPoM1j0m4K1kj2pL9k7ppM6l2j0M7n6
6838a5kM8o7O5j08M5M1J4m6kL1L6n9lJ9L5o9J2nkN1kl1m3P4l9l4M3M4n5L7jN3
$$ y = [-35, -61, 18, -43, 5, -10, 31, -9, 15, 2, -23, 37, -29, 18, -38, 11, 9, -25, 23, -1, 3, 0, 0, 63, -37, 28, 19, -13, 15, 32, 16, 52, 5, 11, -18, 31, -9, 24, -53, -1, 10, 39, 6, -16, 10, -25, -13, -29, -29, -39, -55, -31, 14, 39, -36, 21, -19, 33, 38, -32, -35, -28, 17, -23, 19, -10, 0, 63, 9, 30, 25, -10, 26, -26, 12, 35, 53, -10, -45, 16, 63, 59, 43, 15, 56, 15, 14, -24, 1, 68, -19, -22, -36, -26, -20, -38, -47, 3, 14, -58, 24, -5, -14, 46, 15, -4, -56, -22, -5, -2, 61, 40, -29, -13, -1, -17, -2, -38, -5, 23, -30, -29, 14, -48, 24, 41, 3, -54, 16, 49, -26, 1, 36, 38, 6, 7, 4, -32, 4, 25, 69, -22, -8, -23, -3, -18, -67, 18, -11, 0, -31, -45, 13, 59, 35, 17, -8, 44, 59, 15, 2, 26, 2, 13, 49, -25, 1, 23, -18, -57, 0, 80, 0, 30, 23, 21, -4, -36, -41, 40, -7, -32, 50, -57, -18, 30, -9, -30, -31, 20, -1, -13, 20, -12, -19, 50, -56, -22, -58, -13, 3, 7, -65, -64, 22, -45, 41, 44, -23, -9, 2, 7, 8, 4, 11, 5, 46, 36, -8, 13, 11, -1, -8, 31, 4, -3, -10, 36, 4, -6, 41, -15, -17, 31, -36, 29, -79, -34, 7, 21, -25, -27, 4, 40, -19, -22, -3, 32, -37, -25, -30, -32, 19, 17, -14, -57, 17, -22, -56, -13, 31, -24, 13, 12, 65]
6871F5l0K0m3J7k9M0o8NN7l9L8k6j8K2K5q1Q3p0J8RnJ2k3J5Ml8N5j9L4o9j5M4
6903a0k9J3nM3%J1l0Pm5N6K6Np2jP7q3K3Q3n5l5K3l0N8j8K1k9l7RJ6lL6k6J8J0
6937B7p9P7k8lj7J5k5N1k9J2m9RJ7l6M6K0m1O0j5j7L2p0P8k0k7N2op8L0M4p2N9
6969A7Mk2J9n3L8M9q6J2N8n9Kl0L0P2lj07OK2K4K5k9j3m5K5J2M7j2oJ3k4lL4l5
7002a8jlO6nkkMJ5l8l7MJ7on3J05n1mK6J6k6p3M5L5m6mP1J1o0J1KOL3l8kj3J5
7038@jm8K9qO0m5l5j1N5Ml2PK0N7p9O1j3Km6j1L2P1m4J4p0J1O3k6j1j6Q3j34M1
7071b0M7j8o7P8n3o1J27k7j1j1M8n0m5N7j2L2j7K8l9K7k7OKjJ3m9M7k1K5j3O1
7102E6n5M2p6P6m6K7J2k5k0LN2m8O%kj1p9R1J4m2N2J4j8n7nOkN2o0l8J24p6k3
$$ y = [65, 35, 55, 12, 29, 0, 40, -28, -23, 34, -5, 33, 7, -11, 11, 36, -45, 38, -32, -14, -5, -10, 2, -21, -6, -2, -40, 15, -4, 30, -39, -54, -10, -39, -26, -31, 12, 12, 23, -7, 0, -45, 11, 37, 42, -30, -31, 46, -37, -14, 69, 14, -21, 2, -28, 30, 12, 33, 4, -33, -24, -8, -11, 25, -1, 17, 27, -52, 25, -3, -6, -23, -8, -33, 18, -11, 1, -48, -39, -22, -58, -12, 8, -33, 27, 12, -5, 27, -43, 35, 15, -12, 40, 34, -44, -14, 30, -42, 17, 21, -1, 18, -35, 3, 52, -34, -22, 36, -23, -21, -51, -21, 51, 48, -59, -53, -31, -7, 18, -11, -24, -69, -44, -32, 15, 3, -3, 10, -14, -17, 17, -18, -19, -22, 44, 39, 37, 35, 39, 54, 16, -21, -17, 0, -6, -59, 46, -5, -9, 17, 33, 7, -66, -21, 14, -32, -36, 35, 46, -14, -3, -1, 5, 38, 0, -2, -15, 0, -1, -49, -20, -28, 32, -13, -48, -59, -4, 0, -32, -25, -5, 52, -27, 34, 21, 23, -23, -34, -2, 69, 25, 39, -31, -20, 43, 17, 6, -10, 73, -61, -20, 27, 9, -58, 20, -33, -94, 33, 6, -5, -16, 32, -18, -63, -6, -18, 14, -3, 25, -14, 13, -14, -8, -6, -7, 6, -43, 4, -17, 8, -5, 56, 1, 43, -33, 43, -3, 24, 36, 11, -9, -6, 46, -2, 4, 4, 2, -9, -88, 3, 17, -25, 27, 41, 23, -34, -39, -33, -35, 17, -43, -81, 43, -33, -56]
7135e6mK9l1kJ8P1r8P7K0o5J6K1L0J8l1j4k0JK7J5on1N7roJ2OL5o4K1Qk2k5nR4
7170F7o3L1m4L9n1L1o3R3no0j6L2qn0L8M6k0m7K4jM3o0N2j9k2O7lk0L9m4j1k4
7202b9K6l5J14j09OR9r4L8pj1O0q1%O0q1L6oM0k8qP1k5k2j5K9k4k1QRk8j6N1m6
7235c9O8k2l9lM5n4L5LK0k6PK4K1j5m8JM1k2k1kO6o9K1jk2J6J7O3q2%j2L3kQ0
7269H2p1mJ2k5n5M9M7k3p1N2q2R8Nm4K2K0n6N3Oj3k1k6N6l6J5L6m0J7%j9N4j7
7301B1prK4n2N2mk1rM6q2Q4m4J3m4J7K5LJ4k4k2M4k7n0J2K1Pj6JL2MJ6m8M0o5
7335d8Q1l4J1j4K5kn8L7J8K3k9K5o6J5J9k8k3j2P2j8pJ5j3J5KK3o8Q4l2l9oJ50
7367A18j44J3K8l1PN0m7m8P5l2M2p6O0k9J2k3P3m7k0M2q0P3l7K5J1j5M7n1Rj5
$$ y = [-56, -60, -31, -62, -64, -46, 25, -73, 4, 24, -41, -25, -4, 26, 44, 13, -1, -21, -20, 7, 22, 16, -35, 22, 13, 7, 19, 25, 60, -4, 17, 25, 3, -22, -27, 67, 4, 35, -9, 30, -21, 10, -53, 40, 35, -25, -41, -9, -17, -67, -29, 17, -3, -50, -26, -27, 16, -44, 8, -11, -33, 34, 31, 11, 50, 6, -5, -29, -3, -38, 76, -33, -27, 72, -22, 16, 9, -2, 58, -23, -23, 37, -44, -8, -14, 26, -2, -10, 61, 36, 14, -1, 28, 4, -17, -9, 0, -28, -44, 7, -39, 29, 7, -32, -35, 10, -44, -9, -6, 14, -12, -5, 19, 40, 25, -23, -22, 19, -3, -24, -26, 40, -29, -8, -9, -31, -15, 2, 65, -17, -17, -29, 4, 2, 82, 11, 7, 19, -6, -61, -12, 35, 12, -59, -7, -89, 9, 14, -30, -8, 12, -44, 9, 15, 2, -19, -45, 11, -25, -10, 26, -14, 3, 3, -16, 38, 21, 14, 5, 29, -23, 29, 25, 4, -5, 41, -41, 43, -1, 12, -32, -15, 10, 13, 27, 3, -19, 25, -2, -52, -40, -19, -12, -28, -27, 5, 9, 25, -23, 17, -48, 33, -1, 10, -4, 21, 19, -39, -2, 16, 39, 10, 35, -31, -16, 3, -25, -48, -60, 12, -6, -13, 2, -11, 4, 6, 29, -39, 45, 13, -26, -32, 118, -26, -13, 15, -16, -9, 41, -6, -54, 21, -11, 31, -45, 15, -14, -2, -25, 48, 1, -19, 23, -57, 16, -21, 4, 15, 0, 47, -4, 5, -10]
7397a0%MJ3k0L6MNK4n6J2j6N5m2JJ7n1k5Q8m4K9n2O9j01J5J1k3J8O2l6l9O9j2
7429EK5n2j2K5kM0l1k8O7J3o6M1n1K8j1k3nK2O7m2L7n8k8l4N2J0K2l8JM6j2l0
7461b2M6lk6m6J00j02MJ02r1L3rM1m7pNK9m1K9NL1m0KL0l4oM9qn4N9qJ7o0lJ01
7495G6n4K4r0R8jr5M4Mj4l4J6pN9k9l1J05n9j1N3j18Q0j2k4j4rj2oM8j1%L6K0
7527C2Nm6O9n7j6k7N9k3k6P6n3L5k0N4q2L9L4%k0k3OJ1n3K3lK4j9l4Q8j13R0n
7559B5n8K0M4o4JL2l0O0p1M2QJ2kK9l9l5j0K6NJ2J4j6o7Q7L0n8j3k0K2K5j2M4
7591D3l7K0km1L5l4j5J4ll3N0L2m0k5L9K8rRm9k3K2L8q5M3L2pk6L6j5j3J8l0L6
7624Hn0L8jL9n8J8pK3l0K8kJ2o5M4%Nm5R1o9k6P3n9J6L2Mn9J8m9N5nL2j0k2K8
$$ y = [-10, -10, -6, 7, -13, 23, 27, 32, 56, 0, 12, -4, 51, 9, 10, 27, -24, -49, 39, -5, 24, -28, 41, -60, -45, -34, -57, -39, 23, -13, -52, 17, 5, 30, -22, -34, -9, -11, 29, -2, -30, 37, 50, -16, 25, -26, 2, -9, -32, -37, -15, 52, 10, 47, -11, -39, -73, -21, -11, 11, -27, -26, 20, 8, -22, 24, 21, -5, -51, 49, -53, -49, 53, -38, -5, -14, 27, -20, -27, -22, 7, -34, -5, 0, 31, -9, -7, 23, -11, -17, 32, 24, -30, 29, 21, 38, -22, -25, 76, 22, 46, -44, 54, 53, -42, 2, 6, -8, -42, -26, -33, 26, -3, -34, 71, 12, 1, 54, -64, 16, 4, -20, -34, -43, -55, -61, -13, -24, -24, 12, 32, 37, -9, 60, 3, -13, -40, 19, -4, -30, 46, -7, 28, 8, 62, -20, 19, 53, 53, 33, 10, 16, 27, -26, -3, -6, 18, -1, -35, 53, -60, 30, 25, -33, -13, 31, -33, -32, 0, -30, 30, -41, 1, 9, 21, 19, 48, 9, -26, -36, -10, -5, 7, 21, 5, -62, 25, 55, -3, -16, -36, -14, 11, -1, 43, 6, 26, 24, -17, 18, -16, -31, -17, -20, -53, -3, 29, -11, -36, 3, 31, 22, 31, -18, -41, -19, 19, -66, -23, 9, 2, -24, 12, -3, -16, 2, -28, 8, -42, -4, -5, 34, -24, -6, -13, 10, -20, 8, 6, 18, -47, -3, -3, 2, -43, 48, -21, -47, 26, -33, -17, 15, 19, -40, -22, -71, -16, -21, 11, 1, -21, 7]
7658GKmJ2j0pJ3L7o7K9o5L4J9L9o4J8K9k7N5r5P8m3M4j3o3Q0m6k0L4%j0O8n6L5
7691D3m1m7j1O6rK2J6n1K0n3N8j5MJ1m8RM3k9lJ3J0q%q1P4pM6k8%KK8l7M2m2p
7726a0JJ8Ll0pN8p8L3N5K0o5P6o2l0PL4k5n4M2K1n7M9Jk6K5j7Kk8mN1J3j5K6j4
7760A3l2K7l2Nn9P6qk4J9L2j4J2nj1N4l5J5k5K1m0N1o8JP0j5n4O9Qm0n2Ll2Q3
7793A3K6o1J0l9O8m2j2J2L5K2k4n8M0J8jol3L4rL8o3L4qkl6Q1L1o3j1K0q7J02
7825B9k9l7O4nqk8O2l7lj8ll1N0M9r1J5Nk1J4l0M4l0j0j9M9L1l8J4m0M6mpj5j1
7859d3M5j5qK3k2N8Qm5K9o6N9n8R6mn1K5nL5p8PlM2kk3M8m6k0N4q3O1Krm0J8l7
7894d8L7K%jJ3O2n5m0pK7J5k8Jk0L8N8p1L7J4l3k5M6m8P5m9M6q2jN2j5J1j4J7
$$ y = [7, 9, 5, 17, 7, 0, 13, 50, -17, 12, -53, -19, 0, 39, -25, -7, 22, -5, 50, -45, 33, -10, 34, 21, -42, 38, -8, -28, 6, 6, -4, 64, 8, 43, 2, -45, -56, 10, 1, 23, 39, -12, 8, -45, 13, -2, 2, 13, -35, -26, 17, -12, -15, -2, 8, 0, 0, -81, -7, -14, 32, 4, 4, 6, 34, -3, 39, -3, -10, -9, 9, 12, -18, -25, 33, -45, -12, 43, 63, -2, 74, 12, -18, -11, 23, -2, -56, -14, 7, -50, -1, 0, -26, -1, -18, -16, -44, -48, 3, 16, 1, 27, 13, -19, 8, -24, -19, -78, -2, -10, -34, -15, 17, 3, 15, 10, -1, 53, 18, 33, 8, 29, -11, 40, -28, -27, 43, 28, -26, 43, 51, 11, -41, -38, -70, 13, 39, -22, -12, -51, 17, -25, -37, -25, 10, 32, 8, -50, -10, 8, 7, 1, -32, 2, -7, 31, -32, 2, -6, -8, -44, 37, 68, 5, -6, 14, -73, 29, 0, -37, 27, 22, 14, -14, 48, 11, 8, -10, -13, -44, 6, 55, -36, -21, -16, -37, -23, -53, -9, -39, -49, -68, -19, 12, -26, -12, -52, -6, -10, -17, -32, -43, 2, -13, -21, 2, -20, 38, 46, 1, 30, -36, 23, -35, 61, 57, 6, 31, 26, 61, -17, -10, -13, 29, 27, 4, 52, 6, -14, 40, -43, 18, 20, 11, -29, -11, -48, -11, -9, -9, -10, 3, 65, 10, -30, -37, -10, 5, -23, -22, -42, -4, 54, -17, 20, 34, 1, -24, 22, -26, 49, 0, 46, -36, -37, 15, 0, 11, -3, 14]
7927A4m4L5j6NK5o2R7j5l3J4q4K9N8l4J9K3k1M3p9J5M9n6M6o1O8o4j1N5n2O6q
7958B1p1P4j4J1Oj5M7q3M1nM3o2Km0R9n7pO8m9O2r0k3M6j4Rl9Q7m9j5J9k4j4P
7991b9L0J7k1K7k0o1K5L1J2o7Q5MOm9L0Nj3k8M3M4p5L6m1MKQ7m1k4j13J19k3%
8023Bk7N7o3kk0M8RML4r7M0Ql9J7K5k3J7K6k3j6j4j2M6Pl7l8P9%m0L8l7NJ3O6
8057E3m5J7Rl3mM1j8q9R6r3P3K6n2K3L1%m4N1o9L0n2L7K6Pp7L1J5l0O1rMl3lj5
8091c5M6Po1L4jk9P1m4O7l4k2L8j8J8p9j8Q2k9O5m5m2L4n1M6qJ8N8q6J7J5K0J0
8123D4%l2rk3JQMJ8l0N1n2M6n9m0N8j2K5l7L3qPk6L9k9l9P1kj8Rk9P0ml4J5qN0
8159E8k4j3k1kPk9R1r0KM2j7ok1L7K3q7M9M2n3k2Qk1N1k8RL6k1nj8PJ5j1
$$ y = [14, -30, 5, -11, -6, 19, -43, 54, 39, 6, 20, -64, -35, 23, -11, 8, 31, 10, 53, -26, -11, 38, -18, 28, -33, 35, -29, -40, 15, -37, 29, 21, -50, 24, 10, 21, 27, 12, 59, -24, 17, 12, 55, -7, -5, -45, 54, -3, -10, 58, 9, 71, -19, -42, 4, -10, -1, -40, 47, -2, -17, 2, -22, -36, -29, 1, 18, -3, 24, 4, -57, -32, -1, 11, -56, 29, 33, 39, -10, 20, 25, 12, -16, 27, 71, -4, 32, -9, -5, -3, 84, 43, 19, -94, 25, 2, 2, -25, 32, -31, -33, -53, -5, 4, 8, 42, -55, -15, -7, -46, -29, -4, -27, -10, 16, -7, -23, -37, -49, -3, 4, -33, -71, 8, 8, -32, 6, -31, -26, -13, 53, 8, 25, 34, 1, -3, 38, 20, -69, 27, -66, 7, 33, -19, 4, 35, 35, -9, 42, -27, 3, -49, -12, 14, 21, -56, -25, -10, -40, 21, 12, 16, -17, -20, -35, 11, 18, -43, -9, -10, -39, 32, -12, 55, 21, -1, 37, 19, 37, -42, -60, 22, -7, 58, 13, -29, 5, -46, 0, -8, 10, 68, -18, -1, 14, 34, 44, 44, 12, 3, -20, -19, -11, -7, 11, -19, 32, -20, 26, -33, -73, -15, -27, -2, -39, -6, -14, -7, -33, 6, -23, -62, 9, 7, -11, -2, -31, 39, 35, 1, 16, 8, 58, 34, 21, 0, -2, 5, -24, 67, -23, -21, 21, 4, -2, -23, 14, 37, -50, -1, 41, -12, -34, -26, -47, 4, -24, -15, 21, 0, -5, -23, -16, -1, -12]
8191a2
$$ Imaginary data points
##PAGE= N=2
##DATA TABLE= (X++(I..I)), XYDATA
0@%%%%%%%%%%%%%%%%%%%%%%%%Qj6J6j6J6j6J6j8K6l2L2l3M1m8N0n8O4p0P8q6R6
45E0j06J17j30J45j59J75j93K11k33K58k85L17l50L90m39M95n64O50p58R01j102
66f10J408j938L105j1308N356M805j5437R974N042j1103O90R304p675m54Q860
81A9n399m322J0840m408q042J1478J888j2451O918P875j0287j19J0995n747n553
96f315Q325j661o547P867P51p281O772K444j0313L731P157q691j246J0437m750
111F80p552Q286M82q809N420L620p686K771M550p182R11O367o166k739Q081l158
127b124o936P723K185q397L997M913p682L92O018m558r83O137l185l439N948j126
143a117n992N833K980p243K819N618o441q16O272l237k742M983j053l666M427
$$ y = [0, 0, 0, 0, 0, 0, 0, 0, 0, 0, 0, 0, 0, 0, 0, 0, 0, 0, 0, 0, 0, 0, 0, 0, 0, 8, -8, 8, -8, 8, -8, 8, -10, 16, -16, 16, -17, 24, -24, 26, -32, 32, -38, 40, -46, 50, -56, 61, -69, 76, -83, 92, -101, 110, -123, 135, -150, 167, -183, 207, -232, 263, -301, 349, -409, 492, -610, 798, -1140, 1965, -9343, -3987, 818, -14619, -4645, 397, -10706, -10016, -712, -8387, -8841, 19, -5380, -9702, 1138, -3270, -11312, 166, 2054, -10397, -3479, 4396, -5891, -6010, 4985, -762, -6315, 2010, 349, -6198, 1669, 2420, -4861, 1911, 4355, -5958, -2227, 4930, -3761, -5007, 5430, 680, -6872, 1414, 1896, -6913, -1493, 2127, -5559, -2788, 1762, -5420, -4509, 1858, -4308, -7047, 1034, -2124, -9060, -1337, 848, -7549, -3552, 1361, -6321, -5929, 89, -4469, -5452, 685, -2500, -5939, 9, -1117, -7109, -1276, 1704, -5539, -2720, 2898, -3543, -4359, 1913, -1324, -4066, 917, -136, -3802, 625]
158F25M27m956L837K596o473J810N358n543j126O366k865l945M556Mm407L283
174d53J885m471K128K903n171Q04M778m790j441O040k323m234M766J032n082K259
190a370L144m329M83L857l663k82M374l436j738M947j765l964M540J400n203K030
206i75L996m610q11M795k773j966M239j554k605L786o40l549L284J428m653J760
222h48L797m391j028N012k597k983M526o73l597L271Q42l710K029K123l959O79
238a507L793l694j403N060k073l599M506K61m480K813K219m021Q07L213l107r12
254b124L982k264k325M453j010l715L793R82m365K166K754l780m3L749k606j681
270b034L933j312k933L753J42l846K919J637m042J265L024l247p50L798j794k413
$$ y = [625, 1052, -3904, -67, 2529, -3944, -2134, 3224, -2319, -3445, 2921, 56, -3889, 667, 671, -3736, -453, 1432, -3039, -911, 1992, -3179, -2375, 2403, -2387, -3828, 2212, -111, -4345, 421, 1453, -3629, -1370, 1774, -2555, -2072, 1785, -1878, -2160, 2214, -1222, -2960, 1987, 222, -3742, 798, 2198, -3005, -975, 3021, -1589, -2400, 2395, -378, -2344, 1895, 341, -2264, 1522, 882, -2667, 617, 2045, -2608, -848, 2949, -1442, -2470, 2542, -55, -3038, 1488, 815, -2782, 489, 1331, -2379, -350, 1773, -2186, -1507, 2286, -1408, -2811, 2249, 176, -3423, 1083, 1344, -3136, -323, 1896, -2125, -1318, 1895, -1212, -2124, 1858, -406, -2731, 1722, 712, -3003, 790, 1772, -2593, -427, 2327, -1453, -1496, 2253, -353, -2034, 1899, 587, -2346, 1407, 1549, -2297, 622, 2259, -1783, -518, 2506, -741, -1491, 2307, 513, -1900]
286a900L619l35l456L016J028l830K053K221l663L94L364k601j696L701q30l192
302b107L225P64l669J954J914l513R48K599k894l75L201j944k027L419l36l479
318b320K723J578l862J429K475l132m9K768k077j046K804j061k102K795J85l220
334b112K296J621l721J020K940k869p28L180j468j928K666j42k502K075R94k898
350a576J406J955l113M56K851k580r35L204j109k290K613N48k882J512J736k885
366a089N69K508k460l49K759j926j291K831p08k384K443Q36k981J193K254k967
382g62o9K788k071j116K930j110j902K471o8k494J767J264k763O98K410k552n79
399a158K964j782j642K853m97k384K196P39k632R81J907k581o9K633j897j180
$$ y = [-1900, 1719, 1384, -2072, 944, 1972, -1858, 195, 2416, -1247, -853, 2511, -90, -1786, 1915, 1085, -2107, 1118, 1882, -1787, 167, 2081, -1432, -484, 2115, -779, -1154, 2047, 103, -1924, 1495, 1159, -2320, 403, 1981, -1881, -452, 2023, -1109, -1158, 1610, -467, -1513, 1291, 230, -1872, 923, 1108, -2112, 184, 1805, -1916, -896, 2044, -825, -1553, 1627, 159, -1769, 897, 755, -1747, 328, 1322, -1576, -170, 1785, -1328, -872, 1979, -601, -1536, 1668, 559, -1731, 882, 1430, -1452, 60, 1796, -1089, -520, 1988, -472, -821, 1938, 12, -1279, 1552, 844, -1540, 903, 1739, -1242, -49, 2205, -762, -831, 1957, -114, -1230, 1700, 590, -1312, 1159, 1091, -1403, 364, 1628, -1135, -437, 1973, -579, -1158, 1806, 24, -1618, 1235, 738, -1646, 550, 1289, -1343, -362, 1545, -1036, -1105, 1528, -369, -1549]
415a549K906j020k075K472Q8k529J647J248k429N17K236k167q08K786j318j812
431a807K669j69k362J961P60k412Q85J647k035j15K291j609j073K547q42k020
447a684K389K06k540J610J325k316M65J963j762p54K244r26j571K260j56k066
463a313J913O15k412J191J461k197N8K259j494j273K362m29k025J923M38k152
479a075J266J048k043N72J551j697l26J882j044j324K140j78k159J738P22k279
495a206Q40J593j968m2J812j255r11J868o33j484J754K13k103J495R51k256P07
512f25J624j885l19K045j141j189J980p9j907J449P59k115R29J412j973K66J785
529A016j565n72J932o91j460J781L83k044J146J188k074M75J828j747m35J947
$$ y = [-1549, 1357, 337, -1738, 734, 822, -1707, -60, 1188, -1241, -724, 1512, -655, -1463, 1323, 5, -1807, 862, 693, -1669, 292, 1052, -1360, -475, 1172, -863, -978, 1313, -296, -1369, 1178, 336, -1684, 705, 911, -1629, -19, 1306, -1010, -545, 1418, -344, -1098, 1146, 220, -1351, 909, 753, -1313, 600, 1215, -1197, -6, 1455, -742, -684, 1575, 81, -1192, 1170, 741, -1284, 639, 1077, -1075, 191, 1239, -804, -232, 1319, -378, -704, 1178, 134, -1190, 950, 772, -1387, 351, 1073, -1206, -366, 1227, -741, -783, 1029, -226, -1137, 731, 98, -1386, 368, 581, -1522, -27, 924, -1332, -625, 999, -886, -1205, 840, -301, -1490, 490, 411, -1496, -47, 712, -1403, -474, 938, -1035, -769, 1016, -549, -1121, 811, 120, -1340, 441, 824, -1220, -74, 1114, -960, -485, 1343, -404, -839, 1108]
545A108j068r70J762k38j482J335N96j970Q69J391j979Q1J982j539p98K074q26
562C28j331J701J93j926J075J108j942L46J692j714l53K006j204j090J962m53
578C98j659J529N90j933P21J533j902j99K066j371r94K035o78j393J636J23j674
595a172J056R17j758K68J716j645m84K006r00j373J874o7j696J213P70j723N73
612d25J233j371k66J652j087q49J822n19j405J639K04j741J062R49j678J90J636
629A046j260o90J787o14j361J727Mj626J280N08j563O42J177j430k22J606r05
646A06j033J785k95j542J365M17j587Q36R07j361P3J188r68n27J366m85j098J344
664D91O6j483J119O10j532M87J005j192j82J290o33q59J246j15j253J054L35j352
$$ y = [1108, 40, -930, 832, 594, -888, 447, 1043, -927, -58, 1333, -646, -565, 1417, -122, -920, 1154, 328, -1003, 698, 891, -1035, 40, 1148, -794, -448, 1244, -470, -823, 1183, -21, -1111, 851, 398, -1261, 268, 858, -1075, -354, 1179, -723, -922, 1144, -227, -1221, 814, 136, -1257, 379, 502, -1172, -116, 801, -957, -689, 1027, -618, -1102, 904, 4, -1369, 505, 438, -1258, -45, 725, -998, -425, 808, -563, -829, 823, -264, -1113, 709, 190, -1215, 424, 628, -1113, -51, 898, -780, -590, 1046, -214, -904, 883, 269, -1092, 635, 639, -987, 293, 801, -762, -120, 1057, -373, -595, 1011, 106, -927, 858, 563, -979, 386, 803, -784, 52, 959, -402, -329, 859, -109, -636, 730, 245, -853, 491, 557, -926, 193, 803, -729, -242, 763, -429, -611, 679, 46, -813, 433, 318, -935, 119, 454, -898]
682h98Q09O94j356L60J055j126k44J255n69r02J233J32j387Q78O98j399L82J008
700F23j161p0J148o53o00J106k43r15R54K88j280P12P52j305K76J095j041k94
718f08J178m94o97R47L4j022P79M58j170M99Q52j140P8J089r13l79J175m58p64
737e56R05L09j228O06Q13j174J13J081r97k52J057o15n14R86j45r26Q34L43j155
756e15M47Q93j123j05J199q89n30J216m51q37R45J96j024N21N71j027J97R37r87
775c66k21J192p53n84J143k04r94Q20L93j090L76P74r13j30J077p07n05J087l11
794H4p72R72K3r35O70M25r69J93R38q51l69J205m85q28J179j54q84Q00K33q81
814d06L70O72r07rR87p44m12J072l89q00J014N2r96O64N44j007J52Q10o89l41
$$ y = [-898, -89, 605, -751, -391, 664, -462, -706, 549, -20, -922, 311, 443, -944, -66, 632, -767, -385, 623, -538, -608, 540, -113, -713, 393, 150, -765, 189, 477, -803, -91, 661, -644, -368, 727, -314, -608, 570, 76, -621, 326, 360, -662, 117, 575, -595, -96, 756, -384, -306, 783, -130, -509, 666, 208, -556, 349, 658, -570, 36, 849, -325, -212, 869, -128, -380, 677, 62, -452, 534, 389, -537, 297, 640, -515, -68, 825, -298, -403, 796, -93, -623, 593, 142, -695, 250, 446, -578, -57, 514, -513, -316, 621, -366, -587, 605, -148, -732, 411, 207, -787, 33, 426, -664, -288, 486, -427, -557, 520, -187, -692, 395, 84, -688, 284, 307, -628, 42, 467, -502, -309, 629, -222, -591, 614, 129, -699, 480, 326, -558, 242, 475, -406, -36, 636, -271, -280, 707, -37, -449, 623, 234, -566, 448, 500, -496, 168, 712, -295, -143, 667, -22, -363]
834c63R49l52o91R63j14q64P23K33q79M72N32q82n1R13o21m58J010k48q39Q19
854B52J92j004O23M16r00K01O86p20j39Q12m22o10Q91l2j007Q07M02j113M37P32
874E04q73q8P74m17l94P08j28p07P23J36q12N23N29r89K90P17p66j25P93l81n70
895e53Q12O3p74N11M14q22L24N70p72M2P27o34j21P37l48o19P63J24q59M46N95
916F26r42K33P29p60j35P91m58l81O70r1o33N20K83q26L59O18q70O0P54o25k74
937c52P99l28o02P08J13p07L29M77p11L0O50o75o6P41n45l12P11j61o02N56K24
958B77p35K94O02p85r4Q45n94l22P62l02m74O79l6o35M39L78o85J16O56o19k02
979d35Q93m93m52Q02j80o64N92K62p04K39N40n24j59O88m58l24P71k44n46P05
$$ y = [-363, 586, 234, -457, 506, 392, -472, 251, 484, -395, 77, 609, -273, -324, 589, -32, -490, 520, 272, -567, 252, 444, -560, 63, 479, -421, -220, 466, -254, -393, 419, -3, -613, 278, 246, -761, 46, 448, -665, -228, 504, -369, -457, 317, -100, -494, 214, 86, -621, 102, 238, -574, -51, 478, -511, -221, 496, -270, -395, 398, 17, -553, 259, 322, -452, 59, 473, -349, -25, 545, -227, -185, 542, -92, -213, 524, 176, -443, 320, 444, -415, 31, 626, -316, -83, 646, -114, -249, 542, 84, -297, 373, 282, -351, 169, 452, -374, -15, 603, -267, -207, 547, -78, -352, 447, 119, -483, 225, 338, -369, -40, 437, -274, -244, 406, -269, -335, 406, -139, -451, 260, 99, -503, 53, 277, -458, -164, 438, -347, -441, 404, -190, -512, 250, -52, -526, 153, 117, -518, -79, 299, -386, -270, 386, -233, -435, 458, -35, -487, 315, 135, -529, 63, 325, -379, -140, 400, -124, -283, 405, -53, -377, 394, 150, -396, 309]
999C09J2o37M30L52o51P6O52o62j64P25k86m91O57m5o01N21J11n69L63K49n69
1020b18J23N16m24l85Q13k61o31O92K6p18N41K25n42J07M34m17j87N37k09l96
1040c74N55j05n69O32J11p19M20L54n98j7O28m79k63O46k15m08M70Q8n82M52J84
1061B11n79K75L39m76o2N37l37k79O20q6o41N50J94o66L55L64n16M1M68l91j26
1082b05M99j94l94N04P1o33M97K99p77L07N10n97p1N91k68l95N41k5m84L43K55
1103C74o05K66L21n44P7N62n41j08N14j59m35M26J33n72K38L99n59P0M68m47r9
1124b21N57l41l24M93p8m19L98J39n66K42M79o30j4O23n32j22N25k14l53M51L5
1145A28m26K05L50n63J20M14m29j03N77l93k14M86j10l95M35J63n34J22M65m34
$$ y = [309, 321, -316, 114, 466, -185, -109, 543, -119, -283, 442, 156, -335, 322, 277, -324, 197, 308, -261, 102, 351, -218, -95, 421, -3, -388, 425, 164, -467, 225, 251, -467, 74, 299, -243, -136, 298, -119, -306, 231, 22, -374, 181, 76, -493, 139, 250, -469, -49, 305, -293, -310, 318, -161, -424, 222, 7, -401, 69, 157, -425, 27, 211, -368, -93, 246, -230, -292, 245, -92, -371, 249, 163, -478, 72, 266, -400, -45, 319, -197, -156, 312, -79, -205, 294, 100, -294, 210, 281, -352, 145, 444, -333, -26, 484, -113, -184, 407, 139, -256, 285, 260, -224, 119, 374, -231, 35, 356, -188, -111, 451, -90, -198, 316, 157, -278, 148, 281, -291, -53, 346, -213, -143, 325, -122, -221, 336, -5, -329, 164, 86, -333, 65, 204, -362, -120, 359, -271, -285, 338, -194, -316, 209, -5, -358, 93, 128, -298, -93, 257, -306, -186, 228, -201, -304, 273, -120, -334, 152, 42, -353, 82, 245, -289, -167, 298, -136]
1165a36j16M98k95k80O33k77k55L97j0k77J79J85m27K6N14l81k22O07k65l04M46
1186B40J5m18L16O6l27Q9L07m03L7L77k44k83M85j11m23M75K3m15K58K12m33L9
1208a18L80l09j59M38j82l16L68J4l98L81L7m07K71J76l68j7L99k46k26M01n4
1229F5m31L78J34m53K66J50l04J00K27k39p2K99k06j53L48m1l26L20N8m21K48
1250e3K67l67J8K61j72j35L39m9l19L19R8m26K34K36m55K30K28l51l2M07k26k32
1272a80L47K9m04L53J93n67K66K08l06O6K86l22q5L37r0k73L05O9m52L59J42m41
1294a60R9L20l47o9L30j44k04K79L1l61J69J72l32J54K67m15J02L08l72q9M26
1315A64j54k70K92K7l16J58K54l86N8L76m06J9L47k56j04L29j46k55L17R6l86
$$ y = [-136, -252, 246, -49, -329, 304, 27, -228, 169, 159, -118, 61, 246, -181, -155, 359, -22, -244, 363, 98, -206, 240, 255, -163, 153, 219, -108, -19, 288, -115, -78, 299, 55, -228, 257, 146, -277, 198, 221, -194, 64, 276, -157, -118, 262, -47, -206, 232, 50, -266, 102, 116, -282, 99, 136, -271, 0, 176, -192, -209, 190, -56, -282, 119, 65, -366, 12, 146, -307, -41, 109, -195, -95, 132, -107, -179, 120, -86, -239, 109, 68, -258, 62, 120, -301, -53, 214, -153, -135, 126, -46, -181, 158, 109, -210, 109, 207, -219, 15, 251, -204, 26, 254, -97, -129, 278, 52, -180, 167, 196, -208, 145, 338, -229, 37, 245, -61, 5, 291, -31, -116, 221, 131, -142, 163, 232, -220, 139, 281, -160, -61, 259, -88, -157, 173, 29, -175, 104, 135, -226, -57, 115, -217, -63, 204, -211, -109, 199, -173, -262, 164, 10, -260, 32, 59, -257, -99, 155, -231, -173, 203, -203, -184, 163, -93, -197, 132, -14, -269, 48, 144, -242]
1336b42J53L43l96m4L92k82j08L05k9k24K64K7l41K02J07k30O9K94l58k3L84k06
1358E7k10L78j13k90K85P9l00J19K27k17r8L34k05j88M24k85j45L43o8k72K43
1379I8Q4k64K8K66k32p2K96j41k66M07j28k55K74K7k61J35J03k14nK79k38j72
1401b51M01j56k43L27jl80K41J20k45Q0K62k82l0K39j20j43K33Mk83K50M5k30
1423a62J26O4j35K8K36k14j46K98L2l54L45m9k64K78P0l38J77J53j42k5K53k09
1445B2j57K85l8k85L23J17m35K31J49k62L6K03j72m6J54l7k35K49P9k98K14J48
1467B45l21O1K37l01J8K73k30j14K66n8k80K54J21l03J03K37l55O9L02m00mK48
1489F8q3j63J67J48l37J17J74k72R1K26k79L9K16j86j26K61n2j47J26Q1k77J52
$$ y = [-242, -89, 254, -142, -186, 206, -76, -184, 121, 92, -132, 132, 159, -182, 20, 127, -103, -34, 260, -98, -121, 263, 57, -153, 225, 112, -178, 107, 186, -114, 5, 232, 15, -83, 251, 46, -142, 282, -3, -148, 195, 127, -145, 98, 182, -82, -54, 212, -20, -92, 204, 63, -203, 204, 76, -179, 95, 122, -139, -4, 99, -115, -120, 159, -79, -251, 150, -6, -249, 78, 77, -303, -62, 58, -187, -107, 155, -127, -157, 82, -38, -181, 52, 56, -227, 23, 68, -162, -36, 28, -107, -79, 157, -57, -203, 95, 127, -227, 118, 69, -195, 83, 153, -185, -8, 145, 3, -22, 231, 22, -135, 150, 112, -173, 150, 267, -168, 63, 212, -50, -14, 189, 17, -29, 125, 88, -147, 102, 181, -117, 97, 245, -76, -15, 222, -79, -61, 212, -18, -132, 134, 76, -204, 50, 171, -132, -29, 208, -147, -78, 224, -176, -180, 68, -15, -178, -11, 137, -200, -83, 91, -181, -90, 136, -143, -104, 112, -74, -200, 61, 9, -138, -12, 69, -208, -56]
1511e6J94l00P9K52k59o9K87j30j25J67O8k43J20J40k29Q9J46k06MK67k39p6L54
1534B35j49k54K71N3k67J39J35j66r4K46j40n4J81j17j17K72o7k12J34J64k87
1555i4M9K77k74o1L33j86j72K25o1j55J55Q7j54M6J38j51j03J94j70QK27j70j80
1578a92K68pk63K20L3k02Q6J84j90o5J98j22n0J82k5k09J86Pk20J52J00k25J12
1601d2J30j72j18K71r4j56K14l8j41J79O5k32O5J45p6j11K14q2j20K42k1l13L44
1624A53j3k36J43R6k15P9J21j19j30K54m8k11J98N2k83K45J7k26J78J71k87lK44
1647A80j60p0J80Nk38J97kk36J46J09j90K6J41j95L2J60j28r0J62pk32K16J59
1670A65l01O6J64j52j14K54o0j46J24M4j77J03Q1j69J05J19k65O9J89k65M4K50
$$ y = [-56, 138, -162, -83, 169, -90, -159, 128, -2, -127, 40, 108, -135, -15, 125, -104, -15, 131, -75, -71, 196, -43, -119, 235, 86, -168, 103, 156, -111, 28, 163, -3, -97, 149, 9, -45, 136, 19, -98, 174, 107, -105, 29, 193, -94, -45, 232, -42, -103, 230, 44, -128, 97, 36, -119, 36, 123, -31, 15, 153, 2, -101, 93, -77, -69, 158, -12, -192, 76, 69, -194, 26, 59, -143, -57, 127, -63, -128, 70, -52, -102, 80, 55, -154, 32, 39, -181, -29, 71, -154, -42, 88, -84, -202, 69, -25, -181, 33, -5, -146, 33, 98, -134, -69, 76, 0, -111, 103, 21, -99, 143, 122, -191, 153, 140, -96, 47, 143, -72, 7, 128, 9, -121, 133, 85, -126, 72, 124, -159, 86, 103, -123, 55, 226, -61, -64, 180, 20, -50, 130, 135, -103, 94, 92, -144, 2, 111, -79, -53, 88, -107, -75, 85, -43, -133, 29, 22, -210, 6, 165, -136, -70, 94, -58, -172, 82, 22, -124, 0, 44, -133, -30, 51, -118, -13, 106, -159, -90, 99, -166, -122, 128]
1692A28j57j05R3R1j64P5J51k43O2J96k05NK07j44l5J55o6j39J34Q1k24J62R6
1715A54k26K0K43j95r0K31l9j24J07K5j31J50K4k22O2K52k42q5L04k34o0J99n9
1738F4j43J44N1k15N4J91k04l4K02j25p7K24j60o3J78p1r0Q2K0j38Q7J13j37k8
1762g5J73r2j60K96j30j26J06j5m5J28k1j76R3J00j18p2J83o7j06K03k1j92J12
1785b2Q2j12mJ90j84m5J81j04r3J55J8j79K09n4q0J05Rp6o5J68o0j19J79k0j39
1810f0J73j1j27R7l5q6J12L4r6K2R7j07q7J97o7j49J68L4j86Q9O2j96M9J96j54
1835c1j8O3O5j41J07J2j57J55N1k45Q4K00k70N5J35j37m1J62K0j84O1J13j27O2
1859fL0r7K8J02j85P6J01k1j03J06j2j12J34L1j60N0J32j74k0K34j78l0J08J4
$$ y = [128, -29, -134, -41, 50, -114, -39, 112, -131, -69, 127, -78, -73, 134, -10, -45, 110, 44, -95, 39, 120, -104, 58, 154, -72, -52, 191, -4, -94, 137, 98, -26, 81, 106, -25, 125, 149, -73, -11, 241, -1, -86, 218, -16, -76, 123, 64, -79, 65, 116, -99, -45, 146, -58, -92, 110, -15, -92, 132, -28, -91, 87, 16, -74, 8, 28, -110, -23, 90, -47, -75, 98, 6, -154, 142, 12, -114, -8, -23, -68, 60, 39, -137, -44, 56, -62, -134, 49, -18, -124, 79, 58, -134, -22, 60, -52, -56, 134, -50, -95, 86, -18, -111, 44, 62, -117, 92, 38, -42, 63, 72, -4, -69, 99, 39, -80, 99, 79, -60, 113, 102, -25, 72, 37, -49, 63, 97, 1, 23, 120, 13, -74, 123, 56, -93, 75, 109, -77, 12, 74, -122, -73, 123, -31, -49, 14, 79, -62, 45, 57, -100, 55, 106, -139, -55, 145, -125, -70, 65, -72, -113, 49, 69, -115, -54, 59, -68, -6, 24, -73, -45, 57, -128, -52, 49, 28, -75, 31, 19, -93, 41, 72, -88, -38, 94, -80, -100, 134, -44, -74, 34, 48]
1883D8q2Q2lj27R7P5j44N0J21j22j0J25j04m1J23Qr3PR9j52K3J79j96M3M3Jm6
1910DR5p7p2J40Qj69J13R2j48QN4%r3R5r1L9M0m5m2R9L7k24J02R2r5j8J69k08
1938i5j9J89r9o2J25mj27N8M7l9m5Q6r3MJ73j42r4J89m4j49J77J1j50O6J16j08
1964b9m3J76j47k8J20l7j06J21k2o3J15pq3J9J26j25m7J41p8m9J66p5o6P1J9r7
1990b8Q6Nj3q4J37j04LR4mj23J29k0j12J47%j40K6J17j02o3J52p1q3P9Np6QR2
2018E7j46N4R9j44M8Q5r2kO4J4j46J50qj47J07Q7j41kJ00q5J3Q8l9j18Q9qn7P6
2046dJ2m1M7N7j06J5P1k8m4O6l9m7R7L6j80R0kr0R5N4j20K5Q9n9k7PM1l3K8M2
2076E2j16R4Q7j17k0J25j09p8J07J4n1P8K4q6mR0j09k1O4j9J7k5Pm6N0k2k2K5
$$ y = [48, -34, 48, 45, -82, 15, 90, -54, -4, 117, -5, -15, 110, 6, -35, 88, 96, 3, 10, 109, -43, -20, 159, -37, 6, 49, 50, 4, 99, 22, -50, 90, 98, -71, 42, 134, -14, -6, 48, 48, -45, 50, -41, -2, 38, -7, -49, 50, 87, -137, -35, 57, -38, -56, 113, -95, -114, 75, -24, -86, 39, 35, -92, -34, 13, -26, -71, 15, -78, -74, 99, -43, -137, 52, 8, -141, 36, 47, -103, -37, 79, -29, -72, 104, -43, -71, 49, 12, -94, 27, 5, -58, 57, 50, -33, -14, 112, -13, -60, 81, 3, -46, 120, 45, -21, 50, 69, -28, 58, 63, 50, -34, 103, -1, 2, 96, 92, -31, 98, 78, -34, 113, 113, -27, -1, 116, 14, -49, 103, 32, -51, 28, 33, -43, -35, 57, -89, -35, 64, -80, -32, 53, -39, -41, 23, 37, -109, 41, 33, -114, -7, 80, -61, -63, 37, -48, -35, 53, 14, -104, -15, -23, -80, -4, 8, -33, 14, 71, -35, -20, 51, 23, -21, 45, 6, -41, 56, 92, -88, 2, 0, -90, 5, 59, -61, -36, 53, -6, -33, -26, 15, -18, 10, 52, -64, 30, 117, 0, -20, 105, -4, -82, 25, 39, -12, 66, 90, 4, 0, 90, -19, -40, 24, 5, 22, -3, 4, -42, 8, -14, -36, -11]
2104a1N3m2MK8r6J2J61j14m2J16k9r5J15n4q6M9O2j05J1Q2p7LQ4j03n4J97m7r6
2132g4Q2J6j00oJ54j37RJ24p7o2P8k1k1J8O1j12M9M4o5NQ6j13J7Q5l4j16J28l5
2160a7m8J53k9p2k5M8j1o3J12m1m1R7k9p0O2l3K0O3l1k7j7L6m0n8J06qo3L9K8
2189D1o7J05k8n5L4kko4N5l5JO7j12K8N5k6l2M2k3pj0L8k1l9M0K9k8N4p8j2Q4
2220C2n0m8M6O3j43P6O1k5r3K7O8o7P7P2j67P0N7k9n8Q5j21O5Q6oj17N9Q5j55
2248e0J18K3j50O1R4j49LJ03k9K0J0j5ml5N8j6Ml0n8L9K8m5M3L7lj8K4m7J3K6
2278E5l4n8L3N3l9l6L6n0L3L6k1k5O9Rn4J5Oj09L2P5k3l3KK6j8k3K2n1Q5j0o8
2309f5K2K9q5L7J45j20M4J2l3n1R6k6l7K3Qk3j1L5m7MR0p5j1J23k4n2oK4p5K0
$$ y = [-11, 42, 0, 4, 32, -64, -52, 109, -5, -47, 69, 40, -55, 60, 6, -80, -31, 31, -74, -63, 19, -58, -55, 29, -74, -128, 69, 22, -74, 8, 24, -76, -82, 72, -65, -56, 68, -9, -71, 7, -14, -35, -17, 44, -68, -19, 25, -40, -35, 51, -62, -45, 40, 6, -110, 18, -17, -65, 88, 59, -13, -38, 10, -1, -64, 48, 7, -34, 63, 34, -36, 26, -7, 13, 76, 45, 18, 1, 37, -3, -61, 45, 37, -26, 13, 41, -26, 79, 51, -4, 30, 28, 26, -38, 17, -18, -17, 50, -62, -34, 21, -5, -37, 5, -18, -25, -35, 3, -18, -57, -17, 12, -16, 38, -40, -52, 32, -18, -66, -20, 43, -100, -24, 37, 12, -81, -54, 14, -53, 24, 96, -71, -1, 56, 27, -31, 54, -67, -2, 84, 78, -39, 20, 105, -50, 68, 91, -59, 2, 96, -53, -50, 53, 24, 44, 54, 39, 35, 0, 58, 42, 46, 16, -42, -3, 25, -20, 23, 60, 57, 39, 63, 16, 29, 55, 21, -37, -4, 49, 10, -26, 10, -40, -7, 29, 8, -17, 52, 61, 7, 22, 28, -81, -49, 26, 3, -30, -28, -2, -20, -43, -21, -72, 13, 3, -65, -43, -14, -99, -62, 83, -37, 7, 19, -14, -65, 31, 5, -32, -9, -1, -24, -35, 0, -47, -43, 47, -28, -39, 84, 60, 8, 2, 26, -49, -29]
2339b9J19k7q1P8p0RQ9r8K7O0q5l9P6K6j27J44o1J5n7P6nn1R8l3m4N4l5l4KNL7
2370C9r2Q9m8J4K7n7j4R4j02l1J13m3j4N0J4k7k3J7Qm1L6J3k2j1O2l3m3L8l2%
2400a9L8n1n4Q9k7j5M7J5j6rK9m0J8k0k3j0R6q9JK4J8o3J08J1o2L7M7q6K1k9J9
2431EJ6l0P6p1L2J0n6N5l2k3K9J3o6M8J6m5J5K4J9n5N2Q1j79Q4L8o6Qk6K3nM1
2462C1J9n6L5mp5O9L1j52J06P6j26P4Jk1l0L3l2j0N1k4m9%N2m9M8N1j33L9P0n5
2492c0K3k9K7KPJ8k9LK5n1m9M8LN5J1p0M2j1N5n1KM1o7M7K5o1n1J24p7O3p4K8
2524aK7pJ5l9L3L4n6K5L9q4M0M9l7j11J49q1j8N1j6j5qOO3r6N2L3n4LL2j1m1N8
2556C4J0j02N0J0l5J05p3l8P7o0l2L5N2r4N8MkK0j7Om2Q5l9o8J6J09j15P7l1O3
$$ y = [-29, 90, 63, -18, 60, -10, -1, 88, -10, 17, 77, -8, -47, 29, 55, -72, 72, 11, 26, -31, 45, 40, -11, 87, 54, 10, 64, 29, -5, -3, 2, 39, -53, 36, -12, 2, 29, -28, -42, 52, -50, -81, 32, -11, -25, 25, 39, 12, -11, 6, 14, -27, 9, 22, 0, -11, 51, 18, -25, 13, -19, -19, 19, -32, -86, 3, -24, -39, 8, 23, 7, -2, 27, -13, 5, -15, -38, -48, 48, -41, -40, -16, 2, -61, 47, 58, -4, 33, 80, -6, 15, -14, 5, 21, -9, 67, -4, 28, 38, -18, 37, 5, -18, 11, 24, -42, 6, 22, -23, -8, 16, 35, -20, 32, 113, -66, 18, 56, -10, -2, -28, -5, -10, 31, 50, -6, 29, 25, -50, 19, 50, -102, 4, 80, -46, 28, 29, 8, -22, 11, -21, -31, 20, -4, -53, -53, -1, -50, -2, 49, -84, -45, 25, -30, -7, -36, -9, -7, 0, 18, -11, -8, 17, -34, -83, -35, -32, 23, 34, -36, 6, -5, 50, -1, 1, 42, -25, 22, 47, -14, -65, 59, -18, 45, -29, -1, 26, 19, 34, -5, 28, 62, 6, 31, 70, -14, 26, 75, 38, -73, 76, -5, -23, 28, 12, -3, -11, -5, 58, -38, 14, 47, -7, -4, 28, 17, -24, 34, 44, -58, -8, 2, -33, 72, -1, -39, 38, -22, -54, -19, 33, -61, -3, 1, -1, 19, 2, 8, -34, 51, 12, -56, -40, 69, -46, 31, 0, 63]
2586F3j19L5P0j10Q8q5j9N4J8k9M4Ol2Q1p4j6L6K5o0M3M3p3M2j2O5o7l7N3lm5
2616a5L2j0K4l7L9m5L5rn0P2J0m6K5lj3j5pK8m2M9j0m3K2lj6M5Nj4K5K4j11L9
2648a5P0k9m6J1L1m0M0L6jr4P9k9Qk1m2O1o3K7K7NM5p3ML9m4MJ4m0M1L0n0K8j5
2681bn3L1j4J9N0l9J8o9P2l5j8O4l4M0ok6L7k0J4l4K2l5O4j2LRp9O5j1MpN0q9
2714b1M3L5M4q8l2K3L4j1L3k2qK5k9k2m6J0Q1Nn1J2rL1l6m2R3o5k5K7j9K2j1j
2746b0Jn8Q1j5j3O5n1j2ML1rN1p7K5P2p0Mk7J4J1kJ0%nM4l1n4M0M4oo9K0Qj8L8
2781B6J4r2Q3J1n8L5lm1M3m3m3O7L8l0j7L0k3M6J8L1j02L0O4j31N4N8o7j3RK6
2811B0rKqM2p5N4k0J4O4r1L2k6%koJ3n7K0L7m2N2l7kJ0J4j2ONm1K4K8m1K4MJ0
$$ y = [63, -56, -21, 49, -61, 27, -58, -77, -23, -5, -34, 10, 16, -16, 65, -9, -25, 11, 36, -24, 19, 62, -11, 31, 19, 84, 17, -20, 33, 30, -15, 17, 7, 31, -6, 33, -12, 23, 14, -36, 36, 46, 0, 25, 22, 9, -6, -13, 15, -27, 22, 12, -31, -9, -12, -28, 17, 22, 8, 33, 57, -54, -15, 55, 26, -20, -9, 22, -18, 22, 58, 57, -37, 42, 13, 21, 0, -42, 19, -44, -17, 10, 15, 60, -13, -9, 30, -14, -10, 4, -36, 5, 35, -15, 13, -2, -55, -24, -38, -19, 31, -8, 10, -59, 13, -22, -40, 24, -10, 30, 24, -2, 35, 15, 29, -5, 17, -18, 46, 34, 37, 46, -33, 32, 21, 25, 18, 68, -21, 22, 57, 101, 13, -19, 4, 38, 27, 60, 38, 30, 55, 26, 4, -42, -32, 49, 54, 3, 15, 6, 37, 1, -41, 52, -13, -38, -11, -30, -8, -19, -20, -19, -77, 4, -11, -24, 41, -10, -22, -18, 13, 4, 55, -22, 3, 75, 5, 9, -18, -4, 7, 5, 15, 15, 10, 54, 23, -31, 9, 53, 47, -22, -2, 6, -12, 26, 40, -52, 31, 42, -16, 19, 16, -25, 18, -25, -68, -1, 37, 7, -10, 20, -3, 43, 61, 92, -10, 20, 84, -47, 7, 65, -2, -15, -6, 20, 11, 13, 5, 47, -28, 26, 6, 20, 84, -7, 25, -1, -1, -3, -9, 4, -53, -33, 4, -38, 14, -23, -25, -15, -1, -13, -7, -2, -43, -19, 9, -32, -8, -4, 6]
2846Fn5K3J6QJ7K6l5Kk0J5PKj5J4K7%m6oJ2j2j5N3L6p6J5P7q8P1p3pK8K1n9M7
2880A6K7j5j1l7P3l0l6n1L2L5k6KK5RlK2ok2k3P7k1k8jK4k4knk1M7Nm7M8l2J1
2914A2mj5NJ3k2jqlN9k7oK9l7KK4l9KL0n4L2L5k3m4K6K0m1nN5l4L5rjM4n5j6P5
2950E4k9qJ1q9Q2J7n1J6K1Jm1N3n3P7n3m9Q8n5O1p8J2l8J01o9J2j1M8k2M4lnl6
2982Hm1P5pl6OK8m9P2k7k1n8J06n3k7L5J2o5M8JK8l0K9n6M0J1n7N3k9j3j1K4q
3014a2JL0n6K6M9j9m7M6J9j0k8n4N3k8j0K3JK7L1j3l5K0r8Q0K6k7l0KM5r0Q1l8
3046c5J6K4%m3M3J7j8K1j3j3nM1q8L8J3pmK8j0Nj5m8M7m3N5qk1R2l4m7N2m1M6
3079D5m8L7m0L0l0L2RJ6l1l1j5JO4m0Ol8M4m6l1N2j6L6KL0m7n6Q8nn0J1M2j8L3
$$ y = [6, -49, -26, -10, -2, 15, 41, 6, 8, -12, 3, 10, 12, -3, 11, 38, 38, -8, -14, -2, -14, -29, 24, 60, -16, -1, 76, -12, 59, -14, -21, 7, 28, -31, 16, 43, 28, 17, -20, 53, 23, -13, -64, -32, 3, -23, -21, 4, 13, 10, 32, 26, 4, -19, 58, 37, 9, 8, 32, 8, 6, 1, -20, 27, 32, -15, 33, 1, 12, 8, -7, -2, 11, -11, -12, -20, -23, 36, 9, 3, 32, -5, -3, 21, -18, -16, 14, -40, -8, 27, 4, -40, -14, 6, -35, -40, 15, -19, 16, 7, 6, 50, -5, -21, 54, 25, 17, 28, -61, 21, 38, -13, 3, 24, 25, -16, 37, -16, 61, 8, -41, 47, -8, 53, -25, -13, -51, 50, -19, -7, -18, 30, 8, 52, 49, 44, 8, -33, 42, 35, -1, 5, 33, -16, 56, 29, 8, -50, 56, 3, -24, 11, 23, -42, 6, 7, 35, 5, 34, -22, 18, 29, -28, 25, -4, -17, -28, -4, -12, -11, 19, -37, -11, 38, 19, -28, 18, 37, 27, -1, -55, -2, -30, -40, -17, -16, 11, 42, 29, -6, 14, -84, -4, 22, -5, -35, -33, 12, -78, 3, -35, -19, 5, 5, -38, 5, 22, 4, 25, 12, -1, -6, 35, -53, -15, -2, -9, -13, 15, 5, 10, -5, -53, -6, -49, 6, -2, -23, 69, 35, -12, 40, -1, 45, -3, 34, -6, 24, -6, 26, 35, 51, 20, -11, -26, -25, 39, -1, 5, -33, 11, -35, -66, -14, -30, 6, 8, 38, -9, -65, 23, 18, -32, -21, 21, 3, 36]
3112C6m2m1M7JL5p9K3l0L1pK1l4j1M2L5j4mj1J4plN0l7lK1k3Nm7J4K0J7m2K4L0
3146C1l2NkL9o6KN8pL3p5J5N5o8j7KP6n0J3l5PM6L1n0l3L9j4nM1m2j3k1M1OM2
3180E2j2q2pJ27j05M6l1j0k8Q3p5M4N8q9OJ0l3L6j9L1k9L7l1kjJ4OJ1m8K6j3L0
3212BK6l3l1R8o6N4j4m1k1K3l%J8J3M2k2m3K9J6o1M3j2j2K2m2N7Qp4L5J4J7k5
3244A7J1l6L9J8m1k1K0J7k5rJ5%LL0p1J6M2nm4O8m0nj3NM7k6J8m3J8k9J9m7M6
3277fM0n1l3Q1j9l8J5nL6K5m2K2j9k2N8n3k2N3o7J8J2L8o0mP2l2m9P9qj02N9J7
3309gM8k9mk3J3K7jl9K0M7l3o3K8J4K0j9O2np4R1o8k2L2kJ3k8O0n2JK7J0j8j7
3342IO5m4qkl4P2p3N2L4m8J0m7L0n6j0Rj7M4j6K5M1n5J5J0lL5o0L3m2N4j6j2k1
$$ y = [36, -6, -47, 0, 1, 36, -43, -20, -50, -19, -26, -5, -39, -50, -8, 27, 13, 9, -2, 12, 5, 2, 52, 15, 12, 33, 10, 15, -32, -18, 2, 19, -23, 1, 31, -1, 4, 2, 41, -25, -23, 35, 28, 61, -14, 1, 56, -12, -29, -27, 49, -1, 12, -23, -16, 30, 61, 11, -22, 17, 3, -2, 39, -3, -16, -37, 4, 10, 52, 40, -42, -49, 78, -27, 19, -12, -22, -50, 33, -42, 2, 60, -29, -23, -13, -46, -10, -29, 2, -27, 10, -21, -23, -24, -10, -4, 7, -41, -15, -28, 2, 28, -5, -36, 62, -4, 50, 36, -5, -26, -3, -6, -6, 12, 25, 67, 45, 2, 31, 47, -14, 29, 17, 5, 27, -15, 42, 50, -24, 11, 25, 42, 17, 28, -8, 31, 49, 8, -13, 7, 24, -1, -10, 5, 5, 8, 38, -33, -17, 25, 20, -24, 44, 4, -1, -14, -9, 38, 12, 30, -13, 5, -24, -5, -52, -6, 34, -17, -50, 31, 12, -26, -11, -16, 20, 45, 3, 25, 6, -16, 42, -11, -33, 20, -47, -29, -17, 21, -39, -43, 29, -3, -52, 27, 19, -83, -24, -7, 41, 12, 8, -15, -2, 25, 24, -15, 5, 52, 19, -44, -16, -2, 18, -1, 61, 56, -18, 73, 5, -17, 15, 13, 26, -2, 58, 6, 7, 34, 44, 26, 9, 74, 30, 22, 20, -14, 58, -15, 37, 71, 23, 33, -14, 16, -40, -50, -41, -58, -14, -30, -5, 36, -19, -4, 6, 3, 38, -22, 11, -31, 23, 7, -5, -26]
3375b6O2o3j8k5J35k1o2N7m5K8%M3q2j7qO7j1k2J7nl3K6j5QL3n0J2%KM2j7M5k9
3408B8oJ5q8N2K7j3j2K3J3k5K0n4M4k5j0J6pL5lo7P3KK7l8KpMk2J0K1j7j6K5M8
3442G5j04L4qK1j6k2Jk3J9l0J06o0j0L5l2k4K0l4N5J6l1J3Om0K6n0M8L4J7l9o
3473cN1l8k5L3jJ4j9n5J8Q7m9llpK1j3k9L0O2p3M5j11M1L2k0j4%K2L1JQk5n9O8
3507A7l0K6m0P5q9M0qrJ1L3j2M3ln8J31j15k1l1N8k2J0K1q9P4J7l7k5M4J2l2K4
3538A5j3j2L6n6L4Ll4L2j1k4k1M6pK9m8L9l8J3L2k7O4n5L4rp7O3K0J7q8K9M6l9
3570gL3n0Q4r9OP5r5L3J2J5L5l2K1j1l9N5m1JJ0J6k6L1J7m7J7k9ML2N7o6rNJ8
3603B6PJm4RN7j7l4l9P1j4p0M3K9m6N0K0k3Onl9K0%j4KM6qQl3J1j5JJM7p4%L2
$$ y = [-26, 36, -27, -45, -70, 65, 44, -18, 39, -6, 22, 22, 65, -17, -34, -42, 25, 14, -8, 9, 4, -29, -3, -18, -10, 23, -27, -15, -15, -13, 29, 12, 57, 28, 22, 37, -51, 1, 28, 15, 3, 26, 39, 14, 34, -20, 24, -1, -11, 5, -2, 33, 30, -37, 36, 38, 65, 27, 29, 22, 26, 4, 14, 35, 18, 2, 27, 75, -29, 5, -3, 18, 2, -20, -19, -42, -23, -53, 53, -7, -17, 18, -14, -38, -18, -52, 3, 19, -12, 1, 7, -33, -7, -57, -9, 25, 42, 3, -3, 48, 10, -15, 18, 17, 31, 12, -43, -25, 62, 13, 10, 7, 0, 21, 8, -21, 9, 71, -2, 43, -68, -27, 5, -15, -29, -29, -7, 24, 25, 33, 8, -51, 17, -13, 13, -27, 48, -41, -1, -9, -18, -7, 26, 14, 57, 54, -4, 127, 12, -9, -40, 18, -4, 6, 27, -62, 12, 29, -8, -33, 11, 23, -9, 15, 2, -10, 26, -30, 4, 7, -27, 5, -6, -30, -51, -5, -12, 17, -31, 8, -30, -17, 15, -12, 52, -3, 31, 22, -55, 8, 28, 45, -43, -14, 32, -7, 26, -24, 60, -39, -33, 42, -53, -20, -8, 7, 42, 10, 31, 20, -19, 36, -5, -4, 6, 22, -4, 27, 44, -3, 14, -15, -11, 21, 78, 12, 3, 8, 26, 33, 34, -10, -1, 56, 39, 5, -34, 37, 23, -47, -4, 25, -21, 29, 49, 26, 32, 27, -12, 8, 8, -6, -4, 42, 34, 42, 9, 20, 5, 6, 7, 54, -20, -20, 12]
3639A2%k1k2pKM4k0O2l4j7k6j6N3k7L3J6k9j7M9n3L9j3rK7l6M8l6m5N8jRKj9l6
3673c0rM6n9O3l6M7M3Ln3Pj3m5N5j9k3L3K9n5Mj0J2M6J4j9l9J8M4p0MO2j17J60
3705I3j04pM3l9J1lK0n3Q2m1Kk2M6j9pK6m2kJ0L1m1J6ML2j1o9j5M5k4M7K8n9k6
3738d8K8j3K3j3j5Q0o9J3j7M7J1l1j2KK9M7m0j7j9J9mN3l4k9N3n3MK7K7k7l4K7
3770A5Ml3L5l0J1M3n6K2k9M4k4J9qL9k3r8O0j5NJ0k5J4J2M3k9m5o1J20n4L4PJ7
3802B4k3M3n0j0N8l4L4m1qK6K6m5J1Ojj7LM9m5k3j4J1j4L9k0N6l2k9k5J8J8n2
3834f1K2Q6m5L5o7j6L0k5j1M3oO0r6J0O8p4L5l1M5L8n8M5L6o8N8p0K8J3j2nL4
3865D1m1kK9L2j4n0L8l7j8%K0M8m8m2K3QoN2k5k2llN2n1mK3J3L7j01M3j6K3J0
$$ y = [12, 12, -9, -31, -38, -36, 8, -12, 50, 16, -1, -27, -43, 10, -17, 16, 32, 3, -14, 35, -18, 21, 8, -1, 26, -10, 38, 2, -43, 15, 14, 23, 25, 6, -30, -39, 7, -52, 11, -25, 22, 65, 68, 15, 22, 9, -36, 19, 0, -23, 10, 39, -16, -12, -22, -10, 36, 50, 31, -8, 10, 54, -16, -12, 50, -67, 93, -11, -18, 25, -14, -3, -6, 14, -39, 43, 2, 4, -18, 28, 9, 2, 28, -14, -16, -6, 25, -16, 0, 4, 36, 25, -44, -59, -14, -38, 9, 37, -22, -48, -20, -33, -10, -23, -38, 42, -27, -14, -31, 16, 27, -4, -16, -14, 15, 62, 22, 5, -14, 5, 1, 54, 20, -9, 44, -9, -5, 22, 49, 22, -12, 15, 19, -14, 21, -9, 2, 45, -11, 11, -18, 26, 2, 21, 13, 52, 29, -69, -9, -24, -19, -9, -34, -20, -8, 35, 6, -39, -100, 20, -34, 0, 7, 24, 1, 44, -6, -16, 42, 8, 42, 1, -7, 19, 45, 0, 11, 17, 16, -1, 2, 51, 6, -17, -31, -20, -34, 5, -15, 41, 9, -20, -45, -27, -9, -61, -39, 47, 2, 37, -30, -46, -16, -41, -52, -9, -15, 45, -51, -41, 27, -47, -12, -43, 2, 40, -18, 27, 63, -5, 53, -17, 11, 24, 12, 7, 41, 0, -2, 27, 59, 45, -5, 33, -4, -22, -22, -2, 46, -2, -44, -21, -13, -19, 33, 8, -14, -17, -20, 32, -19, -23, 0, 13, 50, -51, -8, -24, -1, 9]
3898IJ5m8l2Q5k3k7N5m3J1K4q0N6L6l0J3J8k7j4Ok4NK5L9on7jL5k1J2m4j8O0L4
3931D3m5j7N0j9K9l8j9K8k9j2M5j3M4p8K0oK5%Ok5J8M1J0k8m7L3k1%K4Nl8M1j9
3964Hm1M9j1K0jl9K8jJ3J4j7pk9j8K0j7NL8Lj9j3K6k2J7K9m0MK6Op6R3K3r7k3
3998d9O3j0j9j3N9k3M2l2n1P5n4j4K7L1%m8J8OJ3nj7O7r2M3l0J0J6j4M7l4j4j0
4030a2j7OK8N3n7K3%Pk7J4j4L3mK2n7N6r7O1L9n9k9L1j7J8J6k3J1qP9p8k2M1n
4063A2l0l2k7J16m7mll5N4K1Pm3M3J4j7m9k7P4Ok0kjk2K6nJ7l8J4M5m3n2J52r5
4096IK6m8M3n1L9Ol1L5j6l1L8mJ4N6o4%l4J0m2L6J2k4nK3k0mJ0j9P3m2J4J5m3
4129a9j2K0M9j5j4mk8L7K1Ml5M3l5nm8Q0j8p9Q8n2J0P5k6l4J9n4PJ8K2qJL2m8
$$ y = [9, 24, -24, -56, 29, 6, -21, 34, -9, 2, 26, -54, 2, 38, 8, 21, 39, 12, -2, 4, -20, -15, 10, 49, 43, -14, -15, 20, -1, 11, -33, -51, 9, 43, -2, -19, 31, 12, 41, 3, -16, 12, -17, -29, 16, 3, 47, -31, -11, -17, 8, 8, 14, -11, 7, 48, 58, 30, -17, 16, -5, -5, 19, 24, -14, 27, 8, -33, 16, 5, 25, 24, -15, 13, 12, 25, 39, 22, 15, -14, -32, -12, -29, -24, 14, 17, -2, -15, 11, -11, 6, 35, -5, -1, 25, 31, -45, 48, 71, -26, -49, 14, 4, -15, -28, 31, 8, 50, 18, -33, 42, -12, -26, 1, 32, 32, -16, 2, 8, 21, 16, -1, 66, -26, 17, -13, -3, 13, -1, 46, 12, -2, -12, -29, -23, 5, 58, 1, 24, 24, 31, 4, 18, 4, 37, 33, 55, -2, 54, -43, 18, 57, -2, -31, 0, -17, 1, 17, -6, 5, -3, 76, -2, -24, 17, 12, -18, -50, -77, 39, -8, -12, -15, -50, 4, 25, 32, -11, 32, 46, 29, -20, -47, 27, 33, 13, 11, 10, -12, 14, 9, 26, -12, 2, 47, 4, -48, 104, 9, 35, -13, 30, -21, 18, 24, -7, 28, 12, -19, 19, 15, 29, 85, 21, 21, -13, -3, -45, -9, 3, -21, -26, -3, -23, -27, -17, -36, 37, -5, 9, 24, -19, -31, -11, 38, 23, 9, 5, -23, 14, 35, 39, 4, 47, 12, 7, -41, 39, 21, -58, 30, -22, -12, 63, 37, 3, 22, -32, -25, -7, 15, 7, 8, 40, -8]
4162hpK0Pj3k1L2o2Pj1N7J3J8m1L1l9K3l6J0Q9p8m2N1L1l8O1m7J7l8J2RK1o4K2
4195a4O2l0o0J7QJ8O5p0Ojnj3Qk0J7%J9L6m6j0k6N8np6J00k4m0LL6KL1j1l9j6
4229b0J2pJ7J4K2m3L6lJ7J6o6M5m3N0j4n0K1J0j3m2O5PL0m9Qon1L7j5j0K9j4M1
4262C1m5K0M5j10N0M9kq2K5L1OpQL4l9Qom3L4mL6j1q6O2m3L8N6n4Q3m4k9L5n3
4295gj2J0M7K6o7l7N1L2n3K9p9O6j8l1J2M7Oj4O7n4KJ4o1Rl2P2k5l7N9n4P3j5
4327B6k3m1R8l7kj6L9n4M1k3M1q9N0K4Qn4L8k9m9P9J9l6j0N9j03O6j9k5K3L0j02
4358g1M2J1l1P0jPn2L4J0n9j6N4l1L3No4K3M8Ll9M2k7j3L2kl8j9N9J5k5K1l5N
4391ij1L3l5J5K7n0j5M6M4j2m8J5NLp3J18q8P3j6j7n4L4J3l0J9l5P8o6N8Ln4m
$$ y = [-8, -15, 5, 12, -1, -22, 10, -52, -45, -56, 1, 14, 32, -9, 22, -17, 6, -30, -20, 69, -9, -51, 0, 31, -7, 54, 7, 24, -14, -2, 7, 28, -36, -14, 48, 18, -42, -25, -17, 1, 66, -4, 2, 1, -4, -17, -9, -29, -12, -12, 7, 43, -3, -13, -39, 19, 14, -62, 38, 14, -26, -23, 13, 15, 46, 35, -4, -20, -8, -15, 2, 16, 38, -5, 31, 28, 45, 61, -5, 40, -3, 47, 33, -17, 4, 14, 1, -41, 24, 31, 61, 12, 20, 14, -37, 0, -15, -25, 4, -10, 31, -14, 6, 51, -59, -9, 40, 38, -44, -19, 12, 18, 11, 19, 53, 14, 22, 16, -27, 7, 3, 39, 28, -58, 4, -39, -1, 55, 1, 84, 40, 11, 46, -7, -19, -9, 38, 64, -3, -40, 11, 43, -10, 19, -60, 6, -12, -43, -31, 16, 22, 8, 75, 21, 23, 37, -24, -15, -47, 25, 0, -37, 22, -32, 41, 26, 3, -38, 60, 23, 21, 5, 44, -10, 31, 8, 49, -40, 10, 34, 42, -12, 26, -3, -52, 27, 46, 10, 0, 59, -44, 22, 3, -22, 1, 31, -71, -29, -18, -49, 21, 20, 27, -25, 9, 19, -40, -56, -2, -33, 0, 5, -59, -36, 12, 15, -24, 18, -9, -22, 10, 8, -30, -49, 10, 25, 0, 21, -14, -9, -20, 13, -22, -7, 20, -30, -45, 1, 45, 33, -15, 0, 5, 8, -65, 53, -35, 38, 22, 5, -49, -15, -2, -32, -13, -48, 30, -36, 22, 25, -29, -33]
4423c3L0J9K6j3K7nm8J4L1n5J2L7l5M2rm3l7lM3l1k1O4Nk7Pk3L7j6%nJ4l9N5m4
4457b4KN0k9L8n3mM3l9L0k3N6m7m5M5K5ql5j5oj1L5J8L6JQl7k4N1l9J6k9J7J4
4490A7LK9o6K0k6O5j9k5L3l3kmL2Ol6J2lK5l0K9l5j3N7m2j4N3k9Jk2M1J6%l0K2
4524C2k0J0k4J1k9K8k2M5J9m1%k4N4l2m7N8rJ7j0mJ5j9k9lJ4%lj0L5NNn5L2JQ
4559HK8p5NM4l2K4k3P5o4L2%mj8M2m4M0k1J8j2l0L5j6k1K5M1l9j7rOj2Rl4J4J5
4593a0M4j4J0%j4J7n5J8O0k8k5k8M6k3K3o6O1k9NL5l5N7p4K5L3N7q5K5m5K3L2
4624D0o9KK8m0P6j5j4K7Kk5p4N8n1Q7k8L0k8K0om3P7k1m9K7n8PN7k0j7J5M2r3
4656e6K3M3rk7M5l1j0P9q4O7lj6ll3L2QK4r0M1L1k4j4jpk7M1j0jl0N6Rn1lN7K4
$$ y = [-33, -3, 16, 42, 29, 56, 51, 3, 17, 48, -7, 5, 42, 7, 49, 40, -3, -40, -43, 0, -31, -52, 12, 17, -10, -3, -26, 11, -5, -5, -10, 4, -35, 20, -24, -22, 28, -1, 37, -16, -20, 23, -16, 14, -9, 47, 0, -45, 0, 25, 17, -18, -33, -39, -50, -15, 3, 39, 40, 48, 11, -13, 38, -1, 15, -14, 3, 17, 20, 49, -17, 3, -23, 42, 23, -2, 31, -2, -4, -8, 24, 30, -6, 6, 3, 28, -2, 27, -8, -21, 36, -6, -20, 33, 4, 5, -17, 24, 40, 40, 10, 32, 12, 22, -2, 9, -20, 8, -14, 31, 50, 9, 9, -15, 39, 7, -40, 18, 9, 26, 16, 12, 27, 8, -21, -24, -10, -10, -13, -23, 12, 17, 22, -33, -1, 0, 8, 36, -39, -34, 10, -22, 2, -21, 54, -10, 22, 22, 18, 0, 42, -2, 38, 17, 35, 23, -7, 28, 12, -9, 16, 57, 18, 1, -8, -2, -14, -5, -39, -25, -10, 34, 20, 30, 30, 16, 33, -22, -4, 56, 28, 3, -25, 21, -2, 21, -45, 16, -13, -8, 27, -8, 49, -25, 0, 33, 90, 5, 30, -15, 8, 40, -29, -27, 1, -39, 37, 22, 8, 35, 37, 12, -62, -4, -55, 32, 4, 34, 6, 26, 20, -23, 54, 33, -16, 11, -47, -40, 17, -3, -20, -5, 37, -56, -33, 10, 1, -26, 19, -12, -22, 57, -27, 40, 37, 21, 18, -15, 17, 25, 49, -41, 0, 31, 7, -7, -8, -15, -42, -1, -11, -12, -42, 14, 23, -28, -31, 26, 50]
4691E0j4l1qL6j7L9n1njj6k0l6Q9N0o6o5P3%j5Oj9O0q0N7j8K1K3m8R5j16K9Jm2
4724c9L7J5nl5K8j2J6Kmk1L5K0o3L9%Kj4k6M9n5L3Rnl3N6m1M3l6j4Jj1M2k4N0
4758C9n5K1k7M6rl1k3J4M1j4k9Q4l6L6n0J9r5O7nKl6%O2r7P2M9l7l4K3L8n9Rk1
4791c6L7L3j4k5%n9N8O5p2N3r7J01j6j1M0n8J6rk8J0L7oOo3M6J5J4m3ok7L3J6
4823A0k9J0Jj2K0k0j2K2rj1k0J24q1N2n2j4P7k4m2l0K4L0j6k8M8K0J7o1kJ3J8
4854B3N2o2m0P4l2M%MNm1K3ol9L6rJ3jl0L4l2M9j5J3J1J3p5K9k8J3L9n4mj4P4
4888B7k0j7j4k0L6J0k3K0L8n2O6k1l9M4l6J8l8L1jK0n3J7l8J8L6m6P6l7N0n3q
4919iJ8j0nk7R5j21M7jj4P0q0m9N6N1n2N7k5j4j1j0P1k4L8q2M3j6k2N3J9oj3m9
$$ y = [50, 36, 5, -3, 33, 16, 55, 4, -1, -2, -18, -38, -74, 15, 65, -1, -66, 7, 7, -8, -2, -21, 39, -41, 16, -2, 19, 42, -6, 89, -27, 2, 3, -39, -2, 13, 8, -27, 1, -11, 5, 7, 3, -18, 17, 37, -26, 13, 13, 15, 1, -25, 24, -31, 2, 11, 6, -27, 29, -12, 31, -5, -19, -18, -29, 13, -11, 39, -16, 5, -22, 24, 15, -16, -39, -25, 16, 2, -27, 57, 21, 57, 7, 26, -69, -2, -7, -5, -41, -41, 21, -76, -4, 45, 8, -26, -3, 35, -24, -15, -36, 1, 34, 20, -5, -5, -64, -6, 59, -13, 40, -57, 44, 28, 17, 57, -1, 15, 6, -22, -12, 25, 19, 25, -38, 8, 23, 37, -6, -12, -39, -6, 10, -19, -9, -8, -20, 0, -20, -32, -10, -19, -30, -50, 74, -7, 45, -7, -21, 56, 32, -10, -40, -16, 14, -2, -30, 18, 38, 55, -6, -8, 5, 23, 75, 13, -27, 47, 15, 19, 19, 23, 28, -13, 10, 4, -35, 1, -8, 5, 4, -26, 8, -24, 25, 10, 23, 34, 47, -28, 1, -27, -14, 25, -29, -33, -47, 27, 7, -10, -24, -44, -8, 2, -21, -1, 37, -15, 51, 30, -9, 35, -1, 17, -21, 10, 9, 29, -24, -7, -45, -27, 9, -37, 39, 2, 52, -1, -9, 9, -1, -6, -33, 62, -59, -12, -13, -27, 43, -37, -86, -30, 21, -31, 26, 1, -13, -24, -34, 37, 13, 51, -31, 12, -4, -26, 27, 46, 40, 27, -22]
4951b2M9m5L3l1JpO8m9PK9k7n9k4P2lK7J7m1k2NoJ4NM1j8Ml7pk9L0K6k4N7J5o4
4986a5K3j4l6M9l1N0n7L6k4N9po6P9m0j2LO9r2M4k2k9M2Qj6K9m7K6J3j2lk4l2
5018d9R1l8Nj4jk6O3k9J0l6L9l6M3o1O6j3ol3NOQ1p7L4n5l2P1k0L6nk2RM2k2l0
5052dJ4ll4O7nm1LR2j20J2RPK2m2KK4J2K3o2J5j3m1O6J4km9K5J9j6L1o9P1l7L8
5086B8j8kKM6o4j7rO8p1P5l8L6lm1l0O3Rj6J8k9n5L2J1qMO6n1N4kj6mj00P3j2
5120aj3MJ8mJ0o6M7j5K0K2po9P4l0lJ5k3M2n3O5Mo4N4mo1K9M4K5q9L7J6j4Okj
5155A3loM4j08K9M7J1o2J1O3k9l8K9j6Pk7J9L6k1%n0K4L9l5L3J4m9m7N1J5KLJ7
5188A6J5%Nm8K5m6P4o6K1J0L8j8M3r0L7K0p3M4n2L5M%k1pO0l9LJ09n8mm0jK5j3
$$ y = [-22, 27, -18, 15, -16, -15, -22, 46, -3, 4, 33, 6, -53, -77, -5, -8, 19, 36, -5, -27, -22, -28, -14, -9, 32, 14, 18, -19, -26, -55, -25, 1, -23, 34, 49, -15, 8, -6, -42, 7, -24, 26, -31, 5, -19, 40, 33, -33, 46, 6, -6, -3, 66, -26, 18, -4, -33, 9, 17, 1, 30, -17, 9, 22, 10, 7, -17, -49, 42, 4, 9, -5, -6, -32, 31, 2, 12, -24, 15, -21, 22, -39, 27, 14, 8, -25, -20, -14, 67, -10, 24, -31, -63, 8, -12, 24, 19, -3, 6, 48, 26, -4, 10, 7, -27, 40, 35, -6, -3, 89, -31, -19, -10, -3, 19, -23, -21, 3, 15, 38, -24, -9, -22, -63, 3, 17, 15, -34, -9, 10, -6, 25, -44, 27, -10, 28, 10, 8, 10, 56, -8, -25, -34, 34, -37, 38, 0, 36, 33, -8, -38, 25, 34, 18, 36, 7, -48, -16, -5, -13, -9, 57, 6, 60, 58, 42, 38, -62, 11, -1, -14, -10, 8, 4, 14, -52, -5, -20, 0, 22, 15, -54, 20, -10, -13, 2, -21, 21, -32, 33, 37, -27, 27, 23, -38, -9, 35, 60, -29, 8, 24, 10, 16, 14, 13, 10, 4, 48, -60, -31, 16, 27, -35, -24, 39, 10, -28, 1, -15, -8, -35, -16, 20, -1, -1, -51, -27, 12, -23, 10, 24, -25, -72, -21, -6, -4, -1, 16, 31, 31, 36, -12, 13, -33, 41, -25, -4, 6, 44, 26, 69, -21, 16, 36, -37, 7, -45, -10, -6, -6, -27, -34, 26, -13, -10, 99, 41, 37, -3, -4, 21, 8]
5222HJm3O3k6K4n1M6j3K9m2%NPl5OJ4L8Qq5Q4j7L3j12M5m7Q6l8N9j4n2O7m7k4
5255b3M3k4lj0M7j9j2J1l0J8l4M8j0k7M4j4m8P5Q%p2L3P4o6PJ7k9N0j9q2M1N2
5287D6l9j5Nj5%k8L7L7n0K3LK8l2pK7m7L3K9j05N9k7KL2L7J4o2K0l7JJNOK2pK4
5322B0qL6J1m4m1K9OJ2l4K0l3K6m9M5J7k7LkM3j6l6j0K6N0m5l3L2K6j1k7R1r2
5354a5MK6j3pnk7K0j5M5o2M3pK7KJ0J4r6Q7l6L6k0J4JK1k2j9N2o9J1k7P7n7K1
5387A4M9n%l9j9k0O1n8L7k8L0n4M5j9kl9M9k7oO1o9N3j4P0o7K3l2jm3Q1MOo0Q4
5421F5m5qL2n2K4l8M4r0Q2N0k7m2k2MP9l5k5K5j6j8pO7m3l6N8m1P0j7q7M6J9J1
5453B7k3nPJ6k1J1l0K7l1jJ6m1Q8K1l0m4N2n6N2l2nQ5j25nM5L4j2l8M0n5K8%q8
$$ y = [8, 9, -34, 29, 3, 27, -24, 22, 9, 38, -4, -4, 1, 8, -27, -21, -7, 31, 39, -46, 38, 21, 54, -58, -13, -60, 26, -12, 47, 33, -19, 48, 1, -23, 20, -4, -7, -17, 30, 11, -1, 10, -20, -2, -36, 12, 2, -25, 19, 5, -43, 32, 40, 40, -32, 1, 75, 9, 16, 33, 4, 54, 35, -47, -6, 46, 7, -8, -3, -18, -18, -46, -9, 28, -22, 1, 4, 32, 0, -7, 20, -27, 6, 35, -70, -11, -38, -36, -4, 33, 47, -15, 5, -32, -31, -30, -25, -19, 3, -4, 20, 12, 48, 59, 15, -26, 3, 9, 21, -13, 7, -26, 0, -49, -4, 13, -14, -11, -13, 30, 14, -22, -32, -6, 44, -1, -34, -2, 24, 13, -14, 77, -15, -11, 15, 2, -5, -10, -37, -17, -32, 13, -49, -6, -13, 14, 16, 26, 40, -56, 31, -5, 31, 11, 25, 26, 47, 25, 6, 58, -11, 0, -27, 50, -7, 14, 63, 58, 58, 19, 0, -20, 41, -17, 20, -8, 22, -32, 13, -6, -8, -47, 2, -25, -31, 30, -39, 14, 0, 70, 3, 26, -6, -7, -50, 31, 35, 41, -19, 65, 20, 12, 44, -8, 16, -22, 22, -68, 14, 64, 37, -5, -27, -23, 56, 21, -4, 21, 5, -13, -20, 47, 4, -32, 26, -15, 55, 38, -49, -3, 16, 27, 4, -1, 6, 22, 1, 12, -18, 9, -22, -23, -7, -48, 40, 61, 31, -13, 39, -17, 35, 3, -2, 83, -42, -47, -2, 32, 20, -18, 22, -33, -5, -5, -93]
5486i3J19n6J6N4l4j4k9L0j0QL8k8J6p5J7%N6kK0k4l3M7KJ6l9j2MRMRn4O6m3L
5520a2L2j3p7M7MN9k5oK9n1%MM5p0N1J0n0J5j6L1k5rJ2N1n8K1kK4ql3L0m5K6O2
5554E3o6K6rk7O3j03O4qk7R8j3p8M2Mm1J3M5j05O4K7k8J3k3J3Mnk3J5PO4r2K7
5586fJ8j0PJ4o9P3o0M6j5l9L8J6Pn0L6m5J1R0o9M5pn8O6k0l7%K4qK6Mj9o6OP0
5620A9ql2M7o4K3O8j17N8Q%rL3m2MnK3J3k8J1k7N4j8k8M0k5l4L2RJ1J2m2RJ5R
5654A9j5l2MJQL0k1NOK9k4n0O8M6o9J%K4k0MK3m7N6p9J8O3m7O1o9p%k8J8K0J1
5689GP1r6K7k1K0j7K2Jm5J9P1n9K3n0j4P1m8L0j6l7N2m3K9k1N5l8J4J6l9l2O2
5720A4pj0k3K3N7n3J3o8O8j2Lqk8J9J3J7k7jM7Qn7L6n5N7j0l1K7k1k3K9LK0oo0
$$ y = [-93, 26, -30, -14, 40, 6, -8, -37, -7, -17, -9, 29, 1, 17, -58, -41, -41, 15, 13, 33, 9, -24, 23, 25, 41, 2, -10, -6, 3, 7, 16, -38, 28, -15, -12, 20, 7, -70, -23, -19, 40, 15, 9, 38, -13, -13, -9, 36, -34, 17, 27, -23, -8, -24, 7, -18, -27, -15, 36, -22, -1, -3, 21, 13, -20, 10, -35, -9, 53, -13, 13, 4, -23, 40, -63, 1, -7, -34, 64, 51, -27, 15, 19, -22, -9, 36, -69, -5, 22, -6, 7, -16, -3, 1, -4, -27, -12, -5, 59, -33, -6, 12, 2, 9, 23, -46, 27, -33, 13, -2, -41, -3, 13, 20, -30, 6, -39, -28, 62, -7, 38, 31, -27, 39, 19, -18, -18, 6, -2, 24, 28, 9, -57, -51, 19, 11, -21, 26, -38, -15, 53, -64, -6, 2, 2, -7, 26, -16, -12, -17, 6, 19, -9, 2, -25, 29, 11, -17, 23, -2, -36, -4, 5, 16, 28, -14, -5, 10, 19, 4, -28, -24, -23, -15, 15, -6, -1, 5, 34, 10, -40, 28, 74, 5, 6, 6, 30, 10, 14, 37, -10, 46, -33, -15, 48, 1, 62, -7, -14, -14, -42, -24, -4, 7, 78, -18, 9, -12, 8, -9, 13, 14, -31, -12, 59, 0, 23, -27, -41, 30, -18, 12, -4, -41, 11, -32, -3, -24, 31, -7, 7, 23, -16, -48, 14, 7, -3, -26, -3, 54, 1, 14, -54, 14, 2, 5, -3, -31, -12, 1, 18, -9, -10, 37, 45, -12, 24, -31, 26, 16, -15, 12, -9, -32, -3, 0, 20, 14, -46]
5754d6M5M3j7m3K0l0PK1P6k2p1R2p0%OLL6l0m6RN4Qm8N3p1kJ3j0L7l5K7l4PjL
5789a6K0J0k7K9onkJ4n9Q4k3j6j7M7k9j2j5L0PRj8k5k4Q0k4J6m0l0K9j0J1K4j3
5822aLJ3k8mk8P1n9M0o2L1LL1jl1J7L0l8L3m5Q0j16L0l8L0M6j3L1JJl2J0J5k8
5855hJ1J9p4J9O5qk9P8o0lJM7l4Km0K4K4q4Q6q3K3l5j4O1J0nj0l1j3N7Oj2K7R
5889B6k6l5KJ17o2l3MK3pJ1pJ0p6Q6JRl5l3L3K3j0ol1Rj6L5%QOm0K4m7M3j1J0
5924En1Q2Pl8Mk9N4RJ0k0m7k3P6n4J5M0l3k7L0J2m6kOm0O9J1J4l8pJ6j0RJ2j5
5958AK0l5L6n0O2l7k0M1qrqJJjl0K0K8j4K6k3J6Ln2K0N0m6j1K9j4j7J7n8O6j8
5992a4P0o9j2O2l2k4M1q0P7J5ll1K4J9m0k4M7o8P6K1l1k0q0N6K0n1M4LL6oq6J06
$$ y = [-46, -1, 42, 25, -18, 2, -28, -21, 0, 76, 54, -17, 75, 5, 5, 11, 14, 50, 20, -26, -17, 37, 45, -3, 50, -21, -23, -10, -20, 17, -18, 9, -25, -18, -19, -16, 4, 14, -13, 16, 10, 5, 3, 17, -42, 42, 19, 3, -14, 33, 4, -8, -23, 7, 14, 23, 5, -20, -44, 36, 12, 28, -12, -42, -13, -23, -12, 12, -1, 2, 15, -13, -17, -45, 26, -33, 7, -55, -24, -21, 10, 9, -22, -5, 25, -13, 20, -25, 55, -61, -31, -69, -39, 7, -6, 25, 26, 27, -5, 5, 20, -8, 3, 22, -52, -33, 32, 24, -5, 73, 13, 10, 11, 58, 24, 26, -14, 10, 34, -50, 36, -47, -24, -59, -73, -12, -2, -7, -17, -48, -61, -4, 2, -10, 17, 26, 0, -35, -33, 84, 22, -11, -7, 16, 9, 20, 13, 23, -53, 33, 34, 43, 8, -25, 8, 31, 21, 15, -16, -7, -23, 12, 12, 20, 26, -14, 10, -37, 6, -5, 5, -46, 36, 43, 5, 9, -20, 34, 43, 53, 33, -14, -37, 39, -15, 0, 40, 7, -20, 10, 22, -24, -26, -20, -60, 9, 20, 34, -4, -11, 5, -5, 4, 16, 1, 21, -14, 22, -28, 34, -3, -23, 18, 10, 1, -7, -6, -5, -6, -36, -16, 12, -2, 24, 1, 17, 20, -32, -12, 38, -8, -19, 10, -4, -21, -4, -62, 4, -14, 56, -13, -25, 37, 5, -19, 22, -58, 19, 34, 31, 0, 24, 43, 3, -21, 26, -42, 34, 55, 24, 4, -76, -20, 0, -51, -7, -4, 32, 26, -60, 46]
6024D6j13J04j8jm6J8k1Q1j1k1k4L8l7j%j2O3n3N9j13Q8l5N8m9NK3J1J1k8k5M3
6055D0n7%L8oq1M2K8j7mM2m8m8P3o0P0m3O6rn6J0M4m4J7QNjj8J7pl4K4k6M7l3
6089b1qN1kk4N4m2l4P1o4N8j0j11N3J2k5L8N1k9j3j2j5L9J8l6K5k4j2QO4l4oP
6121B7k2nN3k6m7M1j9m3j5J5N6L9q7n2O9J8K5o5N4k1m0N9j3L2l5L2%o4O8l7N3
6152E0j4p4K2K7k5L5k5J7pj5J2%Ll5j7K4j9M2k9mO7n9j5M2nRk7pP0l4l0N1o4K7
6186gN8m1k2k5J9L3K0q4N8m2M6Pqn4K8K4L5r2O0J5l3O5j00P7l9kpj5j9oK5QO1
6219D3l0Rj6k8K0j5j3j0K1N7j6k7j0kKk7K6L0K7p5K8K9k2j3oj0jN2m2K1L6j6m
6252A8m7L8K2k2%L9k8p4J3N7j1oj6M0j4j6K5j3KoRn6N0pK6k7K2p3N0J9L2n1k4
$$ y = [46, -67, 37, 19, 18, -28, -10, -31, 50, 39, 18, -6, 32, -5, -6, -6, -18, 45, -8, 51, -62, 26, -9, 49, 0, 5, 28, 39, 50, 22, -3, 40, -17, -17, 21, 15, -66, -24, 4, -13, -17, 25, -23, -71, 2, -58, 12, -31, 35, 26, -30, -20, 24, -20, -3, 5, 10, 9, -9, 8, 1, -33, -9, -35, 12, -21, -29, 22, 20, -4, 50, 8, -26, 45, -19, 39, 29, -82, -29, -17, -42, -4, 47, 18, 5, -7, -22, 17, 35, -1, 24, 0, -12, -4, 60, 26, 20, 27, 5, 0, 53, 27, -20, 21, 2, -41, -56, -41, 15, 54, -33, -85, -16, 2, 27, -38, 16, -5, -45, 14, 1, 33, -2, 30, 30, -34, 34, -3, 50, 36, -38, -16, 11, -14, 21, -4, 13, 6, -9, 3, 3, 6, -29, -46, -22, -41, 1, -28, -32, 35, -24, -39, 3, -2, 7, -20, -27, 43, 9, -21, 30, -34, -7, 51, 10, -12, -37, -18, 15, 35, -49, 9, -33, 13, 20, 12, -42, -14, 10, 45, -47, 13, 28, -5, 60, -40, 37, -2, -4, -11, -26, -45, -51, -26, -18, 43, 13, 22, 6, -22, -2, -17, -30, -40, -19, 38, 22, -5, -15, -17, -15, -42, -16, 14, 41, -34, -6, 23, 1, -12, -18, -28, -29, 23, -19, 2, 38, 22, 18, -29, 9, 31, 9, 9, 48, 20, -54, -41, 16, 5, -1, -17, 23, 9, -7, 18, 5, 7, 1, 10, -46, 4, -3, 23, -4, 18, -55, -5, 14, 46, -5, -29]
6285b9O1o3M0J6J8o1P3qll1J9n0L1LJ8m2o4O5l9K8J7Lk7J3N1q2K3%M2k9k9O0n1
6318b7mM1J3M1q6J6lM5p5L9J6k5K9K5j11N1PJ6n7O4N1q5L2J4k7OK2l6K2m3R3o8
6350dJ3j6M1m8k9j7J9L6J7l1J6J4K5m4p8O1M1l6P5l5k2L0k7L3l9QNLj6j7K3OJ6
6383B3K6j8m1k6O9j1k3qO8n0kM3o2M0k9N6p6m4P7nk3K8mJ4l6n0N0qJ3l4M2O9n4
6416A4J0m8K5nmRN0m8J1l6OO0l2k1J6nK0j7KJ7j5NN5p4L7m3j9kK3k5M2m6L6o6
6450f8L5N1m0O6pK2r2nJ3J6J7L3l8MK1j9m1J17q5k4k3Q4r9P6q5O7J0k6L0qK9M6
6482G7q2J0%k8j3P0K2q6O1k9J5L8r2N3K5o9K2J2Jm8J08r9K8jJ%pk4N5oo1N6n5
6515d6R0k8k0j5m8N8J9n7Q8n7K0On3Q2m2rL6Ko8K7k2N3l9k4P8n4J8k5M2qn4N0
$$ y = [-29, 32, -31, 9, 25, 43, -18, 55, 47, 44, 13, 32, -18, 13, 16, 34, -8, -72, -7, -46, -18, -1, 2, -25, -12, 39, -43, -20, -20, 22, -7, -36, 24, -27, -31, 10, 23, 64, -22, -6, -9, 36, -39, 0, 16, -9, 20, 45, -66, -15, -8, 8, -49, 15, 66, -19, 13, 27, 0, 6, 28, -8, 14, -29, 64, -4, 9, -7, 34, -14, -43, -60, -41, -5, 12, -19, -3, 11, 36, -8, -86, -25, 16, -20, 55, 20, -2, 28, 1, 34, -5, 3, 8, 11, -5, -22, 1, 7, 23, 49, 31, -10, -36, 33, 22, -1, -9, 59, 9, 7, 50, -12, 28, -1, 55, -21, -65, 12, 7, -16, 12, 8, 22, -14, -64, -14, -22, -9, -43, -1, 68, 14, 24, -24, 1, -4, -8, 1, 51, 3, 14, -22, -16, 44, 12, -9, 7, 2, 22, 5, 7, 24, 9, 14, 69, -5, 32, -11, -30, -32, -9, -34, 8, -38, -2, -68, -33, 18, -22, 44, 37, 59, -33, -38, -25, -9, 8, 41, 3, 7, 28, 9, -32, 85, 0, -24, -47, 37, -62, 14, -71, -4, 6, -20, 10, 2, 31, 77, -5, 5, 5, -23, -36, 34, 56, -30, 31, 2, 17, 55, -37, 16, 41, -28, -6, 6, 7, -41, 67, -32, -4, -5, -4, -4, -11, -35, 20, 14, -47, 9, -46, 44, 16, -4, -19, -67, -9, 10, -47, 41, -16, 4, 10, -43, 39, -3, -12, 24, 26, -42, -15, -37, 16, -23, -47, 31, -23, -5, -30, 12, 4, -50, 0]
6547@JJ8n7lk1O1N1j21Q7k6qL5n5K1K6m1jK2RN5k4lk7m0K8l0P0m4L6nok9K0l8
6581c9N5k5J3l8L1K0o5N9m3PPN3k2J7j0n1L5m9L6j9M7pPrj2n9K1j4R1q3L9j3N4
6614C4ok5RM0l6l1nO8l0n0O5k9M7l3L5o5M2k5l0k0MO4q3R6l5k5L9k1K3k3KJ6J4
6647B6n2O6n6O6k5l4J2L5n7n3P6JJ8m5K2lJ9ornM4o2J1M3j0K1p6N0j2n7N8rL9
6680C6k2k7j6LJ3NL0p4N1PJ7j9l9QL3l5jj0K5j0l1N0O8j02K7L5nMK4m3J1l3J0
6713a0N4Jl3l6RM9o2MM4L1q2L3K2K2j6oj7j0lk4M0p9O5K6j0l3J7n6L7J1kl0M5
6746ARn8M1K6m0M3pm6PN6RNp9M9k1rrL5l2KL8qO6p7RnKj5ok5P3j6M6m2j2jMM0
6784E3p1N4m8km9M0l9O2J6j1j9k2J6N7m1l4M3J0Njrkk8J2l5N0LM4q0J0Mm0K8m0
$$ y = [0, 1, 19, -38, -41, -62, -1, 50, -71, 16, -10, -18, 17, -38, -17, 9, -32, -33, -11, -2, 53, 29, 26, -1, -41, -13, -43, 27, -17, 19, 14, 8, -21, -1, -39, 16, -9, 4, -34, -3, 17, -48, 11, -32, -25, -18, 35, 13, 30, 20, -31, 4, -45, -9, -28, 19, 12, 19, 10, -2, -61, -40, -54, 37, -46, -7, -20, 34, 28, 3, 12, 52, 16, -15, -20, 48, 18, -32, 33, 4, 51, 18, 53, -12, 30, 5, -25, -45, -41, 23, -60, 36, 1, -24, 15, -6, 17, -6, -4, 12, 26, -26, 40, -16, 50, 25, -9, 3, 38, -19, -72, 4, 5, 23, -22, 0, -3, 16, 10, 1, -4, 40, -22, -11, 32, 22, 43, -33, 17, 5, -52, 6, -3, 36, 14, -13, -29, -26, -13, -8, 22, -52, -1, 6, 23, 4, -35, -27, 6, -29, -30, -40, -15, -25, -56, -6, 62, -40, -13, 22, 17, 21, 45, 2, 13, -20, -10, 44, 45, 12, -24, -15, 34, -28, -24, 20, 51, -31, 2, 24, 46, 30, 24, 7, -3, -6, -30, 10, -69, -4, 22, 12, -21, -4, -60, -23, -12, -14, -44, 1, 10, -48, -7, 19, -21, 22, 15, -31, -24, 32, 41, 46, -33, 16, -5, -14, -23, 12, -20, -18, 20, 12, 78, 1, 10, 5, 7, -8, -14, -39, 34, 18, 64, 22, 10, 9, 13, 53, -18, 36, -12, -14, -63, -23, -62, 0, 16, 5, -14, -36, -20, 37, -4, -38, 5, 15, 20, 19, 10, 8, -20, -8, -43, 7, 10, 54, -26, -16, -12, -52, -24, -64]
6818f4R0m2pL4m0O3m0J0P7j01k0M8J0J8n3lj0N9Lp9L4k1O9m6K7k5k0O4n7P6n9
$$ y = [-64, 26, -16, -23, 11, -29, 34, -6, 4, 81, -20, -40, 8, 18, 36, -17, -20, -30, 29, 32, -47, -13, -34, 35, -11, 16, -9, -29, 35, -22, 54, -5]
$$ [...]
8191b3
##END NTUPLES=NMR FID
##END=
