##TITLE=1H_ABDP0102
 CDCl3,8 sc, 
 1.03.2021
##JCAMPDX= 6.0         $$ Bruker NMR JCAMP-DX V2.0
##DATA TYPE= NMR FID
##DATA CLASS= NTUPLES
##ORIGIN= UXNMR, Bruker Analytische Messtechnik GmbH
##OWNER= root
$$ XWIN-NMR		Version 3.5
$$ Mon Mar  1 11:45:07 2021 Russian Standard Time (UT+4h)  she@DPX200
##.OBSERVE FREQUENCY= 200.1315066352
##.OBSERVE NUCLEUS= ^1H
##.DELAY= (6, 6)
##.ACQUISITION MODE= SIMULTANEOUS
##.ACQUISITION SCHEME= undefined
##.AVERAGES= 8
##.DIGITISER RES= 18
##SPECTROMETER/DATA SYSTEM= spect
##.PULSE SEQUENCE= zg30
##.SOLVENT NAME= CDCl3
##.SHIFT REFERENCE= (INTERNAL, CDCl3, 0, 15.7039)
##AUDIT TRAIL= $$ (NUMBER, WHEN, WHO, WHERE, WHAT)
$$ ##TITLE= Audit trail, XWIN-NMR		Version 3.5
$$ ##JCAMPDX= 5.01
$$ ##ORIGIN= Bruker BioSpin GmbH
$$ ##OWNER= she
$$ F:/spectra/data/she/nmr/H-F/1/audita.txt
$$ ##AUDIT TRAIL=  $$ (NUMBER, WHEN, WHO, WHERE, WHAT)
(   1,<2021-03-01 11:43:54.57 +0400>,<she>,<DPX200>,
      <created by zg, POWCHK disabled, PULCHK disabled
       configuration hash MD5:
       00 E9 B6 7A A2 85 ED C7 34 08 36 98 17 FE 4E 26
       data hash MD5: 16K
       5B 9F E2 05 87 46 C0 ED 40 2D 0D E9 3C CB E9 00>)
$$ ##END=
$$ 
$$ hash MD5
$$ 69 23 27 30 70 55 ED 37 6A E8 29 49 B1 5E 31 5E
##$RELAX= 
##$RELAX= 
##$RELAX= 
##$RELAX= 
##$RELAX= 
##$RELAX= 
$$ Bruker specific parameters
$$ --------------------------
##$DU= <F:/spectra>
##$EXPNO= 1
##$NAME= <H-F>
##$PROCNO= 1
##$TYPE= <nmr>
##$USER= <she>
##$AMP= (0..31)
100 100 100 100 100 100 100 100 100 100 100 100 100 100 100 100 100 100 
100 100 100 100 100 100 100 100 100 100 100 100 100 100 
##$AQSEQ= 0
##$AQ_mod= 1
##$AUNM= <au_zg>
##$AUTOPOS= <>
##$BF1= 200.13
##$BF2= 200.13
##$BF3= 200.13
##$BF4= 200.13
##$BF5= 200.13
##$BF6= 200.13
##$BF7= 200.13
##$BF8= 200.13
##$BYTORDA= 1
##$CFDGTYP= 0
##$CFRGTYP= 5
##$CHEMSTR= <none>
##$CNST= (0..31)
1 1 145 1 1 1 1 1 1 1 1 1 1 1 1 1 1 1 1 1 1 1 1 1 1 1 1 1 1 1 1 1 
##$CPDPRG= <>
##$CPDPRG1= <>
##$CPDPRG2= <>
##$CPDPRG3= <>
##$CPDPRG4= <mlev>
##$CPDPRG5= <mlev>
##$CPDPRG6= <mlev>
##$CPDPRG7= <mlev>
##$CPDPRG8= <mlev>
##$CPDPRGB= <>
##$CPDPRGT= <>
##$D= (0..31)
0 1.2 0 0 0 0 0 0 0 0.06 0 0.03 0 0 0 0 0.0002 0 0 0 0 0 0 0 0 0 0 0 0 
0 0 0 
##$DATE= 1614584634
##$DBL= (0..7)
120 120 120 120 120 120 120 120 
##$DBP= (0..7)
150 150 150 150 150 150 150 150 
##$DBP07= 0
##$DBPNAM0= <>
##$DBPNAM1= <>
##$DBPNAM2= <>
##$DBPNAM3= <>
##$DBPNAM4= <>
##$DBPNAM5= <>
##$DBPNAM6= <>
##$DBPNAM7= <>
##$DBPOAL= (0..7)
0.5 0.5 0.5 0.5 0.5 0.5 0.5 0.5 
##$DBPOFFS= (0..7)
0 0 0 0 0 0 0 0 
##$DE= 6
##$DECBNUC= <off>
##$DECIM= 32
##$DECNUC= <off>
##$DECSTAT= 4
##$DIGMOD= 1
##$DIGTYP= 9
##$DL= (0..7)
0 120 120 120 120 120 120 120 
##$DP= (0..7)
150 150 150 150 150 150 150 150 
##$DP07= 0
##$DPNAME0= <>
##$DPNAME1= <>
##$DPNAME2= <>
##$DPNAME3= <>
##$DPNAME4= <>
##$DPNAME5= <>
##$DPNAME6= <>
##$DPNAME7= <>
##$DPOAL= (0..7)
0.5 0.5 0.5 0.5 0.5 0.5 0.5 0.5 
##$DPOFFS= (0..7)
0 0 0 0 0 0 0 0 
##$DQDMODE= 0
##$DR= 18
##$DS= 0
##$DSLIST= <SSSSSSSSSSSSSSS>
$$ [...]
##$SUBNAM2= <"">
##$SUBNAM3= <"">
##$SUBNAM4= <"">
##$SUBNAM5= <"">
##$SUBNAM6= <"">
##$SUBNAM7= <"">
##$SUBNAM8= <"">
##$SUBNAM9= <"">
##$SW= 16.9725356469052
##$SWIBOX= (0..15)
0 0 2 0 0 0 0 0 0 0 0 0 0 0 0 0 
##$SW_h= 3396.73913043478
##$TD= 16384
##$TD0= 1
##$TE= 0
##$TE2= 300
##$TE3= 300
##$TEG= 300
##$TL= (0..7)
0 120 120 120 120 120 120 120 
##$TP= (0..7)
150 150 150 150 150 150 150 150 
##$TP07= 0
##$TPNAME0= <>
##$TPNAME1= <>
##$TPNAME2= <>
##$TPNAME3= <>
##$TPNAME4= <>
##$TPNAME5= <>
##$TPNAME6= <>
##$TPNAME7= <>
##$TPOAL= (0..7)
0.5 0.5 0.5 0.5 0.5 0.5 0.5 0.5 
##$TPOFFS= (0..7)
0 0 0 0 0 0 0 0 
##$TUNHIN= 0
##$TUNHOUT= 0
##$TUNXOUT= 0
##$USERA1= <user>
##$USERA2= <user>
##$USERA3= <user>
##$USERA4= <user>
##$USERA5= <user>
##$V9= 5
##$VALIST= <valist>
##$VCLIST= <CCCCCCCCCCCCCCC>
##$VD= 0
##$VDLIST= <DDDDDDDDDDDDDDD>
##$VPLIST= <PPPPPPPPPPPPPPP>
##$VTLIST= <TTTTTTTTTTTTTTT>
##$WBST= 1024
##$WBSW= 4
##$XGAIN= (0..3)
0 0 0 0 
##$XL= 0
##$YL= 0
##$YMAX_a= 19428
##$YMIN_a= -48338
##$ZGOPTNS= <>
##$ZL1= 120
##$ZL2= 120
##$ZL3= 120
##$ZL4= 120
##$ABSF1= 10
##$ABSF2= 0
##$ABSG= 5
##$ABSL= 3
##$ALPHA= 0
##$AQORDER= 0
##$ASSFAC= 0
##$ASSFACI= 0
##$ASSFACX= 0
##$ASSWID= 0
##$AUNMP= <proc_1d>
##$AZFE= 0.1
##$AZFW= 0.1
##$BCFW= 1
##$BC_mod= 2
##$BYTORDP= 1
##$COROFFS= 0
##$CY= 11.3945322036743
##$DATMOD= 1
##$DC= 2
##$DFILT= <>
##$DTYPP= 0
##$F1P= 15.9154993809931
##$F2P= -4.1035820241983
##$FCOR= 0.5
##$FTSIZE= 0
##$FT_mod= 4
##$GAMMA= 1
##$GB= 0.15
##$INTBC= 1
##$INTSCL= 1
##$ISEN= 128
##$LB= 0.24
##$LEV0= 0
##$LPBIN= 0
##$MAXI= 10000
##$MC2= 0
##$MEAN= 0
##$ME_mod= 0
##$MI= 1.114404
##$NCOEF= 0
##$NC_proc= 0
##$NLEV= 6
##$NOISF1= 3.799351
##$NOISF2= 2.8
##$NSP= 1
##$NTH_PI= 0
##$NZP= 0
##$OFFSET= 15.70392
##$PC= 1
##$PHC0= -10916.93
##$PHC1= 8.20094
##$PH_mod= 1
##$PKNL= yes
##$PPARMOD= 0
##$PSCAL= 0
##$PSIGN= 0
##$REVERSE= no
##$SF= 200.130013532006
##$SI= 16384
##$SIGF1= 3
##$SIGF2= 2
##$SINO= 400
##$SIOLD= 16384
##$SREGLST= <1H.CDCl3>
##$SSB= 0
##$STSI= 0
##$STSR= 0
##$SW_p= 3612.71676300578
##$SYMM= 0
##$S_DEV= 0
##$TDeff= 0
##$TDoff= 0
##$TI= <>
##$TILT= no
##$TM1= 0
##$TM2= 0
##$TOPLEV= 0
##$USERP1= <user>
##$USERP2= <user>
##$USERP3= <user>
##$USERP4= <user>
##$USERP5= <user>
##$WDW= 1
##$XDIM= 8192
##$YMAX_p= 0
##$YMIN_p= 0
$$ End of Bruker specific parameters
$$ ---------------------------------
##NTUPLES= NMR FID
##VAR_NAME=  TIME,          FID/REAL,        FID/IMAG
##SYMBOL=    X,             R,               I
##VAR_TYPE=  INDEPENDENT,   DEPENDENT,       DEPENDENT
##VAR_FORM=  AFFN,          ASDF,            ASDF
##VAR_DIM=   8192,          8192,            8192
##UNITS=     SECONDS,       ARBITRARY UNITS, ARBITRARY UNITS
##FACTOR=    0.0002944,     1,               1
##FIRST=     0,             0,               0
##LAST=      2.4114304,     0,               0
##MIN=       0,             -48338,          0
##MAX=       2.4114304,     19428,           0
$$ Real data points
##PAGE= N=1
##DATA TABLE= (X++(R..R)), XYDATA
0 0 0 0 0 0 0 0 0 0 0 0 0 0 0 0 0 0 0 0 0 0 0 0 0 0 4 -8 8 -8 8 -8 8 -8 12 -16 16 -16 18 -22 24 -26 29 -32 36 -40 44
45 44 -49 53 -60 66 -71 79 -87 96 -106 117 -130 145 -161 180 -203 232 -265 310 -364 445 -559
66 -559 745 -1095 1991 -9055 -15935 -4655 -13046 -16349 -16129 -11053 -6331 -3457 -11097 -13864 -9986
81 -9986 -5402 -1234 -4455 -8460 -10107 -6347 -1027 -1097 -4628 -9508 -8082 -4613 -278 -3820 -8458 -9884
97 -9884 -8891 -4809 -5017 -7832 -12405 -12552 -10883 -8452 -8493 -13242 -15883 -16286 -12119 -11474 -12927 -16868 -18777
114 -18777 -16019 -13741 -12671 -15802 -17848 -18219 -15081 -11967 -12736 -15146 -17110 -13949 -11797 -9163 -10764
129 -10764 -13188 -11873 -9862 -6322 -5921 -6677 -8804 -6350 -4071 -1432 -1420 -3472 -2531 -2266 2113 2189 1385
146 1385 -290 -16 2493 4725 5995 2917 4018 3972 5754 7840 6185 4484 4230 6243 6878 7880
162 7880 5575 4039 4790 5423 6951 5506 4320 2721 3585 4664 4971 3592 1430 1891 1829 3428 2720
179 2720 856 -95 182 1269 1331 1324 -1487 -1203 -687 -51 494 -1041 -1888 -2191 -469 -566 -433 -1829 -2479
198 -2479 -1728 -1118 -35 -1431 -1759 -2545 -1402 -526 -535 -1418 -2660 -1547 -1592 -402 -989 -2135 -2385 -2019 -988
217 -988 -1189 -1229 -3006 -2441 -1844 -1396 -1428 -2807 -2912 -3035 -1778 -2073 -2236 -3169 -3247 -2534 -2404 -1531 -2997 -2980
237 -2980 -3045 -2301 -1869 -1928 -2571 -3001 -1811 -1995 -970 -1531 -1953 -1796 -1230 -300 -517 -455 -1235 -339 60 736
257 736 623 -242 481 373 1577 1431 1303 785 1155 1712 1901 2466 1154 1626 1807 2224 2383 1983 1661 1362
277 1362 2230 2007 2395 1595 1296 1496 1535 2090 1348 1346 616 1141 1208 1432 1031 227 840 313 1158 663 246
298 246 -43 195 573 219 584 -394 -95 -7 312 358 -101 -217 -501 190 -69 106 -526 -417 -260 -406 186
319 186 -477 -423 -645 -260 -353 -189 -371 -1040 -342 -781 -370 -585 -839 -1041 -844 -552 -923 -682 -1521 -875 -1131
340 -1131 -944 -875 -1454 -1056 -1375 -921 -1046 -809 -1293 -1110 -808 -979 -187 -966 -649 -669 -231 -265 -14 -67 -325
361 -325 429 57 914 427 608 746 826 1397 1149 1466 1088 1651 1502 1919 1797 1406 1889 1780 2064 1934 1970
382 1970 1662 1807 1919 1634 1989 1258 1468 1357 1413 1321 1021 1091 615 1302 412 1178 -272 231 329 -124 398
403 398 -581 -188 -829 -381 -719 -779 -732 -1158 -957 -1170 -911 -1262 -1223 -1494 -1188 -1057 -1237 -981 -1459 -900 -1096
424 -1096 -1005 -779 -1032 -1082 -898 -602 -811 -282 -752 -510 -148 -422 82 -283 -191 -71 205 -4 278 303 29
445 29 519 248 598 233 347 378 464 515 370 696 211 640 318 511 427 271 420 389 674 274 686 272
467 272 412 678 508 709 510 805 654 977 689 1085 1141 900 1469 1189 1647 1425 1604 1712 1806 1884 1971 2178
489 2178 1904 2507 2107 2255 2618 2282 2509 2325 2542 2390 2582 2225 2345 2381 2077 2265 1772 1958 1696 1667 1574
510 1574 1543 1227 1012 1164 629 968 406 190 73 -62 -176 -379 -329 -738 -601 -906 -914 -992 -1156 -1154 -1478 -1197
532 -1197 -1414 -1220 -1381 -1323 -1212 -1234 -927 -1158 -831 -931 -668 -644 -425 -297 -369 169 -166 542 453 555 797 839
554 839 1082 1081 1436 1331 1826 1598 1994 1944 1862 2167 1962 2289 2173 2165 1946 2153 2037 1989 1998 1530 1902 1656 1500
577 1500 1309 1159 1034 797 938 448 596 101 87 -91 -394 -336 -820 -664 -1041 -1057 -1289 -1290 -1476 -1762 -1640 -1922
599 -1922 -1854 -2080 -2032 -2194 -2010 -2120 -2213 -1956 -2309 -1953 -2034 -1998 -1936 -1805 -1682 -1668 -1400 -1586 -1120 -1328 -1152 -980
621 -980 -991 -587 -746 -477 -391 -193 -340 62 40 -47 332 -28 405 382 518 356 539 509 481 582 344 727 355
644 355 515 485 452 539 344 290 105 346 -39 132 -71 -235 -39 -281 -213 -435 -388 -477 -399 -551 -763 -629 -772
667 -772 -552 -927 -813 -828 -902 -794 -934 -791 -879 -652 -952 -776 -730 -785 -684 -753 -503 -684 -487 -710 -459 -477 -506
690 -506 -277 -366 -251 -354 -159 -160 -109 -72 -62 233 -141 217 37 163 91 58 343 237 240 258 419 132 499 367
714 367 300 580 260 449 324 422 270 435 379 235 470 107 345 147 491 212 340 322 249 348 172 363
736 363 -15 190 213 49 201 120 135 68 157 -110 79 121 -98 125 -151 74 -159 -42 -187 -112 -73 -306 -96
759 -96 -312 122 -301 -28 -149 -169 -82 -175 -56 -235 20 -216 22 -18 -32 62 -108 149 -11 133 -39 253 184
782 184 150 331 173 348 72 249 220 327 290 203 368 134 517 236 312 280 116 324 232 278 176 259 -44
805 -44 187 99 -27 99 -156 -7 -174 -25 -271 -194 -331 -347 -258 -547 -235 -493 -486 -388 -527 -549 -576 -562 -741 -472
829 -472 -753 -570 -537 -569 -454 -698 -499 -562 -436 -530 -364 -482 -427 -173 -449 -171 -218 -70 -112 -44 -52 53 130 -117
853 -117 197 3 128 169 155 236 177 250 251 378 231 318 283 190 399 152 374 224 310 138 275 284 206 229 -28
878 -28 294 10 60 -69 32 -24 -78 33 -262 11 -261 -147 -223 -293 -153 -270 -299 -304 -30 -380 -2 -182 -148 41
902 41 -295 -25 -118 -1 -60 115 -10 136 323 107 378 116 242 460 399 385 414 551 415 694 512 693
924 693 657 651 784 743 797 631 807 753 910 661 714 905 695 933 740 690 576 617 576 465 656 420 496 348
948 348 299 355 162 347 66 175 44 115 -45 115 -120 -222 -137 -236 58 -171 -103 -205 -64 -502 -457 -265 -446
971 -446 -505 -402 -310 -515 -398 -650 -694 -688 -541 -652 -721 -556 -472 -758 -394 -485 -663 -749 -662 -601 -474 -524 -496 -674 -553
996 -553 -332 -383 -256 -21 -274 -110 -154 -165 -511 -134 -357 -124 -111 -60 -24 -179 426 106 92 -93 237 139 111
1019 111 84 95 492 371 -43 150 133 551 733 578 170 590 135 731 583 528 619 413 536 675 901 523
1041 523 435 383 456 882 -91 263 497 426 332 368 418 59 286 85 351 170 136 162 238 86 143 91 93 176 -35
1066 -35 161 58 30 147 -32 29 -59 145 -129 143 342 118 73 48 85 -69 194 44 151 113 153 96 65 119
1090 119 -53 90 124 93 124 29 163 -39 299 141 95 133 40 87 0 76 37 111 -64 12 -63 -81 63 -111 59
1115 59 -131 -169 -170 -69 -180 -160 -106 -232 -47 -302 -156 -261 -213 -265 -321 -223 -269 -175 -308 -152 -352 -228 -242 -284 -219
1140 -219 -289 -160 -255 -168 -183 -167 -110 -107 78 -213 -15 -134 -24 -123 -65 14 -6 157 6 125 54 104 126 95 168 45
1166 45 188 61 272 222 75 236 135 212 137 164 111 134 53 117 172 47 258 -16 57 -7 11 -58 17 40 -95
1191 -95 37 -168 -74 -93 -154 -186 -54 -117 -207 -108 -177 -120 -237 -236 -79 -286 -81 -213 -112 -204 -107 -224 -137 -77 -158 48
1217 48 -247 -123 -78 -70 -19 -68 -90 -123 114 -91 73 66 84 -12 -7 218 75 197 151 222 308 252 164 218 304 218 310 256
1245 256 299 271 294 340 224 395 138 355 265 276 312 342 355 162 289 288 266 209 196 112 90 237 53 77 150 43
1271 43 -112 -500 -54 -56 205 452 587 123 -7 -15 51 -329 312 153 -155 -336 -7 -293 356 -53 -3 -12 -21 271
1295 271 142 -102 -121 -20 -44 -162 -471 -271 87 -4 -162 40 -301 -95 2 -14 42 98 -206 -88 -47 -75 -116
1318 -116 64 -128 -43 -51 4 -46 -17 11 -35 -40 -62 54 -139 0 -15 -199 -2 -141 -18 -75 45 -99 -55 25 -114
1343 -114 17 -70 75 -155 -28 -53 -85 -46 -95 -7 -74 75 -113 -3 58 56 135 -1 83 65 105 -27 143 142 88 250
1369 250 152 193 155 84 249 253 240 196 214 168 300 211 287 256 230 232 146 204 254 363 137 240 174 121 208 110 152 163
1397 163 114 79 27 99 60 106 -122 123 31 -95 101 -22 -81 -92 -49 -155 -54 -199 -26 -71 -146 -17 -189 -173
1421 -173 -207 -137 -252 -174 -198 -213 -79 -125 -208 -191 -126 -190 -197 -81 -89 -43 -156 45 -46 5 4 9 -37 -168 -50 -21 105 29
1449 29 -82 72 -46 39 22 16 -22 54 58 62 80 4 96 -100 10 -66 2 82 22 53 60 -25 -18 89 -104 -78 -27 -70 0
1478 0 -82 -80 -97 -2 -132 -57 -96 -116 -31 -222 -54 -179 -88 -141 -73 -193 -134 -151 -182 -202 -203 -176 -221 -140 -203 -262 -193 -162 -138
1507 -138 -243 -46 -127 -88 -66 -147 -141 -276 -17 -169 -150 -123 -70 -172 -95 -68 -77 40 -48 17 -77 -72 17 -36 16 53 -2 -60
1535 -60 -149 43 58 80 51 64 -25 114 9 -13 106 26 65 -17 122 66 36 31 91 67 53 107 56 48 -27 59 101 13 73
1564 73 51 163 8 130 25 48 21 76 59 40 110 46 90 88 22 18 -58 48 29 -1 23 28 17 -22 9 -85 82 3 128
1593 128 -72 -212 52 -141 -152 -72 98 -111 -61 -154 -53 -156 -402 87 -124 -56 -330 112 -150 67 167 -501
1615 -501 -195 -292 -230 -60 -363 -255 212 224 42 282 -256 -304 254 467 186 21 304 -183 159 168 201 297 184
1638 184 222 108 216 207 71 27 215 84 182 319 270 212 225 260 351 238 452 65 376 308 254 155 253 184 280
1663 280 -3 -64 235 -43 336 670 475 76 137 255 295 -87 -125 15 278 -593 -168 -52 -183 -231 266 -321
1685 -321 -428 -683 -84 -41 -105 280 -363 -145 -13 -96 -51 -791 -33 71 297 -24 168 -191 -99 -80 -173 -74 -174
1708 -174 339 -186 340 -6 -85 -141 -159 -81 -76 -15 6 -69 144 387 159 128 -140 28 19 62 -200 -61 -2 18 345
1733 345 207 112 -212 -87 104 61 43 -4 -110 74 -189 -189 -79 -203 -208 -184 -194 -74 -127 -151 -87 -157 -131 -63 -195
1758 -195 -106 -66 -93 -18 -10 -84 -47 6 -89 17 -116 12 -91 100 -43 -25 16 32 200 107 65 77 37 174 116 40
1784 40 87 171 102 -8 185 109 212 193 225 36 153 139 104 146 61 48 127 100 51 180 91 60 87 82 74 93 117 71
1812 71 27 21 6 83 30 71 43 102 -72 74 37 29 101 92 -96 45 17 15 84 -12 -25 31 14 82 -40 92 24 101 114
1841 114 33 76 -45 150 60 157 104 134 114 20 84 46 165 72 42 43 21 109 8 142 29 20 -29 30 -31 -83 -127 -70
1869 -70 31 -14 -191 70 -66 -205 -106 -138 -160 -185 -355 -172 -156 -362 -61 96 53 -318 73 -408 -21 82 -406
1892 -406 48 362 21 -191 172 67 106 -393 787 234 -794 -343 -48 61 -82 567 -109 -64 4 78 90
1913 90 238 259 43 21 178 -137 164 77 228 216 164 128 127 201 204 200 121 135 161 145 287 54 196 89 206 121
1939 121 226 132 209 108 79 67 43 208 41 82 55 -92 105 -26 5 -79 -35 -144 92 299 -258 -195 -23 157
1963 157 -135 -309 -274 -99 -235 169 -733 -474 -475 -230 -436 348 -471 -695 -405 -140 -658 -227 20 -353 -84
1984 -84 -320 -75 -485 -66 -194 -107 -126 -127 -99 -402 -168 -339 -173 -157 -192 -36 30 -174 6 -371 -116 -12 -250
2007 -250 20 -58 -33 43 -39 145 -76 18 -13 20 71 11 0 535 126 65 -323 121 390 -286 13 -169 -268 558
2031 558 -46 98 467 -204 -39 1 318 147 784 -575 -235 327 -36 -22 -380 -217 102 -369 397 160
2051 160 -300 -300 -53 -64 -110 -158 323 -109 -179 -268 -338 -324 -117 287 280 251 184 -102 -67 -285 -243 -125 -62 -109 -256 -46
2077 -46 521 255 79 267 -19 -151 75 -27 -208 99 326 -148 38 -18 -6 -21 -2 -36 63 31 18 -13 -17 -97
2101 -97 -41 -87 71 -71 -155 -48 -28 -41 -47 -7 -51 -5 29 -19 71 -2 35 85 55 -11 145 203 51 92 136 128 95 206
2129 206 225 158 173 229 124 190 143 218 110 129 185 90 116 118 229 108 132 125 105 133 -19 93 80 42 30 -11 -74 -83
2157 -83 38 12 -31 -90 -17 -8 -70 -51 -57 -14 -194 -88 -150 -130 -65 -35 -3 -93 -71 -73 -42 -70 6 -27 -84 -47 -107 -54 -152 -80
2187 -80 -127 -88 -50 -32 -42 -66 -71 -4 -43 -75 107 27 29 -10 -24 62 67 88 14 -23 70 68 23 193 88 89 2 24 26 116 90 58
2219 58 5 84 -20 -42 -7 -128 -10 -88 60 -51 -104 -53 -62 -31 -32 -83 -14 26 -33 -41 -154 -39 18 -113 -140 -115 -126 -132
2247 -132 -149 -67 18 -132 -158 -80 35 51 13 -60 21 -64 -32 -141 4 -26 46 6 -69 101 -12 -9 53 45 -13 -34 -61 77
2275 77 73 40 66 62 80 -3 98 -3 64 -29 46 71 20 -16 -20 1 45 -49 49 83 -25 31 -42 46 -69 91 14 35 -56
2304 -56 25 35 18 102 75 -32 -53 -12 -65 -57 37 47 -12 -35 58 -8 14 106 81 36 45 63 17 -27 -33 82 -35 24 -27 62
2334 62 76 72 -11 70 29 8 24 51 35 7 -58 36 33 25 33 36 -12 3 27 108 15 75 38 66 32 55 53 74 88 25 75 8 20
2367 20 48 65 34 32 110 77 41 80 43 64 5 20 8 -7 51 34 56 77 152 90 -23 95 86 72 -59 70 -12 -39 -31 57
2397 57 29 27 -46 2 64 36 -18 90 67 -95 -34 45 -24 34 10 41 -29 8 120 -31 63 37 -33 83 59 -52 7 -10
2425 -10 1 37 -26 -3 -49 38 -37 35 89 57 -36 -76 75 -23 -29 36 -80 -17 5 89 64 -29 -47 -54 25 -40 42 -58 -35 16
2455 16 -25 -13 -26 -58 -78 -47 -58 -70 29 -101 -153 -119 33 -49 -98 -99 -84 -77 -38 48 -13 -16 -51 -159 -32 -44 -36 -58 -2 61
2485 61 20 22 20 -43 -28 -77 119 17 -56 9 31 23 -10 23 -54 12 131 44 34 37 4 41 -36 -30 -31 -58 60 23 8 65 54
2516 54 -83 -80 36 -138 36 8 -11 9 -13 19 -106 -66 -85 -49 -147 211 -145 -44 71 -236 182 -130 184 -296
2540 -296 -179 -122 -173 -178 -209 -334 65 -111 25 25 -138 288 220 200 -46 -85 219 -410 -46 -245 -342 -128 21 104
2564 104 151 134 -63 302 57 -154 83 90 19 61 81 79 108 28 116 68 -47 -17 91 95 95 17 7 22 -24 60 115 4
2592 4 61 42 -22 17 4 20 -12 28 62 76 10 -1 -22 31 18 113 64 -9 52 14 30 63 -55 72 67 100 -142 62 13
2621 13 118 124 -25 26 -62 -9 -37 -50 94 -52 -7 -68 -200 -163 -54 -58 -54 -175 -22 -154 -91 -185 -12 8 -94 79
2647 79 -58 114 40 -9 -68 -62 63 42 77 41 -151 -12 37 84 -90 -49 86 85 -12 237 95 31 -124 236 -122
2672 -122 47 47 -16 -8 56 -67 233 -159 -72 -275 184 4 263 418 135 348 173 172 144 251 -238 55 -80
2695 -80 46 81 139 -22 -31 -611 -144 -152 138 -141 35 221 -86 -300 -80 -41 -36 -264 -324 12 104 240 -383 7
2719 7 206 -293 -29 -312 84 -448 176 52 61 377 -213 19 -41 267 -246 -14 -61 29 -154 277 -151 74
2741 74 -35 -29 -101 465 -103 41 -89 -208 -58 -1 71 5 -2 -31 -20 98 55 18 308 -86 73 83 -264 -237 84
2766 84 -184 368 12 -108 87 -429 -409 127 28 84 -126 -47 121 -17 57 -38 99 -68 -29 90 34 -70 104
2789 104 103 -36 1 -113 -42 -121 -16 -27 54 -79 -20 38 51 -28 4 125 30 42 -5 3 -11 -17 -8 -112 35 6 -46 34
2817 34 42 -40 10 -14 11 -60 27 -3 9 4 4 15 100 15 41 -23 -21 10 9 -56 21 -42 -26 -45 -17 52 -37 -46 -51 22 -27 33 41 35 -53
2852 -53 -17 -17 28 -10 -57 54 6 52 -45 11 -26 -38 24 -33 -8 -86 -72 -31 11 91 -62 -92 24 -121 -3 -18 -59 1
2880 1 50 -51 -42 60 -58 62 22 9 11 99 28 46 27 -33 59 4 33 27 25 -28 28 63 39 26 44 90 -65 16 38 -82
2910 -82 -32 -59 4 -71 -23 -3 -67 -30 -55 -65 58 35 -33 0 36 5 68 -13 -9 -1 81 4 -27 53 52 12 79 -40 16 41 -81
2941 -81 67 13 -37 -42 -20 41 22 29 -92 42 40 61 15 -5 -67 87 67 25 62 9 -33 37 69 -22 39 -34 74 57 18
2970 18 34 -1 -58 -31 -150 29 51 0 60 -12 57 13 12 31 -73 -33 115 -18 40 -39 -20 92 23 -60 -42 25 4 39
2998 39 53 -25 -112 -81 112 -3 -110 -32 24 -41 24 -43 -51 57 -22 -66 -22 80 -8 56 -13 -107 -140 56 -19 25 -26 -7
3026 -7 54 57 -25 -45 167 60 11 -62 35 33 23 21 28 -7 90 -3 -78 76 -13 27 2 -11 26 71 26 133 65 57 76 -8 24
3057 24 70 -33 54 -22 -15 71 33 15 43 109 -54 17 -41 2 21 -37 -2 108 104 45 -16 -94 -74 0 -42 37 -81 -64 -3
3086 -3 -98 51 -36 25 110 47 -14 20 77 -66 -33 -130 -48 48 90 -25 -23 -59 -38 5 -22 40 -50 8 57 -88 -21 11 -30
3115 -30 -49 85 -61 9 -37 -74 -24 -57 -19 -52 -62 -93 -126 -41 -3 -32 87 -12 94 -14 4 -22 44 19 -19 -10 4 -92
3143 -92 23 3 135 -56 3 8 66 -38 -32 -48 -45 76 -66 -27 52 32 -80 11 -94 -95 26 29 32 63 7 -36 -19 102
3171 102 -80 -88 7 -38 81 40 -34 3 -75 61 93 10 26 -23 48 -133 -113 62 16 -31 -126 -67 155 -80 -206 15
3197 15 25 25 -62 -20 58 27 49 104 83 73 -67 -70 116 -102 36 -90 -281 4 396 -119 -4 -277 85 122 -41
3222 -41 43 -13 -106 -239 9 -273 -84 -74 -218 -79 46 34 -185 0 -22 210 -7 40 -55 70 9 -55 50 -333
3246 -333 -55 82 -174 -30 -100 -62 -34 -92 50 4 -54 -229 12 -39 -161 192 284 56 55 203 47 -192 -3
3269 -3 -9 -157 22 -35 -130 168 50 78 121 99 57 -385 -71 151 115 -135 -68 107 186 -138 -97 47 -58 103 -24
3294 -24 32 20 -46 -22 67 8 84 -33 -1 -18 -59 -36 -13 5 -124 -49 19 -19 -66 93 -9 -43 30 15 79 -32 -47 66
3322 66 48 74 26 -30 64 -4 81 26 22 -52 -33 -64 19 15 -98 -63 39 -60 6 -32 -35 0 -78 83 -6 -4 13 -12 45 28 56
3353 56 62 -6 -13 -88 -114 16 61 2 18 -92 69 2 22 25 40 21 -4 38 -75 95 -44 -26 -39 63 -52 32 -17 9
3381 9 22 -36 62 32 36 33 16 26 18 -54 36 16 -15 5 126 8 -44 115 -16 25 -2 3 21 -15 26 28 9 68 82 -41 13
3412 13 52 78 29 32 25 83 -76 49 -64 6 38 5 128 -14 156 -81 -27 -169 87 36 29 195 -104 -258 -231 196
3438 196 -164 130 -83 -251 -92 -35 63 -107 39 -33 14 53 -28 14 -18 77 -104 -111 -109 -93 -33 -98 87 -14 -23 121
3464 121 76 67 178 20 61 -267 -112 110 -19 -1 -85 -33 13 66 103 82 113 8 -69 -104 2 95 10 -62 21 91
3490 91 59 41 94 34 88 21 11 9 29 -15 -66 52 -16 8 63 42 -2 53 -34 -99 35 13 19 -6 -48 111 18 3 -50 -51
3520 -51 -94 1 54 26 -130 -68 8 102 38 20 -4 29 -168 48 -176 92 -141 -2 -92 -8 87 -20 -1 -137 -55 -41
3546 -41 150 -48 -85 -122 -39 -82 52 -127 105 68 -24 -62 -10 -115 27 32 30 -78 54 103 44 82 23 -16 45 77 122
3573 122 64 95 3 21 55 -20 43 149 1 54 152 -19 37 -84 -93 35 -46 9 26 23 -48 37 -36 95 -94 43 -49
3600 -49 7 -18 -58 -43 3 140 128 -120 0 54 -3 -105 -126 15 82 27 68 -40 -211 46 46 95 -219 33 -182
3625 -182 112 142 -166 -37 219 -63 394 153 -155 20 601 -69 404 24 -1 -185 -231 63 -52 73 -208
3646 -208 -138 154 236 175 -10 112 -157 20 -191 153 243 111 278 191 76 -21 63 -103 172 8 126 14
3668 14 -99 -116 222 0 -94 -34 -5 69 -48 88 430 35 -147 285 143 -59 579 325 3 -73 72 -99
3690 -99 -155 -81 -279 519 -10 59 76 95 516 -149 141 23 68 113 -373 59 193 219 441 198 -92 416 -107
3713 -107 140 116 -261 -38 -56 -19 230 58 -136 352 -124 291 94 116 173 80 -55 -184 -98 139 50 93 91 91
3737 91 -51 105 101 -172 5 -73 -108 -187 -16 -195 -114 -35 -86 61 -77 -121 -55 -117 14 -19 18 -91 82 59 -239
3762 -239 232 95 -153 -180 37 -1 48 83 -38 94 34 -6 12 -9 -13 41 42 24 58 -27 -87 -24 -86 -72 -17 -53 -15 -10
3790 -10 22 100 45 32 80 29 27 17 9 -11 -24 -33 113 19 49 4 -4 -15 64 83 6 -53 -83 20 -67 -70 14 -30 -2 -45 -71 -43
3822 -43 -20 -7 -56 -46 57 62 7 42 63 112 -2 -14 -38 -61 -58 65 8 91 -47 -19 -74 7 -5 5 36 -91 26 -52
3850 -52 -27 61 59 78 -64 -40 -59 4 91 10 12 63 -47 -18 24 -83 1 -104 43 -25 56 96 -93 50 -109 10 -176
3877 -176 -49 78 -1 -18 -48 115 255 -163 59 261 -7 -9 -74 21 -48 14 143 -57 119 -129 -41 53 76 46
3901 46 -58 50 31 35 -117 -107 43 63 -356 -218 -18 18 20 35 110 94 177 -81 -45 -75 20 104 78 31 -72 56
3927 56 30 82 0 102 73 -118 -110 35 -3 -44 -42 -90 -50 -74 86 69 -51 93 78 -38 120 109 45 60 -123 108
3953 108 118 -80 40 -92 62 54 28 29 -82 -162 -204 -151 -29 -85 -42 -159 -123 -97 115 7 -54 24 -102 170 4
3978 4 50 -325 -66 335 -212 208 -21 -150 -204 -25 88 258 23 62 163 196 -108 462 386 -421 135 -428
4000 -428 190 -672 -146 9 -112 -49 -255 46 148 3 252 -182 173 14 -204 90 -121 188 -149 -135 -196
4021 -196 -248 -148 -67 151 41 99 -434 177 -70 52 -84 265 152 230 416 157 -203 -84 136 -126 59
4042 59 -267 -2 -80 -19 -8 -9 -52 -24 -120 -42 -41 38 78 1 -143 102 36 20 -21 -3 40 -53 -52 5 23 -24 14 37 -6 25
4072 25 -123 27 73 62 63 -68 -82 -7 -10 -13 2 2 -5 0 -30 -17 24 91 -25 11 62 -2 -74 -33 5 -38 -4 43 25 3 33
4103 33 16 -59 -13 -55 -22 5 -52 9 22 -2 -20 44 49 -3 -101 -22 1 -44 4 -94 2 -30 73 -119 51 14 -1 -66 18
4132 18 -60 86 -37 -81 13 96 101 11 79 26 69 -62 90 -37 2 -10 14 -11 108 6 37 51 5 -9 -15 71 40 68
4160 68 45 -7 -38 -26 98 9 9 -109 4 -46 -106 113 -27 83 55 -13 4 12 49 -15 25 -44 12 20 30 -15 23 -22 -20
4189 -20 -14 39 -71 -12 -61 50 -24 -16 10 7 -15 -47 -31 -26 -50 -5 80 -15 94 1 22 52 -8 -28 -6 -69 110 62 18 -26
4219 -26 -21 7 135 -78 -12 -19 79 15 -78 -19 101 26 3 6 -73 50 -33 89 -29 -6 43 -13 17 4 32 -64 -72 -9 -69
4248 -69 12 -31 -101 -40 -122 -8 52 -39 52 -3 -75 30 38 50 -7 -54 38 -32 63 -84 42 30 -3 -20 -100 79 17 -25
4276 -25 -61 -40 -160 8 -45 -71 -16 -28 94 -85 -79 -43 12 -72 -12 24 -112 15 -93 -31 -58 -3 -26 35 77 102 -25
4303 -25 -18 12 -42 -1 117 43 10 5 5 -93 -28 25 -2 -20 -97 77 -65 -52 38 -13 13 -5 -90 -37 -129 -22 71 -41 20
4332 20 18 -55 45 -144 70 41 24 -15 53 21 -20 -30 -9 2 -9 15 -30 -62 57 25 64 -2 -68 -89 -39 26 44 -24 11
4361 11 -100 56 80 -31 41 55 -10 -3 51 55 -52 45 22 32 48 86 19 -15 -9 -3 80 -107 -37 77 -5 29 30 -44 22 -12
4391 -12 36 -127 57 -29 -40 28 30 -11 -102 63 36 10 41 -16 17 115 -4 -41 45 23 109 92 -46 -79 -62 -49 -23 43
4419 43 -38 32 4 63 65 38 31 10 55 -46 100 55 -9 23 -57 -8 -138 -49 -40 -57 -38 -101 -20 -19 64 -37 -76 15 -43 76
4449 76 19 51 102 -26 14 -44 -164 -58 8 -72 93 88 -30 116 -99 -38 -125 19 -120 -31 -81 -84 -101 -110 -6 7 113
4476 113 -102 73 -48 -14 49 -129 -86 78 21 30 -79 -44 63 0 -16 31 1 -30 -69 -62 -29 19 -73 -82 79 -15 -22 -38
4504 -38 20 -26 46 63 -61 -39 -5 -40 16 -85 17 15 5 -1 2 -60 -35 0 -1 -31 -60 -97 12 -98 -59 -33 -48 -123 -53 35
4534 35 -59 30 -14 -12 -2 -55 -59 17 -71 -6 74 27 -33 116 7 -8 29 -20 1 30 6 -25 -16 3 43 -3 31 33 -22 -100 -96 34
4566 34 -114 -66 -68 -17 45 -18 -18 -22 -33 95 60 42 25 -16 121 48 -17 -8 67 -5 89 15 -41 37 28 35 -79 13 10 147 48
4597 48 57 -58 -35 -47 -127 14 42 18 76 17 29 79 -126 35 68 43 -26 47 84 -68 -72 32 -15 40 -61 -54 -69 -18
4625 -18 -32 -9 30 64 79 40 78 -25 80 52 -5 50 -1 34 72 -23 37 11 173 -83 -65 -45 -17 105 -6 38 -16
4652 -16 -4 -22 28 3 -120 1 2 -31 6 81 -4 -2 -44 36 -30 -41 -96 -22 34 -12 21 -47 15 45 20 -50 35 -38 38 22
4682 22 68 -3 80 -96 114 -76 -55 1 8 -17 -26 31 -64 21 -5 -14 4 93 33 31 -69 -30 59 -20 -5 -59 -8 110 13 -16
4712 -16 -20 -28 27 -18 2 68 52 80 -34 -3 0 14 -111 -12 7 -2 34 80 37 -56 104 -17 -63 -5 59 29 46 38 30 -1 19
4743 19 31 52 7 10 -115 18 -62 -11 68 -12 3 50 62 25 22 -73 50 -17 -47 15 -68 52 16 88 6 55 -112 -22 -37
4772 -37 -8 -8 -46 -66 -9 53 -35 47 137 -35 -72 187 17 -36 -41 -79 16 90 37 24 11 74 -55 27 16 27 -45 10 6 -42
4802 -42 -56 -30 82 -83 63 -28 -79 -16 -20 -4 2 2 -11 93 38 78 -13 -16 35 -31 -77 -17 7 -39 35 -5 -49 30 7 -43
4832 -43 74 58 -29 98 -7 18 -47 -40 22 -38 -55 71 -27 73 -30 -52 92 -7 28 -11 6 1 42 40 3 -18 -42 50
4860 50 -22 55 56 12 44 19 -19 -51 13 34 23 -85 -8 -50 56 -12 -6 136 15 -66 -88 5 -33 62 96 57 -46 44 56
4889 56 -33 7 62 -1 48 -11 -48 70 15 81 13 53 19 3 10 -56 3 17 17 -29 54 -11 45 4 29 -67 -9 -10 -10 -50 33 84
4921 84 -25 122 13 -33 -16 24 -85 -58 -36 -12 -13 50 -111 -53 -36 2 -4 54 118 -63 5 6 55 20 62 30 27 30 7 66
4951 66 66 29 101 24 -19 30 8 -19 -43 -69 -33 -21 -33 -116 4 33 13 27 18 -43 72 -4 -42 9 -69 45 70 56 -27 -6
4981 -6 114 3 65 57 57 3 31 -49 -34 -70 -34 -35 -23 -24 -9 41 -2 -1 26 20 -33 23 -33 -168 19 -25 -24 -43 -20 -2 34 18
5013 18 -25 -51 -39 28 -33 24 61 1 0 -23 -9 -101 76 66 59 42 -57 17 -52 -117 -57 -65 56 46 -105 -2 29 22 5 15
5043 15 56 -12 38 -59 38 -13 -18 26 46 75 8 59 -21 -55 -38 79 43 26 -67 71 14 -14 47 41 -1 -49 50 -63 16 -45
5073 -45 64 -55 -69 36 -78 -90 42 -69 22 36 108 -19 3 32 14 33 79 -120 -43 -63 39 19 -57 -14 -61 -53
5099 -53 -29 19 32 -46 -81 32 -7 25 13 21 -14 60 9 -54 38 27 -59 25 -49 -85 -5 23 24 -29 -37 -6 93 68 -9 -119 96
5130 96 -48 2 -99 2 20 -90 -27 -3 -45 -32 -25 -35 -20 1 4 -2 91 102 64 -26 -73 -62 -43 -31 -19 -57 89 56 -71
5159 -71 -38 -13 15 15 4 61 -24 -113 -48 6 9 -100 -6 73 -118 22 -91 70 62 79 -35 87 -2 -80 -7 -21 130 64
5187 64 -4 64 60 -25 24 -55 17 -50 -11 24 -21 25 -6 -6 48 -1 -7 2 -57 51 -53 37 68 42 24 -24 -46 25 45 55 -120
5218 -120 -4 4 19 30 -1 31 -8 -18 -118 -185 73 -13 -17 -51 -54 11 9 -14 -73 -62 -229 158 -35 3 186 -87 -1 87
5246 87 -190 -100 -122 42 311 -42 -78 -68 -97 -379 21 -37 -209 122 -304 93 -135 -27 -250 257 305 -589 -411
5269 -411 -224 243 376 49 -225 396 7 49 -145 266 76 -238 86 344 107 173 139 -206 88 -53 106
5290 106 420 221 -227 -112 -14 -97 141 68 -405 356 -40 51 577 -232 153 -51 -217 -181 2 -52 -34 -97 -188
5313 -188 88 -34 -110 16 157 -73 -57 3 -37 18 66 -151 -4 -73 71 44 -84 88 -8 65 35 -12 -6 -83 -27
5338 -27 -53 -12 37 32 -30 13 -37 -116 -27 74 32 -64 -44 -21 -15 -22 71 83 16 8 41 97 -95 -60 20 -56 53 67 -18 -31 56
5369 56 119 46 12 -35 -8 28 -60 134 -49 -27 13 39 -55 5 -2 44 -28 -3 -44 6 -4 -32 -64 -54 -64 11 -7 30 3 -24
5399 -24 45 30 4 -71 92 -4 38 -152 -102 71 21 0 -56 235 -211 111 -349 -132 -60 -221 -353 230 195 -133
5423 -133 -209 92 -346 -177 389 -375 326 -36 75 232 436 94 173 304 34 563 135 -133 -59 230 -62
5444 -62 17 28 77 -31 38 -310 39 -8 -35 -84 -19 -52 -96 -62 35 -32 -61 105 70 -96 8 -52 2 -94 25 10 9
5471 9 -11 65 123 28 -37 20 -31 3 -32 62 -36 -23 66 32 -38 86 -77 -8 68 121 -2 44 87 8 -23 33 59 -40 37
5500 37 -39 17 76 60 -107 -79 -66 85 23 19 67 76 11 8 -15 17 94 4 92 82 43 53 69 -14 -60 28 -30 93 46 -22
5530 -22 -26 57 55 -34 -18 32 58 65 30 9 32 -21 -38 -14 56 54 -51 -63 -44 -102 -81 71 -37 7 -71 57 -61 -94 -91 -17
5560 -17 109 0 -11 -63 -50 6 -63 17 -81 -45 -29 -46 -97 15 -26 24 -55 -8 30 81 15 3 9 63 -60 -90 7 95 -52
5589 -52 4 37 23 2 11 -10 -22 -24 -61 49 90 -46 -126 54 -55 -55 49 29 32 12 -11 -31 -4 -109 -44 43 -26 137 24
5618 24 91 77 -40 10 25 8 -12 51 -16 -3 106 -18 128 0 -37 12 -61 27 61 -5 -58 60 -70 -20 -155 187
5644 187 -78 100 66 111 -378 24 106 -203 271 36 118 330 -102 269 -106 40 -153 -523 -320 -344 162 -177
5666 -177 326 -181 147 251 -99 -181 132 -55 47 -96 49 64 58 -40 137 -216 308 -243 -278 153 239 587
5688 587 -222 877 324 82 28 -112 -41 323 386 50 -200 -198 161 356 1036 319 611 -142 746 557 -146
5709 -146 716 682 -205 -424 50 253 -127 130 -279 -204 160 -38 243 -280 -150 -45 -45 -231 -112 132 134 -239
5731 -239 -98 210 35 -164 95 2 -21 139 157 -28 144 396 119 -51 -224 -63 -170 -230 375 145 -56
5752 -56 252 -521 -181 166 109 -36 1 9 43 199 -102 -304 -95 -418 39 -380 71 -69 301 -286 149 459
5774 459 178 -87 307 -33 128 131 126 223 27 384 -108 155 2 127 97 158 -230 -92 33 266 -140 -6
5796 -6 179 -98 165 344 235 -271 -75 -188 -169 101 -439 -43 -186 244 261 234 252 362 49 -309 -143 -222
5818 -222 -402 437 -319 -182 -220 -360 -475 162 -120 -145 5 -243 -374 401 159 -223 280 212 -26 -193 -227
5839 -227 -36 -151 -72 -28 -22 87 32 -15 1 -20 -37 3 -14 63 3 -19 -67 37 -15 -33 -15 -51 -12 -78 30 76 52 -61
5867 -61 -14 15 64 37 94 3 -43 -78 -35 28 -10 -70 47 -6 20 -103 2 4 23 49 -17 -71 -73 40 -58 54 2 -78 29
5896 29 70 -6 -3 75 56 51 4 95 -43 13 4 -56 -19 75 3 27 -37 -6 -18 -30 -32 -26 -30 41 24 49 88 -64 -108 -73 -2 -56
5928 -56 -21 47 59 30 -55 111 121 -9 109 129 47 -113 86 -40 36 17 -18 72 -3 -66 35 -30 -24 54 -62 45
5954 45 -107 -15 81 53 31 18 19 21 -57 20 -19 -30 37 -30 -40 56 -111 -37 -88 27 -73 22 -56 0 -47 -61 44 -14 -30
5983 -30 47 -126 -114 -11 68 12 -91 36 -9 19 88 -25 -7 8 7 92 22 27 -94 -36 37 7 -9 10 -85 -11 -46 -67
6011 -67 56 -51 -32 -15 -46 -27 38 -84 -70 70 29 2 43 1 94 64 -15 65 -15 21 75 -15 -62 -13 30 51 79 -67
6039 -67 -15 -55 -117 -46 -54 60 32 0 -75 25 -32 -16 -57 15 43 -51 -48 -13 -19 -74 62 -54 -47 12 12 -27 -67 -2 53 -52
6069 -52 -27 38 34 -30 -18 -18 25 -31 13 53 -15 1 -38 -46 -19 -35 14 30 -13 -48 -85 -31 -23 -8 -1 -148 -52 23 63 7 -67 31
6101 31 8 -5 -145 -19 -39 -28 77 16 42 -48 -50 -26 33 -44 107 -27 18 -91 63 -66 -14 71 31 126 -20 65
6127 65 -35 -78 40 66 -22 -6 -30 -29 -1 -84 -96 -50 26 70 3 89 56 50 -7 -8 -36 107 -8 4 -11 29 -60 78 78 82
6157 82 38 -1 87 61 32 -99 -83 74 42 -86 -22 68 -15 83 16 -37 -6 -64 30 -27 90 -8 19 -77 1 21 19 -15 -36
6186 -36 40 56 -72 34 11 27 27 55 71 -18 -80 56 39 -71 -17 -21 -15 -55 -4 -130 -81 -50 -73 -138 84 24 40 -3 -1
6215 -1 -46 -27 54 79 -15 21 36 74 16 87 62 114 1 53 63 43 -60 50 51 32 -98 31 20 26 -106 11 42 20
6243 20 -13 -6 -25 -60 -29 -62 28 55 55 -5 57 -22 -16 42 -38 -80 -33 37 23 -48 8 -50 -4 -59 97 -6 7 14 24 24 23 -63
6275 -63 37 23 -13 -4 6 48 5 3 37 -60 -27 29 -17 -47 3 -35 11 95 55 33 -48 24 13 41 33 18 104 9 35 86 -7
6306 -7 9 76 58 -24 -69 20 34 -73 -50 -57 7 36 -50 26 -26 -48 7 7 -58 21 -7 40 53 18 17 126 142 33 -79 46
6336 46 30 -19 -28 64 48 37 41 63 -18 -49 -19 -36 -7 -17 109 126 -52 43 25 89 200 -171 -4 193 -37 94 -17
6363 -17 124 -97 75 95 221 -280 74 41 184 154 166 -215 114 -356 -208 129 5 -480 -18 -245 20 7
6385 7 207 -67 87 21 262 214 -339 -372 -883 -127 -59 -329 -669 419 -40 5 70 23 -41 -215 -41 -12 13 -74
6409 -74 -17 -61 -66 -85 -86 -6 28 -11 -19 -11 -1 -33 -12 -12 138 97 -6 5 25 -10 -17 13 59 -47 57 13 -54 -25 -30 37 69 61
6441 61 -30 5 31 -9 72 5 -16 -6 -40 2 -77 -14 -28 -36 -6 -13 -27 -4 -18 67 -80 32 40 23 -102 5 -37 -34 2 -78
6471 -78 17 -30 -92 -70 -41 27 3 57 68 11 -24 -38 -75 49 -3 -83 -10 -7 -98 -59 -67 -9 68 -48 -37 -38 5 -75 1 -6 7
6502 7 -17 17 -5 0 36 -4 23 -66 51 -70 -107 -6 84 -56 112 23 116 41 26 -22 -91 -7 57 33 4 57 -79 -50
6530 -50 42 -7 -15 -37 48 72 60 -18 -20 10 30 -33 60 -14 60 59 -27 35 24 0 15 7 38 -92 3 -16 -43 -69 -83 24 0
6561 0 9 -4 70 -30 -69 -39 29 -33 78 32 -96 48 -57 -19 81 37 -24 51 -34 -102 14 -69 58 27 79 24 62
6588 62 -42 -4 55 -9 49 40 -120 8 25 -24 13 39 78 -109 1 3 -37 55 -37 -35 28 -59 -12 -11 49 55 -21 2 0 52 -62
6619 -62 45 61 -16 -31 79 -46 8 -20 -18 119 -63 65 -49 57 33 -14 39 -23 71 -87 -17 49 58 -38 90 37
6645 37 123 -96 -68 49 -39 -21 -12 -67 -10 -66 41 29 -13 -34 -67 -31 2 -21 -50 -21 29 69 34 -73 14 -10 5 29 55
6674 55 -11 -47 68 -5 29 9 -23 -65 22 -32 47 -80 -59 77 -8 -45 -29 8 -12 78 -78 -74 2 -80 62 7 38 6
6702 6 -2 40 -21 6 13 74 -1 -106 9 -101 42 -9 27 -37 -75 -3 40 -6 -41 -28 -44 11 -62 2 112 -17 56 18 -36
6731 -36 -3 32 -31 -69 7 -7 -21 -64 38 92 -18 2 22 65 -38 78 93 74 26 -13 -36 38 96 108 100 -61 26 -23
6759 -23 65 -132 -33 37 -124 66 -21 -44 -27 15 -50 -34 0 -2 22 21 -126 79 110 19 9 37 -33 -32 -12 17 34 -19 -22 -65
6789 -65 -38 33 -8 57 54 45 -122 -24 86 -15 29 20 -27 -38 -30 36 46 38 -75 32 57 -49 11 -11 -57 -37 -32 -123 19 131
6819 131 58 64 91 19 41 -34 60 27 14 -9 86 12 47 42 -20 -2 -6 -95 -53 -13 -76 79 -4 -54 -93 -54 11 -63 36 5 38
6850 38 -36 -36 14 -49 -22 7 12 -94 49 88 39 -50 -59 -16 -53 -48 -11 66 -80 -41 6 86 3 -11 -92 -10 -4 15 65 -105 76
6881 76 -90 -36 -34 -73 -18 5 59 -70 -34 -28 -16 -22 6 -11 43 -27 -11 -7 77 -30 58 5 19 40 -20 17 11 76 87 24 23 78
6913 78 -58 8 -15 180 54 40 -20 94 48 91 -156 80 93 110 120 206 40 -164 -105 -253 -112 344 79 -9
6937 -9 -193 142 -129 -114 272 255 -110 -102 476 -21 137 43 27 -16 56 378 83 -60 19 314 -120 -228 -12 31
6961 31 -40 93 -20 104 64 0 -58 -185 -135 2 56 -62 -128 45 -83 62 117 1 -27 -29 41 50 34 -93 101
6986 101 42 29 66 10 -24 45 19 -21 23 -90 -69 24 62 15 -76 28 -125 -2 -12 -11 -43 96 -25 -6 -74 77 -122
7013 -122 5 59 -86 -66 5 -96 -3 -4 35 -108 -49 -54 -75 -45 28 -41 -77 -54 -3 16 -75 7 32 -36 18 -53 20 -39 -13
7042 -13 -36 -118 -31 22 -19 -49 2 -59 27 -10 60 -85 95 51 -42 48 -84 -142 12 66 38 97 41 -22 -20 -35 -50 -64 -42
7071 -42 -28 12 -2 2 0 72 47 39 11 -63 24 -36 -51 49 -4 -15 5 -4 115 56 -34 17 -64 63 48 66 73 -27 -17 76 -16
7102 -16 17 58 -39 66 26 -55 2 -16 21 17 -31 -19 -27 -52 22 7 -13 16 5 -3 49 -7 -24 -45 21 -21 -52 -24 4 9 -105
7133 -105 -3 -104 60 -36 -44 8 30 -43 -43 -9 -9 16 -116 -23 -31 0 -106 54 22 -15 45 -9 -24 74 -16 -11 28 39 -31
7162 -31 -71 -37 25 38 -22 -32 -18 15 -95 -52 -70 -44 -9 49 73 -43 89 97 12 -119 26 80 183 -8 50 -5 71
7189 71 -9 -3 50 7 -20 -29 20 16 17 67 16 9 -23 1 -66 -38 13 -13 5 -131 -87 -43 -86 65 -138 -35 20 25 16 54 4 29
7221 29 -18 -29 55 125 68 -120 -13 -11 105 22 -44 11 39 -41 5 -13 27 96 -42 -14 143 19 72 38 -43 58 -16
7248 -16 -57 -28 -3 36 36 18 -34 -3 -50 74 21 -25 -6 -105 36 11 -35 -27 -1 15 0 -128 -49 -25 -63 -31 16 -43 75
7277 75 40 31 23 -54 17 -42 11 24 -58 30 6 8 17 -25 67 -43 64 4 -117 9 44 32 -16 -33 -31 -23 7 123 -4 -4 -47
7308 -47 42 -32 35 28 -62 63 11 -16 -56 -23 -14 145 17 -62 14 -62 -50 -54 29 -30 26 -42 25 -4 23 -20 3 -33 28 53
7338 53 -51 12 -25 21 -32 -25 32 -81 -53 17 85 87 7 68 -42 -3 20 55 12 74 0 36 -3 19 7 21 25 2 -46 11
7368 11 20 95 -28 23 -27 -44 -22 -38 -2 -10 107 79 -37 -4 -79 10 19 14 99 16 86 -34 83 -4 -43 23 -88 -21 71
7397 71 -48 -14 -5 17 38 59 27 20 57 20 -65 46 22 91 54 -58 -78 -66 -60 93 -44 -13 61 7 -21 -27 -77 -7 -42 -43
7427 -43 58 -53 -65 1 12 -159 48 19 46 -88 51 -41 34 -20 2 -15 -85 -73 51 -6 -35 -131 32 79 -54 -63
7453 -63 68 -29 -8 46 22 162 128 -23 151 155 121 -30 8 -72 147 363 -94 79 -14 6 -56 169 -215 12 220
7478 220 188 -223 -114 323 -432 -73 -309 -208 41 218 -215 -9 -151 -369 -93 347 -69 -178 485 -186
7498 -186 22 -560 -482 -459 77 239 507 -152 109 -357 -191 -57 92 -180 75 67 195 154 305 173 -136 -178
7520 -178 -191 -14 -377 85 234 507 18 381 -80 319 -56 -150 -11 -134 -11 390 -278 -133 310 -438 -289
7541 -289 -321 -58 -108 233 6 271 -27 -448 34 -279 -462 -950 218 -163 -260 -286 -651 320 573 279 -474
7562 -474 53 -401 -440 -192 379 -187 -442 258 -216 -316 115 -382 -14 -26 -183 114 88 -340 -290 -99 -52 43
7584 43 -36 74 -51 53 79 9 -14 -12 -25 -61 16 -103 -71 29 -21 -155 -130 28 -31 -9 98 -6 14 27 -6 -12 -14
7611 -14 -23 -8 -49 9 8 -11 35 32 -53 82 36 -42 14 11 27 54 -52 -16 27 37 -73 -71 44 -21 40 47 -27 -11 -49 -78 27
7642 27 81 25 12 -14 96 3 -4 -109 -9 -32 94 -19 0 51 64 27 27 49 52 -127 41 -56 82 49 87 43 62 -63
7670 -63 -1 50 -55 -20 48 -18 -216 10 -5 -20 -72 -4 53 79 140 33 68 -114 -49 20 -17 30 -34 -2 -28 -14 13 -81
7698 -81 -10 -34 35 -27 88 0 -60 16 -45 2 9 3 100 -3 21 20 -97 -5 -10 27 -44 -7 41 -14 25 -27 3 -89 -5 -41 -55
7729 -55 -62 23 -38 63 -16 -17 -28 60 -68 -34 35 -58 -6 -33 -47 -31 -37 -5 -14 -51 4 19 73 73 -34 -45 140 63 13 -27 45
7760 45 39 110 -112 6 107 -44 -67 60 -97 -65 4 29 42 27 31 -5 36 -49 99 62 -1 -23 -21 33 56 -28 -9 51
7788 51 57 -13 85 21 33 18 83 60 35 15 37 38 85 104 -7 0 -30 -15 37 26 -38 44 32 -43 -12 -70 17 -5 27 61 31
7819 31 65 -59 -4 76 14 -48 -9 33 -1 -13 27 58 -41 -4 12 -37 1 84 58 -19 -120 61 -29 32 42 113 130 182 -643
7848 -643 54 291 -256 -423 101 -692 -145 8 2 -274 -150 -58 -191 -70 -607 168 -40 -144 -139 -195 72 190
7870 190 199 -69 135 148 -218 302 15 -81 -25 -68 34 16 22 -112 -28 -2 -46 -39 38 -53 -73 -53 74 -52 -136 -27
7896 -27 -28 -12 -54 89 -18 -3 31 -14 8 -12 34 -72 -57 24 45 -47 63 16 -54 -41 -101 17 -31 -6 77 -74 6 40
7924 40 53 -14 48 22 -16 -35 18 13 -24 42 21 -34 74 -35 6 23 -4 81 31 -68 -82 -43 -1 31 -29 25 -66 14 47 131
7954 131 -7 -79 -39 28 -57 6 62 92 11 152 -73 -168 -252 77 -47 90 -112 10 -288 -122 87 39 119 -280
7978 -280 -304 1 -61 110 -12 329 230 -16 280 155 231 -347 -62 -55 -318 254 -271 31 148 30 98 -125
8000 -125 -17 -69 -63 122 -691 132 189 255 -354 -324 154 -388 47 251 176 -411 587 -445 38 -636 -552 86
8022 86 -134 422 415 -288 -311 666 662 -70 -417 -147 765 -134 289 -141 406 -359 40 909 -277 -149 -289 -184
8044 -184 -21 59 -301 93 69 77 82 323 -307 463 417 15 -67 -160 35 32 101 -14 29 -14 -119 113 -36 19 -3
8069 -3 -11 5 -76 41 -99 36 -66 -24 20 31 -52 11 44 44 -17 -114 2 -32 31 78 45 19 16 -80 -77 -62 -104 -4 108
8098 108 52 -29 83 84 -47 24 66 8 6 62 48 51 -107 15 2 80 109 15 -23 47 23 55 2 -3 -37 -62 141 224 -162
8127 -162 -127 -6 47 11 83 -137 -33 4 -2 197 -61 56 67 -170 9 43 -138 -76 -220 -63 96 -110 169
8150 169 36 21 116 -65 186 92 137 -45 -28 93 82 -9 110 57 51 -10 -67 17 75 17 -131 54 -19 22 0 -76
8176 -76 60 25 -56 -25 23 -2 15 -53 -62 30 45 -37 31 7 -113
8191a13
$$ Imaginary data points
##PAGE= N=2
##DATA TABLE= (X++(I..I)), XYDATA
0 0 0 0 0 0 0 0 0 0 0 0 0 0 0 0 0 0 0 0 0 -8 8 -8 8 -8 8 -12 16 -16 16 -24 24 -28 32 -36 40 -46 50 -56 64 -71 79
41 79 -88 98 -109 120 -133 146 -161 177 -196 215 -238 261 -289 318 -353 391 -437 488 -550 624
61 624 -713 825 -973 1175 -1471 1942 -2832 5120 -26211 -48338 -35144 -38170 -34154 -42942 -42869
76 -42869 -38098 -30700 -31214 -29398 -35235 -32189 -26426 -19900 -18735 -21742 -22337 -18737 -11733 -7591 -7858 -9971
92 -9971 -9451 -4032 353 4859 1771 209 1832 7481 12023 12093 9080 7103 11782 15534 17500 15117
108 15117 12509 12755 15202 19428 17664 15521 12447 13325 16122 17421 15500 11149 10406 11347 13531 12660
124 12660 10413 6904 6035 8620 8271 8355 4689 2364 2447 4892 4977 2416 677 -1675 1061 1485 1991
141 1991 -675 -2121 -1815 -1217 833 -60 -1697 -3716 -1847 -342 206 -135 -3454 -2284 -1075 217
157 217 371 -1025 -2533 -1584 805 859 1198 -1448 -1471 -77 1471 1930 7 -757 -888 1206 1272 1560 -328
176 -328 -1267 43 546 1558 234 -1012 -1837 63 436 -2 -482 -2474 -1484 -714 110 -783 -1789 -2594
194 -2594 -2107 -244 -830 -1249 -2764 -2283 -1340 -500 -609 -2115 -2033 -1866 -287 -445 -317 -1519 -1720 -70
212 -70 61 653 -236 -536 -635 1012 1331 910 748 -203 1084 1484 2205 1414 787 869 1433 2613 1927 1720
232 1720 594 1485 1961 2076 2114 785 954 1284 1956 1600 1436 452 317 1515 1111 1264 215 135 215 970
252 970 809 243 -64 -644 448 147 699 -197 -719 -240 -37 537 30 -225 -938 198 145 184 214 -760 -370
273 -370 -80 536 42 -68 -520 -380 487 191 361 -638 -217 -81 262 464 -206 -191 -599 314 -60 423 -420
294 -420 -659 15 -34 430 -266 -29 -620 163 297 111 156 -545 136 90 698 168 113 36 313 808 539 842
316 842 107 741 818 961 1110 746 820 709 1527 978 1370 856 816 1253 1092 1368 821 974 583 1185 990
337 990 801 653 84 744 256 416 -9 -177 -253 -307 -208 -620 -411 -1307 -866 -868 -1098 -1006 -1695 -1598 -1721 -1321 -1831
360 -1831 -1568 -2021 -1981 -1531 -1980 -1510 -2051 -1805 -1799 -1443 -1428 -1402 -1319 -1432 -713 -1038 -471 -664 -639 -286 -123 287
382 287 106 585 172 1065 974 1174 1174 1131 1290 1693 1948 1351 2041 2555 1292 2023 1669 1940 1662 2333 1985
403 1985 1706 2077 1870 1662 1216 1769 825 1214 917 747 653 545 618 87 247 -334 -39 -273 -346 -455 -998
424 -998 -654 -830 -981 -1170 -1031 -1270 -1176 -1152 -1413 -1032 -1459 -1166 -1186 -1179 -1079 -1068 -1051 -1017 -491 -923 -423 -487 -485 -175
448 -175 -317 119 -108 259 -69 448 560 553 794 586 1037 872 1096 935 1173 952 1147 1290 1044 1393 947
469 947 1215 1139 1233 1195 1072 964 807 1288 690 1026 794 585 867 484 629 496 548 355 638 276 469 341
491 341 -118 559 99 296 210 175 70 310 287 -40 412 -117 345 161 313 340 55 245 140 196 -35 350
513 350 -152 -1 109 -181 109 -286 -189 -396 -249 -554 -646 -681 -999 -632 -1126 -982 -1315 -1315 -1427 -1519 -1472 -1905 -1581
536 -1581 -2120 -1910 -1964 -2208 -2179 -2370 -2211 -2380 -2271 -2560 -2165 -2497 -2315 -2287 -2434 -2086 -2330 -2064 -2054 -1878 -1914 -1663
558 -1663 -1604 -1717 -1202 -1537 -996 -952 -843 -646 -611 -418 -405 -57 -290 186 47 287 549 294 599 460 782
579 782 606 848 785 791 784 734 890 637 934 531 698 487 368 404 153 340 -143 112 -231 -222 -316 -565 -607 -783
603 -783 -624 -1106 -936 -1112 -1183 -1133 -1619 -1453 -1574 -1504 -1728 -1572 -1789 -1754 -1575 -1831 -1573 -1893 -1475 -1564 -1566 -1450 -1390
626 -1390 -1390 -1324 -978 -1208 -797 -862 -744 -512 -568 -341 -442 -164 -322 77 -110 176 357 114 591 359 570 475
648 475 635 787 772 840 615 1083 681 1003 742 827 859 752 839 682 902 526 854 512 500 630 455 559
670 559 346 602 215 431 201 228 260 7 333 22 201 61 148 107 184 151 25 317 -64 316 133 179 97
693 97 165 327 130 372 148 338 103 313 335 224 393 118 491 215 303 295 291 380 298 568 108 388 193 254
717 254 206 239 185 42 240 50 191 122 106 15 -97 34 -180 -30 -137 16 -255 -39 -141 -250 -6 -426
739 -426 -177 -185 -281 -90 -182 -191 -335 -160 -304 -46 -166 -202 -221 -185 -137 -185 -99 -204 0 -246 -56 10 -213 44 -96
764 -96 -33 -138 78 -68 62 124 -29 229 -156 90 97 53 160 75 177 101 281 69 250 127 147 227 48 268
788 268 -18 242 79 258 24 196 100 34 279 -70 201 47 121 -40 151 108 -102 187 -53 53 -28 -108
810 -108 -59 -106 37 -215 -47 -254 -37 -310 -55 -224 -398 -114 -364 -221 -355 -165 -401 -326 -416 -453 -213 -533
832 -533 -232 -311 -388 -450 -390 -305 -319 -309 -447 -214 -400 -313 -149 -283 -76 -57 -30 -61 125 -27 129 140 122 399 127
857 127 335 241 474 328 531 554 528 657 528 795 557 722 738 734 859 715 854 825 934 725 891 885 704
880 704 854 716 826 686 694 674 617 600 438 612 478 470 266 448 217 355 265 95 329 -21 296 -32 -94
903 -94 -52 -80 -85 -224 -133 -290 -89 -307 -234 -171 -258 -150 -236 -147 -349 -224 -433 -106 -257 -339 -94 -303 -87 -258
927 -258 -137 -35 -19 -152 -252 20 -296 -38 -167 -106 -116 -148 50 -132 -56 -145 -145 -42 -134 -35 -241 -143 -147 -115 -260
952 -260 -168 -392 -268 -235 -548 -255 -385 -194 -353 -534 -553 -716 -292 -461 -227 -428 -616 -360 -473 -285 -568
973 -568 -367 -553 -327 -624 -280 -783 -257 -181 -408 32 -295 -168 -168 -72 -195 -154 -116 305 466 53 347 330 -98
996 -98 273 307 318 202 405 84 528 433 399 457 410 348 246 597 450 470 531 339 453 429 937 491 800 -30
1020 -30 489 289 431 268 -122 473 241 224 -229 222 -29 343 769 107 582 154 146 451 211 -115 -362
1041 -362 424 276 624 655 -219 13 -39 -439 -145 234 -303 226 -89 -325 -156 -172 19 -54 -25 -80 -10 -127
1063 -127 -85 -178 -214 -13 -187 -60 -130 -219 -185 -110 -154 -183 -3 -284 -13 -292 -191 -246 -162 -159 -242 -53 -315 -93 -266
1088 -266 -147 -184 -316 -166 -177 -103 -181 -189 -296 -128 -181 -199 -112 -256 -127 -264 -128 -270 -48 -165 -228 -11 -243
1111 -243 -57 -197 -139 -112 -186 -23 -150 -57 -142 -6 -144 28 -74 -129 -28 -180 6 -162 -86 -72 -37 -77 -178
1134 -178 75 -99 143 -94 -56 -19 47 -76 88 136 -13 164 -5 150 17 10 108 15 152 93 194 81 202
1157 202 71 123 240 70 182 77 99 -22 137 118 98 102 -112 113 81 146 0 101 59 -40 12 41 156 -59
1181 -59 15 -15 -123 127 -20 -3 -35 -39 -196 64 -57 -41 -8 -89 94 -76 -20 4 -28 -197 -18 1 -58 144 -16
1206 -16 74 9 27 53 42 176 -1 134 -58 114 41 139 110 31 152 83 215 123 236 232 199 212 155 210 157 236 151
1233 151 78 266 156 125 47 222 49 161 39 83 93 -7 97 -68 139 -17 37 33 -12 -51 -49 7 -128 12
1257 12 -75 -66 -87 -119 -36 -192 28 -241 -120 -201 -160 -163 -217 -427 -262 -119 -546 -113 -134 -662 450 -575 -110 -635
1281 -635 -700 -531 -590 -167 -385 -88 -455 -73 -303 -254 112 330 -315 -246 -269 -183 163 -280 -81 371 -158 696
1303 696 287 311 21 148 92 451 0 54 202 91 71 97 289 29 161 173 91 270 173 50 127 148 137 -67
1327 -67 11 33 58 9 97 -90 37 -71 -1 31 21 -88 -14 81 -151 -29 -105 -147 0 -121 12 -166 -91 -68 -139
1352 -139 -82 -149 -77 -197 -66 -123 -86 -73 -59 -45 -60 30 -40 -82 -127 -29 -7 11 90 -1 64 -7 120 130 135 40 127 151 110
1381 110 112 78 174 139 92 206 213 231 76 190 -22 129 107 169 164 97 38 91 141 -24 92 -10 9 37 -64 -20 -71
1408 -71 -71 -125 -119 -131 -190 -212 -197 -159 -355 -218 -297 -321 -216 -313 -363 -508 -216 -338 -161 -278 -292 -283 -263 -281 -311 -236 -407
1435 -407 -294 -253 -356 -248 -265 -208 -134 -168 -172 -118 -104 -95 8 -87 70 -64 -62 -51 0 126 25 111 -26 182 145 195
1461 195 57 91 130 70 212 132 216 118 241 109 177 152 55 213 -38 94 185 49 103 110 100 -39 -11 8 114
1486 114 -31 -30 -46 -57 -30 -137 1 -38 108 -165 -110 -176 -136 -29 -153 -179 -177 -69 -84 -179 -75 -63 -119 -95 -6 18
1512 18 -105 61 -86 -15 -65 57 59 44 -14 -16 83 90 115 58 168 56 134 59 108 173 125 177 99 65 80 167 179 55
1540 55 223 113 199 18 142 51 106 154 146 97 112 143 3 83 -7 -1 6 -20 3 -24 34 -46 32 63 -9 -64 -79 44 -30
1569 -30 -6 -83 -46 -58 -36 -103 -36 68 -37 -32 -69 -23 59 23 84 25 42 -42 215 71 80 146 73 242 9 211 157 246
1597 246 132 230 193 166 161 31 306 142 187 207 27 254 45 -62 -135 129 -123 152 145 36 -123 93 243
1620 243 -80 141 -21 60 249 -57 -96 -361 -200 -19 -272 -256 -234 40 -314 -168 -196 -215 -129 -195 -299 -290 -128
1643 -128 -87 -94 -106 -173 83 -110 -166 24 -66 -61 -103 -114 -158 -12 239 21 65 297 139 230 38 175 300 241 589
1668 589 343 -16 123 599 17 195 6 117 169 150 -41 -5 515 561 266 -71 35 -129 3 278 -120
1689 -120 -140 127 -192 79 30 -557 -250 -103 -244 -281 -382 -209 -606 -555 -473 -311 -518 -458 -714 -362 -503 -237
1711 -237 -446 -284 -516 -369 -349 -192 -395 -566 -352 -47 -285 -536 -440 -266 -112 -202 111 -51 -25 63 6 77
1733 77 -89 67 -99 78 268 68 391 237 439 116 198 529 186 297 402 394 273 371 186 309 358 293
1755 293 366 276 294 364 234 233 225 283 121 218 128 81 200 50 153 66 59 21 171 55 55 62 -78 45 -84 -15 -16 -25
1783 -25 24 27 -143 -118 -162 34 22 -79 -20 -228 -24 -9 -108 -50 -44 21 -100 -93 -3 -29 -4 -99 -8 -99 32 -77 -25 -15
1811 -15 -88 47 -61 -68 -120 -33 -34 -51 -39 -69 -129 -127 -54 -101 -96 -8 -25 -30 -9 -69 -11 -30 -136 -141 -88 -32 -8 -110 -57 -68 -34
1842 -34 -36 -90 -107 -91 32 -18 -31 -4 -139 -37 -101 46 -26 -6 -96 -14 -67 -34 2 -12 -34 19 83 -29 -42 -15 12 71
1870 71 -105 -78 -38 -46 -24 70 -32 -33 -101 -298 -253 -5 -24 -105 -165 -159 -101 16 -69 -48 -183 39 -178 -228 -223 -73 15 -79
1898 -79 32 -33 598 6 170 -262 -374 107 -118 222 -81 123 -257 -65 151 -71 -125 -132 43 -155 29 -170
1920 -170 -24 53 -53 13 -38 -49 -66 -74 -47 -92 -80 -68 -39 -180 -13 -61 -33 -100 -61 -64 -145 -10 -155 -126 -100 -135 -102 -135
1948 -135 -112 -150 -154 -65 -246 -118 -304 28 -114 -268 -46 266 103 -204 -318 70 -153 -207 -217 -63 162 -32
1970 -32 -342 -235 -66 -113 192 246 -326 -301 74 -180 -76 -220 -307 -155 92 -251 202 -64 169 112 -6 83
1992 83 -50 109 -12 -64 -227 -224 16 -147 27 6 -26 32 -64 301 -177 37 -165 31 61 11 -258 -148 -192 -122
2016 -122 164 191 198 31 -138 477 82 -8 -115 316 191 123 56 512 -62 783 648 249 82 397 549 1155
2038 1155 -227 508 631 435 -292 -357 446 269 536 766 315 -213 113 -96 579 -199 225 -120 324 483
2058 483 156 410 -289 327 -116 -194 263 -329 2 -137 -16 -389 221 -89 -199 -34 -247 302 -246 57
2078 57 -58 -127 -217 1 88 -104 -188 50 34 -119 -22 -82 -94 39 -67 48 174 -5 -116 -26 29 61 -61 28
2102 28 3 -11 20 55 -122 68 7 17 35 34 -23 13 81 42 47 14 51 50 62 15 46 79 39 3 95 85 64 79 10 3 37
2133 37 104 54 119 54 106 -24 2 40 94 16 56 119 36 61 27 -37 43 1 34 188 68 115 14 -37 43 -100 34
2160 34 -52 -88 -61 -69 -80 -128 -76 -157 -143 -216 -150 -214 -125 -269 -124 -213 -257 -238 -265 -135 -139 -142 -236 -126 -140 -182 -173 -233 -98 -145
2190 -145 -187 -100 -144 -60 -57 -137 -140 6 -20 -6 0 -34 81 -35 71 74 31 55 107 34 -7 89 62 46 61 71 103 127 99 197
2220 197 157 176 113 88 251 45 64 57 117 187 104 102 80 22 45 78 172 16 -15 -8 62 32 -59 -22 14 37 -220 -90 -5
2249 -5 -22 -69 30 -117 -102 -75 -92 9 -18 -27 -46 -189 1 -127 -41 -61 -66 -59 17 -18 -7 -48 -75 91 33 59 124 54 47 56
2279 56 63 77 96 98 1 39 18 48 63 30 31 53 5 98 80 95 41 11 63 -16 111 46 46 41 -67 -48 40 26 -77 -38 -50
2310 -50 -30 87 -37 -6 -5 70 60 -21 -8 -77 5 -25 -26 -43 38 -8 6 -4 -91 1 -71 -22 -35 -52 1 -17 57 -21 52 -96
2340 -96 -22 16 -50 -38 -46 24 52 -35 -65 -14 -2 15 -114 79 -1 -59 21 -47 -7 -25 -37 2 7 61 41 13 -27 15 9 99 12
2371 12 -120 25 -49 37 -20 -107 -37 -8 -17 -30 -84 -55 -27 -38 -78 -6 -77 -78 -28 -48 -39 -74 -80 -140 -68 -99 -35 -73 -39 -87 -25
2402 -25 -153 -100 -159 -38 -18 -114 -173 -87 -22 -37 -52 -28 -127 -39 -41 -42 -60 -61 -78 -88 -15 -62 25 -92 -26 -46 68 -15 -148
2431 -148 -100 -22 -33 -10 87 -26 7 141 29 -16 -24 13 4 -25 9 29 -116 -6 30 69 62 7 85 -42 61 12 -25 -62
2459 -62 -56 3 24 -57 -56 -45 -87 -49 -120 -72 21 12 -52 -108 -143 -30 7 -80 -30 -73 -135 10 -62 -3 -23 -92 -44 -76 -27 -32 -132
2490 -132 -45 -19 -76 -117 -45 -56 -37 -7 -22 25 52 -15 -44 24 -62 -3 -4 71 126 -2 67 115 11 45 13 113 89 63 40
2519 40 169 -33 159 117 92 118 71 41 1 90 27 3 86 -37 77 128 67 -187 -50 176 -143 -80 87 -23 -112
2544 -112 243 -455 -369 -82 -83 59 -171 97 102 -549 -219 -159 -266 -224 -136 -55 -66 -122 131 -82 105 -167 -61 141
2568 141 -52 -53 -21 41 -122 39 -39 -4 34 60 -26 -42 -11 -26 -28 64 18 87 4 -25 -34 -54 -85 -66 154 56 57 77 -11 38
2598 38 36 10 42 35 -30 -94 86 28 -66 -26 52 -33 115 -31 4 -19 -96 -55 -66 -101 -78 98 33 -47 -86 -50 -57 -99 -7 -65
2628 -65 -165 -80 -24 -41 -86 44 67 35 -28 -57 57 53 -9 43 154 251 84 61 18 126 206 6 -37 -39 -23 -35 45 106
2656 106 -10 56 52 -94 -62 24 -91 -122 -308 93 150 13 -105 93 -81 -161 245 70 78 -49 127 28 -65 98
2680 98 22 -108 68 -46 78 -148 122 -118 81 20 -117 46 -298 200 54 106 -257 57 20 259 -63 -163
2702 -163 236 -206 -35 -246 23 220 -1 248 138 -265 212 -225 162 -128 -139 109 -543 229 48 -194
2722 -194 411 190 -84 -26 32 258 -192 -190 221 -237 188 234 -439 247 46 -60 290 21 -81 298 -23 120
2744 120 105 -17 -153 -97 3 334 -181 -73 59 -199 93 4 69 88 -53 -69 191 76 -227 209 96 86
2766 86 -238 -52 -22 36 204 112 102 -55 142 106 -88 -60 36 212 77 -25 -47 2 2 -7 170 108 -58 33 14 86
2792 86 79 84 135 21 93 24 60 -36 114 -29 54 35 -43 39 -3 -35 70 -70 -51 -137 32 -134 53 -1 -6 -94 -63 -97
2820 -97 -8 105 -11 -11 -52 139 8 -36 -28 -59 -5 -75 14 50 44 9 79 -24 -69 54 6 -49 13 66 11 -40 -93 -143 44
2849 44 -75 5 99 -140 -83 -28 71 -16 -43 113 -55 -4 14 -44 64 -8 -89 7 103 -5 -20 23 -4 1 -56 37 51 -80
2877 -80 20 45 -74 9 -15 53 -20 -3 -64 -62 -41 26 36 42 48 -37 -91 32 0 58 27 19 51 -22 -7 -1 -97 72 -38 5
2907 5 -20 18 93 -1 6 67 70 42 33 -14 10 -116 72 107 -19 -2 16 91 6 63 -3 41 -64 50 7 11 -28 -27 -49 -6 28
2938 28 -45 32 108 21 53 -89 2 21 14 -34 32 31 -45 -3 -59 -97 11 20 3 98 73 27 35 -25 -98 77 -39 -102 4 83
2968 83 -64 -45 -31 -30 1 20 -91 0 -17 -19 -79 -104 -99 36 -56 9 -93 28 -7 -3 70 -26 -53 34 32 16 30 15 -31 62
2998 62 -3 -32 26 -69 7 78 48 42 78 18 -40 150 33 -17 -17 36 -24 61 4 32 57 -60 82 48 -12 45 56 47 -64
3027 -64 8 37 89 13 -22 24 -85 -30 -43 -16 -29 -20 29 115 24 -14 -7 51 14 39 -14 51 28 61 149 102 87 13 44 -53 36
3058 36 -68 -78 15 67 -50 -88 -80 -100 4 10 -13 69 49 -37 9 24 89 93 88 -54 -43 26 67 109 -81 34 -19 -104 4
3087 4 20 45 -21 -26 112 -66 -62 3 58 71 -80 19 11 71 -21 22 -30 -68 -56 -8 -1 -20 -20 -55 -13 -34 -67 -43 -29 -25 -1 -161
3119 -161 46 -128 69 -48 -66 -123 -71 -20 41 -92 -67 -90 37 5 54 8 50 -65 10 -78 -76 -16 17 45 -125 -59
3145 -59 4 -15 58 -12 6 -46 -47 63 5 -18 -72 -9 27 131 -19 -31 73 119 -2 -10 -38 -35 78 -31 80 39 -20 51
3173 51 74 66 51 50 52 0 11 -96 42 -3 -50 10 43 -13 149 -13 89 108 -268 -86 119 -110 -78 -70 -24 -108 -4
3200 -4 87 139 -37 -43 -9 -77 178 27 89 137 -44 50 33 5 69 -57 -131 -129 -117 -7 98 225 120 -138 33 71
3226 71 -27 -191 102 40 186 18 -210 -58 -130 -26 -12 -10 108 77 -79 -53 113 -28 -113 -296 -127 -50 10 75
3250 75 113 -26 -121 1 293 -25 -235 -14 17 388 -47 240 32 -32 -166 72 -181 -145 6 18 145 108 244
3273 244 -59 33 -28 228 19 -16 -57 -86 109 -37 51 9 38 -89 -115 -79 67 -10 -64 -14 1 -19 67 52 53 -36 47
3300 47 81 13 -83 -95 -114 27 -9 41 4 -55 -15 -17 -42 23 -14 55 52 52 23 94 17 56 100 24 -7 -103 -27 104 95 -24 23
3331 23 6 -10 36 -10 -6 9 -29 -101 3 -73 -44 19 3 -24 47 -26 10 -62 -66 -52 101 -41 -83 -51 93 67 62 -48 -26
3360 -26 4 -11 -34 -25 48 63 15 -39 58 -23 -141 -64 -20 -55 43 -5 1 -29 -16 -51 -37 -92 -46 -5 -13 -21 -71 8 26 37 -44 48
3392 48 -40 75 -18 76 -7 -32 130 50 -31 39 6 34 -74 9 -48 -71 39 39 -19 2 9 -23 43 -54 -50 -23 -39 -69 97
3421 97 42 -93 -72 70 123 -30 -35 -2 -123 123 -74 -41 -34 -26 163 -241 188 -111 160 44 -271 -56 -29 62 -8
3446 -8 -56 0 -89 -15 -73 -5 -3 -1 55 82 -81 -10 -153 -156 -16 -147 -134 97 75 38 -58 139 140 -106 118 -234 31 70
3474 70 -67 -88 101 64 -55 50 -48 67 85 -65 1 73 -38 12 8 -26 -16 40 -51 47 -159 -26 -46 -15 -15 5 -18
3501 -18 41 55 -12 -72 45 -67 93 -35 -70 59 42 3 44 55 18 -4 33 67 -1 -80 27 -45 73 -72 -12 -34
3527 -34 23 -58 126 26 -32 27 -3 77 52 51 57 28 -8 82 1 34 46 -57 -33 -52 34 -15 224 -24 168 -112 138
3554 138 74 -24 180 -2 -11 68 92 -115 -11 37 96 -146 -96 37 14 105 -26 50 13 -153 91 76 31 -8 -92 -101
3580 -101 -80 31 10 -129 13 -60 -11 33 19 -2 -1 37 -65 31 62 116 78 73 71 -40 -27 55 60 67 23 190 -70 70
3608 70 -5 -43 3 115 74 13 143 25 -340 -309 -179 -148 358 65 -24 -187 25 146 -186 -79 26 386 -109
3631 -109 33 64 356 85 50 -7 -162 65 -4 -38 -33 460 191 -368 100 -223 355 50 45 160 383 190 133
3654 133 166 -131 338 -57 167 -190 -207 88 -7 -12 -52 252 -301 -198 -74 -107 5 -35 -295 50 62 -194 -298
3677 -298 43 -157 -228 26 -437 171 -290 -463 200 -63 116 348 9 -121 139 118 60 126 -11 -183 330
3698 330 66 -196 -204 24 0 -10 437 133 -103 -76 -219 56 -119 -93 -373 33 -172 -17 3 129 43 -59 233
3721 233 291 121 29 113 -304 64 -62 -15 -81 -102 68 -91 -154 39 115 -86 86 67 -23 -245 30 -195 -69
3744 -69 -13 132 22 -244 40 -67 -100 -382 6 -145 -33 -175 75 73 -27 -15 46 74 140 -68 -93 140 -80
3767 -80 -117 -6 -55 90 -99 -76 79 -11 -44 -3 -4 -3 -20 -10 -15 45 -93 -46 -9 -30 -134 -26 -15 31 -37 17 8 14 -32
3796 -32 29 24 -10 -12 -50 21 -36 -43 32 19 -99 43 -24 -81 31 -18 38 -31 20 -49 47 -4 0 43 141 17 -16 3 91 48
3826 48 63 103 -34 -3 -73 -7 72 -21 142 4 0 -63 90 63 25 40 -3 31 -35 -26 4 -20 103 102 -13 -19 51 -4 -85
3855 -85 -7 48 -124 -25 -41 -69 -51 -87 120 89 -41 34 15 -4 -141 -99 -78 -36 -132 63 -63 -17 90 -82 -19 41
3881 41 -116 104 23 -75 -158 -28 -69 13 41 -120 -18 10 -12 -210 -3 -147 145 -3 -73 13 17 -20 3 -69 -68 -138
3907 -138 -30 93 -85 150 -7 -50 27 82 97 60 -23 51 79 40 -145 -16 6 121 -12 241 10 13 15 18 65 -29
3933 -29 -27 -2 -13 41 66 -128 93 34 -12 12 30 -12 -81 -5 -136 48 -59 60 -105 -17 -193 91 -142 43 90
3958 90 -4 -48 38 120 -7 -21 -96 144 -105 -17 -184 159 197 -86 -54 -247 -20 -114 85 244 -167 -131 144 -366
3982 -366 502 -270 -220 174 385 160 -185 400 174 -31 206 46 -133 37 -251 -14 235 -61 11 188 58
4003 58 243 -81 104 222 -36 -362 155 140 -4 146 -232 -249 236 -413 319 430 -168 -316 524 383 -161
4024 -161 220 132 -22 -258 -622 337 -204 -697 -115 -90 395 -108 34 -60 3 37 -191 -279 126 21 -140 -28
4046 -28 -93 -8 -83 -122 30 -66 103 -93 71 -24 65 -9 19 27 13 -38 -12 -62 -74 -59 -30 -34 17 -27 28 -17 -3 2 52 -36
4076 -36 1 39 -24 -34 16 44 -53 49 76 45 11 34 21 35 54 -3 -35 116 -35 28 -34 -63 -22 -15 -65 80 66 39 0
4105 0 64 -14 58 105 -57 -43 -43 12 -23 62 53 16 -43 -21 69 118 -34 159 -9 -19 -110 -1 14 69 -22 -44 9 -9 11
4134 11 -10 -43 -2 -38 -89 -19 -82 -131 8 -50 -15 -50 2 56 9 -44 -54 -46 -27 -46 -49 -37 33 -37 73 5 -3 -88 7 -2 -29
4165 -29 -57 91 -8 161 -81 13 -72 32 -35 46 -26 20 -18 3 5 -33 18 -66 26 -23 -25 -6 75 43 -94 -54 13 30 9
4194 9 -59 24 -79 -12 29 20 -24 136 16 24 -19 70 -12 5 37 -124 -55 78 32 -29 21 71 -11 46 -28 -28 -78 -82 10 3 -53
4225 -53 -11 110 -34 -25 -101 -104 -42 5 71 62 67 -25 6 106 -54 -14 82 -93 11 -100 -46 81 31 32 -4 60 -112 61
4253 61 -27 -30 62 -26 -80 -29 8 -129 -6 8 -51 -99 108 26 15 -57 33 24 92 48 49 37 50 -22 -26 33 58 20 -16 -8 -23
4284 -23 -44 32 33 44 20 13 -28 5 -39 45 43 15 36 -37 -77 57 -96 78 7 38 134 31 -89 -45 -96 45 17 -21 25
4313 25 -49 52 -90 85 -9 56 -4 5 6 -50 12 67 -50 39 -12 22 2 20 -9 20 -1 -80 -27 -70 -41 -31 -2 -2 8 25
4343 25 -73 36 -5 13 -7 17 6 -14 -32 51 -10 -27 36 69 29 91 -14 2 -58 -53 -4 -1 -31 -6 -45 5 22 6 22 6
4373 6 -27 2 15 18 41 -21 7 -49 -49 59 -38 -4 2 7 83 1 17 -61 -7 -59 8 -55 -33 -15 -9 28 3 -100 12 75 89 -14
4405 -14 11 53 -6 -39 19 44 -174 -37 -78 19 -31 20 38 -89 4 -34 -11 59 -3 11 12 -22 -72 -53 22 40 44 28 -32 43
4435 43 10 26 24 39 7 -46 -42 -56 -51 96 48 -85 36 28 -58 13 47 -74 -66 -80 28 -5 5 56 -14 5 -90 226 -160
4464 -160 -69 -232 -37 -57 -143 84 37 27 87 2 -59 -13 43 5 102 6 -53 46 23 -27 -39 29 -48 23 28 -68 40 3
4492 3 8 17 -7 -6 -1 43 39 19 -26 -23 -4 5 74 -42 -28 8 -16 -7 39 27 -7 22 -28 -12 31 13 73 20 -98 20 -30 -5 -63
4525 -63 -36 -37 60 -42 14 -23 -31 -53 19 -36 -55 73 34 -46 7 1 -63 -86 -29 77 6 7 20 16 -70 -78 18 35 -18 -21 64 -12
4557 -12 23 -72 -42 21 -6 54 -31 15 -92 63 59 8 100 -4 86 -73 8 24 54 -50 -3 -40 42 78 85 -34 -10 -19 -47
4586 -47 24 100 -47 33 -63 -32 -1 -44 18 -14 -9 5 66 -73 66 -35 -34 -88 -132 41 -19 -10 34 -195 26 69 -16 -22 2
4615 2 -29 5 -44 -40 71 4 -181 -60 62 -41 -71 46 77 -66 7 27 -74 18 2 12 -18 8 2 44 -42 29 47 -45
4643 -45 73 -65 19 65 61 -32 -20 44 56 -43 29 -23 37 -82 -33 9 1 121 -12 -15 -42 -13 -41 109 -6 8 -30 -72
4671 -72 -105 -33 -26 -93 35 -30 -73 -24 44 57 3 -104 5 60 3 -47 -60 -53 62 -74 -29 -52 -46 26 -65 36 18 99 -3
4700 -3 -12 -29 -95 -17 -83 -49 60 -7 -3 -45 -72 58 -53 64 -59 13 17 31 -8 -16 -63 14 48 -5 -12 45 36 4 -23 6 -11
4731 -11 29 -19 -53 -58 -58 -5 -65 89 58 -88 35 -48 8 40 -77 -57 23 16 23 -34 1 -23 13 -15 -46 -63 -35 -12 -21 -29 69
4762 69 46 59 17 30 4 -22 83 49 78 31 13 18 -89 3 -73 -54 8 -102 -135 -53 -15 -9 7 15 -36 -79 -58 36 -103 -34
4792 -34 22 100 -49 -98 -52 -12 114 -33 59 -15 -3 18 19 56 10 13 -72 -39 56 -91 17 62 -102 -68 -14 30 -27 -55
4820 -55 30 -99 -122 36 -20 -1 -23 -52 -51 56 -61 30 5 -35 -36 124 102 -62 34 -54 -41 7 72 44 3 32 -18 -19 -103
4849 -103 -26 5 -12 0 -157 -2 -15 -93 0 -72 14 -3 -58 13 -89 25 -61 45 56 -95 11 -22 -10 -40 -60 -8
4875 -8 -67 -16 66 -2 -61 41 -35 -91 63 -18 25 15 -34 -67 24 -86 -39 -50 -67 25 52 -128 21 -16 18 6 -18 -78
4903 -78 -24 -48 -80 -23 41 80 -35 -127 -31 -30 39 -52 16 -2 -19 9 1 30 -53 -46 -81 -4 -32 36 -12 -33 -31 -52 -66 -93 -48 -64
4935 -64 98 -47 -45 40 64 -31 -22 -32 104 53 -93 4 37 30 -53 2 -2 15 -34 0 96 -24 -20 -74 -109 5 -19 3 -74 -112
4965 -112 -38 22 37 -60 -11 22 -3 -30 -14 28 -9 53 35 -5 -144 -4 17 -38 -71 -11 64 -10 -96 -2 -70 -17 -3 -14 63
4994 63 -132 44 10 6 -60 2 -37 -127 39 73 -18 5 -15 -80 -3 -3 37 82 48 -34 -7 -13 -72 24 -23 26 5 -13 89 45
5024 45 -43 40 -91 10 -9 22 20 136 40 57 -69 -45 84 -9 -38 20 -1 36 -13 -52 62 -44 -36 33 -19 8 -58 24
5052 24 19 41 9 -109 -6 -15 -95 -6 -54 -18 53 -53 71 -23 -52 -18 -70 -50 24 -15 30 25 84 -13 35 -25 3 -61 -24 -28
5082 -28 -92 -13 21 -26 -9 -81 2 -61 -41 -62 -29 21 -28 -23 -25 7 -22 -169 -10 17 -20 -73 3 -14 -60 -7 -90 65 -88
5111 -88 60 -62 20 67 -109 60 -17 -20 77 -64 67 73 -5 10 27 29 -49 -4 -4 -26 -44 -9 -60 -33 77 41 21 -137
5139 -137 -20 19 -16 24 -66 -19 -23 -53 -72 -75 80 -16 19 42 17 26 -8 -3 51 -64 -24 21 76 28 11 -28 -16 -50 13 -7
5169 -7 -123 -67 -78 -60 18 20 -42 -18 -19 -102 -59 -8 55 3 79 32 29 3 9 -47 -14 -29 34 62 -46 -6 2 -2 -84 -44 51 52 -76
5202 -76 31 96 -1 -70 152 -40 -70 -25 -7 43 -13 13 -2 -48 -43 -88 -20 -14 -76 59 11 -1 -78 -26 24 -23 32 -139 -30
5231 -30 63 46 -47 66 -59 90 62 11 -107 -95 14 -44 -134 20 12 174 14 -129 -235 -145 399 -142 296 93
5255 93 433 -57 65 -20 86 -224 -603 60 425 335 86 -693 -74 -396 571 578 -206 472 197 195 -212 -151 141
5278 141 37 -237 -249 79 -99 25 -40 -3 139 -371 167 -67 206 163 178 -220 -186 547 137 -148 -352 -115
5300 -115 3 -96 204 -179 -129 -198 -87 -4 164 -229 17 -50 -54 -168 73 26 90 -9 -54 -32 3 5 41 54 41 -2
5326 -2 -27 -17 -21 0 21 -14 -73 25 6 34 29 38 -127 5 -63 111 91 38 -28 29 39 -44 63 -45 -82 -102 -20 -77 47
5355 47 14 39 -63 -75 103 -44 -51 58 -30 -32 4 68 0 38 36 -42 19 -41 41 -30 46 45 -13 4 -11 68 -45 -7 -8 -42
5385 -42 49 47 -90 -58 15 16 -44 -86 33 16 10 1 -20 -9 104 108 -83 -72 151 -59 -24 216 80 94 23 -69 109 191
5413 191 0 67 -119 -333 -143 293 -207 -95 -488 -90 35 -12 -134 -409 91 99 -15 -688 157 158 -178 47
5435 47 -274 86 17 108 -87 92 -137 -148 -31 87 7 108 -4 17 58 -91 178 48 -10 -43 -43 -21 28 -67 65
5460 65 -112 27 0 2 14 31 -24 0 112 -7 -48 80 -58 43 -7 -17 19 -33 30 -107 74 96 1 156 23
5485 23 -15 -93 44 15 -53 38 54 -88 -86 -47 -50 15 -6 -10 -49 4 -92 10 -55 24 -100 -78 -52 -76 -34 -4 -20 -107 47
5514 47 90 -20 -63 14 -41 -29 -54 69 -29 -30 50 -4 -41 63 20 -103 16 -53 -26 -22 57 -126 -29 -46 67 32 -55 36
5542 36 -58 -52 -53 -76 -110 -28 24 -6 -60 -34 -100 -27 -45 86 -37 -52 4 -14 -28 50 57 72 19 41 67 -9 -71 -132 6 -101
5572 -101 -3 90 -31 17 -64 28 -71 -36 -17 -47 36 -9 -122 -1 -53 17 63 -70 -103 -96 -1 -25 -17 -9 -63 49 63 51 30
5601 30 29 -13 83 1 62 44 -73 -2 -46 57 -6 19 -67 -36 -36 -31 51 24 -48 14 -27 -77 30 -99 -27 1 42 58 -57
5630 -57 5 -70 28 -127 102 -53 -50 154 41 78 79 6 -31 5 13 72 -38 279 290 -40 -134 236 161 209 231 -59 -12
5657 -12 342 149 -959 45 104 21 305 -180 179 31 125 278 -243 -533 254 -195 8 25 -31 23 -73 83
5679 83 -43 102 57 15 -33 76 -79 347 487 195 233 -462 327 -275 388 -318 -1009 21 -375 -212 -50
5700 -50 46 -560 -297 663 -319 -80 188 -71 -462 306 517 389 -381 -123 726 110 -386 288 391 -14 -187
5721 -187 155 -49 -10 1 119 -93 104 156 118 -89 78 -58 44 272 -45 -480 423 2 376 104 150 275
5743 275 173 259 -348 415 -423 97 -180 -48 183 -176 -73 -236 -483 231 -511 57 141 47 465 -32 -3
5764 -3 276 242 177 45 0 -10 -221 394 220 -128 130 213 587 180 340 366 159 -208 -335 48 250 133 105
5787 105 -31 -92 -81 -265 210 41 -94 -16 3 697 -233 254 185 -106 -208 71 -72 -482 179 -253 115 -65
5809 -65 214 155 -83 205 615 -272 562 163 -7 -197 -55 -71 208 157 495 704 -572 18 32 -286 -360 -39
5831 -39 -34 -362 -75 73 37 -392 -58 199 -118 -107 -62 -132 34 38 31 -28 -128 23 -65 2 -90 -6 -138 39 -88
5856 -88 -73 -87 -12 -73 -67 32 22 2 19 -54 42 3 -2 63 -36 91 6 -44 -41 -10 -6 -26 -5 24 -58 -40 -39 -11 35 4 -20 -125
5888 -125 22 -42 -18 8 -120 65 111 -3 10 79 -61 47 -8 43 -25 -51 -20 29 79 8 54 30 -69 4 18 -22 15
5915 15 -91 38 13 34 -16 4 34 -19 29 70 -34 93 52 17 35 22 18 28 -29 -4 -32 -33 -117 -107 -25 66 -9 76 27
5944 27 68 53 20 -43 -92 -36 -57 64 41 19 -50 48 40 21 29 -85 -14 -10 15 -16 -2 -24 111 -113 100 72 -51 18 -2
5973 -2 -22 -3 -109 -52 -9 69 8 -76 -20 7 -42 -62 42 -55 -23 -28 -52 25 -19 -8 55 84 74 -48 -20 -78 37 -70 -85
6002 -85 -28 -28 -56 -54 3 -56 8 -18 26 39 5 -36 74 34 24 9 -31 9 57 20 -25 -24 -37 -37 6 18 49 -50 -57 97 -56
6033 -56 -82 38 -2 -18 -30 11 -71 -32 17 -35 -72 11 34 -102 30 2 27 2 1 90 -61 79 38 51 -51 49 97
6060 97 -42 -80 32 -14 -73 46 22 90 -7 -48 69 6 12 -48 7 -7 -37 50 7 -40 -35 34 1 -55 8 86 96 62 39
6089 39 79 4 24 44 38 -9 4 40 31 6 45 -119 26 -49 -52 38 -130 -56 62 43 -28 -33 -40 -47 -76 5 19 -10 39 1 22
6120 22 34 19 55 56 39 57 37 49 31 -8 -56 -46 -48 29 84 6 10 -11 -20 -22 35 -48 36 68 89 41 -58 80 -113 41 50 15
6152 15 69 55 35 44 -43 -92 -9 44 -67 87 -98 8 84 16 52 -25 -48 31 21 79 -13 -69 -46 75 -40 -29 -77 -79
6180 -79 66 -85 0 -65 87 107 -10 -111 -17 -46 -4 20 76 -8 39 -36 66 89 4 -22 52 21 2 67 53 70 -17
6207 -17 -19 -19 29 59 39 -81 -49 23 -25 59 -36 31 -34 -8 36 56 -45 -21 84 -38 -82 -51 3 -46 76 -39 31 -20
6235 -20 -29 -47 -132 -48 -4 -75 -34 -22 17 -41 -104 -19 -8 -47 22 -73 43 -85 -39 -32 17 13 129 -15 30 -25 30 18 28 5
6265 5 0 36 -28 39 -37 53 -47 -19 -40 2 72 14 -22 -9 23 -10 -79 4 22 -47 -10 52 33 62 79 34 -26 -12 -13 91 48
6296 48 -28 -63 -4 -2 28 -37 56 59 42 -25 -98 21 -20 -49 -93 -30 18 13 -1 77 27 -38 -24 15 14 24 -51 29 16 87 68 -15
6328 -15 -80 -8 52 15 -18 19 7 79 33 -33 -39 21 12 -19 -23 -8 99 105 13 10 73 -34 -47 44 117 -49 51 38 72 121 89
6359 89 -17 64 14 152 9 -240 92 172 70 -151 -96 -116 149 203 87 245 114 409 -153 -181 -66 -49 -235
6382 -235 -223 246 -52 298 29 -282 308 100 -563 125 243 127 -197 200 -497 96 -369 66 78 -30 89
6403 89 24 146 99 45 7 -35 -54 100 -76 5 5 -40 -42 0 -70 -35 -55 -40 -44 61 -27 -75 -15 -140 -20 -59 -35 -76 -11
6432 -11 -3 19 41 3 -99 -51 16 -38 -30 18 69 62 19 20 -35 -2 21 -51 -27 -4 -19 52 -3 5 -41 70 -22 17 61 -24 -75 -2
6464 -2 29 -28 1 19 106 -27 -35 -63 33 6 -12 -17 -28 -4 -72 -89 89 46 40 58 102 55 -35 43 7 13 2 -3 -7 -4 26 -93 -63
6497 -63 -26 3 -16 -43 -23 -55 37 -79 -11 -55 -5 -22 46 -2 -40 49 58 -11 28 -30 80 -44 -8 -29 25 54 43 5 -7
6526 -7 -37 -39 7 -98 -1 22 91 -10 9 -15 80 19 -35 21 -18 -28 41 -90 -15 -37 62 2 -21 28 -76 -23 15 -12 74
6555 74 -30 -41 -8 -53 -23 31 -36 1 -13 -18 -39 -34 48 134 -4 -107 -48 9 11 -99 47 -12 73 -58 -50 29 90 22 -15
6584 -15 -1 30 -2 54 -90 -59 -61 -30 23 -47 47 -83 18 13 18 -24 91 0 -28 3 54 17 38 46 60 -49 10 -38 40 34
6614 34 -42 7 -67 139 47 -77 -10 -84 -95 40 -48 77 -11 -44 71 -35 -42 19 -2 59 -2 29 105 -39 -23 -35 25
6641 25 -20 9 9 45 -90 39 -1 -29 -19 -54 -80 61 -74 19 -12 -3 -23 50 9 -82 -71 7 32 67 26 -46 56 -111
6669 -111 -96 -54 -6 -57 -29 -36 113 -49 -6 -19 0 -13 -11 67 14 -15 33 4 -16 -51 48 -41 129 53 -50 -84 -39 -37 -15
6698 -15 -12 0 -21 -36 -8 -75 87 10 4 86 15 31 -54 66 8 -103 -46 -44 21 -3 49 37 -35 60 -32 -65 -125 74 78 131
6728 131 -29 89 57 29 -12 -47 -51 26 -46 -97 24 44 48 30 28 -17 -75 -94 -20 -94 -42 -66 -51 66 8 -39 -40 -18 40 13
6758 13 15 30 22 66 -26 -15 11 121 -32 54 40 57 -19 92 -39 -33 -78 -24 10 18 47 -20 -40 11 -70 -49 -61 -45 6 -40
6788 -40 3 17 20 -54 7 -71 46 -14 -62 -42 35 -93 19 -109 10 58 -28 54 -21 -84 96 13 60 -47 -65 -4 -26
6815 -26 62 8 -63 4 -10 -113 36 -7 -71 -77 38 75 -48 -16 -14 20 -11 7 -99 -8 -89 26 66 42 -50 3 -24 -63
6843 -63 -55 -16 -45 48 -34 102 57 56 -23 -45 -58 28 4 18 8 -41 21 27 66 -49 -18 -39 39 -65 -97 -119 -1 -14 -10 -60
6873 -60 21 -19 -63 50 18 54 96 53 100 -54 -7 -25 31 50 6 68 22 19 15 58 -36 1 -11 -86 -70 -49 -106 -71 17 -8
6903 -8 -103 45 -10 -9 -14 -66 -33 -27 -21 61 28 -78 -11 -44 56 -8 -106 19 -142 61 -36 90 -122 14 133 -175 -170 220
6931 220 46 -94 149 -238 -97 -107 -92 -254 -184 -185 -78 -285 228 -434 168 61 -362 -2 -168 -166 -66 -104 438
6954 438 -19 91 -231 207 -234 0 5 -113 -45 -40 -29 -7 -224 71 34 -62 -26 44 12 14 149 -3 -5 -1 2 73 17
6981 17 56 -52 65 -15 -56 -92 -36 -32 1 -2 -40 -79 36 -23 7 -88 4 -84 -50 48 -19 26 -12 65 26 5 55 -2 62 -1
7011 -1 43 -102 -35 88 -15 30 32 17 -41 -44 -40 -88 53 21 46 -25 -122 13 -39 -37 5 74 -57 82 -40 3 -30 -19 81
7040 81 -33 28 -14 -44 49 17 34 44 -43 -3 -24 11 -74 -18 -17 -21 31 58 42 -13 -96 -15 -92 8 -2 6 -92 -12 -14 -15 -50 31
7072 31 -4 -42 -39 -136 30 -26 -30 -48 -128 -58 -26 30 49 68 35 11 87 -36 -6 16 -67 -22 -47 10 -6 3 4 -7 -3 46 -32 60
7104 60 -39 12 -65 -14 -53 -26 -27 18 -43 84 43 -90 8 77 72 -95 -101 0 101 -45 42 -20 -5 -31 -94 44 -114 -123
7132 -123 -101 59 2 46 45 -19 -65 -16 8 -10 76 0 16 22 -53 -72 -1 3 -23 28 14 117 -44 156 49 -15 67 57 -27
7161 -27 64 -45 -12 18 -10 67 -112 27 21 -47 45 -1 14 70 163 1 23 24 40 47 32 -84 -15 65 31 -77 61 -44
7189 -44 -41 116 -23 -111 -14 -11 -24 36 -19 5 -17 31 1 26 61 -82 -11 -70 -49 24 -13 -76 -60 -4 -3 44 -64 91 -37
7218 -37 -48 34 -9 -95 -23 11 -24 -60 -50 -48 -74 -113 -19 10 14 34 20 0 4 71 70 49 -20 11 -55 18 65 6 -83 -33 -63 74
7250 74 125 -14 23 93 -8 -88 18 -51 61 -60 46 -7 40 28 37 -12 -19 23 -112 -89 57 -5 -72 49 41 53 -21
7277 -21 -26 -98 39 -15 82 46 -92 10 -49 -42 43 -22 85 32 13 -34 -28 52 46 -25 -38 22 -67 -62 12 -70 -32 45 0 -63 55
7308 55 31 98 9 -42 -86 -40 38 0 81 -102 -3 -34 16 65 41 -20 -14 13 75 -67 17 4 32 18 -42 18 31 50 87 -81
7338 -81 -8 -10 71 -83 -40 -10 -67 -32 -6 -44 38 29 -15 -56 -51 35 42 -16 -16 46 -10 58 3 -5 -11 22 24 52 16 -83 11 17 -75 -1
7372 -1 101 -87 -3 43 -60 88 8 -64 3 10 -37 3 44 5 -108 -66 39 47 20 -9 -34 -35 24 -125 -23 -44 -15 0
7400 0 53 18 69 -39 8 -98 -70 44 73 82 1 2 8 36 -108 -26 117 2 46 -20 2 -7 35 12 -15 4 51 -60 -69 40
7430 40 -40 -83 13 5 -104 -55 -74 -1 -7 53 71 -30 36 47 -20 -42 25 106 -76 -115 -54 -120 53 -99 -65 -121 59 60 -14
7459 -14 -35 -76 -34 -145 55 -173 37 -37 156 104 121 -33 53 -85 -61 -61 36 14 190 -31 -92 238 -184 78 468
7484 468 -11 129 -449 -215 -147 -50 -17 155 40 -36 -183 -132 -581 -368 468 -49 -19 94 -167 -433 32 -97
7506 -97 115 -164 270 352 -161 282 -328 -121 262 -142 -67 13 -402 26 443 -61 184 343 23 478 -18
7527 -18 -17 -226 62 230 284 -139 19 -262 126 -41 -400 -55 -41 -209 16 -124 3 -275 55 -442 434 -63
7549 -63 580 309 25 -238 -45 228 231 -249 -381 -112 356 -290 197 49 -537 -381 240 -60 477 -636 219
7570 219 362 -21 -620 415 286 113 18 -253 116 298 113 -159 -64 -14 32 8 -33 -49 -62 -56 -35 30 -244 -100
7594 -100 80 -50 41 -4 14 -136 52 35 69 8 20 -41 50 -1 -7 2 40 89 -7 26 6 93 -20 49 -4 40 -11 -81
7622 -81 -22 10 13 -21 -26 17 -53 0 1 -62 18 -64 36 69 13 -52 17 45 23 -69 -36 46 36 16 34 121 6 50 1 -41 -24
7653 -24 66 136 -97 54 -115 -6 65 127 -26 55 103 -21 -71 -210 23 77 -66 -22 -39 46 -9 -144 -90 48 81
7678 81 23 -42 -52 -92 60 -38 18 -6 -105 8 92 -5 -11 -31 1 27 38 -38 51 -1 -52 -34 83 -4 -13 -114 78 78 -67
7707 -67 -113 8 -17 58 -57 -7 -28 87 -72 -38 5 24 18 -23 100 47 -33 35 -4 20 90 8 54 -67 1 14 -20 48
7735 48 53 -74 2 -39 -24 53 108 19 152 -51 -39 -26 -50 -88 -58 -78 25 -45 45 39 9 -2 69 1 -71 -53 -61 46 45 -16
7765 -16 -23 -53 118 -1 -56 22 53 -44 -35 -6 22 40 36 47 6 -5 -58 8 13 34 -78 8 -53 -35 -156 -68 -56 11 -14 53
7795 53 24 82 -39 -45 -14 -22 -18 81 10 24 -16 -70 104 48 17 -79 21 -76 39 17 -71 0 -61 -39 18 10 13 40 7 -74 13
7826 13 -26 -10 28 -2 39 -38 -24 -53 75 -29 47 -15 -25 -45 16 -285 44 -101 241 -405 431 150 -342 -180 -144
7851 -144 -131 -133 -81 150 -184 -255 10 -252 150 86 58 221 166 51 -72 141 -13 132 -115 225 151 -245 100
7874 100 185 205 -196 -14 -110 0 -72 71 86 -148 -37 18 -41 19 16 5 -6 -48 15 -23 38 -7 35 95 -6 -36 12
7901 12 24 -77 -1 -27 11 -65 41 -98 -42 -74 4 47 -84 5 58 18 -39 -31 24 50 -1 99 24 85 28 63 -15 22
7929 22 52 -121 71 -45 -45 -14 52 -54 -29 7 30 92 -9 29 -109 -138 -56 -6 -2 48 -53 -71 -142 19 -57 -87 -75
7956 -75 36 108 -24 -29 -174 103 -14 -160 -164 99 -43 -120 17 22 -87 131 -13 35 -290 -188 -240 35 -286 -181
7980 -181 -164 -139 -45 -47 -184 -44 -196 316 -323 -156 213 -96 -237 104 327 -23 -139 239 -113 127 -197 41
8002 41 201 -295 190 108 16 58 -659 156 -64 159 -53 294 -278 -683 105 -59 -470 51 -276 -205 128 103
8024 103 335 357 6 403 -475 -465 5 -216 307 -82 -417 -251 -835 -514 41 241 -265 -120 -208 -122 279
8045 279 -65 190 -358 228 373 109 191 -118 92 123 -41 19 -9 99 18 -44 -37 50 47 85 1 113 -129 97
8069 97 -15 -125 64 4 -31 -11 -16 23 -102 21 33 -15 -41 53 30 -60 38 83 -64 29 -30 -65 -54 -69 -46 -61 19 43
8097 43 46 100 22 63 43 10 3 -23 -22 9 68 3 28 -42 -69 30 -104 -90 -32 -23 70 93 17 27 -56 19 -8 131 -164 76
8127 76 -161 181 86 -78 167 -124 13 -207 39 49 83 -301 148 228 -55 -154 -61 -59 -113 52 37 37 -131 34
8151 34 143 40 -219 -70 57 -127 -40 333 -97 -11 24 -59 -51 -64 21 -9 -4 -124 -102 173 -104 13 15 -16 -56 -39
8177 -39 -5 -37 118 -28 -14 -163 76 77 37 34 26 -49 -15 -17
8191a7
##END NTUPLES=NMR FID
##END=
