##TITLE=1H_ABDE3105
 CDCl3, 8 sc, 
 1.06.2021
##JCAMPDX= 6.0         $$ Bruker NMR JCAMP-DX V2.0
##DATA TYPE= NMR FID
##DATA CLASS= NTUPLES
##ORIGIN= UXNMR, Bruker Analytische Messtechnik GmbH
##OWNER= root
$$ XWIN-NMR		Version 3.5
$$ Tue Jun  1 11:48:29 2021 Russian Standard Time (UT+4h)  she@DPX200
##.OBSERVE FREQUENCY= 200.131506
##.OBSERVE NUCLEUS= ^1H
##.DELAY= (6, 6)
##.ACQUISITION MODE= SIMULTANEOUS
##.ACQUISITION SCHEME= undefined
##.AVERAGES= 8
##.DIGITISER RES= 18
##SPECTROMETER/DATA SYSTEM= spect
##.PULSE SEQUENCE= zg30
##.SOLVENT NAME= CDCl3
##.SHIFT REFERENCE= (INTERNAL, CDCl3, 0, 15.7039)
##AUDIT TRAIL= $$ (NUMBER, WHEN, WHO, WHERE, WHAT)
$$ ##TITLE= Audit trail, XWIN-NMR		Version 3.5
$$ ##JCAMPDX= 5.01
$$ ##ORIGIN= Bruker BioSpin GmbH
$$ ##OWNER= she
$$ F:/spectra/data/she/nmr/H-F/1/audita.txt
$$ ##AUDIT TRAIL=  $$ (NUMBER, WHEN, WHO, WHERE, WHAT)
(   1,<2021-06-01 11:47:30.84 +0400>,<she>,<DPX200>,
      <created by zg, POWCHK disabled, PULCHK disabled
       configuration hash MD5:
       00 E9 B6 7A A2 85 ED C7 34 08 36 98 17 FE 4E 26
       data hash MD5: 16K
       2B 11 E0 FD DE 77 E4 37 FA 5A F5 C0 47 99 97 19>)
$$ ##END=
$$ 
$$ hash MD5
$$ B4 29 5A EA 8A 34 DA 7B 2B 3C 28 E3 2A CD 7D 6E
##$RELAX= 
##$RELAX= 
##$RELAX= 
##$RELAX= 
##$RELAX= 
##$RELAX= 
$$ Bruker specific parameters
$$ --------------------------
##$DU= <F:/spectra>
##$EXPNO= 1
##$NAME= <H-F>
##$PROCNO= 1
##$TYPE= <nmr>
##$USER= <she>
##$AMP= (0..31)
100 100 100 100 100 100 100 100 100 100 100 100 100 100 100 100 100 100 
100 100 100 100 100 100 100 100 100 100 100 100 100 100 
##$AQSEQ= 0
##$AQ_mod= 1
##$AUNM= <au_zg>
##$AUTOPOS= <>
##$BF1= 200.13
##$BF2= 200.13
##$BF3= 200.13
##$BF4= 200.13
##$BF5= 200.13
##$BF6= 200.13
##$BF7= 200.13
##$BF8= 200.13
##$BYTORDA= 1
##$CFDGTYP= 0
##$CFRGTYP= 5
##$CHEMSTR= <none>
##$CNST= (0..31)
1 1 145 1 1 1 1 1 1 1 1 1 1 1 1 1 1 1 1 1 1 1 1 1 1 1 1 1 1 1 1 1 
##$CPDPRG= <>
##$CPDPRG1= <>
##$CPDPRG2= <>
##$CPDPRG3= <>
##$CPDPRG4= <mlev>
##$CPDPRG5= <mlev>
##$CPDPRG6= <mlev>
##$CPDPRG7= <mlev>
##$CPDPRG8= <mlev>
##$CPDPRGB= <>
##$CPDPRGT= <>
##$D= (0..31)
0 1.2 0 0 0 0 0 0 0 0.06 0 0.03 0 0 0 0 0.0002 0 0 0 0 0 0 0 0 0 0 0 0 
0 0 0 
##$DATE= 1622533650
##$DBL= (0..7)
120 120 120 120 120 120 120 120 
##$DBP= (0..7)
150 150 150 150 150 150 150 150 
##$DBP07= 0
##$DBPNAM0= <>
##$DBPNAM1= <>
##$DBPNAM2= <>
##$DBPNAM3= <>
##$DBPNAM4= <>
##$DBPNAM5= <>
##$DBPNAM6= <>
##$DBPNAM7= <>
##$DBPOAL= (0..7)
0.5 0.5 0.5 0.5 0.5 0.5 0.5 0.5 
##$DBPOFFS= (0..7)
0 0 0 0 0 0 0 0 
##$DE= 6
##$DECBNUC= <off>
##$DECIM= 32
##$DECNUC= <off>
##$DECSTAT= 4
##$DIGMOD= 1
##$DIGTYP= 9
##$DL= (0..7)
0 120 120 120 120 120 120 120 
##$DP= (0..7)
150 150 150 150 150 150 150 150 
##$DP07= 0
##$DPNAME0= <>
##$DPNAME1= <>
##$DPNAME2= <>
##$DPNAME3= <>
##$DPNAME4= <>
##$DPNAME5= <>
##$DPNAME6= <>
##$DPNAME7= <>
##$DPOAL= (0..7)
0.5 0.5 0.5 0.5 0.5 0.5 0.5 0.5 
##$DPOFFS= (0..7)
0 0 0 0 0 0 0 0 
##$DQDMODE= 0
##$DR= 18
##$DS= 0
##$DSLIST= <SSSSSSSSSSSSSSS>
$$ [...]
##$SUBNAM2= <"">
##$SUBNAM3= <"">
##$SUBNAM4= <"">
##$SUBNAM5= <"">
##$SUBNAM6= <"">
##$SUBNAM7= <"">
##$SUBNAM8= <"">
##$SUBNAM9= <"">
##$SW= 16.9725357007746
##$SWIBOX= (0..15)
0 0 2 0 0 0 0 0 0 0 0 0 0 0 0 0 
##$SW_h= 3396.73913043478
##$TD= 16384
##$TD0= 1
##$TE= 0
##$TE2= 300
##$TE3= 300
##$TEG= 300
##$TL= (0..7)
0 120 120 120 120 120 120 120 
##$TP= (0..7)
150 150 150 150 150 150 150 150 
##$TP07= 0
##$TPNAME0= <>
##$TPNAME1= <>
##$TPNAME2= <>
##$TPNAME3= <>
##$TPNAME4= <>
##$TPNAME5= <>
##$TPNAME6= <>
##$TPNAME7= <>
##$TPOAL= (0..7)
0.5 0.5 0.5 0.5 0.5 0.5 0.5 0.5 
##$TPOFFS= (0..7)
0 0 0 0 0 0 0 0 
##$TUNHIN= 0
##$TUNHOUT= 0
##$TUNXOUT= 0
##$USERA1= <user>
##$USERA2= <user>
##$USERA3= <user>
##$USERA4= <user>
##$USERA5= <user>
##$V9= 5
##$VALIST= <valist>
##$VCLIST= <CCCCCCCCCCCCCCC>
##$VD= 0
##$VDLIST= <DDDDDDDDDDDDDDD>
##$VPLIST= <PPPPPPPPPPPPPPP>
##$VTLIST= <TTTTTTTTTTTTTTT>
##$WBST= 1024
##$WBSW= 4
##$XGAIN= (0..3)
0 0 0 0 
##$XL= 0
##$YL= 0
##$YMAX_a= 231571
##$YMIN_a= -246158
##$ZGOPTNS= <>
##$ZL1= 120
##$ZL2= 120
##$ZL3= 120
##$ZL4= 120
##$ABSF1= 10
##$ABSF2= 0
##$ABSG= 5
##$ABSL= 3
##$ALPHA= 0
##$AQORDER= 0
##$ASSFAC= 0
##$ASSFACI= 0
##$ASSFACX= 0
##$ASSWID= 0
##$AUNMP= <proc_1d>
##$AZFE= 0.1
##$AZFW= 0.1
##$BCFW= 1
##$BC_mod= 2
##$BYTORDP= 1
##$COROFFS= 0
##$CY= 11.3945322036743
##$DATMOD= 1
##$DC= 2
##$DFILT= <>
##$DTYPP= 0
##$F1P= 15.9154993809931
##$F2P= -4.1035820241983
##$FCOR= 0.5
##$FTSIZE= 0
##$FT_mod= 4
##$GAMMA= 1
##$GB= 0.15
##$INTBC= 1
##$INTSCL= 1
##$ISEN= 128
##$LB= 0.24
##$LEV0= 0
##$LPBIN= 0
##$MAXI= 10000
##$MC2= 0
##$MEAN= 0
##$ME_mod= 0
##$MI= 1.114404
##$NCOEF= 0
##$NC_proc= 0
##$NLEV= 6
##$NOISF1= 3.799351
##$NOISF2= 2.8
##$NSP= 1
##$NTH_PI= 0
##$NZP= 0
##$OFFSET= 15.70392
##$PC= 1
##$PHC0= -11281.29
##$PHC1= 15.20099
##$PH_mod= 1
##$PKNL= yes
##$PPARMOD= 0
##$PSCAL= 0
##$PSIGN= 0
##$REVERSE= no
##$SF= 200.130013532006
##$SI= 16384
##$SIGF1= 3
##$SIGF2= 2
##$SINO= 400
##$SIOLD= 16384
##$SREGLST= <1H.CDCl3>
##$SSB= 0
##$STSI= 0
##$STSR= 0
##$SW_p= 3612.71676300578
##$SYMM= 0
##$S_DEV= 0
##$TDeff= 0
##$TDoff= 0
##$TI= <>
##$TILT= no
##$TM1= 0
##$TM2= 0
##$TOPLEV= 0
##$USERP1= <user>
##$USERP2= <user>
##$USERP3= <user>
##$USERP4= <user>
##$USERP5= <user>
##$WDW= 1
##$XDIM= 8192
##$YMAX_p= 0
##$YMIN_p= 0
$$ End of Bruker specific parameters
$$ ---------------------------------
##NTUPLES= NMR FID
##VAR_NAME=  TIME,          FID/REAL,        FID/IMAG
##SYMBOL=    X,             R,               I
##VAR_TYPE=  INDEPENDENT,   DEPENDENT,       DEPENDENT
##VAR_FORM=  AFFN,          ASDF,            ASDF
##VAR_DIM=   8192,          8192,            8192
##UNITS=     SECONDS,       ARBITRARY UNITS, ARBITRARY UNITS
##FACTOR=    0.0002944,     1,               1
##FIRST=     0,             0,               0
##LAST=      2.4114304,     0,               0
##MIN=       0,             -246158,         0
##MAX=       2.4114304,     231571,          0
$$ Real data points
##PAGE= N=1
##DATA TABLE= (X++(R..R)), XYDATA
0@%%%%%%%%%%%%%qJ6j6J6j6K4l2L2m0M8n6O4p2Q8j01J14j30J48j67J88k11K36
35A25k65K97l32L70m10M54n04N58o16O78p49Q28r08R97j097J208j333J471j625
54h53J798j996K225k491K804l182L645m223M969n971P379r484J2920j9349L4838
69B3029j26929j01052L78237k65995J33527R3683l80658L25697J8393k29707K87926
80A56151k59203q085L42708l17564N4551Q9256k34042L25945p2483k48816K68776
91I7194j56166J5733K26297l08010Q9913J30659j87177J97376j07860j57547K81040
102A21452j13833m8289J16609k00879J32667R9845j78994J12231n8119n8424J93033
113A17299j29539n2149J06290q7116Q8131O218j44514J06888J0026l6370P7901
$$ y = [0, 0, 0, 0, 0, 0, 0, 0, 0, 0, 0, 0, 0, 0, -8, 8, -8, 8, -8, 16, -16, 16, -24, 24, -32, 32, -40, 48, -53, 61, -69, 79, -88, 100, -111, 125, -140, 157, -175, 195, -215, 239, -265, 293, -323, 355, -394, 434, -474, 523, -574, 634, -699, 772, -853, 945, -1051, 1174, -1317, 1487, -1695, 1950, -2273, 2696, -3275, 4104, -5380, 7540, -11809, 23029, -103900, -204952, 173285, -92710, 40817, 134500, -246158, 79539, 97932, -131775, 156151, -103052, -111137, 231571, -85993, -31442, 57814, -176228, 149717, 77234, -171582, 97194, -58972, -43239, 183058, -124952, -35039, 95620, -91557, 105819, -2041, -159588, 121452, 7619, -40670, 75939, -124940, 7727, 107572, -71422, 40809, -17310, -75734, 117299, -12240, -64389, 41901, -45215, 42916, 49134, -95380, 11508, 21534, -14836, 63065]
124F3065r6812j5927R3668l9303P933j3069m6349P2586M235m9713Q836n018K0522
137D654K6439k6290k7484N588K7557J0517j0504k6296j1222M6855k963l4981K0544
150B414j9004J6698L7309n9014J1169J8292k9787O4738l5404n8027P8197l3813
162f232l244M9595q5854M3482M0880p8186O6224k3690n2282J03802n8028k4098
174b7631O4425q3108N8325L3130j02578Q3406j6476n7099J05288p5860j6340Q9293
186E4775r3515M7443L1588j06197R7104p468p2286R6675o6999j3918R0152r4499
198c7145L6613L9752r4084Q6143j0118p2312R3481n3174j5031P8235r2304L4269
210e675M7140r0466P4241m496p1604R0454m2584k7766P6192p5652K1232N1167
$$ y = [63065, -33747, -49674, 43994, 4691, 12624, -445, -46794, 25792, 30027, -19686, -10850, -15868, 4654, 31093, 4803, -22681, -17093, 10464, 20981, 10477, -15819, -27041, 19814, 16851, -18130, 2414, -16590, 108, 37417, -21597, -10428, 7864, -21923, 42815, 7411, -50616, 27581, -6232, -9476, 40119, -45735, -2253, 38627, -39559, 26665, 2975, -49307, 54495, -3533, -27631, 36794, -46314, 12011, 45141, -57437, 25969, 9493, -47606, 57682, -18178, -34518, 54775, -38740, 8703, 40291, -65906, 31198, 23730, -48556, 48119, -18880, -32798, 57354, -37145, -532, 39220, -54864, 31279, 21161, -51151, 42330, -10844, -25875, 52360, -39944, -5675, 41465, -49001, 25240, 20744, -50860, 39594, -2990, -30756, 45436, -30216, -8984, 42183]
222D2183q3680N2925J0626o3349P2290k9815l1847O8083n8014Q929M9112p2109
234c4666L9273K0757o1346N7028j4083l7458O2192m2217q113N1795n7173J9966
246d045L1726n7398L9669M106m2327N0920k2523k2766N0456m0405M17L9014m7965
259b1121K2281J6903m3518L9885p559l1208M9599k9977j3871M6323m3667R901
271f029L1060m8811L1268Q485m4254M6978j3778k8686M9759l3676o785M0195m5364
284a9638J9964K1068m7419L9364k866l7222M9059k4946j5523M4846m3357J0610
296f060K9564m9390L4355Q176m4679M7709j6675k7129N0569l7019k074L9823m9327
309b2157K1501K1341m7555L9678k384l4565M6023k7074j1069M2073m3253J3764
$$ y = [42183, -41497, 11428, 22054, -41295, 30995, 1180, -30667, 37416, -20598, -11669, 37443, -34666, 4607, 25364, -35982, 21046, 6963, -30495, 31697, -10520, -18633, 33162, -24011, -4045, 27681, -29717, 9952, 14058, -28269, 22651, 128, -22638, 27818, -12587, -12170, 26844, -21121, 1160, 18063, -25455, 14430, 6871, -24337, 25262, -4715, -18586, 27737, -15930, -6029, 25031, -23780, 7488, 15973, -28281, 18697, 4919, -23767, 25992, -7684, -14469, 25726, -19638, 326, 21394, -26025, 13339, 10473, -26749, 22310, -2636, -18159, 26687, -16670, -6060, 23504, -25886, 8469, 16645, -28034, 19675, 3000, -24129, 26440, -10579, -12653, 27170, -22157, -656, 20685, -26870, 12808, 10424, -24141, 21882, -5192, -16261, 25812, -17441, -3677]
321c677K6464m8707L3937N012l9808M7306j9605k1853M7405l9643K191L7424m8093
334b1647K4002J7027m5825M0175p044l0417M7687k9425r971M1097m2828J3385
346c784K5748m4566L2384K027l5958M3692k1192j7012M4248l8193M494L1601m5810
359b2321K6494J3045m1863M1103j1218k8189M6018k9926p223L8168m0871J5339
371a444K0423m2877L4344p71l1619M2953k4388j3731M0672l7594R134K5769m3663
384b2792L0019N850l7642M1484j6088j9428M2645l4438k52L1807m0370K2572J3297
397A6664m0467L5368n834k4737L8117k5365n705L2563l3718J2275J4880l4256
409b0215L0563r49k7257L2215j8140q244L2403l0812M435K1656l0450K0135N415
$$ y = [-3677, 22787, -25920, 8017, 13029, -26779, 20527, 922, -20931, 26474, -13169, -10978, 26446, -21647, 2355, 19382, -26443, 13732, 6688, -23729, 23958, -5467, -15438, 25659, -17169, -3784, 21964, -22602, 9782, 11809, -24149, 19543, -1649, -18661, 25587, -12606, -8112, 23489, -22321, 4173, 17218, -24645, 16458, 5240, -22949, 23069, -6857, -14080, 24088, -16783, -1444, 18979, -23898, 10446, 9675, -21944, 21009, -3379, -17110, 23562, -14032, -4898, 20871, -22792, 7227, 13077, -24565, 16919, 831, -18597, 24048, -10390, -10642, 21165, -19205, 3367, 16664, -23803, 11565, 5731, -19006, 19111, -6254, -11959, 20604, -13114, -839, 14041, -20215, 10348, 9399, -17858, 14357, -3783, -12027, 20376, -10436, -6001, 15655, -14795, 5340, 10755]
422A0755k8810K7551n471j5037K4673k0840j441K3839k3008P392R440k2896K0391
435F538J290j9512J9064q334o466K1187j9293k395J8317j7079Q967O553k3073
448a4236J7314N024j7584J7527r285j0737K6163j5347p462J7842j8566J0186J2900
461A3739k7575J4062N661j6461K4378j4790j5026K9497j7746J249J7152l2708
473a8568J9820J4746l1008K4060q986j8357L9977k3966j0336K7887l1322J9267
485C214J6919m3060K8877J188k3699L8725k8731j1389L9903l3449J2386J4945
497A5829m2615L7661J905l1844L7259k7297n292M3098m2794R003K0865l8307L7354
510A4825k661l7446M0577j7792p274L4194m2364J1307K5238l4330K7053o820k7813
$$ y = [10755, -18055, 9496, 4025, -11012, 13661, -7179, -8620, 15219, -7789, -397, 9043, -13853, 6538, 7828, -11684, 7380, -954, -7420, 13767, -5526, -7921, 10396, -6683, 2284, 8837, -14236, 3078, 8102, -9482, 8045, -1240, -11977, 14186, -1161, -8623, 9219, -9347, 839, 13739, -13836, 226, 5887, -10574, 13804, -986, -16012, 13485, -4261, -3012, 14140, -18568, 1252, 15998, -15010, 9050, 64, -18293, 21684, -2282, -12618, 15269, -16053, 3214, 20133, -22927, 5950, 7138, -16561, 22164, -6567, -17956, 21947, -11502, 884, 15829, -26786, 10875, 12780, -19064, 18195, -9102, -14394, 28704, -14090, -5087, 15778, -22529, 14825, 12164, -25282, 15295, -2497, -9771, 24423, -17941, -6634, 18604, -15726, 11327, 4507, -23306]
523b3306M2089j8497j1010K6968l3616J7248J9746l6626K1880j989j7880L4185
535A9192k1779j1150K6525k2238J2447R362l0042K1317K528j3846J8598j7696
547f782k002K1040j6177M453K356j4205J8493k233j1281R523q007M247R444j3113
561d244J208L816j791N893n049l947L347K348K313n387r31J939L19N571o902l389
577d886Q071m809M633M01j2209J2259m36o861J0864j3277K486J4206j6709P944
591A677J787j4575K1539q881j1244K0161j8321O208J5730k7940J6148N385k1036
604a3362K6248j3766j2653K8928k2838M412J6486l0106K1873M125k4942K8403
616A2808j5669r615L1485k9279N684J9221l1953K4829J931k8443L2560j4654j1247
$$ y = [-23306, 18783, 286, -10724, 16244, -17372, -124, 19622, -17004, 4876, 2887, -14993, 19192, -2587, -13737, 12788, -9450, 2997, 12359, -17683, 3634, 6162, -7684, 10914, -6782, -8784, 12256, -3921, 532, 2888, -11317, 7176, 4943, -6338, 3185, -4822, -575, 8869, -4244, -3036, 780, -1011, 4882, -167, -4114, -767, 1581, 3894, -1493, -2424, -485, -166, 5405, -1497, -4886, 3185, -1624, 3009, 3410, -8799, 3460, 3024, -3837, 7027, -6250, -3764, 10442, -6267, 1677, 3464, -11111, 10428, 1547, -9697, 10464, -7857, -1649, 14081, -13859, 2289, 7674, -13362, 12886, -880, -13533, 15395, -7443, -3031, 13455, -16651, 5222, 9347, -15595, 12808, -2861, -12476, 19009, -10270, -4586, 14635, -17318, 7511, 9442, -19001, 13559, -1095, -12342]
629a2342L1373l0755O487K1777l2857K2909J795k6980L3049j4689j2347K9777
641A7197k8428P659J9828l2579K2123J946k4628L1689j5593j2153K9906k6575
653i608N792J9324l0976J9739M830k4174K6559j1301j1878K6317k1306K162J7202
666A2682k4987J5581N030k1412K1967p586j1516K2279j6898o10J6842k0380R750
679G42P239j8943J6641k400j2732J8089j0519m554J5917j5149L297J0231j5826
692g967R997K855j3116J3314l940p720J3589r668j416J1463j3039N125O573j3454
706g404J0326P52j1340J3257n015o925J3776j0415q37J1423j3321N515O240j3474
720g442J0868k12j0624J3828o969m919J3501j2363K151R464j4246Q872K989j2914
$$ y = [-12342, 19031, -11724, -5237, 16540, -16317, 6592, 8387, -18593, 14456, -233, -12580, 17197, -11231, -3572, 16256, -16323, 5800, 7746, -16882, 14807, -786, -12939, 16967, -9608, -3816, 15508, -15468, 4271, 9101, -15073, 11486, 185, -11693, 14624, -6682, -4520, 12682, -12305, 3276, 8306, -13106, 8861, 1275, -10241, 12038, -4860, -5470, 11372, -9008, 742, 7981, -10962, 5679, 3279, -9453, 8636, -1883, -6437, 9480, -5669, -2372, 7859, -7967, 2030, 4885, -8231, 5083, 1143, -6577, 7012, -2656, -4072, 7391, -5648, -523, 6050, -7404, 2922, 3674, -7666, 5591, 576, -6349, 7427, -2988, -3825, 7598, -5723, -208, 6032, -7442, 3426, 3214, -7410, 6418, -551, -5470, 8031, -4332, -2181, 7283, -6963, 1909, 4898, -8016]
734h016J3608m517q005J5060j1285p45J2469j5218O710O785j5355J2643o94j1740
748h300J5395q042m744J4002j3231L184Q797j4521J0086J541j2411J4624o355
761B5o513J4692j2443J061J1152j5130Q068M831j4116J3087k657r512J4647r341
775b149k550J2437j3284M557P326j3724J0226O47j0873J3240o208m989J2517j1002
789c829J686Q702j2891P901K850j1678J2129l763p357J3108r124j434J0781j2117
803e036M539O195j2172R313Or025J1502n812l880J0677r966K093P256j1422P665
818A933J965r971J0209l278n792J0557p670r02Q662r964M007M773j0083P984K
833B432p846R713m338m238R416p442j3P186q930M303L316q371P222j012n890Q613
$$ y = [-8016, 5592, 1075, -6930, 8130, -3155, -3900, 8569, -6649, 61, 6846, -8509, 4134, 3440, -8300, 7095, -947, -5691, 8311, -4920, -1736, 7061, -7460, 2626, 4167, -8244, 6380, 25, -6488, 8204, -4239, -3178, 7974, -7156, 912, 5743, -8373, 4714, 2057, -7455, 7192, -2149, -4699, 7738, -5546, -989, 6337, -7387, 2839, 3486, -7387, 5853, -355, -5344, 7173, -3829, -2143, 6559, -6332, 1569, 4419, -7259, 4870, 1107, -6250, 6858, -2266, -3700, 7081, -5036, -497, 5698, -6474, 2839, 2845, -6180, 5322, -490, -4370, 6307, -3659, -1566, 5690, -5732, 1933, 3898, -6073, 4136, 858, -4934, 5623, -2047, -2949, 5713, -4251, -244, 4529, -5554, 2430, 2432, -5414, 4299, -39, -4277, 5139, -2303, -2316, 4870, -4060, 243, 3559, -4812, 2410, 1398, -4492, 4121]
849D121m997k489Q376q200J835O176r798O043K437r059Q869k058o497J0352o400
864a289k235R247r709L287N802j0793P836Q85r033J1031n104m977J1608r826J224
879b046Q465j2560P590L224j1797J2143l988p601J4273j0464j154J1797j4253
892f371O762O052j4637J2356j554j0118J5208r815k952J3581j4625N992O808j5673
906h986J3467j201j1755J6429j0197l562J5557j6140N194Q583j6632J3615m64
919C908j3242J6980r152m371J5552j6202M731R650j6434J2507l41j2855J6765
932G496q241m949J4311j4890M930R243j6071J1419l8j1519J5962q284n522J4017
946G864j2791L820Q358j4843R754J410r966J2413o954m286J1945j0121K569N929
$$ y = [4121, -876, -3365, 5011, -3189, -1354, 4822, -4976, 1067, 3504, -5555, 3314, 1256, -5241, 5111, -1289, -3524, 5723, -3986, -699, 5103, -5690, 2146, 3031, -6002, 5029, -75, -5052, 6556, -3270, -2046, 6419, -6141, 1449, 4673, -7124, 5019, 1031, -6570, 7703, -2761, -3915, 7882, -6371, 391, 6443, -8194, 4162, 2608, -7510, 7698, -2117, -5069, 8512, -6113, -121, 6687, -8986, 4481, 3280, -8475, 7954, -2243, -5805, 9752, -6388, -1194, 7389, -9243, 4372, 3908, -9334, 7646, -1506, -5877, 9675, -6527, -1796, 7854, -8580, 3927, 3586, -9269, 7496, -745, -5694, 8617, -6273, -1343, 7900, -8171, 3248, 3210, -8309, 7653, -631, -6153, 7864, -4927, -1107, 7251, -7592, 2162, 3572, -6394, 6019, -935, -5221, 6724, -3397, -828, 5101]
960E101j1571R008R18q734R466n181k589R490q438R87N102p650O209M96p059O696
976B251k013k132N316n435K30M423l693J504K50l155L508J53k007R36r93M29J985
993A557j387j673J434K61k80J520k444j055M255k243p38K485m673L329K911o199
1009b940L721l00l633P411m808k842P026o335L245L549r847P385Q98o764R190
1024D956o855k492J0977r862K743M999j1624J0945j35j0424J2189p209k408J2934
1038H734j3850L164Q129j3130J1293j078j1785J4918p046l570J2359j4689N315
1051a236Q860j5102J1273j558j0885J6939r084m849J3447j4165O070Q207j6658
1064h741J1803j96j0467J5738j0100m153J4289j3458N085O704j5368J2364n1j0482
$$ y = [5101, -6470, 2538, 3456, -5278, 4188, -993, -3582, 5908, -2530, -1543, 3559, -4091, 2118, 2614, -4445, 2251, 238, -1894, 3422, -2013, -1783, 2640, -1053, 451, 701, -2454, 1054, 1207, -800, 136, -857, -428, 1557, 170, -1503, -69, 192, -88, 1432, -1012, -2067, 2188, -55, -793, 1692, -2981, 348, 3259, -2940, 781, 481, -3152, 4259, -549, -3391, 3635, -2700, 545, 4094, -5753, 1632, 2530, -4234, 4956, -1899, -4391, 6586, -3276, -533, 4466, -7158, 3787, 3652, -6772, 5417, -1792, -4200, 8734, -5116, -1952, 6177, -6953, 4340, 3262, -8523, 6395, -651, -4221, 8138, -6551, -1236, 7624, -7478, 3795, 2237, -8648, 8291, -793, -5642, 7805, -6360, -290, 7917, -8741, 3062, 2866, -7601, 8137, -1963, -6116, 8173, -5285, -200, 6504, -8864, 3500, 3449, -7033]
1078g033J3746r189k310J2999j3232M333O035j2832J1658j288r983J2779p225
1091a542k057J0571j1821L832N996j0338Q371j279p344J0415n580j900P406q665
1105c935L790M275q230N959p08m872P545m317j943N591n331K240K583n500L662
1120H09L69l036L786k147j349L346k256J22J283j899J102O43j292M64K42n70N78
1137A95J88j049O58N06j253J191n4j805K547j111j313K909k582J43K893l849J795
1154IJ610m006L841q41k966M798l281n28M225n178K238K425n402M711o82m007
1170c034O017l830j000N232n959K464K810o207N369n77m800O889m101j598O137
1185C812o348K060L626o580M956M5m986O489l518j849N907n941J843L606o500
$$ y = [-7033, 6713, -2476, -4786, 8213, -5019, -686, 5349, -7483, 4175, 2887, -7096, 5683, -1542, -3599, 6972, -4849, -1017, 4979, -5359, 3012, 1733, -5611, 4804, -776, -2676, 4730, -3935, -145, 4130, -4100, 1859, 1151, -3721, 3824, -493, -2436, 3155, -2176, 64, 2647, -2853, 809, 1178, -1858, 1928, -219, -1568, 1778, -478, -356, 927, -972, 130, 773, -519, -55, 187, -383, 195, 383, -666, -8, 498, -755, 436, 382, -1423, 1124, 13, -1300, 1609, -973, -830, 2063, -1786, 9, 1619, -2387, 1454, 613, -2353, 2445, -836, -1364, 2861, -2317, -79, 2346, -3056, 1655, 973, -3034, 2983, -847, -1847, 3385, -2574, -110, 2700, -3507, 1862, 1285, -3515, 3374, -727, -2325, 3812, -2536, -476, 3150, -3430, 1526, 1571, -3415, 3074, -444, -2293, 3614, -2327, -484, 3122, -3378]
1200c378M722M31n277O343k937k573O107n227P71M114o018L597J334n191N264
1215B082j779k936N524m121k26M339n207K401K074n020M287n35l535N054l069
1230f67j093M616m739J387K917n141L657O71m651N089j872k453M870l776J05L563
1246B483m536K239J592m382M202r04l032M723k999q26M078m391J481K523m694
1261b443L515J73l799M667k209j757M368l953O75L233m684K746J113m220M317
1276A742j311k568M420l169k56L456m143J957J631m148L692o72k951M485k768
1291f03r37L907l929J098K459m211K901N11l487L913j619j746L796l090J39K893
1307A995l817K025J298l691L342n65k598L860k275r11L345l417J080K179l883
$$ y = [-3378, 1344, 1775, -3502, 2841, -96, -2669, 3438, -1789, -1018, 3096, -2922, 675, 2009, -3182, 2082, 303, -2633, 2891, -1230, -1456, 2883, -2324, 77, 2151, -2869, 1418, 883, -2652, 2402, -667, -1760, 2856, -1883, -496, 2421, -2720, 937, 1608, -3043, 2046, 174, -2279, 2591, -1185, -1080, 2483, -2053, 186, 1778, -2604, 1598, 694, -2338, 2385, -614, -1440, 2638, -1753, -272, 2251, -2443, 1072, 1245, -2554, 2113, -96, -1853, 2515, -1438, -763, 2470, -2214, 532, 1645, -2575, 1742, 431, -2137, 2283, -886, -1142, 2314, -1829, 128, 1759, -2389, 1303, 631, -2320, 2165, -603, -1540, 2367, -1562, -464, 1995, -2216, 685, 1196, -2291, 1622, 3, -1743, 2053, -1037, -898, 1995, -1822, 203, 1501, -2190, 1152, 587, -2011, 1849, -426, -1337, 2008, -1409, -329, 1850, -2033]
1322b033K765K97l157L803j556j939L945l017n9L183l989J863J559l744L323o26
1338F18k648M045k457q56L578l954J527K263m496L323J38l362M343k189j698M181
1354B356l582O70K780m499K845R53l816M013j633k147M481l336j29L238m220K395
1370C69J310m019L581r03k198M095l153m01L452l761J733J480m011L396j52k667
1386a849L474k261o33L317l123O97J644l000K669k4k676K789j151o92K513k639
1402i45J91K061k190J315K32k200K326k29j278J472j258r2J995j821mR80j251
1419f96J234K61j830J011M92p54R95r48o71J673n41m66O84j285P39J339j903M37
1437b29O22j352K045o15j982K208o37m89J738k490M07K225k341J380j22k324L402
$$ y = [-2033, 732, 1029, -2128, 1675, 119, -1820, 2125, -892, -951, 2232, -1757, 106, 1665, -2079, 1244, 618, -2030, 2015, -442, -1298, 2280, -1674, -147, 2116, -2380, 943, 1081, -2281, 2062, -127, -1825, 2356, -1226, -556, 2224, -2275, 570, 1523, -2293, 1720, 87, -2060, 2421, -915, -1044, 2194, -2026, 369, 1679, -2340, 1241, 338, -1860, 2235, -918, -1319, 2133, -1628, 105, 1585, -2426, 970, 818, -1849, 1625, -636, -1269, 2048, -1075, -378, 1266, -1734, 935, 911, -1765, 1024, -127, -819, 1694, -945, -754, 1307, -883, 432, 664, -1536, 790, 561, -717, 755, -503, -595, 1400, -421, -425, 555, -696, 538, 799, -1031, -20, 472, -282, 713, -235, -906, 767, 226, -240, 444, -841, -102, 1237, -666, -229, 393, -959, 1086, 471, -1511, 697, 60, -429, 1309, -1181, -774, 1451, -890, 490, 368, -1956, 1446]
1454A446r18j729K420k445N77K882l901J292J441k680L354j185k812L951k025
1469c32k20K828m640K093K346m032L163r10k587M862k725j168L363l994K152K117
1485B316m702L242kk698M480l198j616M234l227J268K007m806L746P52l779L688
1501A705k541p14M335m102P81K373l967L448J20l873L831j478r89L577l937M86
1517i45K878l599K485j5l210L957r09j890K967l142Q80K882l990J761P35k559
1533a714L330j367j828K721j812L96J816k902J296Q73j680J551p87j466K902j268
1549F1o83J307j310K10J246j249M79N49j051R66j19q41J264p40m10J155j434N54
1567d6J273j607J74Q24j072O36L48j311J088j29o46J147r84k03J466j472K95R08
$$ y = [1446, 528, -1201, 1219, -1226, -649, 2233, -1668, -376, 1065, -1615, 1739, 554, -2258, 1693, -332, -552, 2276, -2364, -271, 2075, -1957, 1206, 296, -2291, 2571, -154, -1322, 2041, -1953, 199, 2316, -2386, 856, 854, -1844, 2636, -562, -2178, 2056, -1171, 97, 2104, -2702, 1044, 1796, -1983, 1705, -836, -1550, 2785, -1317, -536, 1837, -2130, 1318, 1438, -2435, 1396, -82, -1071, 2506, -1431, -945, 1933, -1666, 819, 804, -2406, 1551, 642, -1248, 1719, -1423, -543, 2339, -1651, 110, 845, -1714, 1616, 249, -1579, 1142, -670, -274, 1542, -1360, -64, 809, -871, 680, -107, -1573, 1329, 61, -622, 685, -625, -415, 831, -418, 61, 610, -441, 525, 406, -435, 829, 89, -321, 834, -600, -46, 1227, -380, -206, 618, -454, 182, 530, -781, 307, 178, -468, 679, -305, -508, 958, -514, -219, 689]
1585F89j813J432N17j867J900q75j080K416j851q7J830k308J358O55k452K448
1601I12o24j556K685k098j02K349k833J254J100k681K610o00k023L073k030k08
1617g72K447l139J468J362l098K654m84k183L407k014o46K633k967J310J461l233
1633a794K561j32k197L175k012p17K911k881J001J459l026K345P0k242K780j542
1649b41p98K714k649O68J651k793K086J63k257K568j057j068K448k199K92J733
1665A261k351J372L12j864J999m61j591K453j766O7J752k116Q24R25j854J506
1681D68o2j462J857q84o07J659j634L18J318j836R72M92j600J528k30j175J621
1698G43r57l41J442j482L86R83j553J041K96j495J606n65q85J692j245j22J443
$$ y = [689, -1124, 308, 825, -1042, 858, -17, -1097, 1319, -532, -619, 1211, -1097, 261, 916, -1536, 912, 288, -1268, 1417, -681, -783, 1566, -1267, -13, 1087, -1594, 1016, 416, -1607, 1466, -564, -772, 1675, -1464, 4, 1366, -1732, 922, 438, -1745, 1662, -352, -998, 1635, -1332, -22, 1439, -1794, 767, 635, -1562, 1613, -399, -1116, 1795, -1086, -85, 1374, -1652, 693, 763, -1479, 1301, -241, -1039, 1675, -974, -306, 1345, -1448, 638, 801, -1456, 1112, 55, -1013, 1435, -764, -472, 1261, -1090, 282, 594, -1270, 729, 268, -1323, 1130, -636, -569, 1183, -933, -109, 816, -1038, 468, 406, -1056, 801, -83, -690, 969, -665, -347, 971, -865, 107, 599, -1001, 527, 297, -878, 743, -214, -555, 887, -595, -209, 774, -779, 262, 558, -937, 669, 104, -781, 911, -334, -456, 987]
1715I87j636N86Q29j726J451r3j347J727q56n83J697j588K06J307j829J020N14
1732F66j688J737m89j121J909j457r1J608j892Q13P95j935J736j68j470J902r97
1749a42n86J812j671K60J234k167J592K44j549J726p63p91J891j619J17J448j988
1766i52J053O64j901J780l40j303K014j270l34J657j855P58Q97j907J517o4j429
1783a015J928j032o37J839j596K45J178j793J123L35j494J582o54p31J664j327
1799c85l5J343j642Q41N98j643J359j07j055J447q78m07J400j266K73P64j285
1816f78R09K25j176J043k99n01J099q12k83J238j163L82L60j125Q95K78p77O47
1834B62l79p95J508r56n0R77j183N50P05j184P03Mp72J121m07q59J420p87k10
$$ y = [987, -649, -63, 766, -960, 491, 398, -949, 778, -78, -661, 1036, -552, -346, 961, -868, 152, 666, -1022, 715, 226, -895, 1014, -443, -534, 1074, -818, -5, 790, -1145, 591, 423, -1047, 855, -142, -728, 1084, -587, -327, 907, -1260, 332, 576, -973, 753, -10, -801, 1090, -529, -412, 1036, -952, 101, 765, -1136, 644, 304, -999, 1015, -255, -589, 1068, -787, -29, 868, -1039, 478, 414, -1015, 913, -119, -756, 1083, -513, -268, 910, -883, 240, 575, -919, 663, 9, -722, 942, -385, -420, 923, -719, 122, 720, -923, 436, 329, -726, 721, -157, -564, 836, -430, -157, 607, -678, 231, 456, -720, 323, 24, -477, 622, -190, -473, 765, -398, -16, 344, -781, 114, 392, -385, 262, -117, -912, 596, -360, -410, 567, -616, -66, 639, -545, 158, 162, -610, 511, 104, -755, 665, -122, -332]
1853c32J059j463O31R52j651J104l0j233J902r07q62J717j472M50J210k132J237
1870A80M53j576J911r92j065K308j588o6J519k317J504P46k227J966p56r84K469
1887A485k083o3J861k344J530N59k571K424m76j364K456k180J5K235k451J170
1903B03M89k232K520o53j535K326j927L75J981k797J287P56k081K326q71j524
1919a357K565j650M4J592k513J445P25j977J909q47j033K386j650j43J458k004
1935a050J440L67j877J689o09n67J726j697J60J314j583J025Q6j406J602m56o54
1952d90J231j246K88J003j270O17N5p62J153n03m64P91o77J75N88r53N50N4l92
1971b52N50p7o02P55l88k80L44l64K90J9j87J60l4Pj4J86p0l21M48k24p3K84l97
$$ y = [-332, 727, -736, -105, 847, -804, 300, 270, -963, 939, 32, -830, 887, -585, -135, 1075, -1057, 180, 633, -943, 968, -24, -1089, 1219, -369, -435, 1084, -1233, 271, 1017, -1210, 756, 0, -984, 1485, -598, -661, 1200, -1144, 386, 945, -1626, 798, 322, -1042, 1414, -766, -751, 1484, -967, 203, 692, -1540, 980, 327, -1208, 1118, -809, -434, 1547, -1250, 37, 793, -1288, 1038, 167, -1357, 1208, -442, -398, 1194, -1319, 126, 851, -1126, 783, -64, -1097, 1289, -361, -504, 954, -1050, 390, 757, -1120, 569, -40, -607, 1119, -578, -418, 896, -687, 338, 424, -982, 620, 164, -490, 741, -505, -217, 786, -484, 133, 188, -574, 579, 76, -388, 403, -274, -99, 489, -464, 86, 140, -252, 298, 221, -381, 374, -14, -294, 50, -314, -24, -5, -192, -32, -66, -59, -73, 113, 43, -278, 170, -54, -127, 157, -240]
1994b40K58J53n00N42k27k94O13n25J34M88q27N71J53p56Q52l23m88J001q14J41
2014h8O03j069O88K84r69R72l71o19J314j007m6Q72j193Q74K56j266J211m48m76
2033d78J286j280J18J111j394R47R4j286J433l68q11J335j107P1J081j381O74
2050D5L00j081J273m49p55J286r45J33Q85j401O84N28j152J102m02p80J341p49
2068a37k42R36j109N64N56j150P90j20o01J056n77l92Q65o86K26M72r78O13J86
2087B72o02P16m93l24Q71n11r1M36p27N45L08p62M73k1l55O49l58l52N64m03J55
2108a0K88o25L29K82n39L67p2l41O40k61k75M54m86J87M00o29L19J88n83N99j72
2129F0m11P62m73k08N88n53O1N28o53L55J26n63N68k15k45N17m28J9N44p93L72
$$ y = [-240, 18, 171, -329, 213, -14, -308, 305, -220, -86, 402, -425, 146, 299, -457, 395, 72, -416, 585, -229, -88, 515, -554, 134, 418, -551, 421, 50, -569, 745, -262, -308, 564, -629, 245, 501, -765, 446, -2, -478, 808, -472, -354, 757, -637, 310, 404, -882, 551, 183, -628, 707, -400, -329, 752, -629, 45, 345, -736, 537, 88, -667, 619, -326, -193, 692, -709, -25, 503, -649, 453, 51, -729, 612, -137, -379, 557, -552, 12, 568, -582, 208, 88, -513, 543, -34, -426, 439, -247, -21, 451, -527, 86, 272, -330, 386, -107, -431, 440, -71, -162, 274, -453, 92, 400, -362, 111, 90, -265, 384, 26, -326, 238, -165, -10, 278, -347, -18, 264, -275, 92, 20, -321, 319, 58, -217, 237, -249, -62, 338, -291, 28, 216, -367, 232, 60, -351, 411, -62, -270, 318, -235, -174, 354, -299, 56, 182, -381, 187, -28, -273, 244, -184, -165, 379, -414, -42]
2150d2L41o12M79k09l73O54k40r6M72p57M65L50n70L75P8o45M64j34n93J029m69
2171c3L40M09p07J07M86r61O90j80l99N77m95L2M83o34K02M12p15N70J30o62N74
2192B26j86l24N90m27l3M45o33M27J24n55N82j58m06O44l89j24N53n94J79L86
2212C27o61N07n0n01P11l92k27O73o24P5N09p18M48J84o32N80j83k54N28n29J01
2233a28M01o07L93J58n65O12j88l75O44m29j04N58o72L00K64o12N76j05l35M69
2253B55l16j00N00n24K25J97n44M24n7l46N26l01j03L50l56J24K50n32M63ql27
2274b00L98k15j42L87l34Q0K30l94K24M3j96K33j12j06K46j86J8J08j98J46Kj89
2296a57J88K0j16J62q5p4J05%m3k2r0N1J50j20%O4j21J29M7j97J48pn1J72j92
$$ y = [-42, 299, -313, 166, -43, -416, 238, -2, -98, 374, -383, 82, 432, -138, 237, 315, -330, 134, 0, -593, 436, -33, 307, 716, 9, 116, 602, -359, 331, 151, -248, 329, -166, -134, 349, -285, -83, 329, -386, 184, 314, -348, 226, 40, -284, 306, -121, -154, 291, -342, 85, 209, -346, 236, 78, -328, 316, -73, -197, 356, -238, -59, 327, -334, 173, 123, -378, 333, -59, -286, 387, -237, -162, 347, -371, 77, 261, -371, 209, 26, -228, 300, -229, -128, 273, -334, 59, 217, -348, 264, 76, -299, 345, -84, -188, 370, -302, -2, 262, -350, 226, 121, -214, 255, -61, -161, 339, -185, 40, 237, -307, 117, 60, -286, 240, -61, -164, 186, -170, -46, 204, -328, 135, 127, -200, 198, -17, -159, 228, -106, -26, 204, -190, 34, 77, -119, 114, 2, -104, 142, -44, -26, 82, -116, 30, 32, -157, 31, 51, -65, 97, 12, -62, 43, 43, 0, -22, -112, -61, 89, -31, -31, 33, -88, 41, 88, -109, 39, 32, -19, 153, -39]
2321c9j5J92j49JJ25l18L17P1l20K79j94m0L72l64RK93m24K88K2l66M06q5j62
2344a01L49m32O5L44m16L19m3l89M97j02k55M12m81J95L87o13K79J09m02N60k58
2365B4l30N51m08J60K48o09L69J62l80M17k39k31N50l52J8J85m73M71J15m77L68
2386A39j93j49N52m44n0K91l58K98Q8m70L77k8j27J84k73O4N59n45K62l10J61
2407B8J74Q0J62m55K70n5km36P5J19J1r0K77k08k4K25j88K9J4j55J64J36k06L0
2431b5k1l2K55j98q7J58j15J34J24m03K76Mk20L65l04j06M51l71J26J59m62M04
2453A12J20n18M37k56j42N40m13l5L77n30M47P0n15M60j88j48N10n70P7M45n27
2474b47L91J0n28O88k65l42O07n29K4O22o39K31J73n54O27j61l95O00m35M3M61
$$ y = [-39, -54, 138, -11, -10, 115, -203, 114, 185, -135, 144, -50, -90, 282, -82, -73, 220, -204, 84, 106, -260, 146, 61, -101, 248, -184, -119, 225, -191, 128, 85, -304, 193, 91, -164, 248, -233, -38, 349, -264, 15, 124, -278, 282, 24, -306, 245, -163, -3, 245, -364, 5, 167, -213, 204, -35, -266, 284, -68, -50, 135, -338, 133, 248, -229, 139, -54, -203, 349, -95, -145, 146, -212, 86, 174, -296, 81, 53, -74, 110, -163, -99, 460, -85, 177, -133, 28, 202, 282, 444, -11, 259, 204, 202, -234, -159, -40, -29, -119, 158, -50, -74, 151, -37, -8, 6, -149, 15, 151, -55, -25, -46, -78, 177, -21, -108, 50, -65, 69, 193, -210, 66, 70, -150, 215, -89, -195, 256, -115, 11, 170, -292, 112, 232, -286, 151, -105, -247, 293, -120, -155, 222, -308, 139, 209, -306, 154, -34, -182, 328, -242, -165, 280, -247, 144, 154, -374, 314, 49, -293, 314, -215, -191, 431, -208, 23, 196, -358, 269, 108, -287, 313, -122, -79, 382]
2495C82o46L34J11m88N54j66m79P14l33j01M30o77L37K97n67M22p4l64O24l56
2515d6j75M17m92L20L04n43K36N0k61M01k52j96M83l56J49J53m36L14J07l28K39
2536H8j22j57L53j47j03J71k26J70J29k97J23N1j42K99j58k14L43j41l4J05k69
2557a78J54K02k20J37j00j81L27q6j64K44j85L3K07k85K4J95k29J88m4k44L16
2578A11o5q8J13k41J75J10k67K17n2j52L09j84j75K41j68N4J85l00J51J23k42
2599a45K88j32j61K61j62L3J25k85K23R8k62J57n7j41L45k43JJ47j73J56M9l25
2621b03K64lk02K64j74J0J54p6k6P1j28Q7N2j66J81j10n4J37q1n5J47j52O2O4
2645F3j50J42Pr8J50j09o3J68j23kM9j29O6P1j51J12L5j39J70p5j03J19p2K3J03
$$ y = [382, -264, 70, 181, -307, 247, 81, -398, 316, -17, -118, 312, -365, -28, 269, -298, 124, 50, -314, 310, -46, -221, 196, -296, 24, 328, -215, 21, 71, -190, 211, -41, -237, 246, -110, 39, 192, -244, 70, 177, -151, 88, -34, -191, 162, 15, -88, 83, -143, 27, 156, -141, -18, 33, -109, 190, 32, -182, 161, 20, -14, 91, -178, -24, 178, -42, 95, -5, -186, 141, 55, -109, 135, -50, -17, 190, -95, -71, 124, -105, 83, 39, -205, 111, 46, -42, 71, -170, 5, 115, -152, 65, 13, -139, 170, -14, -189, 52, -116, -62, 123, -177, -26, 97, -145, 143, 11, -150, 111, -51, -18, 107, -178, 45, 143, -119, 38, -19, -160, 185, -58, -57, 90, -83, 73, 122, -203, 61, 58, -144, 120, -54, -44, 110, 34, 8, 79, -49, 38, 90, -76, 105, -5, -59, 78, -3, -58, 89, -63, -1, 63, -87, 55, 62, -36, 114, 5, -58, 110, -13, -15, 34, -95, -29, 42, -109, 3, 38, -101, 69, -6, -109, 10, -62, -39, 64]
2670F4j62P3O3j27J35q9o0K19j53m5J97k37J46P4k60J78J5j69K60j01j09K18k10
2693h0Q0J20k66J79R3k64K48p0k04L16k22NK34k62J00J06l30L23m6k08L15k43
2715g6l5L16k92L2K65l58J94J8k23L06j78p7K95k95Q9J74k85K34m0k83L34q4j49
2738a18L31k98mK66l09J11K04l82K84o4j97L02j76q9K60l27K14J43l00J90j9j84
2760a62L43k80N3J88k69J02J46k55J44J08k55K23p6j79L08j87m2K28k19J31K9
2781G9k08K21n8j53K20j24J9J00j93R9Q6k19J98M9k77L14j71l5K22j53l6J04j60
2804g6J20J08l35J86O0j37J43l2j31J80j58O4J03k73J88P7j81J44l1j85K99j03
2826C0j63K34j85P9J01k28J41M1j81K33q3j89L15j67n0J57k42J81R0k68K14jj54
$$ y = [64, -98, -25, 38, -89, 46, -43, -103, 116, -37, -82, 115, -122, 24, 98, -162, 16, 31, -138, 122, 21, -88, 130, -80, 0, 120, -146, 33, 126, -138, 110, 40, -164, 152, -70, -65, 169, -93, 7, 113, -217, 106, 60, -148, 167, -76, -111, 205, -87, -55, 210, -148, 46, 64, -159, 147, -31, -108, 187, -108, -19, 155, -130, 104, 64, -219, 115, 31, -118, 213, -85, -89, 177, -132, -21, 183, -199, 85, 21, -176, 126, -50, -139, 121, -206, 8, 151, -149, 41, 22, -162, 181, -99, -46, 142, -127, -25, 121, -134, 10, 118, -137, 86, 10, -169, 139, -48, -90, 138, -81, 50, 79, -129, 92, 34, -119, 101, -23, -4, 96, -97, 2, 88, -131, 67, 116, -161, 153, -18, -53, 169, 16, -20, 84, -76, 44, 152, -183, 3, 63, -74, 69, 37, -94, 86, -72, -8, 95, -178, 10, 87, -94, 50, 19, -166, 133, 30, -133, 101, -84, -5, 96, -132, 9, 50, -131, 102, 19, -170, 145, -22, -72, 85, -157, 24, 114, -154, 60, 59, -95]
2849i5K41k28NK57l34K04R9l38K57l5j53K44j94q8K79j53j6J34k11J35N4k02K60
2872A22j84j9K75k53mJ58k85K77J0k92K50n6k2J47j66p2K59k45J24L5k02J63Q5
2895A05j65J30j18j4J42k16J14N8j27J63n9j36J58j18O7J27l35K10J13k45J46
2916@m7n4J72j30k1J30q1l5J23q7N4l7j9M7kp7Q8o1P7j3r0Q7M5j02K5N2K3J6r5
2945a2l7J6jL8Qn6N6k2K7l0j6k6N7j0J7%J2LPk3o2O7o4Q8j6o7J5M5n8Q9q2l0J11
2978D4o9k6R7q6O3rj8M0n5jO3k3l1O1j02N3j7o9J17k5o8J02r0N8J12j58L6No9
3007f5Q5K6j10J27o4KN1p3J4L0m7J3j4k8Q2r3M7N0j44J14M5q2M9Nl8P9j29p5J90
3036D7j35L8O1K4l2J75l57K73lk1pp9r1K45j57O9P0j38J3J17j58J09j54J28k99
$$ y = [-95, 146, -82, -77, 180, -154, 50, 149, -189, 68, 33, -120, 124, -70, -158, 121, -32, -48, 86, -125, 10, 64, -138, 122, -62, -81, 194, -59, -63, 95, -190, 87, 97, -195, 55, -1, -23, 124, -42, -114, 145, -100, 24, 59, -143, 20, 105, -60, 70, -48, -62, 80, -136, -22, 36, -91, 72, 13, -123, 35, -83, -16, 111, -224, -14, 99, -146, 0, -47, -101, 71, -59, -80, 50, -31, -66, 57, -30, 24, -13, -32, 15, 13, -64, 24, -37, 40, 27, -63, 24, 69, -33, -8, 44, 67, 83, -12, -49, -33, -34, 4, 12, -44, 12, -10, 17, -13, -29, -55, 2, -8, 9, 9, 21, 24, 31, 8, -54, 13, -51, 37, 21, -46, -31, 14, -44, 45, -37, -67, 44, -25, -51, 46, -40, 23, 14, -4, 36, -19, -20, 43, 20, -11, 50, -52, 1, -16, -85, 32, 7, -61, 41, -49, 9, 121, -37, -1, 4, -65, 20, 46, -64, 63, -1, 1, 52, -21, -7, 23, -24, -11, -25, -53, 29, -64, -17, 33, -111, 3, 48, -34, 15, 20, -18, 61, -68, -143, 47, -88, -50, 11, 35, 3, 178, -179, 94, 91, 70, 63, -16, -107, 138, -19, 50, 120, -18, -5, 112, -46, 63, -91, 37, -262]
3061b62M33k84L46m96L31q7j30K28n4K1J57k34K7J58k25K63l03l7J91J23k56Q7
3083cj04N8l9Q1K2J95l62K26P9j6k01P1l6J8J04L20n99J66O6r4p7L58k18KK26
3108B43l26m8Q5Jq9K71j53M6J28l51O7K38k51K46j03j67K82j30L6K2j07J38o8
3131A0m4K5l8M4M3m0RL9j33J22L8j16M7Om2L3p1N7N5q6M8M7j04P0j5n9J12j3r7
3160e3J41j10LQ3n7L1k2k8M2l1o3J01l2l9J06j38J8J48j12L2N1j05M4Rq9J15l4
3187A1o1J05o4m1J16r1OK2n5O3k8J3N3p6K7l6k8L1Q5j53J71J1l5L1j03L2O5j24
3215e3O9m0lM6k4l1Mj04J12O7q0QL8m9P2K1j31Q1m2RO3p2J2Q3j12L4P6o9N3l7
3245APpnK5M8q4N9k5rL3j7m2k7K3M7k8j3L8kKj8J4o0R9k7n4M6m1l7L9L6m7M9J4
$$ y = [-262, 171, -113, 233, -263, 68, -19, -149, 79, 25, 46, 203, -31, -4, 154, -71, 192, -111, -148, 43, 166, -90, -3, -107, -49, -88, -7, 15, 210, -152, 74, 153, 137, -64, 7, -29, -11, 93, 413, -186, -20, 46, -48, -125, 233, 15, 17, 243, -83, -131, -46, -45, -134, 137, -16, 30, 158, -193, -126, 112, -139, 107, 4, -163, 119, -11, 25, 47, -60, 78, 10, -34, -9, -47, -3, 40, 0, 9, 48, -85, 37, 75, -41, 6, 12, -30, 3, -68, -11, 44, -42, 6, 53, -51, 19, 4, -55, 57, 44, -53, 88, -22, -19, 64, 7, 38, 16, -12, 30, -1, -64, 37, 5, -34, 72, -66, -48, 100, -12, 20, 71, -34, 10, 19, -70, 45, 11, -50, 55, -9, -50, 66, -25, -19, 3, -52, 11, -17, -4, 49, -27, 0, -36, -64, -33, 52, -101, 70, 81, 46, 77, -26, 6, 71, -53, 16, -24, -27, 19, -5, -36, -32, -136, -24, 43, -37, -29, 9, -40, 32, 53, -78, 3, -39, -30, 33, -39, -27, 56, -56, -22, 54, -15, 38, 1, 8, 1, -4, 21, 69, -15, 44, 19, 10, 43, 26, -16, -43, -20, 27, -1, -14, 24, 22, 24, 6, 20, -40, 59, 32, -22, 24, -17, -54, -15, 21, -26, 23, 37]
3279C7n6R7r5QK1j3J7j6j5Q1j05L8O4n4m2Q8j13J7N1nOlj6N7q7j0Q1q9k3J26r0
3310d3N9Lo3N6l1NM2OjN0n8j8MrR6j21oO6p9N4N4j30J05o0l8J06o4pL9m2K2L5
3342C2q7N0K7o4N8j2k5J9q5J02k0o4J34qj26J03Jr2J41j19L5N1k2n1R8j44Q4q
3370Hl5P8j05K9Q0l4MQ0j47Q0J7j50P6K3o5P0j14M3k6q3L48q0r4L7J08q4J09n4
3398A19j79J62k8l03M29m2j49nM8j37Q7l6J05p3l3P8k8K7J5m5j1k1L4P0j10m0
3424f6J43j33J0L9k2Q3o2n4O3lN8j7r3nM2m9N4m0o7J33m9j5J00j06N3NKm3Q2r3
3454e0N1M5r8KL2J3N4j13P4%k3L6l3j1P7m3q0J07n0M2J6o7j7R5j14Q0k6n1J33
3483H1o0m4N1n6L3kmL3l1n9Q4p1nQ8q5M6Oo3N8kn4N6%j8K7j0j9Qn9J2R2n2NOj6
$$ y = [37, -19, 78, -17, -9, 12, -1, 16, 0, -15, 66, -39, -1, 63, 9, -33, 55, -58, -41, 10, 5, 11, 8, -8, 49, -38, -48, 33, -56, -79, 47, -43, 16, 19, -44, 12, -19, -14, 28, 34, 33, 83, 25, 7, 11, 2, 98, -23, -29, 37, -42, 12, 66, -64, 41, -19, -57, 49, -15, -22, 17, -25, -3, 32, -55, -5, 22, -42, 16, 4, -21, -2, -87, 15, -5, -69, 65, 57, -69, 34, 35, -57, 84, -35, 0, 51, 29, -22, 76, -68, 16, 8, -27, 51, -54, -25, 55, 21, 25, 105, -42, 38, 55, -95, -19, 4, -61, 9, -105, -62, -88, -171, 177, 97, 3, 40, 148, 64, 173, 119, -60, 102, 74, -229, 200, 158, 9, 4, 52, -85, 2, -34, 71, -2, -35, 43, 15, 42, 57, 12, 1, -20, 14, 84, -26, -66, 77, -56, -46, -7, -29, 54, -8, -62, 1, -2, 56, 39, -54, -59, -17, -66, -12, -52, -119, 14, -35, -50, 50, -56, -3, 2, 4, -39, 43, -50, 1, 46, -52, -50, -18, -5, 49, -64, 10, 10, -13, 23, -10, -21, 56, 13, -67, 40, -10, 32, 48, -19, -36, 59, -55, 25, -1, -52, 81, 21, -23, 28, -28, 5, 3, -1, 32, 1, -58, 26, -45, -50, 38, -47, -1, 5, -58, 0, -2, -56, 0, 0, -18, 9, -1, -20, -12, -71, -59, 33, -19, -14, -8, -24]
3518b4L6Rn7M6o0K7P2o1J5K4n2N4Op6J23o4l3L2p8%R3m4j9Q1p3O4k0o4J1RMJ07
3550H8j23M9k6%M0Nj22M5O2j0K3o4MR6o1K0j1q3J26o0n0J36j07K0OMRRo1K2L2
3581A8o6N5l5L8k4n1L1O0j04M4Lj5N1Qm6K4l5O2Lk6L9Qn7O8m2qk7M0Lk5p2J08
3613C0%m8O6N5r2j3kK4L2r3N3j3k5ML5L1k6m5m2JQ2n5j7P1n3Q5q9O6L1p2K4M8
3645E3L0p8J08j02O3j15O9O1k9j52J90o8J0j01J14q3J88k13m5J28L2k33K40L5
3669A02l0K9O8j86k20K68N4M5l2k14J18l5P8m5J10J30j1j45j08P4J94k90J28o
3693G6j67J86j20N0P7%l07J66J68l31m5L06k78L37j22n5j48J75L8j3P3L0q4K2
3717C4M3M1nl5j80K53p4j56J41k35K10J14k03J24l00L64l48K48J82j33o4j40O1
$$ y = [-24, 12, 21, -36, 10, -50, -23, 49, -12, 3, 27, -25, 29, 35, -41, 82, 18, -15, 17, -61, -61, 32, -12, -31, 50, -23, 41, 21, -43, -32, -23, -19, 88, -35, 14, -12, -12, 28, 33, -89, -44, 18, 8, 31, -33, -29, 67, 6, 26, 15, -68, 58, -2, -52, 84, -23, -3, 3, 7, 16, 25, -36, -14, 18, -48, 7, -28, 10, -14, -65, -34, 26, -78, -34, -31, -46, 5, 13, -33, -9, -44, 18, 21, -5, 34, 42, -15, 53, 11, 3, -24, 16, 19, -6, -78, 30, 30, -18, 48, 103, 11, -2, -4, 20, 52, -41, 12, -1, -26, -22, 13, 44, 18, -27, -69, -68, 14, -41, -58, 13, -40, 45, -44, 22, 53, -19, 5, 53, 83, 5, 113, 11, 74, -41, 28, 89, 60, -92, 98, 30, 40, -61, 53, -30, 158, -55, -100, 28, 60, -173, 67, 102, 72, 101, 169, -17, -237, 31, 85, 130, 98, -116, 2, -33, 45, 0, 110, 240, 229, 84, -24, 50, 244, -46, 82, 76, -91, 95, -25, 25, 102, 102, -205, -39, 129, -202, -247, 59, -219, 118, -4, -59, -207, -32, 6, -7, 66, 96, 12, 34, 77, 118, 113, 78, -102, 151, 77, -79, 62, -173, 37, 151, -52, 72, -228, 136, -212, 36, 218, 85, 21, -119, -58]
3740e8M6q8K2J84j92L9n7l6K39j51Qqj29Q2K04p9p2m0J04J4O9k22Q7l2J6L1k1
3767d0J69j11j07J52q6l6P5j06J10o8L1O3l6j1J5k5J7M2m8N9m9J4l7P7p5m7R6
3794C8j2k0m7M3j7m1L0Lo8O8PK0l5L1j5N2L8j23P5L8p1lOPK6q2N3J8m5M2mn5K3
3827b0kjJ0j2J3L3j10J18l7K2J4m5kO9j0n9M9p9O9J8j06M9j2j1KK5O0m4rL8L4
3858F4j15L1K2J4O1r7lK0mN2l8o8O2n9L9K8m7NlJ6k8M7M2k9L8o2k5J6%N3l8n3
3890e9RP6j0Jo4J4J7K3lJ7m1M4o2L6j5p7O7J2pk3N0J2k0Nj8R6j5n1j5rQQ7j13
3923b8QL2j6P8j12K1N8l1j7Nk4j3M1j7%j8n5J22l0k9L0n3P3J2r2pQ4Kn1M7m0J7
3955cJ8LJ9r0M5N7m1o0MJ8J0j5mLlN2j4%J0jk2J3k7mnK3L3j12N9pQ1n4NK8p3L6
$$ y = [-58, -12, -100, -78, 106, -86, -47, -104, -140, 99, -52, -44, -52, -181, -99, 105, 26, -46, -86, 18, 32, 101, -121, -34, -66, -50, -19, -40, 129, 18, -89, 63, -23, -59, 16, -90, 20, -48, -17, 46, 10, -1, 14, -11, 6, 48, 0, 59, 10, 24, -13, 64, -11, -58, 38, 26, 6, -41, 2, -15, -56, -26, -23, -91, -23, -16, 4, -31, 0, -15, 37, 75, -48, 27, 65, -6, -9, -3, 4, 30, -52, 1, 19, -26, 16, 12, -43, -20, -22, -23, -13, -25, -12, 21, -89, 29, -8, 14, 28, -17, -19, 50, 40, -19, 30, -49, 20, 38, -68, -19, -31, -42, -40, -15, 45, 1, -8, 30, 64, -51, -20, 2, 16, 77, -20, -23, -3, -7, 45, 7, -61, 1, -58, -19, 9, -38, -33, -36, -20, -48, -1, 41, 12, 50, -12, -37, -21, -21, 32, -6, -59, -50, 26, 16, 17, -47, -33, -16, 7, 4, 21, -20, 24, -38, -2, -17, -94, -27, -15, -22, -45, 5, 17, -3, 2, -16, 80, 65, 14, -1, -10, -2, 85, -28, -20, 12, -4, 74, -38, -17, 41, 10, -7, -2, -26, -39, 2, -15, -15, -33, -88, 34, 4, -25, 5, -48, 25, 37, -55, -62, 22, 24, -27, 20, -20, -3, 15, 18, 37, -53, -8, 49, 8, -52, -48, -30, -20, -35, -39, -36, -39, 13, -1, -1, 9, 8, -14, -1, -28, -32, -37, -14, 19, -93, -34, -41, 40, -14, -9, 19, -54, -18]
3991a8lk5pP3J2n7mk1K3k6P8q0N7PK9l7p1R0k4m0J03j15M7O9o8l3M9l8K5N8j1
4022D2n5jkj1NrK2N3k1r5K3qQ4o7Ll0L6L1olMJ1qJl2J00J9j40p7J33r2J43Q8k83
4056a42J38m6k4N1O0Jr4kO1J2l04K88J30j57j61J68K05m42K71M6k92K94j09J14
4080F6j85J35o2P1p9k7R3m7K3J1L0j7mO3p0l8N0m9Q1o3j9K1KLj4k1L6L3Rj6n0
4111c4K1J0k4k3M8k3j7kO2j7MK0Rk9l2nM0Ll8%M7l1L4m4N2n5K4j6M1J8q3M3K8
4144C1o0K9n6L5o9N2Om4OO3k3K8oj01J47r7J3J59j5o9p4L2n5N8J67j16r1R7q8
4173d1J80M0j37J9J44p9j05J05q6Q4k25K77k37J40r2m5j2J45j85J63K51l20k7
4196d3J18r6Qml16M86K34j77k65K72o0q2j25J11L0k68M50k50k8K24j97k64J94
$$ y = [-18, -21, -46, -53, 20, 32, -25, -29, -50, -27, -53, 25, -55, 2, 9, 38, 1, -70, 20, -4, -44, 59, -56, -9, 60, -8, -41, 8, -30, -5, 53, 42, -13, -14, -16, -27, -22, -31, -9, 44, 23, -72, -49, -57, 27, -40, -37, -67, -31, 0, -6, -9, -5, 6, -2, -1, -33, 67, 86, -54, -131, 2, -90, 53, 141, -142, -4, -50, -74, -23, 37, 38, -56, -58, 3, 15, -289, -1, 129, -28, -189, -21, 184, -258, 13, 59, -233, 61, -48, 66, -119, 16, -46, 25, -54, -81, 12, -35, -12, -1, 29, 12, 8, 71, 1, -37, 13, -36, 45, -18, -37, -16, -14, -11, -25, -46, -10, 23, 32, 16, -34, -13, -3, -27, -50, -2, -25, -42, -44, 18, 1, 5, 25, 34, 5, -27, -32, 8, 11, -27, -27, 20, -11, 23, -21, 31, -24, 0, -16, 25, 43, -40, 3, 31, -29, 0, -56, -21, -90, -38, -32, -76, -70, -7, -30, -2, -8, -109, 38, -59, -46, 113, 98, 29, -45, -13, -68, -10, 157, 41, -50, 47, -41, 139, 179, 42, 61, 205, 126, 21, 126, 40, 124, -101, 176, -61, 79, -13, -58, -70, 75, -110, 53, 304, -16, -43, 75, -21, -13, -17, -333, 153, 387, 210, -55, 217, 157, 75, -50, 61, 91, -177, 273, 23, -5, 219, 22, -242, -48]
4219d8j40K45k1o8r8M54m14J40p7K6L6j36P7J6m3N4K1n7O7l1L6l6l8O7jLj4j7
4247CpnM7j4m6k4Q2l0k7qN5l6L5nJ4m5J3PJ4l4K4j6j1%pJ3NJ1n0M1j9J9J6j6L
4282Bj2N8o0K9o1J0N9j4L6m7MK9J3k0K6o4j1N8l8K2qk2M3r6O0j0M3j4m7rN6N0
4314F5j42J08L2kp4P7j44J07K2j1k32J21K54l96N0K67j77K2J01jom8M6m1j3l9
4340e4M3k5M6K9oQo7K5l0J5n6N1kK1l2RO1j18P2Lk4O1q5M8N8k2k3N6p8j4N2k0
4372BM4j1p6Q0n1K3m3QK5J2l7M7k4J5L1q3P1J2k7Nk5J9j0k6J9Q1j19R3O2k06J6
4403g3J95j8q7q2N18j22l06K38k77J96j09l8L3N8r2J8j46J24o8K53j72l3J8lo4
4428c9L6r1O4o6L9J0J57kj17q%J65k37n9M27k35J80p17N49k28L50l74M8K38k7
$$ y = [-48, -188, 57, 36, -32, -130, 324, -90, 50, -27, -1, 35, -101, -24, -8, -51, 3, 24, -33, 34, 3, 39, 3, -35, 32, 31, 34, 20, 3, -4, -9, 38, 24, -22, -46, 36, 6, -21, -29, 26, -10, 25, 20, 34, -11, 2, 9, 23, -11, 13, -3, -14, -14, -21, -8, -3, 8, -42, -1, -20, -1, 15, -1, 2, -10, 48, -12, 17, -44, -34, 25, 11, 47, 0, 4, 33, 46, 26, 52, -12, -23, 35, -3, 19, 11, -11, 32, -64, -4, -14, 29, 15, -32, -41, 15, 65, -77, 31, 63, 61, -13, 64, -80, 27, 49, 38, -194, -73, 181, -215, -165, 102, -75, -53, 48, 47, 41, -7, 39, -2, -15, -54, -11, -36, 10, 39, 33, 41, -26, -1, -31, -16, -72, -21, -23, -2, -34, -25, 36, -82, -10, -7, -31, 30, -55, -7, 51, 29, 6, 62, -16, -30, 22, 2, 46, 35, -41, 39, -12, 11, -32, -24, 1, 13, -24, 23, -1, 14, 45, -38, 33, 45, 18, 23, -2, 17, 7, -19, 0, 81, -38, 55, 117, -89, -73, 122, 104, 17, -65, 453, 331, 25, 263, -14, 182, 73, 35, 68, 126, 34, 52, -94, 30, -38, 215, 43, 10, 28, 25, -39, -3, -94, -30, -96, -57, -47, 110, 108, -9, -17, -17, 148, -89, -148, 279, 44, 224, -493, 56, -172, 178, -196, -148, 90, 63]
4453F3j79k00K69K4k43J86R1p8J77n1j78K56j24jJ68q1l05K86p6j54J05J4oR7
4477F0n9J7n0j0O1m8MJ6j9j8P9m1K2J9o7PJ3m0Q6m4Jl4N6ok7K8K0l6k5L5k5L9
4509A4l9Ml0O2k2NK4j3j5k8O2J9j6m8LrQ3o2%K0o8Q5L8p1k6P6k0kqNj9l6O2k5
4543Em5M3m7K4K2m0P0j9k4j1M3o2lO0m2jN3K6jl5l4M7l7j4N0j8j8J9m7P8j6j1
4575A5M6%q4K1j3L6m3J1K4L3j3p4L0j4O3m9L5om7J6M2l5J0M1l3j1l7J9j3O0Pj5
4607B2l2K4j6j2K4K3j2j1K6q7J15p9N5j33J56m8L5L9j89oJ1Q8N7j10pK0j00K03
4635E6J2j65L9J3j7m6J65k55K29p5r0L04j85J0J13L3k93M47j31n7n4pL05m32n3
4660a34M4o3JK53n5p3Q4j08o1j57R3K71j05j51P4J65j61K06j27j98Q3J61o8l0
$$ y = [63, -116, -316, -47, -23, -266, -80, 11, -67, 110, 59, -119, 137, 13, 12, 180, 99, -206, 80, 4, -150, -45, -31, -37, 60, 1, 18, -32, -42, 19, -29, -25, -9, -28, -46, 33, -8, 14, 33, -34, -27, -14, -54, 32, -12, -11, -45, 11, 5, -22, 6, 26, -10, -35, 0, -25, 14, -25, -21, -51, 11, -11, -6, 18, 5, -10, -38, 24, 43, 27, -21, -18, -27, 56, -6, -6, 14, -54, 31, 69, -2, -28, 48, 28, 26, 18, 23, 4, -32, 30, 5, -40, 3, -44, -20, 2, -38, 32, 13, -11, -22, 21, -41, -44, 16, -26, -27, 26, 52, 51, 16, -18, 29, -8, -22, 28, 10, -8, 11, -36, 42, 26, 15, 61, 61, -23, -2, -15, 21, -22, -11, 13, 46, 33, -41, -11, -25, 38, -11, 24, 18, -29, -13, 29, -6, 4, 45, 12, 1, -36, -17, -30, 30, 37, 22, -10, 14, -2, -14, 10, 33, 21, 10, 36, -51, 64, -15, 40, -93, 63, 15, 50, 89, -100, -106, -95, -7, 50, -60, -67, -47, -147, 56, 68, -97, -58, -45, -62, -108, 57, -198, 31, -44, -134, 170, -15, -5, 108, 141, -152, 295, 164, 107, 53, 46, 351, -81, -134, -90, -153, -152, 101, 46, -27, 57, -51, -112, -269, -176, 95, -10, -161, -87, 78, -83, 123, -4, -202, -119, 42, -26, -56]
4684e6J36k07nK85k12K23l43J17J55qkj06N1K5q6K7M4p7M4J2j0nj1K2m8RRRM7
4713C9m0O4o8O0r2L8j3Jl0l5Q3j7J8K3J2o3N8l6j1J6o8Q3%L5l8m4j4O7k9m2N8
4744A5k5l9N9J4nl2oM4l5M0n8L8k4J2k2kJ6J1N6l9j0J4k7j5P0l0l6N6m7ppM0K1
4777D0o8oM3N5n6K4n7jkL8q9Q3j8j6M1mlJ3l7l4M1j5mRK9Mk1Qj9L9m2N2q2P8Q
4812C1p9P1p7L8KK4l1M4n5M2M3j00P0m0l6O5k7J0J6l1M2k7J7k4oK2Km5K8J5Lk5
4844a8OjN2k7%k7K8l2N8Nk6m7L5L2k7K0Mo0N2k9QM1r7M5Okj8K4k2k3J1L6L2r7
4878e8O8l5K1K2rNj9qMQ6r6K0rKM8p8J08o5j7M8Mr3Q9l3j2j9k9Q0N2j18L7l7M4
4911CL3o0O2k2n4N8k0o4Q8n6OM0m1K4%j8O6n5N6J2r9M4N1n7PM8n9O0p1oL4l6L
$$ y = [-56, 80, -127, -132, 153, -59, 164, -179, -62, 93, 85, 83, -23, 28, 53, -33, -6, 38, -39, 5, 17, 7, 2, -9, 13, -35, -26, -17, -8, 39, -1, 63, -5, 55, -37, 1, -12, -11, -41, -76, 7, -10, 8, 31, 43, -20, 38, 2, -9, 7, -61, 22, 22, 57, 19, -25, -39, 28, -1, -43, 15, -10, -49, 10, 24, 19, -13, -19, 25, -10, 30, -28, 10, -14, -2, -24, -26, -10, 1, 57, 18, 8, 22, -5, -20, 50, 20, -16, 40, -7, -14, -21, 19, 40, -28, -34, 9, 64, 8, 32, -25, -26, -28, 10, -79, 4, -14, -30, 11, 7, 4, 17, -20, -54, -13, -28, -32, -23, 6, 10, -11, -3, -22, 17, -25, 27, -55, 23, 31, -48, 23, -54, -16, -14, 10, -21, 23, -32, 10, 53, -47, 23, -17, -53, 12, -15, -5, 11, -20, 22, -5, 12, -12, -18, 4, 6, -39, -11, 4, 7, -18, -12, -13, 39, 12, 12, -15, 13, -19, 39, 44, 18, -29, 6, 38, 11, 31, 35, -25, 27, -2, 6, 47, -50, -5, 1, -1, -19, 5, -17, -40, -29, 7, 39, -58, 10, -25, -4, 18, 9, 14, -5, -13, -9, 77, -19, 1, -8, -6, 42, -36, 72, 7, -10, 38, 42, -51, 38, 5, -7, -26, -55, 25, 77, -41, -4, -41, 3, 36, -24, 38, 16, -38, 20, 0, -64, 24, -32, -26, 14, -27, -3, -3, -21, 45, -10, 46, 58, -41, 3, 54, -3, 4, 52, -7, 53, -18, -24, 10, -26, -23]
4944b3N5n3L1M5n2ll5L1O2k9j6mm7M1J%j4pNk6M3K1k7l0N2r1N5J5j7J1Q3q6QN
4978DPK5j3Mk5J6j6N6j33K6M6J2J5n0J8J2l0O3l6K8l8J5J1k5j5K7M3m2M1n3l0
5009c7R9k9PMo4%pO6j0KlKm8K6Lj9L4j0m1L3k5M5n1J1N5k3l1M0m9J9K4K2o7PK0
5044Em0K4K5M3o5m0J01j03J10n6m0N7L2m0O4j00J5M9p1N9n2KP7r6K5ONJ6j0o0
5074e8Q4ln1L1k5KP8j09P5qk2Kk7N3M0kl4J4mj3K2l9j5L5m2J8m6J06l3p3N3J6
5106B5l3j3M2rl2j6O3m7L7n1J3rK3P%k8jM8m3j5LON6Ln6K2MJ4j5O2n3J2j4L0p3
5141c8Q3p0L0pk5J1L0KK5p6J3O9l1j1k0j8O5l7n9N3Nj7M9J7n8J4OqN5k6nNk4P0
5175G2m4pJ4L3k6j1p6N8L9l5k9k3M0L4m8J4j5k8M5n3k3J0L6J1M2K8o4L0J6l2m
$$ y = [-23, 32, -21, 10, 55, 3, 0, -35, -4, 58, 29, 13, 9, -38, 3, 4, 4, -10, -17, -12, -38, 5, 26, -1, -31, 21, -70, -15, 0, -17, -6, 77, -9, -1, 4, 11, 36, 23, 27, 2, 18, 2, 58, -75, -49, -3, 9, 24, -26, -8, 4, -26, 37, 1, 29, -9, 6, 17, -8, -23, 4, 47, 5, 46, -7, -37, 62, 33, 40, 44, -20, -20, -27, 39, 29, 31, 28, 30, -18, 8, 11, -8, 26, 16, -25, 8, -17, 28, -23, -12, 43, 20, -11, 29, -20, -1, 23, 45, -22, -15, 5, -35, -11, 14, 57, -8, -48, 53, -50, 60, 4, -36, 21, 53, 13, 77, -23, -8, 41, -30, 29, -23, -21, 56, -40, -15, -9, -4, 12, 2, -58, 26, 23, -28, 3, -22, -20, 58, -51, 24, 16, -6, -4, -31, 22, 62, 60, 26, 40, 36, 23, 45, 6, -9, 26, -16, 2, -44, 62, 29, -44, 9, 25, -8, -21, 21, 12, -20, -36, 27, -20, 17, -34, -21, -30, -7, 0, 0, -28, -29, 19, -24, -39, -36, -30, 26, 29, -27, -5, -1, 13, -2, 60, 7, 19, 5, 35, -38, 45, -25, 5, -2, -27, -16, 14, 16, 41, -35, -22, 47, 16, 5, -15, -33, 32, -5, -64, -11, -6, -23, 26, 43, -15, -1, 5, -3, 52, 26, 21, 26, 2, 72, 28, 21, 35, 68, 42, 31, -45, 13, 52, 17, -12, -35, 5, 39, -9, 5, -10, -38, 7, -46, -69, -59, -23, -12, 30, 58, -6, 24, 40, 8, 4]
5206Dk1L2Ml7O9j06L2N4m6K3O4q2%Q5o4L1r1L9Q4p7M6ll1j7Rj2K3Rk6l7M0Noj
5240dK2qL2m1k2N9pm6L3j5l8P1m8M0pl7k1J3jP7k7n8J02n1m0M3k2JPK3j2Pm8%
5274b3k4M6Rl5R6mp2Mn%Nl2P8k9k1l4L3L1rmrM5o4R8q9kL3Nm9J2k6K5K9j6K7o9
5310d0K3L0n0J6L0n7K6M3j02Q9K3q1O2k9OM4mL0o1k8MJ5JN2q4P5kn5O4n7P0m6
5342Gl5O2K8p6N%m2R3p3L5L0n0K6Rn9L1j9nR0r3pO8o3J09q3J8J7m1M2k1L7j8p
5375A5oPm0K9R3j07k6P0k1J7m3K5L3p0j5O2l3PL8q2J10j8l3%p0Q5Nk8k5J5k8M6
5407A2ln6J08r9J1l1MM7L1l1MLJ2J0q1N6Jl3M7m3N4m4L3m6J1k1K6K4K6pq8O2P
5440Fo6K4P0k5J5Lj8N1r0J4O7m1L4n3j4P3l0m1O4l7k9P1l6K8j4m9N2l9m9M2M4
$$ y = [4, -17, 15, 19, -18, 51, -55, -23, 31, -15, 8, 72, -10, -10, 75, 11, 42, -49, -10, 74, -3, 43, 40, 9, -8, 1, -11, 12, 21, -5, -42, -2, 3, -3, -4, 18, 10, 42, 1, -21, 38, 31, -15, 18, 3, -35, 36, -12, 28, 21, -16, -37, -24, -25, 52, 25, -33, 69, 18, -22, 21, -1, 0, 7, 30, 18, 25, -23, -23, -47, -1, 8, -27, 69, 65, -7, -3, -8, -8, -3, -35, 43, 14, -7, -41, -8, 23, 14, 10, 1, 46, -18, 80, -9, -11, 22, 27, -22, -10, -36, -11, 18, 2, 29, -40, -17, 13, -37, -21, 9, -48, -22, 21, -81, 8, 31, -50, 12, -17, -11, 33, 29, 59, -2, -30, -26, -11, -10, 42, -42, 33, 31, -24, 40, -17, 53, 7, -28, 34, 62, -14, -9, -9, -51, 42, -31, 4, 34, -16, 10, 19, -40, -9, -28, -33, 57, -36, -43, 25, -38, 71, -12, 6, 23, -18, 24, 3, 40, 22, 15, 9, 16, -24, 5, 98, -9, -35, 35, 14, 31, -12, 13, 46, -24, -39, 23, -10, -3, 35, -47, 63, 45, 12, 12, -58, 27, 32, 4, -21, -6, -34, 12, 9, -47, 61, -38, -27, -58, -54, -7, 24, -7, -3, 0, 12, 22, -59, -3, -2, -35, 12, -31, 23, -21, 12, -34, -23, -44, -18, 6, 32, 25, -63, -1, 6, -60, -36, 34, 9, 24, 27, 9, 60, -30, -16, 51, 10, 44, -9, -23, 50, 20, -21, 43, 6, -23, 48, 12, 40, 26, -23, 29, -10, -59, -17, 27]
5471B7j3J3l6K7k8J9J0k4l6M2pN7j8m2qM0k4J2k6mO7o2Q1n7j9J7k3K7j0K2j6q
5503@k9Q4p1k5O4r3K5J6kR0r0L9m9RJP4n5M8j9j2kJ7k2Pl2O4qp7L9N3m5k6O1r
5537B5L0r7K8J2K1kJ8o3K1L1m5N3l4l8M0m7K2L3m7LK0L8Jk5ml0O0l6l3K2J03q8
5569hM0k4n9P8m6j2M8j2K9l4J1M1j7l7k4O9r1M0m1K8k6P1k5K4j0rk6QprKL1K8
5602C1m9jk0J5L6om8O0J8q7O6mn0P6ll6L1K4o5pJ5j8O7n6M8j0mm3J8k0M2l6%L1
5636A5nLKk5jj7j9N8o1N2k0Q0o8J5jqm0L5J9k8J4j7K9m2L3n0J05p1J2J0n9M5j0
5669a5pK1l6L3nl8j6J8L8nRPJ0k9j5N3%k2m5j9M7L3j1M1o2k7P4o9J1rPP4o2k6
5703d2N9j8J9j3n3Q9o9K2nm5J9p%M2jk5N9p4L2O7n8J0j3l0PM6%l8k9N2J5j4J7
$$ y = [27, 14, 27, -9, 18, -10, 9, 19, -5, -41, 1, -6, 51, 33, -9, -17, 23, -1, 11, -15, -19, 48, -14, 67, 10, -9, 8, -15, 12, 2, 24, 8, 0, -29, 55, -16, -41, 23, -70, -45, -29, -31, 59, -31, 8, -41, -32, -31, 43, -12, 36, 17, 5, 3, 20, -2, 5, -27, 37, 29, -48, -9, 44, -1, -27, 34, 25, 55, -42, -14, -2, 19, 17, 35, -28, -7, 24, -21, 32, -2, -40, 0, -47, -25, 8, -39, -36, -16, 22, 23, -2, -6, -36, 24, -12, -45, -23, 80, -8, 32, 8, -51, 27, -19, -31, 17, 5, 34, 0, 11, 52, 35, -2, -26, 43, -48, -8, -49, -21, -47, 24, -1, 23, 13, 4, -22, -14, -21, -30, -28, 3, 31, -18, -19, -39, -24, 12, 6, -42, 18, 36, -51, 15, 11, -39, 37, 34, -2, 29, 53, -12, -19, -4, -22, 45, -11, 37, 27, 23, -20, -2, -22, 20, -16, -16, 15, 10, 13, 15, -10, -11, -28, -47, 11, -50, 2, -18, 62, -6, 9, 8, 0, -40, -5, 14, -14, 0, -17, 12, -30, 3, -47, 58, -13, -1, 9, -50, -5, -15, -22, -1, -37, -4, -9, -47, -63, -45, -7, -12, -3, 4, 14, -15, -30, 23, 23, 1, -44, -63, -16, 17, 6, 47, -15, -42, 32, -37, -26, -35, -28, 46, -16, -42, 17, -1, 18, 5, -48, 41, -28, -6, -11, -56, -37, -44, -44, -2, -3, -28, 31, -43, -11, 56, -2, 8, -5, -35, -28, 18, 18, -20, -49, 3, 18, 4, 21]
5736B1lj1J4n3k7R6l8JM4q3PM7k8QN7r6P3m8K9k5K6L1jm3J1n0K5j6K7j9k0M9L8
5769D3K0j44J07l9j4K4k9P6n6j7N1m8j4R4j06J14r0j6L6rNJ2p8Q6J8q4N5l0jN9
5799B5l8J7J9l5K6Lp2N0J8KK2o1M6Rl3qM0j08J08l1K2nm7K5J2o4N8m3J0J29p3
5830B3qJ2j10J25K6j10L0J0j3K7j1k9L3j2J0J8p0J05m1n8J1K4qK2j4M6m6l6Q1
5859C7o8M4J2q1J16m7m1O8k3l1L9l4L4k3m2M5k8j2K8J8j3J0n8O3J8n4O9m2OM2
5889E2p2K9N0q3QK4j0M0p6L4j6J4P4m2n4O1p1J1Q4p3K3m0j7L6KrJ8n8N8J7l3l0
5921d9M7k7J4J6n2P1q3J3P4nK4l4J3K2j9jj5m4k3R9o5N7m2m6Q9n8P1n3K0L3k3
5952B4n9M9o4N7j6J6q6N3k8N8J4l2lpl0L4L2L3o6k1O4%l2J8j4k4J25q4j8N8l8
$$ y = [21, 18, 7, 21, -32, -59, 37, -1, 0, 44, -39, -32, 15, -13, -5, 52, -44, 29, -19, 10, -15, 11, 42, 41, -2, 9, -41, -16, -32, -5, -24, -44, 5, 43, 63, -81, 26, -13, -27, -3, -32, 44, -12, -29, 22, -26, -40, 54, -52, 62, -28, -44, -8, -17, -12, 0, -78, 8, 26, -58, -3, -33, -34, 25, -13, 4, 23, -12, 14, 17, -55, -5, 13, 15, 37, -24, 22, 31, -2, -10, 30, -78, 30, -1, 21, 16, -31, -6, 6, -58, 0, -43, -33, 96, 23, 15, 27, -83, 42, 68, -42, -12, -2, -15, 12, 1, -28, 5, -7, 3, 21, -49, 56, 15, -43, -32, -8, -16, 6, -8, 38, -8, -44, 37, -31, 13, 25, -56, 60, 13, -28, 40, 17, -14, 25, -9, 25, 2, -40, 5, -23, -35, -7, 11, -2, 8, -50, 13, 31, -23, 46, 4, 10, 52, -20, 9, 59, -24, -16, 8, -2, 38, -38, -4, -20, -6, 68, 26, -28, 33, -38, -27, 57, -16, 7, -33, -50, -14, -12, -21, -3, -61, -3, 14, -19, -49, -2, -29, -15, 1, -51, 20, -63, -50, 24, 19, 43, 9, 22, 44, 25, 24, 9, -35, -58, 41, -24, 33, -9, -55, 34, -24, 47, -6, 14, 47, 24, -35, 14, -50, 7, -9, 7, -79, -26, -54, 4, 18, -14, -17, -24, -54, -20, 12, 45, -21, -42, 22, 22, -10, 8, -6, -30, 95, 11, -7, 51, 13]
5983A3n0O3l3L2m1M5j8l3M2j1j0K8n2J4N5m3j7mKM0p7P3j7m7Q1k8m4RL4Pj6j4
6015a7k9N1k9J2L1Jl4Rj1K4j0j0QMj8L3m3K0pOK0J0m0RK0m0LM4nl0K1l2N4J6j5
6050B6j5k1N3j2m0k5J9l7L7Mj6L9%O6r1K0Qrmj4k1J9j8J9%K5J8m5J1%qN2n5K4
6084IJ%L2l4m5K3oJ7mM1j4l6jJ1m5L2M7j0l2K2n2J4L0n1L2L4J0j0k7J0k9n4J5
6117g0M4%K9M5p1NJ4j6N8q6N2j2k2JK3j5O2l6J3nl6M0p1P0K3q9L6J0J00q3j7l
6149gO1j10M1N6j9m2kj1O5J0o8R9j24K2L4l6J03j15J4L5p0P9m6j1O3Mj2mn5NP0
6180B9k0j1J2K7n6N1p0N0o2j1R9p5N3Rl8l4P6o8L6m2J6M5l3J5O3o0rL8n3Ol7L9
6212a5K3k5K9K2l9M8n6J1M3m5k0M3o1L6Jo6Q3k9o2R5q3R6k4o7N6N8m5L7o9J9j0
$$ y = [13, -37, 26, -7, 25, -16, 29, 11, -22, 20, 9, -1, 27, -25, -11, 44, 1, -16, -20, -18, 22, -55, 18, 1, -46, 35, 7, -37, -28, 6, 13, -3, -17, -46, 5, -24, -12, 19, 20, -14, -5, -16, 8, -2, -12, -4, 0, -18, 15, -28, -8, -15, -9, 11, 21, -19, -10, 10, -30, -27, 17, 12, -18, 3, -29, 25, 41, 26, 11, -10, 43, 31, -9, -34, -15, -52, -15, -11, -27, 12, 12, 78, -13, 7, 15, 6, 2, -12, -33, -14, -32, -13, -13, 12, 30, -15, -4, -4, -12, 40, -15, 9, 10, 10, 42, 8, -37, -14, -20, -3, -7, 34, 20, -16, -17, -6, -51, -19, 28, 18, -14, 8, -44, -30, 0, -51, -19, 15, 25, 15, -12, -2, -31, -85, -70, -26, -26, 3, 48, -23, -18, -4, -20, 38, -48, 4, -8, -30, -29, -6, -21, 41, 5, 18, 13, -23, 17, -54, 16, 39, -50, -14, -4, 96, 13, -4, -7, 54, -56, -15, 41, 22, -20, -22, -33, 32, 42, -26, 73, -51, -29, 5, -31, 72, -43, -29, 6, -64, 15, -31, -42, 21, 25, 13, 9, -46, -41, 29, 9, -2, 10, 37, -19, 32, -38, 12, -50, -61, 38, -37, 16, 25, -13, -47, 29, -39, -3, -45, -29, 16, -17, -2, 61, 1, -8, 30, -23, -17, -54, -15, 8, -17, 12, 34, -5, 43, -13, -2, 41, -4, -24, 19, -42, -6, -5, -71, 12, -17, -79, 16, -67, 29, 5, -62, -6, 52, 7, 44, -25, -6, -16]
6243a6l2J05p9K8O3o2n8J30j30N2L9r7R0j1p2K6J5J4K4o9P9n6NN8qm8L4k6nj0
6273a7o4J64n4n1O1o2M3L4j18M6j3l3O0Pm7R9p4PN4j67J41J5q2P2m5RO2q5mK4
6303a8l3O5J8m8O8j26R5M7q0K4L0n8Jrj2N4m5N9rr3J34l5o1K5J3K6n8lM0Ol2Q2
6335F7o2nnK4q1M0k0L0K9j8M8j3r8J10lm1l5j2K54j89n4Q7j57J79j55O7J4j1N5
6364D5j5j17%J22Ll5j06L3Q3J3r2J38k1M1q3k4J25j09J1O3o5Q8j61J71k4j18L0
6391dkJ22q4L3r6o8K7J26l5Qp9O3qk5LL6k3J7j1K5Rn3L4J5l8N9q5j1R3j23O7L5
6423B7m5L0L0m6L1n6L2L3q8N3Pm5R2n5l7L4o3O6M2j01M8K0l4M2l6oM6k9L7n6k0
6454d7J26r9j0L9MKK8o8M5n1L4k8K2j8M1k8Rl2m1J41p1k1N2q0K0N9J2n3k6J0K9
$$ y = [-16, -48, 57, -22, 6, 69, 7, -51, 79, -51, 1, 40, -57, 33, 22, -50, -24, -9, 5, 29, -40, 39, -17, -12, 46, 38, -10, 24, -2, -7, -17, -81, 83, 29, -22, 39, -23, 20, 54, -64, -18, -31, -64, -4, 3, -44, 55, -19, -12, 42, -125, 16, 31, -51, 21, -24, -15, 47, -38, -42, -18, -51, 14, 32, -16, 52, -74, 21, 68, -12, 12, 42, -16, -15, -24, -36, 18, -27, 32, 23, -70, 64, 29, -32, -7, 6, 32, -26, -29, 11, 17, -15, 67, 5, 0, -5, 19, -62, -22, -42, -12, 17, -1, 47, 34, -64, 46, 43, 2, -33, -45, 209, 20, -34, 53, -104, 75, -80, -13, 1, -10, 45, 30, -87, -87, 35, 38, 3, -103, -70, 13, 26, -66, 72, 51, 92, 9, -15, 110, 1, 12, 75, 10, 98, -63, 108, 84, -34, -4, -6, 116, 32, 65, -31, -99, -72, 54, 19, 27, -52, 11, 3, -22, -19, 17, -6, 11, 0, 25, 34, -19, 15, 30, -8, 51, -34, -45, 48, -75, -8, 27, -18, 12, 42, -4, 27, -29, 3, 36, -52, 1, 8, -37, 55, 0, -37, -3, -66, 0, 42, -59, -11, 9, -25, 17, -19, -25, 21, -8, 29, -27, -47, 79, -20, -30, 9, 13, 15, 43, -25, 20, -31, 3, -25, -3, -21, 20, -8, 1, -31, -72, 69, -2, -23, 29, -51, -31, 28, 40, -13, -39, -29, 0]
6485@n6M6Pj3K1m4j4O9m1J7M9k8K5k5J0LJ4p9J07r5L4k7J3%M6p2K6M5p9P2o2K3
6517hL3o1j3O1o6Q2n5JK5pK8q7N0O2J43k14m1N7Q6n2j16qk9J13PJ19k3m5o8R3
6547F7q3J10n6P0j74j20J31l9Mk9K7L8PJ0j15J48N9J2j19j1K8M33m48J71l12K07
6573A6N9j88R4K80m55J47L96k49j65j6L86j27l22q0M01j09j81M61j98n24N88j82
6595C2j6m2j44J67L0k12J41m9J04o6Q2j22J80n8N1m8m8J8p4R5mo0O4m9M0J0r2
6622g0M3M0%l1M5n2J6N5j00O4J4k2J5o5M1L3n7P2k6j9l9L6k5N2j9L1l2nmK6q4
6653f7Q7n2K6l4N3m7OK2J8l6J6Qm8P0l1j6M9rj4L2Lo2M6n6K8NoJ1k0%k0J2K3j8
6687b1n3P0ll7P2q4P0O1j12R7q8k4Q9k3l2L6k9K1j5jJ6r6Q9M0m4n8P8p8P6k2j9
$$ y = [0, -56, -10, -3, -16, 5, -39, -53, 16, -25, -8, 41, 13, 38, 13, 23, 26, 40, -39, 68, -27, 7, -20, -7, -7, 39, -33, -7, 38, -41, 31, -31, -8, 25, -36, -49, 12, -54, 28, -27, -26, -1, -8, 20, -67, -17, 45, 188, -26, -67, -10, 76, 24, -92, -100, -129, -16, -9, 110, 87, 42, -26, 67, -16, 94, 38, 108, -66, -186, -55, -94, -90, -119, -92, -54, -47, -37, -152, -4, 55, 67, -52, -63, -35, 398, -50, 121, -191, 16, 75, -113, -19, 261, -194, -47, 349, 100, -65, -81, 305, 178, -144, -224, 177, 68, -113, 348, 150, -374, 214, 32, 16, -26, -170, -3, 27, -185, -44, -93, 11, -55, 27, -95, 85, 27, 78, 30, -18, 0, -74, 21, 17, -43, 21, -28, 12, 22, -70, -27, 13, 13, -18, 27, -25, -9, 46, -54, 10, 24, 2, 17, -48, -7, 26, -31, 41, 15, -4, -43, -7, -32, 20, 1, 32, 0, -5, -9, 17, -67, 20, -32, -6, -40, 13, -34, -28, -6, 12, -24, -8, 0, -48, 22, -9, -25, 24, 15, 1, 33, 36, -26, 20, -36, -8, -3, -9, 2, -18, -18, -38, -26, -3, -21, -74, -4, -7, -44, 28, -56, 14, 75, -37, 60, -28, -52, 37, 14, -18, 18, -11, 10, -5, -6, 10, -86, 3, 43, -1, -59, 19, -59, 17, -5, -24]
6718b4J01o7l1K7n3N5K2q1J01m5p2Q6j0k6L4j06Q3k0L5j6qj7R4p3pL1n3L1K3r
6748EN1p5L1K3n0J8J3o2P3o2K6mk4K4K4o8M6K6n2N9m8lJ0K2K3j7m4J9Oj5N5n0
6780b0N0L3q8O0j0l9N3p0j5P6l0J9J9o2K2K7m8K3l1j9O6m4M8m5k8Q3m1j7K1M6
6810C9l1MJ1k8M6o7K3l4j6R3m6j4M4p0P4J5q4K7k8K1K5j3J9j6k4O6r2M9N2p0L
6841b2R4r4MkJ8J5o2N7lQPLk3mK3Mj3JK8q3RN8L1o9N0p2J6O3n4J0N4m0oO5m8L6
6877E9o8Oj7R0j5P2j60oJ31j19Q1j34M40j65j44J36r1P0k07k12J65J61J58j90
6901D1L25j04n33M84M12o57N4o4O8m6j07K85p2q9MJ16l8j23k4J47l13J35M3j9
6925g5J49N9m73J69mJ27N9j0j19K35l6j0N5j45Q2j3q7N3J56l23O6L07j59K2j70
$$ y = [-24, 77, 10, -21, 6, -47, 8, 30, -51, 50, 5, -67, 19, 9, -17, 17, -89, -6, -26, 9, -7, -15, -32, 62, -11, -18, 13, -40, -9, 14, 5, 56, -19, 12, 35, -15, 3, 16, -46, 27, -35, -9, -13, -37, -13, 11, -57, -11, 15, -37, 22, -26, -29, -19, 3, 26, 9, -35, -16, -10, -25, 30, -20, 30, 63, -25, 35, 25, -14, 39, -31, -46, 30, 0, 19, 38, -24, -2, 25, -23, 0, -31, -50, 16, -28, 20, -25, -53, 30, -11, -28, -7, 39, 8, 12, 23, -5, 41, -26, -3, -37, -53, 40, -6, -20, 24, -46, 28, 43, -41, -14, -42, -21, 4, -9, 10, -6, -30, 36, -56, -7, 45, -25, -22, 72, -22, -18, -20, -2, 13, -49, 8, 5, 13, 20, 23, 0, -4, 19, 23, 10, 11, 39, -44, -35, 23, 54, -15, 35, -37, -21, 42, -12, -2, 52, 12, 6, 71, 23, 59, -9, -3, -20, 70, 55, 127, -33, -39, 92, -27, 54, -80, 360, 195, 51, 187, 96, 166, -41, -253, -88, 73, 231, 41, 366, 262, -271, 213, 625, -32, 22, -42, 26, -20, -127, 158, 86, -3, 1, 117, 79, -44, -68, 79, -234, -99, -56, -75, 74, 133, -340, -171, -175, -48, 11, 1, -118, 117, 81, 71, 126, -19, 63, 50, -37, 16, 172, -151, -85, 222, 63, 85, -85]
6950h5NO0j9lj88J24R8k5j3K4N4m9K6j7LRj4o0r0J77Nn9kJ5M7L0j46K33j7k28
6980a05M4J11K5J5j14q2J63j53P3k24K32j08P9J61j6J19m02L11r2J24J1j91K36
7003B17r5l28K87o0j47P3K63K5j15O4P9m05M0K77q0j55K12k48J36k8N4j13P3Q
7027C4n2k8L3j4K3K6lnrj2L2rl5J0K0kk1k0O1Ok5L7o9j5J8OJ1k5L7lk0k5P6l0
7061HR0q7M1K7Rj8q0O5o3L3j40L4R5J19k35K34j55J90k29J08L5k70L77l98M47
7086B37O9J52q28M97K4j15r6kp5L15k31R8j99P0L01l00M8M9n3n3J46nP4j50O7
7111D0j23J27j36J43m7j13j1pK88l55N6j33K59o4j42L68L08l76k7N2O2j45l00
7134b76L78j04j2j96J54L2k31L51o5k0J47j46k7o4K69j44P6j62O7K6J17k81Q6
$$ y = [-85, -80, -20, -39, -42, -230, -106, -8, -33, -46, -22, 32, -17, 9, -8, -5, 4, -10, -70, -160, 17, 22, -37, -39, -24, 23, 53, -93, 140, 123, -105, -61, 50, 75, 90, -24, -106, 57, -96, -23, -247, -15, -123, -44, 117, 101, 220, -182, 129, 37, 161, 172, -19, 217, 122, -206, 81, 21, -126, -53, 210, 235, 120, 184, 263, -142, -102, 175, 95, -60, 152, -96, 40, 12, 66, -47, 26, 34, -18, -46, -13, -27, -4, 22, 19, 14, 5, -7, 25, 16, -19, -9, 11, 9, -12, -32, 29, 35, 10, 47, -22, -37, -19, -13, -2, -27, 10, 7, -13, -38, 38, 8, 98, 11, 52, 79, 88, 70, -10, 55, -8, 25, -115, -81, 14, 133, -102, 132, -23, 167, -62, 46, 81, -189, 188, -210, 237, 306, 458, -370, 127, 151, 36, -60, -62, -137, 178, -53, 45, -154, -84, 217, -83, -35, 14, -39, -92, 54, 49, 123, -27, 40, -83, 44, -92, 51, 4, -109, -120, -127, 161, -194, -138, -271, -12, -76, -218, 150, 458, 82, 55, 107, 169, 24, -276, 102, -2, -14, -210, -56, -24, -255, 96, 31, 11, 158, 12, -15, -79, 190, 46, 122, -40, 27, 53, 170, -111, -25]
7157b5R9p0MJ28j66O2j25K91k45j18N2OJ77R6l8j78L4k05J91J02k37J11O9m1j2
7182c8J53K17m01j9J47j48M01j82j46J0K8j70M25n14K96j02l4n5R3L47K1m03K5
7205d9j02j41R2M44k20j33K88q1j62k5J54j10L2j0O0j26J08j60J42M5o2K3J17
7228A24l05j4K88j6j88J47j04Q9OL3j17J59k6n3J51q0k16p8K14n6p8K37q4j04
7252g1K14o1j63J24M2K07J69o19K90M7j86J17n13M11j00K24K46n90o0L02p2Q6
7274D4j54J82l0J2J22k93K91n7j17Q8j98J21j3J4J8n9Q9o4J2l8N7J9k0o9O1o1
7300d3P9p5K6J5Lj1K3j2PK5j9K4k8K1Om6k4J7j0NL7r8J00m3k5Q5m9m2J37o0L6
7331F1l7l3M4m1pl8Q3l0M1m4oLO%%k0K7o3M2L9n0L2jmM4l4l8lN7k9n3L5L7rOm1
$$ y = [-25, 74, 4, 8, 136, -30, 32, -93, 198, -47, -165, -113, -107, 70, 166, 128, -50, -16, -221, -30, 72, -165, -54, 15, -26, -38, 115, 332, -69, -88, 59, -89, 312, 130, -16, -6, 22, -148, 277, -237, 59, -43, -77, -132, -39, 308, 329, -74, -49, -151, -292, -200, 244, 24, -109, 179, 98, -64, -89, 65, -45, -13, -23, 37, -89, 19, -141, 1, 46, -16, 7, 124, -181, -195, 93, 77, -111, 36, -68, 21, 27, 60, -57, 102, 76, 23, 174, 94, -122, -200, 14, -42, -120, 117, 33, -71, 143, 82, -81, 43, 85, 292, 461, -158, 132, 179, -7, 110, -403, 8, -92, 132, 378, -212, -272, 30, -42, 44, -110, 72, 42, 54, 176, -117, 174, 117, 0, 88, -110, 11, -2, 12, 30, -29, 60, -4, 8, -30, 27, 46, 26, -43, 18, -43, 36, -39, -13, 2, 5, -6, 17, 5, 12, 37, 18, 42, 14, 35, 41, -5, -29, -12, -22, -17, 20, -78, 22, -21, -46, 39, -10, -52, 85, 25, 61, 24, -9, 35, -6, -13, -51, 32, 2, 43, -1, -7, -4, 2, 2, 2, -18, 9, -54, -12, 27, -23, 9, 8, 4, 48, 14, -24, -27, 30, 1, -52, -17, 20, 11, 17, -24]
7367b4OJ1j4L5l7L7J5m0M4k6K3n5O3m5lJ1M9l8k8L4J7k2j4Kk3L4K3j6n0L5j2q
7399a6Mk7J5L8k5oK6j4J5J4l4j0J6L7p6O0m5P3m8J8Plm2O1m1O0m7M1p4J3mN0n2
7432a6Rj5L1k1K0j0M8m8k5K0J3orK2k6j8P5o6L6L8k8l4K6pKjm4NM9kk5l2R9n6
7466DoM6o4M0K0l4K2k2K8j2m3QQ6l3j9j6K8p8j4N8Q2kJ21k76o5j7J95J7k01R1
7496e6K2M4K42j39J42r1l6j11p1M6L8P7o4o3M9j5p9P0J1N7o0n8P4n1L5L0r1Q4
7524C6Mm4L7p1j1R2j6n2JN3p6Q2o0P2Mp7M9J8n3J1M3rJ2q2N4m4L2L5j20P4K5M6
7556F5m1l4j0l6N0M7m2mJ2jLk3N4q8P7jl5j4l6M8L0j1LJl9L1%k3k0J3N8p3O5K0
7590D6m9K7o8P2m4J2lkQj8K2l4K9k5M9l3J9j4Kn9J11m3l7J5J4jJ5J0l1J1OQlj2
$$ y = [-24, -18, -7, -21, 14, -23, 14, 29, -11, 33, 7, 30, -25, 38, -7, -10, 1, 50, 12, -16, 18, 35, 13, -1, 1, -22, 12, 35, 19, -31, 4, -8, -16, -12, -39, -24, 14, -11, -17, 9, -5, 10, 24, -10, -20, -4, 33, -43, 17, -28, 45, -3, 15, 22, 19, -23, 38, -3, 57, 10, 51, -23, -10, -14, 36, -16, -7, -22, 9, -12, 8, -2, 46, -2, -27, -7, 6, 0, -9, 13, -13, -31, 44, -22, 14, 52, 24, -10, 16, 9, 11, 10, -34, -29, 20, 18, -7, -39, 60, 4, -2, 44, -20, 20, 40, 6, 28, 6, 34, 22, -21, -13, 73, 40, 21, 5, 33, -45, -59, -1, 81, 79, 200, -76, -141, -158, 37, 54, -147, -56, -34, 10, 252, 113, 255, 164, 128, 17, -54, -8, 30, 107, 43, -20, 29, 14, -65, 5, 16, 73, 13, -45, 29, -22, 13, 43, -48, 36, 40, -4, 33, -38, -49, 43, 27, -25, -24, 29, -47, 35, -25, 47, 51, -26, 23, 41, -12, -1, 42, 33, 45, -37, 17, -27, 5, 40, -80, -6, 19, 65, 24, -10, -20, -56, -6, 41, -1, -5, 7, 6, 9, -14, 40, -48, 29, 28, -7, -21, -57, -9, 21, 10, 13, 14, -25, 6, 6, -17, -37, -24, 34, -39, 26, 46, -3, 24, -44, 28, -16, -4, -7, -9, -1, -19, 3, -31, -2, -27, 22, -11, 8, -6, -4, -63, 48, 5, -32, -17, -3, -4, 11, 21, -10, 1, 7, 15, 12, 0]
7624@J3%n0L1Pk8L5M2m1m3L0j8k0P2j5k1k8L8n6K6L9p1R1n0L7J2l6MJm3K0kK4
7657@J4J6Po5KK2J4pJ6M0q9RjK2N6m1J2n5jL2J7m9L4J8K2o2MM8m2L3j8NJ4l8M7
7692C6n2rKj8O4L4j01N2JQm6J0L4pJ6o2O2j9l3L3m5O9O2r3ljn4P2J3J1l7k8J5
7725a4JK0j7KomK4LJ3j5l8P3n1KJ7Jqn0L3Q3q1j8O2k6J1J0l6l8N3MNPm5j7J2L4
7761FNj8M1j8%Rq0P7qm1N2m9K0j3J4J3npM6j4p2L5M2J8rm6M4J5o6J7PK9k9m5M3
7796A3J1j7J1k3rJ0J3J1o7M7j1OnN6k7Km1lL0k5k0N1k7l5Q7l1k3mM9njK5q2Q2
7830D8q2P0J8j7k4J5q8O3j8j8K5K2l1jJ6m6L3k0P8l7lo7P9PPm6P2k8m3M3m2L9
7862B4k6j1L9Rm9j3OO0k9m5j1R5n9qJ8k3k8L6m6k1J26j2ol5k1M6j1Qq0M2K9KM
$$ y = [0, 13, 13, -37, -6, 1, -27, 8, 50, 9, -34, -4, -22, -42, 30, 15, -6, -34, 4, -52, -26, 13, -58, 33, -17, 20, 32, -4, 0, 1, -42, -22, -24, 0, 14, 30, 37, -28, -26, -4, 10, 3, 19, 59, -30, -21, -22, 0, 56, 15, 27, -28, -29, 3, 20, -29, 5, 23, 45, -17, -13, 35, -7, 26, 8, 13, 27, -11, 36, -16, -25, -23, -41, 23, 57, -44, 8, 9, 17, -29, -19, 15, 8, 24, -38, 24, 5, -28, 5, -40, 29, 91, -2, -5, -6, -60, 12, 25, 36, -1, -29, -14, -13, 7, -10, -8, -14, -18, 6, 9, 22, 7, -31, 42, -9, -7, 10, 11, 3, -47, -14, 69, -12, -30, 32, 6, 17, 27, -9, -47, 6, 10, 15, 22, -23, -40, -28, 6, 11, -7, 34, 16, 16, 25, -55, 22, 14, -27, 25, -24, -4, -17, -3, 10, 5, -2, 44, 30, -42, -7, 35, 53, 44, -2, 42, 57, -9, 8, 15, 44, 15, -30, 13, 24, 7, 18, -5, -14, -4, 9, 20, -47, 0, -11, -5, -10, 46, 19, 21, -20, -23, 7, -18, -38, 13, -14, -49, 38, 7, -16, -20, 29, 24, 23, 48, -34, 48, -34, 36, 54, 37, 13, 28, -60, 3, -15, -33, -8, 14, -17, -18, -2, -48, -15, -35, 43, 6, 3, -64, 15, 22, 29, -17, 55, 27, -16, 27, -15, 24, -2, -13, 26, 35, -14, -27, -21, 39, 10, -35, -46, 49, -10, -18, 0, -23, -51, -15, -61, -82, 44, 32, 26, -9, -30, 16, 5, 13, -67, -25, 4, 6, 10]
7895A0M1Mo5L6l9JN1l8mL3r1J33l5p4N8j4j2M8l6N5q8N5m1K1j8K3N1l9n1RL3o1
7927d4NJ7K9l0L1n9LL1O1m4J8K6r2K0P6k0K9Mo3mj5K7nkL8k1po0J20r5JPK0O3
7961F5p6N8l6n3L7jk0M6m9j4M9k3OK2rj4j3K4J7k0m5QN9jk6N4r6N6m1Q6n7L9L3
7994F5q9Pl8L8M2k8qk4L7kJ5K7r1J6OoK6%k9O0m0K7L2l2j6lM5n4j6L4rO0k6j3
8028A3k9mj4P0l9ml4jL1KK3k4J1k0L9K7j6J8q8K6JL7mn0O5o5O5m2j0J0J8K0o0
8061b8L9J6Pn2kOJ9K5m1m2J06p2J2K4o9R2r1N1J2m4RoM1Rn2J9M7l9JRL7p4N6Q
8095C3l7k4qM5k5P2j2p6K3J0k8N6k7pl2K6nJ0O0k7J7l8j6k6J9rrO1n9K3kKL3m8
8129b5k0P3l4K8%j1n5L0J3J4Jo3Q6j3LLm4J3PQnJ3NJ6K6m6pl2j4J6OK8o5M1J0
$$ y = [10, 51, 55, -10, 26, -13, -12, 39, 1, -3, 30, -61, 72, 37, -37, 21, 7, -5, 43, 7, 62, -26, 29, -12, 9, -9, 14, 65, 26, -25, -16, 17, -44, -39, -22, 7, -23, 8, -51, -48, -17, 44, 0, 18, 44, -48, -28, 48, 28, 57, 61, -2, -6, -21, 6, 1, -1, 37, 16, 9, -51, 69, -26, -25, -18, 2, 65, -11, 47, 11, -42, -5, -6, -26, 20, -29, -43, 6, -17, -11, 11, 2, -12, -25, -1, 16, -4, -49, -41, 18, 17, -9, 45, -51, 5, -36, 50, -7, 32, 65, -24, -17, -55, -17, 25, -3, -11, -35, 2, 0, 15, 42, -49, -33, -27, -33, -7, -7, -36, 24, -16, 11, 43, 11, -5, -8, 37, -17, -33, 1, -8, 52, 26, 13, -16, -20, -34, 36, -3, -7, -41, -42, -11, -9, 14, -10, 1, -19, 20, 47, 31, 49, -39, -13, -12, 25, 21, -29, 36, -29, 36, -6, -16, -6, 12, 32, -28, 11, 27, 34, -18, -20, -14, 5, 30, -11, -53, 53, -19, -7, 17, -52, 40, -51, 0, 12, -32, -23, -29, 12, 21, -31, -12, 35, -4, -3, 6, 43, -31, 25, 33, -4, -28, -36, 9, -16, 56, 44, -32, -9, 1, -27, 29, 2, -5, -37, -11, -16, -6, 54, 27, 44, 6, -10, -36, -17, -26, -35, 26, -33, -10, -12, -10, 23, -25, -45, 28, -6, 22, 22, 11, -44, -14, -1, 13, 14, -49, 37, 24, 27, 30, -14, -1, 6, 14, 9, 22, 27, 43, 69, 23, 16, -16, -30, -14, -8, 20, -45, -4, 6]
8164Fp7M6M2m8J6k1lK4M5j3m2L9k5J7j8Nj2M8r9Q0l8J5k9j0N3Rj1
$$ y = [6, -71, -25, 17, -31, -15, -36, -39, -15, 30, 17, -25, 14, -11, 6, -12, -7, -19, 29, -70, 10, -28, -13, -42, -52, 1, 10, -1]
8191a
$$ Imaginary data points
##PAGE= N=2
##DATA TABLE= (X++(I..I)), XYDATA
0@%%%%%%%%%%Qj6J6j6K4l2L5m3N6o4P2q8J12j36J60j86K13k51K89l30L80m36M98
33B65n64O38p20Q10r11J021j139J269j413J570j740J925k129K353k598K863l152
50a652L470l822M213m646N126n662O269o962P759q684R777j1090J2702j4740J7409
65I467k1071K6435l5175N2617j43896K33464m4404j92047K90255l63152J60774
76b6733K34437l50094J86265o928k17549L92015k11181j59991K67711k07341J43645
87D4256J20123l66841K31380M0125j69638K57290k03691q4764K77985k00121N7505
98C609O2849k32238K43412J7121k03321J66593j09818N294J92327k01708K3083
109c2797P5949j24035J62017m4547j46123J53584m0252j0928P0581j47003O6461
$$ y = [0, 0, 0, 0, 0, 0, 0, 0, 0, 0, 0, 8, -8, 8, -8, 16, -16, 19, -24, 32, -32, 40, -48, 64, -72, 88, -98, 115, -136, 153, -177, 203, -233, 265, -299, 339, -381, 429, -482, 539, -600, 669, -744, 826, -914, 1011, -1118, 1235, -1363, 1500, -1652, 1818, -2004, 2209, -2437, 2689, -2973, 3296, -3666, 4093, -4591, 5186, -5904, 6798, -7942, 9467, -11604, 14831, -20344, 32273, -111623, 121841, 77437, -114610, 175645, -187507, -26733, 207704, -142390, 43875, 36947, -180602, 211413, 232, -159759, 107952, -99389, 44256, 164379, -202462, 28918, 69043, -100595, 156695, -46996, -131760, 146225, -53896, 3609, 66458, -165780, 77632, 94753, -108568, 58025, -51793, -46499, 145828, -55880, -32797, 43152, -80883, 81134, 36587, -109536, 44048, 3796, -7132, 63449, -83554, -17093]
120a7093Q8453r4550N3782l8572n9180J16153k4261m4352K3255m1393N0747K8656
132D1645p0835J0563K0427N029K0497k8542k7194J6793K8397L637k1931j7229
144a8743k899L7702Q992m7656J6349R753q600L7928m4160j7236N0583l1360K6530
157A7183M060p7829O9146J3521n3673N9389n1901q277Q1855p8844J8034L8444
169C1108p9951Q0183l047q1908Q3521m1815q392P9654j02974L2334N5893r3805
181d9199Q0280j0133p9807J07953n2805k7914Q5097j00485M0788O2948j09809
192e3086P0916K385p3823J03377n3299l4309Q9447q7220K9577N5018j02680O8857
204A5160J0182p1721Q7982n0382k9570R1147q1942J8194N6378r4637O2258J6977
$$ y = [-17093, 71360, -23190, 30592, -7980, -67160, 48993, 24732, -19620, 3635, -37758, 12989, 41645, -29190, -18627, 1800, 6829, 27326, -1216, -28410, -11617, 16780, 20417, -1514, -18743, -21642, 16060, 25052, -22604, -6255, 3498, -5102, 32826, -11334, -28570, 22013, -9347, 17183, 21243, -56586, 12560, 26081, -27592, 31797, -20104, -28381, 53474, -25370, -7336, 31108, -48843, 31340, 28293, -53615, 29906, -11909, -20301, 59353, -43621, -11287, 44606, -49199, 31081, 20948, -58859, 49094, -3711, -31625, 53472, -47013, -6225, 56723, -53086, 17830, 20215, -53608, 49769, -3530, -37839, 51608, -35612, -6035, 48983, -53697, 15160, 25342, -46379, 41603, -8779, -38349, 52798, -29144, -10950, 45428, -49209, 13049, 30026]
216C0026p6523P9002l2501l6368Q3036o8584K594O0590p6569M1738K0452o7415
228d0522O4833j8323l8346P0189n2799n784N9339o5710K5323K9486o1793N0599
240A6492l635m5198O0798l2094k0070N6843n0035O469L8821n3363L0863J2731
252A8622m7553M7255j1574l2021N0577l1235j0238M2082m3334J4991K3869m6351
264b4910L6212J584m0315M8597j9825k3140M8345l7950j27L7311m8503K4030K0184
277B1493m8892M1137l726l6210M8463k5955j2927M3228m3424J1145K8758m9067
289b5977L3607P934m2207M5602j7970k2641M7758l8795K626L7432n0913K5321
301A777J8064m8531M3631o337l4323N0118l0555j1816M5651m4619J2052K9039
$$ y = [30026, -46497, 32505, 4, -36364, 46672, -21912, -19318, 41272, -35297, 6441, 26893, -40522, 24311, 5988, -32358, 37831, -14968, -20752, 38587, -27123, -1800, 27686, -34107, 16492, 12857, -32341, 28457, -3637, -23707, 33136, -16899, -10430, 28391, -24972, 5891, 18622, -28931, 18324, 6750, -25271, 25306, -5929, -16167, 25915, -17419, -2428, 21441, -24910, 11302, 12886, -27429, 21168, 1343, -21797, 26548, -11402, -11529, 25782, -22721, 1309, 21493, -27399, 13738, 10012, -26198, 22265, -3690, -16617, 26611, -16813, -5668, 23090, -25977, 7630, 15564, -26643, 18959, 989, -21652, 26106, -12689, -10063, 27369, -23544, 1777, 19841, -28690, 14941, 8604, -25719, 24399, -6156, -17972, 27679, -16940, -4888, 24151]
313B4151m8246L1957M632l7665M5427k0878j8726M5414m0360M737L4924m7795
325b2428K7411J3303m5039M3507j1390k9373M9620l2444q456M1898m5307J5261
337c437K5203m6002L5736N43l7303M5795k1611j7767M4372l7861M453L0424m4847
350b2302K7226R779l9696M2591j3733k5663M5229l2572l441L8228m4453J8234
362e73J9878m5034L7115j362l4198M4290k2263j4657M0115l7976R109K7472m3304
375b1388K8632M865l7077M2291j5654k0505M1551l4403K490L2397m3923K3416
387B692J3865l9792L8318r863k7597M3103k6471o011L5084m0842J4654K1842l9211
400b0229K9493p02k8517L7747j8854j2737L2297l0926R834K1482l7063K2268N244
$$ y = [24151, -24095, 7862, 12494, -25171, 20256, -622, -19348, 26066, -14294, -9557, 25367, -22428, 4983, 18286, -26753, 16754, 5364, -24009, 25611, -6833, -15289, 26609, -18698, -3437, 21766, -24236, 11500, 12043, -25260, 20535, -1076, -18843, 25529, -12332, -7879, 22545, -22302, 4924, 14703, -24993, 17598, 3865, -21798, 23431, -9141, -12582, 25646, -18807, -573, 19305, -25729, 11386, 10024, -24174, 20116, -2147, -16804, 23311, -14665, -5556, 21916, -21388, 7244, 12109, -24968, 17323, 1669, -18836, 22715, -11688, -9198, 23199, -20724, 2692, 16557, -23235, 15083, 5220, -22377, 20726, -5745, -11756, 23328, -17514, -2860, 18982, -20229, 9264, 8562, -19955, 17792, -1062, -13799, 18498, -12428, -2594, 18888, -18175, 4093, 9337]
413I337k7024L3367j4483j7665L3505k3245l13K3302l1600J4599J4042k7597K0582
426F807m069j7173K8507j4085r723K1136k0132P141J5014k5152J2159O495j7022
439a0097J9150p748j4464K3491j0278n640J5548k0077O377J7121k1771Q415N676
452E703j8619K1769k458k0738K1540p711n808K0710k3266O22K1047k0665J2078
465D204K990k5749K7930k341j8391K3810k1249K03L0119l2240O786J5090k9046
478a7884L0945k971l1821L4387j4724o850L2263l9398P772K7966l5616K5415j964
491G520l3178M4594j5644j7658L3196l6183J3599K8996m5157K4587L069k9383
503b1642M5134k3502k0891M1417l2590J0220K4244m7869K8659J1057l2174L5614
$$ y = [9337, -17687, 15680, 1197, -16468, 17037, -6208, -6521, 16781, -14819, -220, 13822, -13775, 6807, 2738, -14435, 14072, -13, -9736, 11400, -8732, -1591, 13423, -11729, 430, 6925, -10097, 9053, 1305, -13159, 10332, 54, -5586, 9962, -10115, -3738, 13383, -8388, 27, 5703, -12916, 8853, 6395, -14343, 7197, -514, -6322, 14388, -8878, -8256, 12791, -7874, 4204, 7194, -18555, 9375, 7034, -11357, 12453, -8796, -8593, 21526, -10714, -3928, 11162, -17884, 13061, 10090, -21731, 12656, -2068, -8918, 23345, -16053, -8281, 19685, -15931, 9484, 7520, -25658, 18936, 3292, -14366, 18830, -17353, -3754, 25242, -19915, 4672, 7741, -21642, 23492, -10, -20901, 20516, -12074, -1854, 22390, -25479, 3180, 14237, -17937, 17677]
515A7677k2286j5056M3116l1095K964J9126l6711L1052N527l4188L1520j5579
527c933p573L4831l4834L045K2095k7732K4058k011k8726L1644r167r040K1959
540A4616k7623Q135J9646k3419J2528k521j3917K4663j0147r215J2991j3521J0318
553B534P330j8617Q983P82m000J1504j0861m040J0066l349K371j905n953N630
567D75K239m9l924k408M845l87K395l193o204R256j202k859M895j0777O614P729
583G445j2782Q101l435o688J7694j2100m088J2985j5625J2056M828k1529J9267
596F129m695j0345K2941k1556o7K1726k4966J3700N796k5955K7839o909j6247
609a2609K6732k2845K953K2630l0775J6231O629k5934L0918j2397j6886L2077
$$ y = [17677, -4609, -19665, 23451, -7644, -4680, 14446, -22265, 8787, 14314, -19874, 11646, -3933, -11506, 23325, -11509, -8464, 13631, -14101, 9957, 7946, -20780, 10864, 1697, -7343, 14616, -13007, -4872, 14774, -8645, 3883, 1362, -12555, 12108, 1961, -7254, 5737, -7784, 2534, 9864, -8753, 230, 1012, -2988, 8516, -2345, -6385, 3681, 332, 2703, 798, -5155, 475, 2714, 2665, -1259, -3667, 1178, 791, 3186, -7, -6211, 3045, 1843, -1016, 3879, -6898, -284, 7445, -5337, 2764, -671, -7359, 10335, -1765, -5853, 7132, -8493, 3563, 8391, -13138, 6129, 1434, -8911, 14030, -7526, -7593, 14133, -10833, 2867, 8663, -17292, 10547, 3638, -12609, 14123, -8722, -5769, 16861, -13914, 2317, 8946, -16988, 13930, 1533, -15353, 16724]
621A6724k5196L387K2721l4762K0075Q761k9016L0616j2497j6555L4405k6200
633g537J081K3032l3016K0540P878k9829K9671j0729j4896L2016k6633J801K2792
646A6171l1252J9676O025k8583K9802r838j5653L0236k4255N67K3152k9068J4911
659A891Q092k5284K4857o536j5489K5367j8223q96J9650k4364J1443Q717k1816
672a2591J9677l790j4688K1999j3174m318J7928j8852O429J0396j8953J3490J107
685D660j4441J7083p004p850J6269j2467J09J1831j4953P084N618j3496J1351
698C794j303r636J3652p509m054J2674j2001K449R125j3869P976M040j2963J2107
712D482k197r517J4110q060l713J2643j2287K893Q639j3904R041K427j2253J3313
$$ y = [16724, -8472, -5085, 17636, -17126, 2949, 11710, -17306, 13310, 813, -15742, 18663, -7537, -6456, 16576, -16440, 4100, 11978, -17851, 11820, 1091, -13805, 18211, -8422, -6621, 16171, -15081, 4595, 10620, -17963, 11839, 2001, -13652, 16584, -7671, -7104, 16048, -13020, 1891, 9983, -15301, 9556, 3020, -12469, 12898, -5325, -6221, 13429, -10935, 508, 9225, -12591, 7086, 3296, -11392, 10607, -2567, -6885, 11043, -7809, -1380, 9016, -9937, 3553, 4660, -9781, 7302, 298, -7552, 8717, -3750, -3641, 8190, -6763, 321, 5939, -7557, 3794, 2491, -7145, 6507, -1002, -5056, 7618, -4383, -1934, 7191, -6678, 1298, 5338, -7625, 4482, 2285, -7232, 6878, -1182, -4895, 7748, -4539, -1646, 6993, -6911, 2130, 4557, -7696, 5617]
726E617m819p414J4231j0720m21J1247j4220O890N684j4244J2713k047j0364J5406
740G539r329l807J4236j4229L733R545j5871J0582K204j3130J4583n677o946J4400
754G833j1683P76J0694j4721Q420L977j3762J3790l855q924J5241j0410j935J2856
768H297j4323N370P329j4645J1410Oj1220J4197p001n029J3297j1825J907R352
782G122j3763Q354K929j1893J2232l970o933J2797r518n86J0295j2666N947N185
796E532j2616J0877j198r355J2935o982l977J1726j0849K144P825j1986P611J928
810C615r932J0713l757n710J0937q393k42Q697j0863N248M062j0333R049j258
824A833p369J0457n834k996R548r105K049O491j0198O405K079q864Q741k082n918
$$ y = [5617, 798, -6616, 7615, -3105, -3526, 7721, -6499, 391, 6075, -8169, 4544, 2497, -7867, 7539, -1790, -5597, 8639, -5590, -1857, 7688, -8183, 2399, 4603, -8527, 6056, 379, -6567, 7833, -3850, -3074, 7620, -7101, 1319, 5296, -8466, 5324, 1469, -7455, 7786, -2624, -4559, 8297, -6026, -656, 6673, -7972, 3438, 3444, -7776, 6421, -580, -5609, 7688, -4137, -2230, 7122, -6641, 1713, 4642, -7251, 4981, 1011, -5922, 6875, -2643, -3229, 7066, -5600, 347, 5532, -7084, 3793, 2595, -6760, 6175, -807, -4784, 6942, -3907, -1763, 6062, -5924, 1687, 3615, -6317, 4396, 639, -5071, 5866, -2527, -2769, 5928, -4935, 313, 4375, -5958, 3091, 1833, -5536, 4921, -913, -3909, 5639, -3466, -1417, 5074, -5124, 1281, 3360, -5504, 3237, 1155, -4763]
839d763R348n863j738P894q171K579M715q516O244O16p225Q654l602m278R292
854E186p444j27P872r715M110M570r847P885J16q204J0262m839l980J0064r051
869c142J277P623j0919O425K791j0555J0848l170o810J2007q961o52J0321j2560
883e477N575N329j2965J1769j665j0138J4505q591l350J3262j3883M102Q625j4843
897g745J0986L64j2083J5417p684n128J4327j4281M176R644j6535J1500J182j3248
911i108J6810q115o791J6361j4509L289J0692j7631J1515K607j4113J6343p706
924c56p173J7020j4125K047J0750j6804J1206L004j4301J5057o501o375J5849
937I298j3882J759J0503j5375J0598K182j4010J4736n057o689J4003j2258J104
$$ y = [-4763, 4585, -1278, -3016, 4878, -3293, -714, 4001, -4515, 1729, 2345, -4880, 3774, 172, -4106, 5186, -2258, -2385, 5487, -4228, -118, 4452, -5395, 2490, 2606, -5598, 4664, -175, -4155, 5909, -3142, -1865, 5758, -5161, 1264, 4055, -6500, 4348, 1178, -5632, 6375, -2586, -3238, 7083, -5477, 98, 5427, -7538, 4231, 2566, -7572, 6933, -1658, -5008, 8254, -5629, -1527, 7098, -7745, 3241, 3605, -8478, 6939, -745, -5873, 8454, -5827, -1651, 7993, -8542, 2958, 4140, -9108, 7702, -413, -7204, 9157, -5352, -2063, 8629, -9002, 2513, 5120, -8993, 7350, -356, -7529, 9491, -4634, -2587, 8163, -8641, 2565, 5569, -8732, 6325, -176, -6551, 9298, -4584, -2825, 7678, -7697, 2901, 5083, -8927, 5809, 752, -5937, 8066, -4192, -3088]
950c088J0490j3222P597J916j0983J2437m150n915J0723r445J902Q073j1551N988
964G72K016p975R661m007n178Q863o010Q03N212q508M403K807n772N050k217l138
980c218O139k859j373K589l231K204J746l319Q88L47l57J800j020j970J505J111
996I82j128P92r81j638L710m39l230L210k361m0N011n841M94L942n085M728k77
1013A849o676P687k378k802O863q301K141O993r392N639L06p972J1457m681n468
1028d735J0181r566L344P777j3805Q122K104r962J3197p096o414J4400j1009K041
1042a421Q299j5192J0391K928j2278J3079p084n036J5424j3366J756R134j4902
1055h268J1886J361j4053J4912o323n144J4858j4766K453J0726j4927J0657M34
$$ y = [-3088, 7402, -5820, 1777, 3693, -7290, 5147, 997, -4918, 5805, -3640, -1738, 6335, -5216, 772, 2788, -5187, 4474, 467, -4711, 4152, -1858, -1055, 4157, -4351, 52, 2859, -2913, 2137, -80, -3218, 2921, 62, -1311, 1278, -1953, 251, 1997, -1322, -434, -87, -444, 1356, 336, -1634, -129, 982, -146, 646, -335, -1973, 1737, 1298, -1932, 1278, -1083, -1123, 3888, -1953, -1459, 2483, -2602, 2126, 1849, -4827, 2860, 482, -2320, 4543, -3758, -1617, 5376, -4016, 1623, 1929, -6043, 5414, 733, -4735, 5446, -4120, -776, 7001, -6804, 1318, 3422, -6540, 6657, -439, -6853, 7547, -3462, -1421, 6878, -8314, 2077, 5005, -7273, 5806, -1278, -6314, 9110, -4256, -2500, 6634, -8268, 3618, 4979, -9074, 5838, -485, -5629, 9229, -5537, -3084, 7642, -7285, 3372, 3806]
1068C806j3054J5937o331n989J3513j3451L673R885j5173R549Q23j0847J4654
1081F995p328n449J2849j1594L684P595j4091R479J477r882J1974o592m224J1618
1095F511r536J858N949j0422P818Q82q008Q751m672k249Q298p896J460M720p181
1110c717N480K55o027O546k508k047N139n093R58L461m369K505M08l237L584q22
1126E16j855K328j537M2J510j493O0P11n93L00M13r32J74R47r95K51Q64j978J619
1145C52O65k596K485o29j898L476k306r63L615l779J363K334m556L533L8l649
1161b515M962k863j564N003m918J425L207n846M454J99m704O016l294j821N807
1176C548n714J509L834o686M914M38n534O678l144k615O493n702R20M389o605
$$ y = [3806, -9248, 6689, 358, -5631, 7882, -5569, -1896, 7989, -7184, 2365, 3188, -7659, 6995, -333, -5782, 7067, -4527, -843, 6752, -7339, 2140, 3617, -6265, 5709, -883, -5107, 6511, -3025, -1167, 4782, -5640, 2178, 3060, -4948, 3803, -869, -3118, 5180, -2716, -1256, 3464, -3717, 1763, 2018, -4009, 2537, 29, -2018, 3121, -1972, -1014, 2447, -1922, 583, 991, -2246, 1338, 516, -1339, 989, -548, -506, 1004, -489, -429, 282, -311, -11, 402, -530, -356, 591, -404, -153, 711, -1267, 352, 1017, -1579, 906, 277, -1621, 1855, -451, -1414, 2201, -1578, -215, 2119, -2437, 1096, 1134, -2515, 2447, -416, -1980, 3023, -1895, -470, 2737, -3109, 1345, 1544, -3160, 2856, -438, -2259, 3548, -2166, -657, 3177, -3509, 1405, 1843, -3691, 2987, -157, -2772, 3721, -1981, -1061, 3328, -3277]
1191c277M236R69n513O304k787k670O259n459P51M524o484L771J581n821N901
1206B285j793l460O075m446k93M785n730K569K328n506M842p31l757N473l246
1221f05j262M749m813J469K873n128L708L84m085M949k292k015M903m286M74L635
1237B658m935K550J658m602M226q48l070M718k975q38M056m333J538K408m718
1252b507L638N4l676M701k397j755M564m005O07L216m775K881J053m235M431j524
1268B71k382M587l401l25L826m600K070J882m433L751m99l027M335k619r18L818
1284B336m034J422K224m311L271J99l553M339j952j800M157l457K49L077m169
1299b002K300J182l715L554q79k318L826k568n50L412l766J329K032l873K956
$$ y = [-3277, 959, 1928, -3585, 2719, -68, -2738, 3521, -1938, -1187, 3337, -3147, 624, 2205, -3616, 2285, 492, -2968, 3107, -1339, -1632, 3153, -2577, -8, 2320, -3186, 1656, 925, -2832, 2641, -605, -1867, 2882, -1931, -462, 2411, -2717, 991, 1375, -2710, 2239, -53, -2068, 2835, -1451, -977, 2658, -2277, 273, 1931, -2671, 1555, 707, -2363, 2355, -620, -1458, 2598, -1735, -197, 2211, -2507, 1131, 1185, -2491, 2210, -187, -1942, 2622, -1383, -776, 2440, -2335, 546, 1599, -2636, 1795, 271, -2111, 2476, -925, -1250, 2576, -2024, 46, 1928, -2505, 1246, 747, -2280, 2055, -564, -1482, 2336, -1698, -276, 1948, -2363, 908, 1107, -2446, 1893, -59, -1859, 2298, -1159, -910, 2167, -2002, 298, 1480, -2235, 1319, 440, -1878, 1948, -620, -1170, 2242, -1524, -195, 1837, -2036, 920]
1314I20O6l024L700j676j505L684l196K61K893l916K191J072l671L548p19k607
1330a979L940k451q82L618l659J141K062l869L040L6l198L953j973j403M056l811
1346a379O20K953m318K749P87l897M076j230k356M241l367p3L683m416K084J383
1362A540m084M017p78k971M257k666m93L634m248J510K016l804L229n32k898M210
1378A939k218r98L407l733J284K351l918K468K47k695L599j624j628L133k491
1393h77P08J910l462K007P37k281K522j282j495L027j681l77J659k356J417J081
1409A257k216J147l9j028K046j086j189J737q50J73R70j793M78J203j110M63j0
1426A53j174J550J08j265Q12n26o5J608j644m21J615j263Q45N66k506J669Q82
$$ y = [920, 986, -2038, 1662, -14, -1519, 2165, -1031, -770, 2123, -1793, 398, 1470, -2201, 1347, 628, -1979, 1961, -490, -1372, 2246, -1413, -272, 1790, -2079, 961, 997, -2201, 1752, -221, -1624, 2432, -1379, -759, 2194, -2124, 625, 1412, -2485, 1591, 361, -1995, 2246, -1121, -1194, 2489, -1927, 157, 1540, -2544, 1473, 695, -2276, 1981, -685, -1178, 2456, -1792, -282, 1734, -2070, 1159, 627, -2271, 1939, -279, -1277, 2130, -1603, -319, 2032, -1886, 582, 829, -1866, 1733, 109, -1519, 1614, -877, -169, 1741, -1721, 286, 1023, -1258, 1264, -18, -1513, 1514, -167, -544, 1115, -1241, 176, 1257, -959, 188, 149, -879, 1167, 81, -1108, 629, -221, -48, 922, -871, -393, 810, -300, 163, 153, -1021, 529, 637, -628, 184, -342, -407, 1201, -443, -864, 751, -512, 333, 899, -1607, 62, 944]
1443I44j803J639j196r82L099j878m80J625k519K119R50l308K157k00j317L272
1459B122k628j106L203k445J138J141l822L418J54k697L229k519p52M280l886
1474a170O88J955l912L482L80l807L728j357j111L889m314O13L125l912K570J95
1490A042l968N208j836k001L838l934P87L762m722J849J066l639M773j994k373
1505b142M028l215P93L069m855K502J361l237L447j966j852M246k614k62K469
1520A772l630K292J148l397K468n03j771L823k936o97K785k564J439J098l190
1535a863K472k3j748K224j972J42K525k516L65J242j956J622J62k013J871n50
1551a6o49J752j414j78J025r36M76N25j491J105K59r72M83o6p90J565r79k75Q67
$$ y = [944, -859, 780, -416, -1398, 1701, -177, -657, 968, -1551, 568, 1518, -1790, 367, 167, -1150, 2122, -506, -1612, 1591, -854, 284, 1425, -2397, 1021, 1175, -1522, 1707, -812, -1564, 2716, -1170, -482, 1473, -2439, 1043, 1423, -2384, 1344, -13, -1124, 2765, -1549, -936, 2189, -1723, 847, 1042, -2926, 2282, 446, -1555, 2283, -1651, -864, 2898, -1824, 25, 1091, -2548, 2225, 231, -2142, 1886, -1329, -536, 2533, -2322, 180, 1541, -1696, 1751, -215, -2067, 2179, -435, -697, 1772, -1858, 434, 1582, -1815, 653, 150, -1621, 2202, -734, -1431, 1354, -1210, 229, 1327, -1863, 609, 586, -1162, 1062, -910, -768, 1757, -759, -394, 848, -1108, 514, 676, -1337, 534, -16, -665, 1087, -327, -505, 520, -416, 60, 585, -906, 199, 458, -514, -31, -97, -887, 678, -301, -576, 291]
1570B91q13L04P98j208L66J010j473R66k08r99J688o34r52J781j332j08J540k106
1588a089J412L86j890J973n68j451K394j503k96J968k463J127J191k662K202k95
1604D36j863K865j782p28K676k626Q52J544l084K429p3k213L062j895p02K903
1620A801k900Q46J733l180K504O4k655L164j508q82K830k888P16J894l112K261
1636F88J32k566L173j381j237K841k634N82J986l040J791M60k324K827j231j340
1652a273K777k263L21J857k837J611Q11k410K279p45j365K504j711k18J810k167
1668a019Q99J072k287J998k79j568K388j457m48J649j613M91J087j855J182L62
1684F02j602J726p03q33J819j326j67J402j664O70R11j783J273J25j311J550o61
$$ y = [291, -522, -218, 580, -628, -262, 748, -725, 241, 33, -966, 722, 88, -864, 917, -415, -523, 1017, -1089, 323, 709, -1181, 792, 224, -1227, 1167, -336, -632, 1336, -1127, 0, 1191, -1471, 731, 436, -1427, 1438, -344, -1072, 1604, -1022, -170, 1374, -1710, 719, 646, -1567, 1495, -400, -1102, 1801, -1099, -253, 1480, -1700, 804, 868, -1787, 1377, -131, -1013, 1817, -1071, -355, 1539, -1573, 688, 820, -1746, 1427, 46, -1191, 1650, -984, -402, 1584, -1456, 335, 795, -1529, 1298, 67, -1273, 1504, -759, -438, 1419, -1418, 193, 1004, -1406, 873, 128, -1237, 1267, -444, -662, 1148, -1019, -120, 952, -1335, 663, 384, -1184, 1204, -253, -701, 948, -665, -174, 913, -942, 240, 602, -1000, 726, 23, -810, 1009, -317, -484, 918, -746, -76, 835, -948, 325, 450, -861, 689, 28]
1701B8p35J563j222J34J118j652Q95O21j685J476k34j183J763r60n66J609j485
1718e15L29J108j761J137K46j528J698o46r51J862j343j57J509j809Q34P61j814
1735a040J490o7j416J927j066m87J611j696O18J112j962J426J30j767J999n03
1751C09j229J952j616J50J428j855R03O85j714J598l29j242K040j401k68J717
1767A128j930P43R99j962J537l7j506J893r66o03J792j724M27J203j954J271K96
1784F07j707J870o04j012J886j415m3J346j699Q46N53j540J439k51j203J728r65
1801a64l67J491j638N27R71j582J025P0j151J412n63o85J309j054J53R30j364
1818f80N69N78j114J047k59q06J169n40m25R48q23R6Q71j155L82M34r41J008j12
$$ y = [28, -707, 856, -366, -232, 886, -766, 129, 750, -935, 541, 307, -876, 887, -73, -639, 970, -515, -186, 922, -839, 298, 544, -984, 714, 68, -883, 979, -364, -521, 988, -821, 13, 774, -1040, 450, 383, -1033, 894, -172, -659, 952, -744, -126, 986, -976, 450, 580, -1187, 812, 309, -920, 1032, -584, -434, 994, -861, 42, 727, -987, 611, 282, -960, 1080, -321, -589, 1128, -802, -59, 940, -1022, 515, 478, -1028, 865, -101, -704, 1088, -636, -209, 994, -960, 311, 607, -1100, 770, 166, -846, 1040, -375, -418, 928, -771, 75, 628, -912, 527, 276, -927, 801, -164, -531, 960, -678, -151, 820, -762, 263, 333, -818, 594, 31, -654, 655, -399, -246, 684, -680, -111, 467, -647, 400, 141, -665, 504, -36, -461, 487, -336, -240, 631, -524, -142, 292, -649, 359, 247]
1837B47p84Q31k49o26J241j063J2J394j615M65P60j382J080J45j189J345p84l41
1855e13J567j531K20J054j614J161L92j858J727l74r54J850j671l7J750j942R22
1872A49N37j967K084l78j513K110j522r8K079k467Q90R45k072K143n94j711K548
1889A163j517k28J924k652J214J335k532K055n75j588K821j670o14K119k396J229
1905H8J151k691K077k60j480K536j925m31K200k196J109P52k479K284j71j594
1921a030K233j801o5K108k312P89Q48k041K131m18j613K087j323K7J557k136R21
1938c8P30j564J610o53j075J930j155q9J063j634R96N97j506J177l65o63J478
1955H39j021j71Q61j008P11J74j070R60j88l61P09q03R2O41n54M22n0o94M97k05
$$ y = [247, -537, 294, 45, -581, 660, -403, -391, 1003, -612, -147, 613, -769, 311, 456, -733, 612, -172, -513, 1054, -477, -257, 797, -817, 344, 736, -1122, 605, 231, -723, 1127, -544, -581, 1169, -773, 149, 686, -1281, 803, 425, -1088, 1022, -500, -598, 1481, -986, -96, 849, -1223, 920, 326, -1385, 1163, -354, -582, 1342, -1310, -96, 1239, -1293, 762, 187, -1401, 1420, -250, -864, 1255, -1141, 88, 1239, -1452, 625, 365, -1115, 1421, -504, -935, 1265, -931, 178, 930, -1549, 735, 564, -1030, 1203, -598, -663, 1445, -867, -78, 770, -1271, 860, 442, -1171, 916, -407, -380, 1177, -959, -38, 692, -872, 738, 85, -990, 940, -215, -304, 759, -875, 121, 718, -788, 389, 24, -639, 839, -182, -353, 508, -500, 211, 385, -685, 275, 87, -274, 435, -368, -276, 365, -189, 233, 183, -511, -14, -219]
1975b19m7M05m61J42L09j74r8KP2j2MM2o1K83j79j56K75j25n5K90m24J85K50n32
1999b84M93j02l81O73n52NN81p96M66K36r04R11j98o46R91p51J1R25j147M88L98
2020D17j096J194k94q97J269p66q4R65j364O47N35j168J172m25q70J545j009q1
2038c10J021j464Q36N54j426J147k68p21J413j037k26J132j204O88M13j411J154
2055B91o5p86J247r86j88J255j190L85M54j125J064j1r75J075o40j67J125j147
2073c84K46N93r56Q43m3r34R83k05l93P88q52J18P27q04L74P5o80Q63j65o27P62
2094C29m33o6O46p55P2N34n32L98k7n67N60o2l07M62m31rN78n73J42J93n22N43
2116A73O8n96N32j39k17N95n47j17N35n21K48K37o46M77J31n63O19k93l08O76
$$ y = [-219, -266, 139, -322, -180, 129, -45, -143, -141, -69, -81, -77, -35, -96, 187, 8, -148, 127, 2, -53, 237, -187, -2, 248, -284, 209, 107, -274, 399, -153, -148, 433, -363, 103, 339, -565, 346, 148, -498, 493, -258, -247, 678, -469, 19, 417, -679, 515, 221, -676, 593, -173, -257, 708, -656, -9, 526, -642, 530, 105, -765, 780, -229, -310, 711, -753, 83, 637, -789, 358, 90, -631, 782, -255, -481, 651, -553, 135, 548, -863, 291, 226, -560, 687, -299, -487, 768, -422, -37, 417, -708, 356, 345, -630, 445, -195, -362, 763, -384, -138, 455, -501, 342, 299, -635, 348, 143, -250, 538, -314, -196, 531, -273, 101, 176, -504, 359, 194, -433, 329, -104, -170, 476, -279, -207, 327, -205, 193, 166, -401, 159, 97, -210, 252, -179, -188, 390, -183, -41, 152, -370, 173, 241, -355, 177, 38, -179, 416, -131, -248, 287, -234, 14, 251, -395, 82, 213, -350, 269, -24, -332, 344]
2136C44m49n2L76n10L52K53o26N17j53l42O95m75j76O52o15J95L14p04N36K20
2156C52p96P87k06l24N69p49K01N28p52O00j85k56M52j72m39J226j515L81P19
2175D21p67L66Q4m32K76K27n28O89m27j88O75o10M9N58o90L44K24o46N84j30l94
2196c15O31m51k5M55n82K72K69n94N27n9m52N88l29k29O49n49J11L76o29M30N5
2217A49n59O69k41l07O55n13pM70n74K80K45n83M99q9l95O54n07J9N23p09L71
2238E0K39o43N74m7n24O43l57j75N65n51K00L11n94M33J5m57N82k78j56M83m51
2259a38Q4K94n05L46L2l48M08k42j29M00l78J03K76m63L52%l56M36j03k72L74
2280A71k12J6J99l00J19J15k32K45j17j48K12r1rJ49k32O9J34j40J02l8j19J29
$$ y = [344, -105, -157, 219, -291, 61, 314, -312, 205, 52, -290, 405, -70, -246, 406, -209, -14, 300, -404, 132, 352, -444, 343, 137, -187, 382, -367, -166, 362, -390, 210, 25, -231, 221, 49, -390, 836, -679, -298, 421, -346, 20, 104, -328, -52, 175, -353, 336, -91, -279, 396, -214, -165, 393, -297, 47, 271, -375, 209, 79, -315, 316, -135, -160, 295, -287, -15, 254, -340, 187, 128, -324, 264, -65, -294, 355, -194, -83, 293, -336, 94, 149, -410, 259, 18, -289, 366, -147, -154, 316, -258, 22, 267, -316, 183, 94, -301, 353, -154, -135, 388, -321, 50, 289, -354, 220, 173, -351, 292, -65, -240, 325, -226, -26, 285, -309, 124, 139, -318, 264, -14, -170, 313, -138, -54, 240, -265, 81, 113, -235, 173, -69, -198, 202, -176, -73, 203, -260, 92, 92, -264, 172, 69, -203, 171, -41, -25, 174, -126, -7, 108, -124, 121, 4, -144, 68, -23, -32, 117, -115, -46, 88, -52, 50, 12, -107, 22]
2302B2N6j06M1j5j04J93j08m4J50r6QJ36k78J04J46j70J63q5j52K46q0j10J49
2325F6j48O6J68l52K14N0k48M13k39k46M39k06p6L16n01K20K95m53L80k17j72
2346b31M93l34n9K92m29K92K12n62M61j10k32M68m05j12N07m87L49R1n86N44p1
2367I1l17M74m39MN29n38J97J46m67N49j51l29M04l21J38L94o06J77K30m27N17
2388B55j69m48N74j87j13L25m47J77K40l11K16j37j34L99J34k67n2m24N97r7n16
2409c85K77J50j28J9K29k14Q0p5j85L17q7LO3Pj74Qm0J49R9k08k6J31o1J41p5
2434A5k80K90KmN5k62J49J95k53J65pl19M59j89j66K96l10J01L92n59K81M0l55
2457b64N30k46l77O14l23j9L82o21L02K80m79N06k61k86O67m96m8M20n97M42J84
$$ y = [22, 78, -28, 13, -2, -106, 87, -21, -65, 85, -11, -3, 133, -145, -41, 105, -65, 98, 13, -139, 107, 27, -83, 66, -82, -16, 152, -200, 14, 64, -184, 229, -10, -256, 183, -23, -99, 217, -284, -64, 231, -222, 158, -59, -231, 262, -72, -131, 161, -268, 24, 236, -326, 135, 25, -207, 261, -144, -256, 251, -236, 113, 204, -382, 162, 91, -226, 248, -191, -187, 342, -196, 1, 147, -320, 229, 78, -251, 153, -168, -30, 364, -242, -65, 165, -262, 255, 86, -362, 212, 25, -88, 237, -210, -33, 207, -104, 112, -25, -159, 240, 374, 107, 55, -369, 228, 131, -385, -108, 42, -86, -67, 162, -52, 28, -47, -232, 85, -2, 1, 64, 71, -103, -95, -135, 14, 113, -95, -121, 10, -51, 90, 15, -265, 25, 27, 23, 78, -184, -35, 160, -93, 72, 65, -254, 205, 16, -150, 146, -164, -63, 329, -230, 51, 91, -264, 266, 20, -357, 257, -66, -85, 297, -324, -22, 258, -221, 285, 24, -262, 405, -91, -139, 281, -316, 126, 310]
2478C10o43M94j19l96P90n34j49N65n58L21J68p09N76j8l53N25m53m5N13n13K35
2499GK24o69N89l8m22N42m03q0N97n21O2L07n09M95k5m59M14j31j64M59m51M1
2521a35K83k53J94Jl52M20q8k01K97l27kM25l50L7J84l23L41K9l70K58j43QK49
2544A82l40P2K01j83J74Ql15K72K9j66J48j24j1K83k79L5J34k98L13J6l40K49
2566F0p5o6K25j96r1L20k19L4Q4k61J93R7k22J79j43m1K59k01pJ39k00K08J0k78
2590a92K51p8p7K83k84k3K70j86J05J2k87K72N4k52K68k26L1K30k05P4K3j86K34
2613A11o0j76K41j67N3J99k75L9J40k52J84L4k00J94Lj71J84j20OJ27j42Q3Mj41
2637a02J71p0j21K44j65J7J25j62L1J63k13J25j2j46J75q2j09K16j39lJ48j63
$$ y = [310, -333, 161, 42, -354, 436, -98, -247, 318, -240, 81, 249, -460, 116, 98, -255, 270, -183, -228, 285, -228, 7, 231, -438, 151, 113, -309, 233, -170, -250, 347, -174, -112, 195, -314, 181, 156, -303, 111, -20, -184, 275, -176, -135, 148, -105, 89, 90, -262, 158, 70, -131, 166, -161, -163, 262, -88, -51, 133, -190, 151, 180, -190, 68, -75, -67, 182, -158, -86, 115, -68, 106, 114, -201, 71, 100, -66, 82, -42, -53, 230, -49, -14, 120, -178, 135, 151, -189, 60, -15, -81, 144, -52, -143, 177, -42, -8, 76, -185, 8, 105, -117, 62, -81, -122, 137, -64, -71, 68, -132, 76, 86, -192, 59, -19, -96, 187, -97, -120, 150, -36, 69, 81, -206, 66, 120, -132, 136, -90, -59, 171, -34, 40, 63, -123, 111, 51, -125, 116, -51, 2, 201, -74, -35, 105, -147, 37, 71, -129, 65, 68, -103, 81, -39, -33, 94, -48, 35, 39, -102, 69, -1, -122, 122, -43, -26, 99, -63, -32, 131, -82, 43, 31, -115, 60, -22, -131, 85, -54, -57, 91, -72]
2659g2KJ32k00J44M8j36J02Kq3J86j48J4R2j98J23K1j36K03n3j23K29j40r7J78
2683I0j48J9J62k12J01K4j73K70j33j15K32j68l2J77k19J71N0k77K55J2k06K30
2705A10j66o5K28k38J41J04k43K57Pl02K82j21j09K81k86R3J98l03J91L8k79L23
2727A41j38j47K89k88P3J87l47K08J17k88L16j19j36K59k49L6J85k41O2J70k66
2748a76K38j4k16K97j49q7L37l10K0J41k54K04L3k32L54j65j14L05k73J9J81k63
2770a24J39Q3k39K40n3j91K37j39J3J41k07J26K9j87J62j7q8J81j04q8J89k00
2792i7L1K08j80L3P4j99K27p7j66K24n6o9J56j60j3J53j38K1J21j88J53lj59J74
2816G0j10q9K16j58K5J00k19K69K2k68J92m5j13K65k06p1K09j92J19J05k96K74
$$ y = [-72, -70, 62, -138, 6, 54, -82, 20, 22, -61, 125, -23, -9, 83, -115, 8, 29, -107, 96, 43, -80, 149, 9, -88, 90, -58, -39, 123, -89, 12, 36, -137, 133, 0, -115, 117, -51, -83, 94, -125, 46, 96, -181, 74, 86, -120, 110, -56, -121, 107, -131, 10, 114, -129, 128, 135, -167, 115, -6, -115, 166, -120, -27, 171, -132, 59, 97, -182, 141, 3, -144, 145, -143, -70, 117, -230, -22, 95, -193, 123, 4, -132, 127, -122, -86, 99, -142, -80, 90, -176, 62, 48, -168, 129, -20, -107, 230, -80, -60, 81, -173, 31, 64, -168, 186, 21, -93, 212, -61, -42, 139, -124, 15, 98, -141, 99, 46, -145, 92, -47, -34, 107, -100, 26, 55, -132, 30, 13, -75, 106, 2, -86, 103, -97, -66, 142, -38, -5, 69, -130, 97, 20, -146, 78, 22, -47, 109, -51, -64, 89, -49, -28, 93, -95, 58, 55, -104, 70, -40, -129, 87, -71, -46, 54, -165, 104, 126, -142, 50, 5, -108, 157, -49, -120, 89, -103, 16, 121, -175, 99]
2838I9m5j71K16j42p6K69k26O1J17k36K59o9j88K09j04L8J89k84N3J49k75K54
2860I7L6l23K69p7j80L18k47N4K24k69J30Jj55K35r9j63K79j74jJ57k66J76Q4
2883A06j99J88r5j07K28j17p2J30k37J75O7k13J68k2q9J69j44k0J32j31O3M9j36
2906a07J24Mj13J71j80K72p2j47J9J05j23J16J8j34J28o9k8Q1j22K7R6o6Mlk5
2931b4Q2p2J0K5l3k0P4p4K4K2m8N0j6K0K4k3n4O9j5l8P3p5k8Q7o5J8J2o5P4j0
2961Dkqo8O1Q2q5JKom7J65j88P2n1J9R3j19P2J3QmN3j49Q0k1N0j9l0k9P4p4K9
2993b2Q5p0K2J6p8P8m1r4J54l5n5J06o1K5L5j10J00L1j15J8m1k6J90j20m2J31
3019H1j66J13j0r4J47r2l9R7p9J4O1j07J52m9o2O6Qo0R1j40k5J98j26P6k9r1R6
$$ y = [99, 54, -117, 99, -43, -119, 150, -76, -15, 102, -134, 125, 56, -132, 77, -27, 11, 200, -84, -31, 118, -157, 97, 133, -190, 79, 2, -178, 140, -107, -53, 171, -98, 32, 33, -122, 113, 14, -149, 130, -44, -45, 112, -154, 22, 106, -93, 95, 0, -107, 121, 4, -68, 62, -175, 0, 67, -146, 22, 0, -89, 80, -64, -84, 48, -83, -20, 29, -107, 17, 21, -92, 79, -101, 171, 99, -48, -29, 76, -47, 69, 87, -47, 81, 12, -16, 65, -57, -30, 66, 0, 4, 1, -24, 58, -14, -4, 21, -12, -32, 42, -32, -8, 14, -34, 16, 0, 20, 44, 21, -33, 36, 21, -17, 56, -19, -47, 40, -25, -7, 5, -60, 14, 4, 2, -6, -74, -13, 69, -16, -15, -13, -19, -66, 99, -89, -17, -68, -49, 44, -75, -3, 10, 18, 14, 67, -82, -2, -23, 27, 8, -22, -51, 23, -51, -22, 63, -7, 15, 31, -47, 31, -10, -104, 50, 15, -40, 66, 5, 30, 65, -45, 55, 86, -29, -11, -52, -78, 112, -8, -50, 81, -85, 28, 18, -76, 71, -21, -60, 37, -42, -28, 33, -74, 78, 29, -33, 33, 41, -19, 72, -68, -93, 105, -21, 55, 26, -65, 31]
3046C1n4N3R3j35j9L8j1k02J54J3J14k9k27K53p2m2J44m7j31J63j90J18l9NM0
3071B1j36MJ92j62j3K70l7j41J66l61L44j20j92J19J83m3J46k33K2J01j40J45
3093A35J6k09J68l3q4K53j05j74O3j31K34k88J08J20l11K31J1J46m43K85K0l8
3115b6J02oj18J5rK6J41k06J35k31J68P7j32N0L1j08J38q2KO3or2J20j11P7mn
3142IL3J9j19R6m1mQ3j10K1R4j10M9Nn6O5l5mN2Pp9N3k2l5M7m6L6kpj9N0o8P2
3174C4L2r6J06p8j0N7p3k0P9p1Q6l3l8QrJ2K6k8l1Q6p1M3O0q3L8Pp3J03q6J5L9
3205C1j37J12lk2J75j46l4P8j06j3P9Rn0R2j00R7p1l0J63j57l2R2r1P2L3o3K5
3232CL4p9M7J5J8Qm8K8qq8N2O8r6M7mk1K4pK0Pl1k5J7p1J03k8l7J8K1j7P1l1k2
$$ y = [31, -23, 30, 123, -12, -31, 7, -4, -206, -52, -39, 75, 46, -181, 72, 0, -42, 102, 55, -76, 87, -103, 15, -24, -19, 21, -115, -111, 81, -81, -94, 176, 139, -2, 164, -197, 147, 27, -165, -46, 137, 94, 240, 7, 29, 130, -10, 135, 151, -58, 110, 77, -7, 246, 141, -33, 30, -101, 133, -155, -47, 73, -238, -7, 4, 150, -293, -8, 12, -26, 76, 70, -48, -33, -42, -16, 125, -81, 54, -177, -9, 68, -64, -14, 17, -91, 47, -35, -33, 30, 24, -68, 52, -59, 18, 14, 9, 42, 61, -58, 38, -3, -7, 76, -34, -13, 81, -29, 20, 25, -31, 34, -1, -5, 47, 54, -25, 28, 6, -29, 18, -28, 8, 6, -1, -20, 30, -38, 34, 66, -30, 76, -2, -12, 45, -28, -48, 31, -40, 46, 13, -25, -17, -26, -14, 12, -16, -47, 39, -32, 11, 71, -12, 26, 33, -40, 63, -23, -8, 31, -106, 6, 3, -19, 156, 10, -24, 54, -52, -65, 14, 23, -27, 65, -35, 62, -9, -39, 124, -33, -65, 27, -64, 8, 41, -22, 3, 37, -42, 5, 20, 38, 46, -2, 26, 18, -70, -18, 50, -46, 1, -3, -24, 0, -7, 13, 20, -11, -36, -19, -90, 13, -15, -52, -34, -13, -30, 41, 10, -12]
3265a2M0m2k4O3o3L8k4k8Q7p7J1L2KPl0J5K1Kj2j5K4rNL4p4N1n3j2J02m2n8M1
3297@j5K6j4r8P6K2mL1q0M5K7m9pQ6j00P8l1l3O7n6OR2m5j8M8m9M5m7m1P4L7j22
3329d9K0L9o0J15j30R1n1k7J23m6p5Q0m0k7P9q7L7M5j21J56r8mO1o6M7P8j74O1
3357b3N8n6K4J8o7R4n1l7J54j47K0Q3p7O1j15P5N6q2j6Q5m0M0r3oL1k1M4P7M2
3386A31k41O2P6j08N0k6K55k08j17K74r3k18L58M5p9j24n0N4M8k5j58NJ43J6j00
3411c0R3l5j0l8N8n9P7jr4N4ln6J13p2n3Q5m5QKm7L2n4O1P1o8l9J19m9k5N2r3
3442d6O8L3n1Rj6JL3Mo4KL3L0k4m6J6L4l5N6j03O8L8j10Q1Nm2O8J1r4J06n8n2
3473d5O5J4j03J21m1kk2l3O0roN6q8jP7m7j0J8m1J4L6q0P9lm3N2j3n1Q0n6K3k8
$$ y = [-12, 28, -14, -38, 25, -38, 0, -24, -52, 35, -42, -31, 1, 3, 10, -20, -5, 16, 18, 6, -9, 15, 6, 11, 45, -29, 22, -31, -43, 59, 17, -41, 0, -15, 11, -3, -101, -25, -3, -7, 24, -56, -11, 16, -33, -40, 46, -54, 24, -7, -40, 27, -29, -23, 69, 24, 6, 54, 5, 50, 3, -38, 36, 73, -49, -29, 10, -50, 65, -65, 26, -25, -52, 71, 25, -50, 30, -10, -37, 42, -45, -8, 37, -84, 72, -26, -30, 31, -35, 12, 90, -84, -23, 35, -21, 3, 21, -46, 48, -3, -40, 114, -33, -13, 70, -7, 54, -61, 14, 70, -12, -28, 57, 17, 57, -36, -42, -11, -32, 12, 89, 131, -110, -48, 28, -80, -30, -56, 199, -9, -126, 148, 55, -163, 195, 240, 161, 37, -13, 41, 89, 64, -94, -89, 54, 70, -30, 63, 28, 18, -20, 38, -21, 56, 55, -39, 15, 12, -44, 69, -3, -56, 29, -16, -8, -6, -53, -21, -75, -14, 57, -11, -50, 69, 20, -5, 47, -46, 22, 55, 4, 13, -3, -2, 31, 35, -29, -27, 6, 36, 12, -34, -18, 16, -19, 37, -66, 2, 40, -70, 11, 16, -26, 42, 53, -41, 65, 7, -45, 20, 34, -69, 52, 11, 9, -13, -46, 14, 5, -1, 55, -33, -34, 43, -4, -14, 4, -37, -23, 13, -67, 12, 9, -34, 18, 5, -46, 34, -22, 1, -27]
3505b7k1K3L4l5O7j32P1N5l6L8o9J3J06r9j7O1n0MQ0j01nJ37r0Mrk6J7J7LN3o2
3536Dk8J31j13m7P8o4L7J5m4J1J1o7J11o3oJ31j75M2Q0j04N6J6j4M7q9K8L7j8
3564Cj0N6j13R2J7q5P4l4n0K2L6o0O7k5K5j1o1P9o8K7K8J4l7J2qk2Rl4J17lp5
3595a8J8P6q1O0k4k7K5j2jM3n1N6n7k1N5m0k5P6l3r1J35j3r0N6mJ24j19k8Km2
3625e1kJ27j10L4k2M3m1k1PN1%j08P5l2K3N4p8P4l9o4P8L8M5q3k2J03k0l4k4n7
3655e6n0pJ19R2O7j26J7k41L13k25O5k6K5K02m59k0L17j84O4K01K3n6n2J56q0
3680G9j29L97L0l39K02l06m3J96j78P9M6j16L33l46o9K10q1L03l68K75j65%r3
3703h3K87k54K93j8j43k47K00j38L09l32L85L2j73j40nj22R6j8j50K65j45K70
$$ y = [-27, -48, -25, 9, -26, 41, -91, -20, 35, -1, 37, -32, -19, 87, -12, -29, 32, -18, -14, 66, -35, -40, 97, 7, 11, 2, -24, -7, 10, 13, 66, 4, -24, 107, -6, -53, 25, -39, -2, 13, -31, -20, -9, -76, 35, -28, -34, 97, -78, -36, 44, -60, -4, 12, -2, 45, -44, -16, 21, 3, -7, 49, -64, 28, 45, -40, 34, 0, -50, -28, 8, -52, 15, -10, 15, 4, -57, 22, -46, -19, 9, 23, -14, -2, -10, -32, -23, -57, 60, 57, -18, 0, 76, -5, 55, 31, 4, 29, 17, 16, 59, 8, 64, 7, -14, 41, 1, -24, 52, 19, -72, 63, 50, -40, 16, 12, 136, 17, -11, -9, -51, -53, 74, -36, -2, -24, 19, -22, -43, -36, 15, 15, -93, -18, -50, -27, 27, -51, 23, -16, -80, -2, 36, 81, -2, -24, 79, 59, 25, 1, -56, -106, -113, 6, 98, 165, 39, 56, -185, 128, -97, -32, -58, -33, 169, -290, -310, 7, -177, -113, 88, 111, 55, 3, 159, 79, -50, 347, 377, 38, 240, -66, -109, 87, -91, -12, 34, -82, 251, -95, -164, 46, -35, 268, -100, 175, 10, 10, -83, 204, -50, 243, 225, 82, -165, 35, -103, 206, -126, 259, 291, 118, -22, -27, -149, -53, -71, -221, 44, -101, 169]
3725A69l75L06J05k9k25K56o6J26n8j76j39LN0P7N4M3l7Nj57j46K3K61Q2j46j03
3750i7L03l97K35j7P3k24p2J10N4qj27M03j48j74J73M6k37J27qq6Q0N4j08L2r5
3775a08K47j42p7N3m4P8K2j09Q4L0k4m5K5K3m2L8n9O0L6n9N8l0k0K5l4K0l5kM5
3804A4l8J8Q6o6oK7k0m3M3k2N0q5J5L8m8J6M8n1%moO8kn3J3lj5QnJ5M2p3K3O2
3838D6k8K2m3j0L6Ln5P6o0O5n5j1O1m2qNM6l1m6NmO3m0L8o8j5M0J0m5P8q3j4M3
3871b1l5P5J8n8K0Jk5Q4j0n7k8j1M1k3J8K2J3k8K4j5m2J9K7qM6p9J4M7qL4l6J4
3903C3m0L3m6M3o9P2QJ2o3M4n6J7O7q9J1K4J8J9m4l2M0nL4Pk7l9K5k9L2l6M8O
$$ y = [169, -206, 100, 205, 176, -49, 207, 141, 267, 209, 33, -106, -103, -53, 24, 78, 121, 84, 89, -68, -214, -191, 70, 152, 6, -97, 206, -191, 44, 27, 100, -124, -196, -86, -32, -40, -167, 236, 88, -86, 87, 133, -104, 23, 15, -71, 9, 63, -45, -13, -108, 139, -3, -80, -27, -71, 7, 29, -80, 4, 34, 10, -35, -10, 13, -29, 9, -50, 10, 46, -13, 45, 15, -5, 20, -14, 6, -29, -31, 14, -24, -6, 80, 14, 8, 35, 15, -28, 15, -7, 43, -42, -27, 11, -37, -21, 27, -24, -24, -28, -34, 34, 32, -21, -8, -11, -26, -18, -23, -8, 34, -39, -16, 46, 18, 40, -3, -13, 23, 26, -29, 47, -13, 52, -3, -14, 47, 5, -3, 2, 48, 17, -29, -24, -28, 35, -5, 33, -35, -50, -10, 0, -45, 33, -50, -64, -21, -56, 19, 37, -21, -1, 0, -25, 59, 49, -8, -36, -47, -6, -29, -11, 11, 24, -4, 20, 5, -37, -18, 9, 1, 47, -32, -18, 29, 21, 55, 19, 33, -7, 26, -20, 23, -46, 26, 34, 46, -17, 27, -29, -12, 55, -34, -23, 1, 19, 38, -6, -38, 2, -3, 31, 38, 11, -28, -3, -32, 0, -36, 12, 18]
$$ [...]
8191f
##END NTUPLES=NMR FID
##END=
