##TITLE=1H_ABDE0806-5
 CDCl3, 8 sc, 
 1.07.2021
##JCAMPDX= 6.0         $$ Bruker NMR JCAMP-DX V2.0
##DATA TYPE= NMR FID
##DATA CLASS= NTUPLES
##ORIGIN= UXNMR, Bruker Analytische Messtechnik GmbH
##OWNER= root
$$ XWIN-NMR		Version 3.5
$$ Thu Jul  1 09:25:30 2021 Russian Standard Time (UT+4h)  she@DPX200
##.OBSERVE FREQUENCY= 200.131506
##.OBSERVE NUCLEUS= ^1H
##.DELAY= (6, 6)
##.ACQUISITION MODE= SIMULTANEOUS
##.ACQUISITION SCHEME= undefined
##.AVERAGES= 8
##.DIGITISER RES= 18
##SPECTROMETER/DATA SYSTEM= spect
##.PULSE SEQUENCE= zg30
##.SOLVENT NAME= CDCl3
##.SHIFT REFERENCE= (INTERNAL, CDCl3, 0, 15.7039)
##AUDIT TRAIL= $$ (NUMBER, WHEN, WHO, WHERE, WHAT)
$$ ##TITLE= Audit trail, XWIN-NMR		Version 3.5
$$ ##JCAMPDX= 5.01
$$ ##ORIGIN= Bruker BioSpin GmbH
$$ ##OWNER= she
$$ F:/spectra/data/she/nmr/H-F/1/audita.txt
$$ ##AUDIT TRAIL=  $$ (NUMBER, WHEN, WHO, WHERE, WHAT)
(   1,<2021-07-01 09:24:02.70 +0400>,<she>,<DPX200>,
      <created by zg, POWCHK disabled, PULCHK disabled
       configuration hash MD5:
       00 E9 B6 7A A2 85 ED C7 34 08 36 98 17 FE 4E 26
       data hash MD5: 16K
       D2 53 EA 68 72 C2 BB 24 D1 96 D5 15 42 01 E2 0F>)
$$ ##END=
$$ 
$$ hash MD5
$$ 43 59 61 61 05 66 7B 73 1C C1 86 8C 21 FB 99 B4
##$RELAX= 
##$RELAX= 
##$RELAX= 
##$RELAX= 
##$RELAX= 
##$RELAX= 
$$ Bruker specific parameters
$$ --------------------------
##$DU= <F:/spectra>
##$EXPNO= 1
##$NAME= <H-F>
##$PROCNO= 1
##$TYPE= <nmr>
##$USER= <she>
##$AMP= (0..31)
100 100 100 100 100 100 100 100 100 100 100 100 100 100 100 100 100 100 
100 100 100 100 100 100 100 100 100 100 100 100 100 100 
##$AQSEQ= 0
##$AQ_mod= 1
##$AUNM= <au_zg>
##$AUTOPOS= <>
##$BF1= 200.13
##$BF2= 200.13
##$BF3= 200.13
##$BF4= 200.13
##$BF5= 200.13
##$BF6= 200.13
##$BF7= 200.13
##$BF8= 200.13
##$BYTORDA= 1
##$CFDGTYP= 0
##$CFRGTYP= 5
##$CHEMSTR= <none>
##$CNST= (0..31)
1 1 145 1 1 1 1 1 1 1 1 1 1 1 1 1 1 1 1 1 1 1 1 1 1 1 1 1 1 1 1 1 
##$CPDPRG= <>
##$CPDPRG1= <>
##$CPDPRG2= <>
##$CPDPRG3= <>
##$CPDPRG4= <mlev>
##$CPDPRG5= <mlev>
##$CPDPRG6= <mlev>
##$CPDPRG7= <mlev>
##$CPDPRG8= <mlev>
##$CPDPRGB= <>
##$CPDPRGT= <>
##$D= (0..31)
0 1.2 0 0 0 0 0 0 0 0.06 0 0.03 0 0 0 0 0.0002 0 0 0 0 0 0 0 0 0 0 0 0 
0 0 0 
##$DATE= 1625117042
##$DBL= (0..7)
120 120 120 120 120 120 120 120 
##$DBP= (0..7)
150 150 150 150 150 150 150 150 
##$DBP07= 0
##$DBPNAM0= <>
##$DBPNAM1= <>
##$DBPNAM2= <>
##$DBPNAM3= <>
##$DBPNAM4= <>
##$DBPNAM5= <>
##$DBPNAM6= <>
##$DBPNAM7= <>
##$DBPOAL= (0..7)
0.5 0.5 0.5 0.5 0.5 0.5 0.5 0.5 
##$DBPOFFS= (0..7)
0 0 0 0 0 0 0 0 
##$DE= 6
##$DECBNUC= <off>
##$DECIM= 32
##$DECNUC= <off>
##$DECSTAT= 4
##$DIGMOD= 1
##$DIGTYP= 9
##$DL= (0..7)
0 120 120 120 120 120 120 120 
##$DP= (0..7)
150 150 150 150 150 150 150 150 
##$DP07= 0
##$DPNAME0= <>
##$DPNAME1= <>
##$DPNAME2= <>
##$DPNAME3= <>
##$DPNAME4= <>
##$DPNAME5= <>
##$DPNAME6= <>
##$DPNAME7= <>
##$DPOAL= (0..7)
0.5 0.5 0.5 0.5 0.5 0.5 0.5 0.5 
##$DPOFFS= (0..7)
0 0 0 0 0 0 0 0 
##$DQDMODE= 0
##$DR= 18
##$DS= 0
##$DSLIST= <SSSSSSSSSSSSSSS>
$$ [...]
##$SUBNAM2= <"">
##$SUBNAM3= <"">
##$SUBNAM4= <"">
##$SUBNAM5= <"">
##$SUBNAM6= <"">
##$SUBNAM7= <"">
##$SUBNAM8= <"">
##$SUBNAM9= <"">
##$SW= 20.0188882624521
##$SWIBOX= (0..15)
0 0 2 0 0 0 0 0 0 0 0 0 0 0 0 0 
##$SW_h= 4006.41025641026
##$TD= 16384
##$TD0= 1
##$TE= 0
##$TE2= 300
##$TE3= 300
##$TEG= 300
##$TL= (0..7)
0 120 120 120 120 120 120 120 
##$TP= (0..7)
150 150 150 150 150 150 150 150 
##$TP07= 0
##$TPNAME0= <>
##$TPNAME1= <>
##$TPNAME2= <>
##$TPNAME3= <>
##$TPNAME4= <>
##$TPNAME5= <>
##$TPNAME6= <>
##$TPNAME7= <>
##$TPOAL= (0..7)
0.5 0.5 0.5 0.5 0.5 0.5 0.5 0.5 
##$TPOFFS= (0..7)
0 0 0 0 0 0 0 0 
##$TUNHIN= 0
##$TUNHOUT= 0
##$TUNXOUT= 0
##$USERA1= <user>
##$USERA2= <user>
##$USERA3= <user>
##$USERA4= <user>
##$USERA5= <user>
##$V9= 5
##$VALIST= <valist>
##$VCLIST= <CCCCCCCCCCCCCCC>
##$VD= 0
##$VDLIST= <DDDDDDDDDDDDDDD>
##$VPLIST= <PPPPPPPPPPPPPPP>
##$VTLIST= <TTTTTTTTTTTTTTT>
##$WBST= 1024
##$WBSW= 4
##$XGAIN= (0..3)
0 0 0 0 
##$XL= 0
##$YL= 0
##$YMAX_a= 303380
##$YMIN_a= -411313
##$ZGOPTNS= <>
##$ZL1= 120
##$ZL2= 120
##$ZL3= 120
##$ZL4= 120
##$ABSF1= 10
##$ABSF2= 0
##$ABSG= 5
##$ABSL= 3
##$ALPHA= 0
##$AQORDER= 0
##$ASSFAC= 0
##$ASSFACI= 0
##$ASSFACX= 0
##$ASSWID= 0
##$AUNMP= <proc_1d>
##$AZFE= 0.1
##$AZFW= 0.1
##$BCFW= 1
##$BC_mod= 2
##$BYTORDP= 1
##$COROFFS= 0
##$CY= 11.3945322036743
##$DATMOD= 1
##$DC= 2
##$DFILT= <>
##$DTYPP= 0
##$F1P= 15.9154993809931
##$F2P= -4.1035820241983
##$FCOR= 0.5
##$FTSIZE= 0
##$FT_mod= 4
##$GAMMA= 1
##$GB= 0.15
##$INTBC= 1
##$INTSCL= 1
##$ISEN= 128
##$LB= 0.24
##$LEV0= 0
##$LPBIN= 0
##$MAXI= 10000
##$MC2= 0
##$MEAN= 0
##$ME_mod= 0
##$MI= 1.114404
##$NCOEF= 0
##$NC_proc= 0
##$NLEV= 6
##$NOISF1= 3.799351
##$NOISF2= 2.8
##$NSP= 1
##$NTH_PI= 0
##$NZP= 0
##$OFFSET= 15.70392
##$PC= 1
##$PHC0= -11913.2
##$PHC1= 9.800991
##$PH_mod= 1
##$PKNL= yes
##$PPARMOD= 0
##$PSCAL= 0
##$PSIGN= 0
##$REVERSE= no
##$SF= 200.130013532006
##$SI= 16384
##$SIGF1= 3
##$SIGF2= 2
##$SINO= 400
##$SIOLD= 16384
##$SREGLST= <1H.CDCl3>
##$SSB= 0
##$STSI= 0
##$STSR= 0
##$SW_p= 3612.71676300578
##$SYMM= 0
##$S_DEV= 0
##$TDeff= 0
##$TDoff= 0
##$TI= <>
##$TILT= no
##$TM1= 0
##$TM2= 0
##$TOPLEV= 0
##$USERP1= <user>
##$USERP2= <user>
##$USERP3= <user>
##$USERP4= <user>
##$USERP5= <user>
##$WDW= 1
##$XDIM= 8192
##$YMAX_p= 0
##$YMIN_p= 0
$$ End of Bruker specific parameters
$$ ---------------------------------
##NTUPLES= NMR FID
##VAR_NAME=  TIME,          FID/REAL,        FID/IMAG
##SYMBOL=    X,             R,               I
##VAR_TYPE=  INDEPENDENT,   DEPENDENT,       DEPENDENT
##VAR_FORM=  AFFN,          ASDF,            ASDF
##VAR_DIM=   8192,          8192,            8192
##UNITS=     SECONDS,       ARBITRARY UNITS, ARBITRARY UNITS
##FACTOR=    0.0002496,     1,               1
##FIRST=     0,             0,               0
##LAST=      2.0444736,     0,               0
##MIN=       0,             -411313,         0
##MAX=       2.0444736,     303380,          0
$$ Real data points
##PAGE= N=1
##DATA TABLE= (X++(R..R)), XYDATA
$$ [...]
$$ plain form
1973 76 -297 -33 -221 -435 -369 -351 -755 -568 -450 -754 -791 -638 -1113 -949 -785 -1053 -1141 -869 -1130 -1271 -1043 -970
1995 -970 -1392 -1025 -1002 -1129 -1000 -1049 -1074 -1108 -805 -925 -690 -640 -664 -690 -557 -444 -549 -356 -131 -534 -132 -3
2017 -3 -83 -32 382 245 236 459 391 406 604 739 646 878 783 1064 904 883 1035 1009 1132 1209 1027 1216 1146 1122 1087
2042 1087 1105 1139 990 874 1151 1081 886 1029 817 790 648 652 524 497 386 383 197 152 236 7 -60 -110 -393 -177
2066 -177 -275 -600 -608 -766 -537 -732 -757 -867 -812 -830 -891 -837 -1107 -970 -1344 -1002 -961 -1070 -1131 -1055 -1006 -1149 -999 -1208
2090 -1208 -1023 -923 -987 -927 -892 -726 -702 -703 -449 -440 -568 -508 -271 -304 -123 -112 -106 -148 96 251 180 385 453 462 465 487 620
2117 620 951 783 681 921 1073 939 931 1183 1008 1052 1159 1088 1067 1099 1077 1227 1123 1044 1055 1020 842 831 918 760
2141 760 761 685 608 626 508 631 479 375 118 163 18 111 -132 -327 -133 -277 -265 -421 -419 -809 -827 -506 -671 -847
$$ packed form
1973G6l73K64j88k14O6J8m04J87J18l04l7J53m75J64J64k68q8K72k61j41K28P3
1995i70m22L67K3j27J29m9k5l4L03j20K35N0k4k6J33J13j05J93K25m03M02J29
2017cq0N1M14j37rK23o8J5J98J35r3K32r5K81j60k1J52k6J23P7j82J89p0k4l5
2042A087J8L4j49j16K77p0j95J43k12k7j42Mj28k7j11lj86m5Q4k29o7n0k83K16
2066a77r8l25qj58K29j95k5j10N5j8o1N4k70J37l74L42M1j09o1P6M9j43J50k09
2090a208J85J00o4O0L5J66K4jK54Rj28O0K37l3J81J1Om2K44J55p1K05O8RLK2J33
2117F20L31j68j02K40J52j34qK52j75M4J07p1k1L2k2J50j04p9J1l5j78j1Q7j58
2141G60Jp6p7J8j18J23j52j04k57M5j45R3k43j95J94j44J2j56Kl90j8L21j65j76
$$ plain form
2165 -847 -770 -1043 -1081 -855 -898 -1301 -945 -928 -1292 -1083 -896 -1228 -1063 -769 -1133 -1345 -872 -914 -1109 -715 -711 -1049
2187 -1049 -512 -486 -957 -549 -463 -635 -385 159 -344 -491 443 43 -222 312 454 -7 591 702 -20 373
2207 373 959 424 534 1238 635 605 1261 847 711 1339 912 567 1137 1333 545 947 1357 526 1123 1176 594
2228 594 677 1259 818 360 874 869 74 994 744 -111 381 618 104 111 524 -514 -307 156 -73 -756 -210
2249 -210 -411 -899 -166 -177 -1156 -773 -194 -1056 -670 -375 -1310 -1217 -517 -816 -1202 -812 -990 -1399 -544 -521 -1423
2270 -1423 -973 -452 -1211 -735 -275 -1054 -976 13 -578 -976 -148 -386 -691 12 -48 -911 133 347 -311 199
2290 199 563 -275 203 867 472 87 765 640 351 1084 808 130 812 1263 742 890 1112 519 667 1657
2310 1657 972 518 1133 976 417 1288 1057 267 927 1289 343 361 806 20 453 1063 327 33 364 351
$$ packed form
2165h47P7k73l8K26m3m03L56J7l64K09J87l32J65K94l64k12M73m2j95L94Ml38
2187a049N37K6m71M08Q6j72K50N44n03j47R34m00k65N34J42m61N98J11p22L93
2207C73N86n35J10P04o03l0O56m14j36O28m27l45N70J96p88M02M10q31N97N3n82
2228E94Q3N82m41m58N14np95R20k50q55M92K37n14PM13j038K07M63k29o83N46
2249b10k01m88P33j1r79L83N79q62L86K95r35R3P00k99l86L90j78m09Q55K3r02
2270a423M50N21p59M76M60p79P8R89n91l98Q28k38l05P03o0q63J044K14o58N10
2290A99L64q38M78O64l95l85O78j25k89P33k76o78O82M51n21J48K22n93J48R90
2310A657o85m54O15j57n59Q71k31p90O60L62r46J8M45p86M33O10p36k94L31j3
$$ plain form
2330 351 -164 333 123 -661 -1 296 -636 -396 -68 -653 -478 -85 -955 -947 -580 -529 -859 -583 -997 -1371 -714
2351 -714 -543 -1276 -1094 -893 -1137 -861 -399 -1040 -1282 -578 -649 -883 -703 -822 -934 -407 -330 -738 -486 -317 -664
2372 -664 -250 -17 -352 -423 182 86 -46 274 34 34 595 645 218 443 532 478 604 717 381 582 906 732
2394 732 848 1094 643 962 1300 819 675 826 796 599 1075 1067 537 800 1043 523 673 592 292 467 576
2415 576 231 274 298 149 57 366 74 -169 192 245 -173 -235 -218 -472 -384 -218 -508 -743 -524 -697 -728 -567 -735
2438 -735 -1043 -660 -722 -967 -775 -795 -1060 -749 -667 -1086 -1075 -648 -781 -900 -436 -879 -1057 -336 -457 -925 -549
2459 -549 -518 -599 -500 -270 -525 -361 -198 43 -171 158 146 -85 402 394 280 441 500 410 652 711 553 623 766
2482 766 649 510 1174 763 570 1084 890 769 856 851 603 876 842 622 835 806 666 693 873 531 375 574
$$ packed form
2330C51n15M97k10p84O60K97r32K40L28n85J75L93q70QL67N1l30K76m14l74O57
2351g14J71p33J82K01k44K76M62o41k42P04p1k34J80j19j12N27P7m08K52J69l47
2372f64M14K33l35p1O05r6j32L20k40%N61N0m27K25Q9n4J26J13l36K01L24j74
2394G32J16K46m51L19L38m81j44J51l0j97M76qn30K63K43n20J50q1l00J75J09
2415E76l45M3K4j49r2L09k92k43L61N3m18o2J7k54Q8J66k90k35K19j73l1J61j68
2438g35l08L83o2k45J92k0k65L11Q2m19J1M27j33j19M64m43j78P21j21m68L76
2459e49L1q1R9K30k55J64J63K41k14L29j2k31M87qj14J61N9r0K42N9j58P0J43
2482G66j17j39O64m11j93N14j94j21Q7nk48K73l4k20K13k9j40K7J80l42j56J99
$$ plain form
2504 574 562 364 174 257 133 229 187 -224 131 7 13 -93 -104 -212 -145 -345 -476 -440 -386 -550 -590 -694 -383 -946
2528 -946 -762 -594 -766 -849 -891 -762 -879 -1003 -800 -881 -823 -640 -682 -593 -627 -654 -796 -610 -670 -619 -469 -562 -463 -284
2552 -284 -459 -314 -315 -49 -75 -65 260 13 72 255 244 184 300 412 524 367 523 477 553 570 504 767 739 817
2576 817 981 809 675 900 729 649 712 656 809 766 626 872 621 551 615 639 525 586 355 486 463 263 408
2599 408 334 152 -32 -53 -40 -84 26 -354 -177 -334 -356 -217 -473 -409 -521 -617 -736 -509 -651 -712 -636 -773 -573
2622 -573 -676 -763 -715 -743 -758 -673 -800 -853 -658 -561 -571 -645 -657 -516 -645 -574 -419 -290 -582 -293 -140 -299 -282 -61
2646 -61 -146 48 26 219 271 247 214 127 337 260 531 401 499 487 762 630 495 506 618 570 716 853 936 784
2670 784 747 731 950 802 784 766 648 530 570 732 662 529 507 587 426 225 523 132 209 99 132 -72 -2 -26
$$ packed form
2504E74j2j98j90Q3j24R6m2m11L55j24Oj06j1j08O7k00j31L6N4j64m0j04L11n63
2528i46J84J68j72q3m2J29j17j24K03q1N8J83m2Q9l4k7j42J86o0N1J50r3R9J79
2552b84j75J45jK66k6J0L25k47N9J83j1o0J16J12J12j57J56m6P6J7o6K63k8P8
2576H17J64j72j34K25j71q0O3n6J53m3j40K46k51p0O4K4j14O1k31J31k3k00J45
2599D08p4j82j84k1J3m4J10l80J77j57k2J39k56O4j12r6j19K27j42o1P6j37K00
2622e73j03q7M8k8j5Q5j27n3J95R7j0p4j2J41j29P1J55J29k92K89J53j59J7K21
2646f1q5J94k2J93N2k4l3q7K10p7K71j30R8j2K75j32j35J1J12m8J46J37Q3j52
2670G84l7j6K19j48j8j8j18j18M0J62p0j33k2Q0j61k01K98l91P7j10L3k04P0k4
$$ plain form
2694 -26 -128 -65 49 -243 -237 -317 -415 -284 -587 -717 -659 -407 -665 -680 -659 -710 -827 -490 -715 -789 -856 -658 -620 -758
2718 -758 -749 -733 -722 -613 -486 -655 -634 -641 -332 -526 -463 -375 -258 -290 -267 -11 -121 -182 39 124 147 124 154 229 294 286 247
2745 247 328 408 505 540 451 526 411 756 535 683 669 758 608 770 664 625 708 714 772 574 708 418 640 462
2769 462 575 556 491 378 495 578 374 319 533 310 272 63 185 45 -201 -48 -59 -56 -140 -72 -244 -246 -182 -644
2793 -644 -548 -574 -492 -471 -667 -755 -714 -484 -626 -711 -676 -814 -851 -497 -714 -725 -743 -603 -634 -625 -476 -560 -507 -592 -432 -416
2819 -416 -500 -307 -154 -62 -182 -150 29 -6 -222 190 291 -72 234 228 244 -20 481 306 339 549 512 380 471
2842 471 803 557 659 507 397 488 795 629 790 716 694 675 930 649 362 725 731 420 757 476 499 421 377
2865 377 227 202 236 101 60 146 -158 -10 26 -136 -136 -88 -125 -299 -238 -194 -590 -543 -313 -408 -488 -412 -694 -786 -286
$$ packed form
2694b6j02O3J14k92Oq0r8J31l03j30N8K52k58j5K1n1j17L37k25p4o7J98L8j38
2718g58RJ6J1J09J27j69K1pL09j94O3Q8J17l2K3K56j10o1K21Q5K3k3L0P5O5ql9
2745B47Q1Q0R7L5q9P5j15L45k21J48j4Q9j50J62j06l9Q3ON8j98J34k90K22j78
2769D62J13j9o5j13J17Q3k04n5K14k23l8k09J22j40k46J53j1Lq4O8j72kO4m62
2793f44R6k6Q2K1j96q8M1K30j42q5L5j38l7L54k17j1j8J40l1RJ49q4N3q5J60J6
2819d16q4J93J53R2j20L2J79l5k16M12J01l63L06oJ6k64N01j75L3K10l7j32R1
2842D71L32k46J02j52j10R1L07j66J61p4k2j9K55k81k87L63Ol11L37k81K3p8m4
2865C77j50k5L4j35m1Q6l04J48L6j62%M8l7j74O1M4l96M7K30r5q0P6k82r2N00
$$ plain form
2890 -286 -618 -596 -627 -680 -734 -409 -397 -781 -728 -501 -744 -435 -442 -636 -461 -242 -602 -565 -207 -342 -517 -265 -222
2913 -222 -294 -60 -102 -283 41 108 -21 102 346 245 174 299 234 270 599 590 345 492 637 387 683 785 366
2936 366 647 727 701 523 576 483 568 611 588 352 693 618 448 521 506 128 435 638 233 64 260 216 76 77
2960 77 -28 86 183 71 -58 -304 -111 -440 -285 -233 -334 -463 -332 -598 -382 -201 -508 -484 -449 -426 -741 -410
2982 -410 -664 -751 -621 -414 -513 -853 -459 -557 -660 -450 -725 -581 -459 -359 -480 -500 -232 -599 -238 -196 -305 -122
3004 -122 30 -169 38 211 130 -55 151 166 239 387 285 203 400 596 395 355 563 492 642 674 563 523 999
3027 999 670 783 797 636 606 760 739 474 518 514 576 694 511 411 243 417 407 260 474 246 183 249 197 -138
3051 -138 107 -17 12 27 -18 -277 -114 -195 -149 -394 -542 -446 -479 -418 -461 -585 -495 -568 -537 -698 -568 -483 -541 -590 -625
$$ packed form
2890b86l32K2l1n3n4L25J2l84N3K27k43L09pj94J75K19l60L7L58j35j75K52M3
2913b22p2K34m2j81L24O7j29J23K44j01p1J25o5L6L29rk45J47J45k50K96J02m19
2936C66K81Q0k6j78N3r3Q5M3k3k36L41p5j70P3j5l78L07K03m05j69J96m4j40J
2960G7j05J14R7j12j29k46J93l29J55N2j01j29J31k66K16J81l07K4L5K3l15L31
2982d10k54q7J30K07r9l40L94r8j03K10k75J44J22J00j21k0K68l67L61M2j09J83
3004a22J52j99K07J73q1j85K06J5P3J48j02q2J97J96k01m0K08p1J50L2j11m0M76
3027I99l29J13J4j61l0J54k1k65M4mO2J18j83j00j68J74j0j47K14k28o3O6n2l35
3051a38K45j24K9J5m5k59J63q1M6k45j48R6l3O1m3j24R0p3L1j61J30Q5n8m9l5
$$ plain form
3076 -625 -703 -678 -684 -844 -551 -599 -604 -231 -394 -530 -491 -230 -407 -239 -265 -158 -218 -264 -162 -20 -44 -170 91 46
3100 46 165 94 311 327 318 208 324 429 249 683 529 439 400 481 685 564 507 541 627 548 533 614 807 703 650
3125 650 669 538 427 553 322 409 272 340 287 287 381 196 257 187 204 -152 172 118 -86 -6 -82 -133 -149 -175 -231 -300
3151 -300 -209 -330 -317 -492 -454 -651 -518 -549 -603 -501 -574 -575 -745 -436 -536 -486 -469 -550 -450 -509 -557 -329 -344 -445 -343
3176 -343 -445 -291 -151 -230 -256 -211 -91 -37 -141 -38 249 -16 -172 113 280 176 257 217 197 254 386 431 408
3199 408 533 453 733 569 473 569 598 515 530 533 617 452 435 618 644 581 466 483 434 456 360 384 326 336 477 262
3225 262 287 66 89 24 100 152 -301 -64 -192 -147 -234 -300 -218 -372 -217 -431 -575 -238 -454 -433 -437 -555 -616 -455
3249 -455 -489 -670 -495 -456 -672 -590 -538 -414 -546 -412 -412 -612 -670 -469 -412 -415 -458 -372 -235 -299 -245 -197 -107 -159 -370 -157
$$ packed form
3076f25p8K5oj60K93m8nL73j63j36L9K61j77J68k6J07o0m6J02J42k4j26K61m5
3100D6J19p1K17J6rj10J16J05j80M34j54r0l9Q1K04j21n7L4Q6p9j5Q1J93j04n3
3125F50J9j31j11J26k31Q7j37O8n3%R4j85O1p0J7l56L24n4k04Q0p6n1j6k6n6o9
3151c00R1j21J3j75L8j97J33l1n4J02p3jj70L09j00N0J7q1J00n9m8K28j5j01J02
3176c43j02J54J40p9k6M5J20N4j04J03K87k65j56K85J67j04Q1m0k0N7J32M5k3
3199D08J25q0K80j64r6R6K9q3J5LQ4j65j7J83K6o3j15J7m9K2r6K4n8J0J41k15
3225B62K5k21K3o5P6N2m53K37j28M5q7o6Q2j54J55k14j44L37k16K1mj18o1J61
3249d55l4j81J75L9k16Q2N2J24j32J34%k00n8K01N7lm3Q6J37o4N4M8R0n2k11K13
$$ plain form
3275 -157 127 -118 141 135 -46 65 267 366 380 355 417 458 537 413 447 380 441 453 516 684 446 479 356 488 649
3300 649 429 517 495 589 586 372 677 427 286 513 578 346 292 416 250 -35 162 -31 119 243 -62 -178
3322 -178 -248 -50 -55 26 -106 -343 -360 -326 -541 -433 -191 -433 -482 -243 -513 -678 -487 -505 -663 -481 -478 -721 -480
3345 -480 -416 -531 -533 -706 -654 -534 -493 -464 -558 -371 -473 -577 -382 -216 -295 -27 -26 -302 -146 -24 -164 -216 99 171
3369 171 0 201 435 187 322 273 237 319 503 208 304 404 449 537 638 328 424 609 551 649 618 612 359 596
3393 596 665 277 302 648 459 455 577 305 291 523 314 128 278 158 42 267 258 -152 -57 -3 -128 150 85
3416 85 -390 -331 9 -247 -409 -150 -407 -565 -230 -382 -600 -528 -327 -607 -470 -250 -691 -583 -233 -611 -586
3437 -586 -500 -603 -533 -254 -353 -566 -296 -223 -265 -289 -227 -360 -347 33 -314 -226 -100 -240 -57 372 -141 -312 162
$$ packed form
3275a57K84k45K59oj81J11K02R9J4k5O2M1P9j24L4o7O1J2O3J68k38L3j23J32J61
3300F49k20Q8k2R4lk14L05k50j41K27O5k32n4J24j66k85J97j93J50J24l05j16
3322a78p0J98nQ1j32k37j7L4k15J08K42k42m9K39k70j65J91j8j58J82Lk43K41
3345d80O4j15kj73N2J20M1K9r4J87j02j04J95J66p9K68Jk76J56J22j40n2L15P2
3369A71j71K01K34k48J35m9l6Q2J84k95R6J00M5Q8J01l10R6J85n8R8l1ok53K37
3393E96O9l88K5L46j89mJ22k72j4K32k09j86J50j20j16K25rm10R5N4j25K78o5
3416H5m75N9L40k56j62K59k57j58L35j52k18P2K01k80J37K20m41J08L50l78K5
3437e86Q6j03P0K79r9k13K70P3m2k4O2j33J3L80l47Q8J26j40J83M29n13j71M74
$$ plain form
3460 162 383 186 243 212 66 320 662 352 516 592 257 350 748 387 379 457 452 552 618 464 292 463 876
3483 876 314 137 392 519 715 778 221 276 377 411 159 153 228 -61 118 270 -90 -220 3 -101 -149 -26
3505 -26 -386 -367 184 -102 -406 -240 -409 -406 -96 -173 -669 -548 -341 -543 -543 -332 -741 -610 -342 -514 -527 -289 -533
3528 -533 -755 -310 -439 -580 -496 -438 -495 -247 -115 -358 -264 -48 -120 -348 3 24 -83 215 91 -131 64 262
3550 262 177 171 362 76 385 502 281 176 281 447 434 441 534 240 307 815 318 596 568 251 301 551 485 419
3574 419 288 376 358 581 452 163 396 295 342 273 251 0 67 301 209 -33 -19 36 -135 -84 -259 -320 -139 -184
3598 -184 -254 -228 -446 -520 -306 -304 -449 -538 -410 -429 -432 -351 -520 -630 -440 -478 -507 -405 -165 -543 -397 -346 -586 -555 -290
3623 -290 -296 -340 -183 -357 -395 -69 -144 -319 -159 -107 -256 -41 76 -109 66 242 285 183 13 129 128 211 241 152
$$ packed form
3460A62K21j97N7l1j46K54L42l10J64P6l35R3L98l61qP8nJ00O6j54j72J71M13
3483H76n62j77K55J27J96O3n57N5J01L4k52oP5k89J79J52l60j30K23j04m8J23
3505b6l60J9N51k86l04J66j69LL10p7m96J21K07k02%K11m09J31K68j72j3K38k44
3528e33k22M45j29j41Q4N8n7K48J32k43R4K16p2k28L51K1j07K98j24k22J95J98
3550B62q5oJ91k86L09J17k21j05J05J66j3PR3k94O7N08m97K78k8l17N0K50o6o6
3574D19j31Q8j8K23j29k89K33j01M7o9k2k51O7K34r2k42J4N5j71N1j75o1J81m5
3598a84p0K6k18p4K14Kj45q9J28j9lQ1j69j10J90l8k9J02K40l78J46N1k40L1K65
3623b90om4J57j74l8L26p5j75J60N2j49K15J17j85J75J76M3j02j70J16jQ3L0q9
$$ plain form
3647 152 279 162 283 363 541 388 565 563 520 616 515 343 509 634 631 412 412 486 221 457 434 359 217 509
3671 509 173 282 115 280 173 208 231 -119 19 -11 -16 88 44 -172 -221 -85 -239 -224 -127 -179 -422 -258 -296 -399
3695 -399 -370 -440 -377 -315 -375 -489 -582 -468 -589 -408 -487 -404 -480 -505 -504 -485 -393 -562 -425 -307 -286 -323 -332 -108 -294 -195
3721 -195 -161 -203 -9 -69 -8 213 154 95 140 152 184 76 281 159 108 255 231 267 244 442 324 376 534 632 482
3746 482 418 371 525 364 416 430 474 372 327 396 458 452 265 387 346 353 253 229 69 245 198 176 136 62 62 -226 -24
3773 -24 -261 -17 -102 -99 -66 -279 -248 -118 -159 -330 -542 -566 -360 -534 -371 -412 -427 -356 -462 -288 -483 -284 -415 -366
3797 -366 -449 -296 -408 -351 -349 -330 -349 -432 -244 -393 -207 -339 -91 58 -37 -87 -96 -217 -53 -65 16 94 137 44 54 78
3823 78 163 77 433 346 254 411 477 224 406 367 320 416 600 409 223 544 480 472 543 527 257 337 462 419 324 459
$$ packed form
3647A52J27j17J21Q0J78j53J77km3R6j01j72J66J25lk19%P4k65K36k3p5j42K92
3671E09l36J09j67J65j07L5K3l50J38l0nJ04m4k16m9J36j54J5R7n2k43J64l8j03
3695c99K9p0O3O2o0j14r3J14j21J81p9Q3p6k5JJ9R2j69J37J18K1l7rK24j86R9
3721a95L4m2J94o0O1K21n9n9M5J2L2j08K05j22n1J47k4L6k3J98j18N2J58R8j50
3746D82o4m7J54j61N2J4M4j02m5O9O2oj87J22m1Pj00k4j60J76m7k2m0p4%k88K02
3773b4k37K44q5LL3k13L1J30m1j71k12k4K06j74J63m1j5P1j06J74j95J99j31M9
3797c66q3J53j12N7KJ9j9q3J88j49J86j32K48J49r5n0rj21J64j2Q1P8M3r3J0K4
3823G8Q5q6L56q7r2J57O6k53J82l9m7R6J84j91j86L21o4qP1j6k70Q0J25m3r5J35
$$ plain form
3849 459 295 295 344 252 106 213 251 24 267 221 40 43 132 -182 -192 -61 -157 -213 -168 -334 -222 -281 -269 -383 -322
3874 -322 -327 -241 -378 -299 -360 -445 -324 -486 -487 -506 -459 -447 -514 -355 -548 -353 -296 -372 -212 -323 -267 -301 -295 -223 -382 -104
3900 -104 -178 -76 -59 21 -56 30 180 -68 157 94 -4 336 334 186 280 404 393 257 401 493 377 592 614 208
3924 208 569 507 280 527 561 363 423 577 343 180 460 200 272 414 433 -9 289 301 122 455 97 19
3946 19 78 420 267 78 15 -20 -239 137 -271 -305 47 85 -148 -255 -154 -521 -139 -57 -638 -552 -416 -400 -278
3969 -278 -359 -312 -689 -70 -335 -556 -391 -444 -619 -401 -176 -276 -361 -177 -338 -301 -106 -363 -463 -118 -59 -332
3991 -332 194 156 -107 160 326 -118 -161 153 78 124 323 128 171 268 223 112 297 420 57 406 617 189
4013 189 269 511 258 267 690 331 271 593 367 265 523 116 237 691 472 -44 162 458 224 165 239 -93
$$ packed form
3849D59j64%M9r2j46J07L8k27K43m6j81LQ9l14j0J31r6n6M5j66J12n9J2j14O1
3874c22nQ6j37P9o1q5J21j62jj9M7J2o7J59j93J95N7p6J60j11N6l4OP2j59K78
3900a04p4J02J7Q0p7Q6J50k48K25o3r8L40kj48R4J24j1j36J44R2j16K15K2m06
3924B08L61o2k27K47L4j98O0J54k34j63K80k60P2J42J9m42K98J2j79L33l58p8
3946A9N9L42j53j89o3l5k19L76m08l4L52L8k33j07J01l67L82Q2n81Q6J36J6J22
3969b78q1M7l77O19k65k21J65n3j75K18K25j00q5J84j61L7J95k57j00L45N9k73
3991c32N26l8k63K67J66m44m3L14p5M6J99j95M3R7m5j11J85J23l63L49K11m28
4013A89Q0K42k53RM23l59o0L22k26j02K58m07J21M54k19n16K06K96k34n9P4l32
$$ plain form
4035 -93 46 377 109 -183 62 -5 -313 196 13 -419 -271 0 -258 -248 74 -715 -430 61 -304 -594 -268
4056 -268 -393 -459 -59 -314 -775 -363 -196 -471 -252 -276 -722 -545 -91 -342 -446 -367 -263 -327 -178 -259 -562 -116
4078 -116 2 -235 -128 -85 -403 -138 325 -210 -280 41 68 60 387 231 -11 409 438 186 257 354 109 418 652
4101 652 320 237 518 241 447 644 281 199 612 506 298 408 569 4 431 464 -138 250 381 194 100
4122 100 324 40 -35 300 321 -208 99 94 -186 50 85 -251 -282 -49 -216 -201 -85 -363 -376 -14 -140 -692 -272
4145 -272 -354 -468 -246 -152 -577 -464 -233 -422 -434 -240 -338 -461 -196 -373 -523 -322 -418 -471 -113 -191 -576 -205
4167 -205 102 -286 -172 4 -230 -34 -96 -26 -136 202 -52 -74 267 255 -138 242 305 358 208 395 321 272 619
4190 619 165 250 374 644 352 519 446 144 356 448 358 527 473 230 417 383 337 193 274 310 93 332 234
$$ packed form
4035i3J39L31k68k92K45o7l08N09j83m32J48K71k58J0L22p89K85M91l65k90L26
4056b68j25o6M00k55m61M12J67k75K19k4m46J77M54k51j04P9J04o4J49q1l03M46
4078a16J18k37J07M3l18K65M63n35p0L21K7qL27j56k42M20K9k52P1R7k45L09K34
4101F52l32q3K81k77K06J97l63q2M13j06k08J10J61n65M27L3o02L88J31j87r4
4122A00K24k84p5L35K1n29L07nk80K36L5l36l1K33j67J5J16k78j3L62j26n52M20
4145b72q2j14K22R4m25J13K31j89j2J94r8j23K65j77j50K01r6n3L58p8l85L71
4167b05L07l88J14J76k34J96o2P0j10L38k54k2L41j2l93L80O3N3j50J87p4m9L47
4190F19m54Q5J24K70k92J67p3l02K12R2r0J69n4k43J87l4m6j44Q1L6k17K39r8
$$ plain form
4213 234 -45 339 234 28 128 27 -34 -47 173 -137 -314 -18 -2 -86 -197 -277 -279 -280 -348 -404 -350 -248 -330 -236 -100
4238 -100 -162 -415 -313 -423 -503 -382 -439 -619 -385 -167 -382 -280 -286 -462 -198 -210 -397 -282 -214 -158 -325 -84 -11
4261 -11 -208 -15 -76 -76 44 93 -102 248 151 135 194 241 290 250 175 338 402 332 202 343 363 432 149 392 363 331
4287 331 367 325 330 436 421 501 381 423 336 337 407 250 221 284 238 73 19 -23 22 74 148 0 -33 126 91 -167 -258
4314 -258 -130 -200 -238 -166 -179 -192 -162 -220 -466 -129 -251 -206 -299 -380 -337 -326 -318 -366 -283 -426 -261 -238 -312 -334 -323 -302 -290
4341 -290 -220 -338 -360 -425 -133 -97 -374 -34 24 -119 -179 -210 11 78 176 -116 69 184 78 132 25 1 168 214
4365 214 223 391 233 204 414 271 319 265 419 300 245 390 472 330 252 361 305 192 244 376 274 205 383 143
4389 143 240 159 235 181 29 119 173 130 210 16 -162 -15 -94 -68 -28 -131 -110 -17 -273 -190 51 -370 -258 -97 -345
$$ packed form
4213B34k79L84j05k06J00j01o1j3K20l10j77K96J6q4j11q0kjo8n6N4J02q2R4J36
4238a00o2k53J02j10q0J21n7j80K34K18k15J02oj76K64j2j87J15O8N6j67K41P3
4261a1j97J93o1%J20M9j95L50r7j6N9M7M9m0p5J63O4p0j30J41K0O9k83K43k9l2
4287C31L6m2NJ06j5Q0j20M2q7JP0j57k9O3m6j65n4m2M5N2P4j48l3J59l5k58r1
4314b58J28p0l8P2j3j3L0n8k46L37j22M5r3q1M3J1Qm8Q3j43J65K3p4k2J1K1J2
4341b90P0j18k2o5K92L6k77L40N8j43o0l1K21O7R8k92J85J15j06N4j07k4J67M6
4365B14RJ68j58k9K10j43M8n4J54j19n5J45Q2j42p8J09n6j13N2J32j02o9J78k40
4389A43R7q1P6n4j52R0N4m3Q0j94j78J47p9K6M0j03K1R3k56Q3K41m21J12J61k48
$$ plain form
4414 -345 -222 -324 -145 -417 -201 -280 -207 -132 -155 -316 -357 -254 -305 -491 -327 -262 -455 -251 -283 -150 -208 -123 -288
4437 -288 -109 -171 -114 -272 23 80 51 134 9 -37 202 -124 -1 227 264 59 320 272 168 165 409 182 274 461
4461 461 271 320 394 412 372 338 279 277 515 354 401 214 295 66 511 360 17 311 260 78 189 391 32 -17
4485 -17 279 115 -171 80 -116 -270 -38 90 -158 -166 -83 -211 -184 -64 -478 -263 -52 -161 -352 -289 -116 -563
4507 -563 -246 -192 -460 -358 -159 -507 -380 -298 -531 -521 27 -191 -474 -234 -281 -411 -182 -35 -388 -267 261
4528 261 -261 -7 -113 -339 -151 152 -66 -142 199 6 -34 312 225 -57 -4 424 140 177 467 -1 135 517
4550 517 298 149 451 323 289 421 409 217 425 601 397 472 413 200 166 562 183 12 147 161 27 256
4572 256 0 -302 168 254 171 63 177 -113 12 195 -229 -277 45 -167 -174 100 -302 -451 -132 -27 -469 -400
$$ packed form
4414c45J23j02J79k72K16p9P3P5k3j61m1J03n1j86J64O5j93K04l2J33n8Q5j65
4437b88J79o2N7j58K95N7k9Q3j25m6K39l26J23K28L7k05K61m8j04lK44k27R2J87
4461D61j90M9P4J8m0l4n9kK38j61M7j87Q1k29M45j51l43K94n1j82J11K02l59m9
4485a7K96j64k86K51j96j54K32J28k48qQ3j28K7J20m14K15K11j09j91O3J73m47
4507e63L17N4k68J02J99l48J27Q2k33J0N48k18k83K40m7j30K29J47l53J21N28
4528B61n22K54j06k26J88L03k18p6L41j93m0L46q7k82N3M28k84L7K90m68J36L82
4550E17k19j49L02j28l4J32j2j92K08J76k04P5n9k13l4L96l79j71J35J4j34K29
4572B56k56l02M70Q6q3j08J14k90J25J83m24m8L22k12pK74m02j49L19J05m42O9
$$ plain form
4594 -400 -353 -358 -170 -2 -595 -544 -59 -51 -225 -42 -400 -590 57 -65 -542 -132 -190 -546 -60 91 -381 -412 -71
4617 -71 -92 -54 226 -311 -341 141 162 -370 -83 -114 -167 154 434 -96 -66 524 96 8 417 9 60 669 210
4640 210 296 189 374 22 428 285 -88 74 535 214 140 381 111 19 618 227 -91 356 266 165 529
4661 529 196 -172 203 176 80 12 261 -217 -93 451 71 -388 204 -63 -219 -75 17 -469 -240 154 -433
4682 -433 -229 -195 -377 -271 -79 -271 -463 -138 -307 -289 -117 -238 -442 -70 73 -515 -135 -114 -383 -160 139
4703 139 -90 -437 14 -31 -256 172 -317 -257 24 187 -253 -40 115 -97 -5 332 26 -63 332 209 97
4724 97 97 117 158 292 296 62 313 402 254 338 380 236 168 458 359 100 319 202 -30 410 414 -16 210 363 -62
4749 -62 159 305 -102 129 236 39 -227 -107 78 -165 220 -97 -241 -103 -53 -109 -22 -91 -362 -165 -92 -50
$$ packed form
4594d00M7nJ88J68n93N1M85Qj74J83l58j90O47j22m77M10n8l56M86J51m72l1L41
4617g1k1L8K80n37l0M82K1n32K87l1n3L21K80n30L0N90m28q8M09m08N1O09m59
4640B10Q6j07J85l52M06j43l73J62M61l21p4K41k70r2N99l91l18M47r0j01L64
4661E29l33l68L75k7r6o8K49m78J24N44l80m59N92k67j56J44R2m86K29L94n87
4682d33K04L4j82J06J92j92j92L25j69J8J72j21k04L72J43n88L80K1k69K23K99
4703A39k29l47M51m5k25M28m89O0K81J63m40K13J55k12R2L37l06q9L95j23j12
4724I7%K0M1J34Mk34K51Q9j48Q4M2j44o8K90r9k59K19j17k32M40Mm30K26J53m25
4749f2K21J46m07K31J07j97k66J20J85k43L85l17j44J38N0n6Q7o9k71J97P3M2
$$ plain form
4771 -50 -88 -121 -378 -423 -172 -68 -450 -232 -200 -162 -205 -297 -453 -298 -320 -443 -364 -210 -305 -349 -162 -345 -403 -207
4795 -207 -123 -249 -109 -4 -237 -162 134 -144 -75 -35 -118 65 145 62 -30 217 134 42 171 223 69 101 428 118
4819 118 351 424 110 266 460 368 205 451 121 234 398 378 167 264 371 232 332 216 109 102 316 55
4841 55 74 217 132 21 265 149 -53 60 48 25 -67 65 -35 -250 -60 -130 -51 -106 -160 -266 -203 -189 -356 -123
4865 -123 -291 -312 -259 -218 -548 -443 -259 -237 -409 -233 -340 -325 -144 -163 -388 -177 -190 -137 -371 -172 -167 -303 -46
4888 -46 -185 -272 60 -106 -7 79 -32 4 -178 96 -67 168 137 155 7 110 100 72 319 -69 294 231 191 77
4912 77 185 431 270 224 90 232 406 276 171 151 361 308 243 185 259 132 272 68 139 20 101 77 94 146
4936 146 201 -11 146 -54 -83 -194 -1 -124 -148 5 -164 -181 -22 -233 -9 -108 -245 -276 -98 -248 -431 -85
$$ packed form
4771e0l8l3k57m5K51J04l82K18L2L8m3r2j56J55k2j23P9J54r5m4J87j83n8J96
4795b07Q4j26J40J05k33P5K96k78O9M0q3J83Q0q3r2K47q3r2J29N2j54L2L27l10
4819A18K33P3l14J56J94r2j63K46l30J13J64k0k11R7J07j39J00j16j07pK14k61
4841E5J9J43q5j11K44j16k02J13j2k3r2J32j00k15J90p0P9n5n4j06O3J4j67K33
4865a23j68k1N3M1l30J05J84K2j72J76j07J5J81j9k25K11j3N3k34J99Nj36K57
4888d6j39q7L32j66R9Q6j11L6j82K74j63K35l1J8j48J03j0k8K47l88L63o3m0j14
4912G7J08K46j61m6j34J42J74j30j05k0K10n3o5n8P4j27J40k04P1j19Q1k4J7N2
4936A46N5k12J57k00k9j11J93j23k4J53j69j7J59k11K24r9j37l1J78j50j83L46
$$ plain form
4958 -85 -242 -245 -271 -178 -33 -124 -377 -302 -213 -235 -165 -136 7 -91 -113 -158 -248 -260 -21 -207 -262 -191 42 -105 42 -107
4984 -107 -195 -110 -13 73 -125 116 48 175 189 309 286 112 105 280 211 238 65 209 301 245 384 226 77 137 319
5009 319 41 207 350 41 117 321 204 114 143 36 -20 63 248 78 134 106 -123 -6 42 10 -95 257 43
5032 43 -167 37 75 -341 181 -58 -241 -95 136 -381 -173 -182 -439 -411 -13 -198 -370 -90 -257 -263 -174 -247 -390
5055 -390 -107 -19 -301 -323 -282 -237 -202 -65 -234 -255 -118 -39 -246 40 71 -450 -69 140 -98 -144 135 40 -82
5078 -82 193 -11 145 267 35 48 397 229 -36 331 373 256 272 194 45 238 332 169 17 390 -38 125
5100 125 419 210 17 223 195 83 247 271 104 35 475 65 124 252 27 -231 274 -145 -280 204 170 -267
5122 -267 -45 12 -306 -142 67 -393 -431 84 -132 -227 2 -147 -331 23 -15 -400 -235 -286 -556 29 -122 -593
$$ packed form
4958h5j57lk6R3J45r1k53P5Q9k2P0K9J43r8k2m5r0j2K39j86n5P1K33j47J47j49
4984a07q8Q5R7Q6j98K41o8J27J4J20k3j74pJ75o9K7j73J44R2n6J39j58j49O0J82
5009C19k78J66J43l09P6K04j17r0K9j07n6Q3J85j70N6k8k29J17M8l2j05L52k14
5032D3k10K04L8m16N22k39j83J46K31n17K08rk57K8L98j85j72K80j67oQ9p3j43
5055c90K83Q8k82k2M1M5L5J37j69k1J37P9k07K86L1n21L81K09k38m6K79r5j22
5078h2K75k04J56J22k32J3L49j68k65L67M2j17J6p8j49J93R4j63j52L73m28J63
5100A25K94k09j93K06k8j12J64K4j67o9M40m10N9J28k25k58N05m19j35M84l4m37
5122b67K22N7l18J64K09m60l8N15k16r5K29j49j84L54l8l85J65n1k70N85j51m71
$$ plain form
5144 -593 -272 -114 -323 -317 29 -386 -503 236 -24 -383 83 -80 -239 57 90 -365 -130 79 -147 -155 157 -85
5166 -85 -93 270 -91 -349 89 251 -148 284 266 -128 427 411 159 163 381 111 129 461 163 -56 359 149 59
5189 59 344 98 -34 141 311 192 321 395 86 97 457 149 -96 221 107 41 263 24 -192 154 276
5210 276 -94 -113 26 -235 173 189 -337 -240 6 6 -291 69 -97 -338 21 155 -380 -232 14 -335 55 -57
5232 -57 -306 -265 -185 -284 -366 34 -223 -400 -102 158 -314 -17 89 -302 55 53 -336 -221 4 -39 -156 45 120
5255 120 -193 151 250 -264 -61 200 -34 188 248 23 180 286 130 36 220 232 -103 387 268 -17 182
5276 182 258 65 328 296 220 87 410 111 43 370 172 -36 205 -62 -137 125 89 78 166 95 -41 142 192
5299 192 10 -13 63 -125 -96 151 -58 -347 -40 -30 -268 49 -101 -364 -100 4 -338 -218 50 -379 -269
$$ packed form
5144e93L21J58k09OL46m15j17P39k60l59M66j63j59K96L3m55K35K09k26qL12k42
5166h5qL63l61k58M38J62l99M32j8l94N55j6k52MK18k70J8L32k98k19M15k10r0
5189E9K85k46j32J75J70j19J29P4l09J1L60l08k45L17j14o6K22k39k16L46J22
5210B76l70j9J39k61M08J6n26R7K46%k97L60j66k41L59J34n35J48K46l49L90j12
5232e7k49M1Q0r9q2M00k57j77K98K60m72K97J06l91L57kl89J15K25m3j17K01P5
5255A20l13L44R9n14K03K61k34K22O0k25J57J06j56r4J84J2l35M90j19k85J99
5276A82P6j93K63l2p6j33L23k99o8L27j98k08K41k67p5K62l6j1Q8p1j36J83N0
5299A92j82k3P6j88K9K47k09k89L07J0k38L17j50k63K64J04l42J20K68m29J10
$$ plain form
5320 -269 -54 -214 -108 -123 -139 -269 -207 -173 -397 -73 43 -206 -53 91 -157 -247 124 -139 -200 56 -93 -155
5342 -155 125 -108 -59 180 217 -112 -7 126 79 158 369 75 118 254 77 56 215 211 170 407 221 70 267
5365 267 175 -38 170 309 95 11 156 163 181 234 143 80 291 133 77 26 246 -99 57 49 -114 27 -95 -93 -29
5390 -29 -149 -1 -122 100 -222 -33 -139 96 -107 -83 -132 -257 -211 -226 -213 -217 -224 -230 -379 -64 -147 -252 -100 -73 -127
5415 -127 -312 -168 -54 -264 -96 -170 -184 -68 -51 -57 -86 -10 -90 -175 -43 -42 -56 31 36 20 15 -85 -167 -140 120 45 103
5442 103 38 170 102 267 243 44 149 231 84 73 229 96 164 215 118 258 328 92 149 421 305 222 193 230
5466 230 106 171 243 314 129 256 153 147 30 69 36 -67 39 146 18 -132 46 135 -146 -94 26 -270 62
5489 62 -92 -103 -237 -163 -132 -70 -250 -77 -126 -238 -348 -240 -348 -18 -150 -319 -83 -269 -251 -338 -176 8 -3
$$ packed form
5320b69K15j60J06j5j6j30O2L4k24L24J16k49J53J44k48r0L71k63o1K56j49o2
5342a55K80k33M9K39L7l29J05J33m7P9K11k94M3J36j77k1J59mm1K37j86j51J97
5365B67r2k13K08J39k14q4J45PJ8N3r1o3K11j58n6n1K20l45J56qj63J41j22KO4
5390b9j20J48j21K22l22J89j06K35k03K4m9j25M6j5J3mpoj49L15q3j05J52K7n4
5415a27j85J44J14k10J68p4j4J16J7ok9P6q0q5J32Jj4Q7Nj6nj00q2K7K60p5N8
5442A03o5J32o8J65k4j99J05Q2j47j1J56j33O8N1r7J40P0k36N7K72j16q3k9L7
5466B30j24O5P2P1j85J27j03oj17L9l3j03J06J07j28j50J78Q9k81N2J20k96L32
5489F2j54j1j34P4L1O2j80J73m9j12j10J08j08L30j32j69K36j86J8q7J62J84j1
$$ plain form
5512 -3 -96 -148 -90 -84 -90 -98 -81 -63 -230 -47 -54 -6 -181 101 56 147 -45 101 96 96 96 64 225 125 64 88 159 203 244 212
5542 212 -3 93 184 -53 172 244 62 259 145 156 208 139 -102 127 40 219 33 192 190 148 -107 79 32 155
5566 155 129 -9 -103 -29 -76 13 -45 -83 -71 99 -192 -218 74 -99 -151 -47 -99 -235 -192 122 40 -273 3 -422
5590 -422 -162 -89 -169 -142 32 -101 -181 49 -161 1 -73 -184 -192 -140 -32 -225 -221 121 -97 -29 94 -18 -200 71
5614 71 91 -207 150 102 -102 113 76 -50 203 135 15 -114 327 200 77 304 14 21 382 99 155 323 192
5637 192 188 327 249 -8 263 450 25 152 299 79 96 364 237 -29 218 162 -88 100 390 35 73 164
5659 164 -37 -62 109 4 -221 245 119 -284 -30 -176 -274 39 -77 -216 -60 -120 -142 -235 15 -365 -249 -40
5681 -40 -210 -419 -76 -3 -345 12 62 -354 -82 92 -110 -257 -67 -313 -377 125 -149 -221 218 111 -81 64
$$ packed form
5512cr3n2N8OoqJ7J8j67J83pM8j75K82m5R1j92J46n%%l2J61j00o1K4P1M4M1l2
5542B12k15R6R1k37K25P2j82J97j14J1N2o9k41K29q7J79j86J59km2k55J86m7J23
5566A55k6j38r4P4m7Q9n8l8J2J70k91k6K92j73n2J04n2j36M3L14q2l13K76m25
5590d22K60P3q0K7J74j33q0K30k10J62p4j11qN2J08j93ML42k18O8J23j12j82K71
5614G1K0k98L57m8k04K15l7j26K53o8j20j29M41j27j23K27k90PL61k83N6J68j31
5637A92mJ39p8k57K71J87m25J27J47k20J7K68j27k66K47n6k50J88K90l55L8R1
5659A64k01k5J71j05k25M66j26m03K54j46r8L13j16j39J56o0k2r3K50l80J16K09
5681d0j70k09L43P3l42L57N0m16K72J74k02j47J90k46o4N02k74p2M39j07j92J45
$$ plain form
5703 64 -50 -63 104 316 -118 78 219 48 -123 234 13 -138 463 118 70 374 264 -180 352 530 -4
5724 -4 348 477 -8 98 499 -48 4 370 156 98 203 8 -17 244 613 -96 86 189 13 22 421 -51
5746 -51 -35 130 351 -280 263 41 -135 281 110 -439 81 12 -260 72 81 -386 -193 -15 -94 -329 -14 -248
5768 -248 -436 -37 -127 -337 -154 -57 -406 -108 -89 -421 -381 -86 -254 -326 2 -231 -271 299 -119 -426 -388 130
5790 130 -121 16 36 -296 -82 183 -164 -118 -9 -70 -183 263 43 -143 321 34 47 204 188 -54 133 469
5812 469 -17 154 181 168 315 229 138 -25 287 301 147 339 472 -32 211 323 112 48 202 -89 105 263
5834 263 123 -14 251 198 -66 115 56 -63 32 253 -40 -125 151 -118 16 116 -24 -303 64 -50 -283
5855 -283 -121 -36 -104 -105 -81 -284 -294 -43 -166 -125 72 -233 -334 79 -32 -189 39 -64 -238 -128 -67 -168 -32
$$ packed form
5703F4j14j3J67K12m34J96J41j71j71L57k21j51O01l45m8L04j10m44N32J78n34
5724dL52J29m85J06M01n47N2L66k14n8J05j95k5K61L69p09J82J03j76RL99m72
5746e1J6J65K21o31N43k22j76M16j71n49N20o9k72L32Rm67J93J78p9k35L15k34
5768b48j88L99r0k10J83R7l49K98J9l32M0K95j68p2L28k33m0N70m18l07L8N18
5790A30k51J37K0l32K14K65l47M6J09o1j13M46k20j86M64k87J3J57j6k42J87L36
5812D69m86J71K7j3J47q6r1j63L12J4j54J92J33n04K43J12k11o4J54k91J94J58
5834B63j40j37K65n3k64J81n9j19R5K21k93q5K76k69J34J00j40k79L67j14k33
5855b83J62Q5o8jK4k03j0K51j23M1J97l05j01M13j11j57K28j03j74J10O1j01J36
$$ plain form
5878 -32 63 -200 -118 -38 -204 -120 145 88 -132 47 145 40 136 125 -45 -29 242 -100 44 124 -78 81 177 165
5902 165 -80 126 -1 130 77 63 75 96 299 127 62 118 112 72 382 152 19 268 186 -79 361 171 -5
5925 -5 -73 179 -76 168 156 62 230 -90 -63 48 -18 -49 -120 -47 -289 -195 -122 -15 -166 -178 -101 -188 32 -146 -244
5950 -244 -192 -155 32 -259 -114 -226 -309 -255 -5 -179 -292 -148 -197 -66 -87 -141 -97 -107 -130 29 -61 -9 -116 34
5974 34 18 -189 53 189 42 128 49 81 83 27 17 -145 184 162 156 96 154 -36 363 233 195 105 199 190 12 42 152
6001 152 -50 -33 172 93 215 124 24 -34 317 -11 145 266 132 -49 203 -114 32 110 55 41 102 89 10
6024 10 51 77 -149 65 -67 -144 -267 -2 -154 -233 -47 -145 -68 -208 -140 -317 -120 -130 -88 -12 -218 -123 -135 -151 -158
6049 -158 -336 -198 -147 -259 -301 -220 -240 -195 -37 -289 -180 -148 -6 -7 68 4 -146 44 -80 14 25 159 127 -91
$$ packed form
5878c2R5k63Q2Q0j66Q4K65n7k20J79R8j05R6j1j70J6K71l42J44Q0k02J59R6j2
5902A65k45K06j27J31n3j4J2K1K03j72o5N6om0L10k30j33K49q2k65M40j90j76
5925eo8K52k55K44j2r4J68l20K7J11o6l1p1P3k42R4P3J07j51j2P7q7K20j78r8
5950b44N2L7J87k91J45j12q3N4K50j74j13J44m9J31k1n4M4j0k3J59r0N2j07J50
5974C4j6k07K42J36j47Q6p9L2Kn6j0j62L29k2oo0N8j90L99j30l8r0R4rj78L0J10
6001A52k02J7K05p9J22r1j00n8L51l28J56J21j34j81K52l17J46P8n5j4O1j3p9
6024A0M1K6k26K14j32p7j23K65j52p9J86r8P7j40O8j77J97j0M2P6k06R5j2j6p
6049a58j78J38N1j12m2Q1k0M5J58k52J09L2J42jP5o4j50J90j24R4J1J34l2k18
$$ plain form
6073 -91 135 -105 42 -25 213 83 156 231 4 168 164 22 106 145 53 69 230 109 250 126 234 -9 240
6096 240 220 143 303 172 144 269 161 7 227 -3 37 138 183 78 136 68 131 57 101 -105 11 -19 -73 51
6120 51 41 -99 -141 -120 -44 -195 -165 -125 -220 -163 -177 -182 -360 24 15 -220 -342 -148 -231 -169 -136 -402 -76 -162 -259 61
6146 61 -58 -73 -52 80 -188 -13 -6 -178 30 106 -8 -24 60 -8 37 62 250 -75 41 137 -1 69 275 117
6170 117 63 160 211 142 146 167 179 246 80 195 224 109 108 289 126 45 147 87 39 164 263 -24 -17 73 105 32 -38
6197 -38 193 1 212 108 -248 71 74 -129 -122 127 -130 52 18 -213 -269 -82 25 -356 -58 -137 -420 83 -45
6220 -45 -136 -163 155 -23 -150 116 -265 -393 156 -148 -147 -187 -132 -215 34 188 -175 -106 75 28 -34 19 -158 -172
6244 -172 22 243 -154 145 150 -52 88 186 14 58 257 -36 256 345 329 -32 253 170 165 334 184 125 200 470
$$ packed form
6073i1K26k40J47o7K38j30P3P5k27J64mj42Q4L9r2J6J61j21J41j24J08k43K49
6096B40k0p7J60j31k8J25j08j54K20k30M0J01M5j05N8o8O3p4M4k06J16l0n4J24
6120E1j0j40m2K1P6j51L0M0r5N7j4nj78L84rk35j22J94q3O2L3k66L26q6r7L20
6146F1j19j5K1J32k68J75Pj72K08P6j14j6Q4o8M5K5J88l25J16R6j38P0K06j58
6170A17n4R7N1o9MK1J2O7j66J15K9j15jJ81j63q1J02o0m8J25R9k87PR0L2p3p0
6197c8K31j92K11j04l56L19Lk03PK49k57J82l4k31n6J87J07l81K98p9k83N03j28
6220d5r1k7L18j78j27K66l81j28N49l04Jm0N5q3K49J54l63O9J81m7o2N3j77j4
6244a72J94K21l97K99Nk02J40R8j72M4J99k93K92Q9j6l61K85q3nJ69j50n9P5K70
$$ plain form
6268 470 93 91 334 190 287 191 95 -4 341 297 7 246 110 27 270 166 -108 75 57 -5 68 257 -55 -181
6292 -181 301 -89 -18 11 -224 -173 224 66 -369 44 66 -325 -94 -13 -387 -263 116 -39 -198 -94 -95 -278
6314 -278 -20 -115 -437 -98 -206 -97 -225 -178 -270 -131 55 -192 -146 -99 -294 -38 104 -176 -292 -60 67 -107
6336 -107 -69 151 46 -26 128 -27 -52 151 107 170 190 145 -80 318 329 -2 -54 349 75 150 270 102 267
6359 267 331 10 20 422 132 131 226 205 6 139 108 0 303 277 -4 100 313 88 86 158 6 -52 91 127
6383 127 -67 -61 -51 18 -111 5 -143 -15 -5 -313 -118 -45 -244 -207 27 -126 -242 76 -138 -225 -114 0 -130
6406 -130 -242 -120 -256 -64 -44 -281 -173 -7 -116 -232 -115 -303 -191 25 41 -314 -250 -29 -220 -70 76
6427 76 -276 -12 98 -46 -246 194 -19 -42 106 -61 45 10 65 30 112 271 -35 122 141 115 98 209 172
$$ packed form
6268D70l77kK43j44R7r6r6r9L45m4k90K39j36q3K43j04k74J83j8o2P3J89l12j26
6292a81M82l90P1K9k35N1L97j58m35M13K2l91K31Q1l74J24L79j55j59J04jj83
6314b78K58r5l22L39j08J09j28M7r2J39J86k47M6M7j95K56J42k80j16K32J27j74
6336a07L8K20j05p2J54j55k5K03m4O3K0m5k25L98J1l31n2M03k74P5J20j68J65
6359B67O4l21J0M02k90jR5k1j99J33l1j08L03k6k81J04K13k25kP2j52n8J43L6
6383A27j94OJ0O9j29J16j48J28J0l08J95P3j99L7K34j53j16L18k14q7J11J14j30
6406a30j12J22j36J92K0k37J08J66j09j16J17j88J12K16J6l55O4K21j91J50J46
6427G6l52K64J10j44k00M40k13k3J48j67J06l5N5l5Q2J59l06J57J9k6j7J11l7
$$ plain form
6450 172 179 394 233 -47 194 487 183 136 251 45 169 266 121 64 101 107 -62 -7 93 84 93 196 -73 17 65
6475 65 -112 -37 173 -105 -74 83 35 -118 -24 -18 -358 -152 -93 -267 -141 -222 -156 -208 -101 -261 -49 -32 -30 -185 -164
6500 -164 -78 -348 -107 -103 -109 -33 -6 -153 76 -17 -112 -227 59 -67 -174 -126 -126 -157 -43 -4 -26 10 -78 142 76 93
6526 93 148 20 13 112 77 -1 14 -96 182 305 176 -50 263 44 356 206 36 210 247 160 192 170 117 96 75
6551 75 37 124 15 132 54 24 -18 112 -62 97 25 -135 -6 -95 -24 -146 -120 -191 48 -23 -14 -125 -248 -107 -152
6576 -152 -168 -366 -207 2 -12 -401 -223 -267 -178 -315 -63 -165 58 -84 -213 19 -248 -142 -159 -148 -21 -131
6598 -131 -188 -93 -88 193 44 -100 -208 -45 -141 56 62 79 -21 -222 -4 34 48 121 65 124 88 105 171 153 151 171 234
6625 234 233 131 204 158 251 134 155 165 298 177 215 123 129 239 254 241 270 100 229 31 68 81 72 28 53 0 -28
$$ packed form
6450A72PK15j61k80K41K93l04m7J15k06J24R7j45n7L7Oj69N5J00rRJ03k69R0M8
6475F5j77P5K10k78L1J57m8j53R4Ol40K06N9j74J26q1O6n2J07j60K12J7Kj55K1
6500a64Q6k70K41MoP6K7j47K29r3r5j15K86j26j07M8%l1J14L9k2L6q8K20o6J7
6526I3N5j28pR9l5p8J5j10K78J23j29k26L13k19L12j50j70J74L7q7L2k2n3k1k1
6551G5l8Q7j09J17p8l0m2J30j74J59p2j60J29q9P1j22K6p1K39p1Rj11j23J41m5
6576a52j6j98J59K09j4l89J78m4Q9j37K52j02K23j42j29K32k67J06j7J1J27j10
6598a31n7R5NK81j49j44j08J63r6J97OJ7j00k01K18L8J4P3n6N9l6J7O6j8kK0O3
6625B34jj02P3m6R3j17K1J0J33j21L8r2OJ10J5j3K9j70J29j98L7J3rm4K5n3k8
$$ plain form
6652 -28 72 -70 -66 74 -84 -26 135 -79 75 -138 -33 -19 -193 -20 -296 -230 -79 -195 -284 -152 -155 -180 5
6675 5 -159 -277 -220 -77 -61 -147 -43 -93 -284 18 -37 -277 -62 -31 -223 89 -142 -116 -55 -81 -215 159 129 25
6699 25 -48 -21 99 -173 100 -27 -2 43 73 53 97 125 20 141 54 26 7 96 146 110 175 189 -73 66 192 100
6725 100 213 160 -25 183 243 58 202 217 22 -41 168 -3 149 58 30 43 -146 -132 -33 115 -196 -28 -124
6748 -124 31 -259 -139 11 -243 -125 -89 -150 -292 -127 -125 -218 -222 7 -90 -156 -91 -167 -7 -21 -185 -149 -81 -102 -196
6773 -196 -123 -151 -97 -44 -131 -45 -152 -84 32 -52 59 -84 -11 -126 -2 4 84 46 -7 194 71 -152 75 47 65
6798 65 100 188 55 125 -78 -31 103 59 275 95 68 204 83 13 290 93 146 209 94 84 319 64 163 136
6822 136 91 -50 146 340 62 136 41 -65 -3 226 -139 -84 128 -44 -172 94 -74 -68 -29 37 -62 -194 -200 -292
$$ packed form
6652b8J00j42MJ40j58N8J61k14J54k13J05J4j74J73k76O6J51j16q9J32lk5J85
6675Ej64j18N7J43J6q6J04n0j91L02n5k40K15L1j92L12k31K6O1k6j34L74l0j04
6699B5p3K7J20k72K73j27K5M5L0k0M4K8j05J21q7k8j9Q9N0l6O5J4k62J39J26r2
6725A00J13n3j85K08O0j85J44J5j95o3K09j71J52r1k8J3j89J4R9J48l11J68r6
6748a24J55k90J20J50k54J18L6o1j42J65Kr3mK29r7o6O5p6J60j4j64L6O8k1r4
6773a96P3k8N4N3q7Q6j07O8J16q4J11j43P3j15J24OQ0l8n3K01j23k23K27k8J8
6798F5L5Q8j33P0k03M7J34m4K16j80k7J36j21p0K77j97N3O3j15j0K35k55R9k7
6822A36m5j41J96J94k78P4r5j06O2K29l65N5K12j72j28K66j68OL9O6r9j32or2
$$ plain form
6846 -292 -100 -26 -185 -40 -234 -127 -248 -341 -224 -172 -182 -49 -117 -188 -189 -332 -102 -90 -212 -185 1 -70 -83 -37
6870 -37 -113 -101 147 99 -38 21 67 -60 112 90 119 76 175 37 124 282 116 106 -23 356 225 137 261 108
6894 108 84 47 120 167 -88 49 134 222 157 297 230 174 15 141 186 268 129 -40 18 211 94 91 -63 47 -53
6919 -53 63 4 122 -50 48 87 -118 160 3 -27 -79 -82 -153 -5 -115 -330 55 -58 18 -299 -65 -353 -230
6942 -230 -58 -101 -62 -46 -152 -190 -71 -8 -221 -230 -80 -185 -230 -96 -58 20 186 -12 -48 94 -89 -82 35 -43 -72
6967 -72 125 205 -24 230 69 -77 -168 134 -47 0 47 181 -11 71 276 -10 151 178 -14 106 37 69 203
6990 203 255 79 208 334 31 56 66 210 -14 120 222 7 74 179 45 222 133 1 -28 -35 39 38 54 -23
7014 -23 66 84 -66 -124 -139 45 -222 36 -11 -228 -218 64 -73 -255 -80 -270 -201 56 -78 -255 -74 -235 -125
$$ packed form
6846b92J92P4j59J45j94J07j21r3J17N2j0J33o8p1jj43K30J2j22K7J86p1j3M6
6870c7p6J2K48m8j37N9M6j27J72k2K9m3R9j38Q7J58j66j0j29L79j31q8J24j53
6894A08k4l7P3M7k55J37Q5Q8o5J40o7n6j59J26M5Q2j39j69N8J93j17lj54J10j00
6919e3J16n9J18j72R8L9k05K78j57l0n2lp1J48j10k15L85j13P6l17K34k88J23
6942b30J72m3L9J6j06l8J19O3k13rJ50j05m5J34L8P8J66j98l6J42j83PJ17p8k9
6967g2J97Q0k29K54j61j46r1L02j81M7M7J34j92Q2K05k86J61K7j92J20o9L2J34
6990B03N2j76J29J26l03K5J0J44k24J34J02k15O7J05j34J77q9j32k9pP4jJ6p7
7014b3Q9J8j50n8j5J84k67K58m7k17J0K82j37j82J75j90O9K57j34j77J81j61J10
$$ plain form
7037 -125 -172 48 -312 -167 -101 -155 -213 -3 -190 -105 -103 -167 -309 -208 75 -103 48 4 1 -217 -70 -75 29 96 -36
7062 -36 80 -37 158 56 249 -50 136 164 95 131 -30 199 85 -88 186 299 67 281 58 -14 207 149
7084 149 122 149 168 78 76 133 6 65 166 81 18 -25 139 -69 138 59 0 -25 125 -23 -10 72 69 -26 7 34 122
7111 122 28 -187 -85 -82 -80 -94 -159 -86 -192 -61 -120 -66 -177 -96 -201 -131 -133 -74 -158 -244 -148 -141 -60 -48 -118 -176 -96 4
7139 4 19 49 -59 -141 15 4 -94 76 -59 16 60 157 40 -2 33 0 149 275 417 98 45 205 133 96 157 167
7165 167 139 146 -59 180 15 65 222 147 140 199 63 222 138 -33 173 87 161 -1 79 171 -3 181 9 84 72
7190 72 -82 37 89 -39 -5 -57 -62 81 -55 -56 -80 -90 -87 -41 -134 -43 -149 -36 -101 -369 -83 -84 -224 -88 -194 -261
7216 -261 -169 -133 -293 -114 -205 -159 30 -106 -109 -166 -111 -65 -153 -43 -108 -42 5 24 188 17 -98 48 7 -36 83
$$ packed form
7037a25m7K20l60J45O6n4n8K10j87Q5Ko4j42J01K83j78J51m4lk18J47nJ04O7j32
7062c6J16j17J95j02J93k99J86K8o9L6j61K29j14j73K74J13k32K14k23p2K21n8
7084A49k7K7J9r0kN7j27N9J01q5o3m3J64k08K07p9n9k5J50j48J3Q2lr5L3K7Q8
7111A22r4k15J02LKj4o5P3j06J31n9N4j11Q1j05P0kN9q4q6R6PQ1J2p0n8Q0J00
7139DJ5L0j08q2J56j1r8J70j35P5M4R7j17m2L5l3J49J26J42l19n3J60p2l7O1J0
7165A67k8Pk05K39j65N0J57p5pN9j36J59q4j71K06q6P4j62Q0R2j74J84j72P5j2
7190G2j54J19N2j28L4n2nJ43j36jk4j0LM6r3R1j06J13o5k68K86jj40J36j06o7
7216b61R2L6j60J79r1M6J89j36ln7N5M6q8J10o5O6M7J9J64j71j15J46m1m3J19
$$ plain form
7241 83 -32 -85 63 -4 58 -73 39 216 70 153 141 111 277 294 160 140 56 164 77 20 156 213 56 64 249
7266 249 -18 46 98 31 158 125 102 142 144 30 74 130 -48 59 126 53 -155 4 53 -125 -56 -99 -177 -23 -47 124
7292 124 -153 42 -220 -118 -116 -68 -61 -30 -59 -211 -153 -148 -102 -67 -115 -340 -288 -116 -44 -211 12 -146 -91 -107 -178 -233
7318 -233 -77 37 -68 14 -35 -61 -167 -182 -10 -46 62 -33 83 72 26 14 261 139 115 49 84 87 181 203 -18
7343 -18 163 131 149 -9 442 71 65 212 2 20 55 118 -4 85 116 35 93 165 51 58 183 193 114 66 263 -110
7369 -110 11 -3 -6 13 106 -117 -187 53 -68 -46 122 17 -109 28 -113 -94 -90 -80 -352 -114 -60 -202 -98 -27
7393 -27 -60 -133 -177 -82 0 -71 -83 -81 -202 -14 -144 -60 47 -248 -194 3 3 -172 -103 -68 52 -45 -38 -49 99 -42 160
7420 160 93 -2 73 152 104 150 81 67 85 121 182 -1 32 7 229 133 233 247 -39 111 169 61 260 7 137
$$ packed form
7241H3j15n3J48o7O2j31J12J77j46Q3j2l0J66J7j34k0q4J08q7n7J36N7j57QJ85
7266B49k67O4N2o7J27l3k3M0Kj14M4N6j78J07O7p3k08J59M9j78O9m3p8J54k4J71
7292A24k77J95k62J02KM8PL1k9j52N8NM6L5m8k25N2J72P2j67K23j58N5j6p1n5
7318b33J56J14j05Q2m9k6j06j5J72l6J08r5J16j1m6j2K47j22k4o6L5LR4K2k21
7343a8J81l2J8j58M51l71oJ47k10J8L5O3j22Q9L1q1N8P2j14PJ25J0p9m8J97l73
7369a10J21j4lJ9R3k23p0K40j21K2J68j05j26J37j41J9MJ0k72K38N4j42J04P1
7393b7l3p3m4R5Q2p1j2Kj21J88j30Q4J07k95N4J97%j75O9L5J20r7Pj1J48j41K02
7420A60o7r5P5P9m8M6o9j4J8L6O1j83L3k5K22r6J00J4k86J50N8j08J99k53J30
$$ plain form
7445 137 28 154 132 46 129 53 79 96 28 -46 222 94 -22 127 31 -105 175 52 20 -142 19 48 -64 126
7469 126 -89 -217 -39 -178 12 -106 -90 -198 -181 -52 -221 -184 -176 -320 -78 3 -53 -270 -137 15 -142 -175 -61
7492 -61 19 -194 -74 14 -48 114 -67 -104 -73 -45 -28 -126 -3 -32 -77 171 -115 91 17 -57 -8 118 114 48 124 33
7518 33 150 96 137 27 95 99 97 167 88 60 45 319 80 145 237 -77 49 98 52 68 132 131 -33 -39 169 92 6 78
7546 78 -16 12 13 191 56 -50 45 58 54 49 -18 109 -61 -78 58 -50 -154 -58 -59 -55 -15 -5 -120 -189 -119 -53 -15 -131
7574 -131 -82 -266 -33 18 -139 -104 -5 -20 -162 76 -69 -166 -60 -58 62 -7 -54 -114 57 -13 -61 -25 90 -52 -109
7599 -109 251 -76 2 -97 -120 -47 149 291 -58 119 186 98 -32 62 142 236 123 3 77 267 172 130 255 72
7623 72 52 200 208 159 12 18 28 18 189 53 147 -19 217 -13 28 104 -35 55 69 -26 -34 -47 -81 -30 -40 96 7
$$ packed form
7445A37j09J26k2q6Q3p6K6J7o8p4K68j28j16J49r6j36K80j23l2j62J61K9j12J90
7469A26k15j28J78j39J90j18J6j08J7J29j69L7Qj44K42Q1n6k17J33J52j57l3J14
7492f1Q0k13J20Q8o2J62j81l7L1K8J7r8J23k9m5K48k86K06p4p4M9J26mo6P6r1
7518C3J17n4M1j10O8MkP0p9k8j5K74k39O5R2l14J26M9m6J6O4jj64oK08p7q6P2
7546G8r4K8JJ78j35j06R5J3mno7J27j70j7J36j08j04R6jMM0J0j15o9P0O6L8j16
7574a31M9j84K33N1j57L5R9j5j42K38j45r7J06KJ20o9m7o0J71p0m8L6J15j42n7
7599a09L60l27P8r9k3P3J96J42l49J77O7q8j30R4Q0R4j13j20P4J90r5m2J25j83
7623G2k0J48Qm9j47OJ0j0J71j36R4j66K36k30M1P6j39R0J4r5qj3l4N1j0J36q9
$$ plain form
7650 7 35 14 -216 21 268 -123 -3 -25 -55 -34 87 -121 -175 40 -54 -3 -142 31 -77 -254 -152 -137 -16 -54
7674 -54 72 54 75 3 -160 -35 -2 -66 -110 98 51 -4 77 37 31 85 -37 25 -30 136 116 104 33 14 173 115 21
7701 21 161 42 38 319 33 206 118 -60 45 133 143 22 159 8 -83 99 0 243 -241 1 126 81 78 -27
7725 -27 125 -3 96 21 26 -154 31 111 69 16 -155 -83 -15 -134 95 -95 -99 -243 -127 99 -191 -180 14 -110
7749 -110 -184 -118 -116 -94 -129 -57 -157 -155 -28 25 -92 -101 -121 -49 86 -62 -97 -28 14 -128 -216 -68 96 -50 -54 -39 -107
7776 -107 -30 13 68 -73 10 114 173 85 90 -101 -17 62 299 128 60 159 -69 334 210 118 184 93 148 120 112 56 18
7803 18 109 234 157 82 22 177 260 41 270 65 216 90 -69 81 -30 133 -133 -140 55 -68 -163 -82 -144 -207
7827 -207 6 2 -61 -14 -176 -47 40 -67 -93 18 -210 -118 -87 -97 -208 -65 29 -18 -120 -63 -33 -42 35 6 51 94
$$ packed form
7650GK8k1k30K37K47l91J20k2l0K1J21k08n4K15r4N1j39J73j08j77J02J5J21l8
7674e4J26j8K1p2j63J25L3o4m4K08m7n5Q1m0oN4j22O2n5J66k0j2p1j9J59n8r4
7701B1J40j19mK81k86J73q8j78J05Q8J0j21J37j51r1J82r9K43m84K42J25m5lj05
7725b7J52j28R9p5Nj80J85Q0m2n3j71P2O8j19K29j90mj44J16K26k90J1J94j24
7749a10p4O6KK2l5P2j00KJ27N3j17rk0P2J35j48l5O9M2j42q8J48J64j46mJ5o8
7776a07P7M3N5j41Q3J04N9q8Nj91Q4P9K37j71o8R9k28M03j24r2O6r1N5k8qn6l8
7803A8R1J25p7p5o0J55Q3k19K29k05J51j26j59J50j11J63k66pJ95j23r5Q1o2o3
7827b07K13mo3M7j62J29Q7j07k6J11k28R2L1j0j11J43R4m7j02N7L0rP7k9M5M3
$$ plain form
7853 94 -106 -73 -104 -147 -85 143 78 -37 -112 -72 -83 11 21 -125 3 3 -148 -274 26 57 145 188 -5 9 141 42
7879 42 30 53 -6 -30 63 -100 23 164 175 -10 40 161 8 151 -8 33 121 277 20 108 -34 53 -6 198
7903 198 -4 70 97 102 -32 -7 84 35 55 166 68 -33 -11 -180 -68 -122 -156 -83 116 -111 37 41 -118 -115 -156 -103
7929 -103 -4 -153 -150 9 -12 -105 -57 -211 1 -17 -62 -44 -46 -269 -90 -81 -136 19 -5 -21 -201 77 -82 -64 24 -6
7955 -6 -97 132 44 -50 30 48 31 -92 92 -79 205 84 -61 203 -4 29 22 119 -27 46 224 41 187 7
7979 7 44 184 85 4 -117 56 122 158 44 145 -53 46 31 58 29 115 14 -107 -61 -53 -47 24 113 7 142 48 1
8006 1 -52 -207 -81 -11 -218 -189 -13 -179 -9 -170 -179 -236 -118 -130 -96 -8 -150 -274 -115 -109 -131 110 -173 -194 -154
8031 -154 -8 -51 -22 -137 -33 -177 -65 -85 -107 -110 -117 -53 -105 -20 -132 -25 -21 -59 -123 89 222 64 -92 36 1
$$ packed form
7853I4k00L3l1m3O2K28o5j15p5M0j1R4J0j46J28%j51j26L00L1Q8M3j93J4J32r9
7879D2j2K3n9k4R3j63J23J41J1j85N0J21j53J43j59M1Q8J56k57Q8j42Q7n9K04
7903A98k02P4K7Nj34K5R1m9K0J11r8j01K2j69J12n4l4P3J99k27J48Mj59Lm1N3
7929a03R9j49LJ59k1r3M8j54K12j8m5J8kk23J79Rn5J55k4j6j80K78j59J8Q8l0
7955fr1K29q8r4Q0J8j7j23J84j71K84j21j45K64k07L3pR7j46P3J78j83J46j80
7979GL7J40r9q1j21J73O6L6j14J01j98R9j5K7k9Q6j01j21M6QOP1Q9j06J35r4m7
8006An3j55J26P0k07K9J76j66J70j61rn7J18j2L4Q8j42j24J59Ok2K41k83k1M0
8031a54J46m3K9j15J04j44J12k0k2lpO4n2Q5j12J07Ml8o4K12J33j58j56J28l5
$$ plain form
8056 1 24 -44 55 75 57 92 124 183 145 199 63 -41 169 238 -127 102 -22 -19 -5 -11 87 54 21 -97 123 196 95
8083 95 83 35 48 35 -3 -48 115 -41 122 -62 -41 70 -133 123 -92 -33 -38 36 -291 -129 -28 -32 86 67 -30
8108 -30 -127 -45 -99 -230 -8 -40 -81 62 51 -60 -183 -85 -92 -293 -199 -74 38 -50 -120 -141 -126 -162 -192 -133 142 -77
8134 -77 -56 18 -67 158 54 96 81 -61 13 -64 -85 -16 -4 77 114 65 144 128 80 83 84 101 41 210 72 64 176 59
8162 59 12 -5 186 69 105 -32 10 33 -98 116 -22 -31 7 117 105 -133 -18 201 74 205 9 -9 -92 61
8186 61 -17 -152 14 -163 -3
$$ packed form
8056AK3o8R9K0j8L5L2N9l8N4j36j04K10O9l65K29j24LJ4oR8l3l3j18K20P3j01
8083I5j2m8J3j3l8m5J63j56J63j84K1J11k03K56k15N9nP4l27J62J01mJ18j9r7
8108c0r7Q2n4j31K22l2m1J43j1j11j23R8pk01R4J25J12q8p0k1J5l6l0N9K75k19
8134g7K1P4q5K25j04M2j5j42P4p7k1O9J2Q1L7m9P9j6m8LJJ7o0J69j38qJ12j17
8162E9m7j7J91j17L6j37M2K3j31K14j38rL8J10j2k38J15K19j27J31j96j8q3J53
8186F1p8j35J66j77J60
8191c
$$ Imaginary data points
##PAGE= N=2
##DATA TABLE= (X++(I..I)), XYDATA
$$ plain form
0 0 0 0 0 0 0 0 0 0 0 0 0 -8 8 -8 8 -8 16 -16 16 -24 24 -32 40 -45 49 -57 69 -80 93 -104 117 -133 152 -173
34 -173 193 -217 244 -272 304 -339 374 -417 462 -512 563 -622 686 -754 832 -916 1010 -1113
52 -1113 1226 -1354 1501 -1663 1851 -2072 2329 -2636 3009 -3479 4081 -4892 6037 -7772 10690
67 10690 -16458 32008 -156893 -391130 118772 34293 -182973 128909 9918 -411313 -59362
78 -59362 209377 -122672 -72722 113787 -212592 -159551 233554 20188 -173306 117615 -408
89 -408 -222443 116998 173425 -178434 -22932 141739 -168624 -89291 229479 -21215 -176415
100 -176415 90810 -7671 -163652 132663 129065 -185872 -57416 92509 -78076 22440
110 22440 156595 -116856 -153395 120003 48023 -48899 105643 -16778 -172715 85579 167675
$$ packed form
0@%%%%%%%%%%%qJ6j6J6j6K4l2L2m0M8n6P2q5R4j06J26j49J73j97K21k50K85l25
34a73L66m10M61n16N76o43P13p91Q79r74J075j185J308j440J586j748J926k123
52a113K339k580K855l164L514l923M401m965N645o488P560q973J0929j3809J8462
67A0690k7148M8466j88901k34237N09902q4479k17266L11882j18991m21231L51951
78e9362K68739l32049M9950J86509l26379N3041L93105k13366j93494K90921j18023
89d08k22035L39441N6427l51859J55502J64671l10363P9333L18770k50694j55200
100a76415K67225r8481j55981K96315l598l14937J28456J49925j70585J00516
110B2440J34155k73451l6539K73398p1980r6922J54542j22421j55937K58294Q2096
$$ plain form
121 167675 -60512 -11402 73870 -84894 -5720 184105 12822 -103357 56824 36723 -40377
132 -40377 90704 69223 -82660 384 74538 -22149 15189 80224 -32542 -40155 65072
143 65072 4064 -31251 73629 24381 -76834 12579 51642 -25678 19334 49561 -60196
154 -60196 -52355 57314 29500 -19991 8956 -27589 -54100 31777 49597 -23634 -31534 -21344
166 -21344 -29598 18145 36857 -30571 -49094 -9695 -11359 -4403 22097 -21121 -59367 -8105 15447
179 15447 -19854 -12729 1039 -29995 -27293 11441 1360 -25476 -8466 592 -17622 -11776 3042
192 3042 -2152 -3270 -4127 -13024 -4631 8636 3186 2018 4196 -11874 -10203 23456 22338 -10952
206 -10952 -5520 11986 2464 10251 28203 5204 -16377 8475 27749 13086 7334 10440 1028
$$ packed form
121A67675k28187M9110Q5272j58764P9174J89825j71283j16179J60181k0101p7100
132d0377J31081k1481j51883Q3044P4154r6687L7338O5035j12766p613J05227
143F5072o1008l5315J04880m9248j01215Q9413L9063p7320M5012L0227j09757
154f0196P841J09669k7814m9491K8947l6545k6511Q5877J7820p3231p900J0190
166b1344q254M7743J8712o7428j8523L9399j664O956K6500m3218l8246N1262K3552
179A5447l5301P125J3768l1034K702L8734j0081k6836J7010R058j8214N846J4818
192C042n194j118q57q897Q393J3267n450j168K178j6070J671L3659j118l3290
206a0952N432J7506r522P787J7952k2999k1581K4852J9274j4663n752L106r412
$$ plain form
219 1028 6341 23603 17619 4802 6484 6640 11592 19666 9693 -169 11288 12330 78 10474
233 10474 16164 -4887 -526 18916 121 -10790 12428 9086 -11580 180 7631 -9448 -5420
246 -5420 8030 -5515 -12646 -2547 -5185 -5943 -1865 -12779 -13840 -1605 -8963 -15090 -2101 -7954
260 -7954 -23302 -7242 3482 -18416 -18861 293 -10566 -19447 -2377 -4146 -18702 -9748 -1526
273 -1526 -9992 -9732 -4339 -8231 -6915 -2132 -6689 -4943 1436 -5768 -4804 5693 -1405 -6267 6402
288 6402 5247 -4938 3380 10604 -71 1345 12734 5973 906 10994 11108 4257 8557 11372
302 11372 8439 8570 10186 10804 10678 9536 9346 12059 11124 6541 10307 13938 6611 5717 13120 9756
318 9756 3906 8079 11118 4744 2801 8422 7002 990 2963 5962 2254 -618 1155 2555 -544
$$ packed form
219A028N313J7262n984j2817J682J56M952Q074r973r862J1457J042j2252J0396
233A0474N690k1051M361J9442j8795j0911K3218l342k0666J1760P451j7079M028
246e420J3450j3545p131J0099k638p58M078j0914j061J2235p358o127J2989n853
260g954j5348J6060J0724k1898m45J9154j0859q881J7070j769j4556Q954Q222
273a526q466K60N393l892J316M783m557J746O379p204R64J0497p098m862J2669
288F402j155j0185Q318P224j0675J416J1389o761n067J0088J14o851M300K815
302A1372k933J31J616O18j26j142j90K713r35m583L766L631p327q94P403l364
318I756n850M173L039o374j943N621j420o012J973K999l708k872J773J400l099
$$ plain form
333 -544 -3035 -548 -849 -5108 -4671 -1966 -4497 -7932 -6149 -4415 -8063 -8731 -5715 -7882 -10949 -8429
349 -8429 -7042 -10158 -11420 -8585 -8518 -11781 -10281 -7703 -10237 -11270 -8321 -7868 -10203 -10458 -6643 -6238
365 -6238 -9706 -8337 -4503 -5525 -8040 -4918 -1287 -5527 -7074 196 649 -5416 -1978 3492 -32
380 -32 -2428 3321 5032 503 1774 6445 5134 3098 4883 7301 7314 5100 6151 9736 7860 5533
396 5533 9289 10638 6753 6759 11338 10006 5790 8868 10828 7242 7178 9638 8594 6220 6142 8702 7463
413 7463 3848 5549 7194 3746 2690 5946 3978 -955 2171 5298 -831 -1997 2181 -1313 -3163
428 -3163 288 -1599 -5116 -3548 -3431 -4063 -2978 -5967 -8779 -3658 -3750 -10154 -5905 -2778 -11906 -9334
444 -9334 -304 -9026 -13797 -3307 -4557 -12478 -6057 -3537 -11613 -7104 -1096 -9118 -8503 -1711 -7218
$$ packed form
333e44k491K487l01m259M37K705k531l435J783J734l648o68L016k167l067K520
349h429J387l116j262K835O7l263J500K578k534j033K949M53k335k55L815M05
365f238l468J369L834j022k515L122L631m240j547P270M53o065L438N470l524
380c2k396N749J711m529J271M671j311k036J785K418J3k214J051L585j876k327
396E533L756J349l885OM579j332m216L078J960l586o4K460j044k374p8K560j239
413G463l615J701J645l448j056L256j968m933L126L127o129j166M178l494j850
428c163L451j887l517J568J17o32J085k989k812N121r2o404M249L127r128K572
444i334R030q722m771J0490j250p921O421K520q076M509O008q022O15O792n507
$$ plain form
459 -7218 -6203 1415 -6377 -9515 2159 618 -6977 744 1335 -7903 1959 9101 -4276 -3666 7035
474 7035 454 434 10993 2064 -5759 8098 10507 566 6090 8517 -1332 5674 14552 3475 1392
489 1392 10173 4935 4430 12596 4311 -1122 11249 9937 -809 6568 9006 -1673 5701 13326 -1912
504 -1912 -3800 9832 4980 -1081 5099 -352 -5359 5692 6799 -4717 -3760 -699 -3931 2535 4383
519 4383 -9371 -9936 1441 -922 -3721 -1328 -9260 -11958 540 2556 -8610 -9389 -5331 -7139 -3336
534 -3336 -25 -8648 -11991 -3543 -330 -4760 -7308 -7588 -5424 -1724 -1229 -5086 -8182 -5381 158 1718
550 1718 -3109 -6880 -4682 1194 4265 297 -5741 -2805 3438 3531 3947 1824 -6173 -469 13738 7843
566 7843 -4667 650 5301 2799 11424 11749 -6111 -3266 14682 10081 3378 8405 -351 -1775 16685
$$ packed form
459g218J015P618p792l138J1674j541p595P721N91r238R862P142j3377O10J0701
474G035o581k0J0559q929p823J3857K409r941N524K427r849P006Q878j1077k083
489A392Q781n238n05Q166q285n433J2371j312j0746P377K438j0679P374P625j5238
504a912j888J3632m852o061O180n451n007J1051J107j1516R57L061l232O466J848
519D383j3754n65J1377k363k799K393p932k698J2498K016j1166p79M058j808L803
534c336L311q623l343Q448L213m430k548k80K164L700M95l857l096K801N539J560
550A718m827l771K198N876L071l968o038K936O243R3M16k123p997N704J4207n895
566G843j2510N317M651k502Q625L25j7860K845J7948m601o703N027q756j424J8460
$$ plain form
581 16685 12963 -4539 3614 9901 570 9591 13385 -8016 -2061 19477 4515 -5455 9336 -96
595 -96 -6763 16947 10515 -17191 -1921 13391 -4731 466 10163 -14569 -11783 17366 1711 -15801
609 -15801 2020 -3836 -13979 10132 4715 -25270 -6893 10812 -12601 -7252 7564 -20595 -17636
622 -17636 17621 -2824 -26026 630 -922 -19229 5997 6403 -27947 -10190 14653 -10584 -11167
635 -11167 7602 -15713 -14684 19178 -567 -23853 4651 4699 -14582 10107 10344 -23727 -3026
648 -3026 23234 -6472 -8412 15373 -6588 -9620 24957 6933 -19518 9297 15587 -6576 10504
661 10504 14607 -14245 2234 26447 252 -4551 15921 -1340 -2553 26062 6834 -16561 13073
674 13073 17143 -7063 10232 16028 -14106 792 26876 -653 -10501 13645 1846 -5861 17524
$$ packed form
581A6685l722j7502Q153O287r331R021L794k1401N955K1538j4962r970J4791r432
595i6o667K3710o432k7706J5270J5312j8122N197R697k4732K786K9149j5655j7512
609a5801J7821n856j0143K4111n417k9985J8377J7705k3413N349J4816k8159K959
622a7636L5257k0445k3202K6656j552j8307K5226M06l4350J7757K4843k5237n83
635a1167J8769k3315J029L3862j9745k3286K8504M8j9281K4689K37l4071K0701
648c026K6260k9706j940K3785k1961l032L4577j8024k6451K8815O290k2163J7080
661A0504M103k8852J6479K4213k6195m803K0472j7261j213K8615j9228k3395K9634
674A3073M070k4206J7295N796l0134J4898K6084k7529r848K4146j1799p707K3385
$$ plain form
687 17524 4180 -17026 6594 12329 -8015 3161 6576 -15889 -736 18331 -8934 -14131 9155
700 9155 -4027 -11406 11621 -1371 -22386 1783 9399 -13160 -5801 2853 -14392 -6610 10372
713 10372 -9130 -16433 2089 -3772 -9592 4284 -5449 -18064 1410 5792 -12250 -4974 2147
726 2147 -12432 -4333 10887 -7050 -14692 4582 1956 -7748 3279 872 -10520 1296 8861
739 8861 -3591 -3461 3272 -2223 1702 8952 -2264 -5106 7477 4833 -865 6604 3272 -4311 6217
754 6217 11545 -221 -792 7214 3838 2523 8258 3657 -1197 5433 7702 3493 2834 2631 2077 5023
770 5023 5913 1931 662 2709 3077 3502 3345 -115 -1043 2826 3224 172 -696 -285 -503 270 960 -951
788 -951 -4185 -2419 1264 -716 -4539 -2793 -1642 -3687 -2480 -645 -4551 -6638 -1391 -1420 -5162 -4146
$$ packed form
687A7524j3344k1206K3620N735k0344J1176L415k2465J5153J9067k7265n197K3286
700I155j3182p379K3027j2992k1015K4169P616k2559P359Q654j7245P782J6982
713A0372j9502p303J8522n861n820J3876r733j2615J9474M382j8042P276P121
726B147j4579Q099J5220j7937p642J9274k626r704J1027k407j1392J1816P565
739H861j2452J30O733n495L925P250j1216k842J2583k644n698P469l332p583J0528
754F217N328j1766n71Q006l376j315N735m601m854O630K269m209o59k03n54K946
770E023Q90l982j269K047L68M25j57l460r28L869L98l052q68M11k18P73O90j911
788i51l234J766L683j980l823J746J151k045J207J835l906k087N247k9l742J016
$$ plain form
804 -4146 -3294 -4678 -2915 -2192 -4676 -4517 -3041 -3656 -2506 -1265 -5137 -4512 550 -1883 -4839 -436
820 -436 -742 -4340 -210 2180 -2979 -2747 2599 586 -1722 2273 1516 -1126 2333 3220 242 1906
836 1906 3191 1877 3319 3596 1628 2786 4990 2840 2519 5288 2982 1535 5806 5162 1015 3382
852 3382 5687 2740 2079 5069 3404 1296 3278 4197 1981 1535 2316 2130 2024 892 885 1997 341
869 341 -762 969 722 -1736 -1095 573 -1247 -3182 -1159 -781 -2980 -2645 -1660 -2651 -3585 -3018 -2387 -3252
887 -3252 -4335 -3159 -3016 -4248 -4064 -2977 -3587 -4479 -3702 -2860 -3967 -4136 -2715 -3157 -3968 -3258 -2173 -2738
905 -2738 -3149 -2130 -1610 -2648 -2194 -835 -960 -1699 -1056 384 -85 -763 666 1390 259 511 2152 1929
923 1929 918 1389 3164 2329 1619 3165 3709 2575 2740 4102 3952 2502 3400 4872 3631 2969 4252
$$ packed form
804d146Q52j384J763P23k484J59J476o15J150J241l872O25N062k433k956M403
820d36l06l598M130K390n159K32N346k013k308L995p57k642L459Q87k978J664
836A906J285j314J442K77j968J158K204k150l21K769k306j447M271o44m147K367
852C382K305k947o61K990j665k108J982R19k216m46P81j86j06j132pJ112j656
869C41j103J731k47k458O41J668j820j935K023L78k199L35R85r91r34N67O31q65
887c252j083J176J43j232J84J087o10q92P77Q42j107j69J421m42q11P10J085n65
905b738m11J019N20j038M54J359j25p39O43J440m69o78J429P24j131K52J641k23
923A929j011M71J775q35p10J546N44j134J65J362j50j450Q98J472j241o62J283
$$ plain form
940 4252 4308 3441 3384 4102 3580 3034 3449 3659 2858 2601 2644 3028 2401 1664 2113 2106 937 1148 1837 359 -218
961 -218 641 699 -1111 -817 203 -1084 -2031 -740 -1190 -2919 -2349 -1241 -2380 -3646 -2541 -2168 -3645
978 -3645 -3626 -2638 -3374 -3878 -3386 -3298 -3524 -4025 -3900 -3063 -2999 -4054 -3938 -2307 -3245 -4293 -2042 -1688 -4547
997 -4547 -2645 -50 -2438 -3418 -553 -884 -2593 -298 782 -1712 -1076 1304 303 117 1401 142
1013 142 865 2692 1160 1033 2975 1908 840 4143 3514 -41 3359 5382 1025 1868 5614 2081
1029 2081 1219 5959 3757 32 3718 4909 1549 3012 3792 764 2292 4698 1163 1417 3248 -108
1045 -108 1084 4985 366 -2774 2836 2240 -2045 1603 2264 -4150 -1486 3631 -1659 -3340 581 -2159
1061 -2159 -2992 1079 -1660 -4823 -796 -1058 -4301 -926 -1356 -6158 -1660 1055 -5375 -4407 554 -3905
$$ packed form
940D252N6q67n7P18n22n46M15K10q01k57M3L84o27p37M49pj169K11O89j478n77
961b18Q59N8j810K94J020j287r47J291m50j729N70J108j139j266J105L73j477
978c645J9R88p36n04M92Q8k26n01J25Q37O4j055J16J631r38j048K251L54k859
997d547J902K595k388r80K865l31j709K295J080k494O36K380j001j86J284j259
1013A42P23J827j532j27J942j067j068L303o29l555L400K023m357Q43L746l533
1029B081q62M740k202l725L686J191l360J463P80l028J528K406l535K54J831l356
1045a08J192L901m619l140N610n96m285L648O61o414K664N117n290j681L921k740
1061b159q33M071k739l163M027k62l243L375m30m802M498K715o430R68M961m459
$$ plain form
1077 -3905 -4193 1291 -3274 -6808 122 580 -4882 -1614 -492 -5022 -690 2781 -3803 -3711 1008 -1435
1093 -1435 -710 3355 -2482 -4368 3538 2550 -2153 2123 1506 -3706 3048 6472 -2064 -1033 4932 1013
1109 1013 742 5808 1108 -2082 4919 4603 -84 3125 2987 -440 4691 5624 -1505 1010 5798 992
1125 992 1538 5591 -402 -1750 6417 3817 -2867 1843 2571 -1500 3140 4202 -4163 -2050 4046 196
1141 196 -591 1457 -3633 -3376 3847 571 -4612 -853 -1815 -3774 2213 692 -7560 -3291 1909 -3061
1157 -3061 -2624 -169 -5686 -5265 2109 -970 -5973 -2444 -2289 -3644 282 -1188 -6235 -2322 454 -3221
1173 -3221 -1486 -669 -5128 -1728 3798 -1984 -4859 723 341 -1411 2453 126 -4851 696 4360
1188 4360 260 429 482 -1875 2627 5878 55 -1241 2855 1466 2417 6172 821 -2877 4798 5748
$$ packed form
1077c905k88N484m565l534O930M58n462L268J122m530M332L471o584R2M719k443
1093a435P25M065n837j886P906r88m703M276o17n212O754L424q536J031N965l919
1109A013k71N066m700l190P001l16m687L209j38l427N131R33p129K515M788m806
1125I92N46M053n993j348Q167k600o684M710P28m071M640J062q365K113O096l850
1141A96p87K048n090K57P223l276n183L759r62j959N987j521q252M269N200m970
1157c061M37K455n517M21P374l079n003L529J55j355L926j470n047L913K776l675
1173c221J735Q17m459L400N526n782k875N582l82j752L864k327m977N547L664
1188D360m100J69N3k357M502L251n823j296M096j389R51L755n351l698P675R50
$$ plain form
1204 5748 880 3082 2950 -1050 4052 7307 648 -207 3951 2098 2665 5136 -47 -1354 4842 3611
1220 3611 -410 2684 792 -2084 4080 4649 -3412 -1555 3502 -801 -611 3134 -2671 -4646 3011
1235 3011 1469 -3969 -1040 -1373 -4105 1199 1044 -6126 -3746 683 -3186 -2056 624 -6175 -5883 2442
1251 2442 -889 -6290 -1363 -2420 -5928 297 1047 -6936 -4283 1025 -3065 -2717 753 -4311 -4301 2529
1267 2529 -532 -4729 22 -416 -3178 2141 1394 -4737 -685 3874 -992 -661 2921 -1891 -1285 5555
1283 5555 2122 -2525 2244 3013 -1 3840 3600 -1569 1318 5362 1862 1500 3635 169 1253 6255
1299 6255 2448 -748 3647 2955 519 4257 3604 -1358 1503 4947 1018 405 2993 441 346 3677
1315 3677 1130 -1376 1462 1211 7 1445 -4 -2341 484 1662 -1663 -1479 176 -2147 -1134
$$ packed form
1204E748m868K202j32m000N102L255o659q55M158j853N67K471n183j307O196j231
1220C611m021L094j892k876O164N69q061J857N057m303J90L745n805j975P657
1235C011j542n438K929l33k732N304j55p170K380M429l869J130K680o799K92Q325
1251B442l331n401M927j057l508O225P50p983K653N308m090L48L470n064J0O830
1267B529l061m197M751m38k762N319p47o131M052M559m866L31L582m812O06O840
1283E555l433m647M769P69l014L841k40n169K887M044l500l62K135l466J084N002
1299F255l807l196M395o92k436L738o53m962K861L444l929o13K588k552r5L331
1315C677k547k506K838k51j204J438j449k337K825J178l325J84J655k323J013
$$ plain form
1330 -1134 1257 -2194 -3770 -468 -643 -2446 -1107 -1705 -3529 -1785 -421 -2476 -2819 -2117 -2717 -1517
1346 -1517 -681 -3020 -2846 -1000 -2118 -2189 -393 -1919 -3297 -483 106 -2336 -1601 -178 -1473 -907 354
1363 354 -887 -917 520 242 250 616 -254 114 1748 1026 27 1336 1566 503 1938 2433 355 987 2710
1382 2710 1739 1376 2252 1844 1407 2471 2236 1437 1784 1808 1497 2183 1897 869 1636 2049 978 1451 1785
1401 1785 533 535 1667 998 -102 726 637 -324 84 445 -576 -605 -1 -698 -781 -731 -1470 -954 -851 -1621
1421 -1621 -1562 -1037 -1616 -2049 -1086 -1475 -2455 -1686 -1229 -2186 -2118 -1455 -1739 -1970 -1662 -1667 -1765 -1556 -1519 -1510 -1297 -1519
1443 -1519 -1438 -903 -844 -1319 -679 -504 -995 -449 34 -454 -473 350 500 -79 629 635 376 661 1316 823 941
1464 941 1638 1186 1274 1571 1611 1562 1800 1728 1537 2017 1955 1714 1945 2119 1351 1913 2161 1663 1571 1876 1727 1247
$$ packed form
1330a134K391l451j576L302j75j803J339n98j824J744J364k055l43P02o00J200
1346a517Q36k339J74J846j118p1J796j526j378K814N89k442P35J423j295N66J261
1363C54j241l0J437k78QL66q70L68J634p22r99J309K30j063J435M95k078O32J723
1382B710r71l63Q76m08m37J064k35p99L47K4l11O86k86j028P67M13j071M73L34
1401A785j252KJ132o69j100Q28q9r61M08L61j021k9O04o97q3N0p39N16J03p70
1421a621N9N25n79m33R63l89r80P69M57r57O8O63k84k31L08nr8K09L7RK13k22
1443a519Q1N35N9m75O40J75m91N46M83m88j9Q23J50n79P08Ok59K85O55m93J18
1464I41O97m52Q8K97M0m9K38p2j91M80o2k41K31J74p68N62K48m98r2L05j49m80
$$ plain form
1486 1247 1292 1624 1218 891 1332 1053 732 574 646 602 217 183 221 53 -379 -405 -166 -367 -1082 -1095 -723 -1106
1508 -1106 -1307 -1109 -1360 -1660 -1451 -1533 -1456 -1951 -1768 -1766 -1961 -2180 -1920 -1934 -2139 -1952 -1649 -2095 -2005 -1655 -1657 -1825
1530 -1825 -1399 -1525 -1613 -1394 -1408 -1090 -1083 -1107 -688 -672 -535 -821 -202 236 -169 -131 548 252 -14 875 950 249
1552 249 972 1460 971 967 1487 1456 1357 2076 1771 1381 1840 1981 1504 2183 1993 1349 2052 2381 1403 1513 2382
1573 2382 1314 1089 2030 1611 888 1801 1565 549 1104 1346 596 804 1136 136 -18 767 64 -129 284
1592 284 -469 -978 4 -246 -1197 -541 -952 -1619 -625 -539 -1795 -1651 -1049 -1703 -1460 -901 -2013 -2213 -1125
1611 -1125 -1594 -1894 -1249 -1875 -2157 -1257 -1228 -2113 -1495 -989 -1936 -1240 -563 -1826 -1552 -27 -1030 -1522 -245
1630 -245 -733 -884 496 -215 -1389 254 831 -417 518 876 -733 442 2328 467 -86 1755 669
$$ packed form
1486A247M5L32m06l27M41k79l21j58P2m4l85l4L8j68m32k6K39k01p15j3L72l83
1508a106k01J98k51l00K09q2P7m95J83Kj95k19K60j4k05J87L03m46R0L50kj68
1530a825M26j26q8K19j4L18Pk4M19J6J37k86O19M38m05L8O79k96k66Q89P5p01
1552B49P23M88m89mN20l1r9P19l05l90M59J41m77O79j90o44P03L29r78J10Q69
1573B382j068k25R41m19p23R13k36j016N55K42p50K08L32j000j54P85p03j93M13
1592B84p53n09R82k50r51O56m11o67R94Q6j256J44O02o54K43N59j112k00J088
1611a125m69l00O45o26k82R00K9q85O18N06r47O96O77j263K74J525j003m92J277
1630b45m88j51J380p11j174J643N77j248R35L58j609J175J886j861n53J841j086
$$ plain form
1647 669 487 2815 1652 -430 1673 2211 659 1923 2333 -276 1106 3394 865 639 2590 895
1663 895 430 2989 1467 -587 1951 2237 -293 1144 1998 -830 394 2690 -588 -1026 1621 375
1679 375 -1017 1434 -98 -2585 720 1447 -1792 -845 -97 -2371 -674 1767 -2242 -2851 230 -1138
1695 -1138 -1917 640 -1272 -3841 -580 558 -2564 -1439 -408 -3060 -1363 1013 -2086 -2604 -20
1710 -20 -1222 -2071 420 -925 -3029 253 672 -2157 -874 453 -1742 -278 1800 -1461 -1555 1852
1726 1852 647 -641 1199 233 -1250 2231 2283 -766 449 1521 182 1728 2898 -422 -113 2813
1742 2813 1644 880 2227 612 -240 3122 2817 -29 1128 1730 470 1967 2576 -193 28 2134
1758 2134 948 666 1401 -83 -458 1924 768 -1287 516 826 -754 429 630 -1975 -787 1342
$$ packed form
1647F69j82K328j163k082K103N38j552J264M10k609J382K288k529k26J951j695
1663H95m65K559j522k054K538K86k530J437Q54k828J224K296l278m38K647j246
1679C75j392K451j532k487L305P27l239R47P48k274J697K441m009o09L081j368
1695a138p79K557j912k569L261J138l122J125J031k652J697K376l099n18K584
1710b0j202q49K491j345k104L282M19k829J283J327k195J464K078l261r4L407
1726A852j205j288J840r66j483L481N2l049J215J072j339J546J170l320L09K926
1742B813j169p64J347j615q52L362l05k846J157O02j260J497O09k769K21K106
1758B134j186k82P35j484l75K382j156k055J803L10j580J183K01k605J188K129
$$ plain form
1774 1342 -456 -1241 -424 -1591 -962 866 -716 -2724 -1130 -849 -1525 -211 -1153 -3305 -1331 26
1790 26 -1576 -1513 -1070 -2380 -1855 361 -1402 -2762 -961 -1013 -1406 -134 -1122 -2606 -777 192 -1329 -842
1808 -842 -191 -1496 -376 1319 -836 -1228 1030 292 -184 1209 60 -906 1526 2004 32 605 1147
1825 1147 338 1618 2354 453 374 2037 1305 1230 2203 759 292 2504 2280 590 1444 1620 395 1800
1843 1800 2578 309 448 2015 1207 791 1841 405 -385 1806 1145 -488 667 519 -467 805 849
1860 849 -1295 -656 854 -695 -761 486 -1309 -1464 551 -408 -2196 -676 -748 -1866 -573 -274 -2290
1877 -2290 -1569 -236 -1602 -1712 -684 -2057 -1964 -267 -1107 -2188 -863 -1027 -2016 -524 -385 -2189 -1219
1894 -1219 196 -1200 -1266 -148 -941 -1097 418 -355 -1438 181 280 -525 363 411 -897 435 1323 -30
$$ packed form
1774A342j798p85Q17j167O29J828j582k008J594K81o76J314r42k152J974J357
1790B6j602O3M43j310N25K216j763j360J801n2l93J272r88j484J829R69j521M87
1808h42O51j305J120J695k155l92K258p38m76J393j149r66K432M78j972N73N42
1825A147q09J280P36j901p9J663p32p5R73j444m67K212k24j690Q54J76j225J405
1843A800P78k269J39J567q08m16J050j436p90K191o61j633J155j48r86J272M4
1860H49k144O39J510j549o6J247j795j55K015r59j788J520p2j118J293K99k016
1877b290P21J333j366j10J028j373R3J697q40j081J325j64r89J492J39j804R70
1894a219J415j396o6J118p93j56J515p73j083J619R9q05Q88M8j308J332Q88j353
$$ plain form
1912 -30 278 1323 196 246 1807 922 175 1455 1338 617 1565 1526 513 1153 1776 1036 886 1561 858
1931 858 1104 1860 1066 587 1389 1247 515 1131 1190 267 790 1202 173 263 979 105 164 847 151 -467 112
1952 112 165 -410 -133 -444 -645 -307 -361 -941 -805 -426 -1050 -898 -378 -1201 -1380 -810 -1020 -1412 -792 -1111 -1315
1973 -1315 -1003 -1054 -1278 -1122 -847 -1117 -1145 -775 -1032 -888 -696 -954 -1022 -594 -692 -828 -169 -256 -561 -145 22
1994 22 -160 -93 328 62 -10 372 536 421 392 492 569 827 994 774 993 997 602 1114 1148 705 1123 1163 849
2017 849 1038 1228 1100 1020 1256 1089 1004 1037 863 827 1009 824 693 688 550 473 327 342 296 272 195 83 27 19 -149
2042 -149 -253 -450 -349 -451 -598 -623 -755 -536 -760 -680 -961 -761 -1026 -1032 -920 -976 -1075 -1091 -1061 -1062 -969 -1099 -1072 -1065 -1048
2067 -1048 -1095 -1002 -1150 -959 -881 -903 -777 -836 -559 -594 -705 -370 -358 -297 -72 -16 -201 -118 -10 47 385 368 286 319
$$ packed form
1912c0L08J045j127N0J561q85p47J280j17p21R48l9j013O40O23p40j50O75p03
1931H58K46P56p94m79Q02j42p32O16N9r23N23M12j029R0P16q74N9O83o96o18N79
1952A12N3n75K77l11k01L38n4n80J36L79o24J52N20q23j79N70k10l92O20l19k04
1973a315L12n1k24J56K75k70k8L70k57J44J92k58o8M28r8j36O59q7l05M16J67
1994B2j82O7M21k66p2L82J64j15k9J00P7K58J67k20K19Ml95N12L4m43M18M0l14
2017H49J89J90j28q0K36j67q5L3j74l6J82j85j31nj38p7j46J5m6k4p7j12n6qj68
2042a49j04j97J01j02j47k5j32K19k24Q0k81K00k65oJ12n6r9j6L0jR3j30K7PJ7
2067a048m7R3j48J91P8k2J26n9K77l5j11L35J2O1K25N6j85Q3J08N7L38j7q2L3
$$ plain form
2091 319 641 591 676 861 674 725 895 829 856 1057 1087 1107 1011 1246 1086 1210 1166 1186 1021 1288 1083 1077 1291 924
2115 924 861 1092 853 623 905 816 667 617 570 511 286 215 174 149 82 -7 -149 -70 -391 -460 -385 -509 -654 -594 -631
2140 -631 -692 -796 -708 -858 -1008 -913 -1123 -1085 -999 -915 -1090 -997 -1019 -1168 -1115 -989 -1131 -1048 -843 -1055 -960 -620 -1120 -1004
2164 -1004 -564 -603 -788 -262 -387 -575 -369 -52 -233 -247 160 -42 -51 290 200 8 560 263 247 683 835 531
2186 531 788 1107 489 705 1051 951 836 1310 842 789 1312 1107 754 1134 1123 655 1064 1350 578 686 1137
2207 1137 862 586 1105 650 187 890 592 158 477 289 -222 89 350 -245 -164 331 -446 -475 86 -490
2227 -490 -707 -151 -451 -1040 -467 -490 -1197 -725 -308 -1285 -1279 -675 -1151 -1209 -704 -1321 -1545 -381 -666 -1461 -995
2248 -995 -643 -1250 -734 -385 -1240 -960 -206 -868 -852 -56 -559 -809 69 -195 -641 -117 151 -312 246 462
$$ packed form
2091C19L22n0Q5J85j87N1J70o6K7K01L0K0r6K35j60J24m4K0j65K67k05oK14l67
2115I24o3K31k39k30K82q9j49n0m7n9k25p1m1k5o7q9j42P9l21o9P5j24j45O0l7
2140f31o1j04Q8j50j50R5k10L8Q6Q4j75R3k2j49N3J26j42Q3K05k12R5L40n00J16
2164a004M40l9j85N26j25j88K06L17j81j4M07k02rL41r0j92N52k97j6M36J52l04
2186E31K57L19o18K16L46j00j15M74m68n3N23k05l53L80j1m68M09K86p72J08M51
2207A137k75k76N19m55m63P03k98m34L19j88n11L11K61n95Q1M95p77k9N61n76
2227d90k17N56l00n89N73k3p07M72M17r77OO04m76n8N05o17k24J164k85p95M66
2248i95L52o07N16L49q55K80P54o62J6P96n03k50Q78k64m46N24K68m63N58K16
$$ plain form
2268 462 -352 139 730 212 80 751 257 326 1204 813 172 840 1069 453 964 1282 402 765 1414 831
2288 831 428 1289 692 521 1457 924 126 852 914 445 925 937 118 644 1107 59 80 595 -80 -80 774
2309 774 116 -555 196 108 -266 -229 -60 -885 -625 5 -815 -776 -435 -744 -1027 -321 -878 -1203 -613 -576 -1103
2330 -1103 -833 -759 -1446 -714 -282 -1200 -1022 -420 -873 -1076 -199 -880 -1050 -357 -271 -800 -279 -280 -793 -231 227
2351 227 -462 -341 154 -207 18 626 -210 -350 540 592 228 400 607 273 686 957 422 515 1044 745 911
2372 911 1009 606 655 1162 891 718 953 795 698 1021 1172 579 840 920 652 858 968 480 383 752 588 227
2394 227 406 214 202 453 333 -274 55 86 -261 -276 -76 -749 -531 -151 -669 -632 -625 -876 -738 -599 -761 -932
2416 -932 -824 -855 -1017 -799 -887 -1076 -869 -809 -978 -838 -694 -918 -880 -603 -933 -886 -455 -453 -662 -472 -598 -596 -518
$$ packed form
2268D62q14M91N91n18j32O71m94O9Q78l91o41O68K29o16N11L18q80L63O49n83
2288H31m03Q61n97j71R36n33p98P26O2m69M80J2q19N26M63j048K1N15o75%Q54
2309G74o58o71P51q8l74L7J69q25K60O30q20L9L41l09k83P06n57l25N90L7n27
2330a103K70P4o87P32M32r18J78O02m53k03Q77o81j70O93Q6n29N21jn13N62M58
2351B27o89J21M95l61K25O08q36j40Q90N2l64J72K07l34M13K71n35R3N29k99J66
2372I11R8m03M9N07k71j73K35j58r7L23J51n93K61Q0k68K06J10m88r7L69j64l61
2394B27J79j92j2K51j20o07L29L1l47j5K00o73K18L80n18L7Pk51J38J39j62j71
2416i32J08l1j62K18q8j89K07O0j69J40J44k24L8K77l30M7M31Kk09J90j26KP8
$$ plain form
2439 -518 -289 -215 -332 -80 -322 -183 336 40 -10 489 301 170 514 403 317 749 947 497 780 964 705
2460 705 837 805 669 691 1117 771 767 974 824 619 1036 1022 740 791 700 596 754 649 391 478 608 270 338
2483 338 412 146 145 384 127 -60 46 84 -249 -146 60 -458 -316 -306 -197 -580 -330 -536 -751 -397 -614 -956
2505 -956 -730 -894 -846 -1103 -650 -1055 -1060 -756 -556 -1026 -713 -702 -796 -642 -830 -889 -582 -425 -725 -543 -475 -641
2527 -641 -551 -277 -383 -338 -162 -43 -260 109 162 -47 69 63 290 272 327 495 355 471 423 462 654 525 741
2550 741 845 685 629 832 822 728 880 1022 694 798 751 649 652 833 688 615 797 584 600 551 495 583 496 229
2574 229 334 319 179 267 40 44 -32 -4 -206 -108 -162 -353 -351 -156 -374 -544 -331 -609 -653 -575 -603 -622 -822 -734 -799
2599 -799 -653 -806 -697 -645 -838 -571 -786 -802 -866 -774 -706 -784 -516 -480 -408 -480 -469 -331 -490 -410 -160 -215 -226 -114
$$ packed form
2439e18K29P4j17K52k42J39N19k96n0M99j88j31L44j11q6M32J98m50K83J84k59
2460G05J32l2j36K2M26l46mK07j50k05M17j4k82N1r1j04J58j05k58Q7J30l38O8
2483C38P4k66jK39k57j87J06L8l33J03K06n18J42J0J09l83K50k06k15L54k17l42
2505i56K26j64M8k57M53m05nL04K00m70L13J1r4J54j88n9L07J57l00J82O8j66
2527f41R0K74j06M5J76J19k17L69N3k09J16oK27j8N5J68j40J16m8L9J92j29K16
2550G41J04j60n6K03j0r4J52J42l28J04m7j02LJ81j45p3J82k13J6m9n6Q8q7k67
2574B29J05j5j40Q8k27Mp6K8k02R8n4j91KJ95k18j70K13k78m4P8k8j9k00Q8o5
2599g99J46j53J09N2j93K67k15j6o4R2O8p8K68L6P2p2J1J38j59Q0K50n5j1J12
$$ plain form
2623 -114 -68 21 -66 104 41 193 405 398 477 366 307 478 523 593 762 643 521 713 695 711 804 681 898 454
2647 454 665 874 801 773 775 685 925 547 807 522 537 349 577 542 272 468 421 353 193 160 5 164 50
2670 50 10 -48 -43 -149 -29 -290 -446 -385 -448 -383 -596 -525 -406 -595 -662 -595 -794 -843 -597 -806 -774 -822 -821 -896 -859 -670
2696 -670 -751 -770 -748 -652 -598 -658 -546 -475 -657 -331 -407 -183 -226 -370 -284 -130 -185 -158 -9 129 102 187 137 192 255 365
2722 365 463 319 321 577 496 568 570 636 778 493 662 609 763 566 903 794 705 674 665 695 632 767 639 666 606 653
2748 653 619 383 490 331 281 316 351 208 87 114 204 25 -8 19 9 -293 -185 -211 -296 -354 -378 -426 -475 -554 -413
2773 -413 -533 -664 -658 -527 -564 -688 -650 -572 -839 -858 -521 -668 -968 -642 -621 -643 -730 -543 -760 -620 -398 -355 -390 -295
2797 -295 -402 -494 -256 -214 -447 -63 -70 -121 -64 -35 -140 131 251 190 293 375 345 524 401 455 453 538 576 431 572
$$ packed form
2623a14M6Q9q7J70o3J52K12pP9j11n9J71M5P0J69j19j22J92j8J6R3j23K17m44
2647D54K11K09p3k8Kr0K40l78K60k85J5j88K28l5k70J96m7o8j60l3j55J59j14
2670E0m0n8Nj06J20k61j56O1o3O5k13P1J19j89o7O7j99m9K46k09L2m8Jp5L7J89
2696f70q1j9K2R6N4o0J12P1j82L26p6K24m3j44Q6J54n5K7J49J38k7Q5n0N5O3J10
2722C65R8j44KK56q1P2KO6J42k85J69n3J54j97L37j09q9l1rL0o3J35j28K7o0M7
2748F53l4k36J07j59n0L5L5j43j21K7R0j79l3K7j0l02J08k6q5n8k4m8m9p9J41
2773d13j20j31OJ31l7j24L8P8k67j9L37j47l00L26K1k2q7J87k17J40K22M3l5R5
2797b95j07r2K38M2k33L84pn1N7K9j05K71J20o1J03Q2l0J79j23N4kQ5L8j45J41
$$ plain form
2822 572 599 491 775 768 493 622 572 459 752 767 506 553 879 644 347 718 450 207 440 419 257 330 291
2845 291 51 332 208 73 -59 -137 -106 -130 60 -201 -522 -214 -190 -435 -457 -375 -437 -541 -516 -592 -606 -389 -668
2868 -668 -489 -494 -659 -643 -467 -763 -784 -608 -624 -697 -483 -339 -815 -730 -260 -345 -528 -309 -372 -571 -92 -189 -256 -201
2892 -201 -271 -210 144 80 23 83 166 175 372 635 77 209 498 427 374 767 610 440 705 718 472 546 662 737
2916 737 609 770 594 525 710 447 598 798 631 398 667 602 206 332 545 290 333 266 134 2 373
2937 373 -32 77 73 10 -246 64 -277 -384 -206 -241 -422 -225 -221 -373 -420 -186 -419 -758 -476 -623 -736 -643 -333
2960 -333 -741 -644 -547 -675 -766 -572 -533 -613 -548 -611 -603 -376 -566 -375 -329 -494 -649 -256 8 -284 35 -162 -274
2983 -274 -123 212 122 -42 133 124 181 297 109 107 367 509 213 486 470 335 653 783 559 657 691 636 574 848
$$ packed form
2822E72K7j08K84pk75J29n0j13K93J5k61M7L26k35k97L71k68k43K33k1j62P3l9
2845B91k40K81j24j35j32p8L1k4J90k61l21L08K4k45k2Q2o2j04K5p6j4K17k79
2868f68J79nj65J6J76k96k1J76j6p3K14J44m76Q5M70q5j83K19o3j99M79r7o7N5
2892b01p0O1L54o4n7O0Q3RJ97K63n58J32K89p1n3L93j57j70K65J3k46P4J16P5
2916G37j28J61j76o9J85k63J51K00j67k33K69o5l96J26K13k55M3o7j32j32L71
2937C73m05J09mo3k56L10l41j07J78l5j81J97Mj52m7K34k33l39K82j47j13R3L10
2960c33m08R7R7j28r1J94L9q0O5o3QK27j90J91M6j65j55L93K64k92L19j97j12
2983b74J51L35r0j64J75rN7J16j88kK60J42k96K73j6j35L18J30k24R8L4n5o2K74
$$ plain form
3007 848 640 644 814 685 425 473 561 669 711 390 302 481 600 398 371 463 214 214 377 162 -40 175 67
3030 67 -98 -106 -28 -206 -317 -312 -246 -247 -357 -438 -383 -348 -562 -558 -636 -511 -720 -372 -268 -565 -591 -552 -653 -558 -609 -523 -573
3057 -573 -484 -436 -506 -533 -448 -530 -531 -365 -382 -188 -240 -322 -253 -225 -237 -39 -42 -46 -121 191 134 217 368 357 38 451 537 293
3085 293 571 341 347 451 563 489 701 580 465 560 784 634 659 680 656 474 610 573 517 492 696 553 304
3108 304 433 429 311 394 335 168 142 117 -42 82 -106 39 -48 -27 -33 34 -176 -151 -493 -164 -435 -595 -349 -422
3132 -422 -415 -492 -374 -591 -500 -518 -393 -667 -721 -539 -608 -614 -536 -693 -565 -486 -558 -459 -355 -616 -453 -313 -509 -439 -13
3157 -13 -212 -284 -333 -123 -230 -21 -87 34 28 234 56 163 120 470 514 348 312 405 416 320 471 405 395 412 708
3182 708 677 569 614 552 655 546 462 581 579 622 596 560 433 468 550 507 473 305 176 421 296 109 244 96
$$ packed form
3007H48k08MJ70j29k60M8Q8J08M2l21q8J79J19k02k7R2k49%J63k15k02K15j08
3030F7j65qP8j78j11NO6jj10q1N5L5k14Mp8J25k09L48J04k97k6L9j01R5n1Q6n0
3057e73Q9M8p0k7Q5q2jJ66j7J94n2q2O9K8j2J98lmp5L12n7Q3J51j1l19M13Q6k44
3085B93K78k30OJ04J12p4K12j21j15R5K24j50K5K1k4j82J36l7n6k5K04j43k49
3108C04J29mj18Q3n9j67k6k5j59J24j88J45q7K1oO7k10K5l42L29k71j60K46p3
3132d22Pp7J18k17R1j8J25k74n4J82o9oP8j57J28P9p2R9J04k61J63J40j96P0M26
3157a3j99p2m9K10j07K09o6J21oK06j78J07m3L50M4j66l6R3J1r6J51o6j0J7K96
3182G08l1j08M5o2J03j09q4J19kM3k6l6j27L5Q2m3l4j68j29K45j25j87J35j48
$$ plain form
3206 96 16 201 -11 -201 6 -85 -92 -109 -190 -253 -369 -287 -228 -349 -322 -419 -468 -569 -382 -618 -615 -631 -548 -534 -569 -651 -604
3233 -604 -468 -620 -576 -474 -477 -445 -386 -449 -390 -245 -339 -384 -283 -403 -16 -196 -74 -212 142 142 -51 67 52 112
3257 112 17 260 157 300 377 343 310 425 478 529 353 409 300 477 468 478 777 676 571 538 750 413 569 442
3281 442 666 562 471 552 483 454 559 190 172 420 185 287 330 163 116 185 120 20 56 -49 -115 -36 -146 -192
3305 -192 -219 -145 -414 -325 -350 -393 -430 -326 -532 -502 -353 -550 -486 -438 -587 -657 -471 -517 -749 -555 -365 -597 -623 -387
3329 -387 -323 -413 -374 -354 -393 -217 -381 -228 -329 24 -324 -57 99 -64 -60 -1 170 -82 82 132 414 440 326
3352 326 121 389 639 167 399 599 336 528 725 538 402 505 636 379 687 417 489 488 569 577 431 699
3374 699 482 514 594 262 367 422 373 125 419 33 -5 205 271 -144 153 2 -165 89 -52 -143 -226 20 -322
$$ packed form
3206I6q0J85k12j90K07r1pj7q1o3j16Q2N9j21K7r7m9j01J87k36Lj6Q3J4l5q2M7
3233f04J36j52M4J02lL2N9o3N9J45r4m5J01j20L87j80J22j38L54%j93J18j5O0
3257A12r5K43j03J43P7l4l3J15N3N1j76N6j09J77rJ0K99j01j05l3K12l37J56j27
3281D42K24j04r1Q1o9k9J05l69j8K48k35J02M3j67m7O9o5j00L6j05o6P9j10m6
3305a92k7P4k69Q9k5m3l7J04k06L0J49j97O4M8j49p0J86m6k32J94J90k32k6K36
3329c87O4r0L9K0l9J76j64J53j01L53l48K67J56j63MN9J71k52J64N0K82K6j14
3352C26k05K68K50m72K32K00k63J92J97j87j36J03J31k57L08k70P2jQ1Qj46K68
3374F99k17L2Q0l32J05N5m9k48K94l86l8K10O6m15K97j51j67K54j41r1q3K46l42
$$ plain form
3397 -322 -315 -242 -340 -609 -359 -302 -521 -573 -557 -631 -546 -446 -753 -818 -351 -608 -717 -338 -602 -522 -275 -329 -542 -355
3421 -355 -356 -483 -104 -280 -398 -476 -29 -146 -260 -43 -261 -239 33 49 -168 157 127 99 214 415 92 304
3443 304 652 327 473 451 181 319 541 572 89 578 467 594 791 533 353 473 721 333 383 540 460
3464 460 368 719 385 179 385 281 206 396 237 -105 155 405 162 48 46 -207 60 158 -264 -415 -164 -155
3486 -155 -395 -309 -455 -627 -130 -208 -655 -268 -436 -514 -540 -153 -528 -776 -356 -649 -525 -255 -652 -628 -294 -290
3508 -290 -488 -453 -214 -472 -186 -45 -339 -439 80 -141 -155 -95 -292 -322 109 315 1 195 174 -93 188 394
3530 394 -125 291 385 153 307 455 312 250 679 552 356 546 498 522 522 652 361 356 834 301 401 597 314
3553 314 248 755 564 154 331 238 202 504 255 -41 18 467 152 -152 233 -137 22 74 128 -317 -32 -171
$$ packed form
3397c22PP3r8k69K50N7k19n2J6p4Q5J00l07o5M67k57j09L79k64Q0K47n4k13J87
3421c55jj27L79j76j18p8M47j17j14K17k18K2K72J6k17L25l0k8J15K01l23K12
3443C04L48l25J46k2k70J38K22L1m83M89j11J27J97k58j80J20K48l88N0J57q0
3464D60r2L51l34k06K06j04p5J90j59l42K60K50k43j14kk53K67R8m22j51K51R
3486a55k40Q6j46j72M97p8m47L87j68p8k6L87l75k48M20k93J24K70l97K4L34M
3508b90j98L5K39k58K86J41k94j00N19k21j4O0j97l0M31K06l14J94k1k67K81K06
3530C94n19M16R4k32J54J48j43o2M29j27j96J90m8K4%J30k91nM78n33J00J96k83
3553C14o6N07j91m10J77r3l6L02k49k96N9M49l15l04L85l70J59N2N4m45K85j39
$$ plain form
3575 -171 -329 -98 -191 -557 -419 -298 -617 -376 -107 -719 -516 -224 -775 -661 -411 -538 -362 -320 -425 -767 -269
3596 -269 -407 -467 -530 -450 -565 -381 -194 -347 -339 -234 -328 -301 -28 -334 -205 -91 65 -279 120 270 33 177
3618 177 350 108 53 261 431 301 417 320 309 345 451 449 397 422 373 584 738 402 524 348 441 411 425 321
3642 321 433 350 561 345 334 480 253 380 227 94 218 105 67 116 109 19 -164 198 18 -171 -183 -80 -196
3665 -196 -265 -43 -333 -489 -131 -100 -604 -220 -382 -419 -479 -321 -329 -415 -425 -602 -507 -481 -752 -548 -323 -606 -285
3688 -285 -327 -406 -306 -328 -359 -514 -243 -161 -290 -293 -41 -118 87 -91 -84 -29 35 68 -2 144 87 45 204 182 347 325
3714 325 300 258 420 442 365 369 542 592 487 545 275 287 431 445 427 427 514 387 304 428 422 356 402 218 123 293 305
3741 305 166 68 143 -40 51 120 -4 -159 -55 -183 31 -175 2 -226 -120 -123 -156 -216 -327 -495 -233 -340 -367
$$ packed form
3575a71j58K31r3l66J38J21l19K41K69o12K03K92n51J14K50j27J76M2j05l42M98
3596b69j38o0o3Q0j15J84J87j53QJ05r4K7K73l06J29J14J56l44L99J50k37J44
3618A77J73k42n5K08J70j30J16r7j1L6J06kn2K5m9K11J54l36J22j76R3l0J4j04
3642C21J12q3K11k16j1J46k27J27j53j33J24j13l8M9pr0j83L62j80j89j2J03j16
3665a96o9K22k90j56L58L1n04L84j62l7o0J58qq6j0j77R5K6k71K04K25k83L21
3688b85m2p9J00k2l1j55K71Q2j29lK52p7K05j78PN5O4L3p0J46n7m2J59k2J65k2
3714C25k5m2J62K2p7MJ73N0j05N8k70J2J44J4j8%Q7j27q3J24oo6M6j84r5J70J2
3741C05j39r8P5j83R1O9j24j55J04j28K14k06J77k28J06ll3o0j11j68K62j07k7
$$ plain form
3764 -367 -438 -459 -515 -444 -487 -314 -478 -378 -488 -471 -478 -270 -354 -456 -369 -306 -366 -321 -149 -170 -255 -466 -253 -95 -79
3789 -79 -77 32 28 -62 -81 -42 78 84 130 140 154 207 179 500 342 436 328 411 238 275 589 556 556 558 334 317 434 517
3817 517 552 472 349 394 303 353 407 300 360 326 386 288 119 190 297 89 70 165 12 -116 47 90 -121 46 -116
3842 -116 -212 -132 58 -255 -173 -245 -278 -227 -210 -350 -377 -398 -306 -531 -411 -453 -513 -425 -408 -504 -380 -329 -535 -567 -320 -298
3868 -298 -366 -438 -227 -357 -89 -223 -257 -266 -88 -157 -136 42 -288 53 303 42 -108 88 81 235 90 139 4
3891 4 282 411 221 319 299 228 345 372 467 360 444 376 311 513 509 173 427 449 400 455 668 349 271 628 433
3916 433 185 277 210 291 202 317 3 126 321 50 -28 4 -105 -94 299 -152 -205 -132 -136 -372 -123 -270 -670 -388
3940 -388 -196 -443 -367 -218 -437 -431 -352 -358 -657 -521 -541 -599 -246 -492 -449 -345 -128 -595 -369 -134 -473 -391 -82
$$ packed form
3764c67p1k1n6P1m3J73j64J00j10J7pK08q4j02Q7O3o0M5J72k1q5k11K13J58J6
3789g9KJ09mr0j9L9J20OM6J0J4N3k8L21j58R4j08Q3j73L7L14l3%Kk24j7J17Q3
3817E17L5q0j23M5r1N0N4j07O0l4O0r8j69P1J07k08j9R5j53j28J63M3k11J67j62
3842a16r6Q0J90l13Q2p2l3N1J7j40k7k1R2k25J20m2o0Q8J7r6J24N1k06l2K47K2
3868b98o8p2K11j30K68j34l4rJ78o9K1J78l30L41K50k61j50J96pJ54j45M9j35
3891DK78J29j90R8k0p1J17K7R5j07Q4o8o5K02ml36K54K2m9N5K13l19p8L57j95
3916D33k48R2o7Q1q9J15l14J23J95k71p8L2j09J1L93m51n3P3mk36K49j47m00K82
3940c88J92k47P6J49k19OP9ok99J36k0n8L53k46M3J04K17m67K26K35l39Q2L09
$$ plain form
3963 -82 -242 -559 -302 -74 -455 48 -4 -461 34 69 4 -159 16 -85 91 307 206 -91 421 314 101
3984 101 411 193 181 459 564 241 288 611 385 493 748 498 281 568 575 374 466 353 -100 529 546 260
4006 260 240 344 106 375 347 -88 95 481 65 -17 3 -138 -160 56 86 -334 -146 -125 -201 -26 -241 -248 -353
4029 -353 2 -521 -224 -290 -648 -585 -9 -408 -683 -286 -411 -586 -214 -281 -657 -434 -81 -498 -431 -274 -442
4050 -442 -486 1 -291 -559 -25 -95 -191 194 -106 -395 -11 181 -83 -250 252 100 10 263 155 -76 95
4071 95 325 248 190 430 -22 290 496 371 245 447 181 379 660 204 224 515 415 224 557 169 14
4092 14 493 774 116 109 323 -4 178 460 27 -119 369 72 81 94 29 -383 214 183 -249 -251 -193 -273 -214 37
4116 37 -522 -318 58 -223 -531 -237 -476 -581 -19 -361 -533 -497 -393 -587 -434 -240 -509 -483 -140 -246 -433
$$ packed form
3963h2j60l17K57K28l81N03n2m57M95L5o5j63J75j01J76K16j01k97N12j07k13
3984A01L10k18j2K78J05l23M7L23k26J08K55k50k17K87Pk01R2j13m53O29J7k86
4006B60k0J04k38K69k8m35J83L86m16q2K0j41k2K16L0m20J88K1p6J75k15pj05
4029c53L55n23K97o6l58O3N76l99k75L97j25j75L72o7l76K23L53m17O7J57j68
4050d42m4M87k92k68N34p0r6L85l00k89L84J92k64j67N02j52r0K53j08k31J71
4071I5K30p7n8K40m52L12K06j25j26K02k66J98K81m56K0K91j00j91L33l88j55
4092A4M79K81o58pK14l27J82K82m33j46M88k97RJ3o5m12N97l1m32kN8q0N9K51
4116C7n59K04L76k81l08K94k39j05N62l42j72L6J04j94J53J94k69K6L43j06j87
$$ plain form
4137 -433 -52 -233 -556 22 -165 -547 -423 -64 -158 -294 54 -274 -227 135 7 -11 157 -33 1 170 217 148
4159 148 269 260 -77 251 337 63 287 426 331 215 304 480 186 511 436 30 444 500 412 320 382 105 197 542
4183 542 152 278 314 60 235 427 174 -18 151 193 9 129 169 -129 5 74 -54 -102 -46 -42 -318 56 -245
4206 -245 -580 -218 -288 -396 -185 -158 -385 -193 -212 -410 -485 -279 -390 -358 -241 -296 -561 -399 -208 -385 -337 -162
4228 -162 -374 -228 -216 -412 -328 -247 -238 -131 -145 -204 -134 6 4 -75 -57 -10 -64 -25 190 24 153 235 281 220 399 140
4254 140 283 408 212 102 550 361 439 431 425 291 498 467 372 329 488 280 368 508 330 242 335 364 104 206
4278 206 170 226 103 196 13 280 156 11 66 110 -73 -61 -8 -18 27 -135 -158 -247 -216 -237 -234 -434 -194 -229 -354
4303 -354 -335 -307 -331 -183 -371 -454 -469 -535 -493 -276 -405 -472 -342 -339 -308 -225 -255 -363 -154 -193 -277 -223 -201 -242 -222 -237 44
$$ packed form
4137d33L81j81l23N78j87l82J24L59r4j36L48l28M7L62j28j8J68j90L4J69M7o9
4159A48J21rl37L28Q6k74K24J39r5j16Q9J76k94L25p5m06M14N6q8r2O2k77R2L45
4183E42l90J26L6k54J75J92k53j92J69M2j84J20M0k98J34O9j28m8N6Mk76L74l01
4206b45l35L62p0j08K11K7k27J92j9j98p5K06j11L2J17n5k65J62J91j77M8J75
4228a62k12J46J2j96Q4Q1RJ07j4n9P0J40kp9J8M7n4L9K15j66J29Q2M6o1J79k59
4254A40J43J25j96j10M48j89P8qoj34K07l1r5m3J59k08Q8J40j78q8R3K9k60J02
4278B06l6N6j23R3j83K67j24j45N5M4j83J2N3j0M5j62k3q9L1k1Lk00K40l5j25
4303c54J9K8k4J48j88q3j5o6M2K17j29o7J30LL1Q3l0j08K09l9q4N4K2m1K0j5K81
$$ plain form
4330 44 -234 -196 44 -95 -200 152 142 113 54 110 -26 236 296 252 286 293 269 159 515 228 324 394 289 406 355
4355 355 499 267 305 287 333 425 130 300 264 317 239 278 314 186 40 63 199 167 58 -18 -95 -63 113 107 -47
4380 -47 -28 -7 -120 -328 -187 -211 -237 -377 -311 -255 -377 -311 -175 -416 -9 -351 -259 -328 -237 -196 -403 -73 -227 -322
4404 -322 -368 -184 -303 -349 -121 -201 -169 -214 -152 -224 -303 -134 -193 -73 -144 -220 -78 55 -108 89 79 -99 179 181 143
4429 143 232 199 190 170 52 308 224 274 278 321 243 426 203 226 513 306 305 322 392 275 242 411 308 404 189 263
4455 263 323 270 168 151 321 -65 -2 142 -30 144 -10 -19 -277 -5 -40 -102 -53 -50 -372 -240 10 -417 -417 -125
4479 -125 -235 -372 -180 -312 -726 -226 -71 -411 -390 -227 -321 -233 -209 -598 -382 -201 -315 -487 -68 -316 -519
4500 -519 -72 -238 -145 -81 32 -228 18 98 -75 -272 203 -54 28 144 -87 -98 189 260 -147 228 194 71
$$ packed form
4330D4k78L8K40j39j05L52j0k9n9N6j36K62O0m4L4Pk4j10L56k87R6P0j05J17n1
4355C55J44k32L8j8M6R2k95J70l6N3p8L9L6j28j46K3J36l2j09p6p7L2J76oj54
4380d7J9K1j13k08J41k4k6j40O6N6j22O6J36k41M07l42R2o9R1M1k07L30j54r5
4404c22m6J84j19m6K28q0L2m5O2p2p9J69n9J20p1p6J42J33j63J97j0j78K78Kl8
4429A43Q9l3rk0j18K56q4N0MM3p8J83k23K3K87k07jJ7P0j17l3J69j03R6k15P4
4455B63O0n3j02j7J70l86O3J44j72J74j54rk58K72l5o2M9Ll22J32K50m27%K92
4479a25j10j37J92j32m14N00J55l40K1J63r4Q8K4l89K16J81j14j72M19k48k03
4500e19M47j66R3O4J13k60K46Q0j73j97M75k57Q2J16k31j1K87P1m07L75l4j23
$$ plain form
4522 71 335 220 -13 188 233 255 230 469 331 70 512 338 124 326 502 154 260 441 -29 397 563
4543 563 223 53 347 159 138 524 162 44 134 81 108 84 183 -130 38 348 -172 -164 -105 -156 93 140 -386 -386
4567 -386 -130 -142 -330 -192 -314 -592 -444 -33 -292 -423 -310 -562 -353 -134 -615 -594 -32 -245 -411 -76 -182
4588 -182 -451 -285 33 -374 -239 118 -178 -219 216 -355 -384 154 106 -216 58 3 -412 386 401 -311 -31 295
4610 295 -58 441 531 60 -19 442 369 165 348 268 -43 481 712 -28 167 469 277 430 563 -69 -66 453
4632 453 203 41 493 291 -19 416 473 -269 -33 288 -33 100 232 -314 -181 347 118 -257 126 -133
4652 -133 -339 292 69 -446 -240 -12 -260 -144 -186 -330 -293 75 -112 -415 -111 -393 -404 110 -209 -452 -303
4673 -303 -29 -429 -238 -177 -670 -299 4 -322 -465 104 -331 -249 49 57 -318 148 213 -182 154 182 -283 -50
$$ packed form
4522G1K64j15k33K01M5K2k5K39j38k61M42j74k14K02J76l48J06J81m70M26J66
4543E63l40j70K94j88k1L86l62j18R0n3K7k4R9l13J68L10n20QN9n1K49M7n26%
4567c86K56j2j88J38j22k78J48M11k59j31J13k52K09K19m81K1N62k13j66L35j06
4588a82k69J66L18m07J35L57k96m1M35n71k9N38m8l22K74n5m15P98J5p12K80L26
4610B95l53M99R0m71p9M61p3k04J83q0l11N24K31p40J95L02j92J53J33o32LN19
4632D53k50j62M52k02l10M35N7p42K36L21l21J33J32n46J33N28k29l75L83k59
4652a33k06O31k23n15K06K28k48J16m2j44L7L68j87l03L04k82j1N14l19k43J49
4673c03K74m00J91O1m93L71L03l26j43N69m35Q2K98Ql75M66O5l95L36K8m65K33
$$ plain form
4695 -50 410 -52 -76 230 14 144 584 13 -157 260 194 35 501 355 -115 382 455 179 239 414 188 95
4717 95 618 185 -25 456 394 239 289 385 11 99 345 -30 -8 149 -30 88 164 -134 -11 179 -22 -220
4739 -220 -55 -41 -142 -100 -131 -336 -165 -64 -260 -176 -63 -355 -448 -29 -188 -339 -316 -236 -503 -161 -446 -569
4761 -569 -253 -157 -288 -88 -253 -559 -443 -94 -138 -389 -23 -159 -169 -55 50 -373 -52 121 -112 -268 18
4782 18 -253 5 200 -23 2 342 104 -56 154 157 146 257 387 185 112 228 153 381 389 232 144 305 225 196
4806 196 286 355 111 215 387 29 224 194 168 269 294 156 14 198 82 -26 234 76 -33 -134 -40 -8
4828 -8 -7 59 -91 47 130 -185 -255 -54 -117 -111 -333 -220 -426 -86 -251 -417 -273 -217 -380 -184 -166 -326 -394 -194
4852 -194 -320 -421 -115 -43 -285 -269 -369 -341 -129 -66 -159 -10 -138 -192 -94 24 -82 14 19 -20 62 38 162 94 61
$$ packed form
4695e0M60m62k4L06k16J30M40n71j70M17o6j59M66j46m70M97P3k76O0J75k26r3
4717I5N23m33k10M81o2j55N0R6l74Q8K46l75K2J57j79J18P6k98J23J90k01j98
4739b20J65J4j01M2l1k05J71J01j96Q4J13k92r3M19j59j51K3Q0k67L42k85j23
4761e69L16R6j31K00j65l06J16L49m4k51L66j36j0J14J05m23L21J73k33j56K86
4782A8k71K58J95k23K5L40k38j60K10Lj1J11J30k02p3J16p5K28Qj57q8J61q0k9
4806A96R0O9k44J04J72l58J95l0k6J01K5j38j42J84j16j08K60j58j09j01R4L2
4828hJO6j50J38Q3l15p0K01o3Ok22J13k06L40j65j66J44N6j63J96J8j60o8K00
4852a94j26j01L06P2k42J6j00K8K12O3r3J49j28n4R8J18j06R6Nl9Q2k4J24o8l3
$$ plain form
4877 61 148 93 191 316 -139 130 -26 253 268 149 346 299 378 248 310 226 247 209 368 171 153 76 301 337 147
4902 147 299 247 88 150 151 143 191 99 219 50 85 9 25 48 -49 20 173 -223 -236 -55 -62 -245 -92 -51 -157 -43
4928 -43 -127 -379 -247 -245 -106 -280 -284 -326 -246 -231 -240 -101 -21 -405 -315 -81 -310 -229 -154 -208 -299 -296 -170 -150 -121 -35 -62 -237
4956 -237 -124 -112 -155 -102 -44 -95 61 1 -32 -152 78 97 0 33 35 48 197 329 148 280 82 95 243 59 342
4981 342 234 149 113 195 416 189 206 353 139 69 366 306 195 27 267 187 294 239 49 115 196 77 42 -15
5005 -15 -106 23 29 -49 -13 30 30 -173 80 -188 -177 28 -125 -270 -51 -81 -368 -204 -221 -233 -165 -76 -215 -89 -181
5030 -181 -136 -338 -222 -79 -393 -172 -103 -232 -213 -18 -236 -223 28 -238 -290 99 -127 -294 -26 86 -46 7
5052 7 59 -271 157 174 67 -118 196 69 127 374 55 90 102 392 -68 276 296 2 279 445 145 302 358
$$ packed form
4877F1Q7n5R8J25m55K69j56K79J5j19J97m7P9j30O2q4K1l8J59j97j8p7K25L6j90
4902A47J52n2j59O2JqM8r2J20j69L5p6J6K3r7O9J53l96j3J81pj83J53M1j06J14
4928d3q4k52J32KJ39j74mm2Q0J5rJ39Q0l84R0K34k29Q1P5n4r1LJ26K0K9Q6k7j75
4956b37J13J2m3N3N8n1J56o0l3j20K30J9r7L3KJ3J49J32j81J32j98J3J48j84K83
4981C42j08q5l6Q2K21k27J7J47k14p0K97o0j11j68K40q0J07n5j90O6Q1j19l5n7
5005a5r1J29Op8L6M3%k03K53k68J1K05j53j45K19l0k87J64j7j2O8Q9j39J26r2
5030a81M5k02J16J43l14K21O9j29J9J95k18J3K51k66n2L89k26j67K68J12j32N3
5052GN2l30M28J7j07j85L14j27N8K47l19L5J2K90m60L44K0k94K77J66l00J57N6
$$ plain form
5075 358 258 286 424 309 129 262 292 287 315 328 154 279 404 -178 27 174 -75 81 55 54 -303 173 95
5098 95 -82 134 -28 -229 -28 142 -286 -208 -82 -47 -239 73 -473 -255 -29 -269 -372 -59 -238 -406 -30
5119 -30 -105 -464 -222 -152 -421 -284 -32 -326 -557 7 -39 -483 -22 -80 -181 240 -28 -408 58 109 -169 154
5141 154 135 -232 -201 368 3 -1 400 -30 -120 340 226 -148 266 236 -110 114 470 -37 18 476 351 79
5163 79 320 196 48 506 261 17 309 542 115 199 355 3 263 563 72 -64 344 220 105 429 35
5184 35 -117 175 242 -56 131 -94 -384 -42 346 -119 -140 71 -257 -226 89 -8 -219 -25 98 -204 -153 46
5206 46 -483 -216 10 -341 -486 -32 -321 -305 -38 -100 -411 14 -194 -374 -99 -82 -322 180 124 -165 -276 29
5228 29 -141 -2 132 -148 -324 44 128 -50 262 76 -213 191 233 -160 -71 287 163 76 344 -21 -24 339
$$ packed form
5075C58j00K8J38j15j80J33L0nK8J3j74J25J25n82K05J47k49J56k6jl57M76p8
5098I5j77K16j62k01K01J70m28P8J26L5j92L12n46K18K26k40j03L13j79j68L76
5119c0p5l59K42P0k69J37K52k94k31N64m6m44M61n8j01M21k68l80M66N1k78L23
5141A54j9l67L1N69l65mM01m30r0M60j14l74M14l0l46K24L56n07N5M58j25k72
5163G9K41j24j48M58k45k44K92K33m27Q4J56l52K60L00m91j36M08j24j15L24l94
5184C5j52K92O7k98J87k25k90L42L88m65k1K11l28L1L15r7k11J94J23l02N1J99
5206D6n29K67K26l51j45M54k89J6K67o2l11M25k08j80K75J7k40N02n6k89j11L05
5228B9j70J39J34k80j76L68Q4j78L12j86k89M04M2l93Q9L58j24q7K68l65lL63
$$ plain form
5250 339 302 -45 314 208 -153 449 241 -20 190 490 61 149 420 -67 59 327 220 83 249 26 52
5271 52 160 215 11 47 93 -112 147 264 -115 93 237 -131 -111 125 -122 -290 157 -33 -535 2 -57 -260
5293 -260 -82 -1 -376 -343 60 -392 -204 -18 -120 -441 -29 -226 -346 -86 18 -227 -110 -21 -208 -162 83
5314 83 -198 -222 37 -94 -122 -19 29 -104 109 118 -29 -40 216 22 114 256 55 78 98 104 106 397 51 116 243
5339 243 225 0 330 331 -58 305 515 72 191 279 74 109 300 173 91 104 -101 46 100 153 11 151 190
5362 190 -208 -3 49 -44 -94 -73 6 -134 27 98 -188 -49 -102 -178 -126 -96 -221 -216 4 -252 -243 -116 -224 -314 -79
5387 -79 -173 -230 -350 -167 -275 -234 -150 -274 -406 -157 -312 -177 -154 -125 -209 18 -195 -371 -20 -62 -140 -96 76 -7
5411 -7 -118 65 -8 -15 126 -139 202 95 148 52 205 -29 -83 116 120 219 110 70 202 201 214 126 287 323 261 122
$$ packed form
5250C39l7l47L59j06l61O02k08k61K10L00m29Q8K71m87J26K68j07j37J66k23K6
5271E2J08N5k04L6M6k05K59J17l79K08J44l68K0K36k47j68M47j90n02N37n9k03
5293b60J78Q1l75L3M03m52J88J86j02l21M12j97j20K60J04k45J17Q9j87M6K45
5314H3k81k4K59j31k8J03M8j33K13Rj47j1K56j94R2J42k01K3K0OKK91l46O5J27
5339B43j8k25L30Jl89L63K10m43J19Q8k05L5J91j27q2J3k05J47N4N3j42J40L9
5362A90l98K05N2r3n0K1P9j40J61P1k86J39n3p6N2L0j25NK20k56RJ27j08r0K35
5387g9r4n7j20J83j08M1Q4j24j32K49j55J35K3K9q4K27k13j76L51m2p8M4J72q3
5411gj11J83p3pJ41k65L41j07N3r6J53k34n4J99MR9j09m0J32jJ3q8J61L6o2j39
$$ plain form
5437 122 124 163 371 130 215 215 329 207 205 85 254 226 163 -38 -34 9 62 74 -142 -63 -31 39 -21 21 -33 -54 -87 -126
5465 -126 -180 -42 -57 -301 -260 -49 -150 -268 -70 -97 -239 -249 -223 -52 -150 -31 -110 -55 -72 -259 -133 -273 -231 -88
5489 -88 -49 -104 -215 -83 -32 27 6 -225 -68 -57 -156 17 -42 19 -213 -138 -56 -32 148 -287 104 94 118 -29 -15
5514 -15 -83 100 28 74 247 157 -6 406 171 189 188 269 222 19 88 247 240 238 117 261 194 -3 153 45 29 81
5540 81 36 82 24 -15 75 -20 124 -174 47 -9 120 59 -80 -98 -57 0 -274 -23 -52 -234 -173 -149 -115 -73 -24 -382
5566 -382 -262 -197 -84 -58 -106 22 -187 -154 -91 -246 -99 96 -197 -254 -92 -124 -243 -120 95 -249 -22 26 76
5589 76 4 42 -74 -141 178 -74 87 105 15 7 117 167 125 130 223 -26 15 279 148 57 201 189 93 195 157 65
5615 65 206 201 146 71 349 -37 128 255 55 57 187 188 104 117 70 114 263 269 -123 50 200 142 106 65 -79 -102
$$ packed form
5437A22KL9K08k41Q5%J14j22kj20J69k8o3k01MM3N3J2k16P9L2P0o0M2n4k1l3l9
5465a26n4J38j5k44M1K11j01j18J98k7j42j0K6J71r8J19p9N5j7j87J26j40M2J43
5489h8L9n5j11J32N1N9k1k31J57J1r9J73n9O1k32P5Q2K4J80m35L91j0K4j47J4
5514a5o8J83p2M6J73r0j63M12k35J8jQ1m7k03O9J59pkj21J44o7j97J56j08j6N2
5540H1m5M6n8l9R0r5J44k98K21n6J29o1j39j8M1N7k74K51k9j82O1K4L4M2M9l58
5566c82J20O5J13K6m8J28k09L3O3j55J47J95k93n7J62l2j19J23K15l44K27M8N0
5589G6p2L8j16o7L19k52J61J8r0qJ10N0m2NR3k49M1K64j31r1J44j2r6J02l8r2
5615F5J41nn5p5K78l86J65J27k00KJ30Jq4J3m7M4J49Ol92J73J50n8l6m1j44k3
$$ [...]
8191i6
##END NTUPLES=NMR FID
##END=
