##TITLE=1H_ABDE0406-4
 CDCl3, 8 sc, 
 7.06.2021
##JCAMPDX= 6.0         $$ Bruker NMR JCAMP-DX V2.0
##DATA TYPE= NMR FID
##DATA CLASS= NTUPLES
##ORIGIN= UXNMR, Bruker Analytische Messtechnik GmbH
##OWNER= root
$$ XWIN-NMR		Version 3.5
$$ Mon Jun  7 11:02:46 2021 Russian Standard Time (UT+4h)  she@DPX200
##.OBSERVE FREQUENCY= 200.131506
##.OBSERVE NUCLEUS= ^1H
##.DELAY= (6, 6)
##.ACQUISITION MODE= SIMULTANEOUS
##.ACQUISITION SCHEME= undefined
##.AVERAGES= 8
##.DIGITISER RES= 18
##SPECTROMETER/DATA SYSTEM= spect
##.PULSE SEQUENCE= zg30
##.SOLVENT NAME= DMSO
##.SHIFT REFERENCE= (INTERNAL, DMSO, 0, 15.7039)
##AUDIT TRAIL= $$ (NUMBER, WHEN, WHO, WHERE, WHAT)
$$ ##TITLE= Audit trail, XWIN-NMR		Version 3.5
$$ ##JCAMPDX= 5.01
$$ ##ORIGIN= Bruker BioSpin GmbH
$$ ##OWNER= she
$$ F:/spectra/data/she/nmr/H-F/1/audita.txt
$$ ##AUDIT TRAIL=  $$ (NUMBER, WHEN, WHO, WHERE, WHAT)
(   1,<2021-06-07 11:01:10.25 +0400>,<she>,<DPX200>,
      <created by zg, POWCHK disabled, PULCHK disabled
       configuration hash MD5:
       00 E9 B6 7A A2 85 ED C7 34 08 36 98 17 FE 4E 26
       data hash MD5: 16K
       2C 87 97 A3 C2 81 9F FE 03 35 E5 87 C0 D0 8D E1>)
$$ ##END=
$$ 
$$ hash MD5
$$ 3D 50 FB 4F D0 36 13 F9 46 1A FF 24 F6 4C BF 39
##$RELAX= 
##$RELAX= 
##$RELAX= 
##$RELAX= 
##$RELAX= 
##$RELAX= 
$$ Bruker specific parameters
$$ --------------------------
##$DU= <F:/spectra>
##$EXPNO= 1
##$NAME= <H-F>
##$PROCNO= 1
##$TYPE= <nmr>
##$USER= <she>
##$AMP= (0..31)
100 100 100 100 100 100 100 100 100 100 100 100 100 100 100 100 100 100 
100 100 100 100 100 100 100 100 100 100 100 100 100 100 
##$AQSEQ= 0
##$AQ_mod= 1
##$AUNM= <au_zg>
##$AUTOPOS= <>
##$BF1= 200.13
##$BF2= 200.13
##$BF3= 200.13
##$BF4= 200.13
##$BF5= 200.13
##$BF6= 200.13
##$BF7= 200.13
##$BF8= 200.13
##$BYTORDA= 1
##$CFDGTYP= 0
##$CFRGTYP= 5
##$CHEMSTR= <none>
##$CNST= (0..31)
1 1 145 1 1 1 1 1 1 1 1 1 1 1 1 1 1 1 1 1 1 1 1 1 1 1 1 1 1 1 1 1 
##$CPDPRG= <>
##$CPDPRG1= <>
##$CPDPRG2= <>
##$CPDPRG3= <>
##$CPDPRG4= <mlev>
##$CPDPRG5= <mlev>
##$CPDPRG6= <mlev>
##$CPDPRG7= <mlev>
##$CPDPRG8= <mlev>
##$CPDPRGB= <>
##$CPDPRGT= <>
##$D= (0..31)
0 1.2 0 0 0 0 0 0 0 0.06 0 0.03 0 0 0 0 0.0002 0 0 0 0 0 0 0 0 0 0 0 0 
0 0 0 
##$DATE= 1623049269
##$DBL= (0..7)
120 120 120 120 120 120 120 120 
##$DBP= (0..7)
150 150 150 150 150 150 150 150 
##$DBP07= 0
##$DBPNAM0= <>
##$DBPNAM1= <>
##$DBPNAM2= <>
##$DBPNAM3= <>
##$DBPNAM4= <>
##$DBPNAM5= <>
##$DBPNAM6= <>
##$DBPNAM7= <>
##$DBPOAL= (0..7)
0.5 0.5 0.5 0.5 0.5 0.5 0.5 0.5 
##$DBPOFFS= (0..7)
0 0 0 0 0 0 0 0 
##$DE= 6
##$DECBNUC= <off>
##$DECIM= 32
##$DECNUC= <off>
##$DECSTAT= 4
##$DIGMOD= 1
##$DIGTYP= 9
##$DL= (0..7)
0 120 120 120 120 120 120 120 
##$DP= (0..7)
150 150 150 150 150 150 150 150 
##$DP07= 0
##$DPNAME0= <>
##$DPNAME1= <>
##$DPNAME2= <>
##$DPNAME3= <>
##$DPNAME4= <>
##$DPNAME5= <>
##$DPNAME6= <>
##$DPNAME7= <>
##$DPOAL= (0..7)
0.5 0.5 0.5 0.5 0.5 0.5 0.5 0.5 
##$DPOFFS= (0..7)
0 0 0 0 0 0 0 0 
##$DQDMODE= 0
##$DR= 18
##$DS= 0
##$DSLIST= <SSSSSSSSSSSSSSS>
$$ [...]
##$SUBNAM2= <"">
##$SUBNAM3= <"">
##$SUBNAM4= <"">
##$SUBNAM5= <"">
##$SUBNAM6= <"">
##$SUBNAM7= <"">
##$SUBNAM8= <"">
##$SUBNAM9= <"">
##$SW= 20.0188882624521
##$SWIBOX= (0..15)
0 0 2 0 0 0 0 0 0 0 0 0 0 0 0 0 
##$SW_h= 4006.41025641026
##$TD= 16384
##$TD0= 1
##$TE= 0
##$TE2= 300
##$TE3= 300
##$TEG= 300
##$TL= (0..7)
0 120 120 120 120 120 120 120 
##$TP= (0..7)
150 150 150 150 150 150 150 150 
##$TP07= 0
##$TPNAME0= <>
##$TPNAME1= <>
##$TPNAME2= <>
##$TPNAME3= <>
##$TPNAME4= <>
##$TPNAME5= <>
##$TPNAME6= <>
##$TPNAME7= <>
##$TPOAL= (0..7)
0.5 0.5 0.5 0.5 0.5 0.5 0.5 0.5 
##$TPOFFS= (0..7)
0 0 0 0 0 0 0 0 
##$TUNHIN= 0
##$TUNHOUT= 0
##$TUNXOUT= 0
##$USERA1= <user>
##$USERA2= <user>
##$USERA3= <user>
##$USERA4= <user>
##$USERA5= <user>
##$V9= 5
##$VALIST= <valist>
##$VCLIST= <CCCCCCCCCCCCCCC>
##$VD= 0
##$VDLIST= <DDDDDDDDDDDDDDD>
##$VPLIST= <PPPPPPPPPPPPPPP>
##$VTLIST= <TTTTTTTTTTTTTTT>
##$WBST= 1024
##$WBSW= 4
##$XGAIN= (0..3)
0 0 0 0 
##$XL= 0
##$YL= 0
##$YMAX_a= 246325
##$YMIN_a= -248644
##$ZGOPTNS= <>
##$ZL1= 120
##$ZL2= 120
##$ZL3= 120
##$ZL4= 120
##$ABSF1= 10
##$ABSF2= 0
##$ABSG= 5
##$ABSL= 3
##$ALPHA= 0
##$AQORDER= 0
##$ASSFAC= 0
##$ASSFACI= 0
##$ASSFACX= 0
##$ASSWID= 0
##$AUNMP= <proc_1d>
##$AZFE= 0.1
##$AZFW= 0.1
##$BCFW= 1
##$BC_mod= 2
##$BYTORDP= 1
##$COROFFS= 0
##$CY= 11.3945322036743
##$DATMOD= 1
##$DC= 2
##$DFILT= <>
##$DTYPP= 0
##$F1P= 15.9154993809931
##$F2P= -4.1035820241983
##$FCOR= 0.5
##$FTSIZE= 0
##$FT_mod= 4
##$GAMMA= 1
##$GB= 0.15
##$INTBC= 1
##$INTSCL= 1
##$ISEN= 128
##$LB= 0.24
##$LEV0= 0
##$LPBIN= 0
##$MAXI= 10000
##$MC2= 0
##$MEAN= 0
##$ME_mod= 0
##$MI= 1.114404
##$NCOEF= 0
##$NC_proc= 0
##$NLEV= 6
##$NOISF1= 3.799351
##$NOISF2= 2.8
##$NSP= 1
##$NTH_PI= 0
##$NZP= 0
##$OFFSET= 15.70392
##$PC= 1
##$PHC0= -11279.04
##$PHC1= 8.201011
##$PH_mod= 1
##$PKNL= yes
##$PPARMOD= 0
##$PSCAL= 0
##$PSIGN= 0
##$REVERSE= no
##$SF= 200.130013532006
##$SI= 16384
##$SIGF1= 3
##$SIGF2= 2
##$SINO= 400
##$SIOLD= 16384
##$SREGLST= <1H.CDCl3>
##$SSB= 0
##$STSI= 0
##$STSR= 0
##$SW_p= 3612.71676300578
##$SYMM= 0
##$S_DEV= 0
##$TDeff= 0
##$TDoff= 0
##$TI= <>
##$TILT= no
##$TM1= 0
##$TM2= 0
##$TOPLEV= 0
##$USERP1= <user>
##$USERP2= <user>
##$USERP3= <user>
##$USERP4= <user>
##$USERP5= <user>
##$WDW= 1
##$XDIM= 8192
##$YMAX_p= 0
##$YMIN_p= 0
$$ End of Bruker specific parameters
$$ ---------------------------------
##NTUPLES= NMR FID
##VAR_NAME=  TIME,          FID/REAL,        FID/IMAG
##SYMBOL=    X,             R,               I
##VAR_TYPE=  INDEPENDENT,   DEPENDENT,       DEPENDENT
##VAR_FORM=  AFFN,          ASDF,            ASDF
##VAR_DIM=   8192,          8192,            8192
##UNITS=     SECONDS,       ARBITRARY UNITS, ARBITRARY UNITS
##FACTOR=    0.0002496,     1,               1
##FIRST=     0,             0,               0
##LAST=      2.0444736,     0,               0
##MIN=       0,             -248644,         0
##MAX=       2.0444736,     246325,          0
$$ Real data points
##PAGE= N=1
##DATA TABLE= (X++(R..R)), XYDATA
0 0 0 0 0 0 0 0 0 0 0 0 0 0 0 0 8 -8 8 -8 8 -13 16 -16 24 -24 30 -32 40 -47 51 -56 64 -76 86 -96 109 -120
36 -120 136 -151 171 -189 209 -231 257 -284 313 -345 380 -420 462 -509 560 -617 682 -752 834
55 834 -925 1031 -1156 1299 -1472 1686 -1952 2301 -2770 3437 -4461 6196 -9674 19150 -94693
70 -94693 -244543 122973 61557 -125587 139279 107145 -248644 -38344 202083 -65861 -66300
81 -66300 153937 -88849 -168593 176509 99425 -163774 31083 67557 -163963 27667 210552
92 210552 -84402 -130133 99490 -34246 -103558 160559 74646 -177549 -3622 96656 -87947
103 -87947 10645 139574 -87644 -118873 107712 33431 -76938 70313 21813 -137331 23286
114 23286 124903 -43860 -35895 55473 -66101 -60530 113694 45537 -82818 7296 19628
125 19628 -66443 30534 90585 -45181 -57658 40695 -993 -25194 53664 13410 -69463 -2645
137 -2645 48475 -5571 -816 23813 -34110 -39844 34346 36191 -8963 -4283 -5484 -29981 -2527
150 -2527 40442 15755 -23257 -11510 687 -7342 11624 26253 -12888 -34395 7517 22670
162 22670 -5844 4741 10117 -35168 -19928 42262 15228 -26611 7892 764 -40265 14106
174 14106 49722 -23645 -29225 28735 -11903 -30975 43320 17755 -53999 5497 36457 -33019
186 -33019 -3873 47567 -30973 -42394 47611 10716 -42573 32123 19931 -62508 7882 58136
198 58136 -34468 -21711 51698 -24550 -48836 56976 21547 -61529 20816 39677 -54865 -700
210 -700 63984 -35695 -41438 55873 28 -49547 43733 24485 -64105 12184 52612 -42528 -12524
223 -12524 57412 -29110 -43414 55834 9085 -54851 33196 32421 -58445 5308 57300 -39294
235 -39294 -27942 56707 -12680 -47602 46723 19165 -57305 16844 41283 -44846 -7661 52647
247 52647 -27135 -35947 47209 1585 -45813 31796 23521 -49719 6796 42808 -34760 -18479
259 -18479 45775 -14403 -38317 38272 12749 -46007 16021 32072 -38283 -7383 41366 -19946
271 -19946 -28923 35806 3574 -37751 20568 22569 -35868 -124 33620 -22072 -18150 33033 -4330
284 -4330 -30741 22902 15089 -32137 6288 28017 -24747 -12102 32232 -8546 -25802 25622
296 25622 10014 -31106 10340 24859 -26158 -8062 32079 -11151 -23297 27345 6129 -30924
308 -30924 14006 22632 -26856 -3494 30616 -15287 -20177 28825 1797 -28943 19174 18311 -29484
321 -29484 2172 28188 -20878 -14115 31329 -5123 -26956 23918 11552 -32337 9211 26254
333 26254 -26331 -8076 32437 -12940 -24801 27704 5713 -31800 15146 22117 -29569 -3319
345 -3319 30156 -18340 -18996 29586 -1301 -28499 19452 14176 -30446 4439 26215 -22678 -11353
358 -11353 30197 -9765 -25316 24841 7105 -30891 12531 22578 -27575 -5624 30028 -15264
370 -15264 -21368 28679 2751 -29948 16710 18080 -29151 191 27916 -18280 -14849 28618 -3610
383 -3610 -26182 20374 11807 -28317 8202 24224 -23117 -8129 28587 -10925 -21417 25953
395 25953 5980 -28477 13987 20503 -27058 -2696 29179 -15403 -17356 28288 370 -27107
407 -27107 17463 15217 -27017 3589 26095 -19191 -11987 27253 -6911 -22683 22899 8670
419 8670 -27251 10242 20485 -24177 -4439 27582 -13804 -18706 26587 1690 -27180 16378
431 16378 15119 -27901 2420 26258 -18655 -13276 26196 -6352 -23868 21406 9761 -27365
443 -27365 7993 19681 -23027 -4822 25843 -12449 -18088 22603 1203 -23803 14965 13391
455 13391 -25528 1244 22635 -15913 -9995 22832 -6926 -20878 18449 9226 -21481 6554
467 6554 15571 -19513 -4275 22802 -8253 -14999 16736 1451 -17709 11742 12197 -18257 -1662
480 -1662 16353 -8907 -7177 16789 -2919 -16335 10747 8811 -12457 3766 11480 -12551 -6342
493 -6342 15676 -300 -10696 9035 3180 -13957 5030 14323 -8876 -7380 10302 -2256 -8805
506 -8805 12005 6822 -15520 -1803 12190 -5472 -3330 12911 -4775 -15596 9261 10198 -10578
519 -10578 1220 9177 -13502 -5965 18746 -1105 -14883 9142 2797 -16303 9224 16402 -17077
532 -17077 -8684 16477 -6980 -11117 20723 1543 -25268 7767 15093 -16241 2185 19157 -18498
545 -18498 -15142 23387 1648 -17666 14763 3616 -26421 9993 24050 -18581 -7833 19054
557 19054 -14583 -13179 29683 2324 -28921 11213 12963 -22446 9180 25523 -24431 -15397 26963
570 26963 -3856 -16756 23414 2029 -31032 12232 22315 -20132 -339 21222 -20561 -13152
582 -13152 30021 -83 -21797 16019 4239 -25350 13641 23975 -21893 -8434 20301 -12177
594 -12177 -10568 27680 -685 -27358 10950 12439 -16771 8139 17527 -22282 -11069 22945 -1418
607 -1418 -12104 14942 -2801 -22022 12945 16663 -15007 -2273 10774 -13974 -5010 21277 -1993
620 -1993 -16822 7865 2772 -12602 9761 11813 -15347 -6164 11075 -4124 -3990 12175 -2702
633 -2702 -14674 4992 7931 -5622 2156 4911 -10073 -4679 10067 2770 -4524 881 -2178 -5700
647 -5700 4608 7833 -2724 -5639 -422 -9 1256 4884 1462 -5729 -4081 3847 3899 -516 789
662 789 -345 -5835 319 8493 249 -5723 2472 644 -5840 5432 8559 -7898 -4785 7954 -2612
677 -2612 -4761 10709 1023 -12808 4117 8319 -8220 1752 10739 -10640 -7679 14302 -356
690 -356 -10173 10406 1396 -16399 7987 13862 -13745 -3402 14017 -10676 -8842 19792 -878
703 -878 -19232 10867 8194 -17412 6007 15883 -17436 -7217 19424 -6512 -13150 17253 239
716 239 -20565 11743 12074 -19037 2459 16932 -16485 -7837 21558 -6041 -16726 17060 3237
729 3237 -21610 11030 15442 -20258 -1887 19427 -13195 -10357 21686 -2933 -19669 14445 8178
742 8178 -19306 7071 15596 -18245 -4340 20301 -8909 -12094 18170 -924 -18389 13498 10439
755 10439 -18776 3166 16349 -14568 -5898 19593 -6071 -14460 15786 3702 -17190 8710
767 8710 11961 -15667 -975 16060 -9286 -8635 15693 -1582 -13982 10769 6403 -14051 3863
780 3863 11581 -11340 -4095 13661 -4730 -9886 11125 1770 -12655 6446 8395 -11514 -997
793 -997 11199 -6688 -6776 10972 -478 -10934 6824 5830 -10579 792 9030 -7281 -4828 9628
807 9628 -1776 -8647 6621 3664 -9263 1911 7375 -7266 -3151 8608 -3068 -6940 7100
820 7100 1760 -8639 3455 6332 -7771 -1524 8718 -4122 -6347 8191 1022 -8853 4798
833 4798 5986 -8298 -574 8941 -4624 -5642 8514 446 -8298 5500 5154 -8336 747 8034
847 8034 -5666 -3606 8581 -1708 -7203 6866 3201 -8623 3170 7166 -7646 -1688 9476
860 9476 -4052 -6639 8715 1251 -9215 4961 6484 -8900 -547 9452 -5415 -5576 9090 -381
874 -381 -8579 6072 4370 -8854 1447 7657 -6777 -3225 8665 -3097 -7066 7545 1502 -9011
888 -9011 4219 6001 -8536 -697 8711 -5319 -5910 8669 -257 -9083 5648 4739 -9122 698
902 698 7926 -6252 -4088 8370 -1773 -7429 6296 2802 -8250 2584 6236 -6960 -1731 7787
916 7787 -3841 -5448 7326 470 -7584 4502 4816 -7682 258 7684 -5243 -4042 8127 -839
930 -839 -7052 5834 3741 -7752 1781 6983 -5738 -2672 7972 -2019 -6023 6446 2085 -7161
944 -7161 3073 5407 -6166 -906 7144 -3408 -4472 6897 282 -6677 4469 3954 -6882 784
958 784 6470 -4887 -3311 7055 -1165 -6249 5274 2947 -7171 1680 6048 -5628 -2396 6907
972 6907 -2121 -5745 5384 2013 -6750 2078 5074 -5637 -1690 6363 -2865 -4710 5553 537
986 537 -6273 3286 3972 -6316 -369 6317 -4241 -3992 6758 -741 -6892 4829 3615 -7377 864
1001 864 6791 -5394 -3611 7658 -1280 -7002 5822 3159 -7883 2156 6490 -6353 -2206 7839
1015 7839 -3107 -5778 7163 1240 -8150 4394 5304 -7975 525 8451 -5789 -4627 9199 -1182
1029 -1182 -8113 7206 4114 -9909 2679 8777 -7669 -2841 10022 -3759 -7309 9164 1874
1042 1874 -9807 4930 6296 -9321 357 9578 -6762 -5140 10177 -2113 -8691 8472 3175
1055 3175 -11001 3770 8289 -9385 -1633 10864 -6014 -7610 10589 308 -10536 6924 5277
1068 5277 -11368 1666 10032 -7991 -4343 10280 -3800 -8266 9792 2199 -11137 4710 6545
1081 6545 -9853 670 9865 -7454 -5661 10197 -1668 -8629 8054 2901 -11041 3749 8082
1094 8082 -8578 -1414 9360 -5675 -6109 9483 220 -8561 5767 3864 -9005 2305 8124
1107 8124 -6585 -2873 7678 -3476 -5130 7882 891 -7736 3687 4162 -6159 1757 6513 -5885
1121 -5885 -3310 6838 -1105 -4018 5446 324 -6492 3161 4773 -4210 -427 3980 -3566 -2155 5340
1136 5340 40 -3846 1928 775 -2879 1850 2750 -2599 -1239 1549 -836 -243 2225 -354 -2264
1151 -2264 39 795 66 685 116 -1431 -1381 381 1980 330 -1544 -614 -152 -1017 1323 2568 -2304
1168 -2304 -3090 1966 673 -1648 2425 618 -4974 194 4402 -1780 -1323 3152 -2636 -3517 5105 1834
1184 1834 -4744 1818 2048 -5439 1562 6156 -4325 -3254 5336 -2255 -4246 6982 1576 -8061 2505
1199 2505 4950 -6021 1241 7519 -6002 -5110 7955 -104 -5425 6311 1227 -9139 3495 7484
1213 7484 -6168 -854 6657 -5885 -4002 9811 -226 -7934 5124 2287 -7931 4229 7477
1226 7477 -8097 -2680 8113 -3799 -4353 8686 -625 -8919 5119 4469 -7146 2188 6362 -7421
1240 -7421 -3011 8347 -2404 -5134 6632 -475 -7984 5036 5081 -6884 190 5476 -6138 -2273
1254 -2273 8194 -1935 -6454 4915 1000 -6246 4303 4513 -7124 -1193 5887 -3247 -2450 5906
1268 5906 -1717 -5908 4503 2844 -4945 1621 3430 -5035 -657 5355 -1891 -3052 3839 -420 -4016
1283 -4016 3323 2628 -4061 283 3164 -2955 -855 4238 -1047 -3012 2452 817 -2481 1761 2209
1298 2209 -2795 -904 2593 -516 -1160 1919 -193 -2081 1254 1609 -881 -383 819 -698 -411 1452
1314 1452 285 -1239 290 579 -510 217 887 -385 -942 636 761 -1011 -141 1181 -808 -1294 1348
1331 1348 414 -1749 435 1376 -1761 -715 2271 -588 -1902 1603 419 -2454 983 1734 -2364 -474
1347 -474 2252 -1409 -1646 2616 -375 -2898 2062 1371 -3227 696 2574 -2957 -1151 3631 -1382 -2870
1363 -2870 3312 656 -3871 1891 2600 -3704 -78 3788 -2356 -2080 3919 -404 -3349 3059 1571
1378 1571 -3954 1392 3239 -3482 -504 4043 -2178 -2407 4120 28 -3936 2860 2272 -4119 846
1393 846 4005 -3246 -1652 4436 -1225 -3281 3672 1040 -4120 1719 2836 -3472 -274 3877 -2209
1408 -2209 -2360 3824 -203 -3553 2720 1772 -3845 807 3149 -2863 -1153 3622 -1265 -2831 3148
1423 3148 695 -3634 1509 2402 -3309 -346 3279 -1962 -2402 3112 -67 -3296 1981 1733 -3381 291
1439 291 2976 -2419 -1455 3133 -812 -2771 2332 981 -3126 946 2458 -2595 -587 3069 -1533
1454 -1533 -2127 2897 178 -3015 1758 1869 -2975 45 3049 -1888 -1640 3187 -321 -2761 2357 1329
1470 1329 -2830 571 2658 -2165 -909 2945 -795 -2129 2564 586 -2680 1459 1771 -2369 168
1485 168 2651 -1640 -1411 2831 -286 -2484 2004 1203 -2759 591 2366 -2011 -927 2633 -624 -2246
1501 -2246 2012 811 -2482 795 1788 -1906 -464 2178 -1052 -1456 1913 -1 -2094 1163 1106 -2187
1517 -2187 161 1896 -1625 -1131 2120 -515 -2024 1492 830 -2257 192 1772 -1522 -1207 1924 -267
1533 -267 -1961 1362 874 -2122 413 1635 -1401 -817 1756 -464 -1576 1629 449 -1938 831 1578
1549 1578 -1782 -218 2050 -1108 -1467 2008 342 -2125 1327 1666 -2283 -49 2475 -1306 -1193 2325
1565 2325 -270 -2236 1885 1233 -2425 534 2153 -2053 -624 2944 -1005 -2076 2416 318 -2385
1580 -2385 1620 1668 -2782 80 2652 -1753 -1031 2973 -921 -2665 2431 1085 -2749 1137 1907 -2824
1596 -2824 -300 3167 -1381 -1977 2498 -417 -2683 2128 1482 -2911 283 2017 -2166 -402 2686
1611 2686 -1304 -2199 2049 256 -2067 1624 892 -2782 296 2158 -1501 -693 1958 -1296 -1863 2177
1627 2177 741 -1985 642 854 -1862 299 2056 -1000 -1172 915 -256 -660 1500 485 -1437 -139
1643 -139 608 -317 735 903 -1028 -820 687 378 158 426 -309 -789 170 1019 577 -345 -493 -133 195
1662 195 390 949 227 -1264 -455 1286 205 -105 817 -678 -1479 1083 1427 -895 -96 619 -1443 -303
1680 -303 2320 -239 -1653 911 -143 -1460 1941 1307 -2604 -451 1731 -1412 -35 2925 -1551
1695 -1551 -3016 2232 1060 -2119 1621 1146 -3754 -257 3468 -1279 -1521 2259 -1545 -2831 3255
1710 3255 1512 -3412 659 1506 -3037 596 3832 -2267 -2547 2841 -442 -2467 3406 1078 -4342
1725 -4342 834 3089 -2630 -89 3646 -2701 -2850 3833 592 -2942 2354 1113 -4172 1061 4079
1740 4079 -2526 -1364 3119 -1907 -2171 4290 727 -4008 1610 1786 -3193 1388 3743 -3383 -1887
1755 -1887 3548 -738 -2126 3586 31 -4273 1869 2776 -2874 236 2831 -2908 -1655 4036 -320
1770 -320 -2837 2244 384 -3333 1850 2611 -2896 -657 2370 -2014 -1141 3319 -534 -3051 1758 864
1786 864 -2335 1508 1758 -2867 -834 2449 -979 -1198 2038 -586 -2515 1715 1361 -1838 193 1094
1802 1094 -1685 -217 2014 -663 -1316 994 -85 -1137 1141 711 -1484 6 930 -766 14 1100
1818 1100 -609 -891 751 357 -500 317 356 -586 -213 525 163 -164 -105 169 42 -122 363 374 -368 -327
1838 -327 606 27 -229 592 13 -735 467 770 -542 47 749 -688 -181 1411 -336 -1037 1037 274
1856 274 -1209 719 1108 -1537 -115 1714 -1024 -1017 1788 -334 -1610 1354 740 -1882 489 1444 -1707
1873 -1707 -424 1910 -1076 -1363 1901 -148 -1970 1308 873 -2173 388 1613 -1709 -613 2049
1888 2049 -1055 -1678 1965 197 -2178 1164 1144 -2407 327 2064 -1572 -991 1995 -562 -1664 1787
1904 1787 503 -2307 788 1376 -1855 19 1877 -1463 -1010 1970 -134 -1656 1352 701 -1928 703
1920 703 1695 -1577 -285 1840 -809 -1090 1754 63 -1700 995 1115 -1465 86 1615 -1008 -702
1936 -702 1653 -228 -1152 1167 508 -1374 460 1163 -1149 -183 1229 -708 -889 1180 96 -1153
1952 -1153 756 577 -1156 105 1157 -896 -716 1143 -140 -1105 754 399 -1126 127 952 -744
1968 -744 -437 887 -307 -888 723 360 -979 148 520 -856 -351 923 -436 -763 795 189 -952
1985 -952 558 563 -924 -63 1036 -520 -669 945 -12 -1174 576 682 -1004 -126 966 -616 -614 1063
2003 1063 -34 -954 752 510 -954 264 905 -768 -345 1033 -300 -691 1035 304 -1159 569
2019 569 823 -1068 -79 1173 -622 -665 1190 -33 -1064 789 640 -1162 176 999 -764 -429 1043
2036 1043 -310 -863 985 330 -1091 423 705 -1022 -109 1114 -667 -639 944 -214 -1009 675 509
2053 509 -1125 270 886 -882 -419 1005 -454 -985 894 257 -1057 382 745 -916 -213 883 -566
2070 -566 -836 933 -26 -1072 622 476 -950 19 820 -602 -479 975 -155 -849 772 315 -1009
2087 -1009 350 815 -840 -195 943 -460 -744 918 159 -979 507 643 -862 -50 1044 -613
2103 -613 -630 921 116 -763 660 478 -797 98 816 -604 -299 1011 -244 -681 813 246 -912 351
2121 351 586 -842 -116 1015 -502 -654 907 -8 -953 573 619 -920 -43 800 -687 -460 902 -142
2139 -142 -748 511 338 -802 295 514 -846 -229 805 -518 -675 815 -116 -886 579 515 -1003
2156 -1003 -127 717 -644 -359 889 -4 -958 556 409 -868 277 696 -738 -427 761 -74 -532
2173 -532 646 130 -782 429 717 -655 -8 657 -430 -400 884 123 -740 486 319 -749 333 871
2191 871 -526 -568 782 19 -604 746 326 -862 219 837 -477 -145 599 -486 -608 856 294 -669
2209 -669 389 523 -806 107 1030 -431 -572 651 -135 -702 812 428 -994 35 600 -667 -159
2226 -159 984 -508 -877 706 401 -786 270 399 -1120 -175 1039 -369 -677 703 -284 -829 786
2243 786 420 -958 -55 549 -834 -115 959 -468 -691 803 40 -705 709 348 -1034 110 925
2260 925 -577 -360 891 -290 -929 777 353 -746 471 416 -770 179 1058 -380 -362 642 -251 -622
2278 -622 817 211 -895 303 438 -624 103 759 -527 -439 587 63 -467 489 140 -660 259 547
2296 547 -375 -20 281 -222 -348 502 -3 -184 219 -22 -240 289 278 -202 17 107 -325 -76 332 -2 -129
2317 -129 10 74 -13 71 69 -133 -107 43 10 87 -176 -105 208 -61 -179 242 -77 -325 118 139 -252 -107 179
2340 179 -280 -195 379 -126 -369 437 91 -408 338 106 -541 206 528 -471 -285 533 -156 -437 570 95
2360 95 -728 466 501 -620 -18 639 -495 -234 822 -39 -602 581 219 -768 340 478 -552 38
2378 38 530 -503 -359 808 71 -641 526 137 -879 341 727 -714 -178 793 -399 -321 967 44
2396 44 -973 485 589 -690 215 705 -769 -385 956 -198 -504 559 -5 -721 321 427 -724
2413 -724 -18 581 -541 -314 917 -198 -639 583 34 -932 331 551 -763 -297 676 -486 -364 849
2431 849 -120 -947 360 381 -617 101 473 -665 -234 761 -113 -519 433 -144 -603 625 385 -630 -38
2450 -38 489 -430 -138 690 -139 -522 372 323 -479 231 516 -586 -60 631 -77 -194 499 -65 -421 141
2470 141 229 -279 22 244 -284 38 366 45 -248 238 89 -304 90 384 -332 -222 273 -12 -196 190
2490 190 129 -336 50 363 -51 -177 216 -128 -193 106 219 -239 -50 202 -202 -157 285 1 -335 134 15
2511 15 -312 21 240 -391 -206 343 -65 -218 313 -1 -519 135 287 -432 -20 422 -342 -329 394 18 -385
2532 -385 238 220 -526 168 389 -260 -175 467 -46 -284 523 142 -480 293 388 -424 -46 461 -210 -233 415
2553 415 -68 -509 349 269 -613 295 488 -333 -105 623 -72 -376 522 115 -443 164 300 -448 5 311
2573 311 -344 -231 430 -58 -368 262 95 -426 184 252 -469 -104 401 -208 -388 357 85 -401 206 225 -549
2594 -549 -81 377 -285 -276 455 35 -476 229 174 -346 55 274 -325 -86 335 -266 -352 270 11 -460 262
2615 262 283 -367 104 438 -333 -107 291 3 -462 297 211 -350 91 390 -165 -139 303 29 -300 273 191
2636 191 -347 166 274 -231 -40 274 -80 0 252 17 -344 242 168 -295 -73 267 -170 -104 280 109 -245
2657 -245 226 356 -260 -10 232 -91 -234 267 20 -297 152 103 -270 -8 272 -264 -156 375 -93 -225
2677 -225 169 124 -299 66 224 -325 -220 397 -40 -285 188 165 -507 -50 299 -297 -72 376 -135 -361 385
2698 385 77 -526 175 261 -489 -195 477 -278 -189 376 -55 -435 315 216 -514 88 416 -390 -249 551 -320
2719 -320 -448 460 98 -689 504 373 -650 -18 648 -340 -194 725 -113 -489 538 275 -576 325 457
2738 457 -628 -74 702 -257 -384 606 -101 -537 509 194 -625 218 603 -521 -44 799 -459 -527 586
2757 586 25 -546 398 404 -651 106 560 -337 -245 549 -231 -427 546 184 -578 156 253 -541 108 581 -352
2778 -352 -208 487 -185 -341 409 164 -534 125 388 -398 35 555 -211 -316 373 12 -316 250 156 -357
2798 -357 -47 371 -190 -25 111 -94 -125 323 134 -208 72 44 -205 162 368 -83 -242 195 50 -158 142
2819 142 161 -164 30 261 84 -18 61 59 -116 -101 283 -26 -153 141 99 -6 115 198 -63 -19 64 -16 -19 339
2843 339 12 -376 52 171 -67 54 166 -260 -274 338 108 -135 45 52 -392 81 413 -216 -311 312 -130
2864 -130 -334 437 167 -505 17 259 -316 -45 347 -239 -363 460 -58 -355 338 186 -594 32 471 -386
2884 -386 -28 507 -358 -457 602 170 -544 181 143 -711 151 677 -386 -330 634 -123 -447 646 82 -673
2904 -673 182 468 -477 105 469 -369 -262 598 -172 -510 534 151 -619 316 466 -545 67 712 -392
2923 -392 -408 564 -59 -637 541 290 -638 197 580 -473 -137 504 -365 -315 620 -131 -546 445 129 -558
2943 -558 256 416 -588 -103 595 -273 -313 488 -121 -437 327 185 -544 80 403 -373 -184 244 -282 -299
2963 -299 293 -60 -365 240 221 -314 19 180 -319 -42 271 -206 -133 283 -126 -185 211 19 -229 -32 101
2984 101 -7 -95 149 23 -80 82 2 12 45 32 -11 -33 61 81 73 42 43 -40 -84 -21 161 -24 -82 149 107 -5
3010 -5 242 1 -270 83 186 -45 69 149 -236 -153 371 -94 -181 223 -8 -279 59 226 -134 -12 184 -94
3032 -94 -293 269 101 -378 31 205 -197 143 251 -365 -130 155 -149 -164 278 -8 -328 212 204 -354 -42
3053 -42 341 -286 -192 370 -31 -287 333 117 -343 82 286 -314 -138 206 -19 -233 225 14 -259 85 182
3074 182 -367 103 282 -222 -103 307 13 -201 329 -23 -218 123 379 -280 -9 263 -178 -337 314 103
3094 103 -309 106 201 -319 100 276 -197 -111 184 4 -124 231 22 -299 65 386 -243 -4 299 -170 -306
3115 -306 366 -50 -347 160 278 -349 36 395 -281 -202 375 -44 -301 228 85 -270 -79 188 -258 -91
3135 -91 271 -197 -236 281 -10 -187 110 88 -297 22 295 -152 -163 393 -79 -275 236 44 -319 80 186
3156 186 -322 -107 380 4 -233 293 95 -263 107 174 -255 -19 197 -133 -179 249 69 -147 197 116 -142
3177 -142 -17 209 -249 21 259 -148 -210 265 144 -254 128 152 -200 -3 195 -122 -72 216 52 -212 192
3198 192 58 -141 29 189 -164 -39 154 -94 -188 141 -8 -287 15 137 -151 -39 126 -227 -122 108
3218 108 -50 -150 76 129 -207 -11 228 -106 -145 119 44 -140 135 93 -289 -76 79 -49 -60 -20 -65 -52 38
3241 38 15 -123 7 80 -136 -13 153 -60 -52 183 -46 -164 126 216 -91 -106 212 -55 -210 52 58 -196 41
3264 41 60 -78 -69 104 -130 -60 32 63 -62 108 56 -196 60 116 -56 68 233 -87 -152 187 67 -195 149
3287 149 162 -191 -94 197 -200 -193 199 11 -74 99 47 -269 -12 138 -106 -46 237 -94 -128 217 -88 -167 155
3310 155 51 -251 98 156 -143 -17 223 -134 -125 114 96 -161 38 57 -200 -42 175 -40 -45 41 -90 -68 137
3333 137 -84 -113 69 21 -126 10 55 -10 -49 96 20 -52 77 -43 -59 95 89 -55 -8 45 117 -84 67 52 41
3358 41 17 57 56 -2 19 132 -63 -63 218 79 -94 90 144 -85 29 199 -35 -97 169 2 -192 60 -32 -122
3382 -122 57 169 -175 101 336 -163 -90 189 35 -281 73 187 -338 84 304 -169 -66 235 -108 -187 313
3403 313 -61 -285 52 128 -235 114 244 -338 -74 376 -22 -206 298 52 -324 269 232 -355 -40 367 -283
3424 -283 -138 323 -150 -257 293 72 -374 176 165 -282 -29 198 -222 -4 474 -69 -295 219 14 -204
3444 -204 254 216 -400 -35 378 41 -171 246 -66 -271 228 212 -316 67 128 -120 9 204 70 -176 147
3465 147 35 -51 112 74 -236 -21 95 22 0 249 -33 -100 109 23 -83 102 46 -186 -187 174 142 -233 58
3488 58 -65 -90 33 169 -233 -229 145 135 -28 139 -43 -221 -53 117 32 -85 2 -90 -186 171 87 -258 -39
3511 -39 79 -175 166 266 -40 -209 164 70 -77 99 176 -146 -27 52 -3 -63 119 -39 -270 3 162 100
3533 100 12 31 -160 -58 230 113 -51 -78 -2 -136 156 264 -170 -216 167 -110 -74 218 14 -291 38 190
3555 190 -24 -30 105 -198 -154 335 114 -195 13 156 -217 -9 270 -121 -5 204 -66 -171 240 105 -271
3576 -271 41 140 -226 -34 408 -184 -358 219 86 -232 185 243 -447 50 215 -204 -30 224 -141 -210 222
3597 222 72 -205 134 139 -205 130 188 -179 -122 321 -49 -87 245 42 -372 28 158 -250 54 341 -180 -112
3619 -112 241 52 -194 158 217 -142 -15 171 -117 -120 127 42 -69 132 -46 -159 51 102 -136 -29 159 -200
3641 -200 -173 54 -87 -86 56 -3 -220 -62 214 -159 -95 -7 70 -50 50 176 -53 -90 172 -103 -122 107 93
3664 93 -89 -58 93 -41 -46 103 -43 -166 100 -12 -86 92 27 -65 -49 82 -108 -29 44 -42 -206 129 122 -136
3688 -136 -9 193 -112 -70 212 107 -115 442 255 -246 -209 -10 -195 -57 93 -165 -110 305 -54 -133 162
3709 162 8 -223 -7 168 -165 -90 268 -162 -141 308 18 -310 111 105 -72 -22 237 -52 -85 258 92 -142
3731 -142 254 172 -103 -37 79 -110 -2 247 -124 -86 148 -27 -135 120 133 -205 106 170 -45 -150 148 34
3753 34 -200 102 140 -99 -80 138 -214 -26 95 -35 -75 115 -70 -144 43 114 -179 66 189 -116 -101 91
3775 91 -83 -181 108 242 -199 28 125 -107 -61 255 101 -237 176 72 -160 73 91 -103 -89 172 75 -68
3797 -68 227 95 -210 -43 106 -145 60 187 -148 -79 101 -6 -187 141 -12 -98 73 69 -85 -97 160 8
3819 8 -82 167 150 -83 78 136 -134 52 342 21 -132 157 93 -121 -4 60 -95 23 174 -132 -64 -16 -48
3842 -48 -143 52 186 -182 62 213 -132 -108 250 -35 -209 144 13 -163 90 200 -198 -78 213 -66 -150
3863 -150 139 12 -193 8 109 -195 2 193 -137 7 262 -15 -250 203 82 -326 92 177 -180 31
3883 31 264 -132 -194 91 -22 -286 135 149 -220 -13 161 -160 -95 199 -92 -149 178 -5 -245 63 121 -164
3905 -164 100 168 -181 -69 269 -77 -299 51 25 -265 131 126 -111 -117 203 -52 -115 174 11 -220 109 20 -133
3928 -133 -13 80 -63 -176 189 -39 -182 181 -78 -181 50 94 -87 -43 214 -148 -128 139 7 -150 -99 73
3950 73 -171 -68 107 -62 -121 95 -57 -76 95 25 -189 -3 108 -82 73 9 -62 -153 -50 8 -81 -1 55 -148
3974 -148 -71 126 -7 -74 2 -34 -204 100 186 -9 -128 84 -124 -45 54 66 -210 -1 72 -52 106 89 -116
3997 -116 -110 84 68 -52 53 -81 -45 37 240 13 -91 56 -99 13 129 39 -51 -13 -142 -57 120 181 20
4020 20 -204 1 94 63 117 50 -142 -172 57 155 38 -13 -107 -107 -23 247 37 -189 -182 -93 23 169 25 -224 63
4045 63 -3 -60 113 167 -111 -198 73 11 -50 68 85 -262 -42 186 67 -166 115 -188 -214 50 82 -15 40 24
4069 24 -114 1 323 34 -113 137 -83 58 296 118 -237 -53 240 30 40 200 -281 -152 131 66 23
4090 23 -23 10 -216 -11 196 3 62 -11 -50 -23 212 98 -108 -75 -34 0 87 248 -11 -150 102 -92 39 123
4114 123 169 -167 -159 37 53 98 83 -109 -154 93 82 -63 -162 -13 -217 7 56 58 -156 -70 4 10 134 43 -94 2
4140 2 51 18 34 76 -119 -149 -5 44 -87 -74 107 -19 -158 107 161 59 67 14 -157 -82 210 -150 -62 -31 -93 34
4166 34 181 43 -54 83 80 -80 -35 84 -17 -66 76 14 26 70 -36 -232 -62 175 -93 -72 105 6 -76 181
4190 181 155 -33 -53 79 18 69 142 -90 -117 16 38 24 137 -16 -84 45 141 -95 8 56 -20 -122 -24 70 -103
4215 -103 45 38 -110 12 132 49 -45 40 71 -63 -53 86 -35 -37 125 58 -74 -23 -76 -120 77 56 2 84 -8 -43
4241 -43 32 93 123 -187 54 118 -134 -53 52 -67 -135 229 -5 -20 51 28 -61 -53 80 56 36 85 -54 51 55 -5
4267 -5 -148 111 130 -57 34 66 10 -57 240 -16 -67 9 -50 -186 18 54 -137 13 93 -33 75 -24 -17 -58 25 -44
4293 -44 -91 39 60 -14 1 93 -64 -15 -30 -26 -44 -49 -74 -142 4 80 -128 -125 8 -27 -85 73 1 -62 -16 83 -72 35
4321 35 -39 -23 44 -19 46 -13 8 87 20 -39 -5 -19 -70 79 119 -78 50 34 -47 106 14 -3 38 70 -47 -151 57
4348 57 89 -50 -99 -27 21 154 36 10 -23 52 -27 69 -11 21 56 7 59 66 -49 6 1 47 -7 24 -32 -52 47 121 -82
4377 -82 111 129 -84 -31 100 45 -60 18 82 -99 -32 104 -35 -1 107 -37 -128 108 62 -78 -26 -2 -23 22 114
4402 114 -58 -48 152 -81 -122 131 -56 -112 36 10 -1 -148 153 -111 -124 182 4 -93 -15 74 52 92 6 -111
4426 -111 -57 86 13 -26 52 -6 -170 72 132 -149 -76 114 -13 9 125 37 -134 70 49 -139 120 93 -135 13
4450 13 188 -6 -88 143 -24 -49 -13 27 -69 -2 143 -65 -67 105 33 -35 61 22 -71 55 -6 -55 -17 177 -25 -11
4476 -11 51 -177 -100 25 1 -119 101 44 -177 -9 121 -40 -50 65 -63 34 37 29 -129 100 99 36 -89 125 -46
4501 -46 -97 77 56 -28 -5 -24 -66 -22 98 -59 -10 -71 44 -35 -49 33 -58 -12 32 -61 -93 -7 39 -95 29 83 12
4528 12 3 102 -78 -15 145 55 -36 8 -21 1 134 81 -13 -5 91 -36 -147 123 -15 -134 -85 74 -141 63 104 -18
4554 -18 -182 103 92 -116 94 40 -55 -48 109 54 39 -5 -50 -234 178 55 66 -104 -24 -100 80 225 -144 -34
4578 -34 -22 76 -35 8 112 -231 -125 100 -75 -11 -23 74 -92 79 89 -4 -102 -11 -190 -42 128 66 -6 -99 128
4603 128 58 96 47 -22 -34 26 11 -9 39 30 -179 21 88 39 26 18 -90 5 1 122 -127 9 -12 -128 46 69 -44
4630 -44 -147 39 28 28 30 50 -150 -55 59 -127 -44 177 -209 -141 27 22 -22 105 119 -192 9 232 3 -55 -2
4655 -2 -113 -54 138 160 -69 23 84 29 64 86 -31 -102 152 11 -23 121 -130 -199 59 133 -81 43 170 -100
4679 -100 -144 98 100 -30 45 -44 -192 98 36 23 -93 1 -13 -79 48 -61 -182 -85 -52 -143 42 13 -57 -177 108
4704 108 0 97 88 -14 -42 -25 131 26 -26 92 96 -14 116 88 78 -227 -67 69 -17 119 -4 22 -46 43 -39
4729 -39 -15 81 14 23 10 5 -61 32 -130 -78 120 51 -31 36 -69 -122 -63 27 21 -107 -55 44 34 -52 43 -28 -3 47 -17 26
4759 26 46 46 -17 25 28 -108 -10 54 -70 -8 2 36 -116 4 39 -87 -15 48 -41 -44 35 37 8 20 -115 -13 -57 43
4787 43 -3 -57 45 -60 -90 3 98 -71 42 76 -46 17 78 76 4 -32 25 -37 -18 150 -57 -33 15 -5 -97 -14 -52
4814 -52 -51 -31 78 -26 2 127 -9 -121 156 -15 -29 23 29 37 21 189 -24 -5 88 43 -56 18 -3 -14 154 83 -73
4841 -73 -89 90 -50 -15 99 -82 -80 124 22 -76 31 3 -17 23 151 -96 -59 127 -80 -10 114 8 -133 29
4865 29 161 -3 -49 153 -50 -58 105 21 -135 36 63 -58 -43 -32 42 -92 77 150 -103 46 69 26 -26 14 -38
4890 -38 -36 56 -32 20 -16 26 30 -38 84 -52 40 60 -39 -21 22 96 -87 -33 -38 -18 10 147 -27 -3 -38 37 14 -27 24
4919 24 -86 57 106 3 -7 40 -14 -57 1 37 -98 41 65 103 -11 25 -130 -61 70 88 -34 147 -63 -70 -56
4944 -56 70 93 -25 -50 75 -13 -29 33 -1 -47 -35 -33 -42 3 -26 21 -91 -7 16 -33 84 123 -36 -35 -16 74 -8 12 -3
4973 -3 56 38 -24 20 40 57 36 68 42 -161 39 62 -5 21 157 -68 -60 -7 20 38 10 13 -26 54 63 68 0 40 -22 -26 42
5004 42 51 -119 -35 73 -68 -73 134 81 57 37 -27 -91 48 -42 -14 64 9 -112 42 62 20 -36 2 -85 -98 18 27 -108
5032 -108 45 72 -94 -50 137 -52 -133 58 -16 -70 92 77 -126 50 36 -86 -83 -6 42 -23 13 12 -13 97 -13
5057 -13 56 25 -88 -1 33 -16 -7 -55 89 -99 -17 32 -5 -43 57 7 -57 43 97 -96 29 32 -83 34 3 -32 -59
5084 -59 17 55 -126 31 -10 -26 94 -1 -12 78 68 -98 9 90 27 -64 103 -108 -79 41 77 -44 13 132 -60
5109 -60 44 14 7 -19 119 -83 -148 -58 -53 -63 -22 25 -12 -24 120 -5 -16 61 -54 -157 32 49 9 37 103 7 -83
5136 -83 -51 79 13 76 -126 -106 61 -90 -124 23 -66 -106 84 58 -87 -26 138 -14 -41 41 24 -6 34 -3 -11 21
5162 21 97 -39 -4 122 -67 -20 135 -85 -40 98 99 30 12 41 -184 -61 116 149 -33 107 -29 -62 60 17
5186 17 74 -38 62 -11 -122 28 -68 -116 13 -146 -68 -61 28 -132 -36 -43 -40 -45 -33 86 -52 128 38 0 20 60 -83
5213 -83 -35 -45 111 -47 26 -133 -25 -37 45 26 1 -2 -170 2 38 -28 -32 -13 -25 -25 -12 56 -56 -9 38 -42 -34 0 -60
5242 -60 -129 -15 -67 -8 -37 -73 -43 -87 28 -71 -32 39 -39 -3 40 -79 17 -5 59 -33 -13 -69 -120 21 30 -46 141 -66
5270 -66 -45 77 -26 100 -61 -32 -39 -29 115 -7 -62 35 -11 50 -81 129 -27 -62 23 -11 -65 96 -37 -128 4
5295 4 -42 -19 15 -78 -48 104 43 0 29 117 -35 -7 -62 -59 -55 -53 18 31 62 -7 -53 61 62 -27 62 -11 -16 -3 -83 3 43 -115
5327 -115 72 23 -22 -11 -31 93 80 -48 78 -12 19 -38 83 85 -89 -45 -13 15 14 -25 90 0 9 87 5 87 10 65
5355 65 -26 105 83 112 44 20 -8 -18 18 11 30 5 36 -11 40 76 -142 26 -186 -22 -64 25 -51 28 101 -32 77
5382 77 14 39 -44 31 -5 16 -50 -80 71 31 -56 27 -69 -22 64 -79 -60 11 13 -129 59 25 20 28 -75 -91 -71 5 -78
5411 -78 -68 65 -12 76 -16 -54 56 109 33 1 -13 -19 55 38 26 37 48 43 -32 -189 12 -36 -6 -16 -3 -53 4 -52 -29
5440 -29 27 72 44 -37 -32 11 11 38 65 121 -15 -62 69 52 32 51 -41 -42 -19 -28 -17 13 -62 -57 -35 -20 22 19 -46 4 37 46 120
5473 120 29 -49 118 -44 -47 83 92 24 -93 46 -46 45 45 -12 -26 38 19 -37 -27 67 12 -109 15 5 48 98 -78
5500 -78 -39 -42 39 -100 108 -26 -98 -38 -86 23 -91 31 -11 127 18 147 24 -41 -7 1 10 -41 -64 67 54 -58
5526 -58 -4 -85 -80 -108 71 -43 -65 31 117 60 37 -11 48 -108 39 83 45 38 79 -18 -35 66 23 77 50 -23 -119 51
5554 51 9 -24 55 -2 -54 -35 50 -96 2 26 29 -48 -61 -8 -20 -87 43 -32 67 77 -15 34 -18 -32 29 -5 15 -55 -66 -37
5584 -37 -29 39 0 20 53 -38 -45 -89 4 48 2 8 137 152 -64 11 -69 35 86 109 69 -72 -29 47 -45 -45 40 68 -72 81
5614 81 1 -28 82 -17 38 77 78 -8 8 16 16 -108 12 -137 -33 13 59 14 -20 -25 -54 -144 55 52 -13 -52 67 57 -46
5643 -46 -24 -3 -46 39 -37 -30 24 40 -55 -112 -17 16 75 -83 59 -59 -56 -56 -67 17 20 -51 -77 -63 87 -40 23 -16 -114 38
5673 38 -131 16 -18 -12 -76 53 17 11 -106 63 25 -49 -58 -7 -26 34 -17 8 57 -46 -40 -159 46 10 48 -92 14
5700 14 -55 73 14 4 18 -4 -12 -112 101 25 -99 -3 31 57 55 -15 48 40 74 96 41 78 -18 -17 127 -17 4 88 -12
5729 -12 -151 -21 -40 11 19 -27 -176 -65 45 48 -26 -41 73 47 -18 24 77 -68 -5 -69 -32 47 -59 8 26 21 26 -1
5757 -1 47 10 44 79 -21 52 4 -18 -39 33 -6 -116 -35 -3 -18 -83 89 -152 -33 35 5 -46 29 32 -67 -54 37 16 106
5786 106 -8 -10 -50 27 -11 49 -27 -8 -1 38 14 -46 9 -28 -17 -59 -26 -18 -60 -21 -82 -32 17 -70 37 115 -138 -42 10 74
5816 74 -111 -60 76 29 47 51 -2 -30 -14 -39 -22 26 71 -39 25 -23 -68 150 49 -50 -19 95 -33 -20 27 11 -18
5843 -18 -21 13 -66 -41 64 7 88 13 -55 -176 -28 -46 -21 32 3 32 -34 20 37 -31 20 -89 -37 15 132 53 -32 -35 10
5872 10 -26 88 46 22 -76 -52 -29 15 62 -56 -93 9 4 -90 -9 -47 61 65 23 66 52 52 85 -13 -23 -32 60 -16 -6 -66
5902 -66 -71 26 -50 18 65 -104 54 23 3 -98 83 13 -14 -43 -32 -7 -33 37 63 35 54 -91 -63 -42 -13 96 -79
5929 -79 -7 -40 60 -110 -61 0 55 52 -97 -71 23 -32 -57 -27 112 3 40 141 11 59 -32 5 -59 15 -18 46 -85
5956 -85 -12 -5 -54 55 2 -55 -9 21 51 -44 60 -40 15 -4 16 43 71 -1 -186 112 -62 -49 -36 44 16 63 15 22
5984 22 8 -42 -12 100 -9 8 -19 38 -5 5 18 -10 31 -19 107 -27 -88 10 10 -11 45 -2 -52 -63 158 -23 30 -17
6012 -17 13 172 33 72 -52 -22 25 -12 -47 -39 3 6 -21 102 -94 -88 -93 -63 -7 29 -76 21 22 32 60 -20 28 78 2 43
6042 43 -23 6 11 -21 -8 27 -69 -7 121 44 -25 -2 8 -67 -41 6 -63 -18 -38 57 -22 28 32 -36 24 67 49 -38 61 -24 98
6073 98 -46 22 72 46 -9 -84 -71 21 96 2 12 48 -49 23 49 76 -64 10 -20 -31 -51 8 -69 59 13 -15 -82 37
6101 37 1 -73 75 34 -76 14 -6 -90 -45 -99 39 -30 32 -66 57 -2 -37 32 20 -8 -34 52 -60 66 12 -53 -73
6128 -73 39 -46 43 -129 59 -36 14 -112 54 69 13 84 73 6 -85 -35 -8 -59 76 59 -42 18 -4 40 21 35 -70
6155 -70 72 -50 -22 47 48 76 -28 36 35 13 -22 15 40 -98 -38 106 32 -12 45 44 -42 33 -60 11 -113 -34 -50 -71 56
6184 56 12 1 4 -30 -52 40 -29 67 -29 28 43 -101 -49 15 -16 -71 94 -67 -51 -117 -63 15 18 -109 2 4 -58 -17 106
6213 106 -27 -12 -81 -89 53 -19 -75 -71 -36 19 109 -26 36 16 -97 -1 42 25 -40 17 63 31 17 4 -30 35 -95 -93 104
6242 104 11 -43 27 114 -17 40 7 42 73 -29 70 -26 -4 10 -74 0 -87 -40 -21 33 16 31 33 -41 49 -64 43 -24
6270 -24 48 -117 22 30 86 -29 90 -55 -82 -29 105 -107 -27 -40 -26 -12 32 51 35 -51 1 -127 -65 36 -26 113
6296 113 3 -11 27 70 87 25 -43 -3 -14 25 73 100 -55 65 49 -58 -13 22 14 93 14 17 -19 -40 -108 11 12 38 46
6325 46 -11 -25 95 36 17 -18 73 63 93 -31 57 62 -54 20 74 -69 -41 -82 -23 32 -48 -99 -27 4 98 -46 -32 -1
6353 -1 -40 -21 24 99 -60 -34 -65 -14 106 -7 24 15 16 -58 -59 -39 -90 29 79 -24 23 -72 -41 82 -126 -32 -54 51
6381 51 -62 -43 28 -6 9 -30 33 -127 -45 88 26 62 -126 -28 -55 -15 22 76 49 21 -53 -29 39 -80 -64 131 68
6408 68 91 -41 0 31 41 77 -120 76 -12 3 -34 33 20 90 60 -53 10 14 49 -59 -82 -111 17 83 24 26 73 45
6436 45 -42 -50 51 28 -3 11 -32 -4 28 37 0 -69 110 -47 1 1 73 42 111 -20 -52 53 30 -19 134 66 -13 67 16
6465 16 -40 47 57 68 146 -59 59 10 -32 -50 14 12 2 14 -7 -30 89 15 -14 21 7 -4 2 -48 64 37 -11 -9 24 -6
6495 -6 2 38 -60 -58 70 -20 78 -33 42 81 -8 38 -6 59 17 23 -34 -2 33 -27 -24 164 2 104 0 68 -81 -43 49
6524 49 3 64 -79 2 19 52 8 -87 7 -47 74 28 -26 -9 -44 27 27 46 -13 20 -35 -14 -71 -75 28 56 -17 26 15 60
6554 60 -1 62 -35 -57 20 -7 -3 43 41 69 8 47 -8 -42 -31 12 -34 -15 -19 -7 71 -53 13 -130 -59 -38 -39 49 88 -1 -11
6585 -11 -7 -14 -47 91 -21 15 -60 -10 40 2 27 -1 -49 25 72 100 -142 -91 64 88 -14 -72 -20 -39 -3 70 33 -4 -35
6614 -35 55 57 9 8 5 153 15 37 8 43 -16 -29 -57 -51 15 -133 9 -56 -2 35 28 32 -33 -77 -100 -5 111 -22 -101 -20
6644 -20 -75 -114 -91 56 0 -25 41 9 55 41 -14 33 37 -11 62 99 -49 -18 63 51 16 18 -63 -10 -72 7 -22 -91 29 15
6674 15 50 -11 -29 16 -91 44 -25 1 -26 -38 -2 64 -50 13 27 -46 -26 38 14 55 57 85 -20 -119 -81 -120 52 -74
6702 -74 56 79 10 14 42 2 13 -23 -33 118 8 -126 -54 65 -36 -17 9 -34 49 -15 -40 -38 -82 88 -136 -16 -50
6729 -50 -28 0 34 -55 -19 -15 -68 -11 -34 -46 -48 -101 38 6 25 57 -37 -28 -4 -16 -19 -131 52 -80 7 141 -52 49 -22
6758 -22 -81 56 -33 53 -44 -64 -24 -9 25 -20 -25 -111 99 -25 5 26 59 22 -48 -60 20 22 -31 -92 -17 2 59 -8 -23 -94
6788 -94 -21 8 -56 98 -45 -25 16 57 -42 -37 -29 68 -35 45 6 -4 24 20 -46 37 -23 10 115 147 -46 -18 1 60 -98
6817 -98 -44 -20 -79 -21 19 40 9 -60 -30 -83 45 -40 -36 27 48 -20 -63 64 -110 44 24 44 48 -13 -79 -59 -28 -41 -107
6846 -107 -49 -37 117 -66 -44 -74 26 -47 12 -48 -24 -23 37 -28 -21 98 -17 49 12 -67 25 14 62 -59 -87 8 6 93
6874 93 -13 -36 42 5 45 6 22 60 -47 -27 0 36 -31 33 95 -54 84 39 -140 4 50 -18 -45 -55 -26 79 -13
6901 -13 -44 130 -33 22 -72 -16 2 88 15 52 45 -73 30 88 52 -8 31 11 45 31 11 -31 4 -120 96 -30 49
6928 49 -35 61 -73 -44 30 -15 -3 -42 -4 15 38 12 -119 -37 -129 99 87 29 9 53 28 -81 -30 -19 43 -78 -26 29
6956 29 -64 161 87 -108 118 -96 47 7 2 44 -3 16 29 52 -48 73 -39 -78 -105 98 82 55 28 29 3 -42 146
6983 146 44 -77 -71 -22 -70 -20 28 -47 -20 44 -28 -5 10 56 -47 -48 41 -69 -64 62 31 -20 73 24 -94 -40 -47 88
7011 88 -28 48 -33 -127 18 45 -12 11 55 15 -124 -30 -17 36 9 -73 18 -46 43 22 -80 28 -49 31 32 55 30 50
7039 50 -1 -43 97 38 3 67 -9 84 17 89 -21 -22 -26 -83 25 -11 70 5 -39 60 53 18 37 -103 1 -47 23 -71 3
7068 3 -76 -29 43 -52 -6 12 53 45 71 36 4 -1 19 35 -29 53 -98 -17 116 106 -43 3 -36 -27 41 3 -10 -40 -1 16 -45
7099 -45 48 45 3 -26 -33 4 14 -81 -86 9 16 26 31 31 47 80 7 9 34 -97 -55 -58 -45 75 74 20 -4 28 -23 71 -7 -44 -48 -53 -43
7134 -43 -41 -17 -94 -23 -27 -21 -13 43 -2 36 13 53 -51 69 -7 64 24 -39 -34 16 -112 -23 -151 58 64 -33 -16 -30 52 -24 -38
7165 -38 20 -67 -111 34 98 47 -64 -16 -43 -13 -58 15 -42 68 -36 -16 20 -29 -35 -70 -94 60 -12 15 -100 -22 -79 54
7193 54 -51 41 46 47 -11 53 -61 16 74 98 -130 -8 0 -66 39 -92 65 18 -52 -38 101 -94 -40 -97 -13 32 4
7220 4 10 88 44 67 -87 -110 33 44 57 20 -45 15 -68 -95 -57 146 78 -10 34 34 -50 -136 44 4 25 41 -36 53 -53
7249 -53 -22 -73 9 4 -30 -12 -15 -58 50 76 21 -12 80 46 -48 31 -10 -22 71 -13 -55 -39 -109 -81 18 49 -21 -61 28 -38 -38
7280 -38 -116 -4 -31 0 132 17 84 -2 33 37 30 54 -28 74 9 27 26 -59 -90 7 14 -12 98 45 -86 -20 92 -5 43
7309 43 -20 17 -34 -44 -6 -24 -30 74 -9 59 83 -9 36 112 21 -147 -5 -19 -38 -75 18 -46 7 -4 65 22 42 -53 47
7338 47 61 8 30 52 -4 27 -33 -98 31 -46 44 -32 -70 6 -5 11 129 -51 27 54 -49 -50 -36 -35 37 -15 -37 -55 79
7367 79 42 -101 -66 -17 116 1 2 -22 34 53 36 0 19 4 -21 88 -24 -93 -3 6 139 -18 -4 53 99 -15 8
7394 8 1 -31 75 23 -71 -53 50 -23 78 14 -68 -12 51 -7 11 12 21 46 49 -54 -22 73 16 79 59 20 97 22 41 40 -54
7425 -54 35 -35 -25 -44 -52 -49 -36 96 -29 19 -85 -27 -28 141 -57 -23 -25 -3 -3 14 67 -51 -6 -14 8 -105 84 -5 42
7454 42 0 67 19 -24 -43 -33 43 -12 69 -75 -15 38 3 -106 210 -65 77 37 -100 66 -35 49 41 -4 32 -22 34
7481 34 -16 -21 34 -74 -52 -45 50 7 -110 17 -17 50 20 -4 54 33 -61 -2 84 25 -17 82 -7 -58 35 1 9 -72 11 -23
7511 -23 35 -69 6 -58 -48 7 1 18 33 -54 20 -12 120 -132 12 -53 -89 18 -100 -3 -70 113 51 53 21 18 -31 15
7539 15 12 -32 -4 92 -6 22 -61 31 46 -10 -67 -30 -76 -75 -41 76 -14 133 -42 35 -70 -1 101 8 -51 58 55 -74
7567 -74 78 -70 -60 29 -37 -43 27 37 52 -28 -21 121 -43 36 21 2 -103 28 14 -39 -42 -77 -16 -68 19 58 -2 60 -18
7596 -18 -59 1 -126 -41 -1 54 -36 2 62 22 20 -67 -8 16 145 80 -52 -24 16 105 -36 -6 71 -54 -69 9 58 -43
7624 -43 -9 -15 108 -73 -108 2 -58 20 88 -91 -28 -7 26 -42 -78 -91 29 110 -121 -67 52 -20 -74 23 -41 -119 22
7651 22 -67 46 -76 -18 -56 41 41 64 -52 29 -52 -69 57 -72 -63 9 -106 -47 -81 5 -24 46 28 138 -8 96 44
7678 44 9 22 78 -43 -87 35 -9 -13 -77 76 2 -56 33 91 10 -104 35 -65 96 6 -28 -59 0 -60 -123 5 -42
7705 -42 23 -6 -16 -43 -40 -13 -35 -5 162 -20 -34 4 71 -57 106 -21 -26 -77 24 30 -26 20 96 -7 -56 93 92 -17
7733 -17 -85 31 42 -52 27 50 -115 2 -6 65 -53 -38 -75 -27 1 -5 -38 21 -13 14 -30 -22 -113 -64 46 54 -34 -49 64
7762 64 -31 -86 9 22 -47 -39 -13 -36 -70 -72 60 -19 79 -35 -86 44 -12 9 -71 20 -55 -11 -31 60 -30 -9 -46 -3 2 -70
7792 -70 -10 18 133 -11 -81 16 106 40 65 -61 -45 58 -26 -15 14 78 -4 13 73 23 -55 76 -22 -86 -56 79 -13
7819 -13 -45 -39 -7 -13 -53 18 24 32 60 -111 -18 39 -83 21 -10 -61 40 -69 -69 -7 98 -42 -32 -13 -22 -37 -40 29 31 -130
7849 -130 -5 108 -82 5 -34 -4 23 -20 -95 110 -21 -19 -73 -6 87 -56 42 -37 51 78 -30 17 -3 -8 90 39 42 47
7877 47 -9 47 -45 46 -45 88 -52 6 22 -71 88 -10 -84 -73 61 -18 -16 115 24 -86 -15 69 -76 63 -44 77
7903 77 16 -18 -79 -82 157 26 -36 1 -50 7 -119 5 -105 108 100 -53 -33 29 67 -19 4 -59 38 49 44 2 1 -12 -26
7932 -26 -8 -8 22 130 36 3 20 63 -13 -52 97 -80 57 -24 -22 -2 10 -32 -131 -30 -20 -33 66 57 -8 -128 -22 90
7960 90 -1 -62 -13 50 35 44 72 11 28 -14 -29 -76 39 -61 37 94 -16 -36 -64 -57 -89 74 133 -13 -2 -134 32 21
7988 21 -100 79 -76 46 30 -48 83 45 10 -32 -70 8 -79 -24 -31 11 36 -7 -22 10 -50 0 61 -16 3 48 28 155
8016 155 -36 -19 -61 12 -29 -4 -46 6 53 -14 -54 72 -74 -63 91 -24 121 -59 -59 -15 63 -50 36 -19 -129 -3
8042 -3 -68 -17 -121 27 7 20 38 -43 71 -67 -19 81 -25 2 56 -83 11 -115 79 -2 -60 89 -61 -14 130
8067 130 5 -5 67 44 12 -17 13 58 -47 -56 15 -27 -24 -104 26 38 -47 -7 6 30 -33 -38 69 -39 -3 -161 -29 78
8095 78 41 52 -13 -33 -12 -5 4 25 11 23 -49 42 -60 33 -20 54 -11 76 -14 8 67 0 66 -8 -19 -46 37 -24 20 50 -7
8126 -7 -53 105 16 -118 -88 -18 26 -62 46 -101 23 -69 -59 -36 4 19 -45 -2 13 -112 -67 -112 -21 -41 -50 -40 27 86
8154 86 60 -17 -2 -23 -40 53 151 -21 -80 -20 -47 -22 19 91 5 -28 -8 61 -11 9 -51 24 113 -4 37 -26 -108 106 -34
8183 -34 63 -37 20 65 23 -8 73 85
8191H5
$$ Imaginary data points
##PAGE= N=2
##DATA TABLE= (X++(I..I)), XYDATA
0 0 0 0 0 0 0 0 0 0 0 0 0 -2 8 -8 8 -8 16 -16 24 -26 32 -40 48 -56 64 -77 88 -104 120 -136 154 -177 201
33 201 -229 258 -290 326 -366 409 -457 510 -566 629 -696 769 -851 938 -1034 1141 -1257 1384
51 1384 -1524 1682 -1853 2048 -2266 2512 -2797 3125 -3512 3973 -4536 5240 -6150 7376 -9127
66 -9127 11836 -16629 27595 -105932 76217 184398 -140313 53503 112471 -206537 -85091
77 -85091 246325 -16193 -137925 112826 -12163 -174842 146315 141589 -181971 -41164 122335
88 122335 -104295 -14921 201532 -60704 -186318 96154 51263 -102083 108667 95630 -183902
99 -183902 -42958 145492 -42312 -41772 122757 -55183 -137998 105475 82682 -97048 20562
110 20562 50836 -110866 4229 143057 -35435 -86496 50524 -17864 -58936 100447 57821
121 57821 -105720 -22341 52299 -38449 9853 85765 -41289 -79712 44893 29606 -33289
132 -33289 30418 18725 -66699 -7774 63334 -1203 -26114 13321 -20614 -33573 38400 41287
144 41287 -22946 -23137 -1756 -15017 3171 38697 9728 -34772 -16736 10683 2365 6663 17016
157 17016 -13951 -32863 9694 30500 -6388 -10891 6535 -21817 -15617 41977 19817 -37061
169 -37061 -6286 13117 -25102 8038 48954 -19481 -43322 26300 9314 -31148 29801 26297
181 26297 -51881 -7019 48298 -19489 -21065 42834 -14293 -47764 42705 29851 -47508 11139
193 11139 33278 -50137 -5820 65651 -21127 -42293 45421 -1378 -52833 44309 38616 -62530
205 -62530 -438 54046 -39776 -20906 63674 -18495 -55741 49013 22372 -55450 23484 39057
217 39057 -57709 -6398 62666 -28727 -34604 52871 -9351 -53863 45403 28061 -58704 12502
229 12502 45713 -49158 -14630 61254 -23979 -45577 50604 7568 -55738 31326 34822 -55884
241 -55884 -1494 51812 -33155 -26191 51421 -11221 -47633 39242 19384 -49710 15919 36186
253 36186 -43962 -9140 48825 -22343 -32707 42407 1768 -44791 27859 26913 -44771 1812
265 1812 41141 -28821 -20562 42187 -6808 -36821 29618 17240 -38581 9452 32112 -29843
277 -29843 -11533 37106 -11588 -27005 29657 7471 -33243 14887 24648 -28635 -4087 32107
289 32107 -16099 -20679 30593 2330 -30144 18517 19236 -29590 464 29899 -18847 -16998 30992
302 30992 -1276 -28987 20625 15587 -30663 4458 28315 -21500 -13659 30408 -6297 -27048
314 -27048 23153 11631 -30656 9162 24878 -26029 -8701 30166 -12535 -22600 27272 4634
326 4634 -31150 14733 20004 -30173 -1771 30899 -19097 -18584 30633 -3075 -30597 20980 15654
339 15654 -31864 4764 28128 -24101 -13878 31298 -8302 -26268 25245 9228 -31088 10645
351 10645 22300 -26567 -5184 29955 -14260 -19898 28000 818 -29407 18296 17340 -29436 3069
364 3069 28479 -21121 -14730 30489 -4840 -26878 23626 13097 -30627 7689 25669 -24235
376 -24235 -8994 30703 -9488 -22224 25192 6131 -28696 12997 20477 -25533 -1571 28215
388 28215 -16444 -16937 27685 -1341 -26213 19902 14747 -28510 4299 26036 -21582 -12163 29887
401 29887 -6659 -24503 23075 9237 -29375 9033 22268 -23677 -6192 27969 -12280 -20497
413 -20497 24316 2432 -26713 15719 16340 -26910 543 24909 -18586 -13424 27152 -5244 -24828
426 -24828 21047 10458 -28844 7479 22095 -23752 -6949 28555 -11465 -21247 23425 3364
438 3364 -26687 14632 17682 -25905 -1068 24657 -16710 -12755 26043 -4169 -23248 18779 10213
451 10213 -24515 7308 19767 -21400 -6195 25829 -8965 -17175 20802 1607 -22925 13977
463 13977 16352 -20926 -1216 19756 -13643 -9972 22947 -1964 -19781 13684 9106 -17805 6013
476 6013 15863 -15732 -6975 18642 -3645 -12235 13762 2163 -17489 7512 13543 -11943 -2517
489 -2517 12427 -8789 -9359 15060 3317 -13923 4645 7009 -12200 1226 14900 -7496 -11726
502 -11726 9781 2592 -9816 7297 7732 -14954 -4817 14513 -1924 -8304 9172 -1356 -15415
515 -15415 7361 13574 -10538 -5317 9957 -8046 -8303 17108 2434 -18165 4919 9081 -13545
528 -13545 3402 17354 -14074 -13692 17602 1178 -14517 14458 6493 -24683 3242 21701 -12426
541 -12426 -6749 18592 -11165 -18221 22604 9593 -21622 6626 11260 -21743 3832 27470 -15010
554 -15010 -17021 20140 -3206 -16697 24031 8564 -31331 4657 22713 -17081 -1566 25735
566 25735 -18065 -21910 27598 6834 -22803 14596 9670 -29009 5692 28775 -16893 -12098 21778
579 21778 -10859 -18119 27380 7035 -27810 8260 13701 -21919 5265 26203 -19310 -17808 22055
592 22055 -1889 -16329 21154 4782 -29953 5970 21144 -14739 -2267 17714 -16866 -15372
604 -15372 24129 5096 -18840 8480 4195 -20073 8389 20650 -15133 -10437 13243 -6487
616 -6487 -8169 18933 1387 -20629 4793 10321 -10676 4045 12865 -13844 -9743 14158 1143
629 1143 -7633 8930 388 -14479 4346 12319 -5183 -2791 5380 -6799 -4626 11376 4119 -7517
643 -7517 -944 1118 -3090 4290 7452 -3738 -7039 1248 3086 1547 3112 57 -5664 -2757 5249
658 5249 4828 -1881 -1951 -95 -3298 568 7932 271 -7606 809 3463 -4180 2416 7649 -6937 -7367
674 -7367 8339 1327 -6845 6975 2980 -12907 1312 11289 -6412 -3725 9827 -6792 -10146
687 -10146 13206 3980 -13303 5246 5835 -14477 3421 16079 -11620 -9666 14471 -3974 -12331
700 -12331 16032 4102 -21090 5972 14433 -15088 -1299 17614 -12603 -12570 19555 441 -17286
713 -17286 12642 7080 -20243 6207 17409 -16306 -5084 19114 -9997 -12994 20471 1185
725 1185 -20333 12227 10763 -20504 4345 20008 -16447 -9006 21175 -5920 -15591 18841 4104
738 4104 -21888 9451 15054 -17676 -347 18774 -13487 -10460 20869 -2245 -17245 14589 5973
751 5973 -19340 7850 15428 -17182 -3731 18727 -9494 -11665 18157 -243 -18195 11690 9624
764 9624 -17626 2706 15453 -13298 -6843 16791 -4552 -13207 13128 3522 -15840 6427 10717
777 10717 -13350 -1440 13371 -8353 -8359 13057 -654 -12550 8166 5980 -12860 2294 10842
790 10842 -9760 -5066 11907 -3174 -9555 9232 3043 -11689 3741 8806 -9174 -2765 10418
803 10418 -4450 -7334 8995 1568 -9673 4337 6452 -8272 -767 8851 -4733 -5469 8525
816 8525 25 -8003 5647 4734 -8179 1046 8063 -5647 -3889 8847 -1213 -7735 6696 4020
830 4020 -8863 2107 8099 -6650 -3283 9246 -1904 -7540 7109 3366 -8777 2769 7250
843 7250 -7248 -2204 8779 -3468 -6079 7558 1080 -8229 4516 5466 -8195 -114 8316 -5762
857 -5762 -4765 9022 -1288 -8573 6618 4121 -9577 1705 8183 -7504 -3886 9565 -2682
870 -2682 -8100 7539 2649 -9478 3368 6671 -8011 -1666 8515 -4516 -5962 8069 5
883 5 -8533 5599 4420 -9059 1318 7922 -6855 -3729 9058 -2331 -7669 7419 2920 -9401
897 -9401 3169 7405 -7865 -2149 9012 -3636 -6337 7797 1271 -8208 4323 5603 -7670
910 -7670 65 7834 -4998 -4014 8123 -880 -6892 6029 3405 -7733 2159 6807 -6322 -2290
924 -2290 8338 -2782 -6096 7097 1753 -7888 3738 5710 -7106 -982 7904 -3748 -5003 7348
938 7348 329 -7376 4570 4276 -7222 498 6615 -4970 -3286 6965 -1369 -6314 5478 2389
952 2389 -7290 2121 5568 -6260 -1775 6914 -3142 -5336 6168 932 -7221 3272 4704 -6680
966 -6680 -787 6777 -4095 -4628 6471 118 -6709 3774 3967 -6557 -13 6210 -4210 -3697 6357
981 6357 -679 -5827 4415 2794 -6331 1402 5476 -4967 -2332 6765 -1868 -5509 5827 1824
995 1824 -7151 3005 5685 -6407 -1318 7536 -3113 -5338 7013 1457 -7644 3878 5528 -7136
1009 -7136 -258 7746 -4209 -4534 7572 -270 -7100 5626 3872 -8048 1719 7251 -6572 -2507
1023 -2507 8799 -3237 -6888 8046 1911 -9234 4328 6437 -9047 -677 9819 -5594 -6261
1036 -6261 9362 -540 -9204 6735 4745 -10197 1502 8525 -7688 -3378 10083 -3914 -8029
1049 -8029 8892 1555 -10186 5455 6135 -10430 180 10040 -7166 -5423 10556 -2374 -9819
1062 -9819 8778 4177 -11455 3478 8257 -9888 -1953 11316 -5190 -7710 9799 357 -9944
1075 -9944 7240 5709 -11173 1502 9443 -7729 -3065 10535 -4295 -8187 9525 2194 -9817
1088 -9817 5306 6172 -10078 580 10247 -6470 -5015 9669 -2329 -8162 8317 3597 -9538
1101 -9538 3033 6729 -7889 -683 9218 -4697 -5684 7684 -293 -6700 6131 3222 -8463 1466
1115 1466 6364 -5157 -1168 6636 -4195 -5140 6825 1203 -5778 3349 2122 -6442 1455 5947
1129 5947 -4018 -2961 4087 -1740 -3155 4710 1027 -5012 880 2211 -2770 641 2773 -2607 -2264
1144 -2264 1968 229 -996 1654 -284 -2642 177 1509 -79 -32 -241 -1306 -803 935 1755 45
1160 45 -1886 -742 688 -45 742 1804 -1877 -3097 2198 2267 -1774 904 1234 -4077 -304 5197 -852
1177 -852 -3095 2505 -590 -3464 4304 3216 -5075 -83 3875 -3680 -141 6351 -2958 -5088 5132
1192 5132 698 -4949 5045 3257 -8001 417 7157 -4338 -1771 7270 -3846 -6740 7461 2833
1206 2833 -6959 3386 3515 -8165 1061 8825 -5145 -4638 6738 -2693 -5585 8359 2028 -9602
1220 -9602 2632 5471 -6897 1032 8062 -6731 -5600 8457 -637 -6726 6558 1802 -9562
1233 -9562 2976 7112 -6601 -1329 7101 -5327 -5061 8582 294 -7365 4689 2276 -7818 2912
1247 2912 7044 -6393 -2510 6493 -3518 -3983 7730 160 -7916 3565 4027 -5922 1842 5833
1261 5833 -6270 -2953 7000 -955 -4294 4947 357 -6279 3479 4764 -4855 -411 4593 -3606 -2085
1276 -2085 5660 -621 -4482 3171 1460 -3979 2142 3600 -3838 -1149 3886 -1621 -2004 3843 -65
1291 -65 -3859 1862 2153 -2568 490 2512 -2363 -1636 2941 191 -2074 1245 399 -2151 827 1829
1307 1829 -1154 -1025 815 -405 -801 1144 170 -1407 -97 793 -487 -297 515 -304 -1137 409 815
1324 815 -853 -636 1070 -498 -1402 987 791 -1641 -98 1544 -1065 -1291 2030 142 -2199 1161
1340 1161 1271 -2170 120 2099 -1724 -1219 2439 -359 -2078 2134 670 -2919 1295 2324 -2706
1355 -2706 -205 3156 -1858 -1810 3450 -47 -3384 2529 1939 -3727 758 3530 -2827 -1325 4109 -1062
1371 -1062 -3073 3356 1022 -3799 1892 2789 -3584 -76 3875 -2533 -1928 4100 -740 -3522 3395
1386 3395 1387 -4235 1529 3216 -3742 -678 4329 -2004 -3045 3990 178 -4120 2516 2237 -4113
1401 -4113 259 3644 -2872 -1753 3845 -1165 -3444 3116 1053 -3971 1561 2723 -3549 -579 3609
1416 3609 -2089 -2424 3368 -154 -3528 2298 1784 -3739 373 3203 -2670 -1450 3488 -851 -2928
1431 -2928 2710 1200 -3528 974 2682 -2956 -703 3321 -1404 -2174 2923 447 -3066 1756 1998
1446 1998 -2862 36 3062 -1797 -1582 3061 -326 -2672 2347 1332 -2939 985 2604 -2476 -878
1461 -878 3393 -1077 -2353 2869 623 -3045 1559 2220 -2705 -346 2910 -1470 -1895 2716 17 -2797
1477 -2797 1732 1324 -2711 454 2295 -2168 -929 2712 -1008 -2194 2180 598 -2908 955 1889
1492 1889 -2538 -425 2615 -1460 -1888 2371 121 -2571 1276 1578 -2409 -177 2170 -1556 -1299 2123
1508 2123 -393 -1907 1458 641 -2174 482 1562 -1741 -544 2048 -892 -1561 1978 408 -2061
1523 -2061 1006 1496 -1841 -366 2081 -816 -1357 1927 429 -2088 944 1449 -1777 -217 2006 -908
1539 -908 -1194 1852 99 -1715 1204 1131 -1795 179 2007 -1322 -880 2087 -308 -1840 1736 1102
1555 1102 -2101 484 2091 -1984 -801 2622 -648 -2040 2080 599 -2480 1159 1923 -2319 -445
1570 -445 2476 -1433 -1509 2603 -301 -2696 1797 1283 -2600 704 2137 -2478 -921 2752 -1061 -2064
1586 -2064 2458 72 -3025 1693 1961 -2871 -130 2367 -2292 -1314 3035 -661 -2776 2066 795
1601 795 -2724 1347 2162 -2888 -661 2657 -1223 -1322 2424 -526 -2532 1766 1358 -2238 718 1641
1617 1641 -2417 -388 2823 -945 -1513 1894 -367 -1927 1989 1412 -2108 -75 1553 -1333 -67
1632 -67 2223 -564 -1692 1115 578 -730 1090 631 -1454 -256 1194 -96 103 589 -822 -861 953
1649 953 752 -50 -82 -328 -536 390 1006 272 -670 -746 16 457 310 406 -243 -1213 -396 1283 448 -784
1669 -784 200 -279 -1270 961 1573 -1110 -970 716 -696 -522 1915 -37 -2263 528 668 -1285 1078
1686 1078 1444 -2532 -1147 2202 -430 -960 2126 -892 -3174 1807 2199 -2167 241 1677 -2914 -666
1702 -666 3876 -536 -2711 1896 -61 -2660 2593 2379 -3471 -631 2673 -1788 -379 3773 -1439
1717 -1439 -3425 2784 1285 -2715 2109 2076 -4091 -217 4201 -1675 -1612 3354 -1393 -3407 3527 2055
1733 2055 -3580 858 2252 -3477 172 4552 -1952 -2854 3022 -390 -2719 3490 1663 -4511 508
1748 508 3049 -2491 -197 3506 -2631 -3056 3829 595 -3040 2234 981 -4287 956 3638 -2552
1763 -2552 -1435 2825 -1769 -2477 3671 635 -3684 1399 1595 -2970 769 3060 -2528 -1771 2719 -763
1779 -763 -1893 2745 280 -3457 1315 1991 -2124 437 2252 -2408 -1405 2878 -43 -1965 1660
1794 1660 294 -2404 1292 2148 -1819 -638 1563 -953 -640 2125 -243 -1742 841 652 -1065 754
1810 754 1021 -1448 -315 1325 -353 -463 1050 -280 -846 746 776 -583 1 487 -459 -160 590 287
1828 287 -281 -126 97 20 -19 215 262 -439 -384 621 136 -444 191 187 -649 255 849 -638 -467 708 -358
1849 -358 -621 1046 -61 -1302 626 705 -1161 132 1161 -1240 -712 1694 -503 -1503 1387 291
1865 291 -1791 821 1207 -1658 -261 1674 -1118 -1079 1792 -309 -1737 1353 700 -2025 826 1448
1881 1448 -1868 -285 2066 -1197 -1229 2064 -260 -1948 1619 1009 -2201 546 1753 -1782 -349 2222
1897 2222 -1000 -1562 2004 165 -1852 1478 1142 -2075 277 2011 -1382 -781 2094 -780 -1602 1729
1913 1729 538 -1872 906 1239 -1629 113 1871 -1102 -1059 1865 -191 -1536 1457 735 -1852 465
1929 465 1365 -1323 -350 1671 -608 -1315 1515 147 -1452 675 729 -1368 -17 1333 -756 -744 1070
1946 1070 -182 -1083 1038 388 -1362 229 910 -1027 -289 1053 -534 -1163 1026 302 -1120 343
1962 343 810 -1105 -202 1212 -558 -800 860 158 -973 476 725 -970 -132 810 -462 -457 899 -64
1980 -64 -821 786 610 -829 146 924 -764 -359 1043 -194 -791 848 354 -1126 198 916 -707
1997 -707 -263 1078 -279 -846 847 303 -950 500 781 -802 -72 1056 -547 -646 1041 -24 -1049
2014 -1049 714 506 -1142 238 982 -1013 -574 1079 -320 -948 882 285 -1186 390 862 -1038
2030 -1038 -245 1121 -576 -786 970 4 -1197 606 599 -1121 88 850 -803 -474 978 -362 -937
2047 -937 880 120 -1126 318 738 -1059 -199 1043 -563 -780 1078 40 -994 643 611 -1083 216
2064 216 981 -821 -435 998 -172 -804 777 403 -999 331 872 -753 -216 956 -379 -718 916
2081 916 124 -902 630 651 -901 45 871 -633 -405 984 -184 -837 753 443 -859 225 880
2098 880 -667 -397 1000 -278 -727 741 292 -940 322 653 -857 -223 894 -448 -681 918 -22
2115 -22 -889 516 473 -907 -22 856 -770 -345 975 -287 -980 628 311 -995 252 694 -844 -344
2133 -344 903 -263 -623 716 137 -900 433 590 -754 -16 628 -575 -505 904 -117 -792 566
2150 566 155 -850 371 757 -710 -428 890 -308 -605 798 189 -988 257 692 -680 -52 790
2167 790 -506 -581 866 180 -652 448 303 -741 335 912 -421 -333 674 -308 -631 928 369 -894
2185 -894 196 708 -642 8 844 -470 -707 870 205 -677 435 369 -909 -124 887 -377 -496 539
2203 539 -187 -739 608 441 -791 -40 630 -655 -180 834 -265 -759 543 171 -675 541 584 -959
2221 -959 -306 851 -391 -408 763 -274 -1062 564 590 -801 -125 591 -739 -226 1119 -158 -903 545
2239 545 176 -721 530 697 -937 -269 891 -357 -297 873 -189 -927 772 430 -912 435 687
2256 687 -984 -116 1110 -368 -568 917 39 -960 704 701 -887 50 606 -677 -212 979 -192 -603
2274 -603 557 107 -538 680 446 -972 -5 817 -452 -134 690 -437 -727 581 152 -551 225 220 -605
2293 -605 -4 663 -353 -325 381 -177 -357 362 39 -445 97 141 -244 54 284 -278 -296 195 -249 -162 322
2314 322 -38 -259 -27 43 -11 85 -136 -115 -136 -36 58 94 -159 -177 162 -31 -130 101 37 -409 141 388 -266
2337 -266 -48 276 -59 -240 357 -101 -309 302 263 -342 111 375 -286 88 572 -289 -253 580 50 -476 369
2358 369 334 -732 206 669 -397 -235 602 -307 -552 681 205 -695 387 385 -612 151 717 -544 -264
2377 -264 643 -260 -632 595 233 -774 284 393 -763 47 856 -640 -470 662 -109 -492 714 123
2395 123 -997 199 776 -661 -278 737 -552 -633 875 -23 -762 314 170 -806 126 685 -629 -329
2413 -329 651 -318 -473 786 25 -854 379 377 -629 171 715 -635 -329 756 -117 -690 741 252 -912
2432 -912 374 780 -509 -103 541 -408 -399 730 -58 -625 327 233 -523 273 639 -491 -141 544 -234 -231
2452 -231 589 -8 -647 322 353 -449 85 469 -341 -219 544 -10 -369 355 133 -391 108 372 -337 -129
2472 -129 250 -134 -170 263 24 -304 103 123 -224 12 247 -363 -415 257 65 -313 219 148 -419 -103 183
2493 183 -73 -326 204 48 -427 117 371 -266 -209 163 -134 -146 262 4 -324 148 144 -281 73 218 -312
2514 -312 -184 396 59 -383 257 101 -483 12 334 -362 -209 484 -186 -378 480 160 -426 143 328 -423
2534 -423 -29 438 -115 -279 465 -27 -366 176 268 -440 104 430 -326 -59 441 -190 -485 343 93 -443
2554 -443 229 406 -501 -38 479 -250 -304 445 -39 -508 427 229 -505 75 406 -278 -266 494 -215 -409 394
2575 394 107 -511 148 297 -424 -31 463 -322 -166 513 -124 -484 326 148 -429 47 425 -326 -97 460
2595 460 -96 -318 245 195 -405 123 234 -275 -129 512 -243 -262 376 -2 -203 284 241 -442 132 348 -381
2616 -381 -73 385 -195 -271 325 146 -388 224 349 -372 -91 488 -81 -237 329 58 -405 171 403 -159
2636 -159 8 230 -158 -126 336 -4 -299 210 66 -283 136 257 -234 -103 327 -79 -356 219 142 -259 70
2657 70 231 -250 -79 172 -30 -337 161 79 -417 105 138 -157 -130 175 27 -204 291 28 -370 41 182
2678 182 -319 -101 151 -225 -236 290 -59 -299 148 271 -279 -142 409 -173 -373 453 -16 -420 316 180
2698 180 -419 64 317 -281 -185 428 104 -390 368 184 -449 295 375 -306 -6 578 -249 -330 502 -34 -629
2719 -629 403 333 -505 176 539 -574 -150 697 -203 -483 536 89 -568 410 427 -601 -4 588 -386
2738 -386 -281 645 -159 -584 465 174 -588 285 406 -722 -62 573 -495 -455 648 -204 -701 521 281
2757 281 -767 190 543 -712 -286 693 -334 -511 438 -51 -509 495 392 -656 -35 392 -539 -148
2775 -148 586 -270 -446 451 -31 -452 304 277 -491 -68 517 -281 -163 439 -108 -311 391 260 -228 -24
2795 -24 196 -256 -28 383 -69 -181 208 -39 -131 318 273 -306 57 233 -152 95 228 -81 -254 102 110 -97
2817 -97 55 124 -195 -125 151 36 -26 79 89 -139 -38 215 -41 -210 -47 55 -163 -117 225 -137 -182 158
2839 158 -43 -125 229 -13 -387 39 197 -93 -48 199 -200 -222 277 273 -288 -46 158 -273 60 339 -156 -350
2861 -350 220 31 -310 209 247 -411 1 399 -217 -230 365 -136 -391 246 190 -310 173 238 -440 -40 472
2882 472 -164 -222 449 -175 -556 507 284 -600 85 335 -522 -145 741 -268 -467 504 77 -541 400 443
2902 443 -736 125 690 -367 -199 595 -262 -411 755 145 -598 264 465 -636 22 608 -500 -284
2920 -284 725 -168 -650 544 290 -720 252 415 -657 54 664 -379 -363 587 -113 -437 577 64
2938 64 -672 331 312 -459 45 397 -497 -270 648 -257 -582 517 177 -641 183 359 -462 1 532 -276
2958 -276 -310 423 -27 -298 319 146 -357 207 284 -120 8 311 -351 -138 354 -116 -255 199 -8 -229 136
2979 136 115 -242 2 201 72 -76 166 -6 -125 37 56 36 -8 48 -113 20 -1 109 100 -168 26 30 -37 -81
3003 -81 81 87 -143 51 35 -5 76 41 -217 -23 207 -8 -35 289 -173 -247 372 111 -347 4 93 -262 117
3026 117 429 -137 -184 250 -50 -160 227 147 -191 -5 207 -195 -172 269 -163 -272 163 -8 -188 172 57
3047 57 -329 9 196 -211 -57 316 -257 -338 432 78 -483 149 196 -327 5 407 -97 -247 247 -57 -285
3068 -285 121 107 -247 170 231 -260 -104 252 -50 -270 350 27 -232 94 161 -245 16 344 -189 -149 355
3089 355 -100 -307 284 141 -354 -17 246 -279 -9 180 -113 -218 234 200 -282 125 72 -258 -37 289 -172
3110 -172 -98 347 -66 -330 227 73 -422 53 275 -380 -224 271 -173 -205 293 87 -258 87 224 -296 -97
3131 -97 215 -174 -235 215 -47 -238 248 163 -248 73 219 -289 -31 328 -28 -228 326 85 -310 211 226
3152 226 -333 -61 294 -122 -275 274 32 -262 127 216 -302 107 350 -184 -65 265 -66 -189 313 29
3172 29 -301 30 161 -210 -17 286 -209 -183 246 -75 -165 156 79 -222 2 374 -154 -194 304 -76 -188 218
3194 218 118 -288 139 49 -142 10 151 -46 -118 157 -98 -219 255 92 -166 -25 150 -182 -48 86 -51
3215 -51 -289 119 109 -278 1 207 -108 -78 240 -132 -52 96 18 -134 -103 182 -58 -77 121 22 -118 183 51
3238 51 -49 -20 120 -83 52 153 22 -3 97 -20 -169 161 133 -156 39 190 -69 -166 227 61 -171 71
3260 71 68 -206 12 129 -85 -69 127 -89 -29 199 71 -115 116 47 -183 34 184 -140 -40 222 -94 -189
3282 -189 197 1 -321 33 171 -255 -100 179 -141 -156 46 6 -195 107 154 -187 -108 128 -88 -175 189 -33
3304 -33 -89 154 -10 -129 122 152 -104 16 190 -113 -192 185 -35 -214 95 31 -144 44 80 -161 -51 83
3326 83 -14 -178 98 92 -115 154 28 -181 -69 -6 1 -2 129 40 2 65 16 -68 -24 81 14 67 110 92 -28 56 -65
3353 -65 -12 -62 18 -9 -26 33 134 -27 8 24 -40 -39 142 88 -210 -81 122 -95 -22 178 -30 -131 46 28 -164
3378 -164 103 180 -216 -15 255 -133 -77 266 -69 -293 279 52 -259 93 168 -346 11 327 -214 -191 257
3399 257 -71 -349 304 36 -380 20 245 -239 -68 226 -248 -129 294 65 -291 247 55 -379 33 349
3419 349 -317 -103 354 -228 -178 314 14 -350 111 146 -295 83 169 -238 -232 377 -167 -42 256 -95 -260 229
3441 229 203 -183 157 293 -232 -106 441 8 -233 121 -42 -325 241 355 -222 -193 134 -93 -16 175 23
3462 23 -218 81 116 -164 -14 63 -273 -8 158 57 -150 110 80 -248 110 166 -87 -208 154 -71 -155 106
3484 106 35 -162 -21 26 -73 -92 183 -158 -331 -83 191 -40 60 -60 -255 -115 222 11 -10 -67 -210 -193
3506 -193 119 162 -267 20 35 -32 19 178 -143 -207 22 129 -212 100 106 -179 -59 215 11 -118 59 47 -98
3529 -98 -3 267 -81 -93 68 -10 -113 223 112 -203 -31 67 -104 137 245 -71 -202 72 140 -21 65 -1 -299
3552 -299 86 377 -10 -149 136 -72 -238 218 361 -309 -81 226 -178 -23 231 -151 -156 74 -66 -320 221
3573 221 140 -388 -85 268 -236 67 354 -155 -345 252 156 -212 160 200 -363 -66 420 -58 -313 164 15
3594 15 -256 203 200 -307 -83 197 -189 -108 225 -71 -197 287 120 -214 359 -36 -196 -25 320 -113 -169 307
3616 307 -87 -231 208 124 -199 26 140 -144 -23 289 -75 -117 105 95 -192 77 77 -224 -49 189 -104 -40
3638 -40 158 11 -165 104 30 -24 -68 53 -96 -135 294 -59 -139 20 0 -113 -32 -17 35 -122 93 47 -135 115
3662 115 45 -115 -118 139 -62 -98 110 -5 -154 56 59 -93 -21 86 -100 3 210 -43 -220 76 -10 -193 124
3685 124 78 -196 -1 206 -121 -124 132 378 -132 106 -295 -53 -142 -42 21 -160 177 -54 -65 127 -56 -140
3707 -140 111 80 -92 112 224 -153 -148 233 5 -181 160 73 -260 -11 228 -238 -89 147 -13 -160 163
3728 163 127 -242 84 181 -169 -12 116 -58 -13 92 -74 -101 177 23 -350 70 106 -264 11 203 -136 -179
3750 -179 226 5 -269 7 125 -252 -6 124 -33 -141 87 69 -215 86 -26 -188 3 177 -157 -119 183
3771 183 -210 -77 182 -46 -185 86 99 -151 -57 255 -71 -96 267 33 -193 68 100 -191 -93 170 22 -75
3793 -75 145 124 -179 49 68 -50 12 96 -117 12 122 -93 -3 135 21 -158 31 165 -168 -50 117 -40
3815 -40 -195 103 33 -125 33 102 -177 9 169 -5 -127 45 -9 -125 151 42 -223 -39 58 -30 24 184
3837 184 23 -43 262 13 -166 118 40 -122 -43 105 -155 -218 254 31 -270 148 227 -209 -32 125 -139 -230
3859 -230 229 -31 -135 28 140 -265 79 192 -154 13 229 -127 -265 115 0 -220 194 101 -200 149
3879 149 208 -197 -149 319 33 -245 139 101 -206 163 230 -85 -29 214 -70 -168 191 -18 -70 177 82 -162 57
3902 57 278 -105 -116 134 -71 -185 177 0 -395 156 109 -214 -70 259 -109 28 237 84 -173 130 26
3923 26 -186 116 109 -114 -30 136 -128 -87 80 -7 -112 35 74 -145 60 132 -48 -88 57 -113 -89 76 106 -139
3947 -139 -85 39 -34 80 132 -32 -178 19 49 -73 27 -44 -3 -54 90 0 -54 92 -16 -11 43 142 -43 66
3971 66 94 -32 -43 111 71 -152 83 21 -237 -28 103 -82 -85 36 111 -8 159 75 -91 -104 139 98 -118 -11
3995 -11 -85 -153 87 146 -68 -20 19 -57 54 114 -12 -96 -18 -25 -109 113 93 -131 -135 -29 -131 131 123 -8 -167 18
4021 18 145 49 9 55 -166 -39 17 254 15 -179 -85 45 140 292 0 -202 -52 -46 90 125 38 -261 -70 62
4045 62 -17 36 77 -116 -223 77 146 -17 8 38 -151 -102 124 44 -61 59 -59 -91 160 149 57 -223 -31 -37 65
4070 65 153 5 -172 -22 74 -89 123 176 -244 -108 269 30 -59 54 -49 -97 174 131 -81 34 8 -174 -3
4093 -3 216 -13 -131 -44 -42 -29 212 122 -107 -36 99 -32 3 134 -73 -225 69 80 -17 138 -14 -260 -53 101
4117 101 93 -42 -5 -127 -66 60 218 -73 -80 25 -50 83 132 -34 -250 -16 35 -47 84 -12 -98 31 -20 -54 2
4142 2 33 85 -156 10 247 32 -7 -27 -170 -155 27 181 -46 -111 133 -7 56 197 20 -138 120 130 77 113
4166 113 61 -108 -141 132 -2 -23 46 -95 -47 32 45 -106 -42 -32 4 -50 178 -17 -89 130 -40 6 181 134 -87
4191 -87 -42 126 -56 -46 145 -62 16 84 -16 -70 -74 72 -105 -61 71 -111 -133 103 -94 -91 150 142 -97 -89 131
4216 131 52 -10 71 0 -108 -40 89 -112 60 -15 -121 -75 31 48 -37 -51 39 -5 66 81 -145 -88 73 -120 -119 39
4242 39 59 -51 63 159 10 41 91 -89 -132 107 37 -63 13 69 -98 -117 204 70 10 109 -9 15 22 51 -62
4267 -62 69 62 -43 111 199 -78 -101 56 -20 -183 57 -32 -134 -136 65 -39 -60 127 -81 57 135 108 -74 64
4291 64 19 -94 -24 61 -137 -60 39 24 -78 102 -41 -133 60 59 -23 -84 108 -55 -106 -11 -14 43 26 109 -97 -55 95
4318 95 -39 130 58 67 -10 76 42 -51 49 68 34 -9 137 -59 177 10 17 74 37 38 50 142 5 -91 -14 109 -27
4345 -27 21 72 70 39 -40 85 10 32 67 -28 13 35 81 14 -48 -75 12 -6 23 143 -38 -67 9 53 -45 63 8 12 -106
4374 -106 112 -30 23 -49 -33 -151 22 -117 -101 44 38 -153 33 64 -125 1 64 -27 -73 65 -117 -87 -56 2
4398 2 -96 -38 104 27 -57 173 69 -174 15 30 -3 113 102 -135 -69 81 -9 -62 146 18 -51 -86 41 -120 28
4423 28 70 42 -68 108 -36 -199 149 -59 -60 98 84 -59 -54 22 -109 -55 98 -16 -174 60 15 -149 1 63
4447 63 -89 -98 109 -58 -124 71 54 -14 -31 21 -199 -6 149 -128 -60 187 -129 -188 75 19 -210 27 73 -159
4471 -159 -9 79 29 -78 107 3 -82 -59 57 -100 -70 45 -33 -40 55 -26 -55 138 63 -68 91 85 0 29 -83
4496 -83 -13 -82 3 -53 -66 46 62 -2 83 23 -126 38 -32 55 14 -39 -44 -152 21 -11 -121 -62 89 44 6 74 -3
4523 -3 -49 -4 -3 46 22 59 -55 -56 140 -35 -115 5 12 25 -9 90 -40 -97 106 -4 -75 -6 173 -99 -60 116 -17
4550 -17 6 51 39 -141 -9 128 -74 -62 -18 -199 -3 99 71 -55 -35 -34 -41 30 64 -225 -131 50 -63 -20 131
4575 131 -127 -169 -3 73 -85 -13 82 -62 6 6 76 -73 -14 -94 -26 -33 19 -67 72 -93 -24 -3 96 29 -84 -11 -69
4602 -69 -70 34 17 -39 -110 24 65 13 48 -37 -151 54 193 68 -1 71 -43 -75 107 110 7 -66 26 -88 -3 104
4628 104 -82 -95 -48 1 19 23 -5 -151 -93 119 -27 37 74 -126 -145 64 99 -31 0 -15 -137 -28 186 -29 -149
4653 -149 -29 -54 -14 129 40 -134 -33 126 -77 -29 199 -130 -90 122 49 76 76 -32 -181 21 133 -20 -74
4676 -74 58 20 -70 92 7 -134 -9 42 -39 -5 163 -28 -60 91 -16 -33 147 101 -34 -26 31 42 86 70 -179
4701 -179 -127 151 40 16 -34 57 -87 -12 66 9 -80 -83 76 -5 46 11 25 -74 15 182 43 -14 73 -152 16 117
4727 117 10 -36 -130 -87 2 21 95 -107 -4 -67 -84 148 97 -4 -71 56 23 -78 0 -98 -116 -118 40 -16 -47 -19
4753 -19 -21 65 -4 20 -46 -109 -28 -96 -54 26 -34 -127 89 57 -115 35 94 -14 -54 136 -86 10 92 -105 -47 72 51
4780 51 0 46 64 -22 77 89 -1 -66 -2 17 -24 11 200 56 -143 14 -46 -56 -18 128 -80 -19 202 7 23 26 -57
4807 -57 20 65 -13 -72 46 18 -109 -70 64 -99 0 64 -30 -118 35 70 -173 1 57 -29 70 94 -13 -112 90 95
4833 95 -87 73 -66 -127 104 103 -116 45 38 -31 -126 81 61 -100 42 55 -120 -147 8 -7 -21 100 4 -38 104
4858 104 82 -4 -16 -30 -99 86 69 -7 -11 72 87 -82 50 66 -20 76 132 -131 39 110 -29 27 112 43 -127 -49 -27
4885 -27 19 32 56 21 41 172 -39 -87 -63 -38 -56 0 -15 -69 0 21 -64 -43 77 26 -80 -52 90 -45 -107 163 102
4912 102 12 -12 -32 0 10 23 1 -10 -46 79 -38 60 11 -77 -105 -32 40 34 25 -13 13 -105 -7 13 39 -19 -196 108
4940 108 -4 -63 -103 24 12 65 -37 11 21 -101 -23 64 50 10 -102 3 -57 -36 2 -29 -36 -9 -77 10 36 0 89
4967 89 -26 -97 -64 99 112 -44 87 -69 6 166 24 40 -48 76 -95 -15 77 -21 -52 -32 87 -72 21 -38 -123
4992 -123 13 -37 -116 -68 68 -136 -98 -39 -43 133 8 95 -67 55 -42 -58 -113 42 -31 -68 66 -86 -52 53 63
5017 63 -31 -42 -21 -20 -2 -28 94 -104 -4 52 -37 33 -16 -9 3 133 -43 -9 52 57 -151 137 115 -56 -85 151 24
5044 24 6 157 -36 14 58 -58 -89 15 22 25 -8 -7 -97 -65 16 -41 -30 86 0 -43 84 -92 -40 -56 -46 -78 40 23
5072 23 -74 16 143 -33 -69 -45 48 -27 105 49 20 33 -10 67 34 9 -1 30 41 -72 -52 17 -40 -75 69 48 -33 -48
5100 -48 -146 -24 13 53 -82 81 -49 -1 -109 9 -3 15 56 42 28 49 116 31 -17 102 -12 -46 64 -17 110
5125 110 68 -87 -75 -55 -30 -80 -94 31 -107 -7 60 20 21 62 -82 -113 70 13 -85 24 97 -38 57 130 4 -114
5151 -114 83 30 -75 207 -21 -85 20 35 -3 51 136 -49 -105 91 -70 -12 12 36 -6 7 37 -107 36 36 15
5176 15 -139 33 -37 -160 42 -57 -143 34 55 96 -130 0 -49 3 96 -62 -79 -43 56 -86 -52 -30 -122 -33 78
5201 78 -19 -61 -85 39 14 100 9 -120 -116 44 -38 -78 66 45 -84 21 15 -53 -56 49 -6 -2 48 -99 -24 17 -127 -101
5229 -101 50 88 22 95 28 18 -76 41 91 11 92 -62 -25 31 -169 23 7 -113 39 74 11 -30 108 -37 -17
5254 -17 15 33 13 52 77 19 -126 -13 -28 25 39 72 52 -30 -18 -23 -80 55 1 -5 43 22 -8 21 134 73 183 3
5282 3 -25 2 38 20 52 -2 -106 -48 -2 -63 -87 55 11 12 -19 -17 7 -69 -8 -37 5 26 -8 8 84 -52 -93 30 19 -121
5312 -121 57 -23 -89 -34 44 33 -83 -4 52 40 -79 55 -47 -53 -10 -82 17 -39 -33 -27 112 33 -114 87 11 -76 -19
5339 -19 84 -91 -157 -43 14 -115 110 -36 -129 -96 -65 -60 64 -46 31 10 49 11 -56 28 104 -9 138 171 -74
5364 -74 -55 38 29 12 28 -75 -63 56 -70 -135 67 117 10 -122 -69 16 -22 -12 -21 40 1 35 -22 -8 38 -87 94
5391 94 -74 -17 -27 14 -7 57 -74 -91 -42 30 -12 86 5 -6 -48 68 109 59 26 76 21 37 74 49 18 10 44 50 5 15
5421 15 122 -57 55 -61 -43 53 82 82 -84 47 59 -19 -38 10 7 52 -30 -58 -7 -107 27 -63 -37 0 52 -39 -12
5448 -12 -41 155 48 28 -25 1 7 60 51 -106 -1 15 -29 59 46 88 2 -36 -20 -102 102 63 -27 48 -160 -8 -41 -38
5476 -38 78 -31 75 -20 4 -54 45 59 8 -2 -42 19 -66 -1 32 111 -30 -28 -21 -24 51 19 70 -43 4 95 -111 27
5504 27 44 -99 -154 78 0 -72 -94 115 -82 72 -43 -37 52 10 -31 -84 19 -52 -17 52 -44 4 -81 54 -24 -3 -53
5531 -53 -54 3 70 67 -16 -65 -15 -21 -41 81 -31 19 -163 148 8 11 -16 26 14 52 -15 -38 42 -48 30 84 -55 -28 5
5560 5 -123 -62 0 -102 -109 49 69 -38 -81 53 -101 -46 -28 -14 -76 20 -63 68 -12 34 64 -28 -16 -104 -7 48 -2 -3
5588 -3 -57 101 -16 -6 35 -32 41 -14 97 76 -90 -30 -38 -7 54 108 -45 10 20 -60 -34 -2 21 -78 37 12 -46 -91
5616 -91 -46 -18 35 76 2 -36 30 -76 39 33 23 -41 -17 66 7 12 88 14 -74 64 -35 -72 -19 15 4 64 -100 109 50
5645 50 -55 65 0 47 33 18 93 110 -76 -36 -55 -59 -25 37 16 -79 -33 -4 -37 -49 27 96 27 -8 69 -63 14 25 -43
5674 -43 -129 115 -19 77 97 34 -32 -44 13 -36 71 43 -17 1 9 -51 -79 -16 3 -65 73 95 -58 -122 77 32 -26 0
5702 0 -85 -53 25 54 34 43 115 -77 -22 -3 68 41 -70 -161 -32 60 48 85 -9 2 3 -3 32 -93 -113 -33 -41 -34 33 85 6
5733 6 -135 -52 8 -8 69 -42 -56 -63 16 98 116 -16 -99 115 118 2 15 -127 -41 -2 38 -31 -24 43 -60 -10 27 74 -40
5762 -40 10 -40 21 98 -27 -87 -104 61 -40 125 -8 -98 -44 -85 -80 -38 141 55 -8 -43 -11 -91 20 -25 6 -8 -30
5789 -30 88 -69 47 0 -12 58 83 -42 -47 4 -16 73 -79 3 17 -37 -76 -16 52 -28 -66 -55 24 41 56 -101 -148 -37
5817 -37 71 34 -118 61 31 -14 -4 -40 -46 71 35 6 35 -4 -112 -58 14 -83 -91 42 22 13 16 38 -35 71 -17 -8 -82
5846 -82 30 48 11 -26 23 6 -13 -13 -58 22 70 23 0 35 -22 9 -33 42 -8 16 -70 30 54 -39 -144 -10 -49 -52 -33
5875 -33 -39 66 -87 -15 74 37 -29 100 0 13 46 -112 -20 -58 21 81 67 80 -144 10 -38 99 -60 -17 104 -24
5901 -24 -93 -18 25 21 72 -26 74 -53 3 -11 -19 -25 -98 12 -33 -22 24 -34 -50 64 26 -59 -86 -11 -100 -48 77 59 -65
5930 -65 86 -31 73 -108 -16 -72 -7 110 -19 78 -46 -45 -69 -65 27 15 -48 89 -57 33 41 -45 84 122 13 -4
5956 -4 1 51 -34 18 20 9 -57 46 -5 15 67 2 14 75 59 -95 6 -40 -125 -49 14 5 61 2 52 -70 -21 -76 45 16
5986 16 -35 1 63 -84 -101 -79 -9 97 46 -20 -6 -37 58 -53 11 -12 66 -27 -1 -86 -25 -1 116 53 30 43 -112 77
6014 77 -12 -14 14 0 -26 58 -41 -34 -61 -23 52 -23 16 43 -58 -23 115 81 -50 -21 51 11 9 -13 47 17 49 -33 43 1
6044 1 -7 -48 -44 4 32 -19 35 -4 37 67 33 8 -34 23 59 85 -68 -36 40 -18 17 -4 77 -9 -44 -34 -42 35 -86 18 -61
6075 -61 22 100 -69 57 -41 31 54 -10 89 -11 2 -65 47 63 -71 -83 -149 13 -59 6 52 -37 49 82 -67 -6 -82
6102 -82 -48 -14 32 -4 14 -3 -25 64 70 43 -57 -118 -71 -13 -56 8 61 -13 -21 24 -68 -33 -5 -40 8 -50 9 -8 -49 61
6132 61 -81 61 20 11 49 -52 -34 -38 33 16 -87 42 110 -55 11 46 -23 -53 14 3 -4 31 63 -180 -26 -5 73 35
6160 35 85 -25 -5 74 47 14 -34 -28 7 -11 -62 29 64 56 -17 94 -52 -102 19 43 26 33 12 -26 20 69 79 24 12 52
6190 52 50 -61 -18 -28 -75 -27 -5 -84 77 46 29 -40 -54 -43 85 113 -3 19 -99 67 -99 -12 106 13 41 90 62
6217 62 0 -62 -38 37 17 14 54 19 7 -23 -14 -57 -53 -19 -97 21 39 -43 81 -60 -48 -100 -56 32 16 0 97 6 82 -44
6247 -44 -62 -23 39 56 -74 6 -15 25 -22 39 -16 19 7 30 -42 -57 17 29 30 48 -28 -35 -95 146 -40 7 -96 -119 -53
6276 -53 138 -171 -56 -31 -31 -105 42 -59 37 -111 -11 27 24 18 125 122 27 -31 51 -23 37 -6 35 -61 77 141 -30
6303 -30 80 -70 -18 -112 78 3 -9 23 119 -99 -16 -69 56 4 -2 10 85 -109 -50 -92 -46 -99 -96 68 24 97 13 -20
6331 -20 -29 -14 24 62 5 51 133 -13 -29 72 130 -57 -96 10 -55 51 56 -5 2 115 -57 2 -37 -14 -11 -50 19 -24 -76
6360 -76 -56 27 -124 28 -26 39 -87 -23 26 -48 141 -47 -148 -87 -60 60 -66 35 6 18 38 -69 -22 -75 20
6385 20 -43 76 -57 10 -60 33 -30 7 -77 -21 -112 -33 -68 -79 33 -25 -64 -36 42 68 30 47 -16 66 89 6 19 96 26
6414 26 -50 0 36 40 -7 -18 -58 61 66 -13 47 -11 -42 2 24 8 -91 70 -77 -13 -64 33 -65 71 -8 122 -16 3
6442 3 1 27 43 -42 80 -17 -5 -2 18 64 40 -52 64 -28 14 -29 -30 -5 6 -11 -35 31 18 -90 -125 19 -13 -37 36 -32
6472 -32 -29 74 41 28 9 43 -12 25 40 35 29 95 79 166 -37 29 30 -69 -27 35 7 101 -1 -26 126 35 -39 72 31 48
6502 48 133 -42 37 -49 -71 -39 -68 36 57 44 -50 104 -53 -16 -81 21 -13 91 -25 -22 11 -27 -50 -34 -45 -67 -36
6529 -36 16 -118 -86 -48 -145 79 -20 37 -3 48 -40 29 -29 21 44 21 64 46 -46 63 -67 -26 -13 -6 1 12 21 89 63 28
6559 28 -9 70 -4 72 -13 -10 -11 86 75 -50 89 16 76 47 28 41 -19 65 51 5 -4 -52 -41 -51 -73 -20 -16 1 58 40 87
6590 87 -43 19 72 82 63 -24 -79 1 56 -6 63 -2 -70 -24 49 1 50 4 133 -46 16 9 -110 12 21 30 56 76 -81
6619 -81 -48 2 -20 36 25 -9 -45 -10 -41 -42 10 -21 16 82 -8 -127 68 23 39 16 -44 -85 -4 -25 57 -3 -85 -76 39 68
6649 68 7 -49 93 -15 -54 -4 -6 33 18 63 -29 65 -89 0 -32 23 96 -29 104 -23 19 -44 -39 14 -32 -38 -131 1
6677 1 12 86 -26 54 14 -16 42 68 -30 54 -6 34 -41 43 -25 22 46 -15 -14 17 32 144 -32 5 42 -61 12 2 -7 49
6707 49 32 21 -70 -11 -91 -44 56 -38 -54 -60 -96 -59 -35 -28 -11 66 3 48 -115 -22 22 58 27 -105 20 -49 -54 18 70 75
6737 75 -70 -33 -35 -23 -47 -7 30 -50 -29 54 24 0 13 -87 2 34 27 -36 -58 -21 -53 -50 33 -2 -46 -34 -22 31 -19 -46 8
6768 8 -3 63 52 87 102 -39 -14 15 -38 -11 86 -51 85 -30 51 46 29 28 -82 -14 -14 -56 -13 44 3 7 -31 -11 -66 -53
6798 -53 107 55 -107 -15 48 -76 -72 71 -89 1 58 0 -51 44 -19 0 77 84 20 9 4 3 -88 66 -20 19 52 67 51
6827 51 -30 4 15 114 -114 -63 -10 -69 21 46 -28 -100 41 -11 -115 4 40 -49 27 -49 -100 5 -24 -37 -48 96 18
6854 18 -64 26 -128 -4 -25 -65 14 4 53 -6 -2 37 -22 68 -13 42 -59 19 -25 -141 -63 -29 -36 7 72 -47 44 96 -6
6883 -6 33 22 88 -118 30 62 -49 1 20 0 -53 -25 -42 99 -91 47 24 34 -98 -70 8 119 40 -45 -13 14 -27
6910 -27 25 -27 3 1 -75 -1 84 -25 47 -16 10 27 3 6 -2 29 -19 45 -86 84 -56 38 30 -31 -9 -21 13 -77 23 45
6940 45 49 -134 54 58 -101 87 8 17 -123 133 -64 95 11 18 -57 155 50 -79 -17 24 13 22 37 -84 -18 5 -9
6967 -9 -1 78 52 -6 -16 43 36 -67 17 -87 -38 31 26 -90 6 -3 3 71 -112 47 38 13 -88 87 -65 31 -14 97 -12
6996 -12 -104 10 -19 -109 23 40 -17 68 -104 39 54 52 67 -33 70 75 4 62 -25 -46 54 3 -10 25 56 2 34 -16
7024 -16 -39 -8 -65 -60 68 -49 -60 -78 -37 -19 -33 13 -37 -19 -40 52 40 89 -29 115 -9 -90 49 22 -12 34 99 -53
7052 -53 -58 28 14 39 -7 -15 31 -58 30 34 31 6 21 51 21 4 37 13 23 -32 -89 -67 16 -9 2 57 62 76 -43 -117 77 -24
7084 -24 -3 -17 111 -62 -84 -34 -36 16 22 8 -1 11 -65 1 -3 -22 -69 -13 -60 125 -32 24 -151 127 40 19 -34 -5 -3 -14
7114 -14 34 48 13 -49 13 -16 -13 -6 -20 36 4 -36 -9 16 99 -35 88 20 -7 -48 -19 -60 -33 49 -40 77 26 -16 -65 73
7144 73 -116 115 -40 -125 -72 12 52 -35 -15 9 41 12 6 -1 44 -65 -1 2 9 -54 -17 -40 -73 13 3 16 -53 -72 58 98
7174 98 0 -25 -82 -81 13 -67 23 -122 -6 36 38 -72 23 59 -47 -101 -15 -19 -52 49 -6 -1 -96 27 -6 8 -11 31 -24
7203 -24 16 -66 113 36 -72 0 -11 34 75 -20 18 86 -49 -72 62 -22 -7 26 24 -63 18 5 -3 -29 -30 57 -14 60 -128
7232 -128 16 117 110 27 -38 -92 21 -77 55 -6 143 31 16 38 -45 30 7 -38 29 106 56 6 -32 45 4 117 100
7259 100 -54 -8 56 -97 -108 11 14 -43 44 -6 11 56 -94 -98 -34 -79 38 73 49 -57 50 32 76 -23 -67 5 10 13
7287 13 -9 49 63 -50 -20 -3 3 23 91 14 49 -29 -87 51 64 -44 -7 -25 73 -40 25 105 18 -34 54 71 -13 -1 39
7316 39 14 -65 108 -82 13 -18 102 -90 96 -31 -48 -15 -87 32 14 44 -58 -14 4 -25 -92 45 35 64 -14 15
7342 15 0 -108 43 -47 -101 -20 76 109 52 -47 -103 53 -60 -48 98 -22 50 -46 22 56 -27 -30 17 65 -71 60 -35
7369 -35 34 -43 -79 9 -95 6 -62 -56 -72 25 7 51 -54 48 -55 29 -58 -21 -27 -33 90 107 -41 17 50 53 -69 69
7397 69 92 0 54 -18 -47 44 -33 15 83 15 -142 52 73 40 -80 46 -39 43 34 -64 13 110 53 107 -59 14 -2 20
7425 20 7 7 -37 6 58 0 96 15 -62 -91 67 -63 -25 -95 11 56 69 -86 -108 87 46 -44 27 -28 -3 30 81 79 72
7454 72 35 48 -47 -12 109 122 -22 -89 -90 -142 7 26 -6 -9 32 9 57 11 58 58 -50 -96 -37 10 -41 8 42 -36 -60 28
7484 28 -46 -13 -3 -11 57 -39 9 -22 -53 30 102 -70 41 85 10 42 50 -55 -29 23 -9 50 -16 48 43 51 22 -76 -43 48 39
7515 39 19 34 -10 83 -89 35 17 29 -35 -17 -37 12 24 -67 83 -86 -10 24 42 27 45 -38 17 -42 -38 45 16 -5 95
7544 95 -69 31 -33 -4 30 7 -12 4 -14 -50 52 101 -69 -35 -65 19 26 -25 -115 30 85 -19 16 23 98 -11 -64 -46
7572 -46 -57 3 105 -81 15 133 -56 -18 100 106 -64 -5 93 -23 -51 -17 85 -51 -29 2 42 67 -3 -8 -3 -17 -46
7599 -46 17 -122 -24 78 21 -67 26 92 -1 79 51 -57 -106 -48 -4 -2 0 -86 38 -45 26 -63 -66 67 27 -106 49 -46
7627 -46 -52 -39 94 -76 -119 -20 -25 -49 1 111 50 -21 -15 -68 18 -19 -28 103 -36 16 79 54 -53 -101 26 -17 38 57 49
7656 49 69 47 25 -68 147 70 -46 -106 91 -51 -64 98 60 32 89 -1 -95 26 27 -53 -80 -37 -3 42 -79 -4 -66
7683 -66 -42 -33 -52 43 21 19 -18 10 62 -30 -62 -119 71 110 1 44 -16 58 70 38 -45 42 23 2 -85 18 -17 14 -101
7712 -101 -47 20 -47 -9 -6 -33 25 51 49 42 46 7 -112 66 5 67 -26 56 -19 20 -53 -10 -72 -78 -5 8 130 4 4 141
7742 141 66 -45 -107 89 -15 23 69 79 -8 -8 -67 -12 3 8 15 17 -88 13 98 -80 41 47 79 100 10 4 56 -41 108
7771 108 -31 -144 64 -16 -51 -47 70 -37 -61 108 -24 51 -26 -1 18 37 145 -22 29 110 -33 36 16 28 -23
7796 -23 36 18 -6 5 59 80 -23 8 -70 67 17 -89 -15 -51 -93 -53 31 33 56 40 12 52 85 57 48 10 7 -48 72 -52
7826 -52 17 -67 -32 62 48 -83 -11 29 38 -10 8 10 -15 -33 -10 -4 -25 -18 -112 -73 -14 -88 -8 -88 -40 -3 -5 82 -1 69 -54 -24
7858 -24 10 26 57 -37 -78 41 110 72 0 23 -17 -51 77 38 73 32 -69 -30 -11 -55 54 -61 40 -50 31 -122 22
7885 22 40 -156 -26 15 -116 16 -57 16 -59 -47 118 6 15 76 59 -3 -52 -84 63 -28 -68 -44 -6 -62 25 -100 3
7912 3 -15 62 50 -56 74 72 12 -60 82 53 53 49 131 -4 26 -84 -34 -86 97 -56 -29 -7 -44 67 40 -18 44 98
7940 98 -24 64 -6 -3 -7 14 -7 66 60 -38 82 -10 23 15 3 -8 -36 50 61 -25 -9 -7 71 38 -1 -63 4 49 -26 -48 9 -32
7972 -32 9 -50 33 -128 -18 62 -72 -19 19 66 15 49 -23 29 -57 -99 -36 42 30 -32 6 24 14 -109 -20 109 -39
7999 -39 24 22 -47 -51 27 -3 10 134 -23 -37 -42 70 79 18 128 95 -57 -45 -43 -54 -94 -54 12 18 32 -16 -5 51 72 -115
8029 -115 22 -50 -44 -15 -59 -150 -63 15 -55 15 11 71 55 47 20 14 -55 60 70 -8 21 -19 -29 35 107 108 -30 12 -34 6 27
8060 27 10 23 7 34 -57 16 -65 107 1 65 15 -110 46 5 -2 53 -8 24 125 25 -46 174 12 112 -84 -70
8086 -70 -19 -42 -51 -18 -22 -74 70 18 114 -62 -15 -19 -31 -9 -49 -44 -33 4 13 42 -47 63 -58 -75 98 50 -115 53 6
8115 6 -129 -40 -1 71 -7 38 -1 -51 -44 62 11 0 -57 -10 -22 -51 44 -10 -45 102 50 -106 38 14 26 46 -35 39 -5
8144 -5 22 -26 43 71 165 98 118 -84 9 -98 103 -35 21 33 10 75 32 -23 -34 31 48 -7 -68 -5 -109 4 -28 -63
8172 -63 -42 24 -53 -110 50 -34 -96 64 -6 46 21 69 41 14 62 -77 -74 -15 120
8191A20
##END NTUPLES=NMR FID
##END=
