##TITLE=1H_ABDE0406-3
 CDCl3, 8 sc, 
 7.06.2021
##JCAMPDX= 6.0         $$ Bruker NMR JCAMP-DX V2.0
##DATA TYPE= NMR FID
##DATA CLASS= NTUPLES
##ORIGIN= UXNMR, Bruker Analytische Messtechnik GmbH
##OWNER= root
$$ XWIN-NMR		Version 3.5
$$ Mon Jun  7 10:41:41 2021 Russian Standard Time (UT+4h)  she@DPX200
##.OBSERVE FREQUENCY= 200.131506
##.OBSERVE NUCLEUS= ^1H
##.DELAY= (6, 6)
##.ACQUISITION MODE= SIMULTANEOUS
##.ACQUISITION SCHEME= undefined
##.AVERAGES= 8
##.DIGITISER RES= 18
##SPECTROMETER/DATA SYSTEM= spect
##.PULSE SEQUENCE= zg30
##.SOLVENT NAME= DMSO
##.SHIFT REFERENCE= (INTERNAL, DMSO, 0, 15.7039)
##AUDIT TRAIL= $$ (NUMBER, WHEN, WHO, WHERE, WHAT)
$$ ##TITLE= Audit trail, XWIN-NMR		Version 3.5
$$ ##JCAMPDX= 5.01
$$ ##ORIGIN= Bruker BioSpin GmbH
$$ ##OWNER= she
$$ F:/spectra/data/she/nmr/H-F/1/audita.txt
$$ ##AUDIT TRAIL=  $$ (NUMBER, WHEN, WHO, WHERE, WHAT)
(   1,<2021-06-07 10:39:51.93 +0400>,<she>,<DPX200>,
      <created by zg, POWCHK disabled, PULCHK disabled
       configuration hash MD5:
       00 E9 B6 7A A2 85 ED C7 34 08 36 98 17 FE 4E 26
       data hash MD5: 16K
       7C 42 26 B7 B7 D1 5F 58 86 E8 F1 0E 90 AD E4 63>)
$$ ##END=
$$ 
$$ hash MD5
$$ 07 1D C4 36 9E FF B4 3F D4 6F 39 62 9F E6 EA 22
##$RELAX= 
##$RELAX= 
##$RELAX= 
##$RELAX= 
##$RELAX= 
##$RELAX= 
$$ Bruker specific parameters
$$ --------------------------
##$DU= <F:/spectra>
##$EXPNO= 1
##$NAME= <H-F>
##$PROCNO= 1
##$TYPE= <nmr>
##$USER= <she>
##$AMP= (0..31)
100 100 100 100 100 100 100 100 100 100 100 100 100 100 100 100 100 100 
100 100 100 100 100 100 100 100 100 100 100 100 100 100 
##$AQSEQ= 0
##$AQ_mod= 1
##$AUNM= <au_zg>
##$AUTOPOS= <>
##$BF1= 200.13
##$BF2= 200.13
##$BF3= 200.13
##$BF4= 200.13
##$BF5= 200.13
##$BF6= 200.13
##$BF7= 200.13
##$BF8= 200.13
##$BYTORDA= 1
##$CFDGTYP= 0
##$CFRGTYP= 5
##$CHEMSTR= <none>
##$CNST= (0..31)
1 1 145 1 1 1 1 1 1 1 1 1 1 1 1 1 1 1 1 1 1 1 1 1 1 1 1 1 1 1 1 1 
##$CPDPRG= <>
##$CPDPRG1= <>
##$CPDPRG2= <>
##$CPDPRG3= <>
##$CPDPRG4= <mlev>
##$CPDPRG5= <mlev>
##$CPDPRG6= <mlev>
##$CPDPRG7= <mlev>
##$CPDPRG8= <mlev>
##$CPDPRGB= <>
##$CPDPRGT= <>
##$D= (0..31)
0 1.2 0 0 0 0 0 0 0 0.06 0 0.03 0 0 0 0 0.0002 0 0 0 0 0 0 0 0 0 0 0 0 
0 0 0 
##$DATE= 1623047991
##$DBL= (0..7)
120 120 120 120 120 120 120 120 
##$DBP= (0..7)
150 150 150 150 150 150 150 150 
##$DBP07= 0
##$DBPNAM0= <>
##$DBPNAM1= <>
##$DBPNAM2= <>
##$DBPNAM3= <>
##$DBPNAM4= <>
##$DBPNAM5= <>
##$DBPNAM6= <>
##$DBPNAM7= <>
##$DBPOAL= (0..7)
0.5 0.5 0.5 0.5 0.5 0.5 0.5 0.5 
##$DBPOFFS= (0..7)
0 0 0 0 0 0 0 0 
##$DE= 6
##$DECBNUC= <off>
##$DECIM= 32
##$DECNUC= <off>
##$DECSTAT= 4
##$DIGMOD= 1
##$DIGTYP= 9
##$DL= (0..7)
0 120 120 120 120 120 120 120 
##$DP= (0..7)
150 150 150 150 150 150 150 150 
##$DP07= 0
##$DPNAME0= <>
##$DPNAME1= <>
##$DPNAME2= <>
##$DPNAME3= <>
##$DPNAME4= <>
##$DPNAME5= <>
##$DPNAME6= <>
##$DPNAME7= <>
##$DPOAL= (0..7)
0.5 0.5 0.5 0.5 0.5 0.5 0.5 0.5 
##$DPOFFS= (0..7)
0 0 0 0 0 0 0 0 
##$DQDMODE= 0
##$DR= 18
##$DS= 0
##$DSLIST= <SSSSSSSSSSSSSSS>
$$ [...]
##$SUBNAM2= <"">
##$SUBNAM3= <"">
##$SUBNAM4= <"">
##$SUBNAM5= <"">
##$SUBNAM6= <"">
##$SUBNAM7= <"">
##$SUBNAM8= <"">
##$SUBNAM9= <"">
##$SW= 20.0188882624521
##$SWIBOX= (0..15)
0 0 2 0 0 0 0 0 0 0 0 0 0 0 0 0 
##$SW_h= 4006.41025641026
##$TD= 16384
##$TD0= 1
##$TE= 0
##$TE2= 300
##$TE3= 300
##$TEG= 300
##$TL= (0..7)
0 120 120 120 120 120 120 120 
##$TP= (0..7)
150 150 150 150 150 150 150 150 
##$TP07= 0
##$TPNAME0= <>
##$TPNAME1= <>
##$TPNAME2= <>
##$TPNAME3= <>
##$TPNAME4= <>
##$TPNAME5= <>
##$TPNAME6= <>
##$TPNAME7= <>
##$TPOAL= (0..7)
0.5 0.5 0.5 0.5 0.5 0.5 0.5 0.5 
##$TPOFFS= (0..7)
0 0 0 0 0 0 0 0 
##$TUNHIN= 0
##$TUNHOUT= 0
##$TUNXOUT= 0
##$USERA1= <user>
##$USERA2= <user>
##$USERA3= <user>
##$USERA4= <user>
##$USERA5= <user>
##$V9= 5
##$VALIST= <valist>
##$VCLIST= <CCCCCCCCCCCCCCC>
##$VD= 0
##$VDLIST= <DDDDDDDDDDDDDDD>
##$VPLIST= <PPPPPPPPPPPPPPP>
##$VTLIST= <TTTTTTTTTTTTTTT>
##$WBST= 1024
##$WBSW= 4
##$XGAIN= (0..3)
0 0 0 0 
##$XL= 0
##$YL= 0
##$YMAX_a= 436588
##$YMIN_a= -461361
##$ZGOPTNS= <>
##$ZL1= 120
##$ZL2= 120
##$ZL3= 120
##$ZL4= 120
##$ABSF1= 10
##$ABSF2= 0
##$ABSG= 5
##$ABSL= 3
##$ALPHA= 0
##$AQORDER= 0
##$ASSFAC= 0
##$ASSFACI= 0
##$ASSFACX= 0
##$ASSWID= 0
##$AUNMP= <proc_1d>
##$AZFE= 0.1
##$AZFW= 0.1
##$BCFW= 1
##$BC_mod= 2
##$BYTORDP= 1
##$COROFFS= 0
##$CY= 11.3945322036743
##$DATMOD= 1
##$DC= 2
##$DFILT= <>
##$DTYPP= 0
##$F1P= 15.9154993809931
##$F2P= -4.1035820241983
##$FCOR= 0.5
##$FTSIZE= 0
##$FT_mod= 4
##$GAMMA= 1
##$GB= 0.15
##$INTBC= 1
##$INTSCL= 1
##$ISEN= 128
##$LB= 0.24
##$LEV0= 0
##$LPBIN= 0
##$MAXI= 10000
##$MC2= 0
##$MEAN= 0
##$ME_mod= 0
##$MI= 1.114404
##$NCOEF= 0
##$NC_proc= 0
##$NLEV= 6
##$NOISF1= 3.799351
##$NOISF2= 2.8
##$NSP= 1
##$NTH_PI= 0
##$NZP= 0
##$OFFSET= 15.70392
##$PC= 1
##$PHC0= -11288.8
##$PHC1= 21.20101
##$PH_mod= 1
##$PKNL= yes
##$PPARMOD= 0
##$PSCAL= 0
##$PSIGN= 0
##$REVERSE= no
##$SF= 200.130013532006
##$SI= 16384
##$SIGF1= 3
##$SIGF2= 2
##$SINO= 400
##$SIOLD= 16384
##$SREGLST= <1H.CDCl3>
##$SSB= 0
##$STSI= 0
##$STSR= 0
##$SW_p= 3612.71676300578
##$SYMM= 0
##$S_DEV= 0
##$TDeff= 0
##$TDoff= 0
##$TI= <>
##$TILT= no
##$TM1= 0
##$TM2= 0
##$TOPLEV= 0
##$USERP1= <user>
##$USERP2= <user>
##$USERP3= <user>
##$USERP4= <user>
##$USERP5= <user>
##$WDW= 1
##$XDIM= 8192
##$YMAX_p= 0
##$YMIN_p= 0
$$ End of Bruker specific parameters
$$ ---------------------------------
##NTUPLES= NMR FID
##VAR_NAME=  TIME,          FID/REAL,        FID/IMAG
##SYMBOL=    X,             R,               I
##VAR_TYPE=  INDEPENDENT,   DEPENDENT,       DEPENDENT
##VAR_FORM=  AFFN,          ASDF,            ASDF
##VAR_DIM=   8192,          8192,            8192
##UNITS=     SECONDS,       ARBITRARY UNITS, ARBITRARY UNITS
##FACTOR=    0.0002496,     1,               1
##FIRST=     0,             0,               0
##LAST=      2.0444736,     0,               0
##MIN=       0,             -461361,         0
##MAX=       2.0444736,     436588,          0
$$ Real data points
##PAGE= N=1
##DATA TABLE= (X++(R..R)), XYDATA
0 0 0 0 0 0 0 0 0 0 0 0 0 -8 8 -8 8 -8 16 -16 16 -24 24 -32 40 -44 52 -57 68 -80 92 -103 116 -132 149 -172
34 -172 192 -212 240 -268 299 -334 368 -407 453 -500 552 -609 671 -739 813 -895 985 -1087
52 -1087 1200 -1327 1468 -1631 1819 -2036 2292 -2603 2981 -3459 4080 -4920 6124 -7966 11106
67 11106 -17403 34561 -169288 -432560 253992 80673 -252866 281035 138811 -461361 54537
78 54537 338177 -233470 -60695 253337 -276716 -158099 421081 -9059 -304671 165262
88 165262 -21171 -281999 272016 237162 -329684 -32679 199320 -206531 1171 306741
98 306741 -187764 -228128 257191 32813 -166018 190348 -2620 -314338 123638 242809
108 242809 -150924 -3780 128512 -217210 -67399 276401 -27908 -168176 115227 -10600
118 -10600 -132211 168499 87351 -216616 -14038 126388 -65415 36996 135823 -137195
128 -137195 -131367 131814 41462 -59291 81587 -3156 -134308 54294 117454 -62068 -38400
139 -38400 45100 -44453 -6984 113244 6584 -95945 -3139 25575 -14341 50858 53812 -64719
151 -64719 -54653 46995 21413 -19832 26550 -3522 -65306 21062 78958 -27138 -52704 20598
163 20598 -22073 -32661 81458 34309 -95259 -13009 46972 -47809 6198 79517 -64135
174 -64135 -73021 86825 12994 -76500 52281 14066 -109826 44494 101206 -82256 -30607
185 -30607 77480 -71598 -47750 123315 -14878 -102745 77193 21717 -103903 68607 67146
196 67146 -126429 7853 112014 -82819 -29696 120504 -70046 -96305 126847 13624
206 13624 -111823 86949 44561 -136016 46379 108707 -109863 -17201 118479 -76416 -54973
217 -54973 134244 -30667 -110910 102433 29202 -111889 76904 72010 -127569 14515 111959
228 111959 -87926 -29890 120715 -56776 -78287 117742 41 -107612 81545 43372
238 43372 -113754 46363 88891 -103439 -12859 105552 -68401 -53488 110439 -23453 -91612
249 -91612 84362 23352 -101068 50263 60163 -96972 6366 85598 -70898 -33676 90364
260 90364 -39933 -68059 83678 4935 -88023 53242 41311 -88874 17378 72383 -70159
271 -70159 -26403 79877 -35617 -55565 70871 363 -73211 46909 34364 -72380 14955
282 14955 55801 -58243 -15596 67398 -33308 -44640 61668 -2257 -61085 44723 28941
293 28941 -63872 17614 51614 -53831 -13397 62988 -30210 -38219 61722 -1903 -57602 45424
305 45424 27789 -63152 19992 54052 -52264 -10962 65848 -31062 -41195 62463 1033 -56638
317 -56638 45953 29935 -60911 18500 49893 -52150 -8801 62643 -31420 -33594 61445 -8375
329 -8375 -55271 49022 21176 -62943 27126 47386 -58567 -5011 60757 -41046 -34237 63679
341 63679 -10890 -54069 49699 15960 -64512 25584 40254 -58393 91 56884 -42471 -28587
353 -28587 58187 -20259 -50235 51333 10003 -60029 31782 33973 -60855 4021 51035 -46587
365 -46587 -20631 59948 -23675 -44478 52411 1278 -59486 37120 30524 -59913 12502 50842
377 50842 -50196 -18167 58687 -27023 -40432 56117 2272 -54607 37572 25356 -57342 15339
389 15339 45971 -46079 -7578 55745 -30351 -32222 54491 -6885 -48047 45905 20933 -55178
401 -55178 23896 41813 -51968 -3350 56499 -32150 -26373 57729 -9535 -46813 45022 15759
413 15759 -53080 26969 38046 -49227 2950 50770 -37821 -22977 53895 -15207 -39193 48543
425 48543 7744 -52901 28902 28751 -51130 9157 45095 -41954 -14903 51483 -24661 -36259
437 -36259 47055 -2792 -48745 37034 22539 -53725 12053 37605 -45828 -8810 49864 -27342
449 -27342 -31409 44326 -6449 -42435 33869 13175 -47137 16996 31282 -39387 -1625 36961
461 36961 -32068 -20106 43195 -9606 -32999 32807 4868 -41066 21689 25919 -37823 300
473 300 33536 -25087 -12849 36848 -12334 -30317 28847 8830 -28797 18896 18345 -33419 1611
486 1611 31596 -17882 -11134 28965 -9589 -22271 28461 9383 -28304 11482 17611 -23053 5922
499 5922 29454 -19645 -16185 26902 -3156 -18152 26612 6450 -32832 12195 25607 -23377
511 -23377 -2331 27207 -20994 -17448 35866 1330 -30715 17483 9438 -30632 15209 28589
523 28589 -31161 -11082 29056 -16423 -14659 34244 -9594 -36321 26384 14606 -32771 14603
535 14603 19856 -41397 -656 42067 -22546 -20841 33151 -15976 -31359 40369 9697 -44701
547 -44701 16168 21064 -38349 11384 37978 -39792 -19228 42348 -15043 -23822 40847 -8805
559 -8805 -46857 32439 22658 -39895 14652 24808 -45468 1741 48610 -27622 -22807 38651 -16929
572 -16929 -28890 47987 5696 -49060 22716 23387 -37903 17402 36996 -42481 -12551 45378
584 45378 -15139 -18863 38938 -11444 -36262 36682 17276 -34619 16420 17603 -36774 10782
596 10782 39053 -27056 -14594 30592 -15811 -16539 37958 -2474 -35746 19466 13471 -25329 15079
609 15079 18317 -33128 -4119 29128 -12396 -10075 20559 -13809 -20313 24339 7625 -21258 6633
622 6633 5156 -18701 8204 17790 -15651 -9240 10725 -5714 -3342 14206 -4898 -15573 6078
635 6078 5982 -5835 3841 2652 -11748 -2836 10109 902 -6093 -213 -808 -5092 2179 7772 -3328
650 -3328 -9793 1746 4553 -4265 2117 5556 -10143 -6036 12129 575 -8207 7432 -705 -12814
664 -12814 10314 11633 -13991 -359 12324 -11652 -1640 21115 -8097 -15166 18185 2423
676 2423 -15817 17239 8698 -24056 8180 20995 -18350 -1048 23545 -16917 -12064 29200 -4319
689 -4319 -22094 22647 4506 -26987 17904 17615 -28987 3651 24484 -23348 -5627 30181 -16879
702 -16879 -19597 29348 -4099 -26264 25117 6861 -33743 15273 21302 -31336 1694 28563
714 28563 -26090 -12331 34045 -12827 -25084 28632 275 -30910 21863 14062 -33455 8314
726 8314 23886 -27827 -3308 29565 -20767 -16593 30952 -7623 -25613 25546 4313 -30986
738 -30986 17058 17358 -30296 4107 25281 -24379 -7891 29640 -14450 -19267 27784 -1705 -25998
751 -25998 21045 10519 -28186 10386 20696 -23943 -1457 25537 -15980 -12026 25678 -5155
763 -5155 -18980 20876 5021 -21945 13504 14081 -21178 3750 20046 -16042 -5628 22493 -8317
776 -8317 -14441 19929 2067 -18662 12953 10516 -18682 4082 16631 -14018 -5230 17481 -6996
789 -6996 -11336 15479 385 -15549 10033 7552 -15424 3351 12254 -13033 -4066 14835 -7280
802 -7280 -10635 13300 -433 -14390 9227 6499 -15258 2479 11636 -12460 -4453 14195 -7044
815 -7044 -10907 13036 57 -14800 8668 7173 -15224 1901 12294 -11779 -5117 13924 -6371
828 -6371 -10676 12739 484 -13780 8743 6280 -14265 3607 11459 -12450 -2888 14442 -7799
841 -7799 -8888 14755 -1272 -13783 11535 6428 -15115 5285 12303 -13047 -1795 15591 -7813
854 -7813 -8323 15217 -1108 -12507 11902 5422 -14053 6607 11017 -12679 107 14433 -8969
867 -8969 -6225 15132 -3227 -11307 12934 3208 -14051 8074 9158 -13785 1780 13390 -10841
880 -10841 -5137 14929 -5386 -11010 13283 1333 -14413 8609 7762 -14597 1929 12104 -11416
893 -11416 -4740 13516 -6225 -9929 12077 -303 -12986 8413 5175 -13645 3408 9649 -12007
906 -12007 -2519 12496 -8012 -8238 12440 -2134 -12362 9544 4281 -13793 4208 9408 -11878
919 -11878 -1855 11973 -7622 -7134 11849 -2179 -10654 9320 3374 -11822 5126 7923 -10746
932 -10746 23 10823 -7544 -4702 11508 -2955 -8572 10059 2150 -10433 6540 6839 -10178
945 -10178 1862 10210 -7776 -3198 11571 -3542 -7580 10252 1817 -9912 6537 6584 -9618
958 -9618 1482 9496 -6711 -3259 9933 -2814 -6663 8296 1355 -8282 5329 4850 -8324 1579
972 1579 7540 -6729 -2719 8710 -3539 -6467 7932 764 -8969 4859 5024 -8916 393 7809
986 7809 -6715 -4219 8642 -2674 -7690 6966 1472 -9361 3892 5644 -9083 -600 8051
999 8051 -6642 -4689 9088 -2925 -8561 7591 1898 -10160 4660 6081 -10472 170 9646
1012 9646 -7855 -4647 10775 -4190 -9059 10561 1675 -12071 6815 6882 -12304 2269 11677
1025 11677 -10140 -4351 13319 -4971 -8639 12834 280 -12670 9513 6591 -12798 4954
1037 4954 10487 -12524 -699 14714 -8237 -6776 14657 -3798 -11506 14189 3460 -15301 8445
1050 8445 9182 -14782 3530 14395 -13071 -4873 16307 -6695 -9563 15550 -1715 -15184 12293
1063 12293 6503 -15438 6457 10082 -15581 669 15590 -10990 -6714 14654 -6610 -10733 15326
1076 15326 181 -15795 9589 5851 -15021 6140 11109 -15642 -2460 14405 -9030 -6659
1088 -6659 14072 -5927 -12999 12665 3094 -13277 6756 5140 -14131 3538 11649 -10654 -3693
1101 -3693 10061 -7497 -5073 12934 -2872 -11174 8004 2363 -8995 7161 5461 -11818 604
1114 604 9463 -5499 -1305 8047 -5808 -5686 9323 1590 -5834 4249 615 -6236 4884 6052
1128 6052 -4994 -1140 3212 -2799 1088 6060 -2041 -4214 2238 1111 122 3359 -273 -4094 140
1143 140 3057 1470 536 -938 -2116 -453 2138 3056 -38 -3737 -1060 2228 220 1422 2108 -4677
1159 -4677 -3707 5295 2004 -3320 2064 -941 -6386 3930 6324 -5530 -2404 3344 -5044 -613 8840
1174 8840 -3567 -8024 4902 78 -5412 7388 1720 -12027 1982 7528 -6965 754 7469
1187 7469 -10372 -5168 12520 -2060 -8121 8228 -2166 -11331 10418 7144 -12906 1652 7578
1200 7578 -10683 1781 13791 -9632 -8293 12039 -2523 -7363 12902 -500 -14922 8676
1212 8676 8401 -11168 4644 8830 -14074 -584 15977 -6994 -6945 12256 -4971 -9978 14790
1225 14790 3415 -14355 6439 6645 -12051 5481 11927 -12701 -3915 12834 -5967 -4917 13186
1238 13186 -4606 -12012 11456 3919 -11090 7030 5078 -13763 3385 12299 -9550 -3502 10347
1251 10347 -7199 -6028 13192 -1522 -11444 7429 2563 -9817 6529 6197 -11696 -224 8868
1264 8868 -6588 -2086 8535 -6134 -6665 8815 -30 -7246 5388 668 -8508 4304 5454 -7379
1278 -7379 -298 5066 -5728 -1419 7305 -3269 -5292 4919 -93 -4558 4300 1681 -5812 1052
1292 1052 3669 -2807 57 3117 -2823 -1565 3549 28 -1622 1691 -316 -1584 2076 1496 -1287
1307 -1287 103 777 -311 708 1240 -154 -474 153 952 849 -197 119 735 -663 261 2090 -550
1324 -550 -1304 1908 204 -1735 2072 1163 -2844 951 2459 -2606 -178 3285 -2273 -1815 3791 -862
1340 -862 -3047 3248 377 -4060 2473 2151 -4435 906 3384 -4214 -822 4647 -3286 -3045 4898 -1310
1356 -1310 -4832 4305 973 -5983 2553 3440 -5745 -45 4892 -4469 -2306 5491 -2449 -4311 4963
1371 4963 -107 -5326 3658 1931 -5770 1935 3998 -5265 -347 5233 -3932 -2418 5818 -1812 -4574
1386 -4574 5110 868 -5491 3579 3191 -5638 1258 5229 -4392 -1329 5846 -2391 -3373 5595 118
1401 118 -4750 4021 2443 -4862 2022 4094 -4179 -203 4928 -2701 -2114 4987 -873 -3637 4161
1416 4161 1150 -4382 2602 3008 -4410 472 4395 -3198 -1776 4599 -1434 -3544 3876 726 -4464
1431 -4464 2177 2530 -4120 343 3576 -3311 -1567 3950 -1616 -3087 3440 -38 -4053 2398 1805
1446 1805 -4242 612 3168 -3601 -1204 3838 -2270 -2951 3664 -319 -4132 2578 1581 -4406 896
1461 896 3085 -3667 -989 3910 -2238 -2658 3745 -342 -3667 2735 1478 -3893 1291 2810 -3330
1476 -3330 -237 3554 -2333 -1672 3884 -923 -2873 3373 783 -3583 2277 2498 -3624 566 3824
1491 3824 -2650 -1336 4163 -996 -2731 3530 822 -3459 2211 2386 -3228 572 3301 -2478 -831
1506 -831 3641 -1274 -2127 3210 204 -2888 2317 1538 -3180 1015 2639 -2734 -514 3100 -1719 -1880
1522 -1880 3093 -361 -2956 2184 1083 -3261 863 2356 -2880 -810 2817 -1800 -2109 2689 -264
1537 -264 -2935 1683 994 -3045 605 1974 -2683 -710 2536 -1634 -1749 2504 -705 -2711 2191 876
1553 876 -3154 923 2042 -3000 -244 3223 -2029 -1988 3019 -457 -2765 2512 1035 -3372 1230 2431
1569 2431 -2760 -39 2969 -2163 -1379 3435 -639 -2350 2802 368 -2934 2364 2061 -3068 594
1584 594 2785 -2484 -295 3658 -1642 -2172 3404 22 -2501 2747 1174 -3461 1339 2871 -2527
1599 -2527 -82 2917 -2219 -1397 3549 -329 -2421 2079 298 -2492 2022 1729 -2838 28 1953
1614 1953 -1869 -63 2565 -1845 -1988 2302 -71 -1811 1653 51 -2874 827 1983 -1760 -518
1629 -518 1131 -1724 -844 2083 -236 -1864 288 -6 -1017 960 679 -1655 -912 658 -94 36 523
1646 523 -832 -1225 518 1019 -147 -382 -292 -713 -71 1333 461 -1211 -557 475 -179 508 1297 -1036
1664 -1036 -1594 1277 1126 -762 793 489 -2171 322 2847 -535 -1223 1443 -743 -1202 2924 922
1680 922 -2736 628 1413 -1648 1479 2516 -2889 -1177 3051 -683 -963 3146 -1308 -3482 3118 1986
1696 1986 -3030 1419 1620 -4049 790 4481 -2624 -2082 3145 -1806 -2248 4626 70 -4825 2067 1740
1712 1740 -3602 2063 2828 -4962 -919 4309 -2222 -1564 3823 -2517 -3881 4397 965 -4306 2307
1727 2307 1189 -5005 1887 4273 -4356 -1515 3805 -2868 -1893 5109 -1307 -4795 3294 1134 -3769
1742 -3769 2753 2094 -5067 484 4049 -2788 -693 3611 -2973 -2361 4697 -120 -3484 2841 421
1757 421 -3785 2901 2894 -3951 12 3132 -2547 -266 3967 -1975 -2687 3298 257 -2224 2636 653
1773 653 -3323 1503 2462 -2116 210 2027 -2122 -586 3028 -682 -1656 1757 -207 -1555 1928 914
1789 914 -2194 379 1293 -1260 210 1545 -1276 -1061 1406 129 -819 618 -36 -1179 236 733
1805 733 -339 -494 -114 -217 -194 126 49 -453 -611 97 244 -399 -112 53 -801 -79 778 -537 -764 657
1825 657 -396 -939 1055 83 -1660 607 937 -1561 219 1500 -1657 -645 2131 -849 -1539 2024
1841 2024 -74 -2155 1781 1171 -2450 791 1972 -2136 29 2606 -1701 -1163 2859 -570 -1906
1856 -1906 2590 288 -2689 2073 1621 -2855 980 2465 -2663 -147 3392 -1845 -1721 3317 -540
1871 -540 -2571 2895 742 -3414 1752 2137 -3009 531 2706 -2777 -758 3382 -1482 -2040 2981 -549
1887 -549 -2804 2702 874 -3422 1391 2073 -3173 312 2901 -2631 -1323 3174 -1261 -2353 2812
1902 2812 -82 -3197 1978 1411 -3105 676 2128 -2731 -490 2767 -1701 -1652 2441 -728 -2232 2230
1918 2230 428 -2661 1178 1335 -2379 477 2092 -2176 -820 2415 -966 -1601 2154 -123 -2264
1933 -2264 1642 1222 -2110 386 1710 -1689 -321 2118 -826 -1277 1750 68 -1408 1399 708 -1562
1949 -1562 620 1368 -1146 56 1517 -793 -666 1606 -78 -1129 1210 542 -1319 629 1208 -1120
1965 -1120 -202 1390 -656 -691 1446 66 -1232 838 657 -1144 322 1091 -1058 -439 1298 -413
1981 -413 -966 974 54 -1230 655 669 -1283 50 998 -1058 -460 1186 -648 -1154 1187 26 -1534
1998 -1534 831 694 -1634 104 1323 -1279 -732 1547 -584 -1350 1246 240 -1587 755 817 -1572
2014 -1572 153 1296 -1223 -510 1490 -734 -1050 1463 -107 -1551 1194 700 -1685 655 1305 -1568
2030 -1568 -147 1778 -1053 -885 1852 -205 -1510 1492 681 -1770 845 1474 -1561 -24 1844 -1004
2046 -1004 -808 1861 -260 -1357 1477 551 -1528 940 1051 -1489 276 1489 -1224 -507 1711 -692
2062 -692 -1099 1666 61 -1671 1143 895 -1756 448 1439 -1537 -439 1700 -831 -1155 1516 -108
2078 -108 -1617 1086 611 -1687 398 1148 -1461 -234 1423 -1035 -878 1368 -413 -1375 1163 302
2094 302 -1614 613 884 -1514 -22 1283 -1143 -757 1466 -437 -1264 1234 253 -1537 714 909
2110 909 -1302 50 1174 -902 -536 1237 -352 -902 1000 230 -1017 722 648 -1011 234 1023 -866
2127 -866 -184 1248 -484 -754 1135 254 -1033 739 787 -1066 161 1263 -652 -452 1135 -113 -882
2144 -882 989 574 -1039 298 933 -864 -53 1170 -635 -705 1150 -25 -1002 835 306 -1299 513
2161 513 1048 -1115 -182 1198 -883 -723 1491 -298 -1446 1092 378 -1613 748 1110 -1737 -274
2177 -274 1615 -1110 -942 1637 -586 -1689 1446 427 -1859 852 955 -1990 188 1773 -1559 -636
2193 -636 1806 -1109 -1275 2085 -239 -2074 1522 739 -2212 1023 1622 -2276 -147 2225 -1499 -893
2209 -893 2422 -893 -1894 2230 449 -2184 1430 1037 -2356 741 2118 -1898 -345 2223 -1418
2224 -1418 -1031 2574 -432 -2034 2043 483 -2120 1579 1346 -2458 460 2139 -1800 -380 2413
2239 2413 -1359 -1476 2431 -61 -1929 1737 558 -2266 1141 1570 -1995 106 1711 -1611 -430
2254 -430 2124 -1009 -1323 1832 -340 -1580 1679 412 -2140 841 1159 -1721 239 1525 -1569 -677
2270 -677 1791 -685 -1080 1370 -290 -1489 1091 517 -1385 397 674 -1298 184 1094 -956 -325
2286 -325 847 -651 -517 1027 -280 -900 691 47 -701 651 259 -890 173 571 -493 93 492
2303 492 -588 -173 527 -121 -117 287 -292 -126 513 -83 -13 450 -309 -230 677 25 -381 525 15 -555 674
2324 674 371 -616 324 364 -611 380 743 -726 -49 755 -583 -70 1142 -585 -771 1084 -73 -890
2342 -890 1071 242 -1477 547 1009 -1281 86 1228 -1254 -488 1609 -588 -1066 1354 -231 -1401
2358 -1401 1209 502 -1630 557 859 -1540 242 1381 -1395 -538 1652 -877 -995 1758 -382 -1735
2374 -1735 1382 513 -1815 907 1120 -1975 135 1761 -1443 -650 1790 -908 -1255 1792 -59 -1630
2390 -1630 1241 470 -1764 926 1168 -1754 77 1513 -1303 -412 1851 -825 -1184 1649 -59 -1425
2406 -1425 1285 538 -1720 696 1265 -1414 71 1463 -1070 -586 1578 -422 -997 1255 31 -1165
2422 -1165 989 667 -1195 425 854 -1018 98 1164 -746 -611 1073 -226 -827 948 167 -1056
2438 -1056 529 594 -880 147 691 -675 -336 788 -236 -539 493 -14 -575 349 153 -502 52 214
2456 214 -454 -19 290 -287 -312 190 -127 -296 162 27 -367 -62 178 -145 -136 171 -122 -350 157 204 -244
2477 -244 -180 265 -131 -266 366 49 -465 103 331 -273 -66 456 -283 -309 565 49 -378 357 202 -491 272
2498 272 445 -416 82 519 -404 -139 739 -150 -447 665 81 -598 584 428 -765 144 735 -573 -130
2517 -130 879 -353 -521 839 122 -703 569 315 -748 321 650 -710 -34 714 -536 -293 830
2534 830 -327 -648 739 55 -829 505 446 -879 102 734 -735 -163 854 -547 -637 746 -89 -857
2552 -857 523 272 -895 182 603 -757 -194 662 -510 -384 674 -239 -616 605 34 -696 452
2569 452 339 -804 139 675 -684 -230 811 -389 -538 784 136 -779 519 424 -763 179 711 -581
2587 -581 -185 751 -237 -407 644 82 -546 557 265 -612 233 481 -559 5 631 -372 -239 678 -163
2606 -163 -490 622 188 -683 433 480 -644 91 637 -449 -246 641 -169 -534 575 146 -623 315 366
2625 366 -537 120 475 -437 -177 523 -299 -279 521 -112 -523 401 160 -578 242 344 -574 -122 509 -330
2645 -330 -305 403 -146 -474 293 140 -487 93 322 -395 -94 293 -194 -201 275 -68 -285 172 92 -234 103
2666 103 160 -252 32 246 -147 -135 256 -46 -254 240 143 -351 111 284 -238 -75 428 -26 -300 324 231
2687 231 -328 198 382 -292 -12 454 -99 -194 349 61 -241 339 159 -339 233 291 -324 63 407 -333 -151
2708 -151 504 -139 -392 519 80 -516 404 404 -625 87 571 -472 -191 638 -323 -484 538 -39 -586 364
2728 364 258 -682 203 436 -541 -57 516 -489 -265 602 -217 -461 582 -8 -696 468 252 -813 129
2747 129 565 -610 -105 673 -460 -474 623 -125 -577 458 182 -671 317 453 -539 75 414 -466 -115
2766 -115 624 -245 -293 545 -51 -438 485 135 -523 287 403 -412 105 503 -340 -217 562 -31 -196 406
2786 406 69 -385 323 295 -210 61 195 -152 96 305 -93 -41 186 15 -31 238 48 -160 93 119 -61
2807 -61 2 48 -134 -46 113 72 -82 -36 33 -19 -132 144 85 -359 -16 273 -154 -244 288 -181 -365 280 165
2830 165 -469 112 175 -417 -4 417 -382 -291 437 -309 -264 532 -88 -601 434 175 -571 379 353 -713 47
2851 47 724 -529 -271 748 -364 -588 856 61 -831 513 353 -795 329 654 -793 -66 825 -531
2869 -531 -349 911 -327 -614 928 85 -799 676 371 -910 389 824 -934 -1 1080 -669 -429
2886 -429 1109 -259 -853 944 235 -953 649 557 -1031 238 876 -772 -128 838 -580 -462 999
2903 999 -247 -748 781 41 -872 592 483 -995 202 765 -762 -130 859 -638 -581 847 -91 -768
2921 -768 632 138 -912 411 515 -836 -53 611 -544 -145 665 -407 -533 532 -81 -551 505
2938 505 76 -665 249 382 -546 54 429 -546 -198 599 -131 -324 363 -52 -341 431 218 -352 27 232
2958 232 -209 100 313 -192 -151 200 61 -40 217 -3 -130 155 198 -10 61 0 -51 102 238 66 -96 -17
2980 -17 60 87 21 86 -22 -143 28 228 -1 -93 202 -98 -166 252 134 -330 -17 193 -219 57 341 -258
3002 -258 -224 220 -63 -136 250 -24 -453 242 219 -312 49 154 -424 -22 440 -291 -278 379 -243 -423 472
3023 472 53 -642 140 266 -500 110 428 -487 -254 500 -187 -305 429 -104 -431 352 210 -474 188 205
3043 205 -469 70 476 -382 -114 510 -203 -273 567 -8 -483 421 210 -455 232 395 -485 -74 527 -231
3063 -231 -235 476 -61 -345 398 175 -380 193 235 -319 207 428 -386 -101 436 -216 -188 452 -87 -384 337
3084 337 160 -422 146 293 -371 -57 443 -218 -208 252 -97 -256 207 89 -270 91 108 -269 16 208 -204
3105 -204 -132 189 -117 -200 201 -28 -293 83 95 -206 33 152 -235 -109 240 -52 -286 199 91 -218 90
3126 90 205 -207 -72 248 -81 -185 202 15 -225 123 164 -196 -32 205 -190 31 228 -121 -111 252 -15
3147 -15 -164 264 87 -226 165 253 -255 15 358 -212 -128 400 33 -270 339 107 -327 128 247 -267 0
3168 0 278 -136 -87 343 -101 -227 314 59 -282 214 194 -319 71 284 -296 -65 332 -227 -220 379 -35 -423
3190 -423 276 147 -411 83 247 -341 -68 260 -199 -242 306 -45 -312 232 83 -357 141 117 -348 44 253
3211 253 -307 -134 377 -169 -277 308 1 -394 270 111 -418 128 294 -315 -73 375 -144 -237 356 -1
3231 -1 -315 291 151 -301 172 260 -203 70 304 -206 -88 348 -22 -131 356 32 -268 255 193 -246 96
3252 96 327 -258 17 339 -77 -131 313 46 -227 276 170 -248 61 208 -186 -67 256 -145 -84 168 -59
3273 -59 -161 114 -19 -199 91 149 -186 -11 134 -204 -75 211 -141 -179 107 -21 -208 62 120 -274 -65
3294 -65 165 -59 -122 81 -60 -143 28 87 -172 20 53 -133 -58 100 -88 -136 82 -9 -132 109 10 -189 -27
3317 -27 113 -120 25 189 -39 -145 116 92 -190 120 132 -219 -14 260 -55 -115 207 0 -208 155 166 -197
3339 -197 52 188 -173 31 247 -173 -91 237 -52 -121 264 15 -199 188 178 -237 96 202 -253 -30 358
3360 358 -168 -227 373 -89 -339 337 166 -367 110 253 -338 -40 337 -241 -207 336 -130 -255 278 -49 -302
3381 -302 287 100 -398 138 229 -442 -6 371 -279 -139 362 -114 -373 315 6 -385 152 145 -355 71 268
3402 268 -320 -47 230 -215 -137 335 -136 -257 297 -27 -238 236 130 -334 160 276 -209 37 282 -243
3422 -243 -88 353 52 -125 223 65 -211 239 187 -172 13 148 -121 69 284 -83 -83 190 -15 -36 197
3443 197 -16 -162 167 94 -49 140 37 -136 23 164 -16 -36 58 -140 -31 141 89 -22 -24 -138 -27 84
3465 84 31 -66 -38 -128 20 136 5 -129 -38 8 -62 122 21 -199 -147 48 -39 18 31 -170 -103 118 -26 -29 100
3490 100 -172 -158 174 41 -119 12 12 -222 57 225 -156 -155 118 -152 -99 250 50 -272 111 54 -118 216
3512 216 156 -298 -6 254 -75 64 210 -221 -102 374 68 -158 253 -46 -279 315 239 -261 114 257 -200
3533 -200 58 402 -91 -178 290 29 -189 339 95 -318 82 214 -229 44 247 -230 2 363 -109 -152 198
3554 198 -139 -251 298 90 -327 87 116 -315 80 320 -274 -218 273 -87 -165 271 -42 -353 111 108 -270 38
3576 38 79 -280 38 217 -154 -88 122 -117 -169 210 1 -220 159 61 -241 132 151 -253 -101 168 -45 -94
3598 -94 273 -44 -169 149 199 -108 108 147 -112 33 201 -51 -26 177 -28 -53 172 61 -83 75 67 -17 88
3621 88 167 -63 -15 110 20 -74 48 -14 -73 73 125 -70 -5 68 -16 -49 121 40 -77 68 34 3 16 59 -99 -60
3647 -60 50 0 8 67 -10 -121 57 72 -90 22 -37 -121 -18 122 -75 -145 8 -6 -107 121 63 -147 -68 82
3671 82 -79 -111 73 -28 -174 81 -23 -121 8 55 -110 -30 117 -61 -27 87 -26 -106 127 10 -13 49 69
3694 69 -99 50 150 -98 -58 179 -19 -80 180 87 -75 120 126 -38 43 106 -26 -23 157 25 -65 76 23 -91
3718 -91 71 57 -151 156 103 -91 21 135 -51 -41 146 29 -107 93 31 -110 60 69 -174 -44 102 -102
3740 -102 -89 77 -36 -130 129 -15 -134 32 -2 -135 -29 93 -151 -26 81 -61 -119 89 -115 -155 108 3
3762 3 -161 65 102 -138 -59 155 -128 -70 128 -8 -185 14 81 -115 32 90 -73 2 118 -56 -50 115 13
3785 13 -26 92 39 -57 121 76 -47 102 83 -59 11 89 -47 5 154 74 -56 85 80 -82 -7 116 -7 25 105
3810 105 66 4 82 52 -56 72 49 -16 64 66 -44 -31 42 -12 -28 10 5 -29 26 46 -28 -62 75 -83 -124 63 17 -125
3838 -125 35 12 -104 -41 29 -132 -106 37 -54 -165 81 -11 -166 15 22 -118 -23 50 -133 -63 102 -92 -98 137
3862 137 -51 -135 104 50 -147 101 119 -143 4 213 -103 -64 183 4 -62 142 0 -111 109 133 -145 0
3884 0 133 -113 -8 211 -42 -102 210 -65 -32 273 22 -135 183 145 -195 61 181 -139 -17 198 -38 -143
3906 -143 178 46 -201 115 118 -162 98 137 -143 -44 150 -124 -94 125 -140 -118 142 -41 -129 100 33 -191 26
3929 26 63 -170 30 90 -113 -125 148 -135 -159 142 30 -169 46 60 -130 52 40 -82 -27 69 -104 -54 64
3952 64 -22 -74 42 27 -58 51 90 -38 34 93 -76 -39 44 -13 -54 103 46 -1 0 67 -60 -16 101 19 -31 44 89
3979 89 -18 45 62 36 -13 44 75 -9 100 128 26 11 16 77 11 36 -11 -21 102 -2 33 72 61 -72 77 47 -61
4006 -61 19 117 -60 -30 137 23 -126 119 38 -152 6 103 -128 -52 35 -114 -45 104 -44 -142 78 -43 -110 25
4030 25 33 -212 12 95 -143 -61 112 -214 -79 179 0 -151 111 -38 -170 91 106 -107 -26 141 -122 -16
4052 -16 180 -80 -106 112 -3 -108 142 53 -149 109 139 -105 102 167 -135 47 236 -26 -139 193 -16 -59
4074 -59 183 72 -100 60 139 -60 41 231 -50 -28 122 34 -47 117 5 -157 56 91 -109 79 84 -93 41
4097 41 140 -93 -31 111 -40 -11 70 13 -170 11 82 -60 35 27 -100 -84 10 -50 -75 60 -134 -132 8 80 -69 -77
4123 -77 -50 -52 34 -33 -33 -88 30 -79 -22 27 7 -43 -74 32 -26 -41 34 16 -81 7 60 6 -75 15 18 32 50 60 -66 87
4153 87 82 14 32 46 -4 -30 107 53 -23 41 12 -87 80 23 -25 27 124 -30 28 169 -22 19 80 8 -22 72 35 -86
4181 -86 45 91 -29 -9 68 -46 -9 111 -8 -46 40 5 -90 56 50 -114 -25 30 -63 -101 32 -108 -118 64 -53
4206 -53 -81 60 -14 -221 26 47 -119 -49 -10 -67 -50 75 -49 -82 42 -27 -138 4 -39 -107 -29 31 -97 -44 63
4231 63 -116 -44 49 -6 -66 35 34 -70 2 80 -34 9 78 -19 4 149 10 -128 63 66 -15 98 111 -39 -1 49
4257 49 13 -12 96 18 42 119 63 6 102 32 -18 52 89 -2 16 94 -30 -45 54 33 -34 11 54 29 0 52 -52 -51 64
4286 64 -43 -67 10 -27 -43 46 -61 -109 -13 24 -49 -74 -1 -42 -69 37 -62 -85 46 -60 -92 -17 11 -22 -34 33 -120
4313 -120 -40 -46 -30 -73 24 1 -8 -2 13 -26 -39 7 -12 17 17 -34 -6 -5 -13 -1 57 70 -16 60 38 -51 -14 97 -7 3 73 28
4345 28 -18 105 91 -39 60 64 0 7 88 10 -11 77 69 -10 95 -7 -55 55 51 -38 8 33 -57 -13 86 -10 -24 64 7 -37
4375 -37 29 61 -37 29 15 -28 -24 45 -13 -64 32 -37 -73 -40 -63 -40 2 -45 -36 -1 4 -63 -46 6 -32 -49 49 -52 -49 -51 -17 13
4407 13 -73 -15 -53 -3 -49 -56 -55 -3 -6 -44 -15 50 -13 -24 31 -7 23 73 -3 35 43 86 11 69 -22 -19 -1 36 18 30 100 14 -28
4440 -28 35 48 -43 18 76 -7 57 75 -30 46 86 -33 -21 -37 9 0 17 -13 -7 24 44 32 -18 17 -20 62 48 -21 -4 -23
4470 -23 -38 -58 -69 -23 -57 -86 -6 -48 -30 -30 -17 -55 -22 -23 -46 -35 -22 -26 19 54 -35 -81 -24 -64 -51 -85 -20 -63 14 23 -25 5
4502 5 33 -2 -28 27 -19 -60 -23 20 -58 -18 30 -26 -10 80 39 17 53 41 -29 17 29 -30 71 69 4 52 57 -6 -44 25 47
4533 47 51 52 -5 26 8 65 -9 79 3 -24 36 30 14 -13 9 22 -43 4 -3 -30 20 50 -30 -38 73 -7 -30 20 11 -50 -15 31 -52
4566 -52 -57 -9 -61 -7 3 -60 -53 47 -16 -50 34 -49 -152 -52 -12 -59 13 -21 -48 -28 8 -15 -32 -23 -12 -48 -11 -44 -46 4 2
4597 2 -58 10 27 -40 -44 11 -62 -20 -23 -56 -3 16 49 3 81 40 47 10 19 77 -16 -33 55 108 19 59 -19 -25 58 62 23 39 60 17
4631 17 26 78 12 -9 29 6 47 53 52 -48 18 15 10 15 59 -24 26 10 43 -7 37 -49 -69 -24 6 -33 -50 17 -9 -38 -66 -33 -44
4664 -44 -19 9 -44 -59 -36 -65 -33 -38 -33 -64 -13 -56 -56 26 -31 -84 15 -16 -24 -35 3 -6 5 -28 -61 -10 -5 -37 -21 28 7 -13 -15 14
4698 14 -48 49 -3 -20 29 67 35 -1 73 26 72 73 5 19 43 44 -6 61 17 58 1 39 2 80 49 49 21 56 49 -94 59
4729 59 47 18 -16 23 -43 10 4 43 28 63 43 -60 11 -9 -35 -21 -22 -87 -20 33 -39 -77 -31 53 -40 -1 -19 4 -65 -24 -39
4760 -39 -86 -2 -90 -36 -2 -59 1 -12 -23 -42 28 21 -5 -29 -14 -45 -26 81 -4 -68 -22 -29 -68 1 -27 -28 -29 18 23 32 -72 -79 1
4793 1 18 66 6 -33 -32 17 -9 -29 -11 37 37 8 21 39 91 33 32 40 26 -17 39 43 12 14 61 10 -26 21 11 30 -16 -15 13 47
4827 47 -43 -17 -22 4 24 -12 8 -45 10 -33 -23 -37 -67 20 -97 43 -51 18 -52 -44 -11 -11 -26 -65 -1 -27 -66 -72 -45 -44 -49 10
4859 10 -20 1 -19 -27 -26 -36 -23 7 17 18 52 -62 -30 -21 -34 -55 -16 61 -4 -66 -12 28 37 45 2 40 46 15 15 16 -16 12 15 -13 43
4894 43 70 30 95 -26 76 -1 43 51 25 23 106 82 60 6 -3 18 37 23 -29 1 16 29 55 46 -5 -18 53 -17 -6 -5 -54 12
4926 12 -8 -18 13 -45 -26 -52 -60 -42 -70 -26 -52 -21 -5 -20 -85 -8 -13 -14 1 -38 9 -19 -32 12 -23 -78 -43 -42 -15 -35 -33 25 -12
4959 -12 6 14 -22 6 -17 -15 -7 47 1 11 10 14 9 -46 19 -1 67 31 -51 -2 -17 39 40 4 31 36 35 -10 13 10 1 55 1 92 72 15
4995 15 25 92 47 3 11 33 15 -1 34 26 37 -12 18 3 36 -3 -2 26 9 -78 -19 41 2 22 9 -22 1 -1 -53 -5 -47 -38 -88
5028 -88 -26 -5 -42 -72 -70 -42 -82 -46 -6 14 -18 42 -41 -79 -16 -19 -53 -6 -71 -5 13 13 6 34 -17 -38 -14 -50 -36 -29 6 -10 37
5061 37 -12 53 21 12 6 -19 32 -23 25 17 -37 51 47 35 27 69 7 44 17 -29 45 19 74 -17 2 75 4 43 34 -7 -24 10 7 66
5095 66 -3 9 24 68 13 -32 -13 14 -25 -14 60 5 -23 -8 -8 -65 -30 -52 -14 -17 -21 -22 -47 -57 -54 -52 13 -26 -6 -64 -66 0 -7 -8 11
5130 11 -32 -22 -25 -57 4 -34 -19 -40 -34 -42 17 -32 -19 -5 67 7 36 33 24 -56 -14 -19 -11 19 73 42 22 29 49 -12 -13 19 -23 32 55
5165 55 29 0 36 3 -34 55 -47 45 -5 26 -9 -11 -23 44 -17 5 18 -3 17 0 23 27 42 54 0 22 30 28 -30 45 -45 28
5197 28 6 31 -1 -6 -9 6 -39 -53 -30 24 -8 -22 -48 30 -33 -20 -61 -21 -31 -25 -81 9 -2 21 -22 -9 -56 9 38 -34 -43 8
5229 8 -18 -22 12 -30 25 -28 -33 19 -12 -7 -15 -18 -31 82 -8 28 27 53 24 -8 15 -12 15 48 70 13 16 2 31 52 24 -2 62 50
5263 50 15 49 14 25 18 9 21 53 4 18 42 80 19 -21 41 18 16 1 11 40 -22 -3 -15 -9 23 6 -53 3 30 -14 -36 -14
5295 -14 -26 -48 -53 2 -45 -28 -50 -18 -37 -39 -40 -32 -34 -17 35 -53 -54 -68 2 1 -22 -18 -4 -31 -15 -24 -37 -23 11 -75 3 -9 -27 17 12
5330 12 24 -4 46 -44 -4 3 29 49 3 -18 28 69 -4 -30 23 35 63 -2 26 67 63 104 -23 2 26 95 18 23 24 25 -26 30
5362 30 28 1 5 -18 40 8 40 32 6 40 -30 13 18 22 6 27 -3 -40 37 -14 -35 10 18 -18 -45 -5 24 -1 20 -37 -26 -27 26 -71
5396 -71 -46 -23 -56 -80 -10 -48 -40 -16 14 12 -63 -11 -60 -4 -17 -49 -36 -66 11 -58 -22 23 12 -29 -48 -4 10 10 18 24 -5 51 -61
5429 -61 37 -25 38 40 44 49 44 -18 -1 40 0 1 74 11 15 10 6 17 1 -2 46 49 11 62 1 20 -13 -18 -9 14 73 12 14 61 -42 28
5465 28 39 7 -51 16 58 -36 -14 -13 -55 38 9 22 -27 0 -10 -25 10 35 -50 -10 -46 15 -11 -33 -29 26 29 -9 -51 1 13 -21
5497 -21 7 -8 -20 -24 -70 -60 6 12 -3 -5 13 1 -43 -7 -74 19 3 32 26 -13 -5 -46 -42 41 29 39 58 -5 7 50 34 -15 10
5530 10 11 21 66 80 24 60 -26 47 -20 71 27 -27 9 30 37 -5 -17 -5 18 54 -16 -1 19 -4 -21 -45 -26 -29 -87 -38 5 37
5562 37 15 -38 13 -8 -47 -78 3 -27 -32 -47 -28 25 -16 -42 1 -53 -32 32 -12 -28 6 30 51 -1 -30 -79 -41 9 -44 -26 -41
5593 -41 -7 12 11 -32 -43 1 -1 -43 38 -83 -12 24 31 -44 11 -35 -9 -4 40 46 9 -4 76 27 66 7 28 72 79 16 -20 37 37
5626 37 20 -5 -9 27 16 -3 -44 53 14 -42 -16 16 -30 4 21 25 38 -25 44 25 31 18 23 -38 -12 9 -2 -39 -22 -51 -50 18 -50
5659 -50 40 42 -49 -7 -14 -37 8 -25 -25 -50 -25 -29 -13 -41 -15 -9 17 37 -43 -28 -13 -23 -30 -2 20 -4 9 -27 -26 18 3 -69 -23 -7
5693 -7 -5 -48 7 41 -8 57 -37 -32 -17 28 22 -7 56 34 43 5 -41 -14 17 -46 30 -22 -25 72 46 2 -2 5 18 53 14 27 -20 23
5727 23 -8 8 13 29 -19 33 -28 83 -35 -61 4 -14 2 -78 -37 -5 -32 -19 -1 0 -14 17 35 -60 -30 -69 -47 -3 -59 -102
5757 -102 24 -89 -5 -29 -16 9 -10 -41 -23 -13 -27 28 20 -56 -22 -11 5 0 -12 21 -7 -2 8 17 -9 -39 -19 6 -60 0 -23
5788 -23 22 -44 15 -28 0 -36 -60 27 -6 10 27 32 12 32 74 -3 1 14 42 1 34 31 -17 38 51 -4 16 -14 -4 41 40 -19
5820 -19 -18 4 39 20 3 26 -27 47 26 10 -4 15 10 -81 39 -24 -31 -22 6 1 -74 -44 -32 5 -12 -20 1 23 -20 -16 34 15 -9
5853 -9 -29 -10 -71 -56 -67 2 -36 -93 -5 -30 -22 1 2 6 39 -5 -15 14 24 -27 7 19 -17 -7 12 -12 20 -9 20 5 5 -3 26
5886 26 40 9 60 -50 -30 -44 60 17 -23 -1 8 25 57 30 -23 -42 53 36 27 -11 33 41 18 -28 37 22 17 -32 19 5 2 21
5918 21 -10 20 62 -12 -33 10 -46 32 24 49 -42 -36 -28 3 -2 -19 -34 -22 -31 -54 49 -28 -26 -6 -35 -41 -6 -16 -50 -35 -9 -17 -19 -11 -27
5953 -27 -56 16 16 -46 -10 -8 54 -29 6 -86 30 -29 -22 -3 -11 22 -24 -12 18 -10 58 46 -50 -2 20 -1 -54 66 62 -6 3 -46
5985 -46 -7 12 13 35 7 31 -8 61 8 -1 29 -32 22 9 19 22 33 33 -2 19 -27 53 -18 -31 20 48 -64 -30 -40 2 -26 11
6017 11 61 -14 -26 -59 -74 -7 13 -61 21 -71 -46 14 -15 -43 -47 30 -10 -8 -17 -60 -70 -89 9 -19 -13 -56 -35 -18 6 -31 -77 48
6049 48 -35 -16 -28 -55 -13 -44 -16 13 -7 -6 -4 5 12 -20 -51 20 24 9 15 38 -11 43 57 12 -13 21 36 -16 0 -31 -9 -3 18 36
6083 36 43 -34 34 5 -49 28 14 24 -3 -6 55 -1 2 2 25 20 14 15 -2 29 56 25 -7 -4 58 30 -6 39 13 -85 30 4 0 27
6117 27 5 -62 4 -2 -46 4 -32 35 -4 3 -41 -7 -15 3 -20 -53 -26 -35 9 -40 -78 12 51 7 -16 -31 -5 -32 21 1 46 3
6149 3 49 -18 -6 67 15 19 -8 -26 -24 33 63 45 7 10 -54 42 -18 60 16 43 -54 -18 28 33 51 22 -6 -1 16 -4 41 49 12 -17
6183 -17 14 12 38 25 -14 -18 30 26 17 7 -33 -33 12 -28 9 61 -57 24 -8 -11 -7 28 27 -20 -49 1 -10 9 -41 -38 44 62 -44 -12
6217 -12 -27 -7 30 -10 21 -41 -70 74 19 -28 -31 -1 -67 22 -20 -19 -25 44 -14 -32 22 -63 -8 4 -37 32 13 -15 -18 15 27 30
6249 30 -2 41 -11 -6 96 -35 2 26 -33 -32 16 55 -9 -67 17 18 11 18 -19 39 24 59 -7 52 18 -14 -1 -18 -38 -4 -77 -59
6281 -59 50 -35 1 -11 36 31 -37 27 -35 4 -9 39 -37 -71 13 -69 68 -12 -71 -40 -29 29 29 64 -78 -25 -21 -24 15 21 -33
6312 -33 -68 -35 -12 -19 16 27 -10 -30 6 -13 4 -41 2 -22 -14 27 -4 -1 -18 -26 17 24 -53 -17 -25 14 2 42 -41 2 32 36 -29 14
6346 14 0 -8 5 -4 70 28 22 20 -23 27 22 25 -33 4 60 20 -58 -62 23 -19 49 22 12 5 -53 -23 -5 -31 47 -3 6 22 -29 -17 27
6381 27 8 24 6 -34 35 -52 -48 40 -4 -44 39 39 12 -28 -7 57 -5 -31 5 -38 -41 38 -15 -44 -23 -82 -11 -3 -73 3 -70 9
6413 9 -53 4 10 -14 20 2 -35 23 -35 34 5 -21 -31 65 58 -19 7 48 -4 -5 10 49 33 52 42 -10 43 9 -4 7 35 60
6445 60 -10 -2 3 32 14 29 57 19 31 52 -17 -31 18 32 2 -12 -37 14 4 8 15 4 -72 19 -9 -9 17 43 34 -29 -18 -54 -23
6478 -23 -4 -22 -23 36 29 -51 13 17 -18 -23 -39 -46 7 -18 -1 -4 -16 -47 14 21 18 17 10 13 -54 -57 -3 -9 -46 -2 1 40 24 -25 -76 46 25
6515 25 -27 82 1 -36 5 -5 29 16 -31 5 -9 43 -11 -7 1 -13 -4 -6 20 11 4 34 22 16 -28 41 -28 -2 15 -16 6 49 44 -12
6549 -12 4 11 21 -15 12 -7 -18 -52 -4 7 14 -51 29 7 -7 -13 69 25 -52 -31 32 -40 12 2 51 3 -32 22 -22 -6 -62 -21
6581 -21 -11 -11 -24 -21 9 14 -52 -26 -24 -32 33 -27 -4 -43 -4 -45 -24 1 2 5 37 -41 -61 8 -29 8 -12 25 17 -90 -79 -1 -22 37
6615 37 19 -12 -22 -24 -1 54 21 19 -45 23 37 28 27 50 16 -45 23 24 -31 10 -2 -4 -2 9 -20 -25 -41 8 54 22 57 29 11 -13
6649 -13 -50 -74 44 -45 3 10 -5 -25 -25 -45 7 46 -49 -93 55 46 23 13 -14 -11 -7 34 37 31 -18 -17 -47 21 -23 -3 18 -65 9
6682 9 -4 -30 -37 38 12 -23 -14 58 30 -13 -45 -51 15 -17 18 -19 -1 8 -12 -26 -15 -57 12 -13 -4 -35 50 -5 -33 -37 -17 -19 -8 -15 -28
6717 -28 24 17 56 3 23 -13 -23 -8 24 23 26 15 20 46 -8 37 16 24 -21 -12 38 1 40 8 -30 -10 -46 -2 -36 -48 3 18 -30
6750 -30 -4 14 16 -12 -14 43 -60 -24 9 -46 -12 -12 6 -54 -1 1 -10 -20 -30 -29 10 -18 -32 28 7 -61 -25 -7 13 -63 -30 -10
6782 -10 23 11 7 -29 -9 7 6 -32 22 8 -68 -9 -24 -29 29 7 -8 -16 7 -70 -23 -4 -27 51 -1 -17 -32 -12 -20 -5 -53 -15 0
6815 0 24 10 30 -27 -13 49 22 61 49 7 -15 -63 61 19 -74 -15 1 -7 -34 9 -51 11 15 19 -42 5 27 25 35 21 25 -39 -37
6848 -37 -42 19 -13 -41 -17 -23 36 21 -27 9 -29 21 0 40 -19 -24 -19 1 18 5 -32 9 -46 3 44 -15 25 -27 -58 -47 1 -30
6880 -30 -58 4 5 1 34 -18 15 -30 40 27 -4 -27 -10 -43 4 -11 -57 8 1 -29 -27 22 1 -38 16 -22 23 29 -54 -43 13 36 -15
6913 -15 12 -42 -49 13 -41 -42 -30 56 50 38 -28 18 5 18 -48 -20 39 8 16 -32 9 9 10 -23 -35 -44 -9 27 -46 -37 -9 -50 25 40
6947 40 -41 -33 -27 -43 -1 -62 -19 -50 -18 -18 45 -7 -59 -46 4 -20 -4 -2 -1 29 23 13 -73 -3 50 -4 -20 2 0 -89 8 30 -1 -5
6981 -5 -9 -11 -37 -40 -16 -27 17 -22 -1 14 5 32 2 33 -32 25 43 33 -34 36 57 -18 19 -37 -13 -4 73 -35 23 2 -2 9 26
7014 26 -17 20 -25 10 -40 17 -8 -33 -45 25 44 -10 -24 -53 -25 22 -48 12 -6 3 50 -3 -8 -64 26 -10 -73 -65 -73 -27 -10 -25
7046 -25 -3 10 -10 -7 27 -41 -10 59 -32 -40 5 -2 -24 -17 -44 34 5 6 -4 -18 83 -8 2 31 6 0 22 -1 -10 -5 -27 16 -22 18
7080 18 -59 22 -50 -3 1 -15 5 -3 -4 -20 3 10 -21 2 -4 -20 -64 -34 1 10 -37 -17 -21 -44 23 16 -9 71 2 -36 26 7 -25 17
7114 17 6 -45 25 19 1 -25 -24 -26 15 56 10 30 0 0 -21 -63 -14 -12 -49 -25 -38 6 -26 18 -5 -49 -9 0 -42 -6 12 7 -9 -10
7148 -10 -13 7 64 47 -2 2 -51 -13 12 -29 -3 19 -2 -4 45 33 58 3 -30 66 -1 39 -1 -60 -21 -10 -11 -8 -52 32 -10 20 -41
7181 -41 10 -39 -8 58 -5 27 -54 34 -23 17 29 -45 -15 37 -39 -50 19 -27 21 -14 3 -5 -18 2 -31 -53 -2 50 37 4 23
7212 23 9 37 2 -13 -1 -48 -20 -7 -19 -29 45 11 7 -19 -34 8 11 -72 -9 -38 -80 38 23 -25 -57 -62 -28 5 11 32 -27 7
7244 7 14 -1 43 4 -40 29 -40 9 4 -41 22 -28 -36 92 -28 14 64 -11 18 39 26 -9 5 -3 -21 -11 -26 21 24 -56 18 40
7276 40 -37 -26 2 8 1 -13 -3 -46 -28 11 -38 -45 40 -56 -70 -6 27 45 -4 -20 84 12 4 -10 -83 -9 -48 4 -44 28 26 -8
7308 -8 6 14 5 -27 -39 13 -24 -7 -26 13 2 -15 -41 -7 2 -14 -1 -4 43 -40 37 13 -2 -36 4 94 -7 -26 21 -46 27 20 39
7341 39 -24 -1 -26 -52 49 25 18 19 5 -31 -3 -31 -5 9 1 -37 42 -25 22 54 3 -32 9 -7 31 13 30 -1 10 12 24 -54
7373 -54 17 8 -57 -27 9 29 12 -6 -10 3 16 -14 -57 17 -2 10 7 -9 -50 -56 -60 4 42 -1 -18 -55 13 -2 -11 1 -46 8 -32
7406 -32 26 -23 19 -39 -8 -17 23 6 -2 16 -17 -5 -34 -29 37 9 28 -14 9 -18 -48 -60 -23 -45 -1 17 8 -11 40 10 51 4
7438 4 21 -7 3 18 -8 1 6 -31 18 50 21 -11 -47 8 -44 57 46 31 22 17 45 58 10 14 -12 19 13 -18 38 39 -6 -31 -1 29
7472 29 12 -33 -19 16 44 -26 1 29 1 -63 -18 -36 -18 42 -7 -18 16 2 -84 -42 -19 12 26 15 -18 -19 43 -61 10 -4
7502 -4 -63 26 -6 33 46 23 39 -20 -11 -5 -21 -3 2 -51 -8 25 -38 -40 -49 -51 -13 -15 -9 -11 -8 -17 -20 4 10 -4 -12 -17 13 -11 19 -41 59 15
7540 15 17 -36 8 16 33 55 -5 -38 26 30 -13 6 28 21 -10 -53 10 -45 -42 9 -6 46 45 -21 12 5 -7 21 -9 -34 -29 -5 2 -12 -22
7575 -22 -41 16 45 24 13 4 8 33 -7 18 -2 -11 -47 -34 55 -34 -23 -49 18 -38 15 0 12 2 9 -12 -51 0 21 4 9 -17 -14
7608 -14 22 -23 -9 -11 36 -22 -24 47 -12 -98 -28 -10 20 -12 18 22 -50 -42 -46 4 -40 -7 8 -24 44 13 16 50 -26 9 -1 6 -46 -3
7642 -3 -28 -37 2 -10 -6 36 -7 23 -9 6 -15 27 -39 9 15 -17 -60 -5 -2 -55 -8 -53 5 -43 -5 47 53 -21 6 44 15 14 -41 -3
7676 -3 9 -36 17 -26 -57 -8 5 -45 -32 -28 5 -5 26 26 -21 -64 18 13 -30 15 -43 -43 -3 -73 -11 -15 9 -42 -12 -25 -7 60 2
7709 2 7 -45 -32 -46 -11 35 62 13 -4 -42 41 0 16 -34 -13 -30 -38 -19 3 -15 -13 -5 -8 -32 -17 -9 -15 0 -10 8 -7 51 -21 11
7743 11 2 18 52 43 -25 -14 -38 28 8 -25 -3 -26 -21 39 -10 -66 -39 -36 3 50 -50 -4 1 -14 -29 -11 -61 5 -28 -2 36 9
7775 9 -12 -14 25 7 -39 10 42 -50 -3 30 -13 -9 1 -22 -23 80 -12 11 7 7 21 12 -14 -52 -29 -18 -18 -32 24 -32 4 -49 -35 -19
7809 -19 6 -24 -50 -35 -2 -46 -59 -18 -10 46 7 -6 0 2 -33 14 12 29 49 -39 -24 67 63 -25 -12 55 41 -29 -20 16 -64 12 -56
7842 -56 37 16 12 24 -8 4 -31 -11 -20 40 -14 -4 36 -31 -28 -5 22 3 -30 18 -65 1 53 -13 -23 -41 6 55 -1 -38 34 83
7874 83 2 -25 18 -37 6 13 14 -19 8 7 20 14 -41 23 -33 -36 4 -41 30 84 -45 -3 5 -59 17 -60 31 43 17 -28 -15 23 -7
7907 -7 -47 -10 -45 1 49 -32 16 27 12 -2 -1 -24 -11 28 -39 -2 -36 -21 -57 45 -2 3 -17 41 33 51 38 10 -18 -34 -23 -70
7939 -70 7 39 17 11 14 36 8 12 -2 -1 -25 -21 55 -27 6 -41 -18 -40 -21 -53 23 -1 -8 39 3 -12 18 11 51 42 37 -6 34 12 -10
7974 -10 21 -14 -14 -26 18 -30 19 -29 -38 24 -37 11 -30 34 33 -23 -47 -18 -4 -62 13 25 -76 -44 7 18 55 34 -17 27 10
8005 10 -32 8 -3 39 48 39 -37 -23 7 32 -11 -29 1 -10 37 6 -37 16 -14 -15 -10 8 28 -25 3 -36 -18 4 -6 -37 -16 -29
8037 -29 -13 -17 -5 14 43 -45 -8 -61 3 -43 22 -25 -34 -34 19 6 4 -57 -42 -39 -43 -3 17 -14 3 13 -53 -22 -36 -20 -9 -16 -16 -16 -29
8072 -29 -1 27 -18 -25 8 3 -17 -14 -16 -20 5 10 -1 -14 -28 31 50 -30 48 -17 48 4 -7 -2 13 -63 -2 27 33 -3 -51 -28 49 9
8106 9 43 -8 10 -35 -25 36 33 -13 -17 -14 30 -14 19 -26 -17 0 2 3 46 -85 28 29 -59 -2 -15 -15 -38 6 -30 5 2 22 -33 33
8140 33 -22 -53 -24 -12 -29 -64 24 -58 -44 -26 28 -20 21 -4 -29 -58 40 9 -31 6 -27 -24 11 -15 -23 34 1 -7 -5 -30 -10 -17 -9
8173 -9 60 -34 -23 37 30 -51 7 -11 -58 -61 20 -11 6 13 34 4 19 -27
8191b7
$$ Imaginary data points
##PAGE= N=2
##DATA TABLE= (X++(I..I)), XYDATA
0 0 0 0 0 0 0 0 0 0 0 -8 8 -8 8 -16 16 -24 24 -32 40 -49 62 -72 88 -104 120 -140 161 -188 218 -251 288 -326
32 -326 371 -420 476 -536 603 -675 755 -844 939 -1043 1155 -1282 1418 -1566 1728 -1905
48 -1905 2101 -2315 2549 -2808 3095 -3414 3771 -4174 4628 -5151 5756 -6465 7315 -8351
62 -8351 9645 -11315 13563 -16768 21716 -30430 50206 -186415 152199 311041 -294506 127925
74 127925 192127 -398127 -60637 436588 -165994 -208813 257299 -110960 -221635 386136
84 386136 74738 -393142 87771 155639 -236349 172828 284108 -323216 -148785 285307
94 285307 -93589 -98208 281876 -98681 -285198 246118 142068 -226093 84376 85610 -270847
105 -270847 77441 307267 -144641 -133123 145818 -119861 -101651 271945 24093 -236903
115 -236903 78582 82612 -132505 99302 116647 -208745 -50773 188882 -23479 -43528 107061
126 107061 -99117 -144153 148321 97100 -96924 24489 26951 -117796 32630 134972 -62789
137 -62789 -81984 57115 -3608 -24986 84750 2231 -116596 -8042 63289 -3881 15451
148 15451 32841 -67629 -62944 54988 38220 -36315 -468 4600 -51198 10256 73056 -29252
160 -29252 -75446 20443 15642 -27633 54246 33820 -98267 -30440 74033 -17468 -21360 68156
172 68156 -37382 -82945 79774 46927 -87614 20069 49443 -85022 18315 115829 -66800
183 -66800 -71829 85308 -20510 -64880 108121 20752 -120689 49883 68526 -96101 26684
194 26684 94535 -102876 -30363 130910 -46234 -75386 109900 -20608 -115165 108427 62323
205 62323 -126160 40518 84815 -119178 2548 133775 -82282 -65978 124538 -30764
215 -30764 -92289 114456 13413 -131644 72691 76559 -114414 26360 98594 -111084 -31463
226 -31463 128722 -55361 -76352 111848 -15745 -108398 92748 40525 -122873 42539 79498
237 79498 -106751 399 107116 -83029 -56747 110025 -32117 -86940 94565 13684 -110657
248 -110657 56246 59347 -101645 13325 84830 -80991 -29853 96758 -43213 -65108 85628
259 85628 -4662 -85756 65965 38368 -92610 25713 68700 -76410 -12450 86310 -47068
270 -47068 -52311 80708 -5018 -71610 58040 30201 -76430 26167 58220 -63053 -8934
281 -8934 69778 -38195 -36679 68654 -8418 -58625 52222 24045 -64027 26959 49711 -56583
293 -56583 -4420 63136 -36804 -33127 64201 -7277 -52503 50677 20752 -62670 26355 46902
305 46902 -56818 -2968 63848 -37710 -34189 63369 -10490 -56940 50276 22839 -63514 24049
317 24049 45994 -57932 -6788 58633 -38639 -32089 60943 -13021 -52923 48278 12004 -64226
329 -64226 29264 39748 -61319 1706 57553 -47710 -30065 61913 -20994 -52276 54864
340 54864 11058 -64530 30824 35766 -62826 3926 55104 -45934 -22187 61076 -23862 -46957
352 -46957 53059 3775 -58550 38347 32292 -59789 11515 50119 -49983 -15954 60369 -26539
364 -26539 -37651 57842 -1058 -55619 41219 25147 -59126 20372 49629 -50712 -8513 60270
376 60270 -32794 -35908 59608 -3390 -51417 46232 24180 -58225 20089 43952 -49684 -3764
388 -3764 57125 -31435 -27312 55778 -11340 -46443 46521 14759 -53831 29369 37984 -53557 1949
401 1949 52195 -40389 -23723 58598 -15078 -44144 48033 8433 -56542 28783 33056 -53093
413 -53093 5649 48338 -41792 -19919 52383 -23283 -40872 48185 3104 -51136 32882 23637
425 23637 -56206 9745 42325 -44306 -11681 50490 -28842 -33720 48717 -6755 -48479 37380
437 37380 17131 -52131 20619 37345 -49707 -6479 48214 -31528 -24922 51271 -10309 -43647
449 -43647 38427 13050 -46527 22029 30053 -43128 2837 42639 -30027 -17193 41347 -15883
461 -15883 -29729 41612 6571 -39979 23502 20872 -38705 10211 36849 -30866 -12385 39270
473 39270 -12646 -23604 34207 915 -34858 23419 22190 -29552 6553 25783 -27396 -7866
485 -7866 35809 -9510 -21849 25758 1272 -26680 20953 17101 -30108 1394 24880 -18070
497 -18070 -5948 27855 -14198 -24859 24495 6823 -24224 15259 12319 -32569 2069 30377
509 30377 -19754 -16026 25752 -10909 -24765 29360 8881 -36971 7084 20373 -26508 2205
521 2205 30655 -26077 -22685 31231 -3533 -24268 26368 1941 -38802 18631 27140 -32231 -889
534 -889 27698 -30230 -11184 44877 -11698 -34246 29388 2572 -34478 30524 22375 -45760 3385
547 3385 35642 -28857 -4848 41321 -27303 -30580 44887 3169 -34954 30418 8465 -46745
559 -46745 23155 38630 -37985 -3663 35622 -31488 -11373 51990 -14782 -37731 36615 4406
571 4406 -35127 36184 19534 -51530 10038 40118 -31448 -2124 40954 -32003 -26133 48061
583 48061 -846 -34084 29419 3751 -40566 26265 28764 -38918 -914 27560 -29318 -3858
595 -3858 40478 -21469 -29941 30094 -1663 -26022 28358 6232 -41053 10926 25485 -25065
607 -25065 211 22230 -27343 -12729 32911 -5326 -21764 16980 -3208 -22517 20486 14486
619 14486 -25139 -879 13557 -14008 1886 19475 -13437 -14644 14010 1617 -7327 10855
631 10855 -1341 -16202 6081 11585 -6197 -864 4254 -8535 -2495 11992 2146 -8244 -611
644 -611 2709 -2016 2241 7068 -2541 -8885 2985 8471 -2177 -727 5684 -5662 -5435 12764 4763
659 4763 -10023 4293 5092 -9856 6762 14297 -12052 -5902 15023 -4908 -6843 18284 -2556
672 -2556 -19100 14467 10257 -17928 8000 13514 -22117 -517 24339 -14251 -12287 22173 -8832
685 -8832 -19794 24340 3816 -28389 13647 13608 -27457 6405 23257 -26197 -8555 27979 -15329
698 -15329 -17168 28019 -6912 -27776 24105 7790 -30708 15007 17257 -32404 3898 29195
710 29195 -25510 -11144 31839 -15241 -22325 32108 -537 -32135 22137 13497 -32127 11798
722 11798 24138 -29980 -3032 30885 -19458 -14502 31122 -9317 -24723 28085 5048 -30167
734 -30167 18186 16408 -30089 7364 26476 -25110 -6612 30432 -14788 -17194 29716 -2986
746 -2986 -25583 23425 10129 -28121 13047 20266 -25775 777 26988 -17787 -11101 27266 -7335
759 -7335 -19538 23025 4080 -23541 14555 13092 -22814 4983 19474 -18584 -5390 22128
771 22128 -10731 -13870 20560 -1753 -20019 14819 8385 -21094 5502 14995 -17482 -3894 18199
784 18199 -10500 -12242 16284 -1692 -16074 11370 5451 -17319 4536 11598 -14332 -2905 14087
797 14087 -9416 -9270 14305 -2323 -14067 10521 5018 -15124 4792 10813 -13425 -2401 14143
810 14143 -8128 -8682 14098 -1467 -13411 10742 5897 -14675 4675 11822 -12567 -2481 14933
823 14933 -7031 -8939 14144 -323 -12807 10740 6512 -13693 4917 11287 -11847 -915 14412
836 14412 -7972 -7182 14992 -1968 -11972 12559 4732 -14656 7456 11359 -13734 -103 15125
849 15125 -9358 -7116 15740 -2848 -12460 12620 4109 -14644 7196 9765 -13821 643 13438
862 13438 -10475 -5955 14432 -5107 -11305 12675 1361 -14487 8274 7444 -14941 2107 11984
875 11984 -12239 -4552 14075 -7254 -10536 13248 -703 -14493 9434 6017 -15355 3342 11270
888 11270 -12957 -3579 13797 -7698 -9428 12976 -1224 -12951 9471 4837 -13730 4434 9519
901 9519 -11996 -1045 12434 -8339 -6593 13165 -2920 -11044 11137 3407 -13137 6452 9126
914 9126 -12249 256 12710 -8262 -5585 13198 -2706 -9818 10908 3091 -11636 6761 8061
927 8061 -10824 1506 11047 -8043 -3688 12072 -3664 -7906 10737 1381 -10309 7362 6101
940 6101 -10624 2710 9542 -8658 -2410 11178 -4902 -7089 10481 -39 -10174 7398 4960
953 4960 -10814 2546 8599 -8780 -2818 9947 -4682 -7026 8624 -125 -9233 5606 3851
966 3851 -9362 1723 6587 -7788 -2167 8098 -4964 -5962 7813 -915 -8568 5668 3426 -9518
980 -9518 1753 6994 -7721 -2815 8500 -4224 -6749 7858 544 -8975 4913 4702 -8913 1140
994 1140 7933 -7059 -3487 9155 -3203 -6862 8438 1059 -9354 5706 5869 -9317 1638
1007 1638 8939 -7799 -2874 11166 -3928 -7264 10361 666 -10233 8367 6296 -11660 3121
1020 3121 10685 -9673 -2045 13333 -6224 -8254 13025 109 -11406 9891 5148 -13423 5288
1033 5288 10715 -11766 -730 12818 -9237 -5950 14834 -3986 -11607 12298 1635 -14172 9566
1046 9566 8054 -16074 2446 12968 -12648 -3277 15442 -9212 -10742 15527 -1274 -14210 11652
1059 11652 3835 -16968 7234 11294 -15362 -380 13329 -12326 -5428 16543 -6733 -12464 13451
1072 13451 -380 -14039 11581 5498 -17185 4704 11411 -13518 -52 13895 -11984 -7531
1084 -7531 16036 -3643 -11349 12402 266 -14565 10151 8720 -13933 2236 10102 -11089 -475
1097 -475 14163 -7473 -7949 11571 -1735 -7732 11511 1551 -12600 6324 7731 -8638 3158
1110 3158 8141 -9965 -2085 11955 -2854 -5328 7622 -2218 -7020 8664 4162 -7902 1684
1123 1684 3518 -5512 2611 6736 -5379 -3865 4395 -903 -1041 4780 -1898 -5698 2267 2737 -1213
1138 -1213 1129 -585 -4292 181 3676 483 -1496 -1661 -1905 172 2085 1500 -1482 -3983 -1094 3024
1154 3024 606 -829 652 -3509 -3498 5026 2912 -4953 -482 929 -4733 2309 6654 -5301 -5098
1169 -5098 4453 -1530 -2308 7282 -1765 -9419 4361 4358 -5572 3881 3848 -10572 47 10760 -4639
1184 -4639 -3645 7825 -5880 -6732 12693 2140 -10996 5620 3462 -10152 7222 10416 -12286
1197 -12286 -2738 11407 -6157 -2678 13601 -5883 -11693 12077 3636 -10143 8642 3990 -14820
1210 -14820 5238 12981 -10474 -1848 10911 -9919 -4930 16463 -3252 -12350 10307 1100 -11938
1223 -11938 10765 7264 -15904 1521 11228 -10092 -698 12780 -10033 -8670 13632 -1321 -9841
1236 -9841 10133 -195 -13897 8466 8381 -12421 1471 8390 -11603 -1136 13864 -7316 -8858
1249 -8858 10365 -2371 -8976 10871 2030 -13618 4567 7235 -9516 2010 8426 -10144 -3635
1262 -3635 10938 -3583 -5959 8064 -2439 -8327 8109 3533 -8702 2975 4174 -7499 2215
1275 2215 7691 -6282 -2977 6822 -2833 -3192 7290 -864 -6501 4695 2983 -4749 2787 3554 -5198
1290 -5198 14 5448 -1848 -1471 3475 -1401 -2112 3790 1124 -2512 1240 872 -1536 1615 1825 -1683
1306 -1683 -534 1202 -126 175 974 -521 -852 237 765 390 -629 -535 379 -502 -438 1313 -498 -2002
1324 -2002 1096 706 -2152 752 1360 -2842 -425 2673 -2161 -1742 2917 -1388 -3050 3003 295 -3965
1340 -3965 1930 1629 -4201 914 3119 -3913 -924 3986 -2926 -2451 4621 -1409 -4366 4242 857
1355 857 -5338 2939 3002 -5574 771 5069 -4435 -1813 5745 -2393 -3744 5465 -21 -5167 4100 2361
1371 2361 -5358 2271 4049 -4914 249 5550 -3668 -2104 5911 -1654 -3851 5461 588 -5259 4059
1386 4059 3209 -5511 1740 4903 -4704 -780 6066 -2843 -3289 5720 -505 -4790 4396 1957 -5402
1401 -5402 2199 3859 -4715 -187 4810 -3357 -2401 4860 -1437 -3824 4014 530 -4803 2554 2422
1416 2422 -4757 584 3756 -3998 -1551 4530 -2202 -3541 3954 -51 -4609 2668 2024 -4715 555
1431 555 3477 -3576 -1331 3914 -2205 -2977 3694 -266 -3876 2566 1410 -4157 1216 3037 -3651
1446 -3651 -704 3901 -2314 -2370 3950 -546 -3598 3137 1451 -4099 1612 3121 -3671 -209 4098
1461 4098 -2294 -2082 4203 -534 -3358 3340 1414 -3722 1860 2944 -3324 148 3780 -2347 -1378
1476 -1378 3958 -900 -2580 3523 611 -3428 2571 2199 -3611 939 3438 -3029 -939 4109 -1644
1491 -1644 -2674 3759 222 -3653 2514 1946 -3736 692 3042 -2966 -976 3403 -1814 -2347 3088
1506 3088 -349 -3244 2253 1047 -3456 1019 2149 -3217 -496 2929 -2183 -1897 2892 -853 -2987
1521 -2987 2386 603 -3448 1211 1927 -3113 -339 2795 -2176 -1801 2865 -612 -2740 2242 827
1536 827 -3040 989 2057 -2521 -253 2631 -1719 -1382 2843 -489 -2238 2295 653 -2690 1649
1551 1649 2099 -2694 231 2917 -1976 -1074 3428 -844 -2528 2871 1028 -2954 1820 2149 -2963 360
1567 360 3355 -1942 -1179 3234 -1039 -2095 3250 574 -2969 1996 1590 -2971 1150 2805 -2883 -711
1583 -711 3304 -1663 -1587 3368 -693 -3158 2643 1215 -3206 1382 1948 -3499 16 3329 -2230 -1737
1599 -1737 2743 -1246 -2398 2984 380 -3440 1143 1274 -2670 766 2076 -2884 -1078 2393 -1231
1614 -1231 -1290 2212 -1205 -2613 2092 893 -2314 857 878 -2605 325 2532 -1463 -1384 1473 -648
1630 -648 -1074 2046 242 -2101 277 972 -580 667 955 -1353 -733 1376 522 -202 458 -426 -780
1647 -780 913 1347 -93 -532 41 -16 384 1258 511 -1206 -450 1036 442 218 882 -756 -1458 1324
1665 1324 1686 -941 -117 710 -1460 30 2738 -368 -2173 1056 306 -1262 2069 1230 -3053 -227
1681 -227 2217 -1150 20 2189 -2428 -2095 3147 256 -2308 1971 -274 -3622 2260 2893 -3523 -512
1697 -512 2364 -3153 -648 4523 -1946 -3803 2893 -36 -3078 3290 1068 -5324 888 3452 -3199
1712 -3199 71 3320 -3942 -2151 4911 -783 -3218 3196 -571 -4264 3735 2679 -4750 698 2909
1727 2909 -3935 536 5053 -3305 -3069 4463 -577 -2961 4437 410 -5246 2601 3364 -3660 975
1742 975 3219 -4083 -681 5101 -1636 -2401 3611 -1140 -3093 4367 1330 -4330 1710 2175 -3487 1488
1758 1488 3699 -3675 -1459 3866 -1318 -1736 3554 -973 -3530 2797 1608 -2939 1314 1494 -3302
1773 -3302 459 3091 -2007 -1298 2158 -1380 -1421 2727 -207 -2615 1237 639 -1874 1156 1179 -2463
1789 -2463 -409 1699 -1050 -717 1369 -1017 -1549 1239 486 -1290 108 258 -1014 16 880 -510
1805 -510 -753 69 23 -69 97 6 -363 -386 208 432 -267 -243 254 -313 -66 839 -176 -734 737 253 -794
1826 -794 873 704 -1385 388 1542 -1045 -271 1814 -873 -1050 2150 59 -1808 1688 966 -2111
1842 -2111 1058 1844 -2143 -30 2523 -1522 -991 2703 -761 -2022 2497 409 -2449 1753 1242 -2779
1858 -2779 1030 2361 -2667 -382 2841 -1960 -1440 3243 -927 -2862 2745 641 -3177 1798 1699 -3508
1874 -3508 429 2910 -2648 -970 3000 -1821 -2047 3192 -527 -3012 2312 653 -3229 1709 1942
1889 1942 -3434 128 2881 -2631 -1038 3216 -1713 -2393 3085 -30 -3025 2174 1121 -3305 1134
1904 1134 2395 -2761 -390 2792 -1842 -1395 2965 -681 -2271 2227 575 -2420 1703 1491 -2536
1919 -2536 500 2247 -1842 -416 2457 -1335 -1461 2576 39 -2052 1838 846 -2304 1066 1966 -1929
1935 -1929 -244 2216 -1073 -977 2181 -158 -1797 1491 769 -1610 767 1159 -1560 -26 1595 -952
1951 -952 -626 1431 -385 -1169 1305 366 -1462 650 831 -1410 49 1251 -1020 -767 1224 -331
1967 -331 -1179 990 334 -1521 322 938 -1208 -375 1114 -811 -915 1129 -110 -1278 639 383 -1300
1984 -1300 258 918 -1176 -427 1157 -615 -896 1112 -155 -1348 940 527 -1490 379 1170 -1294
2000 -1294 -324 1577 -728 -1069 1546 148 -1474 963 895 -1488 379 1375 -1197 -296 1658 -645
2016 -645 -854 1590 -47 -1240 1299 631 -1536 757 1278 -1397 49 1679 -1067 -677 1823 -431
2032 -431 -1372 1578 440 -1752 974 1244 -1715 59 1741 -1211 -839 1876 -565 -1379 1511 292
2048 292 -1791 932 957 -1662 176 1343 -1376 -519 1591 -855 -1100 1465 -197 -1661 1178 541
2064 541 -1882 484 1221 -1691 -298 1642 -1113 -1160 1607 -272 -1660 1250 539 -1692 513 1107
2080 1107 -1483 -189 1452 -1070 -817 1453 -478 -1284 1234 202 -1532 842 875 -1478 158 1321
2096 1321 -1168 -479 1562 -563 -1074 1433 220 -1393 907 840 -1340 347 1352 -963 -390 1429
2112 1429 -454 -855 1291 232 -1089 796 685 -987 401 971 -910 -151 1182 -487 -587 1135
2128 1135 -113 -991 903 519 -1145 258 961 -945 -379 1236 -407 -944 959 152 -1110 534
2144 534 651 -1203 -152 1022 -656 -572 960 -382 -1056 870 307 -1232 377 624 -1199 -53 1168
2161 1168 -924 -707 1135 -502 -1102 1196 158 -1659 651 893 -1459 162 1406 -1376 -889 1803
2177 1803 -472 -1367 1494 95 -1836 1134 1128 -1809 219 1456 -1500 -349 2080 -927 -1356 1828
2193 1828 -189 -1600 1739 645 -2220 942 1561 -1960 249 2084 -1712 -848 2567 -641 -1643
2208 -1643 2152 126 -2185 1719 1336 -2270 599 1833 -1982 -102 2501 -1442 -1288 2236 -551
2223 -551 -1758 2172 301 -2434 1396 1278 -2226 582 1866 -2254 -581 2445 -1312 -1388 2217 -643
2239 -643 -2141 1956 678 -2484 906 1236 -2152 296 1925 -1768 -877 1918 -1015 -1231 1928 -369
2255 -369 -1924 1452 492 -1842 1027 1081 -2047 109 1745 -1392 -580 1749 -1005 -1159 1807 -53
2271 -53 -1538 1092 417 -1548 747 1103 -1338 -40 1094 -957 -226 1308 -586 -819 1020 -50
2287 -50 -661 981 151 -1065 568 611 -637 352 607 -781 -41 847 -336 -158 631 -315 -290 668 110
2306 110 -342 288 -103 -191 497 77 -263 260 -68 -405 589 215 -571 260 161 -548 379 432 -777 -102 519
2327 519 -538 -29 790 -604 -472 730 -333 -573 819 -287 -1059 804 358 -1128 536 612 -1426
2344 -1426 105 1218 -1074 -500 1256 -737 -971 1510 -118 -1478 1013 353 -1518 772 948 -1646
2360 -1646 -18 1360 -1196 -345 1584 -945 -1087 1615 -248 -1399 1422 309 -1894 985 1233 -1747
2376 -1747 238 1591 -1545 -515 2042 -835 -1202 1712 -92 -1582 1530 636 -1778 826 1155 -1521
2392 -1521 336 1599 -1357 -562 1805 -679 -986 1775 -197 -1558 1444 656 -1666 844 1114 -1592
2408 -1592 92 1648 -1129 -639 1528 -606 -1118 1418 83 -1422 882 551 -1335 489 929 -1185
2424 -1185 -182 1075 -807 -507 1180 -532 -991 950 60 -1052 623 424 -1177 172 892 -819
2440 -819 -366 757 -500 -602 699 28 -769 364 146 -637 183 371 -503 -80 322 -305 -113 343 -177
2459 -177 -326 257 56 -270 136 117 -322 -69 296 -46 -161 192 26 -215 161 284 -198 -213 294 63 -223
2480 -223 319 187 -402 21 458 -116 -146 424 -35 -395 437 315 -427 210 353 -364 78 500 -317 -228 508
2501 508 -214 -312 619 -16 -618 422 398 -657 244 529 -763 -142 812 -405 -513 785 -150 -803 608
2520 608 298 -884 221 495 -799 -28 718 -643 -420 774 -273 -603 655 -104 -860 504 332
2537 332 -887 168 599 -811 -140 834 -508 -565 809 -142 -819 640 353 -868 261 673 -796
2554 -796 -22 812 -521 -406 761 -179 -512 603 116 -699 463 409 -671 264 649 -622 -106 804
2572 804 -339 -416 858 -20 -699 632 377 -734 241 690 -636 -113 813 -371 -450 755 33 -575
2590 -575 429 278 -645 277 465 -615 -14 625 -448 -253 654 -271 -541 546 74 -698 376 362 -711
2609 -711 148 622 -631 -258 654 -391 -584 574 28 -733 354 289 -648 34 433 -558 -213 476 -350
2628 -350 -410 438 -150 -479 411 79 -519 242 293 -579 33 420 -425 -297 516 -114 -434 475 158 -505 279
2649 279 386 -421 -4 411 -267 -180 455 -31 -257 302 28 -313 166 185 -225 68 302 -189 -83 349 -61
2670 -61 -153 259 66 -223 168 180 -265 29 333 -157 -140 358 39 -303 274 274 -293 4 363 -228 -168 357
2692 357 -31 -309 260 113 -338 104 237 -370 -51 336 -320 -217 343 -217 -301 475 -30 -532 255 222 -556
2713 -556 99 468 -583 -215 585 -374 -444 622 -157 -592 399 279 -642 232 444 -625 5 599 -389
2732 -389 -262 543 -193 -445 587 2 -642 426 233 -690 341 545 -693 -82 741 -398 -311 727
2750 727 -161 -591 635 215 -637 257 395 -589 169 619 -388 -200 615 -245 -281 608 -34 -465 462 225
2770 225 -462 353 312 -539 88 571 -357 -113 493 -289 -367 521 64 -482 218 167 -391 145 362 -304 -132
2791 -132 275 -125 -49 192 -78 -302 92 86 -95 79 -60 -239 -16 68 -137 -95 -5 -125 -77 92 18 -145 -180
2814 -180 -9 27 -85 51 47 -286 -94 220 -69 -252 208 54 -378 226 251 -376 -34 335 -242 -116 413
2835 413 -223 -334 474 40 -360 488 100 -617 296 369 -517 109 528 -496 -118 843 -304 -515 768
2854 768 9 -695 669 337 -914 297 669 -666 65 870 -574 -371 938 -274 -601 789 2
2871 2 -850 635 434 -903 276 669 -861 24 918 -713 -513 1012 -299 -785 953 51 -1071 567
2889 567 530 -984 213 754 -907 -194 986 -574 -569 885 -323 -778 746 110 -985 450 425 -941
2907 -941 284 652 -871 -197 883 -516 -509 799 -266 -754 802 257 -924 352 494 -783 182
2924 182 794 -589 -253 704 -295 -388 670 -152 -621 491 210 -528 340 341 -605 156 614 -450 -138 575
2944 575 -314 -292 598 41 -486 267 197 -367 220 295 -375 -76 332 -83 -46 248 -186 -220 242 140 -89 114
2966 114 -20 -196 166 149 -86 -36 13 -53 51 147 -12 -157 9 47 0 0 -8 -40 -173 -31 191 -83 -252 63
2990 63 2 -202 161 136 -342 -158 211 -119 -134 197 -143 -359 235 104 -256 106 45 -365 129 327 -281 -50
3012 -50 219 -291 -121 517 -111 -408 385 71 -367 346 221 -571 114 505 -314 -79 467 -301 -285 518 52
3033 52 -403 325 86 -414 292 312 -513 37 400 -337 -81 535 -161 -325 496 -70 -390 541 165 -531 186
3054 186 416 -417 -33 510 -336 -195 572 -68 -400 395 0 -422 340 260 -461 65 291 -353 -119 396
3074 396 -343 -329 378 -58 -347 251 40 -501 192 273 -394 -67 324 -333 -286 348 -69 -335 276 17 -279
3095 -279 118 169 -336 -86 195 -195 -118 242 -124 -158 265 -35 -231 130 101 -230 49 253 -172 -46 302
3116 302 -85 -196 290 56 -238 165 228 -243 17 296 -125 -142 311 35 -223 161 109 -200 105 152 -249
3137 -249 -66 220 -60 -126 241 -51 -133 278 51 -195 185 189 -277 46 297 -222 -110 323 -121 -247 311
3158 311 14 -303 221 250 -321 13 286 -262 -189 286 -83 -262 262 -4 -372 194 127 -422 78 190 -303
3179 -303 -26 299 -272 -198 366 -110 -367 219 41 -423 145 229 -377 -83 357 -258 -250 347 -42 -314 259
3200 259 62 -306 188 238 -273 49 292 -202 -44 342 -192 -155 366 -45 -293 289 148 -361 196 318 -323
3221 -323 -36 396 -232 -153 397 -27 -309 266 143 -327 175 158 -284 -1 302 -214 -103 375 -102 -230 266
3242 266 17 -285 272 132 -352 138 263 -336 -29 319 -195 -141 277 -77 -307 239 98 -323 78 224
3262 224 -270 -101 234 -192 -150 179 -105 -190 153 -25 -215 112 58 -225 3 102 -194 -116 117 -135 -113 210
3284 210 14 -229 104 65 -190 7 124 -200 -167 153 -31 -154 80 57 -103 106 147 -91 -27 90 -38 -35
3306 -35 140 30 -95 95 122 -39 102 165 -119 6 222 -39 -83 197 -46 -217 136 115 -152 21 212 -154
3328 -154 -57 281 -38 -200 183 115 -200 171 142 -217 19 258 -98 -37 152 -89 -149 220 36 -203 180 70
3350 70 -311 91 207 -252 -14 279 -182 -203 285 -70 -386 169 46 -369 146 203 -380 -106 321 -248 -100
3371 -100 319 -192 -289 234 -7 -350 215 27 -351 121 258 -320 -10 292 -303 -144 401 -145 -292 342
3391 342 22 -367 260 229 -398 67 273 -283 -50 429 -155 -175 322 -22 -237 331 85 -283 256 205 -200
3412 -200 198 228 -252 67 372 -207 -109 331 -79 -251 301 136 -232 116 133 -199 78 251 -184 -134 185
3433 185 -83 -40 131 -65 -198 105 -18 -84 89 -67 -200 60 127 -170 68 93 -158 -13 203 -32 -89 -10
3455 -10 -80 -152 55 12 -159 -88 -53 -61 51 -30 -164 -56 -40 -32 51 -5 -170 -28 80 -40 41 69 -162 -107 145 -7
3481 -7 -59 71 -70 -131 159 64 -59 58 8 -107 107 169 -131 66 91 -90 49 276 -103 -168 216 10 -107
3504 -107 262 48 -246 151 257 -121 86 150 -193 -51 355 -27 -134 136 -182 -199 307 58 -257 79 99
3525 99 -270 124 360 -341 -123 248 -130 -133 304 -81 -286 185 115 -287 117 77 -350 -44 290 -240 -151 148
3547 148 -260 -197 261 -33 -310 137 -58 -353 186 128 -372 -37 231 -196 -10 319 -214 -225 278 70 -234
3568 -234 111 58 -318 105 278 -171 -84 126 -158 -41 255 -57 -161 149 10 -115 213 108 -271 58 179
3589 179 -170 65 230 -106 -164 269 5 -111 134 18 -214 118 226 -85 -37 146 -77 -12 213 -7 -119
3610 -119 88 44 -33 144 8 -104 57 93 -138 79 100 -133 -156 148 27 -157 63 13 -182 6 89 -119
3632 -119 -76 67 -72 -64 52 36 -135 -43 67 -40 -37 15 -119 -111 55 -58 -89 20 -34 -159 18 64 -69 -49 69
3657 69 -102 -31 80 -33 -148 21 58 -65 -11 92 -133 -80 99 -15 -59 45 50 -42 77 105 -25 23 107 49
3681 49 -25 109 -16 -24 119 58 -29 61 62 -31 75 94 -71 9 188 -75 -43 172 46 -88 116 138 -144 59 120
3706 120 -79 -17 144 5 -47 109 -30 -139 62 27 -105 25 55 -105 -111 135 -117 -49 76 -86 -136 98 10
3729 10 -190 -9 54 -202 0 83 -132 -101 155 -42 -176 78 -11 -197 25 27 -137 -27 100 -128 -94 136 -115
3752 -115 -56 26 -52 -144 109 46 -143 69 67 -138 64 180 -151 -48 156 -48 -57 136 78 -133 45 152 -92
3775 -92 20 140 -31 -47 168 11 -29 117 30 -16 127 99 -63 28 105 -50 15 105 -86 3 124 -3 -97 56
3799 56 54 -98 -8 80 -95 -22 98 -73 -154 43 -5 -103 6 4 -89 -89 53 -49 -55 -22 -95 -90 -20 19 -97 -18 -32 -142
3827 -142 -22 50 -93 -44 10 -63 -86 4 -8 -91 -11 49 -112 22 105 -50 -81 60 -6 -98 51 50 -78 -6 40 -19
3853 -19 -25 48 -28 -14 162 8 -80 98 49 -98 135 130 -68 57 221 -74 -10 196 -27 -100 218 44 -136 162
3877 162 120 -120 72 201 -129 -26 189 -45 -71 173 -36 -131 129 -4 -150 71 80 -215 80 125 -235 -44
3899 -44 150 -91 -182 173 -35 -242 116 25 -248 -17 95 -214 -73 160 -163 -128 114 -89 -193 101 -23
3920 -23 -235 95 -54 -182 78 149 -137 -51 73 -220 -79 158 -135 -102 127 44 -138 47 17 -136 -11 64
3942 64 -107 36 124 -47 -53 122 -25 -63 128 78 -98 83 21 -34 67 48 -2 67 147 -2 0 117 94 18 51 85
3968 85 41 69 94 -20 19 79 38 -20 17 72 7 -14 69 53 -30 -44 -26 -25 52 -30 -20 -42 -17 -14 -6 14 -28 -54 52 -51
3998 -51 -49 -22 35 -159 -24 101 -168 -57 58 -51 -122 38 9 -143 52 48 -101 -54 76 -108 -160 84 -67 -64
4022 -64 76 -8 -141 14 81 -117 53 27 -166 17 161 -68 -60 121 -82 -62 202 71 -162 94 63 -47 52
4045 52 151 -117 -56 158 -18 7 147 -64 -104 139 71 -75 101 113 -130 29 117 -82 -7 138 -58 -67 209 -36
4069 -36 -161 125 30 -147 56 87 -162 -62 195 -53 -68 162 -89 -104 95 17 -116 9 -23 -106 -6 56 -133
4092 -133 -69 27 -128 -58 112 -90 -193 74 22 -56 69 38 -155 -61 61 -27 -14 61 -73 -109 21 112 -69 -35
4116 -35 -9 -33 -25 102 -14 -53 52 27 40 8 -4 -44 -15 94 -17 18 46 -69 17 74 82 36 37 63 -25 6 95 -56
4144 -56 3 45 60 50 57 59 -5 40 27 50 42 78 39 -41 86 57 -33 4 58 -60 50 42 -104 -4 103 -20 31 61 -32
4173 -32 -71 66 1 -88 7 38 -87 -31 78 -145 -75 11 -75 -78 41 38 -80 5 -47 -86 -26 0 -114 -55 37 -81 -76 80
4201 80 -33 -107 112 22 -58 34 49 -106 23 110 -46 -57 144 -15 -75 87 68 14 62 101 -81 26 110 0 -32
4226 -32 102 14 21 97 -21 -51 83 36 -1 80 68 -41 95 107 -23 10 55 38 -58 50 54 -75 23 61 -21 9 95
4253 95 -46 0 45 -44 -55 61 81 -63 0 -16 -29 13 25 -66 -44 25 -81 -56 1 -80 -77 -24 16 -52 -43 38 -95 -90 45
4282 45 -19 -66 -35 -13 -54 5 -23 -39 -49 -2 -32 -102 6 -7 43 42 -12 -72 59 -29 -51 -12 76 -76 14 103 20 5 106
4311 106 -2 -45 82 46 18 56 75 18 -13 98 -14 36 99 70 -3 26 25 -10 74 60 17 15 86 -36 20 65 -11 -43
4339 -43 99 -25 -24 37 -22 -53 -7 90 -32 20 73 -62 -76 0 -46 -75 6 1 -62 23 29 -58 -2 19 -30 -38 3 22 -66 24
4369 24 -38 -25 -15 -26 -108 -21 21 -61 -44 -4 -55 -108 43 -3 -71 2 28 -80 33 -33 -9 28 -29 -31 4 41 -41 -19 28
4398 28 -16 -34 1 21 -39 -7 51 -6 31 60 40 -74 44 28 -27 8 69 32 83 22 53 24 40 37 -32 40 45 41 28 36 -13
4429 -13 22 38 -28 11 18 -44 10 76 23 -2 22 -35 -8 30 38 -74 -11 46 -31 20 -48 -25 16 -49 -1 -88 -56 13 21 34 20
4460 20 -51 -51 -50 -45 -74 33 -72 -86 -51 -51 -39 4 4 -73 -14 -43 -48 -58 -45 1 -43 -29 -34 -40 -50 35 31 -57 -21 -7 -41 11 39 7
4494 7 10 22 28 34 70 65 35 33 28 21 39 3 22 79 87 -14 12 91 36 24 46 0 -7 46 51 26 20 -12 15 -34 4 14 -30 -6 -39 -41
4530 -41 7 3 -17 20 -11 -37 1 -1 -25 -15 43 -19 -40 16 -38 -48 23 34 -57 -25 0 -37 -91 -3 -38 -30 -28 -33 -44 -14 -17 -13 4 -44
4564 -44 -18 -47 -42 -56 -55 26 1 -90 13 -14 7 22 -1 -100 11 37 -13 -26 16 14 -7 58 16 -36 58 62 12 27 67 16 35
4595 35 43 8 44 94 19 6 57 93 8 14 26 19 -10 70 9 30 57 -55 18 89 -8 -33 -1 -2 49 35 -21 -31 -52 -15 -11 40
4627 40 23 -30 -56 -14 20 2 31 -31 -29 5 -16 21 -100 -92 15 16 46 0 -15 -64 2 -59 -33 1 -45 -49 -8 -13 0 -50 16 -73
4659 -73 -49 3 -5 -57 -76 -33 -21 -22 -3 -47 -15 23 32 74 -3 13 47 71 31 -26 22 57 4 69 43 -20 -37 23 2 29 22 23 53
4692 53 27 10 -30 34 27 30 40 64 59 39 60 45 7 -17 -21 -8 79 3 -28 31 33 -14 -26 36 6 -22 66 -8 -105 -26 14 -4 11
4725 11 -17 -11 -8 54 23 -68 -22 -47 -50 -28 -36 -99 3 11 -38 0 -10 -35 -27 -32 -20 -67 1 -74 -59 -21 7 -7 -39 -13 -57 -36 -8
4758 -8 -45 -50 3 -33 -6 28 12 4 45 14 -5 13 41 24 -8 3 -47 61 47 60 10 0 43 13 41 9 1 45 71 31 54 47
4790 47 -3 -6 29 48 52 -53 52 -5 17 26 -31 23 39 -11 -20 20 20 3 -12 29 -15 -12 9 -36 -59 20 -7 -66 9 -8 -42 -26
4822 -26 -63 -72 -11 8 4 6 3 -39 -33 -51 17 -26 -14 -28 -51 -57 -50 50 -19 -20 -48 -6 14 7 -17 32 -14 30 -23 53 25 11 51 -35
4856 -35 3 38 31 -19 8 -30 -32 4 37 -2 -17 -26 24 58 41 35 36 34 86 68 72 57 26 50 48 24 30 66 33 15 8 109 55 14 86
4891 86 56 18 44 -4 -22 -11 3 -26 -36 -48 -1 -40 -39 -36 -43 24 -5 -69 -7 -23 -30 -42 -38 -7 19 -19 -23 -14 -18 -3 -11 -23 -34 -7 -20
4926 -20 -34 -36 -113 -71 -84 -38 -30 -47 -51 -40 7 -26 -14 -58 -14 -5 9 1 34 8 23 11 29 -15 20 13 39 17 56 10 40 -7 17
4959 17 24 28 52 -5 59 37 -26 68 65 -10 30 39 14 -10 27 12 58 49 74 36 2 -10 -10 29 21 28 6 17 -51 62 -42 39 -55
4992 -55 -2 -31 -8 16 18 -42 -48 1 -33 -25 -32 -3 27 -10 26 18 -36 23 12 -15 -31 -44 -12 -5 19 -6 -72 14 -70 -49 93 -14
5024 -14 -46 -11 -19 38 16 -12 19 32 6 2 20 14 -30 -4 14 11 38 17 -16 3 6 42 50 52 18 51 63 6 1 22 -18 25 -19 21
5058 21 54 18 9 39 20 35 11 43 10 33 -30 42 -2 38 -3 50 42 -7 33 -7 -22 9 -7 22 -18 -54 -1 -46 -3 -16 -36
5089 -36 -21 3 -43 -32 -22 -20 -64 3 -24 -46 -40 -78 -31 -52 4 14 -22 -7 -30 37 -52 -32 -20 -38 -3 -18 51 -9 -59 33 -5
5120 -5 -69 -26 -34 6 -8 16 17 9 19 29 43 -9 36 18 -44 3 12 45 43 44 -2 -43 -7 90 5 90 7 10 1 56 53 17 66 32 69
5155 69 68 8 26 5 53 4 -5 46 -20 66 -35 -3 36 10 1 9 10 13 19 -11 -26 10 -24 -21 -25 -26 2 -17 -51 -88 -7 -41 -27 -8 0
5190 0 -69 20 24 -30 -30 -12 0 -1 -68 -55 -29 -34 -28 -9 -68 -12 8 1 -20 -16 15 -18 -11 14 19 62 -21 -16 -17 -9 -24 20 26 15 12 -21 27 61
5228 61 10 18 37 31 -13 -34 -27 64 35 20 37 9 44 5 -14 24 8 35 -1 21 31 96 40 -20 45 -1 33 38 66 42 70 -12
5260 -12 -8 54 6 -36 8 -37 -10 -32 -5 23 -49 22 10 -17 -45 28 -55 -56 -49 5 -70 -37 4 -36 -22 -40 15 -42 -27 -18 -6 -78
5292 -78 19 25 -24 -41 -19 9 -73 13 28 -14 8 6 -24 -27 6 -19 14 -10 -4 13 24 9 -11 -18 39 3 -25 -35 2 12 48 28 15
5325 15 -11 23 14 0 39 -1 4 47 -53 1 -24 31 8 38 20 19 39 59 -9 50 -37 22 37 -4 16 -26 -4 44 49 53 -13 4
5357 4 -41 26 3 -23 -4 -24 -58 -2 -60 -53 -15 -19 -29 -23 -6 -39 -44 -80 -28 15 -43 -38 17 3 13 -37 -22 -20 10 16 -37 0 -27 15
5391 15 -4 3 -3 -39 -18 7 3 4 -17 48 -11 2 7 40 -42 49 10 -7 62 -31 42 46 69 -11 5 26 -6 22 61 50 17 42 17
5424 17 24 22 42 7 -11 22 -21 41 18 22 -1 16 3 -24 10 -12 11 20 -21 -31 8 28 20 -42 60 -68 -29 43 -56 -20 -29 9
5456 9 10 -54 51 1 11 5 -61 -39 -6 -18 -21 -14 -21 -25 -34 1 -62 -35 -61 1 7 -37 -27 49 -61 -21 33 0 24 -7 -14 -2 3 7 28
5491 28 4 -8 14 25 22 -8 31 1 1 27 6 23 -6 54 21 1 22 62 -12 19 11 23 -34 44 19 52 4 -1 -28 38 12 -30
5523 -30 8 -15 73 40 -2 53 -52 -32 -6 -38 -16 -41 -48 63 15 -6 15 -13 -20 -35 -24 -53 5 -51 14 -43 -73 -36 -54 -8
5553 -8 -44 15 8 24 -27 -1 -49 -68 7 11 -48 -40 43 25 -50 -55 -26 -25 -2 -15 30 -12 -5 30 1 -14 -26 -39 24 -25 66 20 -34 8
5587 8 11 20 -20 27 -3 35 -17 77 -21 1 43 42 -59 19 33 19 -6 -7 31 2 4 11 -79 26 75 45 10 11 -19 -20 86 4 -64
5620 -64 8 21 33 7 28 -67 29 31 27 -18 12 -9 -4 33 21 -11 17 31 7 63 -31 -51 -13 6 -58 32 -76 -26 -12 -37 -15
5651 -15 -38 -63 -45 -75 -69 5 -99 4 -6 -22 -45 19 -3 -19 13 -37 -13 -13 56 -47 39 43 -3 49 57 14 0 -40 52 -23 -20
5682 -20 2 75 9 59 69 5 32 10 9 32 35 34 -22 -6 -19 17 21 0 -25 -37 12 52 -39 4 24 77 29 -10 -17 4 -63 -2 4
5715 4 -24 -30 -26 -18 -50 -23 5 -30 -40 -23 -43 35 -2 14 -49 -2 -24 -16 6 -8 -23 -58 -11 -64 -20 -59 -43 -48 -37 -39 -51 -3 -2 -18
5749 -18 -27 -27 -54 -56 6 -38 -51 8 -43 -65 -3 84 -22 -25 -15 -20 -10 35 -4 -35 28 -9 -3 24 13 1 13 58 13 -31 58 -19 -7
5782 -7 28 9 8 11 -34 38 21 36 -52 -4 22 45 9 27 -37 7 41 -12 24 28 -1 10 -12 58 -17 -5 -4 -33 -19 -6 1 -32 9
5815 9 35 21 7 -12 -7 4 -27 5 13 0 -20 -56 8 -39 -11 32 -5 -26 -47 -92 -22 -79 -16 -29 -24 51 -17 -3 -30 -39 -5 40 -2
5848 -2 -41 25 18 -26 25 -8 41 13 -40 47 -64 34 22 36 -13 17 5 5 -31 18 47 55 60 1 5 -17 62 3 31 -21 60 27 3
5881 3 -30 0 -21 -5 0 11 19 38 -62 -46 -1 -82 -4 1 7 -18 -6 16 -30 0 -50 5 -21 6 35 -33 -21 30 -89 51 -30
5912 -30 -6 -25 -24 -26 -14 -3 45 19 5 -87 -13 21 5 -15 -26 -56 -64 7 -49 -17 -75 5 23 -44 -13 -6 5 -3 -54 -52 -95 24 -11
5945 -11 -38 -2 57 -25 15 -1 31 13 14 17 -16 -7 38 -6 -11 36 17 -9 9 0 50 27 48 32 -9 30 21 49 0 5 19 28 -17 52
5979 52 28 80 -4 46 -10 -29 54 4 -2 18 -62 -30 -72 17 -38 8 20 -33 2 -8 8 -9 -14 56 15 -37 7 -48 -25 20 21 -33
6011 -33 -18 -54 36 -47 29 -1 28 -23 -17 -21 -44 30 -9 18 -16 -46 27 77 -17 -5 37 -23 24 -26 -5 15 20 -30 -26 -4 41 55
6043 55 -26 33 -11 -15 42 44 -5 -8 -19 -10 -27 45 1 0 17 45 25 -10 13 -12 3 28 33 -10 42 51 28 65 57 -73 13 28 4 34
6077 34 10 32 18 -18 -63 18 49 6 -93 8 -47 10 21 15 -10 25 -26 22 -8 5 -80 4 58 -22 -15 -22 -45 -89 -24 -34 2
6108 2 -25 52 -55 -27 28 -21 -6 -13 -25 14 25 4 29 19 5 42 -14 -7 6 -31 43 -16 -20 25 -4 7 6 2 -1 18 32 -35 15
6141 15 40 13 34 -20 -16 -31 -29 -7 -4 11 27 25 28 10 32 23 -7 62 -21 -12 0 18 30 49 29 -7 0 0 32 21 23 3 46 24 36
6176 36 -31 -29 6 0 19 -24 -32 -20 -79 -29 -24 8 0 29 25 31 37 -14 -28 -26 -11 15 -4 4 29 5 47 22 -1 56 -4 10 -24 -43 -30
6211 -30 13 6 -31 -31 1 -20 -23 -10 -11 45 -67 -1 17 -28 52 26 -16 -9 -26 73 11 -15 25 2 25 -5 4 2 -25 27 34 28 27 -21 47
6246 47 45 6 -53 22 8 32 5 19 22 24 52 -36 -11 -3 -41 -23 1 24 7 10 64 23 27 -42 -18 12 -88 -2 12 -25 -26 -4 -61
6279 -61 -43 0 -34 -12 -5 -53 35 27 -25 11 -14 -33 -54 -33 -18 30 -19 -20 -39 9 10 -47 -2 -58 26 9 9 42 -46 -34 -15 91
6311 91 36 -16 2 26 -16 5 54 -20 31 14 52 50 15 -26 4 -41 -40 32 -34 15 37 5 -23 -6 79 -56 4 2 26 -19 26
6342 26 27 8 20 -30 -42 20 10 -29 -10 46 11 -6 63 -9 -12 -12 -2 -1 -17 -50 10 -24 -51 30 20 5 -35 1 21 21 -35 -4 -6
6375 -6 -15 -14 -55 -5 -16 -17 10 -48 -8 2 15 21 24 18 28 -32 -52 -9 -72 -12 57 -13 6 9 -1 11 58 -30 -3 -24 42 -10 0 8 11
6410 11 19 29 -5 25 23 -16 6 0 -13 -15 31 8 39 -5 4 -42 -39 42 16 -25 36 26 -32 -50 53 -1 21 8 42 -3 19 43 -3
6443 -3 -5 -13 18 10 11 -46 -12 -28 4 54 -12 -19 -20 59 -16 16 57 7 20 11 -4 -23 -30 -27 -28 3 -9 -56 -49 -45 -83 -11 13 -43 -34 -4 4 -5
6481 -5 48 8 -40 -11 8 -3 -6 -6 -14 8 27 -3 -3 -23 -7 5 29 3 -5 72 -16 -12 -16 35 -12 -5 34 10 -27 -58 -12 40 -22 18 8
6516 8 13 -43 -26 2 -9 51 -87 -75 -51 6 -31 30 -16 -35 27 18 47 23 -7 -8 -24 61 27 -54 -23 -1 -25 -40 13 0 -34 -25
6548 -25 -8 -44 -12 -23 -9 7 -51 -52 -19 2 -10 -56 -18 -1 24 -16 -22 16 -27 11 5 -35 18 -23 -60 7 5 -69 -14 -21 19 12 -9
6581 -9 10 -13 -8 -38 47 -6 -13 -6 38 -28 -18 15 0 -38 -19 53 49 -18 26 23 21 -62 11 1 -54 38 13 3 -42 46 56 -8 34 -11
6615 -11 -10 -15 49 -36 -25 -64 18 -8 2 2 -48 36 46 31 17 22 13 15 1 -45 -13 56 18 -6 -14 22 10 -2 -3 13 -18 13 -63 -24
6649 -24 -34 32 -30 30 4 5 6 -65 -26 6 9 -46 21 -46 -21 10 -12 35 -51 -37 -27 -1 -21 -49 -52 5 -6 25 -3 13 45 32
6681 32 -23 63 24 23 -11 -21 58 23 72 -3 37 47 30 -6 -41 4 4 -10 68 35 -18 1 -43 -31 7 44 7 -3 16 18 15 -43
6713 -43 -82 15 39 -3 46 -1 -14 47 -9 52 -10 -5 10 25 10 -13 37 -36 14 -40 -9 37 -31 31 -10 74 -38 -46 -11 -8 -17 -5
6745 -5 10 -20 -40 49 -70 -23 10 4 -50 -44 -20 12 37 28 -4 -8 8 -45 20 64 -50 -66 36 -33 -9 -20 6 18 55 37 59
6776 59 27 86 -2 -62 29 59 37 -8 -14 -14 63 -25 -13 18 -20 20 10 42 0 43 11 14 1 -33 -21 20 41 -27 -49 40 -19 -22
6808 -22 36 30 17 25 -61 15 -66 -18 -8 6 -9 -35 25 52 23 13 -8 9 -25 12 18 -7 23 20 23 27 21 7 12 17 -22 -16 39 -15 -44
6843 -44 9 -6 22 -24 21 25 -14 11 -21 -9 -10 2 -17 -40 28 -45 38 5 7 -26 -29 56 24 -21 18 87 -45 -35 -1 67 4 42
6875 42 35 11 41 -8 15 36 -7 28 52 -2 11 -8 34 38 31 13 -3 1 10 -1 -17 -46 -32 -4 -25 50 -64 -5 -7 -19 -8 -3 8
6908 8 16 39 39 -43 7 -26 17 21 18 -23 -32 47 -4 10 14 27 -33 20 46 -9 6 -39 3 -2 -7 -48 16 75 33 -10 16 -42 -24 -33 -3
6943 -3 -72 0 13 -18 1 -17 -8 -2 -7 -33 46 9 -26 38 -27 33 -40 12 56 -23 10 1 31 6 -8 16 -13 48 36 -17 0 39 -22
6976 -22 -2 26 -31 -17 6 -10 19 39 20 -23 -9 -6 -11 8 50 36 -28 11 -17 -2 33 14 -1 -13 8 38 -4 28 -15 -47 -29
7007 -29 15 3 -59 -28 -29 13 -34 8 -53 14 -1 3 -18 16 -33 39 -29 -12 -19 -38 -41 -18 13 -10 -11 -34 -11 -27 -11 -7 6 -5 -56
7040 -56 6 -19 35 25 -16 -6 -41 17 -21 -20 -7 15 -56 -46 -5 36 -30 -3 -6 4 44 32 27 24 33 34 8 49 25 33 67 13 -1 9
7074 9 -11 -7 3 -12 -10 -10 -36 -90 8 35 18 40 -28 -10 -16 29 -5 1 -7 -34 -46 20 -15 3 -8 -39 39 -12 7 15 -12 51 4 -36
7108 -36 -1 20 -20 15 15 0 15 13 -20 -45 0 1 11 -23 18 -21 14 -34 18 -8 -28 -3 -28 33 12 22 -33 1 -38 -14 20 18
7140 18 -29 -44 -15 -5 21 34 43 24 46 34 3 3 -5 -39 43 18 51 0 48 -11 3 43 12 17 39 15 -52 49 4 41 -36 -12
7172 -12 10 -6 -56 -34 -8 -48 -9 -6 -10 -44 28 -30 -36 31 -8 -44 -16 25 -21 -37 -66 -31 -34 23 -48 12 34 -39 8 40 4 -46
7204 -46 -57 7 18 -31 51 -13 26 39 1 38 -57 6 -12 -15 -42 13 22 4 3 21 55 -12 -30 -15 -3 -5 -14 -3 -9 -3 -3 -59 -27 25
7238 25 32 -6 11 -50 1 -55 -17 10 0 -38 10 51 -2 23 93 -4 -56 -20 -31 -3 33 36 0 -6 2 -13 64 29 19 -6 -17 -33
7270 -33 -29 9 -55 -4 15 52 21 -23 5 47 33 22 -26 -61 60 26 -20 8 -26 -5 -23 -47 -18 -15 -54 -41 16 21 -31 -37 43 19
7302 19 29 5 32 -18 -16 -20 6 28 -1 -7 1 17 -6 1 30 -66 30 3 51 26 -33 0 -18 -31 -14 8 -31 21 2 -13 4 12 2
7335 2 34 4 39 5 40 12 15 41 8 -14 33 31 -14 4 -63 -5 27 26 -9 43 31 -33 -15 18 8 28 20 6 4 -21 -12 -26 -39 -54
7369 -54 0 -24 -12 -26 5 -13 33 -7 -15 -4 3 11 -27 -19 -1 13 -52 3 47 -11 -39 -43 0 60 26 6 34 -16 33 -31 42 38 -19
7402 -19 49 35 34 -30 -46 -6 7 52 13 18 -46 7 -5 -10 -28 14 -12 3 -34 29 7 -32 -11 -24 -39 87 7 8 -39 15 16 54
7434 54 19 -3 -12 -12 -55 -13 61 -11 4 22 85 -9 -2 9 39 -35 -3 -22 20 -25 -60 52 -59 25 -45 34 -23 -49 29 17 9
7465 9 -45 26 22 28 56 46 -7 -31 -14 -11 -3 1 -21 -2 -5 -26 -19 -30 -38 14 23 36 3 42 -5 -3 -63 21 -15 42 -13 -32 2 3 -10 -20
7501 -20 24 41 6 27 -55 18 27 -38 14 -14 -15 9 -5 -26 27 29 -13 -20 44 71 14 -13 -18 -3 -21 32 19 14 32 -30 3 -1 -18 -34
7535 -34 -56 -33 -24 -23 40 -15 59 -1 -34 3 -12 9 -37 9 -24 -30 -35 43 -8 34 55 -32 -18 -28 5 12 -10 -7 -26 -33 -71 -7 12 -28
7569 -28 -6 -15 -14 43 -30 6 -20 4 -28 -94 49 38 -32 -13 9 8 38 -27 -1 47 -33 -20 -3 -36 2 15 -33 37 -9 32 43
7600 43 -1 -33 41 -9 -28 -27 -45 -34 -32 9 -1 -13 10 -9 -24 -1 -46 -28 -19 -14 30 30 -18 39 14 45 24 -16 26 -6 -8 36 -8
7633 -8 36 -8 0 -16 37 -8 -12 16 -14 -19 17 -14 22 49 -4 39 25 -67 -18 0 -79 8 -5 17 -29 -9 34 21 -46 -84 -14 -44
7665 -44 -14 42 6 -17 8 30 17 -29 0 7 42 -8 55 7 -40 -29 -26 -5 -1 26 58 -7 -35 13 58 -30 -14 79 28 47 -10 -7
7697 -7 72 27 45 51 4 -28 21 15 -21 -31 -9 29 -21 -17 27 3 11 16 -42 23 52 -10 16 32 3 -20 -24 6 4 50 2 -6 43 15 -60
7732 -60 -11 24 9 32 -27 51 -28 -79 19 -22 -17 12 -19 17 -2 -35 8 -43 5 1 37 -40 15 31 -6 -12 -13 -35 23 9 14 -15 31
7765 31 -80 22 -31 12 6 25 -9 -14 -11 26 -62 -17 27 4 -7 -34 19 58 12 -8 14 41 75 13 -2 19 20 31 41 5 -19
7796 -19 19 45 24 -4 -12 -17 3 -18 50 -58 46 -4 -12 -57 -36 11 -12 -31 7 33 -27 -31 39 22 -19 -16 -49 -10 33 -10 6 -35
7828 -35 31 62 -6 -27 -43 2 -38 19 27 1 61 -26 -40 18 6 -8 -21 -14 4 18 -4 25 13 48 -18 -7 -21 -34 -1 -32 -27 42
7860 42 25 -37 -3 -13 -21 -20 7 60 -5 -52 27 -53 27 28 1 -7 -10 36 6 15 54 18 -25 -3 52 54 -1 11 30 -1 -14 -15 -33 -24 22
7895 22 40 -1 -3 25 0 -18 -3 9 -11 -29 -23 -69 -22 -39 41 63 -12 8 -7 -29 30 -23 48 -32 -21 31 -39 0 -1 0 15 19 1
7928 1 29 26 -30 42 37 46 56 12 35 -8 -7 24 9 -36 -4 -28 15 -13 51 22 -15 -3 -49 -32 24 -21 -3 -21 5 24 -21 -6 -35
7961 -35 51 27 -5 -4 4 21 10 17 -35 19 -2 -51 63 21 -1 5 -36 -11 -26 36 5 17 32 11 -54 33 8 -31 19 4 -14 5
7993 5 20 -29 -27 -41 -19 -23 -13 -30 27 51 -3 30 -49 -38 3 10 -17 13 27 -30 -37 51 -12 2 4 78 9 -10 42 23 6 13 11 -35
8027 -35 -40 13 12 23 -5 65 3 -22 21 32 -42 28 -14 -30 -4 3 -21 -11 3 5 -39 3 -16 6 -48 1 12 -43 -60 38 5 53
8059 53 23 -19 65 36 -26 47 17 34 13 39 44 51 67 -1 -36 7 13 -5 -26 2 37 5 9 46 64 -46 -15 14 23 -43 -20 -21 -23
8092 -23 -16 -43 -31 -10 -30 38 14 -1 -8 3 -45 29 11 -26 26 39 -15 -19 27 12 13 15 22 -8 17 -11 -27 3 18 14 -39 32 -2 -30
8126 -30 -12 14 -7 -96 -22 -65 -30 -13 -44 -30 11 -15 -53 9 -26 -37 62 12 19 23 25 3 4 -62 -3 49 11 -23 19 52 49 13 -7
8159 -7 -10 -25 49 -35 42 5 36 -18 -25 -5 -9 7 47 17 41 -43 65 -10 14 -21 -28 -41 -31 2 -14 -59 -14 -48 1 10 -19 -23
8191b3
##END NTUPLES=NMR FID
##END=
