##TITLE=1H_ABCP507
 CDCl3, 8 sc, 
 5.7.2019
##JCAMPDX= 6.0         $$ Bruker NMR JCAMP-DX V2.0
##DATA TYPE= NMR FID
##DATA CLASS= NTUPLES
##ORIGIN= UXNMR, Bruker Analytische Messtechnik GmbH
##OWNER= root
$$ XWIN-NMR		Version 3.5
$$ Fri Jul  5 16:39:43 2019 Russian Standard Time (UT+4h)  she@DPX200
##.OBSERVE FREQUENCY= 200.13155
##.OBSERVE NUCLEUS= ^1H
##.DELAY= (6, 6)
##.ACQUISITION MODE= SIMULTANEOUS
##.ACQUISITION SCHEME= undefined
##.AVERAGES= 8
##.DIGITISER RES= 18
##SPECTROMETER/DATA SYSTEM= spect
##.PULSE SEQUENCE= zg30
##.SOLVENT NAME= CDCl3
##.SHIFT REFERENCE= (INTERNAL, CDCl3, 0, 15.7039)
##AUDIT TRAIL= $$ (NUMBER, WHEN, WHO, WHERE, WHAT)
$$ ##TITLE= Audit trail, XWIN-NMR		Version 3.5
$$ ##JCAMPDX= 5.01
$$ ##ORIGIN= Bruker BioSpin GmbH
$$ ##OWNER= she
$$ F:/spectra/data/she/nmr/H-F/1/audita.txt
$$ ##AUDIT TRAIL=  $$ (NUMBER, WHEN, WHO, WHERE, WHAT)
(   1,<2019-07-05 16:38:50.32 +0400>,<she>,<DPX200>,
      <created by zg, POWCHK disabled, PULCHK disabled
       configuration hash MD5:
       00 E9 B6 7A A2 85 ED C7 34 08 36 98 17 FE 4E 26
       data hash MD5: 16K
       3C DD AB 6C 43 89 B0 9A 83 62 F0 81 5E A9 15 33>)
$$ ##END=
$$ 
$$ hash MD5
$$ 77 8E A1 4F 1D A3 11 19 BE 76 21 05 DF BB 75 7D
##$RELAX= 
##$RELAX= 
##$RELAX= 
##$RELAX= 
##$RELAX= 
##$RELAX= 
$$ Bruker specific parameters
$$ --------------------------
##$DU= <F:/spectra>
##$EXPNO= 1
##$NAME= <H-F>
##$PROCNO= 1
##$TYPE= <nmr>
##$USER= <she>
##$AMP= (0..31)
100 100 100 100 100 100 100 100 100 100 100 100 100 100 100 100 100 100 
100 100 100 100 100 100 100 100 100 100 100 100 100 100 
##$AQSEQ= 0
##$AQ_mod= 1
##$AUNM= <au_zg>
##$AUTOPOS= <>
##$BF1= 200.13
##$BF2= 200.13
##$BF3= 200.13
##$BF4= 200.13
##$BF5= 200.13
##$BF6= 200.13
##$BF7= 200.13
##$BF8= 200.13
##$BYTORDA= 1
##$CFDGTYP= 0
##$CFRGTYP= 5
##$CHEMSTR= <none>
##$CNST= (0..31)
1 1 145 1 1 1 1 1 1 1 1 1 1 1 1 1 1 1 1 1 1 1 1 1 1 1 1 1 1 1 1 1 
##$CPDPRG= <>
##$CPDPRG1= <>
##$CPDPRG2= <>
##$CPDPRG3= <>
##$CPDPRG4= <mlev>
##$CPDPRG5= <mlev>
##$CPDPRG6= <mlev>
##$CPDPRG7= <mlev>
##$CPDPRG8= <mlev>
##$CPDPRGB= <>
##$CPDPRGT= <>
##$D= (0..31)
0 1.2 0 0 0 0 0 0 0 0 0 0.03 0 0 0 0 0 0 0 0 0 0 0 0 0 0 0 0 0 0 0 0 
##$DATE= 1562330329
##$DBL= (0..7)
120 120 120 120 120 120 120 120 
##$DBP= (0..7)
150 150 150 150 150 150 150 150 
##$DBP07= 0
##$DBPNAM0= <>
##$DBPNAM1= <>
##$DBPNAM2= <>
##$DBPNAM3= <>
##$DBPNAM4= <>
##$DBPNAM5= <>
##$DBPNAM6= <>
##$DBPNAM7= <>
##$DBPOAL= (0..7)
0.5 0.5 0.5 0.5 0.5 0.5 0.5 0.5 
##$DBPOFFS= (0..7)
0 0 0 0 0 0 0 0 
##$DE= 6
##$DECBNUC= <off>
##$DECIM= 24
##$DECNUC= <off>
##$DECSTAT= 4
##$DIGMOD= 1
##$DIGTYP= 9
##$DL= (0..7)
0 120 120 120 120 120 120 120 
##$DP= (0..7)
150 150 150 150 150 150 150 150 
##$DP07= 0
##$DPNAME0= <>
##$DPNAME1= <>
##$DPNAME2= <>
##$DPNAME3= <>
##$DPNAME4= <>
##$DPNAME5= <>
##$DPNAME6= <>
##$DPNAME7= <>
##$DPOAL= (0..7)
0.5 0.5 0.5 0.5 0.5 0.5 0.5 0.5 
##$DPOFFS= (0..7)
0 0 0 0 0 0 0 0 
##$DQDMODE= 0
##$DR= 18
##$DS= 0
##$DSLIST= <SSSSSSSSSSSSSSS>
##$DSPFIRM= 0
$$ [...]
##$SUBNAM2= <"">
##$SUBNAM3= <"">
##$SUBNAM4= <"">
##$SUBNAM5= <"">
##$SUBNAM6= <"">
##$SUBNAM7= <"">
##$SUBNAM8= <"">
##$SUBNAM9= <"">
##$SW= 24.9336996594482
##$SWIBOX= (0..15)
0 0 2 0 0 0 0 0 0 0 0 0 0 0 0 0 
##$SW_h= 4990.01996007984
##$TD= 16384
##$TD0= 1
##$TE= 0
##$TE2= 300
##$TE3= 300
##$TEG= 300
##$TL= (0..7)
0 120 120 120 120 120 120 120 
##$TP= (0..7)
150 150 150 150 150 150 150 150 
##$TP07= 0
##$TPNAME0= <>
##$TPNAME1= <>
##$TPNAME2= <>
##$TPNAME3= <>
##$TPNAME4= <>
##$TPNAME5= <>
##$TPNAME6= <>
##$TPNAME7= <>
##$TPOAL= (0..7)
0.5 0.5 0.5 0.5 0.5 0.5 0.5 0.5 
##$TPOFFS= (0..7)
0 0 0 0 0 0 0 0 
##$TUNHIN= 0
##$TUNHOUT= 0
##$TUNXOUT= 0
##$USERA1= <user>
##$USERA2= <user>
##$USERA3= <user>
##$USERA4= <user>
##$USERA5= <user>
##$V9= 5
##$VALIST= <valist>
##$VCLIST= <CCCCCCCCCCCCCCC>
##$VD= 0
##$VDLIST= <DDDDDDDDDDDDDDD>
##$VPLIST= <PPPPPPPPPPPPPPP>
##$VTLIST= <TTTTTTTTTTTTTTT>
##$WBST= 1024
##$WBSW= 4
##$XGAIN= (0..3)
0 0 0 0 
##$XL= 0
##$YL= 0
##$YMAX_a= 236723
##$YMIN_a= -190070
##$ZGOPTNS= <>
##$ZL1= 120
##$ZL2= 120
##$ZL3= 120
##$ZL4= 120
##$ABSF1= 10
##$ABSF2= 0
##$ABSG= 5
##$ABSL= 3
##$ALPHA= 0
##$AQORDER= 0
##$ASSFAC= 0
##$ASSFACI= 0
##$ASSFACX= 0
##$ASSWID= 0
##$AUNMP= <proc_1d>
##$AZFE= 0.1
##$AZFW= 0.1
##$BCFW= 1
##$BC_mod= 2
##$BYTORDP= 1
##$COROFFS= 0
##$CY= 11.3945322036743
##$DATMOD= 1
##$DC= 2
##$DFILT= <>
##$DTYPP= 0
##$F1P= 18.9103706918063
##$F2P= -1.10871071338519
##$FCOR= 0.5
##$FTSIZE= 0
##$FT_mod= 4
##$GAMMA= 1
##$GB= 0.15
##$INTBC= 1
##$INTSCL= 1
##$ISEN= 128
##$LB= 0.24
##$LEV0= 0
##$LPBIN= 0
##$MAXI= 10000
##$MC2= 0
##$MEAN= 0
##$ME_mod= 0
##$MI= 1.114404
##$NCOEF= 0
##$NC_proc= 0
##$NLEV= 6
##$NOISF1= 3.799351
##$NOISF2= 2.8
##$NSP= 1
##$NTH_PI= 0
##$NZP= 0
##$OFFSET= 15.70392
##$PC= 1
##$PHC0= -9015.401
##$PHC1= 12.20096
##$PH_mod= 1
##$PKNL= yes
##$PPARMOD= 0
##$PSCAL= 0
##$PSIGN= 0
##$REVERSE= no
##$SF= 200.130013532006
##$SI= 16384
##$SIGF1= 3
##$SIGF2= 2
##$SINO= 400
##$SIOLD= 16384
##$SREGLST= <1H.CDCl3>
##$SSB= 0
##$STSI= 0
##$STSR= 0
##$SW_p= 3612.71676300578
##$SYMM= 0
##$S_DEV= 0
##$TDeff= 0
##$TDoff= 0
##$TI= <>
##$TILT= no
##$TM1= 0
##$TM2= 0
##$TOPLEV= 0
##$USERP1= <user>
##$USERP2= <user>
##$USERP3= <user>
##$USERP4= <user>
##$USERP5= <user>
##$WDW= 1
##$XDIM= 8192
##$YMAX_p= 0
##$YMIN_p= 0
$$ End of Bruker specific parameters
$$ ---------------------------------
##NTUPLES= NMR FID
##VAR_NAME=  TIME,          FID/REAL,        FID/IMAG
##SYMBOL=    X,             R,               I
##VAR_TYPE=  INDEPENDENT,   DEPENDENT,       DEPENDENT
##VAR_FORM=  AFFN,          ASDF,            ASDF
##VAR_DIM=   8192,          8192,            8192
##UNITS=     SECONDS,       ARBITRARY UNITS, ARBITRARY UNITS
##FACTOR=    0.0002004,     1,               1
##FIRST=     0,             0,               0
##LAST=      1.6414764,     0,               0
##MIN=       0,             -190070,         0
##MAX=       1.6414764,     236723,          0
$$ Real data points
##PAGE= N=1
##DATA TABLE= (X++(R..R)), XYDATA
$$ [...]
1932B579m7n310N37N234q03m849J342M401k049m060K882M161l557l932L944L543
1948D016m641l203N463L236o247l521O577L511o851l367O939L269p303l520P419
1963A777L516o952l510O364K961o184k232N905K075n653j537M803O95m318N63
1978a727M462j348m586J797M372k372l963L357L963m112m491M511M863m192m551
1993d017M126M164m725m003N094M523m659m541L819L953l691l167M016L027l910
2008Il400L132L140k366k263J969J482k194j350J952J417j384r52O33k30p61R05
2025b61J408q25j566N18J185q61j232J433K037j154k795K09K944P51k473r89K527
2042H56J044l065j868L495L441k779m268J715M120j437l810K022M396k104n344
$$ y = [2579, 2532, -2778, -2241, 2993, 2190, -2659, -1317, 3084, 1035, -3025, -143, 4018, 461, -3471, 473, 4016, -625, -3828, 1635, 4871, -1376, -4897, 1680, 5191, -1660, -5027, 1912, 5181, -2122, -5642, 1777, 5293, -1659, -5169, 1195, 4156, -2028, -4260, 1645, 3720, -1933, -3470, 1333, 2028, -2290, -1727, 2735, 1387, -3199, -1402, 2970, 598, -3365, -8, 3955, -157, -4648, -137, 4726, 534, -4017, 109, 4273, -452, -4455, 639, 5162, 503, -4038, -219, 3734, 43, -3124, 892, 3919, 9, -3391, -259, 2881, 515, -1748, 221, 1703, -491, -1841, 111, 1528, 144, -808, -175, -405, -1166, -261, 1147, 322, -1244, -726, 459, -402, -1634, -201, 1836, 682, -2113, -1904, 1040, 1791, -682, -1671, 856, 1900, -1165, -3033, 462, 3903, 1124, -3144, -1429, 2691, 1254, -2556, -534, 3862, 1758, -3586]
2057c586J211N302m42m235P56L589j975l816K477M328k232l886K018K679l113
2072i25j996M682K361n540k890N306K184n571j029O946N87q438j196Q860J484
2087D825q577p39Q879l27r902K53J1000M14j0552n37R625l28r453J453J0190j408
2103D816j0069R99Q754j629p261L506O893m835p289N132O811n401n263O650M215
2118F029q645m559R914N286r996n111R793L939j0827l236J1987L896j2131m493
2132h154J0830L796j0059k307J0470J482j0944j664J0067J472q621k1P925j846
2146B426q246K571Q609k594p513K997O263m561n863O204O431o332o421O077N300
2161E348o595m166P899M341q585m865Q150M704p557l598P644K883q222l085Q005
$$ y = [-3586, -2375, 2927, 2485, -1750, -994, 2595, 620, -3196, -719, 3609, 1377, -2509, -491, 2188, -925, -2921, 1761, 4122, -1418, -4308, 998, 3182, -2389, -3418, 3528, 4115, -4323, -5519, 3341, 4825, -3752, -4491, 4388, 4061, -5841, -5588, 5412, 5826, -4726, -5263, 4362, 4034, -5419, -3966, 6224, 4816, -5253, -4254, 4500, 2871, -4390, -884, 6009, 1174, -6115, -983, 5828, 427, -4836, 1814, 6029, -2616, -7175, 2739, 8025, -1971, -7082, 2711, 6650, -4177, -7413, 4574, 8470, -3661, -8154, 2676, 6472, -3587, -5894, 4576, 6058, -4886, -6550, 3517, 4989, -3632, -3653, 4272, 2426, -5820, -3249, 5360, 2766, -4747, -1750, 4513, -48, -5911, 293, 6724, 392, -6029, 48, 5348, -1247, -5413, 2486, 6827, -1758, -6623, 1527, 6231, -1326, -4924, 2720, 5603, -2619, -5704, 2301]
2176B301L431o857l054N790J702n582q99N554P47m924n75L769o77l067K073L054
2192B786k657l474K910K982l021k531L791K547m515l027M458L407l751l047L259
2207A17K605l360k547L395K936k729k767J735K205j301j522J308J503j134j405
2222i61M14J285J67o76m04K09L22k4m75N2P81J29j087m68P92Q33o68o86L37M48
2242C20j66m34k75K25O90J71j118p59J392J379j603k022J679K625j685l263J726
2259a118L923j569m257J308M401q75m486O98M492n54m097L38L800l14l277M62
2275a125K665p61j935J279J419j761j177K368Q11k832l53L470q6m104O0M749j17
2292B570n059J43M973j58n294M21N478n55n695M26N433l69n135O01M849j073m722
$$ y = [2301, 5732, -1125, -4179, 1611, 3313, -2269, -3168, 2386, 3133, -1791, -2366, 1403, 726, -2341, -268, 2786, 129, -3345, -435, 2547, -474, -3005, 786, 3333, -1182, -4209, 249, 3656, -95, -3142, 117, 2722, -638, -3185, 210, 3146, 417, -2350, -615, 1590, 289, -1233, 75, 1578, 444, -961, -547, 738, 905, 229, -175, 34, 356, 332, -143, -91, 690, 819, -268, -736, 56, 889, 221, -465, -128, 320, 154, -280, -555, -330, 360, 531, -587, -1346, 46, 1425, -178, -2200, -521, 2104, 419, -2844, -1118, 2805, 1236, -3021, -1713, 2688, 1813, -2673, -1975, 2517, 1963, -2134, -1796, 2004, 1690, -1587, -1125, 1540, 779, -1156, 123, 1542, -219, -1396, 972, 1783, -1049, -1402, 2068, 1982, -2122, -2062, 2687, 2570, -2489, -2346, 2627, 2469, -2825, -2404, 3074, 2519, -3176, -2750, 2683, 2314, -2821, -2220, 2629, 1556, -3166]
2309c166J184M527j210l978J331L446j817k811K274K501k518k193K836J663l150
2324a081q96L738M90m142m46M599L29m819k9N128p3n412l2N493R4n297q0M853
2342B417J50m782J13M399j49m056K23L407n60k727J018K359j515k195J672J970
2358A744k050j481K374J088k825j070L095J110l259q62L164P24l412n31L691M66
2374A966l648o37L604O09l346m26L448L97l374n64L253O89k791n64K376N85k252
2391f75k84J906K91j519j73J065k80o67O20O16j152n96J365N39j716n01J894R44
2409A677k417j252K384J604k339j875K212K032k118k236J851K477j444k721J198
2424i67K416p74k181O21J956m60j858M14J524k42j155M49P99o84o03J045M84j093
$$ y = [-3166, -1982, 2545, 1335, -2643, -1312, 2134, 317, -2494, -220, 2281, -237, -2430, 406, 2069, -1081, -1977, 1761, 2251, -1891, -2337, 2262, 2591, -2228, -2257, 2871, 2798, -2614, -2646, 2847, 2941, -2356, -2436, 2417, 2567, -2215, -2102, 2297, 2148, -1908, -1685, 1722, 1162, -1565, -547, 1812, 297, -1898, -226, 1744, -306, -1787, 587, 1675, -1150, -2220, 875, 1985, -1274, -2136, 1028, 1752, -1660, -2191, 1500, 1966, -1682, -2319, 1285, 1894, -1452, -1878, 1570, 1967, -1407, -1971, 1282, 1971, -820, -1384, 992, 1577, -675, -959, 947, 1238, -281, -454, 611, 331, -336, 284, 900, -252, -848, 517, 1056, -660, -1161, 733, 1677, -740, -1992, 392, 1996, -343, -2218, -6, 2026, -92, -2328, -477, 2000, 556, -2165, -967, 1449, 675, -1506, -885, 1071, 611, -1247, -833, 691, 449, -706, -257, 542, -142, -745, 300, 784, -309]
2442c09l98J479K07j731o9K084J36k361j83K517K72k698l11K913L54l167m57L091
2460A369P00l262p10L232P04l303q56L236P65l067p24K803O30k604n10K398L15
2477A116k228j89K172k72j827N97J823j022j847J460J882j763j921K083K242k438
2493a32k293K477K596k645k617K587K886k534k812K404K798k368k697K274K545
2508B469k109k311K096K000k040j959K099J691k113j533K270J113k293j009K273
2523F44Q47k410o97K479M43k482l29K512J05k627L8K760k33k790L27K980l74l258
2541b065N27L345n02l349M28L570k67l605K47L519j17l412J12L234R4l000r8K837
2559A498j37k528L35K272m52k036P26J857j070j847J438J837j994j765K108J935
$$ y = [-309, -707, 772, 979, -752, -821, 1263, 1399, -962, -1145, 1372, 1644, -1054, -1365, 1548, 1902, -1265, -1722, 1369, 2069, -1193, -1903, 1329, 2033, -1270, -2126, 1110, 1875, -1192, -1916, 887, 1517, -1087, -1597, 801, 1116, -1112, -1301, 871, 599, -1228, -631, 1192, 170, -1677, -217, 1665, -98, -2019, 64, 2306, -132, -2425, 52, 2648, 3, -2614, -27, 2859, 325, -2487, -83, 2715, 347, -2350, -76, 2469, 360, -1951, 145, 2145, 105, -1854, 245, 1936, -177, -1710, 560, 1673, -620, -1629, 644, 1491, -919, -1616, 863, 1306, -1176, -1505, 1007, 1112, -1515, -1477, 1283, 1050, -1740, -1413, 1567, 1193, -2065, -1538, 1807, 1305, -2044, -1616, 1954, 1687, -1918, -1671, 1848, 1731, -1681, -1569, 1665, 1759, -1241, -1339, 1498, 1361, -1167, -832, 1440, 988, -1048, -322, 1535, 465, -1382, 56, 1893, -101, -1866, 242, 2177]
2575B177k285k115K497K146k645k426K675K523k639k617K558K518k557k535K538
2590a87K500k487k369K405K238k480j924K506J710k576j378K542J271k502j026
2605a757K638P48k684n40K936L26k809j30K981k20l006L77L242n58l282N62L350
2622B174p22l419Q58L565r85l727R03L650q32l476Q45L176r16l230R62L046q59
2639A013k773Q61K189j095j866J385J737j590j578J628J341j825j070K203R90
2654A550k476j176K642J303k627j038K525J107k641j130K673J357k444j237K109
2669D97J188k018r16J882R86j866q82J621P17j274m98J242K43j445j88J219L36
2686H44j034k45Q34j41r83J62J196j06j158L4Q94j17r63L69J129l60j458J52J543
$$ y = [2177, -108, -2223, 274, 2420, -225, -2651, 24, 2547, -92, -2709, -151, 2367, -190, -2725, -187, 2313, -174, -2543, -138, 2100, -380, -2304, 202, 1912, -664, -2042, 500, 1771, -731, -1757, 881, 1629, -1055, -1595, 1341, 1667, -1142, -1272, 1709, 1489, -1517, -1140, 2102, 1544, -1738, -1176, 2174, 1452, -1967, -1109, 2456, 1471, -2256, -1353, 2297, 1465, -2011, -1166, 2010, 1094, -2136, -1174, 1872, 1013, -1760, -899, 1290, 195, -1671, -286, 1451, -139, -1717, -89, 1252, -573, -1643, 560, 1550, -926, -2102, 540, 1843, -784, -1822, 703, 1810, -831, -1961, 712, 2069, -375, -1612, 497, 1685, -333, -1249, 633, 1619, -247, -1129, 492, 1209, -65, -563, 679, 922, -523, -711, 508, 844, -190, -435, 399, 258, -725, -563, 633, 527, -631, -597, 297, 180, -783, -414, 715, 355, -1103, -951, 592]
2705E92L9j372n7J302j4j447k12J774O61j692q40J399Q78j238p87J397Q12j356
2723a61j027J164J132p31q62O85M82q40l31R92M01r76j93Q49j72j180N02J494
2741A228m02j776K59J709m77j661N95K019p21k451M95K301k20k128M07J934p79
2758C32k060P20K374m39k189K28J817n82j495R85J678r29j855P24J481m62r29
2775f01Q39O71j238p22J282Q46j036n21J187q2j571J58K155L5k135k02J961ok170
2794a150K65K411L1k591l63K176M72j865l44J767K39j846m59J544M15q08k77M81
2812I8l36l80M29N64n34k09N30j11j035J37J617J29j614m34J462M50j357k01J545
2831G50L26j756o22J683R42j194q10Q83O05r80m90J004P12p61p89L09N61j50k34
$$ y = [592, 631, -741, -798, 504, 490, -957, -1169, 605, 1266, -426, -1266, 133, 1011, -227, -1014, 383, 1195, -161, -1188, -24, 1108, 377, -485, 200, 682, -158, -489, 503, 904, -72, -265, 584, 412, -768, -266, 1228, 826, -950, -691, 1018, 541, -1120, -525, 1494, 773, -1678, -1183, 1118, 898, -1230, -823, 1111, 332, -1728, -1008, 1366, 927, -1262, -1034, 783, 201, -1294, -309, 1369, 440, -1415, -691, 790, 328, -601, 238, 909, -329, -1051, 231, 1077, 41, -480, 707, 625, -946, -788, 1367, 1402, -733, -935, 1026, 1020, -1150, -885, 1526, 1557, -1034, -1397, 779, 1251, -614, -958, 809, 1048, -798, -1257, 287, 702, -106, -383, 98, -238, -618, -189, 375, -159, -368, 162, 51, -984, -847, 770, 899, -715, -1149, 313, 763, -594, -795, 750, 1076, -680, -1302, 381, 1323, 129, -681, 202, 807, -173, -663, 341, 1053, 292, -497, -188, 373, 223, -11]
2850a1J28Q7j67J1j22j3J62L08j84o63J1P83J73q54l34R48L52j023o65J072Q78
2871H77r19j145O57J304n14j249L33J324j51j383rJ372L15j226l86Q61M81o21
2889g9k43N37K75n20k14L54LjL11m9o13o1P82K06q22k25J006J3j292j85J618L79
2911A180j635o27J489N14j526m10J800K98j888p25J932P04j628n49J643J53j653
2928i28l29J813N16j544n60J272R3j153M17J205m38j167M70Q12p47m15J302O63
2946A282j858r09K005J009j999q82K310Q68k719j079K768J517k416j614K187J343
2962A813k260j093K225J183k036j255J551Q53j266l69J334o0j483J40J373l60
2978B90j186J006J038j569j365J774J595j678j591J806J452k175j646K500J937
$$ y = [-11, 117, 204, 37, 48, -74, -87, 75, 383, 199, -464, -453, 330, 503, -351, -685, 263, 615, -408, -1073, -1, 877, -42, -1187, -530, 774, 260, -989, -656, 668, 517, -866, -875, 497, 812, -414, -800, 61, 542, -79, -322, 215, 490, -30, -244, 110, 113, 112, 423, 374, -239, -300, 482, 688, -134, -359, 647, 660, -632, -817, 801, 1180, -455, -1082, 407, 921, -605, -1015, 785, 1083, -805, -1530, 402, 1106, -522, -1071, 572, 725, -928, -1257, 556, 1072, -472, -1032, 240, 333, -820, -403, 802, 364, -803, -333, 479, -268, -683, 619, 1282, -576, -1485, 520, 1529, -470, -1352, 958, 1826, -893, -1972, 796, 2313, -103, -1717, 470, 1813, -447, -1540, 685, 1868, -168, -1423, 128, 981, -285, -654, 680, 620, -863, -723, 650, 290, -896, 110, 1148, -421, -1786, -12, 1583, -95, -1686, 120, 1572, -603, -2249, 251, 2188]
2993B188k264k046K057J842j961j597K053J701j992j898J666J861j391j268J283
3008B34Q50j304p61J341O08r44l85Q65k84r44P51J199r13j390R21J436j266j520
3026a506J560J822j686k171J356K305j093k360J041K253j006k263P02K325l51
3041I28k138J82J638j24j298J87J245j29j121J16Q21k49k95M36K70o85j94P24
3059C14K36p75p4R26m3j225k9J456K11j348m20J337L98j420l94J619N60j791q11
3078a273J684Q87j504r70J421J086j466j347J411J384j110j440Q48J296p65j161
3094a019N70J200n21r81K16Q06k35l88L74R6n43J11P26k67q70N40J125p39j363
3113a162P06J818n42k014N28K067m63k213L39K456j70k381q8K271K56k233k99
$$ y = [2188, -76, -2122, -65, 1777, -184, -1781, 272, 1973, -19, -1917, -251, 1610, 219, -1049, 234, 1084, -220, -981, 360, 968, 24, -361, 504, 220, -724, 27, 1226, 313, -1077, -156, 1280, 14, -1506, 54, 1876, 190, -1981, -625, 1680, 587, -1773, -732, 1521, 515, -1748, -1046, 1279, 928, -1210, -1028, 610, 486, -812, -625, 620, 491, -630, -514, 307, 58, -237, 199, 469, -216, -410, 314, 550, -225, -299, 627, 584, -641, -670, 786, 997, -351, -771, 566, 964, -456, -850, 769, 1329, -462, -1273, 411, 1298, -206, -1176, 245, 1331, -135, -1482, -71, 1313, 203, -1237, -389, 907, 142, -1019, -449, 751, 230, -751, -535, 271, 36, -352, 22, 118, -425, -314, 412, 145, -725, -185, 940, 201, -1162, -456, 1362, 820, -1194, -666, 1401, 938, -1275, -936, 1520, 1350, -1031, -1119, 1152, 1408, -825, -1124]
3130a124K075L24k007l76J816L38j592k61J320R5j171N3J004k02q69L28P40o42
3148a51o51Q10O36r98n88J253N17j444n52J645P14j925p84K011R90k052j086K026
3166C71J204j849j360J789J587j634j654J481J570j212j485J036J332p52j025
3181f01N16Q16m76n25L47K76m45Q0M98l65o55M68R08p43j120P22J404p55j603
3200a253P73J557o15j810N84J776l98j808K67J803j64j738O3J685k2j526q3J518
3218F09J79j376j94J209K01j002j42Q04J76o34j55O02J3l49J60K17k73k11N80
3237D14J19p58j61J002J90j229k74J314N09j506o97J493Q53j491j162J460J309
3254A385j378j354J043J528j036j519Q32J434o79j222M73J013l18q44K63O40l19
$$ y = [-1124, 951, 1275, -732, -1108, 708, 1046, -546, -807, 513, 608, -563, -510, 494, 292, -577, -249, 491, -151, -802, 8, 644, -354, -942, 311, 828, -616, -1168, 477, 1191, -734, -1518, 493, 1483, -569, -1655, 371, 1575, -274, -1634, 155, 1742, 108, -1546, -65, 1505, 293, -1192, -156, 1176, 424, -601, -85, 731, 255, -270, 77, 353, -92, -12, 486, 121, -534, -66, 842, 99, -1021, -299, 1105, 350, -1253, -480, 1077, 462, -1348, -764, 1012, 614, -1194, -927, 876, 712, -1026, -963, 722, 700, -826, -909, 609, 788, -588, -782, 427, 628, -374, -516, 288, 464, -170, -325, 277, 290, -59, 101, 318, 45, -166, 414, 533, -225, -386, 616, 806, -423, -697, 617, 1126, -380, -1077, 416, 1269, -222, -1384, 76, 1385, 7, -1347, -304, 1224, 188, -1331, -499, 935, 256, -966, -493, 520, 202, -642, -379, 261, -58]
3271e8l52L79J61m79J05O10j75p39K91R32l20j097M44J248m85j418N63J481m36
3290F55j527M68J550m05j690L33J771l82j629L00J590k46j603J91J454r4j322
3307e86P0J090j29r55J01P60k32n11K02L13l45j19O30j60p86J30J028j06j285
3326h90K65J387j31j662J37J714N7j664j80J578L40j493m14J527M21j283n33J149
3344C25L83o51l59N91J68m73j14M05n3k09K55K3o23M6P79m1p60o3R13k06r36Q8
3366e12J195p6j241j95J232J47j096k19J242K28j298m13J113N24q79m11O73L34
3384C48o82j76M59L23j52j83j42j35K65N31k43n23J88O24l02q28M59J173k07j341
3404e44j93J266L73j099k91J159K10j244m36J078N73o66n93L67L36m12k14M65
$$ y = [-58, -410, -31, 130, -349, -244, 366, 191, -548, -257, 675, 355, -742, -298, 950, 465, -953, -390, 1091, 655, -872, -404, 1146, 741, -949, -616, 1155, 773, -856, -556, 1034, 788, -815, -624, 830, 736, -586, -516, 574, 445, -510, -409, 351, 119, -392, -190, 123, -222, -341, 289, 129, -657, -527, 501, 395, -890, -625, 762, 631, -1031, -894, 820, 877, -787, -967, 611, 951, -542, -956, 571, 992, -291, -824, 325, 708, 57, -302, 289, 457, -16, -130, 275, 222, 13, 268, 291, -332, -286, 493, 452, -308, -371, 542, 336, -600, -512, 683, 607, -634, -829, 403, 550, -546, -765, 477, 705, -593, -1006, 107, 631, -248, -659, 14, 348, -334, -510, -51, 272, 120, -63, -205, -340, -75, 456, 213, -310, -122, 502, 200, -628, -169, 1004, 797, -544, -737, 529, 902, -197, -488, 671, 881, -363, -799, 279, 852, 186, -407, -40, 296, -116, -330, 135]
3422A35J90k86k32nl8O2M03L5m15l04K84K34l55j6O00J06p55l83N46N73m12k65
3444b98M42J40o17l45O66Q18o18o44L75M06l36m06N72O93m82r15L0R46K11o31
3464GrL95j57n69m0P99K77n17m05PJ36O2K31J86l56k92J83m3k32J50O80m7r11
3487d65l43Q77M16p13m40Q88M32j131o22J105R22r14q54P69O18p92n22Q97Q62
3506I90q99q61N52P25m53l68Q31J58q87m61P88M78m81j44M99l50p72L84J052j42
3526F39r82J91O39n00q19Q13J248q06j490N18J407n37j210P26J203p38j616N27
3544g87J556j99j284K08R52m53q20M95R52m10o16K42L31o12pR81J23j060k06R21
3564C07J22r29O2J400q7j555k40J393M93j224j93J082rj240j48J359L36j022m00
$$ y = [135, 325, 39, -193, -198, -236, -174, 229, 264, -151, -455, -171, 63, -292, -308, 292, 398, -357, -740, -194, 379, -33, -298, 144, 284, -333, -678, -12, 806, 188, -456, -81, 325, -11, -417, 155, 848, 366, -549, -519, 427, 638, 7, -2, 393, 236, -333, -373, 426, 703, 186, -219, -212, -76, -14, 217, 403, 47, -245, -62, -105, -337, -187, 493, 446, -465, -808, 69, 485, -228, -668, 220, 652, -479, -1101, 4, 926, 12, -842, -73, 545, -247, -769, 128, 990, 91, -770, -218, 507, 54, -314, 517, 675, -212, -673, 115, 593, 112, -32, 467, 117, -655, -271, 781, 639, -343, -152, 487, -13, -832, -19, 1229, 423, -1067, -549, 858, 321, -889, -163, 1040, 302, -1314, -787, 769, 570, -714, -506, 446, -7, -827, -332, 620, 210, -406, -164, 167, -445, -452, 529, 652, -408, -614, 307, 429, -500, -438, 962, 875, -680, -920, 473, 966, -258, -451, 631, 622, -618, -766, 593, 929, -93, -493]
3583d93O78P3p09J66R59j12j069P1O27j43l45L88N12n39q25L90P29l08m16L78
3603A2L71o68m88P09N58m87m56N43J75o68k71Q84N75p76n44M99M70n74l10P51
3623C05N18q06n72M33N57k10k98K49J90m26k59M33K16l8j98R0k38k73K73M12j7
3644C41m34m0K39j81l67L06N64j08o80j30N65K3l97J15M91q7o80j37O51K49l54
3665e1j75K93R9m80j38N76M10m38l81K64P3j42mL39K34l77l77J82J84P4MJ77j09
3688B37l68K8J78R8j26K23J06m72n04M58P01k19o72J84M53l44o15L55Q93j13r41
3709d60k22P11K18n68QO14j6p56j43M93M43k31j95J35j19k55J20L63j1k10J39
3730E8M3l92r8O81M43o57m41L29M04m84k31P35L62p26o76N13P23l26n22M38L36
$$ y = [-493, 185, 258, -451, -285, 674, 562, -507, -436, 191, 48, -297, 91, 603, 64, -761, -371, 358, 50, -366, 12, 383, -285, -773, -64, 494, 7, -449, 94, 269, -399, -670, 214, 789, 13, -531, -32, 438, -136, -446, 305, 823, 17, -555, -122, 435, 225, -73, 176, 366, -60, -319, 114, 330, 292, 94, 184, -54, -327, -54, 358, 341, -93, -133, 106, -75, -442, -136, 428, 320, -360, -490, 75, 98, -299, -184, 307, 220, -460, -597, 54, 303, -51, -226, 67, 166, -314, -452, 124, 534, 96, -285, -21, 52, -90, -94, 245, 479, 102, -275, -93, 91, 165, 169, 346, 237, -131, -103, 75, 173, 47, 270, 376, -96, -600, -142, 559, 340, -332, -148, 305, -39, -654, -299, 594, 481, -460, -682, 29, 247, -321, -313, 301, 285, -471, -614, -121, 322, 91, -104, 31, -88, -343, -223, 140, 129, -81, 58, 101, -291, -389, 292, 735, 78, -363, -34, 370, -114, -345, 390, 752, 26, -650, -137, 586, 260, -262, 176, 512]
3751E12n88n37N66O14k79m99P1L33l28k74M23M39l24m93R9K06n7L2K27k3l78j49
3773d07L09P8k13K46K93l33n76K30P97j8o97N6O06j76p02J17R52N0q68j54O68
3794B58J87n48j26O17J22n76k02L44L15k18k15J43o7r2R5J2m6M4Q3p7l11K4M63
3817B29M1m24j55M04L4m43p2N70R1n10k97M57L13l77k29K93K76m02j48K14L89
3838B54j59k82Q7K57j30j51R5J39P5j09j69nK96M3j91j66K57J90k19k94J97L84
3860C99j29n63J02M60P0m96m2L47J34l40k46J78K71m7l47OJ95J43j06k46M9K86
3882G8L8m46k3L71K08l70k66L02L71k11m78L17M58k49m83K05M62r2m72J8M98n
3904B31k91q1L24Q6k51j12K23J21j13q7k6J8J64l8k65N8K72O3m15j61L95K61m79
$$ y = [512, -76, -613, -47, 567, 288, -211, -140, 193, -135, -409, 14, 453, 129, -364, -265, -59, -116, -84, 143, 120, -258, -407, -98, -20, -233, 13, 306, -27, -603, -373, 424, 406, -291, -235, 371, 195, -507, -390, 562, 612, -256, -410, 258, 445, -103, -229, 388, 510, -66, -268, 76, 391, 173, -42, 101, 34, -58, 37, 49, 3, 47, 130, 53, -258, -234, 229, 270, -154, -309, 95, 129, -314, -386, 184, 275, -235, -532, -75, 238, -139, -368, -75, 201, -201, -349, -135, 254, 95, -187, -100, 157, 27, -124, -29, 110, 185, 76, -93, -98, 198, 241, 50, -116, 141, 331, 112, -182, 15, 399, 270, -293, -191, 269, 339, -157, -199, 148, 282, -58, -304, -126, 145, 98, -249, -243, -48, 95, -11, -257, -208, 78, 116, -330, -353, 18, 226, -144, -410, -108, 263, 52, -426, -109, 349, 100, -383, -178, 284, 192, -280, -262, 236, 231, -60, -141, 183, 269, 18, -94, 129, 250, 137, 50, 24, 42, 206, 168, -97, -39, 233, 296, -119, -280, 115, 376, -103]
3927a03l72M39M18l41o06L33O37k31p26J08O52Q5o49j33N52K77n16k82L26L82
3947B50j28m37K8L06K09k29l22J91M44q4m32NM51J14l59l37M14M26k83m24J50
3968d7M90o6m58j30M46J13k94k96K96L79k26n13J48M04qm45j21M31K35m57k69
3989c88M71J82l21l26J72L84j97l49J72L10qm05QK81J14k09j12J82K01q1j33m7
4011i9J78J42j23k41l0M62K4m79j53N47L60n65m40N78M93n26n18M47N18l19o28
4032c72J89O49j75o04P6N87k5o34L2M48Ll53n0K56L5j82K9L4q2OO6k7j21J68J79
4057A32j58l44K48L65j57n39J91O64k46o93K20P92r1q10M9Q00M4p72j40Q48K72
4078F75q43l34P10M36n73m83M48M16k18m77M9M69l7k80j24J20K10m9j61j46M3
$$ y = [-103, -475, -36, 382, 41, -565, -232, 405, 174, -552, -444, 208, 293, -356, -489, 63, 340, -176, -458, -132, 250, 122, -315, -287, 19, 228, -1, -323, -132, 312, 228, -204, -199, 252, 366, 7, -330, 84, 510, 227, -197, -47, 443, 377, -81, -211, 235, 348, 54, -242, 54, 433, 207, -306, -158, 246, 238, -207, -328, 103, 338, -119, -388, 83, 265, -56, -382, -210, 174, -23, -372, -200, 110, 102, -303, -295, -14, 100, -109, -221, -39, 162, 81, -52, -99, 79, 221, 98, -143, -173, 289, 313, -166, -319, 228, 588, 23, -417, 161, 654, 128, -390, 57, 575, 256, -372, -183, 466, 291, -313, -237, 350, 325, -309, -277, 171, 174, -179, -229, 27, 62, -120, -91, -57, -139, -133, -67, -94, -215, -47, 132, -26, -370, -122, 243, 86, -453, -262, 402, 156, -537, -317, 475, 384, -426, -377, 423, 467, -305, -445, 403, 675, -168, -502, 208, 644, 71, -412, 36, 452, 234, -243, -194, 275, 238, -42, -166, -46, 164, 115, -46, -192, -149]
4099a49L91q7n08K3M87J47n72l12O25M30n44n50L52P25l37p70K68Q21j27q06k2
4120e15P69K28p76j28O62K75o39l02N96K93m15l62M08K85k85k36K57J46k15m4
4140BJ77r9j72J73J62k66k60M59J84m83l10O14L35p68k67O52N20q24o34Q82O07
4161F84q30o97Q31P79p20r13O01Q50m36q34M63P04l99o67M11N68k66m27K61K13
4181A76k76j11M91p7n02K31M58l04m74M85N56m58p48M27Q79m57q42M41Q70m76
4201B89r58M52R05l44r32L42Q15k21q77J71R08k17p53Q3O36j72m80J26M08j17
4221F4k89J16P5m3K0K70k80l37K61M06j54n94L98O15m66o81M14R22k54r91J21
4242d07Q77n4p24p2Q64J14q42k26O37L24m00l62K28L35j67k32J7K27O7q0k81n6
$$ y = [-149, 242, 155, -353, -330, 157, 304, -268, -580, 45, 475, -69, -619, -267, 458, 121, -649, -381, 440, 313, -493, -515, 254, 482, -294, -422, 240, 515, -124, -426, 170, 463, 48, -314, 94, 379, 94, -142, 115, 261, 46, 2, 179, 80, -92, 81, 243, -23, -283, 176, 360, -123, -433, 181, 516, -252, -519, 133, 653, -171, -805, 77, 684, -146, -843, -12, 767, 47, -866, -265, 585, 149, -685, -222, 482, 83, -584, -173, 395, 129, -298, -37, 176, -100, -211, 280, 203, -299, -68, 390, 86, -388, 97, 653, 195, -553, -126, 753, 296, -546, -105, 765, 289, -669, -217, 688, 344, -588, -246, 569, 348, -529, -358, 550, 333, -420, -337, 299, 127, -353, -227, 181, 64, -225, -109, -34, -77, -57, 213, -67, -404, -143, 263, 109, -485, -87, 528, 62, -619, -205, 717, 463, -528, -407, 470, 416, -308, -380, 484, 598, -244, -470, 167, 491, 91, -271, -43, 292, 125, -107, -90, 137, 204, 124, -157, -213]
4264b13L24K34m12k56K98L49l58m01K27N56k00n15Q6M02O0n21O1M67L2m28k12
4285d20L80K85j74k43Q6K54j25k60R9L29R7l60k15K13L88j37l80J38K49M5m24
4306a75n8M74K13m49l75L75L45j98m26J64L60o2m02m7L89J88l59k32J46L34j15
4327I0k67j28L12J29k24l76K20M52j41l66j2M46J03n39j7M78J68m37k78L55L70
4348C38l03k50K28K61j78l54J97K97K2l16l8K37L0j30p4J34rl3p8l7J83J24j10
4371A41l21J44K15k6k94l5L69M8m72k04M88L08l89l34K15N07l24m82J81N52j15
4392A72m83l3M47J27l68k13L32K27j89k84J63K26jj78o7J10J67l5j97m2K60J21
4414B62k14k34K19K18r8k34M1K97q0l19J2L86N0m29j16L53J17k88k02K74K71l27
$$ y = [-213, 111, 345, -67, -323, -25, 324, -34, -435, -208, 348, 148, -367, -281, 121, 181, -340, -279, 188, 220, -208, -420, -40, 245, 71, -172, -86, 168, 43, -217, -118, 211, 308, -52, -267, -54, 334, 197, -183, -45, 204, 249, -175, -233, 241, 454, 5, -370, 5, 350, 152, -274, -110, 250, 188, -214, -261, 128, 316, -43, -275, -129, 205, 90, -177, -305, 7, 136, -88, -464, -244, 208, 67, -299, -311, 135, 238, -301, -318, 160, 328, -109, -387, -32, 338, 35, -215, 13, 274, 96, -258, -61, 236, 258, -58, -96, 141, 171, 41, -33, 101, 92, 59, -19, -56, 127, 251, 141, -180, -36, 179, 153, -141, -176, 193, 241, -231, -435, 53, 361, -28, -362, -147, 360, 36, -446, -265, 287, 172, -311, -344, 103, 230, -138, -351, -19, 208, 19, -265, -102, 124, 123, -55, -122, -12, 155, 120, -77, -119, 141, 262, 48, -186, 33, 251, 153, -81, -40, 257, 177, -142, -130, 256, 306, -123, -239, 114, 231, -57, -259, 15, 286, -41]
4436d1k68K04K50q1l35K6L16Rl06o2L01J59l03k29K23K75j26k39P1K87Kk00j46
4459b13J75K56j61j83oL28j0j37k44K26K49n4l25o0M60j4l52j18L09K43l16k99
4481b46K79L75j88n16J37L71j1m49M0L99Jl80j08L07J12k48q8K03L8j36n5J15
4503d8R8j56N0M9p9j9J42O7k73ML07N6m44L6M74l6l58q9N03K3m23j53N16J66n11
4528i8k36N90J67m25l03M63K97m35k74L41K09k57k76J92J73j20j43J51J24j32
4548Hn3Q9q8j62J80K15k40k89K33L32k95l35K44L93k27l36J49M47k00n06L22M54
4570C35k59m19K73L43j29l70R2L83m8l87J64K92p7l63J53K48q8k31K42O8j51q3
4592a2J09N7j52n0J29K6k28N8K51j26k86Q8M33j69m10l2M89%m13r1M81J44n07
$$ y = [-41, -309, -105, 145, 64, -271, -245, 71, 80, -226, -288, 13, 172, -131, -360, -137, 138, 12, -227, -156, 131, 133, -67, -213, -38, 218, 57, -126, -132, 196, 186, 49, -195, 31, 280, 226, -99, -159, 301, 287, -65, -183, 126, 369, 53, -246, 33, 408, 220, -296, -159, 212, 201, -248, -208, 191, 192, -188, -296, 11, 123, -125, -213, -10, 28, -108, -163, -48, 50, -106, -56, -7, -86, -105, 37, 104, -169, -165, 142, 198, -246, -210, 264, 228, -130, -219, 284, 307, -116, -269, 247, 413, -98, -334, 256, 423, -2, -305, 158, 455, 20, -254, 87, 296, 39, -237, -45, 128, 8, -135, 16, 140, 8, -45, 44, -44, -206, -26, 189, -51, -340, -107, 225, -70, -405, -161, 232, 5, -331, -182, 265, 65, -441, -119, 335, 76, -343, -70, 273, 144, -226, -134, 249, 201, -186, -22, 270, 193, -170, -17, 231, 143, -88, 154, 222, 71, -12, 97, 154, 2, -48, 81, 107, -121, -63, 188, 62, -224, -136, 297, 128, -282, -314, 175, 175, -238, -329, 152, 296, -211]
4615b11j65L67L18m17k01K22K90k20k29J35K82j08j89L0J73N7j78qO9qR5L2l3
4638A03j36J30J48k13r3J28K20j32l22K28K53j23l74J12M13j46l49jL40L5l75
4659a54q0L43Q9l15j28K79J46l12j15K93L6j56j55J67R8j38k1J00J7j08lJ69r8
4682d6r5J45J60k28j45K22K87l34j71K70K66k89k83K91K80k26k59J84L70k82l16
4703a99K51K32j28k76J34K08j33j97J23J47j51r0J23L0j52k8J77j7k21L7K49q8
4725C1k25N9J99k6k97J25K04n1k52R6J76nk07J07K01o3k38R9J45N7k13jJ56J6
4749I3j60l5K08J09j80m4PJ80n5r0j3O6R5j03p4kJ40K2j90n9J83Lj23o9N0O5o3
4776c9k2o0Q9M5q1n7qJ06J37j75j47R8K84k29k48J74L53j09l65Q3L58j6m24O4
$$ y = [-211, -376, -9, 309, -108, -309, -87, 203, -17, -246, -111, 171, 63, -126, -96, 77, 134, -44, -52, 17, 9, 104, 136, 103, -33, 97, 245, 32, -61, 67, 287, 155, -167, 61, 314, 191, -183, -71, 342, 196, -153, -154, 186, 221, -154, -234, 109, 198, -117, -245, 34, 180, -132, -247, 46, 82, -74, -229, -62, 36, -102, -123, -23, -6, -114, -117, 52, -46, -141, 4, 164, -64, -209, 13, 300, -34, -205, 65, 331, 42, -241, 50, 330, 104, -155, 29, 399, 117, -199, 52, 284, 156, -120, 14, 222, 89, -108, 15, 162, 11, -79, 44, 74, -78, -106, 71, 54, -167, -130, 119, 31, -194, -135, 64, 38, -259, -134, 70, 19, -233, -137, 39, 34, -173, -66, 135, 72, -166, -67, 78, 135, -78, -79, 77, 93, -67, -102, 106, 215, 35, -9, -2, 178, 123, 33, 20, 86, 181, 78, 4, 2, 142, 164, -26, -85, 98, 101, -22, -91, -41, 24, -39, -61, -121, -32, 13, -68, -125, -133, -27, 110, -65, -212, -114, 170, -59, -307, -133, 220, 111, -254, -171, 187, 171, -253, -189]
4800a89L74L1m04O1L34k7k20oJ89Jk63J2L03j15j08J14R7j42p4J68mk20m7L34
4824A99m9l30Q3L67j3n05n3N04Q4m90n0M24j3m16j17N41Q2l91j83L82J04l62k5
4847b27K97J40l04j11J66P8o7K0R6j06n2J19K6o9r5K83n4k40j45L79K02k83k62
4870b09L45J41l52j25L36J57k57l35K70K80k23j49J20K09j27k61mK61N6j12r3
4891g2Q6k3j30L7P3J10j07j04k7P2P7O4n5k4l0m3J7j3J17J19o1k25j1J64J44j70
4917a5l1K41q3k59m6L02K73k14l23R8K84k34j40J20L36n8m42j8L81J3k48K4J31
4940I2J0j90j46J57J87o8mj51p4J08J50o5o5P0N2j53l16L35L19o3m11J2L32L5
4964A53l59Q8M55j84m03m3M18J02k59J5J58k0k65q3L73J30j63k12J52Rp3RN9O3
$$ y = [-189, 185, 216, -188, -127, 207, 180, -40, -46, 143, 144, -119, -107, 196, 81, -27, 87, 184, 42, -32, 136, 132, -88, -135, 199, 150, -180, -97, 270, 257, -248, -301, 203, 287, -203, -253, 171, 158, -258, -375, 166, 248, -143, -326, 56, 160, -202, -227, 70, 210, -94, -205, -39, 39, -28, -8, 88, -18, -70, 49, 75, 6, -89, 194, 140, -100, -245, 134, 336, 53, -209, 136, 277, -75, -200, 136, 293, 36, -299, -29, 251, 28, -121, -1, 208, 81, -180, -184, 77, 133, 21, -72, 14, -9, -139, -102, -29, 81, -26, -130, -157, -85, -8, 56, 1, -23, -53, -96, -79, -92, 25, 144, 83, -142, -153, 11, 155, -15, -46, 195, 112, -147, -193, 109, 382, 168, -155, -57, 227, -7, -147, -27, 309, 251, -191, -209, 172, 185, -63, -39, 92, 102, -88, -234, -77, 110, 42, 38, -113, -187, -79, 71, 6, -59, 11, 63, -90, -406, -71, 248, 185, -226, -214, 118, 153, -206, -118, 337, 153, -250, -293, 125, 227, -32, -17, 141, 121, -144, -227, 146, 276, 113, -99, 53, 62, -11, -2, 57, 120]
4988A20m3j18Mq6Q4K41%k78m2K02m9l32K67L70j05n46p6M25J89k80j27K69L9l61
5012b33k08L89L72k09l36R9J71p5m3K3K39j1k47o5R1K13K5q7j32J1R9l5j12J33
5036G2J69j06k97j5J60K21j44p5O7Q0j53k12K00L28j28l12n3J82O9j40k6K25J16
5059B28l18k64J91L90n7k43p7J90J5k97Q8L32P4l51j70J50K63n3j40M7M7o4j53
5082a72R2J69J15qj20k53J65K08j31j98J77K15j44l54O6M75O4n15j01L96J32m35
5104a57j02M37J47l86l12K75K87j81k16K16Q6j96j39J78K09j54j28L8L1J4MQ7
5126C8p9L2L5Jj35J8K04M7k50j09K64N8j82j29L56J61l92j92L41K70k05l35K62
5149G9K49k72k37J07M02p0m46QL18Lj77p5J32J90k47j25Q7J53m0r7j49J45J09
$$ y = [120, 77, -41, -37, -123, -39, 202, 202, -76, -118, 84, 35, -297, -30, 340, 235, -311, -387, 38, 227, -53, -180, 89, 128, -233, -441, -52, 320, 111, -225, -126, 45, -30, -73, -50, 189, 178, -69, -134, -43, 170, 195, 108, -24, -13, 86, 51, -61, 72, 241, 135, -162, -177, -17, 204, 60, -15, 52, 132, -21, -233, -33, 295, 167, -145, -198, -16, 53, -87, -113, 112, 228, -90, -354, -163, 227, 170, -73, -150, 40, 55, -242, -154, 178, 252, -99, -269, -119, 144, 91, -49, -2, 45, -19, -172, -80, 89, 204, 196, 76, -177, -12, 196, 65, -133, 44, 259, 115, -239, -173, 302, 366, -149, -250, 146, 278, -157, -259, 178, 325, -61, -373, -98, 189, 8, -208, 8, 94, -102, -241, -63, 146, -8, -136, -98, -67, -53, -49, 38, -41, -9, 26, 27, -108, -90, 114, 161, -89, -198, 66, 124, -58, -187, 169, 330, -62, -254, 87, 357, 152, -183, 79, 328, 56, -181, -74, 328, 258, -188, -180, 138, 141, -36, -111, 21, 211, -36, -161, -74, 79, 39, -58, -207, -62, 47]
5172D7o1j06j12K40N4j70j43J61K47j59k38J01K48m1k48k6L72N1l12j77L56K24
5194C08k85k61K85J80j61k22O3L89m9l34j1K70L9k30j62K48J16j53j66K6K59k7
5216A22j39p9J26Q8j7k07lJ42Lj69o6J71J87j12l10J21K45k9k98k0L15J39l79
5239a69j13L21J88k95j94K24K50j55k51J49K07ok38k3J76Q7j11r6J28N3j15m3
5261b6RJ50j5o2m8L4Q7m4o9o8Q0Q9j83m3J07J39n8j92M9J85n7k57P2K74p9l21
5287b47NL22L7k42j69K81J67k36j98K31K48j81k32J84J85j08j63lJ54L6j18OJ01
5310F0N0Po2j79J38R9J0r3j47K25J05k35r3K34J07k49j61K09K68k66k54J78L39
5333B90j82l95J81L48j27l05J5K93n0k57K2J83N9j52q1P2J08q5l1rN7k5Q1j33
$$ y = [47, -14, -120, -232, 8, 62, -108, -251, -90, 157, -2, -240, -139, 109, 68, -180, -206, 166, 217, -95, -272, 84, 308, 23, -238, 47, 227, 66, -156, -93, 296, 247, -87, -98, 172, 211, -19, -181, 67, 183, 30, -136, -110, 149, 122, -17, -96, 30, 118, 101, -106, -109, 33, 36, -133, -199, -28, 159, 47, -263, -142, 103, 74, -224, -244, 71, 210, -169, -282, 39, 227, -68, -262, -38, 212, 57, -194, -45, 162, 156, -82, -105, 71, 158, 47, -49, 79, 132, 17, -26, -17, 133, 118, 56, 8, 42, 129, 85, 16, -52, 28, 117, -66, -109, -2, 137, 79, -113, -64, 121, 64, -193, -121, 153, 74, -247, -242, 80, 117, -125, -294, -13, 154, -82, -280, -49, 199, 18, -214, -30, 155, 47, -116, -119, 35, 71, -47, -41, 60, 110, 117, 55, -124, 14, 113, 123, 30, -117, 108, 213, -22, -115, 119, 226, -23, -184, 25, 293, 27, -227, -49, 290, 108, -287, -106, 242, 115, -190, -175, 118, 68, -189, -167, 16, 75, -77, -158, -86, 22, -63, -94, -103, -46, -71, 10, -123]
5357a23m5K16M1j77j14K17J53j13k30J24K35r0k80K7M80r6l10j2K91P1l19q8K56
5380A14J77k30j99J57J97n0l17M5J93K6q8j40R5J45o9j78J8J02O7j51j30R8K09
5403I1m6k10k8J33J34j42r1P3K08r7k19J08J93n3j61L5J44Q3k39p5K48J3l2j91
5427a21J23K29j44k71J98K44j15k70J22K12o6k10L0K10%j97j6N2O5r2m2Q4l4O5
5451E6q8n3pJ68q3p3j29J59J67j65k51J36K54q0k81Q0M04o9k97J3L41jl16j61
5475b76L95J16k91j49K40J62k33j19K45J26j73j31J96J4j64Q2Q2j01m5J03Oj16
5497c1j1J16Q1j80j22K12O4k30q2K39J30k56j50K87J35k25k65K46K93k97k23K34
5519c5K91k73j97J82K07j26k14M6K20k5j22K3N1Nl4l4L8j0O3j0j0j46J20J34j09
$$ y = [-123, -168, 48, 89, -88, -202, 15, 168, 55, -175, -51, 184, 94, -186, -159, 321, 225, -85, -97, 194, 265, -54, -142, 114, 291, 61, -138, 19, 216, 166, -151, -106, 87, 113, 25, -115, -20, 125, 56, -122, -104, -2, 65, -86, -216, -118, 91, 45, -165, -193, -60, 74, -68, -159, -86, 122, 25, -194, -86, 107, 54, -107, -72, 72, 155, -84, -159, 89, 102, 70, -121, 2, 231, 87, -184, 14, 258, 143, -127, -5, 207, 141, -69, -39, 171, 171, -26, -42, 10, 75, -17, -59, 25, -9, 56, -32, -85, -92, 76, -7, -80, -209, -50, 117, -48, -299, -163, 91, 11, -270, -190, 214, 145, -152, -139, 202, 201, -115, -276, 119, 235, -56, -205, 35, 197, -36, -155, 90, 216, 43, -88, 108, 122, -42, 40, 122, 21, -24, 79, 85, -31, -42, 74, 155, -25, -147, 65, 129, -101, -183, 56, 186, -70, -220, 67, 202, -23, -288, -42, 251, -46, -269, -35, 256, -17, -214, -32, 175, 49, -165, -119, 101, 76, -46, -23, 28, 33, -1, -35, 3, -7, 56, 46, 36, -110, 10, 144, 35]
5544C5j60J21K10j06k25R9L05k00j86n1L02P3l33jK95j08k22%J49J21j85m1J31
5567B3k3o6j37J10J53o4r3K7j2J05m7O0n1n1L7ll2L3J40J6k24J4J25K4j43n2K21
5594I0J38k66j30K60R7p4k24J47J41j43k08J72J93l7k19q9J39Q4j9m8J9Qk5q9
5618h3N3MO7l5j30m1J28O9j13L4M2Q6p3k39J54K40j06j21m0J83o6j06J40P7P3
5643A97k57r4J43J75p6m9M6K3j39r2J90O8J4j64n2P4LJ6L9O3p5r5j05R3R3P4l5
5670G8j42J6rK9j4P9P4r2m6j68J27J33j9j17kR8j16j08J89J96p5k57QR7M0r9J27
5697B7O9r7j28kJ53M1J3r1J6o2M6N8Q1L4q4r3m2j5L3J60Lj24m7O6p6OJ09R4ll23
5727a78j4K20R4j35l4L1K9q7j14J52J79q9j53o2P2R6l1J7L7kq2j01P1J76O7j24
$$ y = [35, -125, -4, 206, 100, -125, -26, 279, 79, -107, -158, 144, 217, -116, -117, 178, 70, -152, -152, -3, 118, -67, -108, 23, 0, -66, -203, -93, 60, -4, -97, -70, -82, 23, -24, 36, -15, -66, -29, -32, -64, -31, 109, 125, -99, -85, 40, 64, -79, -131, 90, 228, -38, -168, 92, 189, 115, -109, 38, 179, 36, -172, 0, 193, 156, -63, -152, -13, 71, 52, 4, 23, 31, 6, -83, -30, -26, 41, 6, -124, -165, -37, 32, -81, -47, -5, 81, 8, -231, -77, 163, 57, -64, -104, 79, 13, -93, 47, 124, 197, -60, -154, -11, 164, 88, 39, 85, 108, -31, -123, 67, 135, 149, -15, -67, 7, 10, 26, 65, 128, 53, -42, -147, -54, 39, 113, 78, -64, -48, -57, -28, -42, 37, 111, 19, -27, -195, -68, 65, 46, -71, -73, 25, -91, -199, -10, 186, 111, -146, -138, -41, -1, -100, 27, 96, -1, -129, -131, 22, 63, 76, -15, 1, -61, -15, 43, 124, 158, 74, -19, -61, -76, -43, 117, 120, -4, -51, 15, -61, -55, 54, 148, 145, -178, -192, 28, 122, -13, -47, -16, 13, -74, -188, -36, 143, 54, -99, -161, -89, 7, -24, -7, 30, 28, -54, -155, -84, 92, 159, 35]
5753C5j56K1J23J4k2N9J27j82o0p4K33O6j41m3o9O6M9j4L9M2k7r4j14O2K09m6
5779A03j42p3QP2j9o0K19L5k67j45J33K17m0p9L4pj39m5J67J57m6j24p0N5m7M5
5805e8R9L0n7m7n2L3K6J63L3j25j00NJ35J9n3M6Q2j60j59J17J62R6k57k1K11j74
5831fj30J50K07l2l21N4R7J08j72J6J32m8j62l9J92J6n6n2k0k5j7Q9J02j07j6
5856d0L5q7m5P3J08Q0j94r1K46nl9j07K01K2k18n2J89Q3j00j25M6J87j65j46K32
5881H8J15j39j51J8J86q1l9J3J10j00j09J8N6J15k4j35K0m9Q3M9q4N9j05R7r7
5906h6k4M2J25l9k21L0K10M2j81pK24J7k92RJ77R2j13j73J44J52j40k00L18J40
5930B46k12j34P9J48l3p8K1J9m8M4J4n0oM0P2j51p0J58P8j34j11Q4J29j17q6R2
$$ y = [35, -121, -100, 23, 37, 15, 74, 201, 19, -41, -115, 118, 184, 43, 0, -69, -3, 46, 32, 71, 113, 86, -8, -122, -60, 149, 103, -39, -112, -104, -32, -51, -111, 108, 143, -124, -269, -136, 81, 41, -38, -4, -11, -150, -195, -28, 129, 83, -41, -111, -56, -103, -58, 41, 71, 14, -33, -85, -52, -26, 137, 170, 45, -55, -50, 85, 104, 51, 97, 179, 19, -140, -23, 139, 235, -22, -43, 168, -6, -136, 14, 221, 189, -132, -78, 19, 127, -45, -29, 103, 55, -107, -146, 46, 62, 6, -46, -66, -91, -108, -19, 83, -24, -40, -5, -92, -137, -64, 44, 124, -70, -161, 85, 80, 41, -66, 135, 157, -61, -113, 76, 159, 59, -66, -20, 167, 2, -144, 88, 203, 64, -87, -69, 117, 36, -3, 10, 120, 20, -89, -71, -15, 100, 76, -59, -39, -88, -5, 44, -40, 19, -86, 11, -86, -110, -68, 57, 18, -203, -173, 37, 79, -102, -109, 115, 132, -160, -151, 26, 118, 5, -168, -24, 128, -12, -212, 106, 246, 34, -100, -21, 127, 94, 16, 37, 56, 8, 52, 66, 16, 10, 50, 122, -29, -99, 59, 137, 3, -108, -24, 105, -12, -98, -6]
5956fJ21n0k47J64J14%k85Q9J97q9j73Q0J61k6j40q1K78r5j49PK01mj40P6J8k5
5982dn7Q8Q5j59P6J30j6k00M3J36j6j96L8J93P3l02n7L20M0l39QK25J4k15rJ41
6008D0J04k35JJ22O1j94p9K58p8m7QOj1m8k0J19p1j1P3L2j00k9J69L7j75p2J67
6035B7M0j62o1J57J57j55j33J47K18k30j13J12J34K1k34O1J79r3q6k7J35Oj38
6058c8L0Q9Nl8j19J14l0N2k6j11LJ08m9p2L2K1K3p2l8J20M1m5j38j1K32o8j15
6085a00j9J46Q6j83l4J79L5j51q2P2J15J2j62m2K37m4j39M8J51L9j45j4N0L3j09
6110b1nL7N6J4n8o1M4K8k9l5M7qO0m9j14K7J83q2k34J13J48m5j43k3J86J1j50
6137a03m3J88Jj17r6K19M3j56j13J37J37r3n6O7j6M5r3l4J01N0M2j45NK9J54q8
$$ y = [-6, 115, 65, -182, -18, 96, 96, -189, -100, 97, 8, -165, -85, 76, 50, -90, -171, 107, 12, -137, -130, 71, 67, -73, 3, 21, -4, -61, 27, 112, -47, 29, 159, 143, -57, -14, 122, 106, -90, -52, 141, 214, -88, -145, 175, 215, -124, -116, 109, 123, -92, -101, 40, 144, -91, -90, 32, 93, -101, -180, 78, 0, -47, -39, -33, -44, -92, -112, 7, -64, -75, -2, 30, -70, -99, 70, 107, -68, -140, 27, 67, -95, -156, 1, 158, 3, -130, 17, 235, 5, -108, 4, 138, 159, -75, -14, 165, 72, -14, -41, 94, 100, -38, -8, 81, 86, 48, -71, 43, 13, 65, 39, -72, -69, 39, -10, -82, -50, -29, -6, -78, -116, 4, 45, 0, -138, -149, 83, 15, -100, -119, 27, 113, -70, -104, 75, 110, -41, -123, -51, 64, 76, -86, -128, 109, 65, -74, -26, 125, 164, 19, 5, 55, 88, -21, -26, 11, 67, 81, 23, -38, 6, 34, 5, -30, 17, 9, 69, 20, -94, -67, 116, 34, -200, -87, 61, 16, -127, -150, 36, 47, -103, -146, 42, 43, -74, -170, 49, 92, -64, -177, -40, 97, 4, -52, 15, -1, 44, -49, -83, 18, 68, 110, -35, -30, -1, 153, 65]
6163F5j18R0J05jk16j7K19M0k00o9J66K1q4j12J42R3j51q8J15N3j4o1k6N7nj0
6189fj63J24O3K4j88L3J58Ql0j56J49M1j18j41J52J47mj86lJ83p8j42J53O3l0
6214E3o1m8R3R1q6p0J03n3qm8L3QK3Rj17j7J30Q6j64l3J05J23j80j48J51K03j09
6241F9j82R8K6L6j57J13J46j42j97N3J85j1o0k4J00j01J5J4k3J05m9K4q8n2J60
6266E8Q4j27j35J26M0o7kQ8J44k28j26J69J12p9j72R8J45j06j83L0K06m0p3Qj9
6291d9P9l0l3n5J85o9r1j06J25J21m9q5p4J75mj47n4K42N2k16p6J07J26p4n9Q9
6317C0R5j31r5O9R2J31j42m7P7m5L9n3n2Q6K5j54n8J06J66m4j88N4J69p3j52M1
6343e4K30r8j41j13K47m6o0L0L2L0j20n2N2N8J9m8p8K4Q8Q9j50J7P6R0j59j18
$$ y = [65, -53, 37, 142, 141, -75, -92, 127, 167, -33, -102, 64, 85, 1, -111, 31, 124, -27, -115, 0, 53, 39, -22, -48, 9, 4, -6, -169, -45, 18, 42, -146, -113, 45, 53, 23, -133, 16, 57, -61, -202, -50, 97, 93, -93, -96, 87, 9, -133, 20, 83, 53, -8, -56, 37, 128, 42, -28, 75, 22, 14, -34, -1, 7, 30, 39, -78, -95, 35, 121, -43, -76, 29, 152, -28, -176, -25, 178, 69, -113, -15, 11, 47, -110, 3, 149, 7, -190, -137, 48, 37, -23, -47, 53, -48, -33, -19, -42, 63, 14, 38, -50, -102, 58, 142, 15, -120, 6, 46, -21, -23, 65, 209, -19, -145, 24, 136, 57, -115, -17, 128, 22, -161, -131, 75, 35, -38, -30, -49, 30, 0, -33, -88, 97, 28, -63, -169, -44, 77, 28, -57, -131, 44, 40, -107, -161, 81, 133, -83, -159, -52, 74, 0, -59, 30, 125, -6, -101, -32, 60, 191, 49, 2, 79, 34, 73, 20, -32, 54, 79, -75, -133, -27, 139, 95, -93, -39, 130, 57, -95, -54, 176, 78, -63, -176, 71, 25, -35, -5, 27, 57, -63, -115, -63, -5, 14, -34, -112, -88, 0, 89, -61, -44, 32, 122, -37, -155]
6369a55J50J78k02j38J88J57j41j84J31J62q5j86Q3K22n8j27K7Q1L3j62j4J13
6391G3n1q3R1K3m0M6L2o2j38O0J04n8j29J06J58j97j08J84J11q9j84O3K29j59
6415a8j94J35K18r6k09L7K29m4j36L2J43j5j97l5K45j2o0l5nLL5j7N0j05J19m7
6441B1r0o0J99J07j31j25P7J21j24j19P3J75n1j14j11J65Q9j18j12J30L9j39m8
6464a46P8J33k2j75k1P5R4q1k1M0J65k05j18K17J08p6j23P0L0J3j6O0j6L4j29
6489c2k3qP9J28k0j51m3J67j1r8j2J25J01l14q6K67P8j28j69J22J84j81j68K01
6513HJ92j53j85O6J15r8n2J23rk2j66J84K4j05K7J08l0j88J24J13j41n6P2J15
6537F6j26j00K10J16j01k74K15J93j60j71J36K37j36k35Q0K51j17j30O7J56j36
$$ y = [-155, -5, 173, -29, -167, 21, 178, 37, -147, -16, 146, 61, -125, -42, 180, 122, -5, 22, 103, 136, -26, -40, 73, 22, -61, 30, 53, 13, 59, 91, 29, -109, -49, 55, -3, -132, -26, 132, -65, -173, 11, 122, 33, -151, -88, 141, -18, -212, -77, 141, 45, -164, -127, 102, 58, -78, -46, 97, 82, -115, -150, 95, 83, 23, -12, -17, -14, 21, 4, 54, -51, 68, 21, -69, -129, 70, 177, 46, -79, -2, 119, -5, -124, -51, 124, 73, -41, -152, 13, 102, -16, -128, 2, 41, -98, -146, -68, 65, 43, -132, -153, -78, 16, -65, -86, -46, 119, -86, -204, 13, 121, 45, -78, -8, 22, 35, 19, 79, 63, 97, -32, -55, -63, 16, 144, 124, -27, -70, 97, 86, -12, -24, 101, 202, -112, -198, 69, 147, 19, -150, -28, 156, -25, -193, 8, 200, 47, -138, -72, 43, -55, -107, 16, 7, -15, -181, 3, 27, -78, -51, 57, 27, -161, -37, 76, -65, -121, -49, 66, -60, -160, 50, 166, 65, -209, 6, 199, 39, -132, 4, 241, 105, -130, -50, 201, 84, -46, 21, 177, 41]
6558D1j15Q0J08m2o6L9K9j12K6Q3J8j37l6N2N4j67O1J63n6k22J19J34j43J1L2
6583d6J25j31j15Q8J67q3j64J02J07j2p8k0J10J1j13l1J24K4n1o2K9L0J45j85
6607b9M3j0R5l8l9o6N2J51j07r2P5M4k1q8j5J65k7p9j15O3J34r5q2M3J08o7j29
6634a26K0K27j05o4j06R0O1l4m9N0R7j08o9Q1N5l7n3J06k6m1RJ0N7k2om8PJ08
6662H4m6m4QK4N2j2j19LJ84k6j08l0J13l0k5j19O8J17j07p4O9J03q4q1RJ33k8
6689C4o4l3R2l7o9NL5O0n0K3n6nJ7Q0r9J7J27m9q3O2O2k4o9k5K8R8k9j10P7Q1
6719I6k1j15Q3j4K3m1j7O0j8o7lR0L1j1j05N9L3m3o7N1m1J21n9k7J4K1p7k2O4
6748bN1m8l7o1jQ7k6k8lQ8l7l2K1K9K1m2q6L4J05Rp0J2J04o3ml9R7m9k5l1J1R0
$$ y = [41, -74, 6, 114, 72, 6, 45, 74, -38, -12, 71, 89, -48, -84, -32, 22, -145, -84, 79, 23, -199, -80, 54, -89, -78, -46, 79, -52, -167, -79, 88, 5, -159, -57, 50, 38, -40, -60, 50, 61, -52, -83, 41, 65, 14, -48, -19, 11, 156, -29, 14, 4, 99, 61, 22, -44, 8, 159, 52, -40, 35, 79, 58, -30, -45, 120, 93, 14, -101, -38, 96, 1, -81, -38, 70, 3, -126, -106, 121, 16, -48, -154, -64, -3, -37, -86, -36, 61, -47, -116, -35, 20, -17, -70, 36, 10, -31, -22, -12, 45, 23, 17, -31, -24, 84, 38, -6, 2, 26, 78, 66, -53, -50, 134, 108, 0, -30, 83, 53, 28, -91, -23, 94, -13, -87, -18, 85, 1, -80, -71, 62, 34, -30, -63, 29, -8, -77, -72, -37, 23, -27, -4, -60, -65, -48, 32, -67, -50, 77, 28, -55, 7, 69, 45, -24, -49, -21, 77, 48, -62, 15, 96, 75, -40, 43, 29, 52, 11, -6, 54, 36, -31, -34, 56, 87, 76, -29, 30, 63, 20, -47, 4, -37, 84, 25, -2, 12, 33, -44, -66, -2, 49, 1, -36, -97, -98, -11, -37, -65, -68, 20, -17, -49, -28, 1, 22, -20, -106, -72, 33, 42, -28, -16, 88, 25, 21, -18, 79, 30, 5, -26, -15, 75]
6780G5p4q5M5J02nr5N3L8m8J9n2M8J2q0O7oj6mll1Q7m4n4Jj6J05r4M2l8N1kJ3
6812A1m5qK3n9M4m0R8M0q3j2O7N0k5j61L0P5K5j15M6J91n9j76M9J43M5j66j2R0
6840F6Rm5j03J55n4j0k2K2K6j00J11n1m3N5K2O1j23nJ02k9p1n3P9J05j81l9R4
6867b2R1o7j14J26Q6j60m6R3M8j06K4lQ8o4m6J21J8l8mj21J51n8K2PK6m6m2R3
6895E7p0k6P6M1r0n4O9P9n9o8J4P1l4j41N4J87j9j65P0J20j17l6o6K14k9m7j18
6922h7O6R0j23M0M1K6j00J4L9Ln3N2nqn1P9m9J8JK9ro4l6J06Q3j37k3J12L9p1
6952B2n7P2P4j21r9L7K27j50r9J09M5p6o9P1R3o1j06J15J7j1j11N8O6j16k5J23
6978B8m5k8R2K9p4p7pJ96q4j14N5O2J5j55Q0J61o6j80N6J70k5j78L3J44j7j49
$$ y = [75, 1, -84, -39, 63, 58, -37, 16, 54, 6, 25, -27, 21, 33, -47, 20, 14, -2, -6, -9, -40, 47, 3, -51, -50, -66, 39, -55, -13, -51, 0, -2, 11, -34, -42, -19, -78, -34, -74, 24, 64, -19, -31, 36, 86, 61, -100, -70, 5, 30, -85, -39, 152, 93, -83, -34, 109, 154, -12, -24, 66, 75, 30, -73, 82, 28, 18, -4, 18, 44, -56, 55, 4, -39, 16, 38, 99, -24, -29, 73, 44, -27, -80, -1, 104, -77, -116, -22, 69, 2, -112, 14, 100, -60, -106, -13, 35, -71, -47, -50, 38, -26, -72, 49, 67, 29, 25, -96, 55, -3, 19, 26, 52, 6, -36, 57, -13, -39, 37, 78, -12, -66, 3, 82, 23, -45, -31, 40, 6, -135, -81, 106, 87, -78, -8, 112, -5, -41, -107, 107, 78, 31, -87, -21, 69, -54, -14, 27, 53, -47, -33, 6, 9, -44, 8, 3, -5, -56, 23, -26, -8, -7, 22, 13, -51, -87, 19, 102, -35, -58, 54, 93, 22, -35, 37, 111, -10, -109, -72, 155, 5, -94, 15, 60, -16, -85, -14, 79, 18, -88, 27, 44, 33, -78, -20, 46, -70, -95, 28, -17, -45, 47, 76, 2, -75, -82, 114, 30, -84, -29, 33, 48, -107, -27, 134, 68, -112, -56, 114, 89, -89, -56, 88, 71, -78]
7004g8K1J64o1j06L1J03o1j7KK7J7n7KN4p1oJ00jp4n5P7N0j47N6J17q7j34M7J42
7033E5k2j63J0J74L3k26K6J15J25j89j3J19J9p0J7NM0m8Ok6N1mK6J3j50P2R2j13
7061b6l1Q5j5J4j02j1J66l6j60J24J3N3j03o7J00J01j33j1K0PL8l5J2j6M1m1q4
7088i7j2Q2M5q2QO6N9j37m0J90j35J9o3J78n5j1n0P1L0r8O4K0N5j61M7N7q3o0
7116i3R8J1j5onL4o6l6J39qj32j3J13P8k38K0K44n1k15O7J33N2k00l5J99k9j51
7143a05m5K04m0o4J9J14m7j25J19J1k0j14J70o6jp9J36N5k41J2K65l9k74mK56
7168I7K4k09J0J80P4j94p5K08J1k07l4J30M1j26nJ34o3p9M7O0p6K7N7j3m3qN1
7195A9M5j78j0J17K1j45QK21j5j51l4J05R8k55J08R1N8j87J4J41j8j44J12N7m7
$$ y = [-78, -57, 107, 46, -60, -29, 74, 13, -4, -2, 25, 42, -15, -13, 41, -30, -36, 64, 63, -11, -66, 11, 61, -86, -30, 87, 0, -134, -87, 55, 33, -130, -120, 54, 87, -139, -113, 2, 127, -62, -75, 44, 63, -7, 10, 15, 55, 7, 13, -13, 38, 34, 60, 73, -77, -5, 87, -26, -57, 28, 13, 27, -75, -86, 80, 44, -116, 8, 21, 74, -29, -96, 4, 105, -28, -39, -19, -12, 26, -9, 3, -13, 28, -13, -97, -109, -27, 18, -64, -56, 10, 69, -68, -108, 82, -53, -34, -97, 81, 26, 15, -35, 36, 66, -32, 32, 52, 107, -54, -7, 50, -33, -93, 5, 16, 1, -5, -10, 24, -42, -78, 61, 53, -79, -92, 21, 99, -139, -119, 125, 74, -141, -74, 59, 111, -89, -124, 75, 46, -105, -150, 54, 14, -50, -31, 83, 36, -89, 30, 41, 21, -93, 77, 11, 10, -69, 67, 122, -119, -107, 158, 119, -155, -159, 97, 121, -88, -78, 102, 176, -18, -93, 115, 126, -81, -115, 15, 56, -70, -75, 59, -4, -83, -36, 24, -52, -25, 32, 19, -24, -32, 19, 64, -114, -124, -7, 14, -131, -123, 98, 83, -68, -102, 3, 101, -154, -46, 45, 103, -84, -70, 71, 53, -91, 21, 78, 31]
7220C1p1M8J7kj8N8p2J6j2O2M5j18N4J3J0j14l3J85j8j80L3J24pj04K7J27p3j31
7248a03M9OQ1p3j6N2m7j3MK2M8m5K9j7o8J20k7m1o1O4j3M3o0k1K48q8k42J34J02
7277F7L5k03P1J69j19o9N2J19k9j13NP1j5l5l5J30j03M3j3o2J5j9R6j25j9J70
7303H4m6o0n0L2J19n5j57Q5O0K6j39N0J25p5p5nN0R6j36n2J20J0rlK8j4k5k0j4
7332e0K7J07j04M4rMJ6l2L1j2Qk9k8j6J01kj20J11O5o0j33P5J02m4n5p9O6O9k0
7361C3j9p4J51m5j04l2R8L3q6LJ3N1j46K0P6M5K4p3k4J6O7p2K5NQ6o6o5K2J1K7
7391@K7m1j2J25o0Or2O7L2m3o4N5J19j79l4J33Q0j00p9N6J05k1j50K3J67p1j34
7418h5L1J23p0l7rP1K3r2o0O1j7O2p5J7N5J8K0j18NMJ17k1j17N8J28o9p5pR9l4
$$ y = [31, -40, 8, 25, 23, 5, 63, -9, 7, -5, 57, 102, -16, 38, 51, 61, -53, -86, 99, 81, -99, -66, 58, 51, -53, -26, 101, 28, -103, -54, -48, 33, -40, -56, -4, -51, -64, -60, -38, 10, -35, -6, -23, -91, 29, 2, -39, -100, -36, -49, -6, -66, -87, 161, 73, -169, -35, 67, 102, -101, -30, 139, 20, -49, 3, 122, 93, -20, -15, 56, 41, 6, -29, 101, -2, 41, 28, -34, -19, -38, 58, -67, -86, 84, 38, -22, -72, -40, 79, 24, -133, -48, 12, 38, -101, -51, 74, -1, -76, -81, -31, 65, -71, -123, -3, 7, -2, -5, 23, 9, -16, -36, -50, -23, 84, -20, 24, 15, 19, 35, 3, 34, 22, 30, 1, -27, -43, 58, 56, -64, 47, 112, 52, -81, -6, 96, 52, -3, -82, -16, 53, 33, 14, -60, 91, 46, -58, -90, 8, 41, -45, -42, -29, 22, -124, -104, -28, 17, 41, -32, -56, -40, 27, -45, -20, -15, 71, 5, -60, -38, -27, 0, 27, -14, -26, 99, 39, 45, -47, 20, 52, 9, -55, 0, 119, -60, -94, 39, 119, 19, -60, -4, 101, 80, -70, -47, 120, 49, -85, -54, 69, -1, -38, -47, 24, 47, -45, -105, -44, -61, 1, -74, -57, -2, 16, 36, -82, -77, -73, 44, 23, -94, -36, 92, 23, -52, -59, 40, 6]
7448Fr2M7J07L0j13J0Q2k5L3j51J08Np1MK1L2o5L4j8J5j1l5Q5j7l0M0q4L9n2M8
7478a8M1l6q9P7K6J6n0RM9o5jkN3L8m6JP2n5r6N9N6k5k7L4O3m9q2M5M5N4j24P
7510b0J50j00qn6K6k6R0l0p7J31j27J02k7k5k1N4Qo2MP2l5p4m2P0R2j47qO4Q3
7539F1p1j15J54O7j37p5J28P1o4j28R0L0l4j1L5R9j00k9l2M2J06j78Q9L6k0l0
7565a6K3R1j63O6J00r8p9P2J07p5j13J8J84n1k11N7J89l5j69M6J11p6q2M8J77
7590A21J6k28j9J16K4p8k4P0l4N4j09J50r9j4P2pl1k8J13p1j4NR4Jj49j0J80l1
7618G0j01o3J10J5n8m8J39J2j42j7J23M3j02K8M5l6r0N4O6kj00K8j6N1j9K1J9
7645C0o4j5J1j0k6L2P6j3o0n2R6L5l2p9Q9M8q2n6L9R1l7j0j7rrK6k8O0J7l1q3
$$ y = [6, -86, -39, 68, 98, -15, -5, 77, 52, 85, -66, 42, 47, -24, -20, 1, 33, -32, 2, -16, -1, -12, -47, 38, 21, -9, 31, -53, -14, -66, -18, 23, -13, -102, -25, 1, 17, -33, -24, 25, -40, -41, -43, 10, 48, 2, 3, 75, 20, -76, -17, 39, 14, -13, 21, 84, 35, -47, -2, 43, 97, -27, -20, 130, 30, 22, -34, -8, -34, 56, 26, -51, 80, -47, 55, 28, 3, -18, 36, 44, -18, -14, 58, 23, -51, -93, -23, 69, -78, -86, -22, 61, -10, -125, 29, 96, -41, -116, 12, 83, 19, -109, -19, 11, -23, -34, 1, 100, 0, -29, -61, -19, 87, -91, -2, 34, 14, -16, 7, 98, -65, 1, 101, 3, -76, -4, 103, 28, -85, -67, 117, 66, -145, -88, 101, 66, -103, -57, 54, -22, -104, -56, 121, 137, -91, -110, 6, 30, -48, -72, -2, -36, 18, -91, 59, -40, -54, 18, 11, -20, -48, 65, -6, -20, -15, 79, 80, -69, -79, 101, 70, -31, -94, 16, 31, -27, -75, 64, 76, -66, -83, 40, 83, -19, 9, 54, 18, -72, -18, 48, 46, -54, -26, -42, 9, -10, 11, 30, -34, -49, -38, -48, -74, -42, 34, 21, -39, -91, 5, 40, 8, -71, 18, 66, -16, -72, -33, 58, 21, 11, -6, -15, -24, 2, -26, 34, 51, 20, -63]
7676f3N4j0Q0q2N3N2j9j54O9J2J6rK0N0j07J8K9J5M7j16MO4k5K0Jp8M8Mj4L6r0
7707g5N8R4o2p6O8N2p6k3j0J14m8q0N2J12p7k7mM5J5j28O9O1L8j16l3Q9Q8r2o
7736B2ll5o7J10l4rj5R1m5q2l7J80m4p5m0O2P3j05l8R6J8r9m1J68qm0p2R2L8j11
7766e0m5N8NRk5O5l9kP0N4j00pK0j6l5k8J25K2p5j3j6M2L0l2Q2n3m3n9P6M5l4
7797C1r1M7o6K7N0J6J8l8Kk9mK7NM1p1QK4p2J5Q4k6k3m8qJ32n4l2L0M0M7j06l7
7829f1N3O3j9l6O1p7L3o2M0K2Ln3J03j20J00M2r9K0n8P3K0m3Q3k0k2l5k9R7p4
7858Em2J3L1L3j21J11K5o0n4K0K3K1l6j9J0L3Rj05J31q8O0m6K5L6p2M6j0k3M3
7887aJ7jr5N5J41n5n6kK2J8p0pJ06j3n2qN3kLlmK7p3N1o5P1K4r6M1k1k6L6n6L8
$$ y = [-63, -9, -19, 61, -21, 32, 84, 65, -89, -20, -8, 8, -1, 19, 69, -38, -20, 9, 24, 71, -45, -41, 23, -2, 18, 19, -59, -11, -7, -21, 15, -75, -17, 77, 15, -61, 7, 59, -17, -40, -50, 64, 16, -64, -12, 100, 23, -4, -8, 37, 52, -76, -7, 54, 92, -24, -57, 32, 120, 28, 22, 19, -16, -83, 27, -7, -16, -31, 60, 15, -67, -104, 76, 32, -43, -83, -21, 52, -53, -91, 5, 23, -76, -117, 51, 43, 3, -69, 23, 61, -50, -95, -37, -32, -23, -48, 17, -22, -24, 46, 100, 0, -7, 13, -3, -38, -66, 59, 81, 6, -7, -23, 19, 49, 17, 99, 46, 3, -56, 20, 65, 31, -60, -13, -79, -52, -2, 14, 32, -6, -4, -33, -37, -10, -5, 36, -35, -27, -3, -75, -60, 24, -2, -25, -73, -81, 51, -3, -35, -5, 35, 82, -24, -61, -8, 55, 36, 0, 61, -16, 17, -45, -5, 17, 20, -33, 70, -50, 50, 92, -7, 13, -45, 28, 48, 5, 88, 68, 46, 11, -18, 79, 5, -37, -24, 7, 40, -81, 30, 55, -5, -59, -39, -16, 5, -31, -50, -40, -7, 2, -103, 28, -60, 0, -46, -21, 15, -57, -11, -21, -44, -1, 16, 15, -80, -25, 116, 61, 5, 3, 25, 43, -27, -34, 72, 59, 7, -1, 52, 50, 53, 50, 46, 73, 0, 51, -14, 57, 81, -15, 26, 5, -21, 15, -41, -3]
7921ck8Lrj2qk4J12o6M2l4j0j6N4n5R9o4N3n9L1Q2j42L6k1N5l6LP3l5j05N7M6
7952A9k0L9j16J22N3q8m9Q4L0j11L3LO0Rp7N6M5j10R9L8m2j36J01j3j49R4m3J35
7980F6r5q9J31nj11L2QJ21M1k29O9J38m7j16P8P1j04j8N6Q3j14K2m3J20p2j1J3
8007eN2Ko5Q5o9LLL0L8j09qJ78m6j11nN4J2l8NN0m6r7J8J42n0r5L8J20Nj82K9
8038f2K0L1q6J9R4kl8j0P5q5j1R7o8Nmk2O6k4rN3rl5L1K7k2r7k2J52J1o5l1JN9
8071C9k5m5Q7moj1Oj9Ln6J02j1l2r9%J19k1m1P9L0q0Qn7L4k5l5M3J2K4ll6J6j6
8104b0%J6kl9P2N9j21O5o9L4J1l0N0j3nj7n3Q3Ok7k2M1K5L5j43K6J13n5n6J1L8
8135A3J8%j4m3L8q8J3P2j0J1n2K8L4M8m0nn7k7O4j6p2O6K0Kq7QJ17p0o2K8J28
$$ y = [-3, -31, -28, -37, -49, -57, -81, 31, -35, 7, -27, -37, -53, 1, -54, 45, -19, 34, -25, 6, 88, -54, -18, -39, 16, -20, -17, 56, 21, -84, -27, 19, -1, 38, -78, 44, 97, 9, -40, 44, 74, -37, -4, -1, 59, 68, -9, 47, 92, -18, 81, 119, 77, -59, 42, 29, -120, -26, -69, 66, -29, -118, 13, 8, -103, -71, -63, 58, 99, -130, -61, 77, 30, -86, -8, 63, -41, -59, -3, 80, -34, -12, -55, 65, -7, -18, -5, 47, 49, -16, 69, 0, 3, 6, 36, 74, -35, -43, 135, 89, -22, -27, 27, 39, 1, 6, 56, 10, -87, -69, 73, 23, -72, -34, 86, 91, -91, -62, -42, -11, -97, -78, 16, 14, -24, -34, 41, -44, -55, 42, -26, -21, -25, -47, 19, -5, -14, 39, 30, -5, 26, 53, 31, -66, -88, 64, 75, 10, -21, -20, 39, 14, -31, 56, 52, 46, 35, 41, 22, 25, -31, 71, 60, 28, -71, -71, 48, 27, -14, 65, 95, 15, 23, -34, 0, -25, -60, -17, -5, 19, 16, -20, -4, -20, -20, -4, -6, -45, 27, 86, -35, 30, -39, -5, 6, -24, 26, 13, 8, -9, -62, 21, 27, 0, -22, 19, 44, 79, -64, -38, 75, 20, -36, -25, 13, 31, 31, 17, -26, 12, -76, -63, 9, -1, 10, -42, -14, 20, 68, 28, 23, -34, -61, 3, -13, -85, -19, 1, 3, -84, -76, 41, -29, -91, -63, 65]
8166F5l2n3j8M8M1j42O5qM1Jp2J07q1QL4L7n9N2o2J7j4M9%j9r
$$ y = [65, 33, -20, -38, 10, 51, -91, -26, -34, 7, 8, -64, 43, -38, -30, 4, 41, -18, 34, -28, -11, -25, 24, 24, 5, -4]
8191d
$$ Imaginary data points
##PAGE= N=2
##DATA TABLE= (X++(I..I)), XYDATA
0@%%%%%%%%%%%%%%%oJ2j2J4j6J6j6J6k1K7k8K9l5M1m3M7n4O2o8P2q0R0j00J09
39E6j20J35j49J64j82K03k27K54k84L21l68M24m98N95p23R08j185J633k445M190
59B702r280M8213J95088j79871k13016J47766J30982j87866j01365K44311J33497
70B11161k36072j52073J82240J03727j61895l3073J98002M897k40504k8496K29697
81G7611M2379j73437J2169J60496q0321k11628P7992K36594m0790j97921M5018
92e1838J49798r9365j55215J34756J91035j14081j90219Q4025J47270r0433j05422
103i9689J31366J07387j55753j37598J25186J29486q5990p2070J00428L5065j41121
114f3303n0571J43986P1887j02168m4639P8255n687r9043K4999J25448r803j20865
$$ y = [0, 0, 0, 0, 0, 0, 0, 0, 0, 0, 0, 0, 0, 0, 0, 0, -6, 6, -6, 8, -8, 8, -8, 8, -13, 14, -14, 15, -20, 21, -22, 25, -29, 33, -35, 37, -43, 47, -53, 56, -64, 71, -78, 86, -96, 107, -120, 134, -150, 171, -197, 227, -271, 324, -399, 509, -676, 957, -1488, 2702, -6578, 41635, 236723, 56852, -156164, -8398, 122584, -65282, -166647, 77664, 211161, -24911, -176984, 5256, 108983, -52912, -85985, 112017, 116914, -123590, -152086, 77611, 119990, -53447, -41278, 119218, 38897, -172731, -94739, 141855, 101065, -96856, -51838, 97960, -1405, -156620, -21864, 169171, 55090, -135129, -51104, 96166, 5733, -99689, 31677, 139064, -16689, -154287, -29101, 100385, 14395, -57675, 42753, 77818, -63303, -113874, 30112, 101999, -169, -44808, 33447, 27760, -71283, -46284, 79164, 69361, -51504]
126e1504m406Q7862j5306o8019N4282Q8568o2617j14170L2877R9058j5259o1206
138b9840L7365N2413o1024p4318M7029P9888j8552n5088J1690K7673k6561k2317
150c1642L7878L4103k7018l7782K514J5466K524R436J6889o595k7715j3245Q971
163a6216J2552J0444R519l391j8223j3561M669J4108J0914J038j0236j0741N19
176h605N947K430Q279J3251r679l2564n794L4026J6281k3530o213K7450n566m7845
190c2132j756N9276J6410n3783j8870M7391J0393n1608n301O0029Q117o3863j5438
203d1135N6046J4190m5178r32M4604j1153n2392J1200N1817j0251m0567K1637
215b114L4997l8418m0514M6249M5779m7548m4190N0627L9613n8040l7010O7554
$$ y = [-51504, -55910, 31952, 16646, -51373, 2909, 91477, 28860, -85310, -52433, 46625, 31366, -29840, 7525, 59938, -1086, -75404, -28375, 51513, 32961, -22127, -10437, 17236, -9325, -31642, 6236, 40339, 13321, -24461, -21947, -6481, -3957, 5479, 22368, 15773, -11942, -25187, -16216, -3664, 6780, 16299, 12908, -5315, -18876, -14207, -99, 10815, 11853, 1617, -9124, -8605, -2658, -228, 8051, 21302, 11623, -20941, -26735, 7291, 23572, 42, -6171, 21279, 15713, -32132, -33888, 25388, 41798, -11985, -30855, 16536, 26929, -24679, -29980, 30049, 38166, -25697, -41135, 14911, 29101, -16077, -17009, 27595, 16442, -35950, -24750, 27067, 16816, -23751, -2114, 32883, -5535, -46049, 200, 45979, -1569, -45759, 4868, 44481, -13559, -50569, 16985]
227A6985M0680p1391m4815O8360M2259o5092l3584O9357K9225p4484l0954P1901
239A8447K9675o5254k0886O3606J1689o5788o857O6301L983o3039O36N7944r602
252B0855n5759J8602N6808k4673n8017K6898N4591l1828n0439M0220N0538m6529
264A267n3261M7997N3008m8316n0040N0894M7746n3510m7478N4093M7075n1810
276b335m4362M9067L9242m7718l3540M8007K9752m7091k5739M4498J9825m2681
288a3075j2302M3643O576m5211k499M5783j027m5363N510M6084r614m7606J2176
301a6925M8848j3016m8924J3996M8197j5500m7880J6415M7215j6895m6765J6467
313a4767M5127j6509m3389J6626M1135j7391m0149J7084L8197j6540l5464J6617
$$ y = [16985, 57665, -13726, -58541, 9819, 52078, -13014, -46598, 22759, 51984, -22500, -53454, 18447, 48122, -17132, -38018, 25588, 37277, -28511, -35368, 30933, 34916, -28123, -27487, 30457, 20855, -34904, -16302, 40506, 15833, -42184, -15286, 39305, 7477, -42962, -2742, 47796, 1267, -51994, -3997, 49011, 695, -49345, 1549, 49295, -4215, -51693, 2400, 49475, -2335, -46697, 2370, 41612, -6106, -39646, 8361, 38113, -8978, -34717, 9781, 29606, -13075, -25377, 18266, 24842, -20369, -22868, 22915, 21888, -23475, -17965, 28119, 18505, -29101, -16925, 31923, 18907, -30017, -16021, 32176, 16676, -31204, -14789, 32426, 15531, -31234, -14767, 30360, 13851, -29538, -12912, 28223, 10832, -29317, -12233, 25964, 9424, -26040, -9423]
325i423L2740j7298l0630J7598K8312j7923k5013J9184K2585k0491j9796K2210
337B055J7374k4726j5462K7580J4567k9383j3214L2214J2535l5296j3223L7432
349A2453J4174l8413j4421L9860J5427m0537j6932L9752J7086l8978j6589L8365
361A1247J6691l6505j5617L4462J2970l3758j0814L2764Q393l1504m907L0898
373A4320J008l1730J298L1550m663l1678Q193L2948j0749l3935J2399L3887j5384
386G464l4614J7536L5752j8518l5459K0366L5489k2172l6015K3332L6347k3396
398F112l5165K5033L5285k5618l5167K5125L3532k5269l1893K5954L0805k5268
410C466k8366K4928K4928k5944k2337K6657J9568k7076j5686K8557J2132l1553
$$ y = [-9423, 23317, 6019, -24611, -7013, 21299, 3376, -21637, -2453, 20132, -359, -20155, 2055, 19429, -5297, -20759, 6821, 21388, -7995, -21209, 11005, 23540, -11756, -24979, 12453, 26627, -11786, -26207, 13653, 29080, -11457, -28389, 11363, 28449, -10529, -27118, 11247, 27938, -8567, -24184, 10278, 23248, -10510, -21324, 11440, 19833, -11671, -16578, 14320, 15328, -16402, -15104, 16446, 11783, -19895, -11702, 21246, 10497, -23438, -11039, 22848, 7464, -27150, -9614, 26138, 7620, -27839, -7473, 28016, 5844, -30171, -6839, 29508, 6112, -29053, -4020, 31265, 5647, -29520, -4395, 29137, 3868, -28025, -2071, 28734, 3466, -24900, 28, 24956, -988, -23325, 3332, 22900, -4176, -19862, 8695, 20827, -10726]
422a0726j0353L2987P652l5159m966L8431M201m0439l864M1464K490m3282k404
435b3968M4454K929m4086k712M3437J532m3375j447M1985P95l9690J706L9019
448B0579l203l8029M701L5938p458l4740J0407L4824j2138l3463J4384L2571j7052
461G321l2322J9142L2217k0145l0813K2563L0221k4700l0407K5332K8687k6955
473A41k7589K9238K7432l0334k6787L0954K4996l2580k4327L3869K3778l4070
485e279k2731L4514K0931l5503k0516L5022J8623l4702j5843L5754J4506l5682
497a0906j2762L4811R295l5262o202L6412M381l6908j987L6876p71l7840L014
510a7849L8541m485l8365P146L9629q151l9616Q791L8260j0958l7578J3167L7985
$$ y = [-10726, -21079, 11908, 19560, -15599, -20565, 17866, 22067, -18372, -22236, 19228, 21718, -21564, -23968, 20486, 23415, -20671, -23383, 20054, 21586, -21789, -23236, 18749, 19544, -20146, -18440, 20579, 17376, -20653, -15952, 19986, 12528, -22212, -11805, 23019, 10881, -22582, -8198, 24373, 7321, -25001, -5859, 26358, 6213, -24600, -2037, 28184, 3484, -26923, -1591, 27096, 141, -27448, 1790, 29222, -1112, -27899, 3055, 28051, -4529, -28856, 5013, 28791, -5279, -28010, 6504, 27435, -8068, -28584, 6438, 25061, -9641, -25484, 10270, 24776, -10906, -23668, 11143, 20438, -14824, -21026, 15386, 19767, -17141, -19128, 17748, 16977, -20863, -17849, 20692, 16207, -22158, -15012, 24617, 16466, -23150, -14359, 23901, 12943, -24635, -11468, 26517]
523B6517j3605l6777J4513L4432j6726l3028J8903L2413k0000l1022K1129K9311
535B6060k2764k8237K3227K5686k5225k4564K6547K4070k6080k2295K5554J8770
547B0749k7070j6669K8770J6098k8371j4559K7686J1478k8354r146K9583P856
559A8051l0324o844L0850O972k9509n448K8610L171k9541k586L0021M038k7581
572a0120l717K4611P48k4024J057K4526n39k2893R69K0699k654j9374M945J9227
586A3461o872k0631O520K0882n213j9261O053J8138q421k0404P803K2340m531
599I864k0760K906J7998m605j8300N062J9434l703j9557J884J7978j606j5442
612h847L414J5440n682j7549N587J9088l428j7360M508J5710q148j8018R922K1830
$$ y = [26517, 12912, -23865, -9352, 25080, 8354, -24674, -5771, 26642, 6642, -24380, -3251, 26060, 3296, -24941, -1714, 23972, -1253, -25817, 730, 24800, -1280, -23575, 1979, 20749, -6321, -22990, 5780, 21878, -6493, -21052, 6634, 18112, -10242, -19388, 10195, 18051, -12273, -19117, 11733, 18705, -10804, -16252, 12358, 15529, -14012, -16598, 13423, 17461, -10120, -13837, 10774, 11522, -12502, -11445, 13081, 12542, -10351, -9382, 11317, 8663, -10711, -5766, 13461, 6589, -14042, -7522, 13360, 8147, -11114, -5061, 13077, 4656, -15748, -7945, 14395, 9864, -10896, -7990, 10008, 5403, -12897, -7835, 11599, 7896, -11661, -9777, 8201, 6595, -8847, -5433, 10007, 4325, -13224, -7637, 11451, 8023, -9337, -4829, 10881, 2733, -15285, -5363, 16467]
626A6467q034k2093P151K0662q913k0574J1778K2852j2757k5312J1258K5367j0474
639G378k3025J2917K2067j6982k4872J7789K7003j5527k4684J6074K1019k0675
651a518k1410K3796K3533k3548k3202K2423J9453k4407j6024K8527J5116l2070
663i331j6116L2120J5122l1238j0464L3749O225l9046o519M1568Q073l9715n381
676b0953L8856O84m1128K057M4220j324m3540J461M0205m658l7543J0421L8256
689B7014j3701m0062J3573L7631j4106l2221J9678K9634k6230l2022K7795L2744
701B9727k6342k8796K7583K3435l2686k2164L6295K3692l5883k3073L3261J7946
713B2995l3379j2215L7176J0525l9989j1681L7514J0003l4028l876L4525j001
$$ y = [16467, 8433, -13660, -6509, 14153, 5240, -15334, -3556, 19296, 6539, -18773, -7515, 17852, 7378, -15647, -2730, 19337, 2355, -22517, -4728, 22275, 6748, -17936, -1862, 19157, -1518, -22928, 868, 24401, 853, -22349, 74, 19527, -4880, -20904, 7623, 22739, -9331, -25447, 6673, 21795, -9443, -19907, 13842, 20067, -18979, -25498, 16070, 24143, -15572, -20953, 17903, 18587, -22541, -20484, 23736, 22412, -21128, -19667, 20538, 15880, -21663, -11242, 27014, 13313, -26749, -13176, 24455, 10349, -21872, -2194, 27440, 1210, -30812, -3017, 29727, 3385, -25411, 2172, 25607, -7079, -29243, 7052, 30744, -5139, -28212, 5049, 22995, -10384, -22599, 14577, 25102, -14887, -26568, 10946, 20949, -13079, -16955, 17570, 16569]
725A6569l7752J115L7859k9l3840K492L0392p455l0026J0738L1184j0447k9317
738a8517J0111K4283j2653k0082J8057K0285k0692k1386J9386J9071j8635j4029
750a4801K1921J1912k5817j3864K5363J5167k1946j2509J9810Q072k1476o679
762a4847K2710Q425k0445r287J5062N280j2383j81J4038j024j5480j088J2302
775C082J143p773K957P006o647r561O110J0849l407q204K967N347n512n550P274
790H1Q440n051r499J602P168p70m870K575O519k502r352j024R379M623o561m550
806c792N529L111p467m462R525P978q220r964N130Q154m655n756O967N823q935
821a034p983P374P337n348l408O692o21j1147Q42J3789K85j3355J261J3151n034
$$ y = [16569, -21183, -20068, 17791, 17762, -16078, -13586, 16806, 9351, -20675, -9937, 21247, 10800, -18517, -8406, 15877, 3224, -16858, 1199, 21484, 792, -20594, -1208, 17863, -772, -14801, 7120, 19032, -6785, -20649, 4714, 19881, -2065, -14574, 5236, 13308, -8168, -14847, 7863, 16288, -4157, -13444, 1618, 6898, -5485, -5666, 8372, 7348, -8132, -9220, 3082, 4225, -3548, -591, 6415, -232, -9793, -3683, 7166, 3759, -4445, -1478, 3869, -1643, -7193, 81, 8521, 3470, -6029, -4427, 2741, 1971, -2899, -324, 6195, 3693, -5659, -6683, 2696, 7319, 758, -3792, 1737, 4848, -2619, -7081, 2444, 10422, 2202, -7762, -2632, 5522, 867, -4889, 2078, 7901, -1034, -9017, -1643, 5694, 346, -3062, 3630, 3009, -8138, -7296, 6493, 6778, -6577, -5316, 7835, 2801]
836B801j6177P560K0630o643k2628N234K1918n874k1103Q661K2605r838k4486
849a7340Q735K3967p738k0958R721J8933j2803j9157J4139J8886j3813j6158J4947
862A361J2853j7963j1393K0816J1108k1741r909K1855O945k3344l872K6081K553
875A5350k8459k534K8386J054k8029K067K9294m623l1919M786L2394m575l1148
888a7956N869K9942q120l0035R400L0019r397k8383R433K5597j0823k2443J3606
901c291K0720j5502j9265J6581J6718j7906j3102K0861J1106k3928j0173K5796
913H615R239k6888p556K8257O339k9878n830L0742N446l0750n027K9772M006k9052
927a2565k585K8609J629k7657j430K5841M3k3897J925K2802l755k1825M541K0204
$$ y = [2801, -13376, -5816, 14814, 8171, -14457, -9223, 12695, 6821, -14282, -5621, 16984, 7146, -17340, -8605, 15362, 7624, -13334, -3613, 15320, 2517, -16640, -2501, 16385, 2572, -13586, 1361, 14214, -3749, -15142, 5674, 16782, -4959, -14868, 6987, 13932, -9412, -13284, 12797, 15350, -13109, -15643, 12743, 13797, -14232, -12165, 17129, 12506, -19413, -14627, 17767, 13192, -17956, -12087, 17855, 9735, -20300, -10900, 19119, 9722, -18661, -9228, 16369, 5546, -16897, -3291, 17429, 1927, -17338, -757, 15961, -1945, -15047, 5814, 16920, -7008, -17181, 8615, 17854, -9034, -16590, 11667, 18006, -11872, -17702, 13040, 18486, -12264, -17291, 12481, 16487, -12565, -15150, 13459, 15088, -12569, -13999, 11842, 11885, -12012, -10087, 12715, 8960, -12865, -8324, 11880]
941A1880n816j8438P415J6824r112j5591J0536J4597j1889j3530J2956J2102j4165
954b231j1070J6072J0805j7213j0909J7829J0756j8232j0277J9028J0951j8977
966c468j1427J8394J1848j7482j1932J6482J1811j5088j1176J3631J0480j2263
978a90r744J0755Q066r577o128R040M153q853k723Q637P26r285Q16J0278j951
993D020j1373K721J2476l296j3863L413J5038l178j6069L006J6809k422j7590
1006a0308J649J7751j016j7618O06J7810j05j7526k74J7037L74j6338l07J5829
1020G564L70j4923N7J4170n72j3234J327J2347k223j1190L591J0401m902r873
1034g090O303R374q175r086R970R183j1767r578J3111R875j4691j0829J5710J1650
$$ y = [11880, 6064, -12374, -4959, 11865, 2753, -12838, -2302, 12295, 406, -13124, -168, 11934, -2231, -13301, 2771, 13576, -3637, -14546, 3283, 14039, -4193, -14470, 4558, 15509, -3468, -14895, 3499, 15347, -2135, -14067, 2415, 14226, -862, -12038, 1593, 12073, -190, -9934, 821, 8887, -690, -6818, 2222, 6375, -2478, -5201, 3436, 4162, -5123, -4307, 5971, 4020, -7353, -4632, 7844, 4548, -9315, -5902, 9136, 5958, -10111, -7105, 9704, 7282, -10308, -8659, 9092, 8076, -9542, -8936, 8874, 8769, -8757, -9031, 8006, 8380, -7958, -8265, 7564, 7934, -6989, -6932, 7238, 6666, -6568, -5241, 7106, 4883, -6307, -2716, 7685, 2783, -7090, -787, 8587, 412, -8674, 1296, 10479, -1288, -10866, 2245, 12120, -2571, -13400, 2310, 13960]
1048A3960j6323j2530J6483J3161j6628j3820J6061J3971j5309j3711J4701J3136
1060A3152j3842j2200J3017J0892j2390r106J2132P547j2019n671J2286L791j2696
1073e107k071J3383O64j3951P36J4839j882j5660K766J6429l492j6933M113J7624
1087A1458m592j7954M890J8280n232j8483N403J8688n436j8648N322J8196n281
1100F611j8041N040J7430m873j6715M577J5576m603j4541M558J3046m844j1637
1113h416N472J0052o283q638P208P421q544o184J0122N536j1485n111J3089N103
1127I342j4448n108J5636N825j6332o359J6885O933j6910p583J6647Q220j6168
1140c420q339J5396Q410j4637q048J3505P472j2525o638J1594N632j0990m368
$$ y = [13960, -2363, -14893, 1590, 14751, -1877, -15697, 364, 14335, -974, -14685, 16, 13152, -690, -12890, 127, 11019, -1371, -10477, 1655, 9202, -2817, -8488, 3798, 7589, -5107, -7178, 6205, 6869, -7082, -6346, 8493, 6611, -9049, -6283, 10146, 6654, -10279, -6166, 11458, 6866, -11088, -6198, 12082, 6850, -11633, -6230, 12458, 7022, -11626, -6304, 11892, 6611, -11430, -6390, 11040, 6167, -10548, -5971, 9605, 5002, -9539, -4981, 8065, 3221, -8416, -2944, 7108, 825, -7813, -605, 6816, -1728, -7912, 2210, 7746, -3739, -8850, 4239, 9342, -5106, -10214, 5422, 11247, -5085, -11444, 5441, 12374, -4536, -12119, 4528, 12748, -3420, -11759, 3637, 12047, -2590, -10638, 2867, 10339, -2186, -8824, 2770, 8402, -2588, -6956]
1153f956J0275K984j0004j595R698K09r645J158R775k667j0176L709J0532m875
1167B422j1081N839J1657o601j2546P063J3176p321j3950P504J4679p233j5046
1180a1438O788J5367o189j5312N523J5157m591j4331M165J3501l601j2264L288
1193c937J0953l251r266L810P793m500o675N505N291o722m419Q286L614r810l429
1208f757J1223L450j2643l828J3483M220j4346m590J4882N082j5276n781J5150
1221D269N980j4838n934J4622N817j4379n711J3853N262j3399m522J3095L819
1234G934j2812l038J2446K255j2091j237J1912M5j1438J210J1512k207j1363L550
1248c322J0955m855j0838O675J1314p990j1716R025J2092j0222j2296J1194J2829
$$ y = [-6956, 3319, 6303, -3701, -5296, 4402, 4611, -5034, -3876, 5899, 3232, -6944, -3235, 7297, 2422, -8659, -2820, 8837, 2236, -10310, -3247, 9929, 2608, -11342, -3838, 10841, 3608, -11438, -4650, 10717, 4528, -10784, -5261, 9896, 5305, -9026, -4861, 8640, 5039, -7225, -3937, 7016, 3765, -5501, -1691, 6102, 1602, -5073, 432, 5723, -999, -5418, 2868, 6482, -3328, -6757, 4466, 7916, -4727, -8555, 4928, 9148, -5198, -9788, 5094, 10176, -5100, -10881, 4269, 10249, -4589, -10523, 4099, 9916, -4463, -10174, 3679, 8941, -4458, -8980, 4115, 7934, -4878, -7916, 4530, 6785, -5306, -6543, 5369, 5414, -6024, -4814, 6698, 4491, -6872, -3322, 7633, 2778, -8060, -1385, 9929, 1939, -9777, -752, 11340, 1118, -11178, 16, 12845]
1261A2845j2122j3430J2370J3897j2474j4142J2118J3774j2193j3269J1862J2758
1273A1994j1400j2041J0778J0172j0594q285J0926O623j1088n032J1186L013j1755
1286e503q43J2869o12j3934J706J4667k851j5074M264J5876n385j6680N722J7334
1300A1556n670j6902O139J6348p131j6221P756J6483p391j5576P151J3856p655
1313B743j2610Q647J1958q821j1009Q261R156q372o908R250N089j0443m136J0718
1327C523K803j0766p72J1298j333j3073J977J4186j841j4124K290J3887l608j4560
1341a0113L990J5482k843j5024J958J3188k087j1663L131J1199l117j0510K273
1354d136Q667j963n858L534M144n304m153N863L868n119k181N712K35p622j63
$$ y = [12845, 723, -12707, -337, 13560, 1086, -13056, -938, 12836, 643, -12626, -764, 11994, 594, -11447, -669, 9503, -1091, -9376, 1550, 8173, -2915, -7947, 3239, 6252, -5503, -6346, 6523, 5911, -8023, -6317, 8350, 5499, -9575, -5311, 10565, 5180, -11500, -5778, 11556, 5886, -11016, -4877, 11471, 4340, -11881, -4125, 12358, 4967, -10609, -3458, 10398, 2743, -9867, -1220, 10738, 1917, -9092, -831, 8325, -47, -6955, 2295, 7384, -3059, -7195, 3523, 6326, -4440, -5212, 6086, 4753, -8320, -6343, 7843, 6002, -8122, -5832, 8055, 4447, -10113, -6123, 9359, 6516, -8508, -6550, 6638, 4551, -7112, -3981, 7218, 4101, -6409, -4136, 4531, 2568, -3290, 244, 4388, -916, -5069, 794, 4662, -457, -2638, 3074, 3309, -4313, -4476]
1369d476Q975J314q404j465P095K58p274O64Q451K0q593j557O896J528n312k28
1385b108N395l59o427j094N709K395l480j992K141L85k749o19L351K375k035l140
1401b252j48J942P62k68M88O41j298j965L58K156J053k98j0r60k469N6L812J854
1419C454l169j782K944N11m939n05P366K499p929m326O772M190o696l109Q154
1434C435L227r640m919R030N741p447m240P139K217q933k003R904K957q985k528
1449e045P622L7q136K085J0024k441j0841J928R951l001q753N478R525p471j1203
1464a0241P635J1668p122j0248Q409R407j0690j0154J1929J1568j1184j1069J0638
1477E46R399j1604q420J3124Q658j3083q981J1958P279j1152m859J2086L140j3454
$$ y = [-4476, 4499, 5813, -2591, -4056, 3039, 3297, -3977, -3313, 5138, 5158, -3435, -4992, 1904, 3432, -1880, -2108, 3287, 2928, -3499, -4593, 1116, 3511, 31, -1961, 180, 565, -2184, -2803, 548, 2923, 888, -2252, -2400, -458, 304, 36, 524, 1165, -133, -2098, -1740, 416, 1469, 1171, 1161, 201, -2268, -2212, 1600, 3454, 285, -1497, 1447, 1958, -2981, -3486, 3880, 6379, -1550, -5876, 896, 5086, -1610, -4719, 3435, 6662, -2978, -7897, 1133, 6874, -573, -4813, 2326, 4543, -4390, -6393, 3511, 6468, -2517, -5045, 2577, 2614, -5522, -3437, 6587, 4146, -6695, -4767, 5184, 2183, -6570, -1092, 8433, 962, -10241, -2606, 9062, 1940, -8308, 101, 9508, -1182, -11336, 593, 12161, 977, -10092, 546, 9945, -1659, -10079, 3045, 11703, -1380, -10361, 1597, 8876, -2276, -7135, 4951, 8091, -5363]
1491e363l081J3243K308j2035J1J1920k777j3701L613J5135l265j4713L690J3487
1505H472n570j3713P289J4991p097j5469N926J4109n951j2065P442J1672q824
1518A212j2064Q279J1613p132r359P636P238r297o639J0348O941r778o031R150
1532B117M187r750k601J1155K359j1556k573J0750J827j0050j71J0622q58j1727
1546f269L25J1523j4j0253P38R556k141j0156K006J0530j009r522N46P707j506
1561B061o983K490P254k183p128J210N640j337l703K712L562l902m256L640M430
1576C507k906l247L329K524m490l151M996M300l989m520K958L979k963l636L520
1591B11M204l160m931K058M751j277l823J407L471j864m120J704M312j013l852
$$ y = [-5363, -8444, 4799, 7107, -4928, -4917, 7003, 4226, -9475, -5862, 9273, 6008, -8705, -5015, 8472, 2902, -10811, -3522, 11469, 4372, -11097, -5171, 8938, 2987, -9078, -1636, 10036, 1212, -10852, -2573, 9040, 1908, -7451, 185, 7423, -1874, -8513, 1835, 8776, -1002, -7033, 2117, 6304, -3446, -6047, 5108, 7467, -4089, -6662, 4088, 5915, -4135, -4306, 6316, 5458, -6269, -5944, 5579, 5565, -4688, -3950, 5606, 3465, -6691, -4685, 5845, 4836, -4686, -4140, 3567, 2061, -4922, -2432, 4822, 2639, -4489, -3279, 2361, 1024, -2679, 33, 3595, -307, -4563, -923, 3507, 601, -2646, 683, 3207, -1283, -4434, 562, 4862, 873, -3647, -689, 3290, 327, -3309, 211, 4415, 1255, -3676, -1618, 3133, 1856, -1967, -560, 2911, 1047, -3073, -1369, 2943, 1930, -1922]
1606a922R83L197j843l526K331M117k212m352J839L858k215l697K974M020l377
1621A75m566L061M569k956l916L667L695m597m020N066M455m846m105N177L692
1636D551n940l682O724M070o684m301O628M035o664l620O986L437p158l455P076
1651B003K972o723k311O859J469p160j000P234N08p266K63P357j156p804J634
1666c121Q092j972q303K331Q268k701q514L081Q429l339q327L367Q162l671p723
1681e941L927P548m355p248M560O902m677o336N154N987n512n543N773N182n808
1696c87m633O203M212o470l542O614L123o996k567P214K136p373j743P720J252
1711D763q101j134Q195R36q313p38Q270P23q403p77Q110O04p732n04P354K64o949
$$ y = [-1922, -939, 2258, 415, -3111, -780, 3337, 1125, -3227, -1388, 2470, 255, -3442, -468, 3552, 175, -4391, -1330, 3239, 283, -3633, 34, 3729, -868, -4888, 178, 4633, -213, -4318, 859, 4551, -1389, -5071, 1653, 5723, -961, -5262, 1366, 5401, -1263, -4883, 2103, 5540, -1618, -5073, 2003, 4975, -1748, -4059, 2800, 4269, -2891, -3891, 3343, 3851, -3415, -3152, 4205, 3049, -4755, -3121, 4971, 2999, -5304, -2973, 5295, 2594, -5920, -2839, 5590, 2251, -6076, -2709, 5453, 1782, -5941, -2014, 5534, 1179, -6069, -1509, 5393, 716, -5620, -466, 5521, 9, -5534, 239, 5421, -387, -5020, 1183, 5395, -1075, -4617, 1997, 5120, -1876, -4443, 2771, 4907, -2466, -4209, 3511, 4763, -3338, -4472, 3723, 4659, -3654, -4392, 3878, 4601, -3802, -4579, 3531, 4135, -3597, -4101, 3253, 3517, -3432]
1728c432kO388m94n728P91N397j479m904K191M606k825m561L425M591m074m487
1744d597M562M726m887m897N125N064n083n106N081N331m890n213M747M935m420
1759D78m552M173M224l940l712L891L162m029k598L970K023m106j532M251R78
1774B681m495o83M546K12m830J24M836k75n066N54N115q61n281J005N350j167
1790A765n362J481N310j594n182J547N209j578n094J709N073j650m798J586M482
1805B904j508m132J658L625j436l184J636K724j899k212K142J755k428j273K859
1820A231J017l266q29L548P42l953p40M222Q98m514r86M446J038m538j329M398
1836A385J438m287j514M029J345l701j473L443J372l202j243L056J081k868p96
$$ y = [-3432, -3434, 2954, 2460, -3268, -2477, 2920, 1441, -3463, -1272, 3334, 509, -4052, -627, 3964, -110, -4597, -35, 4691, -196, -5093, 32, 5096, 13, -5093, -12, 5319, 429, -4784, -37, 4898, 478, -4074, 99, 4323, 383, -3329, 562, 3724, -305, -2903, 1067, 3090, -1016, -2548, 1703, 2681, -1814, -2497, 2049, 2261, -2569, -2445, 2391, 2116, -2950, -2396, 2719, 1858, -3423, -2418, 2932, 1765, -3597, -2116, 3194, 1600, -3582, -2035, 3174, 1596, -3498, -1789, 3284, 1634, -3164, -1578, 2904, 1396, -2736, -1078, 2547, 1111, -2073, -437, 2287, 388, -1824, 318, 2073, -355, -1628, 1231, 2248, -1018, -1847, 1701, 2443, -1510, -2250, 1972, 2870, -1644, -2630, 1816, 2854, -1684, -3013, 1385, 2823, -1464, -2978, 1051, 2396, -1305, -2778, 665, 2037, -1165, -2408, 648, 1729, -1139, -1935]
1851a935K551O76k370l61K277J76k059K78J940m49k014R56J988j262j950J589
1867C1K168j938k482K215K864k370l211K564L619k649l994K422M481k326m718
1882c324J946M903j575m922J173M638q83m509O63L989m69l520O03K793r50k324
1898a768J325J663j769j325K496R19l158p85L920P72m761o01N179R99n671j048
1914c613O188J224o437j456O622J710o448j476O382J376o343j393O267J231n930
1929b096q50N645L00n485K14N273o16n017R72M581j669m228K623L959l387m000
1945c781L738L789m364l356N135L145o001l423O439L630o732l488O881L363p267
1960b292l395P524L519p247l625O707L309o247k561O123K094n759j870N229J231
$$ y = [-1935, 616, 1292, -1078, -1439, 838, 1014, -1045, -767, 1173, 724, -1290, -334, 1654, 392, -1558, 31, 2199, 261, -2221, -6, 2858, 488, -2723, -159, 3460, 811, -3183, -761, 3720, 1394, -3324, -1378, 3525, 1950, -2972, -1799, 2839, 1956, -2553, -1890, 2099, 1630, -1890, -1287, 1506, 556, -1768, -443, 1220, -549, -1874, 622, 1541, -1617, -2402, 1518, 2290, -2471, -3072, 2107, 3106, -2565, -3613, 2575, 3799, -2638, -4094, 2528, 4238, -2210, -3686, 2696, 4072, -2271, -3664, 2603, 3834, -2096, -2946, 2699, 2999, -2486, -2272, 3001, 2385, -2632, -1660, 2921, 1252, -2976, -353, 3606, 219, -3781, -43, 3746, -618, -3974, 1161, 4306, -1695, -5118, 1321, 4951, -1781, -5269, 1612, 4975, -2292, -5687, 1837, 5356, -1891, -5516, 1191, 4500, -1747, -4308, 1815, 3909, -1850, -3720, 1509, 2740]
1975B740m502P7M360j016m535J557M536k013m070K866L873l765m289M437M732
1990D988m290m914M186M280m483l920M883M213m922m741M183M307l705l447L760
2005C78K961l964l303L603L319k685k778K082J790j981j358K179J357j694j218
2020a312R18L65n95P24J025r12j479O34J378o30j112J246J573j408k472P14L143
2037A800K92k769q07K423R88k759j368L385K681l328m060K263M310j421l926J699
2053e97L985k265m983J737N484p20m978L95L830j290l629K164M192k391m298K036
2069a328L318k447k150L934K055n263k660N494K682n316j583O189O40p735p37
2084d907Q739J543q739j223Q626J80r291L94J0611Q2j0961o68J0163K52r483J053
$$ y = [2740, -1762, -1685, 2675, 1659, -2876, -1319, 3217, 1204, -2866, 0, 3873, 108, -4181, 256, 4988, 698, -4216, -30, 4250, -233, -4153, 730, 4943, 21, -4720, -537, 3770, 65, -3382, 378, 3339, -625, -3928, -325, 2994, 309, -2469, -387, 1403, -578, -1936, 243, 1600, -94, -1312, -394, -29, -624, 100, 1125, 213, -1266, -632, 746, 116, -996, 250, 1823, 415, -2057, -1343, 1800, 2092, -677, -1484, 939, 1927, -832, -2200, 1185, 3866, 538, -3522, -1259, 3051, 1630, -2296, -597, 3388, 1123, -3860, -2123, 3361, 2641, -2337, -1942, 1888, 598, -3031, -867, 3325, 934, -3364, -1328, 1990, -457, -2607, 1327, 3382, -1881, -4541, 953, 3635, -1681, -3264, 2925, 3565, -4170, -4907, 3832, 5375, -3364, -4587, 4039, 4219, -5072, -4678, 5933, 6015, -4946, -5614, 4549, 4801, -4682, -3629]
2100c629R802j588j0355J233R537j157p895K422O917m285p097N037P158n137o182
2115e219N907M625p841m222R558M863j0178n357R857M435j0070l431J1430L436
2129G793j2287m306J1596M350j0393k933J0195J790j0769j515J0695J750r376
2142c410q51Q143j009p938K484Q481k618q151K681O750l694n836N449O159o465
2157A75o543O202N899o140m685P211M181q520m590Q562M801p811m235P477L211
2172E195q089k867Q204L336p476l369O211K296n536j194N576P66n366p61M351
2187A277L1l246J297L079k479l232K743L361k862k719L374K448m192k606M580
2202H54L349m119l323L433K842l303k450L460K705l100l013K166K664j551j821
$$ y = [-3629, 6173, 4585, -5770, -4537, 5000, 3843, -4052, -1630, 5287, 1002, -6095, -1058, 6100, 963, -5219, 688, 5313, -2528, -6750, 2808, 7671, -2507, -7864, 1993, 6428, -3642, -7073, 4357, 7793, -4494, -8800, 2796, 7146, -3247, -6180, 4015, 5805, -4964, -6479, 4216, 5966, -3410, -4261, 3882, 2873, -5065, -2581, 5900, 3282, -4869, -2188, 4562, 868, -4968, 481, 6640, 175, -6368, -166, 5733, -407, -5092, 2119, 6300, -2220, -6810, 1752, 6553, -1258, -5493, 1984, 5195, -2894, -5761, 2443, 5779, -1697, -5066, 1145, 3441, -2095, -3289, 2287, 3053, -2313, -3074, 1277, 1308, -1938, -641, 2438, -41, -3273, -530, 2831, -31, -2750, 624, 3072, -1120, -3726, 854, 4203, 84, -3239, 194, 3036, -267, -2717, 743, 3448, 348, -2665, -499, 2165, 614, -1207]
2217a207J338J377j260j521P80J407j36r13m51L60M36p7m32L1N47L7r80l41J027
2236B2P10p69p82M43O28j85n58j16L83N31n4q83l19J207J072j560j653J756K291
2255B164j737k945J851L517j669l993J450M361j036m526Q34M576p36m255M52M001
2271B309l26l602L81K945n49k365R23J626j448j355K140R08k683n55L176J4l827
2288b288J19M451r4m983N7N127j57n171L84N383n02n676N27N676l06n290M52M956
2306B665q34m847J226M686j175m259J272L640j543l015J944K734k429k299K771
2321E37J768k905j262L452P07m016m81M477L45m679k00M977j01n290O2N471o2
2338B800n316k09N130L6m874N3M513j60m227J16L721l93l015P72K576j324k266
$$ y = [-1207, 131, 1508, 248, -1273, -493, 914, 778, -135, -586, -226, 210, 133, -299, -268, 279, 316, -664, -1005, 22, 732, -37, -819, -376, 252, 67, -491, -607, -224, 307, 253, -630, -949, 258, 1330, -230, -1883, -127, 2164, 427, -2518, -667, 2850, 1181, -2812, -1362, 2999, 1963, -2563, -1729, 2847, 2111, -2144, -1692, 2309, 1983, -1619, -1238, 1707, 1158, -1207, -284, 1342, -106, -1461, 679, 1587, -1096, -1651, 1525, 1539, -2288, -2169, 2282, 2188, -2795, -2738, 2389, 2232, -2939, -2555, 2828, 2326, -3350, -2823, 2853, 2547, -2743, -2291, 2665, 1831, -3016, -1790, 2896, 1721, -2538, -1266, 2374, 831, -2184, -240, 2494, 65, -2234, 537, 2305, -600, -1862, 1590, 2297, -1719, -2200, 2277, 2622, -2057, -2257, 2720, 2619, -2671, -2609, 2862, 2800, -2516, -2725, 2405, 2441, -2433, -2380, 2133, 1973, -2254, -2138, 1583, 1190, -1825, -1053, 1523, 199, -2067]
2355b067J680K062j840j644K200J211k600j068L068J065l108r85L219Q59l312
2370a260n76L468N20l662n22L685N77l408n33L357M61l523m16L401N02k946p61
2387a636K714M54k268m59K019L45j771k47J313l5q25L61N85q81o29J146N99j427
2405f42n83J846O08k306r71K490J362k357j714K242J969k104k195K023K537j792
2421D13k564J252K737r21k280O76K074n52j927N02J762k40j367K90R65n73p43
2438d96R08N09j105m24J334J79j613j59J908R7k212k69K453L10k611l63K813K70
2456A529l054l99L246M54l218n38L138O84l277o72L151Q03l138p89K991P63k781
2473a107n83K488N11k371j72K146J08k011M15J845q03j822J270J889j569j933
$$ y = [-2067, -387, 1675, -165, -1809, 391, 1602, -998, -2066, 1002, 2067, -1041, -2026, 1193, 2052, -1260, -1836, 1632, 2152, -1510, -2032, 1653, 2230, -1178, -1711, 1646, 2107, -1416, -1832, 1569, 2071, -875, -1636, 1078, 1532, -736, -1195, 824, 1169, -602, -849, 464, 429, -396, -35, 550, -331, -960, 186, 785, -642, -1225, 621, 1229, -1077, -2048, 442, 1804, -553, -2267, -25, 1944, -160, -2355, -332, 2205, 413, -2151, -899, 1838, 917, -1363, -687, 1387, 835, -1092, -590, 1172, 932, -435, -145, 820, 247, -496, 412, 921, -184, -608, 726, 905, -708, -867, 1041, 1138, -1074, -1343, 1110, 1420, -1191, -1554, 1259, 1529, -1525, -1924, 1322, 1776, -1442, -1980, 1158, 1842, -1435, -2107, 1044, 1847, -1291, -2080, 911, 1674, -1107, -1690, 798, 1309, -1062, -1234, 912, 1020, -991, -576, 1269, 466, -1356, -86, 1803, 234, -1699]
2489a699J984K037k302k173K452K463k598k624K559K772k657k755K439K767k411
2504B54k842K407K574k201k505K108K211k132j943K058J806k205j453K063J322
2519A522k221j177K350R44k326p96K434O45k472l92K506K46k627j5K764j44k730
2536a489L04K920m12l113M89L291m81l291L61L620n23l479K86L525j23l465J11
2553a469L259j2l039j10K884l8k669J75K354m35k113O17J877r22j875J273J714
2570A471j610j832J918J938k239k101K421K142k549k252K689K499k641k606K645
2585a07K645k656k467K600K479k490k379K469K251k373k064K520J743k478j572
2600a879K552J384k493j252K664Q93k761o44K841M67k805l37K866j9k942K23L073
$$ y = [-1699, 285, 2322, 20, -2153, 299, 2762, 164, -2460, 99, 2871, 214, -2541, -102, 2665, 254, -2588, -181, 2393, 192, -2313, -205, 2006, -126, -2069, -11, 1795, -410, -1863, 200, 1522, -699, -1876, 474, 1418, -908, -1704, 730, 1375, -1097, -1489, 1017, 1263, -1364, -1379, 1385, 1241, -1489, -1185, 1735, 1323, -1790, -1301, 1990, 1509, -1782, -1421, 2199, 1676, -1803, -1517, 2008, 1885, -1580, -1469, 1790, 1778, -1261, -1371, 1513, 1475, -1194, -1019, 1335, 900, -1213, -596, 1281, 359, -1516, -243, 1471, -139, -1971, -53, 1885, -354, -2455, -34, 2108, -441, -2693, -4, 2495, -146, -2752, -107, 2538, -118, -2585, 15, 2494, 4, -2375, 94, 2345, -28, -2092, 428, 2171, -307, -1879, 673, 2057, -436, -1688, 976, 1869, -892, -1536, 1305, 1772, -1033, -1370, 1496, 1477, -1465, -1242, 1831]
2617A831m27l280M65L381o56l420Q11L413j009l609J050L680r62l585Q43L340
2633A866r56l127R21L203r03k910Q17K430q42k127J275J843j455j635J589J535
2649A524j704j199K027J050k389j002K675J177k636j229K548J062k502j106K679
2664I75J220k575j320K229J193k095j022J951R39j881r52J688P10j317o17J220
2680C46K89j268l16J383L22j202l15R46K9r34J91J107j98j168P2R73J3q09K63
2699b76R51m73j191K66J504K3j376j31J334Q0j373m7J685M12j792p88J530R73
2717A311j262q45J235P88j317r62J215J130r62j063P26N45o28m49R65K61j056
2734c68l04Q67rq87L31J282m25j724L28J726l05j706O24J792p71k241O63K445
$$ y = [1831, 1404, -1876, -1411, 1970, 1314, -2106, -1295, 2118, 1109, -2500, -1450, 2230, 1268, -2317, -1474, 1866, 910, -2217, -1296, 1907, 1004, -1906, -1089, 1341, 499, -1628, -353, 1490, 35, -1600, -11, 1524, -180, -1379, 648, 1698, -691, -1693, 982, 2159, -477, -1706, 842, 1904, -598, -1704, 975, 2195, -380, -1700, 529, 1722, -373, -1395, 556, 1495, -386, -1338, 350, 1060, -257, -874, 346, 635, -633, -949, 434, 756, -446, -761, 185, 214, -720, -529, 578, 380, -788, -716, 257, 270, -539, -276, 675, 202, -989, -723, 781, 804, -572, -703, 631, 711, -662, -709, 976, 1388, -404, -1192, 338, 1311, 49, -796, 439, 1227, -90, -1052, 163, 1293, 331, -732, -6, 539, -89, -538, 427, 688, -368, -672, 195, 186, -701, -370, 912, 487, -1237, -909, 817, 512, -1194, -570, 1222, 451, -1790, -1127, 1318]
2752A318l39k238L09J983n63j957Q86K151n43k286K70J942l03j498P38J613j034
2769D49j780Q98J692n24j227O61O98j155o24J397P84j243o67R90K36j264J03J793
2787A217k4k251k06J992J71k046J74K259j96k545j51K324M96k021l77J776K01
2804G93j711k93J625N00j189m65O80L1l05L47N52m52m96M91J63q04J48J379k8
2823I66j694k96J582M76j307l99J503K53j652m82J671Q29j382r81J022O86r36
2840a41n12J017N94r19q37N86N99k65l04N1J67j63p0Kk8K01Q6j82m33P7P69O4
2862C59q31k40Q56M03r95l91J056Q22j014j057Q14J137m81j215M00J283j79j393
2880f66Q7J394R7j244l95J001N25p16l51N33K73n35k92M65J32j53N5o8n02KP68
$$ y = [1318, 979, -1259, -950, 1033, 470, -1487, -601, 1550, 1007, -1279, -1009, 933, 630, -868, -130, 1483, 449, -1331, -433, 1259, 735, -492, 169, 867, -288, -912, 485, 1269, 26, -641, 349, 585, -679, -576, 1217, 1193, -1058, -1264, 728, 899, -1147, -973, 1286, 1090, -1455, -1606, 718, 1214, -807, -1184, 592, 793, -918, -1211, 414, 914, -275, -740, -60, -29, -334, 13, 565, 113, -383, 108, 271, -533, -385, 994, 966, -728, -1024, 558, 1034, -273, -672, 831, 1084, -568, -1050, 621, 1450, 68, -913, 109, 795, -141, -653, 364, 958, 39, -798, -212, 387, 122, -182, -131, 36, -127, -197, -195, -223, -22, 64, -118, -551, -474, 295, 359, -472, -712, 144, 547, -448, -839, 217, 1039, 25, -1032, -218, 919, 438, -777, -377, 906, 727, -666, -579, 815, 912, -332, -727, 274, 799, 83, -268, 265, 538, 3, -289, 176, 308, 155, 210, 142, -360, -358, 410]
2901D10J15q26k95Q95J32j073j34J434J96j574n63J526O04j395n02J604L03j836
2919i79n19J993P13j754o31J668K80j569k70J840M19j682m77J398K94j132K08
2936b00J115m07j184M38R97n81n93J070M63j645p57J874R80j922r36K091P94k497
2954i00r94K748J374k738j622K401J384k119j216K195J249k236j349J803J126
2969A106j373n73J245M1j383J54J437k80j233P56R76j247j195J643J612j667j660
2986a641J726J568j985j421K322J760k401k059K190J955j906j690J935J770k201
3001g8j802J944J823j528j527J175J140j293q01J257O92j161n55R49j05p61N12
3018a19J084r18j351R42J447j170j431J394J738j617k104J554K318j208k354J020
$$ y = [410, 525, -301, -596, 299, 431, -642, -776, 658, 854, -720, -1283, 243, 847, -548, -1050, 554, 857, -979, -1498, 495, 1208, -546, -1177, 491, 771, -798, -1068, 772, 1191, -491, -968, 430, 724, -408, -200, 915, 508, -676, -238, 759, 178, -415, 655, 1118, -527, -1284, 590, 1570, -352, -1288, 803, 1597, -900, -1894, 854, 2228, -510, -2132, 269, 1653, -466, -1682, 513, 1762, -474, -1823, -20, 1106, -267, -840, 405, 446, -937, -783, 654, 374, -859, -103, 873, -374, -1569, 74, 1686, 19, -1641, 85, 1653, -332, -1753, 569, 2329, -72, -2131, 59, 2014, 108, -1582, 353, 2123, -78, -1880, 64, 1887, 359, -1168, 7, 1147, -146, -947, 310, 1002, -159, -714, 235, 130, -631, -119, 965, 47, -1304, -362, 1085, -85, -1516, -122, 1616, -1, -2105, -551, 1767, 559, -1795, -775]
3034g75K321r86k248Q65K308n58k158K22J871p3j469K24J239j94j070N5Q70j9
3052D25m92L13J79o30r7P24K69q70j96R28K8j167QJ335J80j530l23J409L84j461
3072e84l97J613M02j785o53J686Q32j547j035J535J028j447j136J335J416j230
3088C3j462J011J400p38j265P24J171n46j060L78Q70j62o00L49J75m36J0O31k71
3107B12p11N14R72o48j296P10J589o16j925N55K071m71k189L21K381k54k457l5
3125a277K446R4k352j79K085L59k129l44J916L43j678l62J503J59j248n5J174
3142D55j44j036L34Q18m80o25P87N99r54o08J114O55j414n02J640O54j834p12
3160a253J904R69k034j124K105J300k100j305J957J467j800j694J629J580j266
$$ y = [-775, 1546, 560, -1688, -823, 1485, 927, -1231, -1009, 862, 789, -680, -456, 783, 589, -481, -426, 444, 425, -67, 246, 425, -205, -302, 422, 691, -179, -375, 553, 581, -586, -578, 757, 937, -593, -916, 493, 877, -584, -981, 632, 1034, -751, -1404, 282, 1114, -433, -1468, 67, 1095, -352, -1488, -153, 1263, 33, -1429, -418, 982, 244, -1021, -297, 874, 328, -732, -354, 516, 354, -246, 103, 278, -158, -148, 483, 212, -499, 15, 987, 339, -957, -247, 1342, 726, -1199, -644, 1427, 956, -1233, -912, 1469, 1215, -1242, -1277, 1169, 1263, -1089, -1268, 817, 1176, -953, -1297, 619, 962, -716, -1078, 425, 584, -664, -719, 455, 311, -725, -391, 427, -53, -678, 109, 708, -246, -854, 260, 915, -499, -1001, 639, 1293, -541, -1253, 651, 1620, -414, -1538, 567, 1867, -233, -1538, 419, 1886, 86, -1608, 21, 1601, 335]
3175C35j619J127J359q54j250O17R64n04o12L15M37n52oN03j91p15M81Q42p13
3194c6r53P10J173p80j379P74J527o56j693O46J680l97j817L18J871k02j729J00
3212h43J738L3j660j4J545Q2j368j80J298K18j166j62J000J41q11j25O18J08n75
3231a23J08L25k48k44M61K9p01r2Q81R4j067k68J315L87j490o02J520Q68j591
3250d38j012J479J207j411j319J263J448j060j417Q87J362n26j445N46J167l55
3266C76r69L78P76l15n07K72K67l63o5O08j25p57L04R32m35j042M70J176n16j343
3286h78N44J461m69j566M17J568m42j637L61J662l58j705L27J563k89j495J93
3303g43J441j74j391J44J205m0r92rQ45j20n85J79M57l05j63M86j03o17J35J008
$$ y = [335, -1284, -157, 1202, 348, -902, -285, 679, 175, -437, -122, 315, -237, -243, 260, 69, -646, -165, 677, -36, -989, -279, 894, 114, -1265, -491, 1036, 380, -1313, -667, 1013, 616, -1201, -883, 988, 786, -943, -843, 895, 928, -732, -746, 799, 881, -487, -667, 631, 849, -317, -479, 521, 662, -149, -274, 344, 452, -123, -15, 310, 62, -182, 279, 308, -393, -485, 396, 490, -577, -845, 470, 857, -633, -1235, 285, 1153, -438, -1450, 29, 1236, -175, -1494, -231, 1217, 157, -1260, -373, 989, 463, -982, -436, 731, 376, -593, -215, 561, 246, -261, 11, 278, -85, -150, 458, 333, -424, -120, 812, 377, -665, -195, 981, 465, -878, -334, 1127, 658, -908, -491, 1077, 635, -1002, -641, 1021, 663, -1042, -715, 848, 559, -936, -743, 698, 524, -867, -723, 482, 442, -550, -559, 286, 166, -419, -240, 217, -88, -251, 235, 132, -485, -350, 658]
3323F58k44j094K53J304k16j543J94J729k3j776j24J747K09j569k94J456L82j442
3341c93m30J179N43r33m66O43K13n08q9L97o7k43J73K2m01J2O93kq64K0Q44r8
3363B45r37J01J141l2j358j0J283J29j082k19J256J13j259k23J215N15r79m56
3381e57P21L13o06k09N68L18k74l59n4O7K17M01j79n83J45M61j33p72L89J065
3401I39l75j308QJ261L33j228k98J109J95j224k60J137N75r08p57N92M35l80j89
3420c43L35K47l53l42J64K34P1J60L3n33j45M09K31k01j07M14R9o71k40P16M85
3441F63m90l94M18K04n79j96P93N49p65o96L52N99k77m69N00N08n07r49K66J012
3461E42R1p06k42M31n6m75J47O55J10o44n05L17K62J50K5M4l77j69K47O7q3M8
$$ y = [658, 414, -680, -427, 877, 661, -882, -688, 1041, 1018, -758, -882, 865, 1074, -495, -789, 667, 1049, -393, -823, 356, 899, -34, -500, 143, 356, -152, -241, 156, 89, -154, 19, 41, -360, -348, 345, 343, -521, -501, 343, 245, -692, -591, 550, 518, -840, -850, 433, 562, -520, -739, 517, 630, -629, -852, 363, 878, -101, -557, 164, 477, -129, -338, 230, 548, 274, -85, -139, -72, 145, 546, 367, -216, -71, 390, 257, -515, -126, 939, 564, -744, -736, 525, 858, -370, -668, 441, 636, -588, -848, 289, 864, -44, -801, -209, 226, -154, -343, -8, 239, -114, -456, -292, -58, 13, 173, 206, -327, -472, -63, 168, -33, -140, 274, 373, -298, -538, 178, 663, 173, -221, 197, 401, -178, -374, 419, 968, 203, -493, -141, 458, 181, -288, 212, 720, 213, -736, -470, 542, 633, -73, -315, 116, 60, -415, -268, 387, 497, -147, -652, -335, -73, 77, 102, 146, -231, -400, -153, -86, -169, -121]
3483a21M83k18p09j36R09M71q12l97P83L01r54m90J280P63j014r52P67P82p16
3502B0n86R49P10j050r01P92Q22m31n37N40J65p82l25Q14N19o92k81L89j09o33
3522f07L07J001l03j066J76Q73l90p57P80J040r21j419O71J551m74j374N35J278
3540I01p51j412O92J608l07j492K77J004k95q74N02R07l86p76K13N26m25j35P47
3559E24J73r48l28R34K13q79L1J114j68j433q8J471M01j279l20J026J00j249m4
3578g49J352J89j179m35Q03K94o23M9Q01j78r47q2Q18J34n64K02N27m92o31M47
3598b64P30k49n96L11M07n67l18P33N13n72n76M95M09o52j89Q05M44q76o22O38
3618DN94n08l22N95L19p74n58O02O26l04m57J91K27l61k80M53L20k18k64J1j05
$$ y = [-121, 362, 144, -565, -701, 208, 679, -133, -530, 253, 554, -400, -890, 390, 1153, 139, -813, -46, 736, 20, -566, 383, 1093, 43, -858, -66, 756, 325, -212, 328, 493, -289, -614, 200, 719, 27, -254, 135, 26, -607, -300, 701, 398, -668, -492, 381, -9, -766, 14, 1054, 133, -1286, -615, 936, 462, -912, -377, 901, 150, -1262, -570, 1038, 731, -761, -484, 520, 225, -649, -147, 760, 374, -402, -189, 337, -88, -223, 524, 697, -251, -579, 355, 568, -311, -280, 834, 666, -767, -855, 616, 1017, -262, -582, 444, 544, -705, -749, 603, 792, -387, -822, -19, 275, -348, -299, 502, 324, -623, -705, 113, 247, -317, -115, 412, -80, -711, -264, 466, 217, -379, -68, 339, -228, -546, 187, 700, 128, -448, 47, 456, -196, -385, 420, 864, -12, -634, 4, 598, 90, -232, 363, 682, -92, -650, -48, 578, 274, -183, 8, 235, -126, -406, 47, 367, 149, -115, -104, -209]
3639b09n8J82L52j17m66J2L01j14k52L34M34k59o97J22N53M9l59L5M40q2o33j2
3661d44P30L08m72l92L84J44m76J2N42K89n64m09K70L55k01m6K41P4l41l29K37
3682h8L53m9r8L4k48k50J98K76P9l07J32P8m05k19M44N87l77n75J07N46k79m13
3704d74K38P69j64r94NP85K34o27o2N49Po30j18O84L54l69k90N9M7j38K06L28
3726C99q0l18O6Lk33P9N26J61n86m28L81M49m23k34N30K81p71n89P24P04m63o35
3748d57L58M27n54m45O27N33l30p07K11M10j68k72L66L17l81m31K34M12j22j21
3768i3J83J7l77kL75J45k16lK85l28l45K60O54j68o27N5N43r0o21K03Q25r0q74
3791b89k03Q12K26o68j04M97R5n79j80M14L25k91k19Q3j7q4Q9J14o8q8R5n1k38
$$ y = [-209, -267, -85, 267, 150, -316, -304, -3, -117, -369, -35, 399, 140, -557, -435, 118, 167, -192, -157, 283, 201, -432, -444, 286, 594, 122, -270, 114, 258, -218, -206, 336, 625, 61, -348, -78, 277, 76, 30, 271, 345, 4, -325, -88, 265, 216, 118, 152, -96, -346, -148, 128, 207, -100, 32, 110, -295, -514, -70, 517, 140, -435, -328, 218, -61, -474, -236, 533, 369, -625, -620, 165, 399, -228, -290, 259, 266, -364, -482, 202, 556, 187, -103, -44, 3, -135, 71, 399, 319, 1, 67, 70, -163, -84, 442, 603, 17, -411, -30, 419, -4, -238, 292, 573, -198, -787, -63, 641, 178, -457, -99, 328, -226, -671, -44, 489, 159, -548, -337, 73, -95, -367, -1, 316, -65, -496, -262, 150, 28, -93, 90, 107, -270, -272, 103, 248, 32, 29, 314, -14, -359, -99, 555, 387, -240, -185, 358, 268, -353, -150, 675, 585, -289, -492, 320, 546, -122, -226, 271, 366, -213, -393, 21, 346, 55, -164, -81, -98, -182, -93, 21, -47, -135, -40, -91, -329]
3814c29J19L58M4m54j14M06J88m94N0M22R6n83r7N02K51k82l27L45J88l56k22
3835b89L86K78k05k50N2K33L1j89l6K19qj64j35J20J58O1k71j87K44K31k81k51
3857b53K53K70j93m43J24L86O7m36j13L47K14l87k00K33K80j09k44j4K20P2r1
3878a7k18J21L39o6l40L0K92K52m65k87M62K91k61l60K37M48k09n16K18M77j65
3899B63l77J6M32pm03l3K89Q7k70j63J79J44j35j21k3J19J30k03r2J6J96K7k47
3922a76j45L26J53k71l66M15M20m22m69L75N59k56o66J93O14J9o24n6N59K30n01
3943h9l13L93L50j71l43L1M16K7l42j13J92L44j45m34O4M10J01m40k12L30L61
3964D17k76m86K19M37j12m71j5L78J69l72l06L75K96k68l92J29M33n4l78n2M15
$$ y = [-329, -210, 148, 192, -262, -376, 30, 218, -276, -226, 196, 292, -291, -388, 114, 365, 83, -244, 101, 289, -67, -289, 97, 375, 170, -80, -28, 205, 236, 47, 11, 230, 222, 58, -77, 43, 201, 262, -9, -196, 48, 279, -2, -253, 0, 270, 77, -366, -242, 144, 211, -225, -338, 9, 223, -164, -364, -131, 149, 40, -204, -218, 2, 74, -17, -235, -114, 225, 159, -181, -151, 141, 393, -72, -359, 103, 394, 133, -227, 10, 458, 249, -267, -49, 428, 263, -114, -98, 334, 327, -76, -109, 180, 267, -3, -166, 13, 157, 22, -99, -122, -3, 127, -76, -168, -152, 44, 71, -176, -321, 5, 158, -113, -479, -64, 356, -66, -535, -160, 399, 143, -523, -330, 284, 303, -321, -377, 182, 412, -89, -402, -9, 341, 170, -173, -142, 274, 301, -41, -154, 38, 382, 237, -197, -133, 277, 378, -62, -274, 56, 417, 141, -345, -126, 311, 199, -272, -287, 91, 260, -112, -418, -43, 253, -15, -407, -278, 155, 101, -277, -329, 86]
3985H6J35m65k07M14K44k70l42K93M17k21l82K02M17j45l31qL67j7k31j19K62
4006I9R1p7j33L7P5J25j3l04OL13Q0l97k25N59J57m86m05N72M37m74o40M34O15
4029D46l69p41M70N75j55p43J62O79j64n33N5M82Km10o7L53N7j87m1J03L4m3J03
4052F8r4j76J97K74k62k25J82L66j78n10L01N59j99o78J66P79j71q29J27Q17L3
4073E47q83m7P90J95p27l53O59M24o53m60M97L95k37n08J02M06j4l46j44K90J57
4094I0n7j94j02K19K13j59l34J2N11J6n25j83O15L62n13m89M47O58l16p81K59
4115b51Q31r7q97l3Q89J45q07j59P41K32o71m35O70M63o19l41M14K95l47k71K61
4136A3K50k90j38K07k6j27J07R3k25j15K91J32m36j73N55K43o52l11P67L70p23
$$ y = [86, 221, -244, -451, -37, 207, -63, -405, -112, 305, 84, -298, -96, 321, 176, -155, -163, 204, 187, -44, -163, 99, 190, 113, -20, 17, 92, 217, 204, -100, -94, 219, 299, -98, -323, 236, 393, -93, -498, 74, 511, 37, -603, -169, 446, 77, -664, -194, 381, 226, -517, -355, 324, 160, -373, -318, 164, 166, -244, -311, 42, 99, -88, -129, -26, 8, -35, 68, -26, -202, -5, 269, 7, -218, -36, 330, 152, -358, -57, 502, 303, -375, -209, 570, 399, -430, -303, 514, 547, -336, -383, 407, 602, -125, -478, 181, 605, -48, -508, -11, 384, 147, -361, -259, 147, 133, -213, -357, -67, 90, 33, -161, -263, -44, 169, 10, -324, -312, 199, 215, -310, -493, 122, 484, -29, -518, -71, 587, 271, -510, -251, 580, 483, -414, -447, 442, 587, -220, -379, 362, 594, -77, -512, 158, 621, 2, -339, 75, 370, 23, -248, 13, 263, -27, -165, 42, 16, -111, -4, 89, -136, -251, 40, 172, -264, -437, 118, 361, -291, -602, 165, 535, -188]
4157a88n74Q12O47q38o32P96P79p48q40O50R12n56q01M53P10l82o51L64N86k78
4177B21m34J61L07k56m9L16j02l59Q5N22k86m36L45N54m41o92M20Q10n16q54M79
4198b05Q48m40r66M19R76m46r37L88Q90l29p97K05Q22j77p46J30O70m4n65L9M54
4219A89n6l49J06K01qqJ34k05k57L03L64l25l98L62M47m29n76L99Q93m12r45J13
4241d57R67oq81QQ42L6q64j80P42L43n88l51K82L05j71k36O3J89N1j12k12k0L70
4264A20Q5k98k83L16K41j76m44K54N65j80o24J04O06Nn00L5M34P8n25j71N57K17
4286D16l02k72J37K37n3l16J94K30L2l53k10L13L15j83l82P3L17l6l46p8M30J74
4308C37m80k63L62L84k93m06K02L23o7l97L6L46J20l29k44K75K37ml51q7L62J45
$$ y = [-188, -762, 50, 697, -141, -773, 23, 802, 54, -786, -136, 776, 220, -581, -128, 582, 200, -451, -87, 499, 221, -213, -52, 255, -1, -50, 266, 164, -195, -110, 412, 126, -310, 35, 589, 148, -544, -124, 686, 170, -684, -205, 643, 203, -763, -344, 632, 186, -751, -363, 527, 198, -599, -394, 428, 251, -495, -365, 305, 261, -304, -265, 189, 133, -216, -110, 91, 83, 75, 209, 4, -253, 50, 414, 89, -309, 53, 500, 71, -505, -106, 787, 375, -570, -457, 510, 504, -377, -369, 473, 509, -355, -535, 207, 550, -38, -389, -107, 198, 27, -209, -146, 43, 94, -18, -230, -250, 120, 205, -93, -376, -60, 181, 5, -439, -185, 380, 200, -424, -320, 286, 291, -209, -174, 260, 338, -187, -358, 199, 416, 114, -158, -21, 216, 163, -153, 41, 271, 303, -50, -260, 53, 368, 185, -197, -124, 193, 157, -189, -267, 163, 337, -143, -406, -44, 340, 47, -359, -157, 166, 99, -298, -262, 84, 204, -125, -369, -94, 143, 139, -212, -299, 63, 208]
4330B08k99k16K67L77j89m12R4N11m2n17k4N05J92n47k58M72L46m33k42K54L06
4351C53k33l02J63M20k12l78L8K50J20k00j11J40J8o9r0k7R2J32j32k35J20K64
4373A21k2l94RL41J11m18r9L74L11m58k91M32L16l25l80J68N34j39n32R7N02J06
4395C64m55j99M35J53k23k56K14K93j34k00q1J53J17n0j28r8K83nk34j51K30K45
4417B73j62l25Q8L18p4l45N6L80L7m92r0L63K09l88j49K48J97j72k40J52L16j52
4439D8l66J37L63l1k66j23L97N3k18j67J38K95j49l21J88K17jk16m0J62J56r9
4461A57k73J4L32j2k09k01K24K73j15l91J5M24l6l64j36M44J97l80l75L55M34
4482C77l53m45K44M38j18m94O4L94R9m80oL32J49l17j12K25J36j71j05J36J00
$$ y = [208, -91, -307, -40, 337, 148, -264, -170, 341, 299, -218, -242, 263, 455, -92, -350, 122, 468, 35, -207, 47, 353, 120, -182, -19, 401, 189, -189, -151, 99, 219, 19, -92, 48, 66, -3, -93, -120, -28, 104, -28, -263, -143, 121, 99, -295, -286, 55, 166, -252, -351, 23, 334, -124, -415, 17, 333, 8, -372, -204, 330, 191, -341, -244, 258, 364, -91, -290, 145, 298, 75, -181, 33, 326, 192, -8, -89, 64, 181, 131, 3, -95, 188, 183, -51, -202, 28, 273, 111, -214, -126, 192, 118, -227, -171, 209, 246, -246, -336, 27, 236, -152, -301, -53, 144, -28, -268, -116, 200, 48, -318, -181, 182, 151, -115, -238, 159, 212, -6, -173, -35, 260, 111, -210, -22, 195, 194, -22, -62, 100, 256, 157, -116, -102, 230, 218, 9, -192, 32, 305, 190, -201, -186, 238, 202, -162, -298, 146, 343, -37, -412, -57, 377, 24, -421, -177, 261, 143, -351, -287, 107, 206, -274, -280, 52, 201, -116, -228, -3, 133, -38, -143, -7, 93]
4503I3j11k6M4K0k2N1O4j42L1K10l5l09O6K76R8m38p3N15K5m87o7M98P2m61k06
4528c14M88K41m87l58M72L19m07l27L34L16l17l22L15K27k31j73J71Q1j52mJ88
4549F0m2k11J20K21k42k51L91K48l04k70K58L69k57m01L14M07k94l96J52N10k19
4570A63m48K21N02k49m89K75L67j24l59J10L30j80l13P7K47j8l21J68K62k37p6
4591i2P8J08j16j04P9k0j01pK68l9l37Q6M05j43m19R8M43Nn47RM82J59n03q3M56
4616A65J36l38k36L46J82j66l23K23L00p4k66M0J87kk16N0Q9l5k3J6j1n9J46j2
4640A19j30j33J36K39k57k48K02K93j58l75J18L50o2l38j0M60p6m28o6M37J14
4661A87m21p8L88P9l03r6K63J43k32o5J53J17j79r1K04N7j37Q1J08n9j30J02P7
$$ y = [93, -18, -44, 0, 20, -2, 49, 113, -29, 2, 212, 177, -132, -66, 210, 308, -130, -203, 312, 337, -150, -217, 281, 353, -108, -314, 174, 415, -72, -430, 42, 361, -46, -373, -39, 277, -40, -362, -47, 180, -51, -224, -53, 28, -124, -128, 60, 18, -193, -73, 148, -94, -345, 46, 294, -10, -280, -22, 347, 90, -311, 3, 410, 116, -280, -128, 382, 163, -285, -64, 438, 189, -300, -25, 342, 218, -141, -31, 299, 119, -194, -117, 130, 112, -209, -41, 221, -16, -92, -14, 94, -22, -126, -47, -67, -168, -175, 93, 54, -283, -197, 208, 65, -354, -256, 187, 192, -355, -346, 136, 295, -208, -291, 165, 301, -37, -273, 73, 255, 89, -234, -11, 289, 215, -51, -11, 176, 174, -42, 8, 97, 62, 39, 55, 44, -15, 131, 119, -11, -144, -8, 231, -26, -274, -72, 221, 63, -312, -194, 156, 94, -244, -254, 206, 130, -298, -364, 73, 187, -234, -312, 76, 155, -148, -244, 19, 162, -70, -135, 18, 135, -44, -135, 69, 126, -11, 70, 178, 119, -11, 91, 168]
4684A68j96j62K73K03k61k39L14K57l28m09N00K47l20l51L83J60j79l65K05L63
4704B63j67l46J54K46p6k87R1J59j09j47J68O4j91LK85o0l18J22K23rk44P0K92
4727A86r5k69J24J96Jl01N6K44L9k60O5J98j5k86R8K50r4j57J2J14K5j35qJ61
4751A49M3j38j33Q9R4k1r8j0N5N6j34r3N1J17Rk35P3J11Rq2j23J48O0p4m7M2J40
$$ y = [168, -28, -190, 83, 286, 25, -214, 100, 357, 29, -380, 120, 367, 47, -304, 79, 239, 60, -305, -100, 263, 96, -250, -96, 150, 74, -213, -122, 37, -72, -219, -51, 13, -178, -175, 110, 50, -268, -146, 77, 68, -176, -106, 186, 91, -178, -54, 142, 143, -158, -102, 142, 181, -79, -14, 184, 169, -117, -19, 231, 137, -20, -8, 106, 131, -4, -12, 149, 192, 54, -79, 10, 104, 83, -15, -25, 30, 86, -48, -141, -90, 27, 36, -199, -126, -15, -6, -88, -211, -63, -3, -77, -124, -82, 58]
$$ [...]
8191A4
##END NTUPLES=NMR FID
##END=
