##TITLE=1H_ABC0107
 CDCl3, 8 sc, 
 2.7.2019
##JCAMPDX= 6.0         $$ Bruker NMR JCAMP-DX V2.0
##DATA TYPE= NMR FID
##DATA CLASS= NTUPLES
##ORIGIN= UXNMR, Bruker Analytische Messtechnik GmbH
##OWNER= root
$$ XWIN-NMR		Version 3.5
$$ Tue Jul  2 13:46:09 2019 Russian Standard Time (UT+4h)  she@DPX200
##.OBSERVE FREQUENCY= 200.13155
##.OBSERVE NUCLEUS= ^1H
##.DELAY= (6, 6)
##.ACQUISITION MODE= SIMULTANEOUS
##.ACQUISITION SCHEME= undefined
##.AVERAGES= 8
##.DIGITISER RES= 18
##SPECTROMETER/DATA SYSTEM= spect
##.PULSE SEQUENCE= zg30
##.SOLVENT NAME= CDCl3
##.SHIFT REFERENCE= (INTERNAL, CDCl3, 0, 15.7039)
##AUDIT TRAIL= $$ (NUMBER, WHEN, WHO, WHERE, WHAT)
$$ ##TITLE= Audit trail, XWIN-NMR		Version 3.5
$$ ##JCAMPDX= 5.01
$$ ##ORIGIN= Bruker BioSpin GmbH
$$ ##OWNER= she
$$ F:/spectra/data/she/nmr/H-F/1/audita.txt
$$ ##AUDIT TRAIL=  $$ (NUMBER, WHEN, WHO, WHERE, WHAT)
(   1,<2019-07-02 13:44:42.26 +0400>,<she>,<DPX200>,
      <created by zg, POWCHK disabled, PULCHK disabled
       configuration hash MD5:
       00 E9 B6 7A A2 85 ED C7 34 08 36 98 17 FE 4E 26
       data hash MD5: 16K
       D4 AC AA A2 6A BF 80 C2 CD 28 41 23 72 1F 31 DA>)
$$ ##END=
$$ 
$$ hash MD5
$$ 79 55 E4 4F D5 59 DB 60 73 AB A8 6C FD BE 27 73
##$RELAX= 
##$RELAX= 
##$RELAX= 
##$RELAX= 
##$RELAX= 
##$RELAX= 
$$ Bruker specific parameters
$$ --------------------------
##$DU= <F:/spectra>
##$EXPNO= 1
##$NAME= <H-F>
##$PROCNO= 1
##$TYPE= <nmr>
##$USER= <she>
##$AMP= (0..31)
100 100 100 100 100 100 100 100 100 100 100 100 100 100 100 100 100 100 
100 100 100 100 100 100 100 100 100 100 100 100 100 100 
##$AQSEQ= 0
##$AQ_mod= 1
##$AUNM= <au_zg>
##$AUTOPOS= <>
##$BF1= 200.13
##$BF2= 200.13
##$BF3= 200.13
##$BF4= 200.13
##$BF5= 200.13
##$BF6= 200.13
##$BF7= 200.13
##$BF8= 200.13
##$BYTORDA= 1
##$CFDGTYP= 0
##$CFRGTYP= 5
##$CHEMSTR= <none>
##$CNST= (0..31)
1 1 145 1 1 1 1 1 1 1 1 1 1 1 1 1 1 1 1 1 1 1 1 1 1 1 1 1 1 1 1 1 
##$CPDPRG= <>
##$CPDPRG1= <>
##$CPDPRG2= <>
##$CPDPRG3= <>
##$CPDPRG4= <mlev>
##$CPDPRG5= <mlev>
##$CPDPRG6= <mlev>
##$CPDPRG7= <mlev>
##$CPDPRG8= <mlev>
##$CPDPRGB= <>
##$CPDPRGT= <>
##$D= (0..31)
0 1.2 0 0 0 0 0 0 0 0 0 0.03 0 0 0 0 0 0 0 0 0 0 0 0 0 0 0 0 0 0 0 0 
##$DATE= 1562060681
##$DBL= (0..7)
120 120 120 120 120 120 120 120 
##$DBP= (0..7)
150 150 150 150 150 150 150 150 
##$DBP07= 0
##$DBPNAM0= <>
##$DBPNAM1= <>
##$DBPNAM2= <>
##$DBPNAM3= <>
##$DBPNAM4= <>
##$DBPNAM5= <>
##$DBPNAM6= <>
##$DBPNAM7= <>
##$DBPOAL= (0..7)
0.5 0.5 0.5 0.5 0.5 0.5 0.5 0.5 
##$DBPOFFS= (0..7)
0 0 0 0 0 0 0 0 
##$DE= 6
##$DECBNUC= <off>
##$DECIM= 24
##$DECNUC= <off>
##$DECSTAT= 4
##$DIGMOD= 1
##$DIGTYP= 9
##$DL= (0..7)
0 120 120 120 120 120 120 120 
##$DP= (0..7)
150 150 150 150 150 150 150 150 
##$DP07= 0
##$DPNAME0= <>
##$DPNAME1= <>
##$DPNAME2= <>
##$DPNAME3= <>
##$DPNAME4= <>
##$DPNAME5= <>
##$DPNAME6= <>
##$DPNAME7= <>
##$DPOAL= (0..7)
0.5 0.5 0.5 0.5 0.5 0.5 0.5 0.5 
##$DPOFFS= (0..7)
0 0 0 0 0 0 0 0 
##$DQDMODE= 0
##$DR= 18
##$DS= 0
##$DSLIST= <SSSSSSSSSSSSSSS>
##$DSPFIRM= 0
$$ [...]
##$SUBNAM2= <"">
##$SUBNAM3= <"">
##$SUBNAM4= <"">
##$SUBNAM5= <"">
##$SUBNAM6= <"">
##$SUBNAM7= <"">
##$SUBNAM8= <"">
##$SUBNAM9= <"">
##$SW= 24.9336996594482
##$SWIBOX= (0..15)
0 0 2 0 0 0 0 0 0 0 0 0 0 0 0 0 
##$SW_h= 4990.01996007984
##$TD= 16384
##$TD0= 1
##$TE= 0
##$TE2= 300
##$TE3= 300
##$TEG= 300
##$TL= (0..7)
0 120 120 120 120 120 120 120 
##$TP= (0..7)
150 150 150 150 150 150 150 150 
##$TP07= 0
##$TPNAME0= <>
##$TPNAME1= <>
##$TPNAME2= <>
##$TPNAME3= <>
##$TPNAME4= <>
##$TPNAME5= <>
##$TPNAME6= <>
##$TPNAME7= <>
##$TPOAL= (0..7)
0.5 0.5 0.5 0.5 0.5 0.5 0.5 0.5 
##$TPOFFS= (0..7)
0 0 0 0 0 0 0 0 
##$TUNHIN= 0
##$TUNHOUT= 0
##$TUNXOUT= 0
##$USERA1= <user>
##$USERA2= <user>
##$USERA3= <user>
##$USERA4= <user>
##$USERA5= <user>
##$V9= 5
##$VALIST= <valist>
##$VCLIST= <CCCCCCCCCCCCCCC>
##$VD= 0
##$VDLIST= <DDDDDDDDDDDDDDD>
##$VPLIST= <PPPPPPPPPPPPPPP>
##$VTLIST= <TTTTTTTTTTTTTTT>
##$WBST= 1024
##$WBSW= 4
##$XGAIN= (0..3)
0 0 0 0 
##$XL= 0
##$YL= 0
##$YMAX_a= 161135
##$YMIN_a= -159309
##$ZGOPTNS= <>
##$ZL1= 120
##$ZL2= 120
##$ZL3= 120
##$ZL4= 120
##$ABSF1= 10
##$ABSF2= 0
##$ABSG= 5
##$ABSL= 3
##$ALPHA= 0
##$AQORDER= 0
##$ASSFAC= 0
##$ASSFACI= 0
##$ASSFACX= 0
##$ASSWID= 0
##$AUNMP= <proc_1d>
##$AZFE= 0.1
##$AZFW= 0.1
##$BCFW= 1
##$BC_mod= 2
##$BYTORDP= 1
##$COROFFS= 0
##$CY= 11.3945322036743
##$DATMOD= 1
##$DC= 2
##$DFILT= <>
##$DTYPP= 0
##$F1P= 18.9103706918063
##$F2P= -1.10871071338519
##$FCOR= 0.5
##$FTSIZE= 0
##$FT_mod= 4
##$GAMMA= 1
##$GB= 0.15
##$INTBC= 1
##$INTSCL= 1
##$ISEN= 128
##$LB= 0.24
##$LEV0= 0
##$LPBIN= 0
##$MAXI= 10000
##$MC2= 0
##$MEAN= 0
##$ME_mod= 0
##$MI= 1.114404
##$NCOEF= 0
##$NC_proc= 0
##$NLEV= 6
##$NOISF1= 3.799351
##$NOISF2= 2.8
##$NSP= 1
##$NTH_PI= 0
##$NZP= 0
##$OFFSET= 15.70392
##$PC= 1
##$PHC0= -8655.262
##$PHC1= 12.20097
##$PH_mod= 1
##$PKNL= yes
##$PPARMOD= 0
##$PSCAL= 0
##$PSIGN= 0
##$REVERSE= no
##$SF= 200.130013532006
##$SI= 16384
##$SIGF1= 3
##$SIGF2= 2
##$SINO= 400
##$SIOLD= 16384
##$SREGLST= <1H.CDCl3>
##$SSB= 0
##$STSI= 0
##$STSR= 0
##$SW_p= 3612.71676300578
##$SYMM= 0
##$S_DEV= 0
##$TDeff= 0
##$TDoff= 0
##$TI= <>
##$TILT= no
##$TM1= 0
##$TM2= 0
##$TOPLEV= 0
##$USERP1= <user>
##$USERP2= <user>
##$USERP3= <user>
##$USERP4= <user>
##$USERP5= <user>
##$WDW= 1
##$XDIM= 8192
##$YMAX_p= 0
##$YMIN_p= 0
$$ End of Bruker specific parameters
$$ ---------------------------------
##NTUPLES= NMR FID
##VAR_NAME=  TIME,          FID/REAL,        FID/IMAG
##SYMBOL=    X,             R,               I
##VAR_TYPE=  INDEPENDENT,   DEPENDENT,       DEPENDENT
##VAR_FORM=  AFFN,          ASDF,            ASDF
##VAR_DIM=   8192,          8192,            8192
##UNITS=     SECONDS,       ARBITRARY UNITS, ARBITRARY UNITS
##FACTOR=    0.0002004,     1,               1
##FIRST=     0,             0,               0
##LAST=      1.6414764,     0,               0
##MIN=       0,             -159309,         0
##MAX=       1.6414764,     161135,          0
$$ Real data points
##PAGE= N=1
##DATA TABLE= (X++(R..R)), XYDATA
0@%%%%%%%Pj5J6j6J6k4L2m0M8n6P2q5R8j17J36j53J77k08K40k72L09l50L94m46
31b37N01n63O33p07P87q76R73j078J197j329J473j628J801j999K216k457K732
48A439l048L414l842M350m968N737o720Q038r905J2768j7755K8886r6225M0523
62c7308J90721j53340j22755J39877J41226j67625j40414J39607J35370j48964
72b3605j11781J59041J26667j59416j18106J49095J06843j64791j04503J65163
82B4607J09371j60794r4971J65919R4102j73932r7575J65553R0469j67729q1525
93a26505J76197Q7248j73318q5587J66240P4252j73185p2748J75348P5308j68417
104d5167o6917J67732N8314j73775n8402J72025N4822j69717m7126J72307M2797
$$ plain form
0 0 0 0 0 0 0 0 0 7 -8 8 -8 8 -16 16 -24 24 -32 40 -45 53 -64 72 -81 96 -112 128 -144 165 -185 209 -237
31 -237 264 -299 334 -373 414 -462 511 -567 630 -699 774 -854 947 -1052 1164 -1293 1439
48 1439 -1609 1805 -2037 2313 -2655 3082 -3638 4400 -5505 7263 -10492 18394 -77831 -37308
62 -37308 153413 73 -122682 17195 158421 -9204 -149618 -10011 125359 -23605
72 -23605 -135386 23655 150322 -9094 -127200 21895 128738 -36053 -140556 24607
82 24607 133978 -26816 -121787 44132 138234 -35698 -133273 32280 122749 -44980 -126505
93 -126505 49692 136940 -36378 -121965 44275 118527 -54658 -127406 47942 123250 -45167
104 -45167 -112084 55648 113962 -59813 -118215 53810 108632 -61085 -108211 64096 106893
115A06893j74323l9982J75190L6339j75782l3589J75667K8885j77029k5344J79382
126G6307K5850j76066k1743J74528J5777j77119j5215J75554J3734j70799n874
137h5066J72293K976j72284j619J68035n429j67933J0130J69984j1028j66264
148h6205J6130J65040k2349j68138K1961J65562k3769j61814L0126J63272l1755
159F8061j63858K9827J57420l4828j54991L9996J56851l9057j53071M0199J46340
170I2889m7687j46974N0370J47235m9913j40970N5569J39312o1478j41541O1290
181d1898J38715o3370j35035O9699J36993o9987j35955P0379J32019p4360j31600
192a04400P6045J31461p5219j26460P8127J23872q0855j23122Q1291J18908q3189
$$ plain form
115 106893 -67430 -107412 67778 104117 -71665 -105254 70413 99298 -77731 -103075 76307
126 76307 102157 -73909 -95652 78876 94653 -82466 -97681 77873 91607 -79192 -85066
137 -85066 87227 90203 -82081 -83700 84335 78906 -89027 -78897 91087 80059 -86205
148 -86205 -70075 94965 72616 -95522 -73561 92001 68232 -93582 -63456 99816 68061
159 68061 -95797 -65970 91450 56622 -98369 -58373 98478 59421 -93650 -53451 92889
170 92889 45202 -101772 -51402 95833 45920 -95050 -39481 99831 38353 -103188 -41898
181 -41898 96817 33447 -101588 -31889 105104 35117 -100838 -30459 101560 27200 -104400
192 -104400 -28355 103106 27887 -98573 -20446 103426 22571 -100551 -19260 99648 16459
203A6459j14690Q7318J12765q9798j10660R0950J06879r4396j04475R7746J03298
214A01396r9928j01924J01234R8650j03787r7541J05398R6634j05728r4105J06109
225F408R1129j07341q9234J07105Q6243j06872q2517J07615P9525j07789p5816
236i1544J08705P1938j09731o8480J10789O5200j11943o1390J13941N9076j14571
247b8010n6402J16149N3869j17131n2270J17771N0111j18197m7655J18610M6424
258H3269j18075m3987J17497M0968j17890l8989J16888L6178j16146l2619J16298
269D3392K9409j16544k6702J16126K2477j16917j9538J17361J6760j17978j4082
280f6236J18355J1499j18894r260J19120P153j19403n272J18942L433j18332j229
$$ plain form
203 16459 -98231 -10913 101852 12054 -98606 -7656 99223 4827 -99648 -1902 101396
214 101396 1468 -100456 778 99428 -4359 -101900 3498 100132 -5596 -99701 6408
225 6408 97537 -9804 -99038 8067 94310 -12562 -95079 12536 92061 -15728 -91544
236 -91544 17161 89099 -20632 -89112 21677 86877 -25066 -86456 27485 86561 -28010
247 -28010 -84412 31737 85606 -31525 -83795 33976 84087 -34110 -81765 36845 83269
258 83269 -34806 -78793 38704 79672 -38218 -77207 39681 75859 -40287 -72906 43392
269 43392 72801 -43743 -70445 45681 68158 -48759 -68297 49064 65824 -52154 -66236
280 -66236 52119 63618 -55276 -64536 54584 61737 -57666 -62938 56004 59437 -58895 -60124
292f0124J17880l60j16323K669J15460n011j14109P498J12792j0289j11381J3368
304d7930J10963j5418j09551J8526J08621k1259j08365K3355J07408k5344j06447
315f5441K7462J06100k8966j05146L0357J03468l2096j02738L3398J00666l4773
326C2291r9093L6419R7196l8144r5423L9800R3270m2207r2022M3967R0238m6306
338A9986q8714M8581Q7703n0671q6374N2496Q5410n4332q4655N5924Q3635n7134
350A1855q2323N8585Q1555n9082p9846O0200P8219o1216p6380O2151P4563o3159
362E122p1858O4576P0133o5823o7691O7434O5454o9245o3770P0864O1653p2518
374e669n9828P4021N8693p5282n7460P6178N5770p7552n4869P7724N3349p8113
$$ plain form
292 -60124 57756 57396 -58927 -56258 59202 54191 -59918 -52420 60372 50083 -61298 -47930
304 -47930 63033 47615 -61936 -43410 65211 43952 -64413 -41058 66350 41006 -65441
315 -65441 -37979 68121 39155 -65991 -35634 67834 35738 -67000 -33602 67064 32291
326 32291 -66802 -30383 66813 28669 -66754 -26954 66316 24109 -67913 -23946 66292 19986
338 19986 -68728 -20147 67556 16885 -69489 -16993 68417 14085 -70570 -14646 68989 11855
350 11855 -70468 -11883 69672 10590 -69256 -9056 69163 7947 -68433 -6282 68281 5122
362 5122 -66736 -2160 67973 2150 -65541 1893 67347 -1898 -65668 5196 66849 -5669
374 -5669 -65497 8524 67217 -8065 -65525 10653 66423 -11129 -65998 11726 65075 -13038
386a3038n1874P8185N0017p8066m8253P7886M5845p7976m3961P8031M1218p8172
398b0158l8615P8550L6282p9015l3493P9742L1403q0491k9505Q1342K7607q1855
410b8206k5621Q2700K4694q2889k3178Q3355K2023q3371k0726Q3282J9346q2870
422c1461j7648Q2701J6166q2084j4000Q1447J1904q1405j0030Q0942P628q0804
434c6644n351Q0682L316q0900j279Q0944j110q1604K544Q1610m569q1591N840
447c8112Q1539p195q1282Q410Q0962j0095q0219J0932P9461j2494p8291J4170
459c2214P7433j5511p6103J7218P5185j8874p4335K0947P3336k2487p2310K4395
471b3320P2091k5884p0965K7519P0350k8812o9868L0135O8985l0993o8149L2149
$$ plain form
386 -13038 -64912 13273 63290 -14776 -63029 14857 60702 -17274 -61235 16796 58014 -20158
398 -20158 -58773 19777 56059 -22956 -56449 23293 54696 -25795 -55300 26042 53649 -28206
410 -28206 -53827 28873 53567 -29322 -52500 30855 52878 -30493 -51219 32063 51409 -31461
422 -31461 -49109 33592 49758 -32326 -46326 35121 47025 -34380 -44410 36532 44160 -36644
434 -36644 -41995 38687 42003 -38897 -40176 40768 39658 -41946 -39402 42208 37639 -43952 -38112
447 -38112 43427 36232 -45050 -36640 44322 34227 -45992 -35060 44401 31907 -46384 -32214
459 -32214 45219 29708 -46395 -29177 46008 27134 -47201 -26254 47082 24595 -47715 -23320
471 -23320 48771 22887 -48078 -20559 49791 20979 -48889 -18754 50231 19238 -48911 -16762
483a6762O7291l3152o5991L3954O4728l5029o3784L6001O2219l7418o0843L8482
495a0304N9535m0043n8206M1058N7064m2922n6156M3907N5012m5489n4108M6823
507c829N3346m7915n2363M8683N1343m9440n0604N0440M9203n0795m8087N1763
519A745M6798n1976m5062N2772M3577n3376m1910N4356M0261n4980l8517N6195
531I883L7157n7030l5487N8115L4275n8978l3299N9823L1948o0298l0860O0603
543A5852L0111o1037k9033O0970K7838o1179k6802O0996K4872o0737k3700O0473
555A8624K1786o0222k0400O0383J8334o0439j6853O0433J5027o0954j3390O1300
567B3629J2037o1581j0427O1892R372o2329q265O2651P104o2476n924O2639N269
$$ plain form
483 -16762 50529 17377 -48614 -14660 50068 15039 -48745 -12744 49475 12057 -48786 -10304
495 -10304 49231 9188 -49018 -7960 49104 6182 -49974 -6067 48945 3456 -50652 -3829
507 -3829 49517 1602 -50761 -2078 49265 -175 -50779 -339 48864 -1931 -50018 1745
519 1745 48543 -3433 -48495 4277 47854 -5522 -47432 6924 47185 -7795 -46312 9883
531 9883 47040 -9990 -45477 12638 46913 -12065 -45364 14459 46407 -13891 -44751 15852
543 15852 45963 -15074 -44107 16863 44701 -16478 -43280 17716 42588 -18149 -41849 18624
555 18624 40410 -19812 -40212 20171 38505 -21934 -38787 21646 36673 -24281 -37671 23629
567 23629 35666 -25915 -36342 25550 34922 -27407 -35672 26979 34083 -28393 -34317 28322 33591
580C3591o2396m084O2053L197o1605j860O1403O04o0829R56O0433k347n9867L922
594b6829N9706n485n9564P418N8920r008n9063J0414N8888j1758n8725J2997N8567
607C6478j4309n8746J5050N8118j6308n7682J7096N7234j8030n6570J8853N5542
619C6726k0145n4902K1114N4086k2017n2871K3061N1976k4368n1179K5567N0489
631C7537k6545m9246K7690M8824k8827m8096K9704M7499l0384m6513L1473M6122
643C9238l2200m5146L2672M4339l3627m3283L4452M2582l4825m1415L5708M0121
655C8616l6724l9482L7362L8364l7942l7342L8904L6260l9937l5707M0403L4672
667C7447m1364l3813M2060L3001m2840l2318M2991L1163m3678l0276M4377K9358
$$ plain form
580 33591 -28805 -32889 29164 32361 -29244 -31104 30299 30903 -29926 -28970 31463 29116 -30751 -26829
594 -26829 32877 27392 -32172 -24754 34166 25158 -33905 -23491 35397 23639 -35086 -22089 36478
607 36478 22169 -36577 -21527 36591 20283 -37399 -20303 36931 18901 -37669 -18816 36726
619 36726 16581 -38321 -17207 36879 14862 -38009 -14948 37028 12660 -38519 -12952 37537
631 37537 10992 -38254 -10564 38260 9433 -38663 -8959 38540 8156 -38357 -6884 39238
643 39238 7038 -38108 -5436 38903 5276 -38007 -3555 39027 4202 -37213 -1505 38616
655 38616 1892 -37590 -228 38136 194 -37148 1756 38016 -1921 -37628 2775 37447
667 37447 -3917 -37730 4330 37331 -5509 -37827 5164 36327 -7351 -37627 6750 36108
679C6108m4419k8260M4775K6794m5238k5914M5828K4791m5841k3306M6770K1949
691C4037m7085k1084M7406K0177m7867j8507M8530J7980m8699j7105M8817J5917
703C2517m8991j5082M9482J4504m9210j3490M8962J2186m9071j1326M8656J0569
715B9706m8374q997M7990P670m8281o922M7943N303m7924l894M8029K959m8309
728b3101k010M7792P18m8324M74M8527j059m8264K041M7883l100m8093L808M8055
742B5347m400m7432N737M7248o475m7004P304M6439q279m5780R820M5621j0517
755A7629m5074J1363M4658j2877m4109J4133M4242j4953m3607J6012M3054j7257
767A3214m3109J7820M2873j8594m2148J9571M1517k0567m1367K0854M0559k1641
$$ plain form
679 36108 -8311 -36571 8204 34998 -10240 -36154 9674 34465 -11376 -34682 12088 34037
691 34037 -13048 -34132 13274 33451 -14416 -32923 15607 33587 -15112 -32217 16600 32517
703 32517 -16474 -31556 17926 32430 -16780 -30270 18692 30878 -18193 -29519 19137 29706
715 29706 -18668 -27665 20325 27995 -20286 -27208 20735 26038 -21886 -25780 22249 25208 -23101
728 -23101 -25111 22681 23399 -24925 -24451 24076 23017 -25247 -23206 24677 21577 -26516 -22708 25347
742 25347 20947 -26485 -20748 26500 20025 -26979 -19675 26764 18485 -27295 -17475 28146 17629
755 17629 -27445 -16082 28576 15699 -28410 -14277 29965 15012 -28595 -12583 30471 13214
767 13214 -29895 -12075 30798 12204 -29944 -10373 31144 10577 -30790 -9936 30623 8982
779H982l9861K2377L9279k2912l8821K3287L7587k4385l6891K5143L6360k5574
791D571l5300K6181L4431k7373l3839K7777L3494k8130l2402K9118L1748k9735
803E41l1185L0144L0497l0434k9553L1552K8881l1843k8319L2399K7315l2831
815b836k6376L3585K5984l3909k5117L4315K4039l5061k3340L5302K2788l5670
827f296k1744L6216K0537l6545k0319L6839J9191l7216j8259L7456J7366l7823
839a0597j6731L7733J5591l8184j4729L8698J3827l8768j2911L8959J1779l9227
851a4560j1078L9339J0372l9261r289L9523Q687l9748p866L9684P230l9561o044
864b2572L9768N421l9340m795L9284L772l8991k908L9157K124l8715j300L8415
$$ plain form
779 8982 -30879 -8502 30777 7865 -30956 -7669 29918 5533 -31358 -6215 30145 4571
791 4571 -30729 -4548 29883 2510 -31329 -3552 29942 1812 -30590 -1472 30276 541
803 541 -30644 -500 29997 -437 -29990 1562 30443 -1400 -29719 2680 29995 -2836
815 -2836 -29212 4373 30357 -3552 -28669 5646 29685 -5376 -28716 6586 29374 -6296
827 -6296 -28040 8176 28713 -7832 -28151 8688 27879 -9337 -27596 9860 27226 -10597
839 -10597 -27328 10405 25996 -12188 -26917 11781 25608 -13160 -26071 12888 24667 -14560
851 -14560 -25638 13701 24073 -15188 -24477 15046 23733 -16015 -23881 15803 23033 -16528 -22572
864 -22572 17196 22617 -16723 -21518 17766 21538 -17453 -20361 18796 20920 -17795 -19095 19320
877A9320L15l8430O95L8070j398l7978K294L7992l523l7923M033L7624n071l7443
891b1423N864L7242o620l7232P233L6864q223l6772Q828L6517r552l6224J0305
904a3193L5944j1254l5428J1768L5254j2633l4598J3438L4231j4010l3794J4861
916i414L3228j5316l2882J6357L2727j6986l2110J7828L1645j8435l1071J9200
928e229L0696j9821l0106K0368K9710k1003k9264K1607K8635k2012k8212K2596
940b035K7457k2961k7190K3427K6416k4055k5946K4341K5199k4834k4569K5051
952C01K3860k5433k3377K5823K2423k6305k1539K6476K0924k6994k0254K7524
964C429J9408k7788j8692K8272J8136k8655j7388K9151J6910k9567j6011K9928
$$ plain form
877 19320 19635 -18795 -18100 19970 18572 -19406 -17112 20880 17357 -20566 -16533 21091 16020 -21423
891 -21423 -15559 21683 15063 -22169 -14936 21928 13705 -23067 -14239 22278 12726 -23498 -13193
904 -13193 22751 11497 -23931 -12163 23091 10458 -24140 -10702 23529 9519 -24275 -9414
916 -9414 23814 8498 -24384 -8027 24700 7714 -24396 -6568 25077 6642 -24429 -5229
928 -5229 25467 5646 -24460 -4092 25618 4615 -24649 -3042 25593 3581 -24631 -2035
940 -2035 25422 2461 -24729 -1302 25114 1059 -24887 -546 24653 -181 -24750 301
952 301 24161 -1272 -24649 1174 23597 -2708 -24247 2229 23153 -3841 -24095 3429
964 3429 22837 -4951 -23643 4629 22765 -5890 -23278 5873 22783 -6784 -22795 7133
976G133J5687l0200j4934L0507J4473l0801j3814L1046J3109l0884j2351L1183
988A0154J1682l1402j0832L1281J0205l1636r144L1670Q080l1684p506L1850O610
1001A9328l2214n865L2140N064l2540m153L2192L637l2621l018L2715K221l2617
1014a5731j779L2723R21l2589l03L2288j52l1995P10L1895j323l1656K189L1473
1028A6671k836l1128L749L1001m480l0562N212L0667o077l0235O667L0348p501
1041A1496k9919Q090K9864q556k9687R174K9318r584k9439J0486K8973j1087k8747
1054a9618J1693K8297j2400k7945J2693K7414j3435k7028J3992K6572j4672k6407
1066b0844J5380K5763j6014k5572J6613K5193j7350k4745J7735K4460j8302k3815
$$ plain form
976 7133 22820 -7380 -22314 8193 22666 -8135 -21949 9097 22206 -8678 -21029 10154
988 10154 21836 -9566 -20398 10883 21088 -10548 -19692 11978 20058 -11626 -19132 12718 19328
1001 19328 -12886 -18751 13389 18453 -14087 -18240 13952 17589 -15032 -18050 14665 16886 -15731
1014 -15731 -17510 15213 16134 -16455 -16758 15530 15378 -16617 -15907 15988 14665 -16991 -14802 16671
1028 16671 13835 -17293 -13544 17457 12977 -17585 -12373 18294 12217 -18018 -11351 18997 11496
1041 11496 -18423 -10333 19531 10975 -18712 -9538 19780 10196 -19243 -8757 20216 9129 -19618
1054 -19618 -7925 20372 7972 -19973 -7280 20134 6699 -20329 -6337 20235 5563 -20844
1066 -20844 -5464 20299 4285 -21287 -4674 20519 3169 -21576 -3841 20619 2317 -21498
1078b1498J8718K3549j9272k2888J9679K2565k0012k1974K0586K1437k0893k0763
1090b0766K1414K0377k1861j9631K2364J9165k2837j8582K3257J8134k3508j7496
1102a9970K3763J7090k4182j6623K4465J6016k4720j5543K4745J5054k5117j4400
1114a9422K5273J3536k5347j3202K5513J2301k5774j1669K5955J0722k6223j0094
1126a8431K6469R180k6646q700K7098Q127k7436p337K7589O909k7862o407K8229
1139A0782N780k8019n447K8271M983k8210m360K8264L861k7985l079K8019K470
1152A5330k7796j465K7529Q17k7486o6K7574p16k7632J591K7639k429k7775L144
1166a1741K7707l851k7758M126K7695m812k7724N147K7836n836k7630N919K7232
$$ plain form
1078 -21498 -2780 20769 1497 -21391 -1712 20853 841 -21133 -547 20890 -3 -20766
1090 -20766 648 21025 -836 -20467 1897 21062 -1775 -20357 2900 21034 -2474 -19970
1102 -19970 3793 20883 -3299 -19922 4543 20559 -4161 -19704 5041 20095 -5022 -19422
1114 -19422 5851 19387 -5960 -19162 6351 18652 -7122 -18791 7164 17886 -8337 -18431
1126 -18431 8038 17218 -9428 -18128 8970 17097 -10339 -17676 9913 16822 -11040 -17447 10782
1139 10782 16562 -11457 -16904 11367 16350 -11860 -16220 12044 15905 -12080 -15159 12860 15330
1152 15330 -12466 -13931 13598 14415 -13071 -13137 14437 13721 -13911 -12320 15319 12890 -14885 -11741
1166 -11741 15966 12115 -15643 -11517 16178 11366 -16358 -11211 16625 10789 -16841 -10922 16310
1179A6310o277k7142O659K6796p242k6221P783K5729q437k5318R064K4934r656
1192F982k4604J0394K4432j1165k3910J1809K4037j2471k3804J3300K3498j3518
1204D980k3400J4106K3371j4611k2866J4900K2878j5329k2237J5423K1926j6034
1216C107k1407J6562K0850j6907k0349J7210J9842j7826j9386J8226J8703j8883
1228b58j8390J9366J7948j9882j7859K0650J7120k1040j6831K1257J6304k1582
1240c197j5964K1784J5718k2167j5113K2472J4372k2487j3856K2654J3341k2890
1252e333j2738K3381J2193k3492j1326K3840J0979k4297j0149K4379R685k4612
1264g490r100K4957Q909k5247q239K5414P715k5267p550K5490O826k5375o396
$$ plain form
1179 16310 10033 -17109 -10450 16346 9104 -17117 -9334 16395 7958 -17360 -8296 16638 6982
1192 6982 -17622 -7228 17204 6039 -17871 -6062 17975 5504 -18300 -5000 18498 4980
1204 4980 -18420 -4314 19057 4446 -18420 -3520 19358 4029 -18208 -2785 19141 3107
1216 3107 -18300 -1738 19112 2205 -18144 -934 18908 1082 -18304 -78 18625 -258
1228 -258 -18648 718 18666 -1216 -19075 1575 18695 -2345 -19176 2081 18385 -3197
1240 -3197 -19161 2623 18341 -3826 -18939 3533 17905 -4582 -18438 4216 17557 -5333
1252 -5333 -18071 5310 17503 -5989 -17315 6525 17504 -6793 -16942 7437 17122 -7490
1264 -7490 -16590 8367 17276 -7971 -16210 9204 16919 -8348 -15898 9592 16418 -8957 -15353
1277a5353K5288N730k5326n252K5337M421k5283l700K5215K844k5654k080K5496
1290A1683J480k5761q47K5865L34k6274K77K6324q69k6442J207K6639j634k6452
1304a4470J987K6339k257k6234K825K6044l366k5535M021K5223m401k5023N412
1317i435K4860o151k4474O942K4410p797k4128Q512K4176r067k4186R740K4117
1330A7519j0119k4213J0395K4133j0988k4134J1254K3894j1661k3412J1619K3143
1342A7430j2097k2631J2207K2062j2781k1574J3000K1187j3678k0628J4295K0092
1354A6884j4941j9751J5598J9309j6114j9198J6913J8873j7226j8801J7985J8594
1366A8125j8239j8283J8544J8180j8724j7907J9191J7301j9075j6826J9521J6351
$$ plain form
1277 -15353 9935 15665 -9661 -14913 10424 14845 -10438 -14138 11077 13921 -11733 -13813 11683
1290 11683 13163 -12598 -13445 12420 12754 -13520 -13243 13081 12212 -14230 -13023 13616 11982 -14470
1304 -14470 -12483 13856 11599 -14635 -11810 14234 10868 -14667 -10646 14577 10176 -14847 -9435
1317 -9435 15425 9274 -15200 -8258 16152 8355 -15773 -7261 16915 7848 -16338 -6598 17519
1330 17519 7400 -16813 -6418 17715 6727 -17407 -6153 17741 6080 -17332 -5713 17430
1342 17430 5333 -17298 -5091 16971 4190 -17384 -4384 16803 3125 -17503 -3208 16884
1354 16884 1943 -17808 -2210 17099 985 -18213 -1300 17573 347 -18454 -469 18125
1366 18125 -114 -18397 147 18327 -397 -18304 887 18188 -887 -17713 1808 18159
1378A8159j9584j5726J9876J5143k0396j4565K0604J4202k1201j3124K1506J2632
1390A7526k2232j2154K2341J1809k2948j1417K3121J1010k3394j0811K3634J0364
1402A6849k3815j0198K3897R637k3991r174K3955Q526k4036p762K4002P392k4068
1415h786o699K4128N867k4375n221K4607M749k4575m060K4968L724k5166l285
1428a4124K5437K827k5425k408K5446K323k5467j707K5356J289k5087q60K4904
1441A2504K04k4721L34K4564j033k4487J812K4394k566k4481L248K4349m015k4668
1455a4562M311K4943n082k4990N585K5057n852k5111O044K4847o549k4868P129
1468i098K4435p229k4097P654K3896q015k3546Q562K3119r411k2522R984K2286
$$ plain form
1378 18159 -1425 -17151 2725 17868 -2528 -17093 3511 17713 -3488 -16612 4894 17526
1390 17526 -4706 -16860 5481 17290 -5658 -17075 6046 17056 -6338 -17149 6485 16849
1402 16849 -6966 -17164 6733 16370 -7621 -16795 7160 15686 -8350 -16112 7890 15282 -8786
1415 -8786 -15485 8643 14510 -9865 -15086 9521 14270 -10305 -14365 10603 14327 -10839 -14124
1428 -14124 11313 14140 -11285 -13693 11753 14076 -11391 -13098 12258 13547 -11540 -12400 12504
1441 12504 12708 -12013 -11679 12885 11852 -12635 -10823 13571 11005 -13476 -10228 14121 10106 -14562
1455 -14562 -10251 14692 9610 -15380 -9795 15262 9410 -15701 -9657 15190 8641 -16227 -9098
1468 -9098 15337 8108 -15989 -8335 15561 7546 -16000 -7438 15681 6270 -16252 -6268 16018
1481A6018j0593k1787J1445K1841j2100k1451J2621K1491j3257k1587J4009K1341
1493A7991j4131k1280J4479K1386j4773k1072J4657K0683j5015k0220J4947J9841
1505A7493j5181j9381J5514J8804j5887j8249J6160J7389j6943j6962J7377J6522
1517A6656j7983j6069J8687J5676j9031j5620J9695J4990k0112j5040K0484J5001
1529A7334k0686j4540K0950J4267k0705j4010K1086J3262k1035j3030K1284J2448
1541A6625k1091j1658K1420J1220k1720j0313K1755R721k2250r155K2798Q772
1553A6124k3378p993K3607P694k3824p522K3989P212k4491o891K4228O686k4359
1566h918o087K4155N825k4245n309K3924M684k4034m267K3783L616k3841k708
$$ plain form
1481 16018 5425 -16362 -4917 16924 4824 -16627 -4006 17485 4228 -17359 -3350 17991
1493 17991 3860 -17420 -2941 18445 3672 -17400 -2743 17940 2925 -17295 -2348 17493
1505 17493 2312 -17069 -1555 17249 1362 -16887 -727 16662 -281 -17243 134 16656
1517 16656 -1327 -17396 1291 16967 -2064 -17684 2011 17001 -3111 -18151 2333 17334
1529 17334 -3352 -17892 3058 17325 -3380 -17390 3696 16958 -4077 -17107 4177 16625
1541 16625 -4466 -16124 5296 16516 -5204 -15517 6238 15959 -6291 -15446 7352 16124
1553 16124 -7254 -15247 8360 16054 -7770 -15292 8697 15909 -8582 -15473 8755 15441 -8918
1566 -8918 -15005 9150 14975 -9270 -14579 9345 14029 -10005 -14272 9511 13127 -10714 -13422
1579a3422K3837K255k4052j506K4088Q17k4333m16K4588rk4527M34K4875o32k4729
1594a2732J023K4686j464k4556J716K4484j889k4283K810K4036l207k3820L896
1607i300K3374m634k3261N138K3279n887k3072O595K3169p186k3205P651K3072
1620A5733q372k3310Q614K3200r064k3005R251K3039r318k3086R784K2227j0089
1633E604k2140J0531K1522j0828k1013J1370K0675j1987j9996J2492J9752j3114
1645B868j9635J3687J9452j4125j9203J4968J9202j5301j8899J5667J8739j6063
1657A357j8508J5953J8517j6057j8136J6399J7903j6306j7430J6327J6909j6609
1669C19j6565J6757J5810j7201j4920J7553J4636j8201j3999J8398J3472j9314
$$ plain form
1579 -13422 10415 12670 -11382 -12888 11200 12017 -12316 -12732 11856 11847 -12680 -12246 12629 11997 -12732
1594 -12732 -11709 12977 11513 -13043 -11327 13157 11268 -13015 -10205 13831 10624 -13196 -9300
1607 -9300 14074 9440 -13821 -8683 14596 8709 -14363 -7768 15401 8215 -14990 -7339 15733
1620 15733 7361 -15949 -7335 15865 6801 -16204 -6953 16086 6768 -16318 -6534 15693 5604
1633 5604 -16536 -6005 15517 4689 -16324 -4954 15721 3734 -16262 -3770 15982 2868
1645 2868 -16767 -3080 16372 2247 -16956 -1988 17214 1913 -16986 -1319 17420 1357
1657 1357 -17151 -1198 17319 1262 -16874 -475 17428 1122 -16308 19 16928 319
1669 319 -16246 511 16321 -880 -15800 1753 16389 -1812 -15811 2587 16059 -3255
1681c255j3198J9539J2885j9987j2473K0420J2291k0656j2317K0987J1973k1371
1693e162j1683K1179J1523k1147j0936K1114J0696k1050j0038K1026R587k1265
1705f156q928K1384Q230k1452p352K1966O753k1956o175K2286N590k2688n354
1718a3852K3154M945k3322m413K3455M390k3469m281K3492L799k3571l450K3068
1731I945L190k2976k709K2972J999k2702j693K2707P12k2746k63K2504m21k2532
1745a2013J027K2751j437k2867K013K2825k306k3233K640K3243k964k3044L325
1758a0040K3136l461k2849L844K2608m116k2417M532K2037m999k1622N737K1518
1771A3908o172k1207O822K1132p568k0985P945K1012q675k0864R258K0938r551
$$ plain form
1681 -3255 -16453 3086 15971 -4016 -16489 3931 16222 -4434 -16751 4236 16209 -5162
1693 -5162 -16845 4334 15857 -5290 -16226 4888 15584 -5466 -15504 5522 15109 -6156
1705 -6156 -15084 6300 14530 -6922 -14274 7692 14445 -7511 -13686 8600 14190 -8498 -13852
1718 -13852 9302 14247 -9075 -13488 9967 14357 -9112 -13393 10099 13898 -9673 -13123 9945
1731 9945 13135 -9841 -12550 10422 12421 -10281 -11974 10733 11445 -11301 -11564 10940 10519 -12013
1745 -12013 -10986 11765 10328 -12539 -10526 12299 9993 -13240 -10600 12643 9679 -13365 -10040
1758 -10040 13096 9635 -13214 -9370 13238 9122 -13295 -8763 13274 8275 -13347 -7610 13908
1771 13908 7736 -13471 -6649 14483 6915 -14070 -6125 14887 6212 -14652 -5394 15544 5993
1784E993k0930R862K0721j0282k0893J0385K0482j0472k0261J0798J9966j1147
1796D222j9369J1218J8757j1776j8495J2131J7984j2527j7566J3062J7296j3495
1808A442j6998J4004J6984j4844j6636J5032J6457j5401j6254J5914J6364j5624
1820D40j6394J5973J5960j6047j5564J5862J5442j6093j4780J6371J4479j6297
1832f48j3846J6413J3220j6902j2626J7000J2126j7535j1675J8148J1302j8540
1844c563j0859J8869J0468j9351j0450J9416J0189j9791r969J9945R832j9881
1856e145r707J9909R227k0042q885J9897Q390j9827p764J9890P337j9906o606
1869a3232J9896O017k0121n437K0251M986k0525m218K0965L816k0910l570K1311
$$ plain form
1784 5993 -14937 -5075 15646 5364 -15529 -5144 15338 4866 -15395 -4597 15369 4222
1796 4222 -15147 -3929 14828 3052 -15443 -3312 14672 2145 -15421 -2359 14937 1442
1808 1442 -15556 -1552 15432 588 -16048 -1016 15441 40 -16214 -300 16064 440
1820 440 -15954 19 15979 -68 -15632 230 15672 -421 -15201 1170 15649 -648
1832 -648 -14494 1919 15139 -1763 -14389 2611 14737 -2798 -14473 3675 14977 -3563
1844 -3563 -14422 4447 14915 -4436 -14886 4530 14719 -5072 -15041 4904 14736 -5145
1856 -5145 -14852 5057 14284 -5758 -14643 5254 13644 -6183 -13947 5943 13280 -6626 -13232
1869 -13232 6664 12681 -7440 -12877 7374 12360 -8165 -12383 8582 12398 -8512 -12082 9229
1882I229L299k1671k992K1588K873k1576k533K1654K326k1364j969K1150J437
1895A1451k1045j150K0692P13k0629K2K0386o40k0247J135K0294j823k0412K162
1909i091K0359k664k0539L053K0696l444k0628L722K0587m193k0512M316K0486
1922A2148m603k0245M930K0073n075j9760N638J9400o131j9187O615J8780o930
1935E653j8523P629J8661q032j8369Q560J8168q886j8242R307J8022r628j8066
1948a3746R893J8088j0081j7802J0296J7546j0524j7349J0564J6855j0796j6553
1960a3609J1136J6075j1391j5711J1671J5224j2247j4903J2484J4604j3093j4244
1972a4004J3493J4048j3638j4015J4097J3935j4439j3880J4671J3497j4707j3293
$$ plain form
1882 9229 12528 -9143 -12135 9453 12326 -9250 -11783 9871 12197 -9167 -11136 10014 11451
1895 11451 -9594 -10744 9948 10661 -9968 -9946 10440 9800 -10447 -9312 10982 9159 -11253 -9091
1909 -9091 11268 8604 -11935 -8882 11814 8370 -12258 -8536 12051 7858 -12654 -8338 12148
1922 12148 7545 -12700 -7770 12303 7228 -12532 -6894 12506 6375 -12812 -6197 12583 5653
1935 5653 -12870 -5241 13420 5388 -12981 -4421 13747 4861 -13381 -4074 13948 4320 -13746
1948 -13746 -3853 14235 4154 -13648 -3352 14194 3670 -13679 -3115 13740 2944 -13609
1960 -13609 -2473 13602 2211 -13500 -1829 13395 1148 -13755 -1271 13333 240 -14004
1972 -14004 -511 13537 -101 -14116 -19 13916 -523 -14403 268 13765 -942 -14235
1984a4235J4775J3387j4760j2940J5012J2406j4871j2154J5106J1391j5025j0978
1996a2886J5275J0714j5620r879J5949R440j6268r208J6699Q625j7035q499J7564
2009D871Q121j7671p856J7824P747j7993p860J7949P520j8123p202J8013O912
2022A2252j7885o447J7617O131j7862n486J7519M985j7673m413J7779L928j7864
2035g419l212J7954K855j8246k433J8411K017j8543j744J8878J680j8781j192
2048i775J8828J153j8914j019J8774N91j8378m04J8367J51j8104K17J7965r06
2062H546j7680J230J7628j657j7603K261J7379k672j7452L189J7477l755j7662
2075a0771M047J7331m192j7632M510J7697m927j7305M880J7142n010j7316N585
$$ plain form
1984 -14235 540 13927 -833 -13773 1239 13645 -1226 -13380 1726 13117 -1908 -12886
1996 -12886 2389 13103 -2517 -12396 3553 12993 -3275 -12483 4216 12841 -4194 -12693 4871
2009 4871 12992 -4679 -12535 5289 13036 -4957 -12817 5132 12652 -5471 -12673 5340 12252
2022 12252 -5633 -12080 5537 11668 -6194 -11680 5839 10824 -6849 -11262 6517 10445 -7419
2035 -7419 -10631 7323 10178 -8068 -10501 7910 9927 -8616 -10360 8518 10198 -8583 -9775
2048 -9775 9053 10206 -8708 -9727 9047 9638 -8740 -9144 9223 9374 -8730 -8513 9452 8546
2062 8546 -9134 -7904 9724 8067 -9536 -7275 10104 7432 -10020 -6831 10646 6891 -10771
2075 -10771 -6724 10607 6415 -11217 -6707 10990 6063 -11242 -6362 10780 5770 -11546 -5961
2088e961J6762n715j6521O040J6478o376j5967O722J5686p091j5589P555J5488
2101A1511p956j5279Q503J5238q791j5075R168J4974r405j4915R611J4716r735
2114B565j4375R682J4506j0030j3970J0176J3620j0524j3226J0460J2871j0746
2126A009j2664J1078J2256j1340j1946J1601J1789j2331j1400J2271J1398j2791
2138a070j1183J2912J1084j3132j0752J3346J0458j3347j0390J3349J0127j3433
2150b031r776J3527R514j3512r043J3805Q541j3781q072J3928P642j4016p225
2163a0499J4343O948j4689o401J4886O312j5087o164J5319N808j5570n414J5528
2176E320N468j5616n387J5701M801j5500m742J5417M435j5496m022J5237L648
$$ plain form
2088 -5961 10801 5086 -11435 -5395 11083 4707 -11260 -4538 11148 4057 -11532 -3977 11511
2101 11511 3555 -11724 -3221 12017 3226 -11849 -2681 12293 2888 -12027 -2416 12300 2565
2114 2565 -11810 -2128 12378 2348 -11622 -1446 12174 1650 -11576 -1116 11755 1009
2126 1009 -11655 -577 11679 339 -11607 -6 11783 -548 -11948 323 11721 -1070
2138 -1070 -12253 659 11743 -1389 -12141 1205 11663 -1684 -12074 1275 11402 -2031
2150 -2031 -11807 1720 11234 -2278 -11321 2484 11025 -2756 -10828 3100 10742 -3274 -10499
2163 -10499 3844 10792 -3897 -10298 4588 10900 -4187 -10351 4968 10776 -4794 -10208 5320
2176 5320 10788 -4828 -10215 5486 10287 -5213 -9955 5462 9897 -5599 -9621 5616 9264
2189I264j5235l157J5113K658j5233k266J5181J798j5322j273J5397R83j5530
2202g622o71J5700L52j5753j68J6014j21j5825K04J5931l74j5746P52J5546o68
2217G551j5623J083J5180j109j5162J751J4972k125j4600K355J4608k879j4493
2230h491L403J4309l788j4249L752J4350m167j4390M598J4421n016j4459N120
2243d607J4198n228j4008N187J3955n474j3822N801J3356n952j3217O251J2989
2256I429o649j2714O882J2392o951j2313P277J2344p668j2076P971J1928q303
2269A549j1777Q658J1803q796j1430Q888J1348r045j1058Q998J1169r241j0834
2282i768R489J0434r544j0084R803R575r772r468J0031R173j0386r046J0638Q641
$$ plain form
2189 9264 -5971 -9128 5985 8643 -6590 -8856 6325 8123 -7199 -8472 6925 7908 -7622
2202 -7622 -8293 7407 7759 -7994 -8162 7852 7731 -8094 -7890 8041 7667 -8079 -7327 8219 7551
2217 7551 -8072 -6989 8191 7082 -8080 -6329 8643 6518 -8082 -5727 8881 6002 -8491
2230 -8491 -5088 9221 5433 -8816 -5064 9286 5119 -9271 -4673 9748 4732 -9727 -4607
2243 -4607 9591 4363 -9645 -4458 9497 4023 -9799 -3998 9358 3406 -9811 -3560 9429
2256 9429 2780 -9934 -3052 9340 2389 -9924 -2647 9697 2029 -10047 -2076 9852 1549
2269 1549 -10228 -1570 10233 1437 -9993 -1105 10243 1198 -9860 -862 10307 1066 -9768
2282 -9768 -279 10155 611 -9473 330 9905 133 -9335 696 9869 -517 -9563 1075 9716
2296I716j0802q584J1097Q372j1291q282J1378P919j1535p867J1661P694j1697
2309b221p491J1739P056j1528o957J1619O599j1671o327J1807N945j1933n448
2322h811J2134N094j2155m709J2354M353j2232m359J2769L998j2651l906J2933
2335D812L677j3141l360J2994L436j3264k863J2827K995j2850k676J2823K340
2348G750j2697k126J2618J587j2649j199J2331J017j2372q63J2523L87j2567m0
2362f300J2469l06j2649N70J2643o07j2835J056J2696j033j2874J266J2611j339
2376E368j2473J457J2474j795j2111J957J2100k305j1662K471J1782k794j1546
2389g077L028J1568l380j1438L842J1167l916j1241M255J1215m491j1153M636
$$ plain form
2296 9716 -1086 -9670 1427 9799 -1492 -9774 1604 9523 -2012 -9879 1782 9476 -2221
2309 -2221 -9712 2027 9083 -2445 -9402 2217 8816 -2855 -9182 2625 8570 -3363 -8811
2322 -8811 3323 8417 -3738 -8447 3907 8260 -3972 -8331 4438 8436 -4215 -8121 4812
2335 4812 8489 -4652 -8012 4982 8418 -4846 -7709 5118 8113 -4737 -7413 5410 7750
2348 7750 -4947 -7073 5545 7132 -5517 -6716 5615 6632 -5740 -6603 5920 6307 -6260 -6300
2362 -6300 6169 5863 -6786 -6216 6427 5820 -7015 -5959 6737 5704 -7170 -5904 6707 5368
2376 5368 -7105 -5648 6826 5031 -7080 -5123 6977 4672 -6990 -4519 7263 4469 -7077
2389 -7077 -4049 7519 4139 -7299 -3457 7710 3794 -7447 -3192 8023 3532 -7621 -2985
2402b985J1175n130j0870M971J1105n389j0784N306J0650n474j0493N535J0308
2415G925n929j0068O149R636o241r623O579R359o810r195O968R052p184q936P322
2430i96Q951p576q666P861Q335p829q251Q065P975p861p931Q169P783q308p497
2445g776Q272P440q437p134Q781O589q644o552Q917O437r179o059R074N971r244
2460a544n747R304N556r379n442R354N310r729n039R747M720r686m630R845M110
2475F750r614m154R754L792r733l680R931L330j0021l040J0053K910j0078k625
2489f425J0125K484j0289k164J0312J980j0243j840J0371J598j0247j326J0221
2502D557J225j0005j177J0074R97j0091o91R943M51r768l57J0018j46r755K44
$$ plain form
2402 -2985 8190 3060 -7810 -2839 8266 2877 -7907 -2601 8049 2575 -7918 -2383 7925
2415 7925 1996 -8072 -1923 7713 1472 -8151 -1572 7787 977 -8218 -1250 7802 618 -8318 -996
2430 -996 7955 379 -8287 -426 7909 80 -8171 -106 7869 8 -7923 246 8029 -279 -7776
2445 -7776 496 7936 -501 -7635 1146 7735 -909 -7461 1456 7893 -1286 -7345 1729 7700 -1544
2460 -1544 -7291 2013 7569 -1810 -7252 2102 7412 -2317 -7356 2391 7111 -2575 -7205 2640 6750
2475 6750 -2864 -7018 2736 6528 -3205 -6885 3046 6376 -3645 -6685 3368 6278 -3800 -6425
2489 -6425 3700 6184 -4105 -6269 4043 6023 -4220 -6060 4311 5909 -4338 -5664 4557
2502 4557 5782 -4223 -5400 4674 5671 -4420 -5111 4832 5283 -4485 -4842 5176 5030 -4725 -4481
2517d481R843p47r525P06R628j070r821J303R691j445r755J683R606j762r766
2532e912J977R600k230r475K382R412k440r486K556R140k475r191L079Q862l181
2547B618q703L359Q675l615q434L841Q391l976q119M219P993m242q109M632P942
2562F472m641p856M740P835n091p614N287P401n275p317N171P274n467p097N646
2577e32O919n824o760N870O615o108o462O010O254o129o228O506N884o644n614
2592f243O645N404o679n258O555N499o947n033O949M929p020m779P238M472p222
2607a490m447P336M371p292m057P400L850p473l591P481L580p565l420P769L139
2622E591p738k914P586K940p720k753P673K589p843k435P783K159p819j966P840
$$ plain form
2517 -4481 5362 4615 -4910 -4204 5424 4354 -5467 -4164 5527 4082 -5673 -3990 5616 3854 -5912
2532 -5912 -3935 5665 3435 -6040 -3658 5754 3314 -6172 -3616 5524 3049 -6142 -3063 5799 2618
2547 2618 -6085 -2726 5949 2334 -6100 -2259 6132 2156 -5963 -1744 6249 2007 -6102 -1470 6472
2562 6472 1831 -6025 -1285 6550 1459 -6155 -868 6533 1258 -6059 -888 6386 919 -6178 -532
2577 -532 6387 563 -6197 -327 6288 180 -6282 -272 5982 -147 -6375 131 6015 -629 -6243
2592 -6243 402 5806 -873 -6131 424 5923 -1024 -6057 892 5821 -1199 -5978 1260 5732 -1490
2607 -1490 -5937 1399 5770 -1522 -5579 1821 5671 -1802 -5393 2088 5668 -1897 -5317 2452 5591
2622 5591 -2147 -5061 2525 5465 -2255 -5008 2665 5254 -2589 -5024 2759 4918 -2901 -4867 2973
2637B973J760p774j567P793J254p768j273P942Q57p902p39P925N62p877m91P877
2653C552M28p978j44P949J7p902J97P873l97p642M56P661o47p639R47P490q84
2670C337p475J243P305j354p397J653P441j862p078J717P201k026p186K098P229
2685D846k487o974K462O812k655o779K747O757k951o627L063O464l094o470L277
2700a609O325l491o209L426O281l630o124L749O095m015n786L972N763m064n694
2715e011M328N568m365n528M623N184m543n043M765M928m871m835M954M810m972
2730hm702N170M557n319m303N350M258n511m056N357M166n574l856N555L623n543
2746h36l785N764L402n741l214N569L163n829l044N816K752n856k604O031K322
$$ plain form
2637 2973 4733 -3041 -4608 3185 4439 -3329 -4602 3340 4197 -3705 -4444 3481 4043 -3834 -4325 3552
2653 3552 3980 -3998 -4142 3807 3824 -4078 -3881 3992 3595 -4047 -3591 4070 3423 -4216 -3269 4221 3337
2670 3337 -4138 -2895 4410 3056 -4341 -2688 4753 2891 -4187 -2470 4731 2705 -4481 -2383 4846
2685 4846 2359 -4615 -2153 4659 2004 -4775 -2028 4729 1778 -4849 -1786 4678 1584 -4886 -1609
2700 -1609 4716 1225 -4984 -1558 4723 1093 -5031 -1282 4813 798 -4988 -1016 4747 683 -5011
2715 -5011 -683 4885 520 -5008 -385 4799 256 -4787 -22 4906 35 -4800 154 4964 -8
2730 -8 -4710 460 5017 -302 -4605 745 5003 -508 -4564 793 4959 -615 -4471 1084 4707 -836
2746 -836 -4621 1143 4545 -1196 -4410 1159 4322 -1507 -4551 1265 4017 -1839 -4443 1588 3910
2761C910n875k326O071K235o445j810O215J803o102j674O123J625o328j403O449
2776B468J351o395j160O283J210o286r39O233Q03o138n82O074M57o083k90O099
2792C105K8n916j14O197l40o043N64N934n64o168O98O084q31o170R91O094j139
2809B410o174J289N914j196o078J346O051j553n823J680N667j622n705J733N584
2824C523j998n385K220N201k110n308K551N097k554n104K743N102k879m999L000
2839i00N008l061m881L177M847l211m837L363M683l308m669L329M526l385m401
2854c720L562M224l788m182L906L957l903m020M064L783m102l811M330L663m516
2869e53l491M391L467m641l234M606L041m490l092M516L105m676k792M584K787
$$ plain form
2761 3910 -1965 -4291 1780 4015 -2430 -4240 1975 3778 -2324 -3998 2125 3750 -2578 -3981 2468
2776 2468 3819 -2576 -3736 2547 3757 -2529 -3468 2765 3568 -2570 -3152 2922 3379 -2704 -2994 3105
2792 3105 3133 -2783 -2897 3300 2960 -3083 -2519 3415 2851 -3317 -2619 3465 2634 -3536 -2545 3549 2410
2809 2410 -3764 -2475 3439 2243 -3835 -2489 3562 2009 -3814 -2134 3533 1911 -3794 -2061 3523
2824 3523 1525 -3860 -1640 3561 1451 -3857 -1306 3791 1237 -3867 -1124 3978 1099 -3900 -900
2839 -900 4108 1047 -3834 -657 4190 979 -3858 -495 4188 880 -3789 -460 4066 681 -3720
2854 -3720 -158 4066 278 -3904 2 3959 56 -3964 100 3883 -219 -4030 300 3963 -553
2869 -553 -4044 347 3814 -827 -4061 545 3586 -904 -3996 520 3625 -1051 -3843 741 3528
2884C528m889k259M820K345m857k135M894K192n075j975N118J946n222j754N236
2899A913J633n106j791N382J567n280j450N305J263n286j229N239J099n175j052
2914b968N101R44n325m57M939N32n260j61N048R1n136J3N298k44n352L45N419
2931B827m89n458O34N128l14n545P22N295o62n208Q03N043q70m770Q82M900j070
2948A848m836J300M894j476m729J578M802k021m493K015M501j981m580K258M589
2963C669k410m611K473M688k723m521K636M447k715m414K572M454k776m159K592
2978g98M131k807m090K930L859l189l518L143L620l325l543L516L305l648l323
2993c737L823L320l870l205L881L277l953l182M199L112m041l175M157L020m036
$$ plain form
2884 3528 -1361 -3620 1200 3545 -1312 -3447 1447 3639 -1436 -3411 1707 3653 -1569 -3323 1913
2899 1913 3546 -1560 -3351 2031 3598 -1682 -3132 2173 3436 -1850 -3079 2160 3259 -1916 -2968
2914 -2968 2133 3077 -2248 -2705 2234 2766 -2494 -2655 2393 2484 -2652 -2639 2659 2415 -2937 -2592 2827
2931 2827 2338 -3120 -2486 2642 2328 -3217 -2495 2800 2138 -3070 -2267 2776 1906 -2864 -1982 2918 1848
2948 1848 -2988 -1688 3206 1730 -2999 -1421 3381 1360 -3133 -1118 3383 1402 -3178 -920 3669
2963 3669 1259 -3352 -879 3809 1086 -3435 -799 3648 933 -3481 -909 3545 769 -3390 -798
2978 -798 3333 526 -3564 -634 3225 36 -3482 -339 3281 -44 -3587 -71 3234 -414 -3737
2993 -3737 86 3406 -464 -3669 212 3489 -464 -3646 553 3665 -376 -3551 606 3626 -410
3008d10k895M042K889m088k702M278K433m375k175M131K132m313j756M264J727
3023C182m370j927M721J568m716j507M607J663m932j360M779J329m852j343M697
3038A539J349m900r64M617R46m495r26M758N91m788m72M863K21m777q6M852j8
3055B310m981J83N056j75n090L72N060k50n026J76N079k21m965M76M773n35m673
3072b431O34M752r21m703R85M527j141m447J343M515j636m465J674M538j971m545
3088c292K016M538k097m683K256M528k071m585J969M664k156m579K287M442k259
3103I78m447K422M036k212l920K291L902k688l622K770L627k851l502L053L509
3118C346l166l478L474L351l532l464L730L620m051l307L769L433l751l427L712
$$ plain form
3008 -410 -3305 737 3626 -462 -3164 1114 3547 -828 -3003 1128 3260 -1053 -2809 1455 3182
3023 3182 -1188 -3115 1606 3174 -1542 -3049 1558 3221 -1711 -3071 1708 3037 -1815 -3158 1539
3038 1539 2888 -2012 -2976 1641 2587 -1908 -2834 1924 2515 -2273 -2745 2118 2339 -2438 -2524 2328 2310
3055 2310 -2671 -2488 2568 2393 -2697 -2325 2735 2485 -2541 -2365 2714 2493 -2472 -1996 2777 2242 -2431
3072 -2431 -1797 2955 2034 -2669 -1684 2843 1702 -2745 -1402 3113 1477 -2988 -1314 3224 1253 -3292
3088 -3292 -1276 3262 1165 -3518 -1262 3266 1195 -3390 -1421 3243 1087 -3492 -1205 3237 978
3103 978 -3469 -1047 2989 777 -3143 -852 3050 362 -3260 -490 3137 286 -3216 -163 3346
3118 3346 180 -3298 176 3527 -5 -3469 261 3881 -170 -3477 292 3725 -26 -3453 259
3133B59L442l812l129L538L178l728k892L538K916l918k579L973K234l918k234
3148c132L878K249m301j896M372J902m535j938M719J767m747j770M747J864m807
3163a628j709M675J861m696j579M664J488m792j246M566J274m596j047M716P95
3178B746m594n86M645M50m705l63M771K53m871j83N053M4m898j71M964R5n159
3195b509ON015q9m883O8M908l46m782M06M772m78m860O13M600p74m619R97M748
3213B793j195m677J354M685j565m759J747M734j746m844J775M954j616m981J822
3228a519M803j724m712J675M586j771m342J959M307k019m306K381M108k569m096
3243c239K763L952k728m010K925L925l146l849L175L875l412l791L170M059l387
$$ plain form
3133 259 3701 -111 -3240 298 3476 -252 -3144 394 3310 -608 -3187 786 3020 -898 -3132
3148 -3132 746 2995 -1306 -3202 1170 3072 -1463 -3401 1318 3085 -1662 -3432 1315 3179 -1628
3163 -1628 -3337 1338 3199 -1497 -3076 1588 3076 -1716 -2962 1604 2878 -1718 -2765 1951 2746
3178 2746 -1848 -2434 2211 2661 -2044 -2407 2364 2617 -2254 -2437 2616 2660 -2238 -2409 2555 2650 -2509
3195 -2509 -2503 2512 2423 -2460 -2392 2516 2170 -2612 -2206 2566 2088 -2772 -2159 2441 1667 -2952 -1955 2793
3213 2793 1598 -3079 -1725 2960 1395 -3364 -1617 3117 1371 -3473 -1698 3256 1640 -3341 -1519
3228 -1519 3284 1560 -3152 -1477 3109 1338 -3004 -1045 3262 1243 -3063 -682 3426 857 -3239
3243 -3239 -476 3476 748 -3262 -337 3588 442 -3407 -232 3643 231 -3560 -390 3669 282
3258B82l872L213L942l227l885L270L678l284l667L377L278l272l265L514L270
3273C352l664l040L747K772l934k775M147K694m274k588M571K663m664k447M579
3288A139K501m541k710M680K586m520k551M594K239m171k363M430J925m215j914
3303b891M246J688m425j426M475J380m770j206M837J012n001r08M881R42m994
3318b160r68N189J043n391r09N287Q23n190p79N034Q22n078n92M991N90m934l75
3335b597M766K95m819j7M697%m948M44M999n51m926O06N112q10n108Q60N071r54
3353B120n134J112N135q80n265J039N007j028n116J148M881j235m794J375M737
3368C102j568m560J653M536j982m529K048M432k194m574K540M512k413m620K435
$$ plain form
3258 282 -3590 -377 3565 338 -3547 -277 3401 117 -3550 -173 3105 -167 -3432 82 3352
3273 3352 -312 -3352 395 3167 -767 -3542 605 3299 -975 -3563 1008 3671 -993 -3440 1139
3288 1139 3640 -901 -3611 1069 3655 -865 -3416 1178 3417 -754 -3117 1313 3238 -977 -2891
3303 -2891 1355 3043 -1382 -2808 1667 3047 -1723 -2929 1908 2920 -2081 -2989 1892 2834 -2160
3318 -2160 -3128 2061 3104 -2287 -3196 2091 2914 -2276 -3055 1979 2801 -2277 -2869 2122 2712 -2222 -2597
3335 -2597 2169 2464 -2355 -2372 2325 2325 -2623 -2179 2820 2269 -2657 -2051 3061 2251 -2857 -1997 3074 2120
3353 2120 -3014 -1902 3233 2353 -2912 -1873 3134 2106 -3010 -1862 3019 1784 -3010 -1635 3102
3368 3102 1534 -3026 -1373 3163 1181 -3348 -1300 3132 938 -3636 -1096 3416 1003 -3617 -1182
3383a182M684k594m640K612M573k611m406K527M582k663m250K702M189k809m102
3398c388K911L832k951l676K915L983l363l525L436L448l585l493L704L542l937
3413a47l521M010L547m023l432L951L543m296l315L933L407l925l383M011L196
3428C556l978k934L608L016l885k861M148K318m084k312M326K180m411k053M616
3443A250J992m736k072M917K044m988k061N118K041m982j988M979J843m846j752
3458c241M777J861m887j564M724J494m669j204M794Q69m732q74M841O41m992m98
3474b660N065M49n146m06N157K70n411j89N329J95n208k84N338J14n135k01N109
3491B386L8m976j13N044k18m833L46M774l89m791O90M844q70m855J068M779j295
$$ plain form
3383 -1182 3502 908 -3732 -1120 3453 842 -3564 -1037 3545 882 -3368 -666 3523 714 -3388
3398 -3388 -477 3355 404 -3272 -357 3626 263 -3262 174 3622 37 -3456 248 3790 -147
3413 -147 -3668 342 3889 -134 -3566 385 3928 -368 -3683 250 3657 -268 -3651 360 3556
3428 3556 -422 -3356 252 3268 -617 -3478 670 2988 -1096 -3408 918 3098 -1313 -3366 1250
3443 1250 3242 -1494 -3566 1351 3395 -1593 -3654 1464 3505 -1477 -3465 1514 3357 -1489 -3241
3458 -3241 1536 3397 -1490 -3054 1670 3164 -1505 -2709 2085 2954 -1778 -2652 2189 2830 -2162 -2660
3474 -2660 2405 2854 -2292 -2698 2459 2729 -2682 -2871 2458 2653 -2555 -2839 2499 2613 -2522 -2723 2386
3491 2386 2424 -2552 -2665 2379 2161 -2672 -2326 2448 2059 -2732 -2042 2802 1932 -2923 -1855 2924 1629
3508A629m832J329N104j358n020J456N161j610n093J598N039j510n128J658M970
3523C393j615m778J644M654j787m615J987M434k165m415K332M219k422m231K587
3538g78M327k808m365K862M239k940m397L161M149k930m298L132M295l243m175
3553c769L077M085l024l986L077L950l270l626L366L589l534l305L412L345l660
3568b73l196L856L205l968l021L941L148m246l084M224L182m235l016M092L142
3583C751m238k984M132K922m168k787M142K641m202k535M202K375m356j971M223
3598A147J980m488j908M501J740m605j736M936J617m944j682N025J545n000j542
3613c414M959J585n094j290M898J459m781j346M821J170m650j133M704R17m711
$$ plain form
3508 1629 -3203 -1874 3230 1872 -3148 -1692 3469 1859 -3234 -1636 3403 1893 -3235 -1577 3393
3523 3393 1778 -3000 -1356 3298 1511 -3104 -1117 3317 1152 -3263 -931 3288 866 -3365 -778
3538 -778 3549 741 -3624 -762 3477 537 -3860 -699 3450 520 -3778 -646 3649 406 -3769
3553 -3769 -692 3393 369 -3617 -540 3410 140 -3486 -120 3469 -65 -3370 42 3387 -273
3568 -273 -3469 387 3592 -376 -3397 544 3692 -554 -3638 586 3768 -467 -3483 609 3751
3583 3751 -487 -3471 661 3583 -585 -3372 770 3411 -791 -3326 876 3251 -1105 -3076 1147
3598 1147 3127 -1361 -3269 1232 2972 -1633 -3369 1567 3184 -1760 -3442 1583 3128 -1872 -3414
3613 -3414 1545 3130 -1964 -3254 1644 3103 -1678 -3024 1797 2967 -1683 -2816 1888 2805 -1906
3628a906o92M786M02m726j70M846k0m892J6M965p7n204K48N232k22n116l7N289
3646B722k35n065R1N211l35n054L54M979n12m691L53M742n46m770O73M729j106
3663A540m445J165M592j380m561J529M632j658m539J446M777j761m744J837M870
3678C300j938m647J814M847j767m756J821M554j895m457K032M362k029m200K172
3693g87M157k363m094K462M013k790l882K786L908k929l889L089L896l260l857
3708c540L218L765l130l948L144L851l178l686L228L478l273l334L176L360l244
3723a13l334L509L141l508k993L617K914l875k776M028K734l983k904M204K846
3738C507m298k492M283K588m280k561M091K618m130k520M100K372m146k240M173
$$ plain form
3628 -1906 -2598 2188 2590 -2136 -2306 2540 2520 -2372 -2356 2609 2532 -2672 -2424 2808 2586 -2530 -2567 2722
3646 2722 2487 -2578 -2487 2724 2389 -2665 -2311 2668 2156 -2535 -2182 2560 2014 -2756 -2083 2646 1540
3663 1540 -2905 -1740 2852 1472 -3089 -1560 3072 1414 -3125 -1679 3098 1337 -3407 -1570 3300
3678 3300 1362 -3285 -1471 3376 1609 -3147 -1326 3228 1333 -3124 -1092 3270 1241 -2959 -787
3693 -787 3370 1007 -3087 -625 3388 598 -3284 -498 3410 481 -3408 -319 3577 317 -3540
3708 -3540 -322 3443 313 -3635 -491 3360 182 -3504 -276 3202 -71 -3405 -229 3131 -113
3723 -113 -3447 62 3203 -305 -3298 319 3233 -642 -3418 610 3344 -639 -3543 661 3507
3738 3507 -791 -3283 1000 3588 -692 -3253 838 3456 -674 -3194 906 3278 -868 -3108 1065
3753A065K148m023k043M000J877m219j729M314J516m328j614M532J504m666j371
3768c037M671J375m868j199M738J119m664j230M867J090m818j019M539J231m755
3783a960q49M637P52m531o33M586N25m563k86M475K33m592M7M480j00m648J79
3800b248M895l56m823M62M649l11m778L70M822m23m880O43M730o26m607M76M682
3817B677p44m520O85M543r63m345J079M311j260m295J356M291j515m344J568M228
3833B752j725m219J818M303j738m292J689M386j833m304K025M163j936m136K080
3848i67L942k006l970K141L827k233l626K175L708k271l656K494L515k652l432
3863c011K893L339k881l357K783L591l113l285K893L471l132l240K980L066k994
$$ plain form
3753 1065 3213 -810 -2853 1147 3024 -1195 -2924 1390 2906 -1422 -3036 1496 3000 -1666 -3037
3768 -3037 1634 3009 -1859 -3058 1680 2799 -1865 -3095 1772 2862 -1956 -2975 1564 2795 -1960
3783 -1960 -2809 1828 2580 -1951 -2584 2002 2527 -2036 -2322 2153 2386 -2206 -2159 2321 2221 -2427 -2248
3800 -2248 2647 2291 -2532 -2070 2579 2268 -2510 -2140 2682 2259 -2621 -1978 2752 2126 -2481 -2005 2677
3817 2677 1933 -2587 -1902 2641 1678 -2667 -1588 2723 1463 -2832 -1476 2815 1300 -3044 -1476 2752
3833 2752 1027 -3192 -1374 2929 1191 -3101 -1412 2974 1141 -3163 -1138 3025 1089 -3047 -967
3848 -967 2975 969 -3001 -860 2967 734 -2892 -717 2991 720 -2936 -442 3073 421 -3011
3863 -3011 -118 3221 340 -3017 -234 3357 244 -3041 -148 3323 191 -3049 -69 2997 3
3878Cl174L160L050l150k995L179K806l182k801L322K659l366k618L490K566l632
3894f83k445L721K423l629k419L719K230l776k075L769K104l801k100L895K022
3909B955l761j963L758J907l822j798L792J667l888j499L944J558l959j348L824
3924A367J281m152r43M079R72m280q39M011J033m148r46M248P44m207q71M220
3940A569Q05l979q15M014O64m078n12M034M06m004l71M103K21l958q5L881m2l895
3958b042J90L956k08m118M76M176n88m130N79M254o28m081M27M252p97l923O13
3975a592M058p89l987Q32L867q06l797Q71L730r81l645R17L852j295l717J343
3991a139L551j328l766J563L739j736l634J761L579j643l669J829L484j915l479
$$ plain form
3878 3 -3171 -11 3039 -111 -3106 73 2879 -303 -3104 218 2877 -489 -3107 383 2949 -683
3894 -683 -3128 593 3016 -613 -3032 687 2917 -859 -2934 835 2939 -862 -2962 933 2955
3909 2955 -806 -2769 989 2896 -926 -2724 1068 2735 -1153 -2652 1292 2850 -1109 -2457 1367
3924 1367 2648 -1504 -2447 1632 2604 -1676 -2515 1496 2529 -1619 -2565 1683 2427 -1780 -2651 1569
3940 1569 2374 -1605 -2420 1594 2258 -1820 -2332 1702 2108 -1896 -2267 1836 2057 -1901 -1986 1895 1853 -2042
3958 -2042 -1852 2104 1896 -2222 -1746 2430 1842 -2288 -1709 2545 1917 -2164 -1737 2515 1718 -2205 -1592
3975 -1592 2466 1677 -2310 -1478 2389 1583 -2214 -1343 2387 1406 -2239 -1322 2530 1235 -2482 -1139
3991 -1139 2412 1084 -2682 -1119 2620 884 -2750 -989 2590 947 -2722 -893 2591 676 -2803
4006b803J810L636j854l412J821L507k004l220J991L134k110k953K012L055k214
4021C96k990K307K996k380k933K494K903k576k767K550K696k608k835K779K665
4036B697k647k645K782K504k719k562K691K444k707k526K884K285k846k158K824
4051C01K087k826k012K888J993l117j828L100J794l185j819L315J735l292j691
4066b557L230J807l253j743L423J519l343j484L375J441l236j524L431J092l084
4081i06j151L180J100l295q80L324R15l521q37L442Q30l557p08L513N53l428o71
4098b097L568N11l511m87L471M21l467l39L475J00l409j07L477Ql255m5L396j63
4116A547l355J33L422k49l511M67L281l46l267O00L159l57l492N86L404p15l275
$$ plain form
4006 -2803 -993 2643 789 -2623 -802 2705 701 -2519 -528 2606 496 -2457 -445 2610 396
4021 396 -2594 -287 2709 329 -2604 -110 2793 217 -2550 0 2696 88 -2747 32 2697
4036 2697 50 -2595 187 2691 -28 -2590 101 2545 -162 -2688 196 2481 -365 -2523 301
4051 301 2388 -438 -2450 438 2431 -686 -2514 586 2380 -805 -2624 691 2426 -866 -2557
4066 -2557 673 2480 -773 -2516 907 2426 -917 -2401 974 2415 -821 -2345 1086 2178 -906
4081 -906 -2057 1123 2223 -1072 -1952 1372 2287 -1234 -2071 1371 2201 -1356 -2064 1449 2002 -1426 -2097
4098 -2097 1471 1982 -1529 -2016 1455 1876 -1591 -1930 1545 1645 -1764 -1871 1606 1614 -1641 -1686 1710 1547
4116 1547 -1808 -1675 1747 1498 -2013 -1546 1735 1389 -1878 -1278 1881 1524 -1968 -1382 2022 1307 -1968
4133a968P64L235p66l181P83L255q92l049P56L205q91l061Q91K913j000k867J083
4150g90K954j324k845J268K784j340k892J428K944j725k599J483K807j632k889
4165b368J828K641j619k835J802K685j763k749J774K723j801k552J878K367j898
4180A13k378J919K525k042k244K104K082j891k142K012K051j975k157K289J968
4195B234k113k101K312J830k290j938K336K001k580j602K295J832k574j782K483
4210C43J790k634j649K623J557k564j527K557J501k710j164K384J244k482j254
4225a985K595J140k623j032K573J098k507j371K842J060k699j029K763Q69k793
4240a099n91K756O98k791n66K671N69k689o30K848N06k803k56K690L77k852l62
$$ plain form
4133 -1968 -1204 2031 1265 -1916 -1133 2122 1230 -1819 -1063 2142 1251 -1810 -919 1994 994 -1873 -790
4150 -790 2164 840 -2005 -737 2047 707 -2185 -757 2187 462 -2137 -654 2153 521 -2368
4165 -2368 -540 2101 482 -2353 -551 2134 371 -2378 -604 2119 318 -2234 -356 2011 113
4180 113 -2265 -346 2179 137 -2107 -3 2079 188 -1954 58 2109 134 -2023 266 2234
4195 2234 121 -1980 332 2162 -128 -2066 270 2271 -309 -1911 384 2216 -358 -2140 343
4210 343 2133 -501 -2150 473 2030 -534 -2061 496 1997 -713 -1877 507 1751 -731 -1985
4225 -1985 610 1750 -873 -1905 668 1766 -741 -2112 730 1790 -909 -1938 825 1694 -1099
4240 -1099 -1690 1066 1764 -1027 -1593 1078 1647 -1042 -1672 1176 1682 -1121 -1377 1313 1690 -1162 -1524
4257a524K866K86k858k78K828L13k822j90K780K8k729J2K681j20k668L5K769k75
4275A134k572J90K538k46k621M36K549m80k613L93K783n53k517N72K495n74k498
4292a584O35K616p71k459O67K528p45k554R72K378r04k282O99K320p50k406J087
4309e53K301j031k255J231K067j038k170J089K161j235k106J271K141j435k093
4324a655J342K061j457j939J375J949j357k095J453J930j521j920J615J844j631
4339fj753J694J710j527j845J651J737j691j601J578J495j571j479J679J495j739
4355a73j398J844J418j911j297J881J303j809j368K016J066j811j101J898J155
4370A713k081j120J933J180k004j046J972J011k146p82J873J013k044q29J855
$$ plain form
4257 -1524 1342 1628 -1230 -1508 1320 1633 -1189 -1379 1401 1429 -1300 -1288 1393 1273 -1395 -1360 1409 1134
4275 1134 -1438 -1248 1290 1044 -1577 -1141 1408 928 -1685 -1292 1491 938 -1579 -1007 1488 914 -1584
4292 -1584 -949 1667 896 -1563 -896 1632 887 -1667 -695 1683 779 -1503 -804 1516 766 -1640 -553
4309 -553 1748 717 -1538 -307 1760 722 -1448 -359 1802 567 -1539 -268 1873 438 -1655
4324 -1655 -313 1748 291 -1648 -273 1676 319 -1776 -323 1607 86 -1834 -219 1625 -6
4339 -6 -1759 -65 1645 118 -1727 -76 1661 -30 -1631 -53 1442 -129 -1608 71 1566 -173
4355 -173 -1571 273 1691 -220 -1517 364 1667 -142 -1510 506 1572 -239 -1340 558 1713
4370 1713 -368 -1488 445 1625 -379 -1425 547 1558 -588 -1370 503 1516 -528 -1357 498
4385D98Q91j928q45J976O71j889p12J954O51j979m96J931M39k006n20K110M12
4402A158k071m09K176L57k192k83K039K92j891l12K093J97k049j72K042J05k046
4419i66O9K067q0j992L9J919m0k032J70J962j40j956J63J905j82k051L99J885
4437A139m11j939M25J860n09j712M16J907n61j809N11J856o41j784O10J766n75
4454E49j872O32J799o64j713P40J727q35j675J014J479p95j588R35J494q62j575
4471a210R58J551r57j476J055J368r79j390R41J415j065j235R60J350j164j339
4487a217J146J343j175j308J299J136j084j319J214J154j215j120J169R94j053
4502c6j228J255J243j390j001J275R82j286r17J188R59j413o59J099R71j384p41
$$ plain form
4385 498 1389 -539 -1384 592 1263 -626 -1338 616 1267 -712 -1208 723 1162 -844 -1364 746 1158
4402 1158 -913 -1322 854 1211 -981 -1264 775 1067 -824 -1136 957 1154 -895 -1067 975 1080 -966
4419 -966 -897 1170 1090 -902 -863 1056 1016 -1016 -846 1116 976 -980 -817 1088 906 -1145 -746 1139
4437 1139 728 -1211 -786 1074 565 -1147 -731 1176 615 -1194 -683 1173 532 -1252 -642 1124 549
4454 549 -1323 -691 1108 444 -1269 -529 1198 363 -1312 -298 1181 386 -1202 -267 1227 365 -1210
4471 -1210 -252 1299 342 -1134 -79 1289 310 -1080 -139 1276 211 -1024 -64 1286 122 -1217
4487 -1217 -71 1272 97 -1211 88 1224 140 -1179 35 1189 -26 -1146 23 1017 -36
4502 -36 -1264 -9 1234 -156 -1157 118 1100 -186 -1103 85 1044 -369 -1028 71 1042 -342 -1083
4519a083J485O27j266q82J551N07j390n48J416N64j406n92J400P07j581m64J428
4536D73O07j452n45J400M83j381n52J509L89j347l44J409J18j241l48J440K39
4553H57j477j67J344Nj308J4J325l0j353RJ353l7j298J43J319J29j592lJ417K7
4573F77j441Q0J319k2j323J87J247k50j229L05J217k77j192K85J251m45j218L78
4591d51J330l81j115L64J104m20j252N31J252o73j204N75J190n40j234N76J183
4608H35m65j245N05J126l93j187M93J113n93j156P50R47p17q35O20J048q77r60
4626i91R90Q59q86r40J006Q42q81r35J048O64p38q28Q03Q18p94q12Q97P04p71
4645E5q22Q65O96q79n34Q52O59j015o23R70N92r48o40R86N28j036n19J016O14
$$ plain form
4519 -1083 402 1029 -237 -1119 432 939 -451 -999 417 981 -425 -1017 383 1090 -491 -955 473
4536 473 1080 -372 -917 483 966 -415 -967 542 931 -416 -760 649 767 -474 -822 618 857
4553 857 -620 -787 557 562 -746 -732 593 563 -790 -781 572 535 -763 -620 699 828 -764 -767 650 677
4573 677 -764 -684 635 613 -710 -523 724 474 -755 -450 767 490 -702 -417 834 389 -829 -451
4591 -451 879 498 -617 -253 851 431 -821 -290 962 289 -915 -340 850 310 -924 -348 835
4608 835 370 -875 -370 756 363 -824 -331 782 189 -967 -217 730 13 -822 -202 846 -31 -991
4626 -991 -1 858 -28 -968 38 880 -1 -936 112 776 38 -790 13 831 37 -775 122 826 55
4645 55 -767 98 794 -85 -619 233 892 -123 -746 224 816 -132 -772 214 742 -294 -813 203 817
4664H17j154n19J064M89r70m86R83M36j041m55J152K50q79m50J055K55j139L2
4682e60R33J41j086M4R54J31j151m0J238m4j033o5J177J0j068j4R44J15j090K
4702d62R87J25j063R5Q07Nq60j1Q85j02r77L68Q48k98q85L70Q09k64j075M12R48
4723F62m63r43M34R41l89j155N24J092n40p97K72R59l94r31L22R31l79p83L73
4742b64P75m23p39N18O64m65n09L48P55p64m52O35N48o65n09O32N76o31o25P44
4762A49N95p92n45O25P06o95o48P37M51o76n15N84O07o98m62O71M88p48l43N50
4782D1N34r88k27Q74K23o46n07R20K80q13l40R50L14j050k76Q84M17q82k14P07
4802B01J90o60j89P87K2n82l2N59J30p70p2Q20j2r07L2R85J1r03l5R69j45q68
$$ plain form
4664 817 -337 -856 208 697 -273 -759 224 660 -381 -836 316 566 -313 -763 292 547 -592 -560
4682 -560 373 514 -572 -528 426 557 -594 -634 604 560 -473 -538 639 649 -419 -433 511 626 -464 -462
4702 -462 525 650 -413 -318 489 494 -366 -377 508 406 -571 -203 645 347 -538 -168 641 377 -698 -286 662
4723 662 199 -744 -310 631 242 -913 -389 703 163 -634 -362 597 203 -728 -406 525 146 -637 -264
4742 -264 511 88 -651 -133 531 66 -443 -95 660 -104 -556 79 627 -38 -547 85 661 30 -595 149
4762 149 744 -48 -593 32 738 43 -605 132 583 -93 -608 -24 583 -115 -577 94 582 -166 -509 41
4782 41 575 -413 -640 234 457 -189 -696 224 504 -309 -649 301 615 -435 -711 173 590 -292 -506 201
4802 201 391 -269 -458 329 351 -231 -263 296 426 -344 -416 404 392 -515 -483 502 513 -390 -425 544 399 -469
4824d69J16Q68j71q12J82P67p4r39J72P39j26n98K5P55k13p85K31P09j80p16K58
4845b61O13l68n93M33N97l53p06K54Q60l38p53M55O97l75o99M33P14l49o98K21
4865b16Q16m44n28M08N54m80o10N71N74m62n39M36N36p33m53Q52L54o24m73N47
4885H6P13p88o16O94K87m22n69P43M69o82m70M32N54n63m33N79M00o32k28N23
4905G7L08p00j38O95J62p69k35R53J20q48k19Q56L10q89p9Q00J00q35j67P45L12
4926E59q55l04J018R3o85j98O74J85p33j98R00l4q75J86O53j09o91O3R52k39q67
4947e05K13P44k18p27K16P44j85p78L8R69k50p95J10R07l44p81L19Q09l61o04
4967d79J84Q58n32m22K48O29k60q31N17O34l39p33M68Q29o07p78N26Q18n75o63
$$ plain form
4824 -469 -353 515 344 -468 -286 481 407 -532 -360 379 253 -345 -320 435 222 -563 -332 377 197 -519 -261
4845 -261 352 -16 -609 -176 421 68 -638 -384 476 138 -615 -160 537 162 -537 -104 610 261 -437 -216
4865 -216 600 156 -372 36 590 110 -500 71 645 183 -356 80 616 -117 -570 282 636 12 -461 86
4885 86 799 11 -605 89 376 -46 -615 128 597 -85 -555 -123 431 -132 -565 14 414 -218 -446 77
4905 77 385 -315 -453 242 404 -365 -600 353 473 -375 -594 262 572 -317 -396 404 504 -331 -498 247 559
4926 559 -296 -600 418 511 -174 -372 302 487 -246 -444 456 422 -453 -267 386 277 -414 -351 601 362 -505
4947 -505 -292 452 234 -493 -277 467 282 -496 -458 511 261 -534 -424 483 139 -642 -323 486 125 -479
4967 -479 -295 563 31 -391 -143 486 226 -605 -88 546 207 -526 -58 771 164 -614 -88 730 155 -508
4987e08N31O01m76o67N83M82l86p21M95O49n89n94N46O49p05m50O43M87o64n37
5007f31P34M07o78n77Q95M21q83l77Q60N61r22m35P05O07q63n40P68M83p73k71
5027e09O66K18m74n12P63L83q00j40O78K54r40J6R18K6q21k71J042K9q94j57Q85
5048C60K39q83k95J094J69r10k96Q87K46r89n8Q09J69r74j44R03O5q13Q0P67j40
5069B86q03P0R53k62p63J97Q05j88q75J75J071j79j111R5J132k45r02K90P80j02
5089D24r82K38P69q9p41J44R17l71p21K64O98k13q52M44O45m36n98L02R33o08
5109A67q10M18R75n46r31N04R26o90o83L73Q10n02p26M46Q05m72r07P12P04n99
5129b6n30L57Q44q43m62O74O63p72p03Q52O60p79o05P23P31q48o55Q45O42p89
$$ plain form
4987 -508 23 624 148 -519 64 546 160 -561 -66 583 -6 -600 -54 595 -110 -560 83 570 -94 -631
5007 -631 103 510 -168 -745 150 571 -312 -689 171 732 -190 -625 80 687 -176 -716 52 535 -238 -509
5027 -509 157 375 -99 -611 152 535 -265 -405 273 527 -413 -397 521 547 -274 -545 497 526 -368 -525 360
5048 360 599 -284 -579 515 684 -226 -522 365 611 -378 -436 373 542 -432 -576 327 392 -421 -341 426 286
5069 286 -517 -447 506 244 -519 -322 483 295 -580 -405 666 487 -624 -529 603 358 -544 -254 526 424
5089 424 -558 -320 449 360 -381 -237 680 309 -412 -148 550 337 -515 -71 574 138 -460 -158 775 167
5109 167 -643 -225 750 204 -727 -223 703 13 -670 -297 513 11 -715 -269 536 64 -843 -131 573 -26
5129 -26 -556 -199 645 -198 -660 14 677 -95 -798 54 714 -65 -670 53 784 -64 -719 126 768 -21
5149b1o22P83O92r02o32P65N86o77n26P07O51q38n76Q55M00q55l97R08L54r41
5169b86l73R14L76r55l83J006K53r93l36R99N48j041n41J006M23r66l19R79K78
5188E89j003k28R58K44q82k05R54J13q97j44J093p9j145J56J121q9j012j02J273
5207G15k30r61q3J119Nr98PQ84J26r66l7R73p2r12k6Q80r1j024J82R93j28r71
5229f15L41R15l69q90L69J008m64j100N32R43l28j048L43J202n07j144M87J063
5247G38l91j087L58J094m09r80N48P99l21r71M85Q18m84r06N74Q04m92p47M89
5266h1R53p82p01M97R12p50r31Q29Q75q39o56P44O45n94r28P80P31p55p48O59
5286a40Q26o41p06O68N91p38n60P63N32q37l89O73P53r53n41Q35O43j103o41J040
$$ plain form
5149 -21 -643 140 832 -70 -702 63 649 -28 -554 153 804 -34 -610 245 645 -210 -607 301 655 -286
5169 -286 -659 255 631 -324 -707 299 552 -441 -777 222 770 -271 -812 194 617 -349 -668 311 589
5188 589 -414 -642 316 560 -322 -527 427 540 -357 -501 592 513 -632 -476 645 556 -456 -558 715
5207 715 485 -476 -559 560 565 -433 -426 458 584 -382 -419 554 482 -430 -456 424 333 -691 -509 484 356 -615
5229 -615 -274 641 272 -618 -249 759 295 -805 -273 670 342 -706 -363 839 332 -812 -325 738
5247 738 347 -740 -382 712 303 -677 -129 670 349 -622 -137 681 197 -709 -135 669 177 -570 -81
5266 -81 872 90 -611 -114 798 48 -883 -54 821 -18 -674 70 715 121 -807 -27 704 -51 -799 -140
5286 -140 686 45 -661 7 598 -140 -700 63 595 -242 -631 42 795 -158 -699 136 779 -324 -965 75
5306G5P01r17o73J060M39r23m92R89N11q76o15J088L69j021m30R72M75r95k66
5325e29Q92L10j031k25R42M85j171k36J070J14j118j53J067J76j060l29J051M10
5343F65j096l12J116L03j161j85J166J14r76k24R64K17j039o8J058r6r90m1J169
5362E84q1j079MJ090kj201K01J096r4j129J19J126K5j220n6J134mj195K44J032
5382E94L5j074R7R20j90j070M16R25k97j077M37J000n36r48M90J083n65r16L65
5401c11R92m36j057N35J019m89j136O70R48m32j000L93Q84m89q08M18R43n20p52
5420f28M99Q53o09q28O82Q88q68o58O15R05o92j021Q79P98p48q72R10P82q08q86
5440h07Q38Q45r16p71Q09P01n29j050R05O75p48p39Q54O17q12o43Q98O92r89o41
$$ plain form
5306 75 776 -141 -814 246 685 -238 -730 259 770 -106 -721 367 736 -285 -715 257 732 -263 -529
5325 -529 363 673 -358 -583 359 844 -327 -563 507 621 -497 -650 417 593 -467 -796 255 665
5343 665 -431 -743 373 676 -485 -670 496 610 -366 -590 374 591 -448 -516 542 446 -544 -585 584
5362 584 503 -576 -572 518 516 -685 -484 612 518 -611 -492 634 659 -561 -617 517 513 -682 -438 594
5382 594 629 -445 -348 572 382 -688 -272 653 356 -721 -284 716 180 -768 -278 805 240 -676 -311
5401 -311 681 245 -812 -277 742 253 -883 -213 735 303 -697 -304 580 91 -717 -299 644 124 -628
5420 -628 -129 724 115 -713 -31 857 -11 -669 -54 851 159 -862 17 815 67 -805 105 887 79 -807
5440 -807 31 876 -40 -811 -2 699 170 -880 25 700 -48 -787 67 684 -128 -771 127 819 -170 -811
5460h11R77O50j208l80J023N14j101m58J018M82r08n54R59N07r77n83J173M42
5478G65r95m96R22N50j008m80J145L43j094k69R74L77j081j79J010J86j024k24
5496e78J163J37j131l08J301J06j156j04J057K54j186m2R62Q5j046j27J124J2
5514E23r53k07J156N3j142o4J215j01j123J80Q92n7j133K20J152j37j097J1J417
5533H05l94j002R7J079j07j184L38J055k04j133K94Q53j33q59J31J035l91r15
5551f35L85J029l86r27K44J075o22q65L99R99m29j027O05J020o37r53M90R73m34
5570C04j136N95Q85m22r76N36Q59m64q68M39R19n79p79N80P76n48r07P72P29o60
5590E5q08O71Q05o84q43P23R48q02q19P78Q14p58p42P71O44p66p59Q08P88q22
$$ plain form
5460 -811 166 816 -392 -772 251 765 -336 -794 224 706 -202 -756 203 710 -267 -850 323 765
5478 765 -230 -726 196 746 -262 -742 403 746 -348 -617 357 734 -347 -526 484 670 -354 -578
5496 -578 585 722 -409 -717 584 690 -466 -570 487 741 -445 -487 475 560 -486 -613 511 523
5514 523 -430 -637 519 572 -570 -634 581 480 -643 -463 429 372 -761 -541 611 474 -623 -612 805
5533 805 411 -591 -494 585 478 -706 -368 687 483 -650 -356 497 364 -495 -364 671 280 -635
5551 -635 -250 779 393 -534 -290 785 163 -702 -303 696 267 -760 -155 865 228 -725 -235 738 304
5570 304 -832 -237 648 226 -750 -214 645 181 -687 -248 671 92 -687 -107 669 121 -786 -14 715 55
5590 55 -753 -82 723 39 -804 -81 867 65 -754 24 838 80 -662 109 753 -13 -772 36 824 2
5610Bo80P91P04q20n89P15O07q67o30Q75N65r01n11Q55O51j037n16J007L74r13
5630c18n00R62N45j032l16Q94L74r04n19J075M52j053l66R36M42j007k34R22K93
5649F46r98k39J007K74j071k09R81K38j063j98J157K28j171j40J119N2r85j96
5667e68J115N6r85j24Q04K94j070n2J061m4q65m9R21k4r47N6Q84R3j095j9J156
5688E98j40j172J99J160k28j095J56R99r3r55L9J086k23q29L3J087j51j139K97
5707c71R80l16p84K87P20j67r56L34R86n79o85L62J039n34r70M16Q82l70r17L71
5727b72R64m05j011N08Q79m15j015O52Q21m70r51N55P60n06p47N46P84o28p85
5746g36O14Q02p05p14P11O97o48o24N31P66p53p20P73O61o64o17O45N97m91p82
$$ plain form
5610 2 -678 113 817 -3 -592 123 730 -137 -767 108 673 -228 -739 116 767 -270 -786 221 595 -318
5630 -318 -818 144 689 -343 -659 235 609 -295 -814 261 713 -340 -706 230 672 -335 -569 353 646
5649 646 -352 -591 416 690 -381 -590 391 629 -434 -632 525 753 -418 -558 561 613 -372 -568
5667 -568 547 603 -382 -506 298 592 -478 -530 531 487 -378 -427 494 470 -477 -421 463 556 -539 -558 598
5688 598 458 -714 -515 645 417 -678 -522 477 384 -571 -532 554 331 -498 -465 622 471 -668 -371
5707 -371 609 293 -491 -204 516 349 -607 -273 713 134 -551 -189 850 316 -654 -238 644 274 -643 -272
5727 -272 692 287 -724 -216 663 248 -767 -115 706 236 -715 -160 600 94 -653 -107 677 49 -736
5746 -736 -122 680 -25 -739 -28 669 21 -603 -72 694 -59 -779 -6 655 -9 -626 19 616 125 -657
5766f57O38O60o63o64Q00O60q30o48Q10N27p65k87M87O15q81m76Q67N23q00m39
5786e23O97N39q70m73J084K70r03m50Q31M28p76m83Q41L09q46l38P85M18p89l56
5806f05Q56L68j017k51Q23L85q52k40Q52J06o65k69Q91J85r16q7P40J65p89k06
5826e26R50J37r44j71R16J68q64j65Q99M0q93J1P40J54r77J44R05o1q75R2P27
5847D07O7j129K57Q84j20j043K68R00j15p99K2Q68k88o06%R32k42p11J34Q37k83
5868B40o91P3Q45j75p97J60R06l73p09L32P39k83q86M49P71m05p58L86P12l12
5888B24r26N26Q64m75p60L76P19l57o83K78P57l87p37M34P16l59p56M84N28n39
5908g3m37L66P35n61n57M38O46n20o48O01O34p16n71O32N93o72n52O58O10o52
$$ plain form
5766 -657 -19 641 -22 -686 114 774 -56 -704 106 633 -132 -419 68 683 -198 -674 193 716 -84 -523
5786 -523 174 713 -157 -630 454 724 -179 -629 202 630 -146 -629 212 521 -325 -663 122 540 -249 -605
5806 -605 251 619 -398 -649 174 559 -293 -533 319 425 -240 -509 382 567 -349 -436 304 469 -320 -526
5826 -526 424 561 -383 -554 362 530 -334 -499 400 440 -453 -442 298 452 -525 -381 524 463 -412 -320 407
5847 407 474 -655 -398 486 366 -677 -409 491 376 -423 -401 467 179 -427 -427 505 263 -448 -314 523 240
5868 240 -451 -378 467 292 -505 -345 561 188 -521 -189 550 267 -619 -170 601 196 -562 -176 536 224
5888 224 -702 -176 688 213 -547 -171 548 191 -492 -214 543 156 -581 -147 569 210 -546 -62 466 -73
5908 -73 -510 -144 591 30 -527 -89 557 37 -611 -10 624 -92 -663 -31 562 -110 -662 -4 606 -46
5928d6o29O56N39m38o31N95N34n46n79O14O01n94o88Q46L46p57l63N13O02p17
5948a42m34O52L83n32m62O79M01q36j79O08K64o46l02P14K50o50k80O90K16n95
5968b01k04N34K81n83j79N30K57o17l10P30J79p92r8P50M2o16j95Q53J09p32j89
5989d51Q71K8o99j97R48L3p34j73Q37L9p35j04O57J11q32O9P72j25p11p7R19p9
6011C67o38Q0O42j55p24J54N71O4q25K28O27j22o80R7P42j85o14J20O32k23n89
6032d31L39N10j94o47J73P05l51n70K57O53k36p20L05O80j64o68K10N67k54p05
6052e41M89O31l39n99L57M02k09o23K78O77l37n56K63N36l79m95M02N07n30l87
6072d53M17M16l93m65M32N15n25m64M71N21o42k68M72M11m59m09L56N98n52m01
$$ plain form
5928 -46 -675 -19 520 82 -549 46 580 34 -545 69 670 76 -612 234 580 -177 -540 -27 575 -142
5948 -142 -576 76 459 -73 -535 144 545 -291 -470 138 402 -244 -546 168 418 -232 -512 178 394 -201
5968 -201 -405 129 410 -173 -352 178 435 -182 -492 238 417 -375 -473 277 319 -297 -492 361 470 -262 -451
5989 -451 420 448 -251 -448 500 533 -201 -374 463 502 -233 -337 320 431 -401 -332 440 315 -396 -473 446 367
6011 367 -271 -191 451 296 -428 -274 297 361 -464 -236 391 269 -411 -314 428 243 -371 -251 381 158 -431
6032 -431 -92 418 224 -423 -250 455 104 -466 -209 444 208 -512 -207 473 309 -359 -149 418 164 -541
6052 -541 -52 579 240 -359 -2 400 191 -432 -154 523 186 -370 -107 429 50 -445 -43 464 -66 -453
6072 -453 -36 380 -13 -478 -46 469 -56 -520 -49 472 -170 -438 34 445 -14 -423 -67 531 -21 -422
6092d22M82M84o31m13O07M28o01k87M64L81m20l32K33O04p58k80M77M86n81l29
6112d08P12J07m78k49N00K58o60j08N06J67m94k44O28R3m81l39O23L20p26j27
6132d00M89L03n16k66O53J3n86j12M98L23p66M7M06K27n86j81O30J02o79R1N07
6153A97K01p22P2M54J08n46j40P03R9o84n4O34Pn14j33O69p6n50R2N56r2n53n4
6176c26O08q4n29J10O50j77o18J90M27J6n72Q0N52k23m37K19L68j35l78MP33l39
6198A39m00J18L89j99l85J19N77j56n95J67N97l09m47J53N40k37m27K81M68k08
6218A85m93K15M26k60m55L95K70k22l06K84K89l70l90M43L27m26j29J62L55k81
6238A9m04L71J28l3n75M67M65n56k56L76L28m09l70L83M24m82k81M85J76l48k36
$$ plain form
6092 -422 60 544 -87 -500 107 535 -66 -353 111 492 72 -260 -27 577 -181 -461 16 502 -79 -408
6112 -408 304 411 -67 -316 184 442 -218 -326 180 347 -147 -391 237 330 -151 -490 133 453 -273 -400
6132 -400 89 392 -124 -390 263 276 -310 -422 76 399 -367 -320 86 313 -273 -454 176 278 -401 -310 197
6153 197 398 -324 -252 202 310 -236 -376 327 426 -258 -312 322 329 -185 -318 351 275 -275 -183 373 281 -272 -326
6176 -326 282 198 -331 -221 429 252 -366 -176 251 267 -305 -225 327 104 -333 -114 254 119 -259 -255 478 139
6198 139 -261 -143 246 47 -338 -219 358 202 -393 -226 371 62 -385 -232 308 71 -356 -75 393 185
6218 185 -308 -93 333 73 -382 13 283 61 -245 39 328 -42 -432 11 338 -88 -217 -55 300 19
6238 19 -385 -14 114 81 -494 -27 438 -118 -374 2 330 -79 -449 -66 358 -124 -405 80 256 -92 -328
6259c28K32L56l78k06N26J77n66j36L89K05n38j50M41L68m65l06N97J24l86k03
6279b47K75L27m77j81L72J87m05l7L20J73l82j52L17K16m30q4K27Q4l65P9K67
6300H4N4l63j86N61Q8k75k94N02lm35J52J95L2l89j01M65J60l78j51M46Mk68n9
6323a59L72Q0n15J06M08j12l69L9L46M3l96L3K28J08n08J64K92k4k91Q0K75j05
6345I5k96R9L44J1n33J70M13k07l58K52K48j46l60N1N63k26m25K24M74k11m03
6366b21J36L30j80k70J02L19j99k60J70K93j53k52J14K21j36j62J5K93j10j96
6386a46J10L13k38k47J69K53j61k63J33L00j32l05J50L60k80j85J7L87j98k51
6406b14K86J95k76j15K48K7j02k43K46O6j96j42J65J52j93j92L74J06l62j04K76
$$ plain form
6259 -328 -96 260 -118 -324 202 379 -187 -323 66 271 -267 -417 24 392 -73 -379 218 342 -44 -247
6279 -247 28 355 -122 -303 69 256 -149 -186 134 307 -75 -227 90 306 -124 -208 19 103 -262 -183 84
6300 84 138 -225 -411 150 238 -37 -331 171 168 -267 -115 80 112 -277 -378 87 247 -131 -282 164 168 -100 -159
6323 -159 213 293 -222 -116 292 180 -189 -150 196 239 -157 -124 104 212 -296 -132 160 136 -155 -75 200 95
6345 95 -201 -102 242 253 -280 -110 303 96 -262 -10 238 92 -268 -217 346 120 -305 -81 393 182 -221
6366 -221 -85 245 65 -205 -103 216 17 -243 -73 220 67 -185 -71 150 14 -148 -133 160 50 -146
6386 -146 -36 277 39 -208 -39 214 53 -210 -77 223 91 -214 -64 296 16 -169 -152 235 37 -214
6406 -214 72 267 -9 -124 124 151 49 -194 52 118 -78 -220 -55 97 -96 -288 86 192 -170 -274 2
6427BK63m12j74M22N8j87j15J03J81j53k06L15P0j67q8K06J13k27k17K84L5j81
6449g5j88K97J59l28N4L37j49k52o7L02J66l42R5O3J99m38qK58M5k08m7K12m9
6472C6k25L3N2J51p0j21K45J3k78J47J85l4l46MM26k28j06J27M6J7j63o2L97j35
6496A11k13J9K44k1l06L6K10n3j20M1O5Q0j32K3K15j22j14q5L47j96k56J95J49
6519A17J8l32K03J14j97j54J88J01o7l4N9P2r2j71J67J37j46L7L1N7m0o7K2J36
6543A59k07j23K42J8j52j19L51R5k43j31J44J77k35j73K47R7k15j7J84Q2k57k6
6565a02P6K00r0k25J28J52j44j06J83l0j41j7J00N7j03j52J96J65j72j02K87l7
6587A23j33o4J99m9j30k7J95K7o4r5L3J74j72j19K36j02j1j42K24m6n0o7J18J8
$$ plain form
6427 2 265 -147 -321 101 159 -28 -143 -40 141 -12 -218 97 167 0 -88 118 231 4 -213 71 106 -75
6449 -75 -263 34 193 -135 -81 256 107 -145 -212 90 256 -86 9 72 271 -167 -175 83 128 -80 -127 85 36
6472 36 -189 -156 -104 47 -23 -144 101 114 -164 -17 168 134 -212 -208 218 -10 -116 11 57 74 -89 -151 246 111
6496 111 -102 -83 161 140 -166 -130 80 27 -93 -52 13 93 -39 -16 199 77 -37 -122 225 29 -227 -32 117
6519 117 135 -197 6 120 -77 -231 -43 58 -9 -43 16 88 -4 -175 -8 129 -17 20 51 108 68 1 23 159
6543 159 -48 -171 71 89 -63 -182 169 264 21 -110 34 211 -24 -197 50 147 -68 -85 99 181 -76 -102
6565 -102 -26 174 84 -141 -13 139 -5 -111 72 42 -99 -116 -16 41 -62 -214 -18 147 -25 -127 160 123
6587 123 -10 -74 125 76 -54 -81 114 141 77 -18 15 189 17 -102 134 32 21 -121 103 57 7 -60 58 76
6611G6l3o6K07j37j64O5K03N3l38J35J89j40k12K43M6j01j33J22Qnp5J5J76j65
6635c1m9K0j6M6q8N4o2J27r5LJ35q1m4O3J24m5k60J38J45r5l4n5J00L4o0J1M2
6662B7nM3r7J63j38j0om5N7Q6O2k2r3jN6n6l4j25K79o5j93M2J81O9k02j29J01
6689e5J50j93O2j7N3r5M7J9J0J02k99K07Rm2K2J3q5P3P6l7J60k51MJ24K0o3K8
6716D2L3Kk28K17O1r0n4nP6n9k1Q6O9r0Mk0m3M6L0J6n8K1j45K06m9p0Q9j23J57
6745A00r6j44K48l6N2k55K4J17l9r5J00K8k5M1o5n5PJ5O8M8j48%J92l9p1J06p1
6772Gm8j11J78j1J05m6l8j46J91jj76K37l5J2j35j33J88j05J9K0Q4mL4r8j0R4
6798G2j50O3N8m5o9J20Kk00Q2J10N0j68O2Q9%j25N8j33J55k8l9J11j57o9R1J12
$$ plain form
6611 76 43 -23 184 47 -117 -52 151 204 -134 1 190 50 -162 81 127 26 -107 15 23 18 -57 -42 134 -31
6635 -31 -80 -60 -76 -30 -118 -64 -126 1 -94 -91 44 -37 -81 -18 106 61 -199 -61 84 -11 -45 -100 0 34 -26 -15 27
6662 27 22 65 -32 131 -7 -17 -23 -68 -11 75 137 115 22 21 77 21 -13 -138 141 76 -117 -75 106 175 -27 -156 -55
6689 -55 95 -98 -36 -53 0 -95 -48 -29 -19 83 -216 -9 0 -42 -20 -7 -92 -19 57 20 180 -71 -67 57 77 14 42
6716 42 75 77 -151 66 127 37 -17 -22 54 -5 -26 60 129 39 43 23 -20 26 56 72 14 35 -110 96 47 -23 66 -57 100
6745 100 4 -140 108 72 124 -131 -107 10 -29 -124 -24 4 -21 20 -45 -100 -93 -78 -10 38 -110 -110 82 43 -28 78 7
6772 7 -41 -152 26 15 120 74 36 -110 81 80 -96 141 106 118 -17 -150 38 -67 -48 -28 56 52 86 -12 -22 72
6798 72 -78 -15 43 -2 -71 49 51 -149 -67 43 93 -75 -13 76 76 -49 9 -124 31 3 -36 75 -82 -151 -60 52
6824E2o1l1PP0jj10P3J33l4k50J43J00j37P5M8m8k7j24K52Lr4j54J08J30oj34
6850a7mM4N8l7L7L9q3j12M4Q6n1j17J60M4j88N2L7O2j20p1J65R9j97j44J99J3
6876bm1o1J08P6nk71K16l5N3q0R5n8j47J11P7OM5o7O5L0j93J72K5pk62J67Q9M8
6904A54k33pQ2R9k7o1m6J10j11j82K88M0j74J3J02rk41K60M3Jk21J9K16o1j50
6929i6k2J37o0q2J22K05k51j53J23J23k6j36Q5L6m8L5K5Rj7L1l4j2R2j74j4K14
6955A12k7l36L79L8j67M9N2o6j5j80P4K71j68j17P3L8N4k41Q3J82j4j22M9L1j44
6980a12n2J32M9j52O9O7J68k04j01J89J00k28N2%K65l76l9K82mj94n3J15J96j08
7004F1k13J59J00j20q8J93N1j8k32R7K07k44j11J90R3o9j42J89J01k16r3J65n5
$$ plain form
6824 52 -9 -40 -33 37 36 -74 -1 132 98 -152 -9 91 -46 29 77 29 2 -122 130 133 39 -115 -7 123 117 -17
6850 -17 -21 23 81 44 81 120 37 -75 -31 55 4 -113 47 91 -97 -45 -8 54 -66 -137 28 127 -70 -214 -15 -2
6876 -2 -43 -104 4 80 75 -196 20 -15 38 -42 53 -5 -152 -41 36 42 87 20 85 115 -78 94 119 112 -150 17 106 154
6904 154 -79 -86 -4 95 68 7 -39 71 -40 -222 66 106 -68 -55 47 38 -203 57 100 101 -120 -101 115 54 -96
6929 -96 -118 19 -41 -123 -1 204 -47 -200 -77 46 20 -116 -31 5 -43 -8 17 26 9 40 6 -6 86 -88 -102 112
6955 112 85 -251 128 166 -1 48 100 34 19 -161 -87 184 16 -101 -28 10 64 -177 -94 88 74 -48 1 32 -112
6980 -112 -164 -32 17 -135 -66 1 169 -35 -136 53 153 -75 -23 -23 242 -134 -173 109 105 -89 -142 -27 169 61
7004 61 -152 7 107 -13 -101 92 143 125 -107 -10 197 -47 -158 32 125 56 -86 103 204 -12 -105 60 5
7027Ej7j9J54j06j79N9O1J76l15M6J29J79k54p6R8J51k06l8K41O8k35nJ48n2j82
7052a69P0N8J46k65O6K28r1r3n6J81q3p8N9J82p0k16J99M5m3k86K24R7k00K03
7076A08k21K43lk28N5K64j81j90R4L14j24l45J51K15m3l12J43J88j92j09J43R0
7098F0L5j68k5K14N0l75J37J87j8k63n6L93n1l00J61R5p0j11J2L10r1j33J79q4
7122H8j34J3o8J13o7P3j39K33j72p6J79J56j56k04J68Q2j22j38J21J61m9j47L3
7145e2J37j24k04J82R9k6r9K76p1k46M4K34M4k57m4J47q0rl0K31N9j69j36J83
7169H9M0j28j40J93M2j12k4O8J39k07m6J33N3k78Q5K65j7k27j30L58M5l40J11
7192b8K22r0k38j12K89J59k79o3Q2K94l74K0J61k0j42m9K78j01j19r5K82P1k37
$$ plain form
7027 5 -12 -31 123 17 -162 -103 -42 134 -181 -135 -6 173 -81 -157 -59 92 -114 -152 89 157 -78 -83 65 13 -169
7052 -169 -99 -41 105 -160 -94 134 43 -50 -106 75 -8 -86 -27 155 85 -131 68 113 70 -216 8 105 -95 108
7076 108 -113 130 127 -101 -46 218 37 -153 -59 255 131 -214 -63 152 109 -203 -60 128 -64 -173 -30 60
7098 60 95 -73 -98 116 166 -209 -72 115 97 -166 -222 171 120 -180 -19 76 6 -105 -93 217 126 -7 172 88
7122 88 -46 -33 -101 12 -55 18 -121 112 -60 -136 43 199 43 -161 7 89 -33 -171 -50 111 62 -85 -52
7145 -52 85 -39 -243 -61 38 12 -87 189 118 -128 -84 150 194 -63 -107 40 -40 -49 -79 152 211 42 -94 89
7169 89 129 1 -139 54 96 -16 -40 28 167 -40 -86 47 100 -178 -93 172 155 -72 -202 156 201 -139 -28
7192 -28 194 104 -134 -246 43 202 -77 -140 -58 236 -138 -118 43 23 -119 -168 110 9 -110 -205 77 148 -89
7215h9J15J76j35k31R3J72K3k42Q4L06j11k47j41M23n9l23J69J55Q4k69RK70k54
7238b2j96Q0K41j5l50K29L5J09k22OL23l12j64J15K19j03j67J37R3J1j60L5J93
7261A15j02k01Q9K29j57j33Q0K27n9k08J06N9k1j80J87J27j31n0K5N1m9j15J37
7284B6K77k74j73K12P0l9k91K60J92l05%qJ78j20j94K69K2j86q0J46J84p9k63
7307a76K10Q4j32l06M01J15k88PJ46J76k13j68Q4K55k74r4K42L7k73k4J78J55
7329A42j95r9K56j3j90j19K66J19k40j8K03j25Q1j44L08j02j99k5J33J47l20K2
7351a12K04P9m00J04K41L9j70j15K17k6j67K5J35j8j95l7K88j49J20j88K33L5
7373A43l91L13P7o6k62M3L85k17j73J50J73q5j99RJ69n5j36j1J66P4k95J74K33
$$ plain form
7215 -89 26 202 67 -164 -71 101 124 -118 -34 272 161 -86 -227 196 137 -186 -17 138 222 -47 -38 232 -22
7238 -22 -218 -138 103 88 -262 -33 2 111 -111 -105 218 -94 -258 -143 76 -27 -194 -57 36 47 -113 -78 115
7261 115 13 -188 -99 130 -27 -160 -80 147 88 -120 -14 45 24 -156 31 158 27 -23 2 53 4 -111 26
7284 26 303 29 -144 68 138 99 -192 68 260 -45 -45 -53 125 5 -189 80 102 -84 -164 -18 166 87 -176
7307 -176 34 118 -14 -320 81 196 -92 -85 61 237 24 -144 -60 195 -79 -173 69 106 -167 -191 -13 142
7329 142 -53 -152 104 91 -99 -218 48 167 -73 -91 112 -13 68 -76 232 130 -69 -94 39 186 -134 -112
7351 -112 92 171 -229 -125 116 155 -15 -130 87 61 -106 -81 54 36 -159 -196 92 -57 63 -125 108 143
7373 143 -248 65 142 76 -186 -143 242 25 -148 2 175 90 -109 -100 69 14 -122 -133 33 107 -188 -14 219
7396B19l3l01J7K44j78m8k4K35rj42Q6R0o4j25j14K83Nl23J89R2j32j26j0L92
7420B23k31k84K27L29l67j30K23L9j31r7J45K22j22j57L8J75j21j63Q0K25j06
7441A7j94K16N3j29k3J76M5j41j94J24K36j93k3P2J84l09n9J56J01j15j37J84
7463D7J63k67r4J91J07k10PJ51n9kj49K20J8j26j45J17J92k00j26K36M2k66j02
7486b55L30Lj33q7K06J37k97j05L89j12j36r3K08K7j56n5J59O6j69K6J20O4j71
7509c4p5J69M7k72J31K64j1k51m1L35j80k00Q0J80j04n8m4K15p0j92J28N9J03
7532A79k77o0K02J38k45o7J76K5k18m8K31n7j27J40J12o8j27K2KJ52j48L0J69
7555A36m0j65M3K82k39q3J5K88j6l41K09n4k4q9N0J92j98j14J94R0j21r7K5J37
$$ plain form
7396 219 186 -115 -98 146 -32 -80 -104 131 122 -20 66 156 92 -33 -147 136 141 -182 7 99 -33 -159 -169 223
7420 223 -8 -292 -65 264 -103 -233 -10 29 -102 -199 -54 168 46 -111 -73 102 -19 -182 -102 123 17
7441 17 -177 39 92 -37 -60 116 161 20 -174 -50 186 -7 -30 42 226 -83 -142 14 115 0 -137 47
7463 47 210 -57 -151 40 147 -63 -56 95 36 34 -115 105 123 -3 -148 -31 161 -39 -165 71 113 -153 -255
7486 -255 75 78 -55 -142 64 201 -96 -201 188 76 -60 -153 55 82 -74 -129 30 96 -73 -47 73 137 -34
7509 -34 -109 60 107 -165 -34 230 219 -32 -73 262 82 -118 -38 142 38 -20 -64 151 81 -111 17 76 179
7532 179 -98 -158 44 182 -63 -130 46 71 -147 -195 36 -21 -148 -8 104 36 -91 -69 -67 85 -63 -33 136
7555 136 96 -69 -26 256 17 -66 -51 237 221 -120 89 35 11 -78 -28 164 -34 -148 46 136 15 -82 -57 80
7579H0o2j98K54J92j98j28M3J47q7k08J17J76j72m2P1J69j63j81K10L3n2j76l1
7602b06L57j68k13J88Q9Jj59J72J59k86o1J79N1p7j41J83N5j25n1J18Jj33M8J86
7626A67r7o2j14J24J60j82j46L5L00j07j51J25O5j45j73J83K53k85n2K30Kq1j39
7649i0J64O3j93n6J82J28k16J06N2j8j22j53J44K5j22P5j6K43k07j43L43q0k74
7672a65n2L42J11l99p9L10O3j62j4Q8J22l12R7O3J05j80N9J15Qk45J27J94j03
7695I3k02J0K10m1j85k7L16j28j96J52K0l0l8n7K43n0k13P4J37N7j52OK9L7k86
7720b21J98J99q6j58o3L82k44j43J07J05J0k10Q6J19n5j00J15R5k05j15J65Q8
7742F9k4k21J36J18j3k88J05K91k16m7J20K2j08K2n9K35q6r5n1K55j56j69J87
$$ plain form
7579 80 18 -180 74 266 68 -60 -17 130 43 -165 -48 128 -44 -86 -15 154 -9 -190 20 53 1 -175 -206
7602 -206 151 -17 -230 -42 47 48 -111 61 220 -66 -127 52 103 26 -115 68 123 -2 -53 65 66 -67 -19 167
7626 167 70 8 -106 18 178 -4 -150 -115 185 78 -73 52 117 -28 -201 -18 235 -50 -102 128 130 49 -90
7649 -90 74 137 -56 -112 70 198 -18 88 140 122 0 -153 -9 16 -106 -31 -47 196 -11 -154 189 109 -165
7672 -165 -217 125 236 -163 -242 68 131 -31 -45 43 165 -147 -50 13 118 -62 -3 112 120 -125 2 196 93
7695 93 -109 -99 111 70 -115 -142 174 46 -150 2 22 -8 -46 -103 140 90 -123 -49 88 145 -7 -1 28 65 -221
7720 -221 -23 176 90 -68 -131 251 7 -136 -29 76 86 -124 -38 81 26 -74 41 136 -69 -184 -19 69
7742 69 45 -176 -40 78 65 -223 -118 173 -43 -90 30 52 -56 -34 -93 142 56 -39 -90 165 9 -160 27
7765B7N7r2j69J73J10j34l6J55l8J05l63K22J20j49L8J03p1n2q8K09qk47n3J80
7789aQ9j72q1K06J09k04M5K0J8j5J1J33q1N6k79K31M8j79n8J46M5k04J19j1J53
7814A44k05j3O1J37k15MK36j19l5j11K58j07j06J09L8k4r5l2J73k4k06J71M5r8
7838a4r0J30N0J7k09l7K02p6P8jL3Mk60J55K00k01j05M9K79j2j76q0P3J04j81
7863f8L6K09j55j94Q7K13m7k19j1J89J8k9j11J29l9r9L9J32M1j17J2lN7k42K59
7888H7N2j42q6N4J41n8l7q4R8k7o9j9K37p7j04j8K03j91j17R6J66k5k12J41P8
7913H7K8l03J08J68j42j60J50J07j65MJ46J61j16k15J01L6R9j21N2J21j97J3m3
7936h1J70o6q2M2M8j68k5K53K4j44r8J43R6k7j9o6J73j53n5J85m2j08k17K43J16
$$ plain form
7765 27 84 -8 -177 -4 106 -28 -64 91 53 158 -205 17 137 -12 26 129 58 6 -82 127 119 -128 -181 -1
7789 -1 88 -84 -165 41 150 -54 -9 11 29 14 25 158 77 133 -146 85 133 -46 -104 42 87 -117 2 -9 144
7814 144 -61 -74 -13 124 -91 -87 149 30 -5 -116 142 35 -71 38 76 52 -43 -75 98 74 -132 39 84 -14
7838 -14 -104 26 76 93 -116 -153 49 -27 51 50 83 87 -173 -18 182 -19 -124 -75 204 192 16 -64 9 113 -68
7863 -68 -32 177 22 -172 -85 128 81 -138 -149 40 58 29 -82 47 8 -91 -52 80 121 4 16 13 70 -172 87
7888 87 139 -3 -89 -35 106 48 11 -73 25 -2 -71 -90 147 70 -34 -52 151 -40 -157 -61 105 80 -132 9 87
7913 87 115 -188 -80 88 -54 -214 -64 43 -122 -118 28 189 73 -142 -41 -5 94 -27 25 146 -51 -38 -81
7936 -81 89 23 -59 -17 31 -137 -162 91 115 -29 -127 16 112 85 66 0 173 20 -35 150 108 0 -217 26 142
7961A42k27j12K33J51l40J44k4J83j43j62J48J69j77j6J1m0N9k7m5J00Lp4L5K09
7985B00l49R4J00J9j79J1J00J8r0m7J52M0r3j58J24K39l00r7K67R4j58M8j3M9
8009G1j46j5K45j15r8j3J05o5L9Q6N8l9j38M6JN7k07J01k1J4j7J23R5k03q9N0
8035g5J77j05j22K34o6j14j7L3J34p1k20J13J93n5k10J39J27j20j53J42J10m2
8057C2j10O6J15j54j3k8P7P8j26M3M1L6q8Q5J29j56l8m4R8j5q8Q3J07r5j79J51
8083GP7j96L0J29J07j23l2LK08k70n6O5O6O9k44Q7J04q1R4j26M8j70J06R1P5q9
8109b1o5K6J87j16o1K18j39n0j72J48M1j3n7R7p9M0k1J03o5m9m1Q6J20j71MO3
8135A3N6j38Q0O2o2k3m8P4J1m0j22J85Km3l2J0Jm4P7o4J35j24m0M4R5j14j09K61
$$ plain form
7961 142 -85 -197 36 187 -153 -9 -33 150 7 -155 -7 162 -15 -31 -20 -60 -1 -28 -73 27 30 -44 -9 200
7985 200 -149 -55 45 64 -115 -104 -4 14 -76 -123 29 69 -24 -182 -58 181 -119 -216 51 145 -13 35 22 71
8009 71 -75 -90 155 40 -58 -71 34 -31 8 94 152 113 -25 21 22 79 -128 -27 -48 -34 -51 72 167 -36 -125 -75
8035 -75 102 -3 -125 109 43 -71 -88 -55 79 8 -212 -99 94 39 -171 -32 95 -25 -178 -36 74 32
8057 32 -78 -12 103 -51 -64 -92 -15 63 -63 -20 21 57 -31 54 183 27 -11 -55 43 28 -60 23 130 35 -144 7
8083 7 84 -112 -82 47 154 31 -1 2 210 -60 -116 -51 15 84 -160 -73 31 -50 44 -82 -34 -204 -98 -7 68 -21
8109 -21 -86 -60 127 11 -50 168 29 -21 -193 -45 -4 -17 -74 23 -56 -16 -37 66 1 -48 -89 -3 117 -54 -50 13
8135 13 69 -69 11 73 11 -12 -60 14 25 -15 -137 48 50 7 -25 -15 -14 -58 19 -45 90 -34 -74 -30 65 -49 -158 103
8163A03r8p6M8KO1q1J9J06j39j09J96L8k10R2l3J52j7j22M3J95k55k3J93j02L
8188a4j5K6M7
$$ plain form
8163 103 5 -71 -23 -21 40 -41 -22 84 -55 -164 32 70 -140 -48 -81 71 54 -68 -25 170 -85 -108 85 -17 -14
8188 -14 -29 -3 44
8191D4
$$ Imaginary data points
##PAGE= N=2
##DATA TABLE= (X++(I..I)), XYDATA
0@%%%%%%%%%%%%%%%%%%Lj0J4j3J3j5J6j6J8k2K5k6K9l4L7m0M6n4N8o1O7p6Q6r1
42d6R8j11J25j40J55j76K01k27K62l12L77m60N79p64J065j611K800o287L2580
61B8108J33027j39440j51128J40168J29316j58527j40833J54730J42180j40477
71b876j20471J54076J17699j62909j25848J52017J12215j55709j02538J67720
81C3376J09149j62372j03320J60593R1618j72548r7023J70195R6295j64093q3641
92a21771J72887Q3659j76833q8990J67561P9063j69141p1870J76022P5417j71425
103d5421p1805J66961O1750j71156n8138J72998N7180j70603n0949J71007M5055
114A06879j73098m0767J75403L8439j75836l5199J75421L0675j76208k6510J78978
$$ plain form
0 0 0 0 0 0 0 0 0 0 0 0 0 0 0 0 0 0 0 0 3 -7 7 -6 7 -8 8 -8 10 -12 13 -13 16 -18 19 -21 25 -29 29 -32 35 -41 45 -46
42 -46 52 -59 66 -74 81 -95 106 -121 141 -171 206 -254 325 -439 626 -985 1815 -4472 28108
61 28108 161135 21695 -129433 10735 140051 -18476 -159309 -4579 137601 -2876
71 -2876 -123347 30729 148428 -14481 -140329 11688 123903 -31806 -134344 33376
81 33376 142525 -19847 -123167 37426 129044 -43504 -140527 29668 125963 -38130 -121771
92 -121771 51116 134775 -42058 -131048 36513 115576 -53565 -125435 50587 126004 -45421
103 -45421 -117226 49735 111485 -59671 -117809 55189 112369 -58234 -109183 61824 106879
114 106879 -66219 -106986 68417 106856 -68980 -104179 71242 101917 -74291 -100801 78177
125G8177K5903j77519k3965J75107J8337j75858j5561J76822J4737j73175j0231
136h7226J71093L873j72686k189J70337j292j67501Q160J68842j1362j69067J2470
148g6548J64975j9566j66189K3029J68158k1966j63358K6434J61239l2459j64936
159a01187L0406J61021l0940j54338L8599J56517l9821j56005L8133J48719m4257
170D6847j46179N0325J48255m9350j43645N2453J39532n9079j40654O1549J40384
181A00438o2059j36600O6822J36008p0005j36936P0217J34092p2008j31610P5315
192b6326J31671p5989j29622P6136J24672p9851j23178Q1792J21422q1795j16811
203i7879Q4732J12987q9365j12457R0196J08947r2463j04895R6989J04033r9238
$$ plain form
125 78177 104080 -73439 -97404 77703 96040 -79818 -95379 81443 96180 -76995 -87226
136 -87226 83867 87740 -84946 -87135 83202 81910 -85591 -77431 91411 80049 -89018 -76548
148 -76548 88427 68861 -97328 -74299 93859 71893 -91465 -65031 96208 63749 -101187
159 -101187 -70781 90240 59300 -95038 -56439 100078 60257 -95748 -57615 91104 46847
170 46847 -99332 -49007 99248 49898 -93747 -41294 98238 39159 -101495 -39946 100438
181 100438 38379 -98221 -31399 104609 34604 -102332 -32115 101977 29969 -101641 -26326
192 -26326 105345 29356 -100266 -24130 100542 20691 -102487 -20695 100727 18932 -97879
203 -97879 -13147 99840 10475 -101982 -11786 97161 4698 -100197 -3208 100825 1587
214A587j02887J00062R9922j02984r8215J05021R7277j05179r5054J06259R2954
225I8763j06518r0452J07067Q7765j07180q4626J07251Q1399j07414p7114J08569
236A7510P4226j09135p0294J09915O6359j11451o3314J12850O0316j13902n7450
247h4370J15494N5212j16723n3243J17181N0689j18436m9075J18347M7061j18215
258c6078m5046J17924M2464j17737m0278J17318L7319j16915l4522J16047L1014
269G1510j16441k7715J16708K4897j16249k1187J16868J7848j17843j5668J18199
280E0927J3007j18245r872J19515Q321j19074o421J18973M230j18884k377J18204
292E8304P55j16672J836J16035l682j14741O111J13256r125j12498J1679J11213
$$ plain form
214 1587 -101300 -1238 98684 -4300 -102515 2506 99783 -5396 -100450 5809 98763
225 98763 -7755 -98207 8860 96625 -10555 -95181 12070 93469 -13945 -91059 17510
236 17510 91736 -17399 -87693 22222 88581 -22870 -86184 26666 86982 -26920 -84370
247 -84370 31124 86336 -30387 -83630 33551 84240 -34196 -83271 35076 82137 -36078
258 -36078 -81124 36800 79264 -38473 -78751 38567 75886 -41029 -75551 40496 71510
269 71510 -44931 -72646 44062 68959 -47290 -68477 48391 66239 -51604 -67272 50927
280 50927 63934 -54311 -64183 55332 63653 -55421 -61842 57131 61361 -57523 -59900 58304
292 58304 59059 -57613 -55777 60258 56576 -58165 -52054 61202 52077 -60421 -48742 62471
304F2471j4297j10150J7173J09303j9999j08578K2134J07613k4668j07313K6284
315d0027J06164k8258j05583K9832J04590l1303j02920L2399J01444l4297j00205
326f8164L5499R8269l7277r5929L9108R4624m0852r2583M3199R0752m5129q9670
338f8153M7395Q8235m9345q6645N1869Q6157n3237q4992N5123Q4031n6661q3199
350f9422N7805Q2206n8769q0647N9967P9401o0848p7461O1725P5258o2901p3491
362f7177O3691P1168o5367o8781O6713O6617o8332o4635O9847O2502p2073o1098
374f6925P3281N9135p4544n8033P5998N6653p6810n5392P7586N3728p8084n2559
386f5966P8102N0937p7950m9058P8361M7143p7827m4603P7861M2392p8128l9803
$$ plain form
304 62471 48174 -61976 -44803 64500 44501 -64077 -41943 65670 41002 -66311 -40027
315 -40027 66137 37879 -67704 -37872 66718 35415 -67505 -35106 66338 32041 -68164
326 -68164 -32665 65604 28327 -67602 -28494 66130 25278 -67305 -24106 66646 21517 -68153
338 -68153 -20758 67477 18132 -68513 -16644 69513 16276 -68716 -13593 70438 13777 -69422
350 -69422 -11617 70589 11820 -68827 -8860 70541 9693 -67768 -6043 69215 6314 -67177
362 -67177 -3486 67682 2315 -66466 247 66864 -1468 -66103 3744 66246 -5827 -66925
374 -66925 6356 65491 -9053 -67086 8912 65565 -11245 -66637 10949 64677 -13407 -65966
386 -65966 12136 63073 -14877 -63935 14426 61569 -16258 -60861 17000 59392 -18736 -58539
398e8539P8294L7495p8559l4895P9720L2776p9930l0409Q0840K8377q1483k7045
410e3358Q2277K5312q2848k3766Q3341K2573q3292k1445Q3164J9899q3270j8822
422e0235Q2775J6745q2286j5168Q1816J3227q1409j1266Q0973Q616q0958o674
434d3844Q0556M303q0805j919Q0921K17q1236J919Q1220l555q1719N178Q1708
447D2944o363q1493P946Q1473q959q0477J0477P9866j1667p9110J3228P7966j4522
460C1309p6741J6469P5785j7857p4682J9778P3867k1739p3046K3440P2121k5076
472B3628p1580K6771P0767k8130p0133K9321O9348l0652o8902L1479O7629l2699
484A6847o6689L3490O5530l4602o4194L5417O2800l6685o1720L7805O0168l9233
$$ plain form
398 -58539 19755 57250 -21309 -56204 23516 56292 -23638 -54047 26793 55170 -26313 -53358
410 -53358 28919 54231 -28617 -52383 30958 53531 -29761 -51206 31958 51857 -31413 -50235
422 -50235 32540 49285 -33001 -48169 33647 46874 -34535 -45801 35172 43788 -37170 -43844
434 -43844 36712 41015 -39790 -41709 39212 39429 -41807 -39888 41332 37777 -43942 -38764 42944
447 42944 36581 -44912 -36966 44507 35548 -44929 -34452 45414 33747 -45363 -32135 45831 31309
460 31309 -45432 -28963 46822 28965 -45717 -25939 47928 26189 -46857 -23417 48704 23628
472 23628 -47952 -21181 49586 21456 -48677 -19356 49992 19340 -49562 -18083 49546 16847
484 16847 -49842 -16352 49178 14576 -49618 -14201 48599 11914 -49806 -12001 48167 8934
496H934n8923M0698N7801m1965n6459M3520N5495m4773n4684M6100N3783m7171
508B356n2541M8333N1946m8915n0818M9980N0006n0676m8721N1119M7480n1623
520b074m5957N2604M4346n2928m2854N3942M0918n4836l9397N5530L7920n6874
532i660l6293N7524L5017n8594l3793N9271L2440o0042l1898O0554L0479o1061
544a6056k9486O1082K8428o1142k7147O0914K5818o0920k4488O0616K2823o0361
556a9919k1094O0397J9502o0207j7651O0581J5821o0535j4376O1095J2803o1158
568b4741j1161O1778J0039o1947q680O2384P774o2662o540O2540N731o2618m584
581c2687O2330L768o1904k423O1232J339o1319O5O0448j649o0185L192N9788m881
$$ plain form
496 8934 -49989 -9291 48510 6545 -49914 -6394 49101 4328 -50356 -4256 49527 2356
508 2356 -50185 -1852 50094 1179 -49639 341 50347 -329 -49050 2069 49549 -2074
520 -2074 -48031 4573 48919 -4009 -46863 7079 47997 -6839 -46236 9294 47214 -9660
532 -9660 -45953 11571 46588 -12006 -45799 13472 45912 -14130 -46028 14526 45005 -16056
544 -16056 -45542 15540 43968 -17174 -44321 16593 42411 -18509 -42997 17619 40442 -19919
556 -19919 -41013 19384 38886 -21321 -38972 21609 37430 -23105 -37481 23614 36417 -24741
568 -24741 -35902 25876 35915 -26032 -34712 27672 35446 -27216 -33756 28784 34515 -28103 -32687
581 -32687 29643 33411 -28493 -30916 30316 31655 -29664 -29599 30849 29200 -30985 -27793 31995 27114
595B7114n9612O416N9180q188n9280R506N8925j0909n8991J2326N8805j3669n8719
608c7096J4643N8507j5647n7978J6798N7361j7573n6941J8626N6090j9284n5187
620c7681K0722N4461k1450n3514K2606N2439k3635n1497K5096N0955k5956m9897
632c7351K7204M9107k8284m8641K9286M7913l0056m7046L1054M6302l1964m5779
644c8255L2533M4598l3200m3790L3741M3070l4899m1900L5098M0724l6163l9943
656c8386L7033L8876l7764l7693L8260L6717l9693l5967M0255L5308m0775l4065
668c7894M1718L3252m2425l2800M3095L1750m3239l0695M4210K9744m4238k8700
680c6222M4513K7542m5090k6193M5901K5181m5700k3877M6187K2572m6837k1646
$$ plain form
595 27114 -32498 -26082 33098 24910 -34370 -24864 34061 23152 -35839 -23513 35292 21623 -37096
608 -37096 -22453 36054 20407 -37571 -20773 36588 19015 -37926 -19300 36790 17506 -37681
620 -37681 -16959 37502 16052 -37462 -14856 37583 13948 -37549 -12453 38502 12546 -37351
632 -37351 -10147 38960 10676 -37965 -8679 39234 9178 -37868 -6814 39488 7524 -38255
644 -38255 -5722 38876 5676 -38114 -4373 38697 3798 -38102 -3004 37720 1557 -38386
656 -38386 -1353 37523 -241 -37934 326 37043 -2650 -38617 1638 36946 -3829 -37894
668 -37894 3824 37076 -5349 -38149 4946 36696 -6543 -37238 6972 36716 -7522 -36222
680 -36222 8291 35833 -9257 -35450 10451 35632 -10068 -33945 12242 34814 -12023 -33669
692c3669M7383K0631m7642j9213M8247J8230m8989j7622M8723J6580m8755j5511
704c1607M9007J4839m9420j3963M8622J2781m8882j1795M8825J0902m8535r755
716b8981M8083Q311m8420p236M8191O033m7733m614M7912L430m8312k345M8246
729B2565J246m7990J06M8547q32m8439J605M8136k543m8092L717M8298m021m7708
743b5405M963M7328o089m7188O860M6958p805m5810Q864M5699j0280m5500J0965
756a6440M4620j2026m4424J3684M4072j4596m3944J5153M3341j6712m3205J7692
768a2785M3032j8387m2377J8745M1855k0115m1628K0721M1142k1255m0065K2037
780i080L9503k2786l9110K3101L8342k3796l7106K4884L6696k5385l5844K5783
$$ plain form
692 -33669 13714 34345 -13297 -32510 15737 33967 -15022 -32644 16079 32659 -16096 -31607
704 -31607 17400 32239 -17181 -31144 17478 30259 -18623 -30418 18407 29309 -19226 -28981
716 -28981 19102 27413 -21007 -28243 19948 25981 -21752 -26366 21546 24976 -23336 -25681 22565
729 22565 23811 -24179 -24073 24474 23642 -24797 -23192 24944 22401 -25691 -21974 26324 22303 -25405
743 -25405 -20442 26886 20797 -26391 -19531 27427 19622 -26188 -17324 28375 18095 -27405 -16440
756 -16440 28180 16154 -28270 -14586 29486 14890 -29054 -13901 29440 12728 -30477 -12785
768 -12785 30247 11860 -30517 -11772 30083 9968 -31660 -10939 30203 8948 -31117 -9080
780 -9080 30423 7637 -31473 -8372 29970 6174 -30932 -6048 30648 5263 -30581 -4798
792d798L5160k6675l4260K7687L3828k7964l2879K8729L1982k9421l1554L0089
804g6L0951l0396k9929L1164K8995l1734k8689L2094K7754l2609k6856L3398K5961
817C0028l3678k5589L3950K4384l4757k3736L5223K2989l5391k2389L5787K1243
829B8064l6565k0604L6853J9753l6966j8761L7438J7823l7859j7000L7958J6069
841B6203l7913j5214L8633J4329l8779j3140L8727J2445l8948j1487L9388J0888
853B5132l9353r845L9537Q892l9555q192L9861P322l9470o571L9493N845l9588
866a6492n179L9433M202l9290l264L9022K434l8934j806L8530O72l8568J63L8352
880A9275j062l8075J702L7788k843l7872L701L7722m485l7591N443L7392o310
$$ plain form
792 -4798 30362 3687 -30573 -2886 30942 2978 -29901 -1172 30810 1389 -30165 -76
804 -76 30875 479 -29450 1714 30709 -1025 -29714 2380 30134 -2475 -29331 4067 30028
817 30028 -3650 -29239 4711 29095 -5662 -29398 5825 28814 -6577 -28966 6821 28064
829 28064 -8501 -29105 7748 27501 -9465 -28226 9212 27035 -10824 -27824 10134 26203
841 26203 -11710 -26924 11709 26038 -12741 -25881 12846 25291 -13657 -25144 14244 25132
853 25132 -14221 -24066 15471 24363 -15192 -23384 16477 23799 -15671 -22242 17251 23096 -16492
866 -16492 -21671 17762 21964 -17326 -20590 18432 20866 -18068 -19874 18656 19328 -19240 -19077 19275
880 19275 18213 -19862 -18160 19628 16785 -21087 -17386 20336 15851 -21740 -16297 21095 14785
893A4785l7256P065L7092p662l6912Q640L6685r061l6499R927L6211j0693l5599
906b3277J1446L5394j2081l4771J2888L4706j3830l4103J4559L3667j5067l3307
918b3776J5963L2750j6633l2425J7320L1934j8198l1493J8972L0846j9523l0518
930b4781K0029K9936k0963k9460K1296K8947k1920k8525K2393K7750k2834k7292
942b5424K3235K6685k3799k6029K4017K5574k4447k4841K4745K4279k5163k3557
954b4725K5714K2829k5939k2073K6521K1197k6764k0381K7231J9994k7532j9119
966b3047K8049J8589k8581j7738K8923J7304k9449j6436K9691J6012l0014j5414
978b2111L0272J4755l0628j4003L0790J3164l0991j2809L1159J1937l1258j1351
$$ plain form
893 14785 -22471 -15406 21686 14024 -22888 -14248 22437 13376 -23123 -13196 23015 12322 -23277
906 -23277 -11831 23563 11482 -23289 -10401 24305 10475 -23628 -9069 24598 9531 -23776
918 -23776 -7813 24937 8304 -24121 -6801 25133 6935 -24558 -5586 25260 5737 -24781
930 -24781 -4752 25184 4221 -25239 -3943 25004 3084 -25441 -3048 24702 1868 -25424
942 -25424 -2189 24496 697 -25332 -1315 24259 -188 -25029 -284 23995 -1168 -24725
954 -24725 989 23818 -2121 -24194 2327 23524 -3240 -23621 3610 23604 -3928 -23047
966 -23047 5002 23591 -4990 -22728 6195 23499 -5950 -22386 7305 23317 -6697 -22111
978 -22111 8161 22916 -7712 -21715 9075 22239 -8752 -21561 9598 21535 -9723 -21074
990b1074L1301J0486l1675r533L1517Q594l1582p992L1823O736l1809o213L2137
1003A2716N448l2280m812L2648L961l2648l157L2622K704l2705j891L2712J475
1016A6793l2622p24L2621M9l2128N43L2102j001l1938J802L1733k645l1265L445
1030a3235L0981l952l0875M864L0540n753l0374O368L0227p128l0116P602K9960
1043A9109q456k9776R024K9497r663k9439J0168K8922j0742k8733J1183K8445
1055A9539j1969k8037J2286K7903j3168k7326J3727K6830j4303k6298J5026K6012
1067B0222j5564k5743J6366K5477j6906k4919J7453K4691j8011k4148J8679K3785
1079B1382j8917k3291J9491K2829j9852k2279K0386K1779k0899k1006K0996K0508
$$ plain form
990 -21074 10227 20713 -10962 -20495 11022 19616 -11966 -19958 11865 18601 -13208 -19421 12716
1003 12716 18164 -14116 -18928 13720 17681 -14967 -18124 14498 17202 -15503 -17394 15318 16793
1016 16793 -15829 -16553 16068 16117 -16011 -15468 16634 15633 -16305 -14503 17230 14585 -16680 -13235
1030 -13235 17746 13794 -17081 -12217 18323 12570 -17804 -11436 18791 11663 -18453 -10851 19109
1043 19109 10653 -19123 -10099 19398 9735 -19704 -9536 19386 8644 -20089 -8906 19539
1055 19539 7570 -20467 -8181 19722 6554 -20772 -7045 19785 5482 -20816 -5790 20222
1067 20222 4658 -21085 -4719 20758 3852 -21067 -3614 21077 3066 -21082 -2403 21382
1079 21382 2465 -20826 -1335 21494 1642 -20637 -251 21528 629 -20377 619 21127
1091B1127k1294k0293K2082J9557k2601j8940K2992J8135k3312j7829K3522J7328
1103B0474k4219j6873K4506J6210k4682j5876K4839J5195k4981j4794K5139J4122
1115A9060k5306j3413K5364J2802k5534j1940K5705J1297k6046j0344K6313R732
$$ plain form
1091 21127 -167 -20460 1622 21179 -1422 -20362 2630 20765 -2547 -20376 3146 20474
1103 20474 -3745 -20618 3888 20098 -4584 -20460 4379 19574 -5407 -20201 4938 19060
1115 19060 -6246 -19659 5705 18507 -7027 -18967 6738 18035 -8011 -18355 7958 17690
$$ [...]
8191h5
##END NTUPLES=NMR FID
##END=
