##TITLE=1H_ABC 2702
 CDCl3, 8 sc, 
 28.2.2020
##JCAMPDX= 6.0         $$ Bruker NMR JCAMP-DX V2.0
##DATA TYPE= NMR FID
##DATA CLASS= NTUPLES
##ORIGIN= UXNMR, Bruker Analytische Messtechnik GmbH
##OWNER= root
$$ XWIN-NMR		Version 3.5
$$ Fri Feb 28 14:22:20 2020 Russian Standard Time (UT+4h)  she@DPX200
##.OBSERVE FREQUENCY= 200.1315
##.OBSERVE NUCLEUS= ^1H
##.DELAY= (6, 6)
##.ACQUISITION MODE= SIMULTANEOUS
##.ACQUISITION SCHEME= undefined
##.AVERAGES= 8
##.DIGITISER RES= 18
##SPECTROMETER/DATA SYSTEM= spect
##.PULSE SEQUENCE= zg30
##.SOLVENT NAME= D2O
##.SHIFT REFERENCE= (INTERNAL, D2O, 0, 15.7039)
##AUDIT TRAIL= $$ (NUMBER, WHEN, WHO, WHERE, WHAT)
$$ ##TITLE= Audit trail, XWIN-NMR		Version 3.5
$$ ##JCAMPDX= 5.01
$$ ##ORIGIN= Bruker BioSpin GmbH
$$ ##OWNER= she
$$ F:/spectra/data/she/nmr/H-F/1/audita.txt
$$ ##AUDIT TRAIL=  $$ (NUMBER, WHEN, WHO, WHERE, WHAT)
(   1,<2020-02-28 14:21:25.51 +0400>,<she>,<DPX200>,
      <created by zg, POWCHK disabled, PULCHK disabled
       configuration hash MD5:
       00 E9 B6 7A A2 85 ED C7 34 08 36 98 17 FE 4E 26
       data hash MD5: 16K
       72 AD D1 5E 89 4D 57 D5 65 59 4A 4B 88 5A F1 08>)
$$ ##END=
$$ 
$$ hash MD5
$$ BD 70 26 38 7F 7A DC BC 00 FA 80 9E 56 E1 CB 66
##$RELAX= 
##$RELAX= 
##$RELAX= 
##$RELAX= 
##$RELAX= 
##$RELAX= 
$$ Bruker specific parameters
$$ --------------------------
##$DU= <F:/spectra>
##$EXPNO= 1
##$NAME= <H-F>
##$PROCNO= 1
##$TYPE= <nmr>
##$USER= <she>
##$AMP= (0..31)
100 100 100 100 100 100 100 100 100 100 100 100 100 100 100 100 100 100 
100 100 100 100 100 100 100 100 100 100 100 100 100 100 
##$AQSEQ= 0
##$AQ_mod= 1
##$AUNM= <au_zg>
##$AUTOPOS= <>
##$BF1= 200.13
##$BF2= 200.13
##$BF3= 200.13
##$BF4= 200.13
##$BF5= 200.13
##$BF6= 200.13
##$BF7= 200.13
##$BF8= 200.13
##$BYTORDA= 1
##$CFDGTYP= 0
##$CFRGTYP= 5
##$CHEMSTR= <none>
##$CNST= (0..31)
1 1 145 1 1 1 1 1 1 1 1 1 1 1 1 1 1 1 1 1 1 1 1 1 1 1 1 1 1 1 1 1 
##$CPDPRG= <>
##$CPDPRG1= <>
##$CPDPRG2= <>
##$CPDPRG3= <>
##$CPDPRG4= <mlev>
##$CPDPRG5= <mlev>
##$CPDPRG6= <mlev>
##$CPDPRG7= <mlev>
##$CPDPRG8= <mlev>
##$CPDPRGB= <>
##$CPDPRGT= <>
##$D= (0..31)
0 1.2 0 0 0 0 0 0 0 0.06 0 0.03 0 0 0 0 0.0002 0 0 0 0 0 0 0 0 0 0 0 0 
0 0 0 
##$DATE= 1582885284
##$DBL= (0..7)
120 120 120 120 120 120 120 120 
##$DBP= (0..7)
150 150 150 150 150 150 150 150 
##$DBP07= 0
##$DBPNAM0= <>
##$DBPNAM1= <>
##$DBPNAM2= <>
##$DBPNAM3= <>
##$DBPNAM4= <>
##$DBPNAM5= <>
##$DBPNAM6= <>
##$DBPNAM7= <>
##$DBPOAL= (0..7)
0.5 0.5 0.5 0.5 0.5 0.5 0.5 0.5 
##$DBPOFFS= (0..7)
0 0 0 0 0 0 0 0 
##$DE= 6
##$DECBNUC= <off>
##$DECIM= 24
##$DECNUC= <off>
##$DECSTAT= 4
##$DIGMOD= 1
##$DIGTYP= 9
##$DL= (0..7)
0 120 120 120 120 120 120 120 
##$DP= (0..7)
150 150 150 150 150 150 150 150 
##$DP07= 0
##$DPNAME0= <>
##$DPNAME1= <>
##$DPNAME2= <>
##$DPNAME3= <>
##$DPNAME4= <>
##$DPNAME5= <>
##$DPNAME6= <>
##$DPNAME7= <>
##$DPOAL= (0..7)
0.5 0.5 0.5 0.5 0.5 0.5 0.5 0.5 
##$DPOFFS= (0..7)
0 0 0 0 0 0 0 0 
##$DQDMODE= 0
##$DR= 18
##$DS= 0
##$DSLIST= <SSSSSSSSSSSSSSS>
##$DSPFIRM= 0
$$ [...]
##$SUBNAM2= <"">
##$SUBNAM3= <"">
##$SUBNAM4= <"">
##$SUBNAM5= <"">
##$SUBNAM6= <"">
##$SUBNAM7= <"">
##$SUBNAM8= <"">
##$SUBNAM9= <"">
##$SW= 24.9337058887773
##$SWIBOX= (0..15)
0 0 2 0 0 0 0 0 0 0 0 0 0 0 0 0 
##$SW_h= 4990.01996007984
##$TD= 16384
##$TD0= 1
##$TE= 0
##$TE2= 300
##$TE3= 300
##$TEG= 300
##$TL= (0..7)
0 120 120 120 120 120 120 120 
##$TP= (0..7)
150 150 150 150 150 150 150 150 
##$TP07= 0
##$TPNAME0= <>
##$TPNAME1= <>
##$TPNAME2= <>
##$TPNAME3= <>
##$TPNAME4= <>
##$TPNAME5= <>
##$TPNAME6= <>
##$TPNAME7= <>
##$TPOAL= (0..7)
0.5 0.5 0.5 0.5 0.5 0.5 0.5 0.5 
##$TPOFFS= (0..7)
0 0 0 0 0 0 0 0 
##$TUNHIN= 0
##$TUNHOUT= 0
##$TUNXOUT= 0
##$USERA1= <user>
##$USERA2= <user>
##$USERA3= <user>
##$USERA4= <user>
##$USERA5= <user>
##$V9= 5
##$VALIST= <valist>
##$VCLIST= <CCCCCCCCCCCCCCC>
##$VD= 0
##$VDLIST= <DDDDDDDDDDDDDDD>
##$VPLIST= <PPPPPPPPPPPPPPP>
##$VTLIST= <TTTTTTTTTTTTTTT>
##$WBST= 1024
##$WBSW= 4
##$XGAIN= (0..3)
0 0 0 0 
##$XL= 0
##$YL= 0
##$YMAX_a= 568585
##$YMIN_a= -586394
##$ZGOPTNS= <>
##$ZL1= 120
##$ZL2= 120
##$ZL3= 120
##$ZL4= 120
##$ABSF1= 10
##$ABSF2= 0
##$ABSG= 5
##$ABSL= 3
##$ALPHA= 0
##$AQORDER= 0
##$ASSFAC= 0
##$ASSFACI= 0
##$ASSFACX= 0
##$ASSWID= 0
##$AUNMP= <proc_1d>
##$AZFE= 0.1
##$AZFW= 0.1
##$BCFW= 1
##$BC_mod= 2
##$BYTORDP= 1
##$COROFFS= 0
##$CY= 11.3945322036743
##$DATMOD= 1
##$DC= 2
##$DFILT= <>
##$DTYPP= 0
##$F1P= 16.9975609425685
##$F2P= -3.02152046262296
##$FCOR= 0.5
##$FTSIZE= 0
##$FT_mod= 4
##$GAMMA= 1
##$GB= 0.15
##$INTBC= 1
##$INTSCL= 1
##$ISEN= 128
##$LB= 0.24
##$LEV0= 0
##$LPBIN= 0
##$MAXI= 10000
##$MC2= 0
##$MEAN= 0
##$ME_mod= 0
##$MI= 1.114404
##$NCOEF= 0
##$NC_proc= 0
##$NLEV= 6
##$NOISF1= 3.799351
##$NOISF2= 2.8
##$NSP= 1
##$NTH_PI= 0
##$NZP= 0
##$OFFSET= 15.70392
##$PC= 1
##$PHC0= -9793.959
##$PHC1= 23.40082
##$PH_mod= 1
##$PKNL= yes
##$PPARMOD= 0
##$PSCAL= 0
##$PSIGN= 0
##$REVERSE= no
##$SF= 200.130013532006
##$SI= 16384
##$SIGF1= 3
##$SIGF2= 2
##$SINO= 400
##$SIOLD= 16384
##$SREGLST= <1H.CDCl3>
##$SSB= 0
##$STSI= 0
##$STSR= 0
##$SW_p= 3612.71676300578
##$SYMM= 0
##$S_DEV= 0
##$TDeff= 0
##$TDoff= 0
##$TI= <>
##$TILT= no
##$TM1= 0
##$TM2= 0
##$TOPLEV= 0
##$USERP1= <user>
##$USERP2= <user>
##$USERP3= <user>
##$USERP4= <user>
##$USERP5= <user>
##$WDW= 1
##$XDIM= 8192
##$YMAX_p= 0
##$YMIN_p= 0
$$ End of Bruker specific parameters
$$ ---------------------------------
##NTUPLES= NMR FID
##VAR_NAME=  TIME,          FID/REAL,        FID/IMAG
##SYMBOL=    X,             R,               I
##VAR_TYPE=  INDEPENDENT,   DEPENDENT,       DEPENDENT
##VAR_FORM=  AFFN,          ASDF,            ASDF
##VAR_DIM=   8192,          8192,            8192
##UNITS=     SECONDS,       ARBITRARY UNITS, ARBITRARY UNITS
##FACTOR=    0.0002004,     1,               1
##FIRST=     0,             0,               0
##LAST=      1.6414764,     0,               0
##MIN=       0,             -586394,         0
##MAX=       1.6414764,     568585,          0
$$ Real data points
##PAGE= N=1
##DATA TABLE= (X++(R..R)), XYDATA
0@%%%%qJ6j6J6k4L2l2M0n6P2q7J03j28J56j79K11k56L00l42L96m64N34o03O87
$$ 0 0 0 0 0 -8 8 -8 8 -16 16 -16 24 -32 40 -47 56 -72 84 -95 116 -140 160 -182 214 -250 284 -319 368
28C68p90Q93j002J132j277J430j594J781j990K210k450K721l020L343l697M097
$$ 368 -422 471 -531 601 -676 754 -840 941 -1049 1161 -1289 1432 -1588 1755 -1942 2155
44B155m539N024n573O199o906P711q655R775j1114J2756j4833J7558k1297K6785
$$ 2155 -2384 2640 -2933 3266 -3640 4071 -4584 5191 -5923 6833 -8000 9558 -11739 15046
58A5046l5739N3427j42660M69314J19503q19778l6028P28336J20973q26191k32597
$$ 15046 -20693 32734 -109926 359388 478891 -340887 -376915 351421 472394 -353797 -586394
69e86394P30796L39125o75553l37405O54333M31882o26207n01613N34851N53475
$$ -586394 144402 483527 -192026 -529431 124902 556784 -69423 -571036 -36185 517290
79E17290m71879n63762M29001O24449l69778o71244K67131O79355j99351o74378
$$ 517290 45411 -518351 -89350 535099 165321 -505923 -238792 440563 241212 -433166
89d33166J52683P15143o3784p16526l3374O84449Q4433o73710j45215O77262K39092
$$ -433166 -280483 434660 370876 -345650 -379024 305425 389858 -283852 -429067 248195 487287
100D87287o29560l03815N78850L39848n58693m06441N15579M73705m41275n00708
$$ 487287 -142273 -446088 132762 472610 -86083 -492524 23055 496760 55485 -445223
110d45223L91019N33516l43437n78856K70443O01253k02642o14678J35839O20123
$$ -445223 -54204 479312 135875 -442981 -172538 428715 226073 -388605 -252766 367357
120C67357p7421o31264P281O31702O9700o08322j23953N91307J75929n86501k55340
$$ 367357 289936 -341328 -334047 297655 367355 -240967 -364920 226387 402316 -184185 -439525
131d39525N41981L06718m97822l39309M79454M02703m28824m49944L65944M71452
$$ -439525 102456 409174 -88648 -427957 51497 454200 25376 -424568 -58624 412828
141D12828l23293n02926K74194N37706k05851n49982J45866N54574r3897n64378
$$ 412828 89535 -413391 -139197 398509 192658 -357324 -211458 343116 249219 -315159
151c15159L2034N65836L2667n50653q8952N32869J37051n21344j96956M90906
$$ -315159 -283125 282711 315378 -235275 -324227 208642 345693 -175651 -372607 118299
161A18299K47758m55196k87986M22058L29342l85308l69140L38036L98345k91596
$$ 118299 366057 -89139 -377125 44933 374275 -11033 -380173 -42137 356208 64612
171F4612m21493K47023M44321j99086m61388J46016M68893r7586m73626N0953
$$ 64612 -356881 -109858 334463 135377 -326011 -179995 288898 191312 -282314 -231361
181b31361M77600J418m73056n0742M62553R6612m50000j43008M31906J87674m09239
$$ -231361 246239 247657 -225399 -276141 186412 283024 -166976 -309984 121922 309596 -99643
192i9643k29715L81534K68768l48145k99649L16933L33311k77029l57727K35722
$$ -99643 -329358 52176 320944 -27201 -326850 -9917 323394 46365 -311362 -75640
202g5640L76564j96184l93928J55248M08198j08774m11918O7433M15947k5943
$$ -75640 300924 104740 -289188 -133940 274258 165484 -246434 -179001 236946 211003
212B11003m16163j8299M10657O0297m00371r9954L85054J37925l70439j77160
$$ 211003 -205160 -223459 187198 247495 -152876 -252830 132224 270149 -100290 -277450
222b77450L46445K10529l19488k38635K94133K67215k62220k92568K26561L09487
$$ -277450 68995 279524 -39964 -278599 15534 282749 20529 -272039 -45478 264009
232B64009j94473l24910J59754L39288j20707l44426Q6419L49062n0292l50340
$$ 264009 69536 -255374 -95620 243668 122961 -221465 -135046 214016 163724 -186616
242a86616J3999L47836K1114l40646n4668L31779Q7904l19331j19570L02746J48880
$$ -186616 -172617 175219 196333 -144313 -198981 132798 220702 -98629 -218199 84547 233427
253B33427k84042j75927K63554K00384k39975k23117K14855K41303j88405k58095
$$ 233427 -50615 -226542 37012 237396 -2579 -225696 -10841 230462 42057 -216038
263b16038J59338K70971j31525k81948J01293K88591p1253k93001M1422K93790
$$ -216038 -56700 214271 82746 -199202 -97909 190682 119429 -173572 -132150 161640
273A61640j2501k93366j8686K87384M4538k81484p3246K70416R8680k58867j23363
$$ 161640 149139 -144227 -162913 124471 169009 -112475 -185721 84695 183375 -75492 -198855
284a98855K44540J45097k28946j67120K10273J85347j91119k03009J69418K17690
$$ -198855 45685 190782 -38164 -205284 4989 190336 -783 -203792 -34374 183316
294A83316j46632k29762J23306K41121r7370k46737P3175K52364m7432k53910
$$ 183316 36684 -193078 -69772 171349 73979 -172758 -99583 152781 105349 -148561
304a48561K2364K54013K528k49895k5813K46027M9962k37999p1327K29298R3255
$$ -148561 -126197 127816 130344 -119551 -145364 100663 150625 -87374 -158701 70597 163852
315A63852k17885j12926K04747J32161j90415j48885J74067J64262j56006j77387
$$ 163852 -54033 -166959 37788 169949 -20466 -169351 4716 168978 12972 -164415
325a64415J37347J89226j17643j97945R6958K05004p6906k10193N6748K13101
$$ -164415 -27068 162158 44515 -153430 -56472 148532 71626 -138567 -81819 131282
335A31282l6255k14228J5808K14553L305k12945k3449K09671M3370k04380o2408
$$ 131282 95027 -119201 -103393 111160 114465 -98480 -121929 87742 131112 -73268 -135676
346a35676J97844Q1477j90056r9540J78820J16711j66899j32336J54269J46533
$$ -135676 62168 143645 -46411 -145951 32869 149580 -17319 -149655 4614 151147
356A51147j37755j58478J21933J69834j04820j78172Q7070J85681o9196j90646
$$ 151147 13392 -145086 -23153 146681 41861 -136311 -49241 136440 67244 -123402
366a23402N1342J94510l2801j96056J5185J97055L576j96127k2314J93922L9240
$$ -123402 -72060 122450 89649 -106407 -91222 105833 109409 -86718 -109032 84890 124130
377A24130j89845n7513J83550P4497j76101r1407J66452J06985j56241j22363
$$ 124130 -65715 -123228 60322 134819 -41282 -132689 33763 140748 -15493 -137856
387a37856J43630J34946j30440j47564J15593J57519j00315j67304Q3363J74572
$$ -137856 5774 140720 10280 -137284 -21691 135828 35513 -131791 -48428 126144
397A26144o6898j80882M9145J84668l1780j87273J2737J88213N163j87320k3854
$$ 126144 59246 -121636 -72491 112177 80397 -106876 -94139 94074 99237 -88083 -111937
408a11937J84790M0973j79899n8938J73974P5167j66578r1053J57732J06274j47326
$$ -111937 72853 113826 -66073 -125011 48963 124130 -42448 -133501 24231 130505 -16821
419a6821j20402J35636J33876j23183j45697J08632J56713r3850j66186P8082
$$ -16821 -137223 -1587 132289 9106 -136591 -27959 128754 34904 -131282 -53200
429e3200J73684o0537j80063M3607J84574k5371j87956O873J88607J1466j88071
$$ -53200 120484 59947 -120116 -76509 108065 82694 -105262 -98389 90218 101684 -86387
440h6387k9964J86161M8810j81515o6312J75295Q4210j67510j01261J57894J17399
$$ -86387 -116351 69810 118620 -62895 -129207 46088 130298 -37212 -138473 19421 136820
451A36820j45782j31965J32940J45924j17976j57317J02185J67789q5108j75300
$$ 136820 -8962 -140927 -7987 137937 19961 -137356 -35171 132618 47510 -127790
461a27790O7221J82316m8884j86185L0718J89369j1337j90257o997J89969K5898
$$ -127790 -60569 121747 72863 -113322 -82604 106765 95428 -94829 -101826 88143 114041
472A14041j87061m3999J82994O3001j76584q0745J69214R8310j59139j13986J46667
$$ 114041 -73020 -117019 65975 128976 -47608 -128353 40861 139171 -19968 -133954 12713
483A2713J29815j33554j43645J18175J56056j02114j66465Q4546J74667o6720
$$ 12713 142528 8974 -134671 -16496 139560 37446 -129019 -44473 130194 63474
493F3474j81096M7550J85650k8904j88969R100J89511R751j88743k9631J86248
$$ 63474 -117622 -70072 115578 86674 -102295 -93195 96316 106067 -82676 -112307 73941
504G3941M8557j81486o7893J75162Q5522j66311j03704J55637J19544j42936j34789
$$ 73941 122498 -58988 -126881 48281 133803 -32508 -136212 19425 138969 -3967 -138756
515a38756J29268J48489j13210j61030R6786J70131p9038j78667O0398J84837
$$ -138756 -9488 139001 25791 -135239 -38453 131678 52640 -126027 -65629 119208
525A19208m1716j89247K2263J91869k739j92136j7227J89826L7222j86572n7089
$$ 119208 77492 -111755 -89492 102377 99638 -92498 -109725 80101 117323 -69249 -126338
536a26338J80504P5808j72129r3979J62228J11025j50491j26815J36538J40896
$$ -126338 54166 129974 -42155 -136134 26094 137119 -13372 -140187 -3649 137247
546A37247j21760j53567J05008J63689q7323j72644O8946J78922m9677j84179
$$ 137247 15487 -138080 -33072 130617 43294 -129350 -60404 118518 68841 -115338
556a15338K9916J86608j0963j86808r482J85198K8908j81781m7909J76406O6373
$$ -115338 -85422 101186 90223 -96585 -106067 79131 108039 -73742 -121651 54755 121128
567A21128j68612q4019J59625J00299j48137j15721J35900J30304j22084j42166
$$ 121128 -47484 -131503 28122 128421 -19716 -135437 463 130767 8683 -133483
577a33483J06821J54515r0441j63519P3556J71626n4819j76907L5656J80833j6368
$$ -133483 -26662 127853 37412 -126107 -52551 119075 64256 -112651 -76995 103838 87470
588H7470j81670l290J81761K2750j78063m1929J73713O0370j66964p7908J58091
$$ 87470 -94200 -97490 84271 107021 -71042 -112971 60742 121112 -45852 -123760 34331
599C4331R4816j47660j09337J36162J23846j22383j35974J07812J47140r1600
$$ 34331 129147 -18513 -127850 8312 132158 9775 -126199 -18387 128753 37153
609C7153j56932P4691J64942n6910j70359L8649J74027j9639j75195L85J74108
$$ 37153 -119779 -45088 119854 62944 -107415 -68766 105261 85622 -89573 -89188 84920
620H4920J7861j71216l6617J65832N3976j59332o9996J50324Q5993j40780j00336
$$ 84920 102781 -68435 -105052 60780 114756 -44576 -114572 35752 121745 -19035 -119371
631a19371J29141J12993j16879j25247J03168J35589q8031j43914P2426J51016
$$ -119371 9770 122763 5884 -119363 -16195 119394 31363 -112551 -40125 110891
641A10891n5981j56067L7907J59456k0603j61464L115J60728J3754j57783l1057
$$ 110891 54910 -101157 -63250 96206 75603 -85861 -82746 77982 91736 -66047 -97104
652i7104J53225M7070j47672o3106J39466P7504j31467r0875J20788J03246j09208
$$ -97104 56121 103191 -44481 -107587 31879 109383 -22084 -112959 7829 111075 1867
663A867j14766R6653J24140q2977j32695O7850J39566n3036j44086L7148J47652
$$ 1867 -112899 -16246 107894 24917 -107778 -39928 99638 46602 -97484 -60336 87316
674H7316k0633j49582M425J49098J1083j47049k6886J43536M2083j38270n6438
$$ 87316 66683 -82899 -78474 70624 81707 -65342 -92228 51308 93391 -44879 -101317
685a01317J31170P0069j22886q3631J14233R4824j03301j05363R1025J14720p7707
$$ -101317 29853 99922 -22964 -106595 7638 102462 -839 -106202 -15177 99543 21836
696B1836j22033O3998J28639m9788j32542L4751J35577k0133j35908N371J35678
$$ 21836 -100197 -36199 92440 42652 -89890 -55139 80438 60305 -75603 -70232 65446
707F5446R405j32668k3470J29315L7087j24281n0052J17844O1991j09855p2712
$$ 65446 74851 -57817 -81287 48028 85115 -39166 -89218 28626 90617 -19238 -91950
718i1950J00755Q3303r0942r1840Q0063R9434o8865j05771N7230J10978m4590
$$ -91950 8805 92108 1166 -90674 -10611 88823 19958 -85813 -28583 82395 37805
729C7805j14129L2410J17198j9580j17774O977J17544N197j16124j7331J13944
$$ 37805 -76324 -43914 73284 53704 -64070 -57093 60451 65648 -50476 -67807 46137
740D6137K9659j09333m0978J04235N2648r8268o3050R0792P1945q1938q0922P2551
$$ 46137 75796 -33537 -74515 29720 82368 -15900 -78950 11842 83787 1849 -79073 -6522
752f522Q8145o1977r3600N1689R7722m0857j01714K9218J03051j8203j03481P036
$$ -6522 81623 19646 -73954 -22265 75457 34600 -67114 -37896 65155 46952 -56529 -49493
764d9493J04243L737j02608j4854J00221K4775r6741l5509R1928M4204q6164n3436
$$ -49493 54750 58487 -44121 -58975 41246 66021 -30720 -66229 25699 69903 -16261 -69697
776f9697Q0249O1542p3119o9014O4352P4695n6254q0467M6558Q4098l7134q6872
$$ -69697 10552 72094 -1025 -70039 -5687 69008 12754 -67713 -21155 62943 25809 -61063
788f1063K7156Q9039j7661r0084P872Q9016J456q8328j0901Q5790K0324q2337
$$ -61063 -33907 55132 37471 -52613 -44741 44275 45731 -42597 -53498 32292 52616 -29721
800b9721k8232P8283L6528p3861m3838O7816N0343o1875n5804N4805O1047m7857
$$ -29721 -57953 20330 56858 -17003 -60841 6975 57318 -4557 -60361 -5556 55491 7634
812G634o4843M0687O8277l2990p1175K5507P2195j7971p3813J0876P4242k608
$$ 7634 -57209 -16522 51755 18765 -52410 -26903 45292 27321 -46492 -35616 38626 36018
824C6018p3370m743P2238J2111p0277j9430O7423K6479o3776l3039O0566L8575
$$ 36018 -37352 -42095 30143 42254 -28023 -47453 19970 46449 -17327 -50366 10200 48775
836D8775n4812m3514M9400M8709m4219n2504L7933N5564l1485n7894K5796O0077
$$ 48775 -6037 -49551 -151 48558 4339 -48165 -10232 45332 13847 -44047 -18251 41826
848D1826j9216o1237J2860O1538o213o1109k60O0552O560n8497j2642N6956J8207
$$ 41826 22610 -38627 -25767 35771 29558 -31551 -31811 28741 35301 -23196 -35838 21118 39325
861C9325n3834k3212N0470K8271m7171l2474M3828L6652l9624l9560L4680M2828
$$ 39325 -14509 -37721 12749 41020 -6151 -38625 5203 41855 2231 -37329 -2649 40179
873D0179k9679m5675K5266M7270k0472m8647J4856N0006r443n0078M024M9882
$$ 40179 10500 -35175 -9909 37361 16889 -31758 -16902 33104 23661 -26417 -22393 27489
885B7489P86m8907o139M7663J0261m5628j4892M3422J9047m1067k2419L8324K6035
$$ 27489 28275 -20632 -26771 20892 31153 -14475 -29367 14055 33102 -7965 -30384 7940 33975
898C3975l6087k9249L2386L2245k9662l4164K5241L6808k2202l8448J7679L9532
$$ 33975 -2112 -31361 1025 33270 3608 -30556 -5315 31493 9291 -29157 -11478 28054
910B8054j3411m1101R320M0894n001m1406J023M0571L327m0334o748L8854J0035
$$ 28054 14643 -26458 -17138 23756 18755 -22651 -21628 18943 22270 -18064 -24812 14042 24077
923B4077l7476j4272L6144J6984l3800k0418L1907K3016k9790k5674K6942K8251
$$ 24077 -13399 -27671 8473 25457 -8343 -28761 3146 26162 -3628 -29302 -2360 25891
935B5891k4138l0166K0471L2538j7758l3654J4170L4395j0296l5492O923L5762
$$ 25891 1753 -28413 -7942 24596 6838 -26816 -12646 21749 11453 -24039 -17116 18646
947A8646l454l5951M29L5693L121l5056o500L4416J0149l3465j3108L1573J6705
$$ 18646 15192 -20759 -20330 15363 18484 -16572 -23072 11344 21493 -11972 -25080 6493 23198
960B3198k9794j9370K7872K2002k5097k3956K2786K6313k0198k7853J7672K9414
$$ 23198 -6596 -25966 1906 23908 -1189 -25145 -2359 23954 3756 -24097 -6425 22989
972B2989j4919l0188J2207L1330r301l2114O581L2768k910l3382M6L3610L314
$$ 22989 8070 -22118 -9911 21419 12118 -19996 -13415 19353 16443 -16939 -16893 16717 20031
985B0031l3422o123L2485R892l2042j2683L0651J6293k9041j8897K6698K2158
$$ 20031 -13391 -19514 12971 22863 -9179 -21862 8789 25082 -3959 -22856 3842 26000
997B6000k4793k4118K2551K6209j9583k8134J6613K9460j3129l1418J0657L2432
$$ 26000 1207 -22911 -360 25849 6266 -21868 -5255 24205 11076 -20342 -9685 22747
1009B2747p497l3302M315L3166n41l3804k628L3245O147l3008r210L1743J2618
$$ 22747 15250 -18052 -13737 19429 18888 -14916 -17544 15701 21848 -11160 -20370 11373 23991
1022B3991l0552j5870K9044J8463k7162k2108K5625K4740k3589k7168K0475K9507
$$ 23991 -6561 -22431 6613 25076 -2086 -24194 1431 26171 2582 -24586 -4111 25396
1034B5396j7673l1668J4115L3480j1127l4526O706L5635k921l6281j323L6177
$$ 25396 7723 -23945 -9830 23650 12523 -22003 -15297 20338 17417 -18864 -20187 15990
1046A5990N122l5620q981L4162J2734l3263j6333L1718J9433l0081k2458K7440
$$ 15990 21112 -14508 -23489 10673 23407 -9856 -26189 5529 24962 -5119 -27577 -137
1058a37K5429k4953k8110K1853L0765j9227l2921J5705L5121j2280l6673Q333
$$ -137 25292 339 -27771 -5918 24847 5620 -27301 -11596 23525 11245 -25428 -17095
1070a7095L7927m815l8241O00L8545L463l8233p616L7607J1967l6431j6209L5094
$$ -17095 20832 16017 -22224 -21624 16921 20384 -17849 -25465 12142 24109 -12322 -28531 6563
1083F563K0192l2579k4458L0639K7854k7767l0417K4110L3783k0606l5576J6351
$$ 6563 26755 -5824 -30282 357 28211 444 -29973 -5863 27920 7314 -28262 -11911
1095a1911L7617j1892l8753P543L9888l692l9471q15L9374N833l9331r218L8195
$$ -11911 25706 13814 -24939 -17396 22492 18800 -20671 -21486 17888 23721 -15610 -24828 13367
1108A3367J3592l6984j7110L5250K1593l3265k5374L0834K9164k7644l2574K4448
$$ 13367 26959 -10025 -27135 8115 29708 -3557 -28931 1903 31067 3423 -29151 -4703
1120d703L5391k0159l7863J6040L9655j1166m1409O738M2095j382m2653l055M2014
$$ -4703 30688 10529 -27334 -11294 28361 17195 -24214 -17476 24619 23237 -19416 -22471 19543
1133A9543Q067m1649j2382M0383J6839l8558k1469L6348K5628l3979k9240L0930
$$ 19543 27610 -14039 -26421 13962 30801 -7757 -29226 7122 32750 -1229 -30469 461
1145D61L2767k7426l6326K3352L9214j8998m1682J4057M3488r306m4546M285M4937
$$ 461 33228 5802 -30524 -7172 32042 13044 -28638 -14581 28907 19601 -24945 -20660 24277
1158B4277N11m5218n933M4912J0528m3815j5749M2244K0250m0198k4760L7359
$$ 24277 24788 -20430 -26363 18549 29077 -14738 -30487 11757 32007 -8191 -32951 4408
1170D408K9615l4721l3583L0770L7005k6779m0466K2268M3003j7324m5281J1896
$$ 4408 34023 -698 -34281 -3511 33494 6715 -33751 -11483 31520 14196 -31085 -19189
1182a9189M6558o964m7060R87M7542M208m7183r639M6494J4226m4581j9898M2555
$$ -19189 27369 20405 -26655 -25668 21874 26082 -21101 -30740 15754 29980 -14601 -34499 8056
1195H056K4730l9978k9378L6805L4049l3325l7513K8791M0894k4272m4001J9678
$$ 8056 32786 -7192 -36570 235 34284 959 -36554 -7763 33131 8859 -35142 -15464
1207a5464M6298j4552m7764R135M8946l425m9638j591M9281P601m8880j3272M7984
$$ -15464 30834 16282 -31482 -22347 26599 23174 -26464 -28055 21226 28827 -20053 -33325 14659
1220A4659J8944m6305k3888M3754K9373m0366l4108L6680L8850l2444m2464K7661
$$ 14659 33603 -12702 -36590 7164 36537 -3829 -37937 -1257 37593 5149 -37315 -9654
1232i654M5506k2230m8115J7103N0329j1154n1546N489N2177R10n2635o101N1703
$$ -9654 35852 13622 -34493 -17390 32939 21785 -29761 -24272 27905 28815 -23820 -29921 21782
1245B1782J2223n0403j8330M9119K3867m6320k9226M3382L4193l9252l8961L4668
$$ 21782 34005 -16398 -34728 14391 38258 -8062 -37288 6094 40287 1035 -37926 -3258
1257c258M3461k9779m6612K4181M9384j8597n1592J2838N3067o642n4002J024
$$ -3258 40203 10424 -36188 -12007 37377 18780 -32812 -19974 33093 26451 -27551 -26527
1269b6527N3691N024n2970j1101N1610J7077n0154k2673M7824K8044m5219l3405
$$ -26527 27164 32188 -20782 -31883 19727 36804 -13350 -36023 11801 39845 -5374 -38779
1281c8779M1901L7433l7400m2300L2255M6777k7537m9920K1873N2260j5770n4850
$$ -38779 3122 40555 3155 -39145 -6890 39887 12350 -37570 -15697 36563 20793 -34057
1293c4057R943N5972m030n6440k350N5684R036n4919j5461N3334K1441n1494k6858
$$ -34057 -24114 31858 27828 -28612 -30962 24722 33758 -21161 -36622 16712 38153 -13341 -40199
1306d0199M7986L2596m5020l7675M0828M2233l6249m6521L1307M9915k5666n3054
$$ -40199 7787 40383 -4637 -42312 -1484 40749 4500 -42021 -10714 39201 13535 -39519
1318c9519J9462N5029j3203n6660O726N7787m04n8169n645N7105J2381n5911j8526
$$ -39519 -20057 34972 21769 -34891 -28165 29622 29218 -28951 -34596 22509 34890 -21021 -39547
1331c9547N3898K4647n1298l0441M7723L5991m3682m1035L9489M5204l3685m9383
$$ -39547 14351 38998 -12300 -42741 4982 40973 -2709 -43744 -4255 40949 7264 -42119
1343d2119K8249N2759k2570n4969J6531N6597r834n8018L592N8505L185n7980
$$ -42119 -13870 38889 16319 -38650 -22119 34478 24644 -33374 -29782 28723 31908 -26072
1355b6072r650N7002J6021n4696k2445N2670K8195m9214l3699M5165L9317m0892
$$ -26072 -35722 21280 37301 -17395 -39840 12830 41025 -8189 -41888 3277 42594 1702
1367A702m3374L6280M7029l0825n0210K5226N3304j9230n5533J3925N6661p826
$$ 1702 -41672 -5392 41637 10812 -39398 -14172 39132 19902 -35631 -21706 34955 27129
1379B7129n7645J435N7890N821n8014j1976N6818J8409n5110k4002N1983L0546
$$ 27129 -30516 -29081 28809 34630 -23384 -35360 21458 39867 -15243 -39245 12738 43284
1391D3284m9044l5817M4618M1130l9767m5767L5010M8907k9012n2088K3182N4091
$$ 43284 -5760 -41577 3041 44171 4404 -41363 -6353 42554 13542 -38546 -15364 38727
1403C8727j7051n5965J0842N6871m168n7910j743N7428P847n6900j3662N4632
$$ 38727 21676 -34289 -23447 33424 29256 -28654 -30397 27031 34878 -22022 -35684 18948
1415A8948K0082n2831k5763M9892L1506m6606l6691M2185M0943l7128m5773L2668
$$ 18948 39030 -13801 -39564 10328 41834 -4772 -41463 722 41665 4537 -41236 -8568
1427h568M8602k7084n1711K1186N3546j5265n5337R601N5529k912n6433l006N5450
$$ -8568 40034 12950 -38761 -17575 35971 20706 -34631 -25030 30499 27587 -28846 -31852 23598
1440B3598R138n4644j5159N2858K0863n0015k6833M7794L1302m4017l6008L9419
$$ 23598 32736 -21908 -37067 15791 36654 -13361 -40194 7600 38902 -5115 -41123 -1704
1452a704M0606l5263m4030K9999M7371k4981m9822J9528N1761j3745n3060Q185
$$ -1704 38902 3639 -40391 -10392 36979 11998 -37824 -18296 33465 19720 -33340 -25155
1464b5155N3799k583n3320l766N3300Q967n1714j4573N0036J9963m7685k5127
$$ -25155 28644 26061 -27259 -31025 22275 31242 -20472 -35045 14991 34954 -12731 -37858
1476c7858M5268K9721m1305l4257L7798L8576l3887m1867K8998M5218k4211m7312
$$ -37858 7410 37131 -4174 -38431 -633 37943 4056 -37811 -8813 36405 12194 -35118
1488c5118J8929M9172j3173n0504P727N1249k044n0696l914N0394R315m8626j4487
$$ -35118 -16189 32983 19810 -30694 -22967 28282 26238 -24458 -28372 22022 31337 -17289 -31776
1501c1776M7042J9099m4360k4017M1827K7941l8135l2072L4712L5500l0910l8126
$$ -31776 15266 34365 -9995 -34012 7815 35756 -2379 -34451 261 35761 4851 -33275
1513c3275K6756M1054k2548m3244J7777M5253j3077m6216P837M7244k839m7577
$$ -33275 -6519 34535 11987 -31257 -13480 31773 18696 -27520 -19683 27561 24722 -22855
1525b2855j958M6621P241m5540j2123M3657J6604m1672k0956L9429K4589l6176
$$ -22855 -24813 21808 29049 -16491 -28614 15043 31647 -10025 -30981 8448 33037 -3139
1537c139k8519L3094L1788l0145l4211K6085L6927k2365l9018J7894M0826j4255
$$ -3139 -31658 1436 33224 3079 -31132 -5047 31880 9515 -29503 -11609 29217 14962
1549A4962m1800R243M2471m611m2842J47M2278M551m1830q934M0685J2575l8734
$$ 14962 -26838 -17595 24876 20265 -22577 -22430 19848 24399 -17431 -26365 14320 26895 -11839
1562a1839j6551L6299K0237l4349k3106L1163K6382k8256k9599K5570L1445k2504
$$ -11839 -28390 7909 28146 -6203 -29309 1854 28236 -20 -29619 -4049 27396 4892
1574D892l3217J8578L5047j4776l6530J1113L7451p274l7707K757L7874R86l7403
$$ 4892 -28325 -9747 25300 10524 -26006 -14893 22558 15284 -22423 -19666 18208 19194 -18209
1587a8209m610L6467Q544l5210j1860L3582J5243l1903j8116K9474K1054k7044
$$ -18209 -22819 13648 22192 -13018 -24878 8704 23947 -7956 -26072 3402 24456 -2588
1599b588k3730K5108K5320k1844k7091J8725K9165j5785l0367J3015L1541j0062
$$ -2588 -26318 -1210 24110 2266 -24825 -6100 23065 7280 -23087 -10072 21469 11407
1611A1407l2095O586L2733l639l2947R50L2211L121l1741n908L0949R272l0175
$$ 11407 -20688 -14102 18631 14992 -17955 -17005 15206 18327 -13414 -19322 11627 20899 -9276
1624i276j1820K8519J4876k7154j6738K5159J9089k2771k1431K0606K3244j8212
$$ -9276 -21096 7423 22299 -4855 -21593 3566 22655 -116 -21547 -941 22303 4091
1636D091k4660J5809K6220j3190k7129J0680K7695p992k8396N601K8679k596k8759
$$ 4091 -20569 -4760 21460 8270 -18859 -8179 19516 11524 -16872 -11271 17408 14812 -13947
1649a3947l06K8708L170k8746n684K7720Q415k6924j0710K5736J3526k4571j5454
$$ -13947 -14253 14455 17625 -11121 -16805 10915 19330 -7594 -18304 7432 20958 -3613 -19067
1662a9067K2728J7200k0594j9381J8647K0992j7238k2301J5011K3220j2690k4480
$$ -19067 3661 20861 267 -19114 -467 20525 3287 -19014 -4003 19217 6527 -17953
1674a7953J0605K5311q186k6531N862K6828l396k7555R33K7693J809k7329m861
$$ -17953 -7348 17963 9777 -16754 -10892 15936 12540 -15015 -14082 13611 15420 -11909 -16770
1687a6770K7291O337k5917r490K5227J1462k4062j3722K3051J5429k1720j7347
$$ -16770 10521 16858 -9059 -18549 6678 18140 -5922 -19644 3407 18836 -2884 -20231
1699b0231K0138J9049j8323k0854J6290K2791j4943k4030J2746K5282j0527k6526
$$ -20231 -93 18956 633 -20221 -3931 18860 3917 -20113 -7367 17915 7388 -19138
1711a9138Q275K7047n457k7876L081K8203j32k8269k656K8288M900k7760p263
$$ -19138 -10863 16184 10727 -17149 -14068 14135 14003 -14266 -16922 11366 16266 -11494 -18757
1724a8757K6804J0156k6216j2700K5367J5079k3932j7299K2480J9335k0126k1998
$$ -18757 8047 18203 -8013 -20713 4654 19733 -4199 -21498 982 20317 191 -21807
1736b1807J8919K4024j6606k5785J4200K7190j1628k8274Q777K9669o372k9868
$$ -21807 -2888 21136 4530 -21255 -7055 20135 8507 -19767 -10990 18679 12307 -17561
1748a7561K832L1526k77l1025l135L1254N846l0563q857K9734J2222k9110j4482
$$ -17561 -14729 16797 16520 -14505 -17640 13614 19460 -11103 -19960 9774 21996 -7114 -21596
1761b1596K7555J7367k6213j9853K4270K2794k2280k5311K0466K7757j8339k9085
$$ -21596 5959 23326 -2887 -22740 1530 24324 2044 -23267 -2801 24956 6617 -22468
1773b2468J4975L1082j2393l2625R281L3840n263l4957J484L5738J681l5942n285
$$ -22468 -7493 23589 11196 -21429 -12148 21692 16429 -18528 -17044 18694 20375 -15567 -20852
1786b0852L5605R164l4590j2888L3129J6603l2303j9543L0445K2441k8046k5552
$$ -20852 14753 23917 -10673 -23561 9568 26171 -6132 -25675 4770 27211 -835 -26387
1798b6387K5786K8214k3572l0406K0567L2462j7447l4958J3781L6531r942l8124
$$ -26387 -601 27613 4041 -26365 -5798 26664 9217 -25741 -11960 24571 14629 -23495
1810b3495O257L9152k529l9560j737L9524O051l9375j0284L8603J4088l7069j8521
$$ -23495 -17238 21914 19385 -20175 -21912 17612 23663 -15712 -25996 12607 26695 -10374 -28895
1823b8895L5578K1574l2863k5786L0803K8616k7705l1675K4562L4336k1116l7157
$$ -28895 6683 28257 -4606 -30392 411 29027 1322 -30353 -5791 28545 7429 -29728
1835b9728J7696L9338j4054m0540R365M2169n114m3193Q86M3473L281m2712q175
$$ -29728 -12032 27306 13252 -27288 -17923 24246 19132 -24061 -23175 20298 23579 -19133 -27308
1848b7308M2320J2650m1609j6532L9371K1611l7806k5282L5414K9054l2360l2832
$$ -27308 15012 27662 -13947 -30479 8892 30503 -7303 -32585 2829 31883 -477 -33309
1860c3309K9628L5768k6039l8300K1795M1057j7531m3054J3368M4617q504m5969
$$ -33309 -3681 32087 6048 -32252 -10457 30600 13069 -29985 -16617 28000 19496 -26473
1872b6473L869M6493J165m6427o316M6130J1588m5603j5765M3848K0432m1408
$$ -26473 -22604 23889 25054 -21373 -27689 18441 30029 -15574 -31339 12509 32941 -8467
1884h467k5217L9054K9591l6077l3299L3011L6474k8550m0118K4889M2376k0296
$$ -8467 -33684 5370 34961 -1116 -34415 -1404 35070 6520 -33598 -8709 33667 13371
1896A3371m4523J5605M6298j0353m7801N584M8509n79m8653m741M8307J0109m7919
$$ 13371 -31152 -15547 30751 20398 -27403 -21819 26690 26111 -22542 -27283 21024 31133 -16786
1909a6786j4871M6400K0180m4286k5061M1717K9255l8330l3764L5047L7423l1318
$$ -16786 -31657 14743 34923 -9363 -34424 7293 36548 -1782 -35546 -499 36924 5606
1921E606m0519K6530M3529k1978m6000J7145M7991j2584m9051O894N0167k371
$$ 5606 -34913 -8383 35146 13168 -32832 -15687 32304 19720 -29331 -22437 27730 25359
1933B5359n0072k953M9902Q181m9480j3612M8488J8633m6613k3909M4107K8549
$$ 25359 -24713 -27666 22236 30417 -19063 -32675 15813 34446 -12167 -36076 8031 36580
1945C6580m1019l3403L7550L7532l3620m1190K9314M3957k4259m6312J9078M8213
$$ 36580 -4439 -37842 -292 37240 3620 -37570 -8256 35701 11442 -34870 -15792 32421
1957C2421j4281m9629Q776N0381l230n0985j900N0678P507n0454j2354M8575J7816
$$ 32421 18140 -31489 -22713 27668 24438 -26547 -28447 22231 29738 -20716 -33070 15505 33321
1970C3321m6597k3321M4706K7812m1562l2454L8175L6526l4478l9970L0008M3366
$$ 33321 -13276 -36597 8109 35921 -5641 -38095 80 36606 2128 -37842 -7834 35532
1982C5532k5031m6114K0209M7946j4546m9662R750N0228m344n0769j070N0904
$$ 35532 10501 -35613 -15404 32542 17996 -31666 -21916 28312 23968 -26801 -27871 23033
1994B3033N983m9351j2072M8756J7205m6838k1708M4156K6590m1245l1132L8501
$$ 23033 29016 -20335 -32407 16349 33554 -13284 -34992 9164 35754 -5491 -36623 1878
2006A878L4630l4266l8525L0690M1476k5830m4581K1331M7089j6608m8367J1469
$$ 1878 36508 2242 -36283 -5593 35883 10053 -34528 -13197 33892 17284 -31083 -19614
2018a9614M9494n973n0106P15N0355M067m9411r738M8606J4681m6731j9633M4472
$$ -19614 29880 23907 -26199 -25484 24871 28938 -20473 -30211 18395 33076 -13655 -33288 11184
2031A1184K4566m1934k8794L8608L3026l5118l6586L1148L9778k6800m2738K2202
$$ 11184 35750 -6184 -34978 3630 36656 1538 -35048 -3900 35878 9078 -33660 -11458
2043a1458M4637j7294m6297J1919M7821o617m8745J880M8236L596m7822q797M6939
$$ -11458 33179 15885 -30412 -18493 29328 22711 -26034 -24154 24082 27678 -20144 -28941 17998
2056A7998J3501m5250j8197M3222K2117m0454k6638L7223L0668l4275l4244L0916
$$ 17998 31499 -13751 -31948 11274 33391 -7063 -33701 3522 34190 -85 -34329 -3413
2068c413L7190k6949l9847K2443M2296j7996m4323J3400M5346q253m6367L296
$$ -3413 33777 6828 -33019 -10576 31720 13724 -30599 -17199 28147 19894 -26473 -23177
2080b3177M6327J686m6120o480M5238J1169m3977j5599M1878J9947l9939k3393
$$ -23177 23150 24836 -21284 -27764 17474 28643 -15334 -30933 10945 30892 -9047 -32440
2092c2440L6535K7526l3708l0824L0496L3937k6832l6659K3091L8765j9143m0825
$$ -32440 4095 31621 -2087 -32911 -2415 31522 4690 -31969 -8878 29887 10744 -30081
2104c0081J4989M2215j0254m3443N917M3885j586m3250l834M3277Q139m1689j2532
$$ -30081 -15092 27123 16869 -26574 -20657 23228 21642 -21608 -25442 17835 25974 -15715 -28247
2117b8247L9994J6903l8245k0549L5839K4176l3180k6943K9894L0407k6933l2841
$$ -28247 11747 28650 -9595 -30144 5695 29871 -3309 -30252 -358 30049 3116 -29725
2129b9725K3380L5299j9717l7070J5808L8723j1700l9545P320M0424l448m0528
$$ -29725 -6345 28954 9237 -27833 -12025 26698 14998 -24547 -17227 23197 19749 -20779
2141b0779m38L9772M981l9324q613L8009J3048l6398j6946L4522J9994l2326k3116
$$ -20779 -21217 18555 23536 -15788 -24401 13608 26656 -9742 -26688 7834 27828 -4498 -27614
2154b7614L0220K5934k7168k8498K3956L1123k0562l3242J6990L4885j3459l5983
$$ -27614 2606 28540 1372 -27126 -3170 27953 7391 -25851 -8861 26024 12565 -23418
2166b3418R758L7222o454l7421K473L7536J252l7172n011L6392Q511l5079j1978
$$ -23418 -13660 23562 17108 -20313 -17840 19696 20948 -16224 -21235 15157 23668 -11411 -23389
2179b3389L3471J5806l2390j9056L0245K1331k7292k4337K5177K6549k2397k8444
$$ -23389 10082 25888 -6502 -25558 4687 26018 -1274 -25611 -434 26115 3718 -24726
2191b4726J8956L0561j6440l1971J3012L3040r628l3689N947L4337k635l4537
$$ -24726 -5770 24791 8351 -23620 -10608 22432 12804 -20885 -14938 19399 16764 -17773
2203a7773q06L4130M532l3999p557L2374J1119l1283j4359L0019J6751k7793j9656
$$ -17773 -18579 15551 20083 -13916 -21473 10901 22020 -9263 -23622 6397 23148 -4645 -24301
2216b4301K5615K1979k3039k4289K0401K6527j8318k7967J5504K9056j2513l0023
$$ -24301 1314 23293 254 -24035 -3634 22893 4575 -23392 -7888 21168 8655 -21368
2228b1368R069L1070o072l1333K598L2142L00l2133l319L1723O425l1025r714
$$ -21368 -12299 18771 12699 -18634 -16036 16106 16406 -15727 -19046 12677 19102 -11923 -21637
2241b1637L0336J2638k8439j5472K6616J7844k4568k0393K2799K2452k0788k3684
$$ -21637 8699 21337 -7102 -22574 4042 21886 -2682 -23075 -276 22176 1388 -22296
2253b2296J7983K5740j5349k7141J2861K8212r759k9487P204K9862l962l0439
$$ -22296 -4313 21427 6078 -21063 -8202 20010 10251 -19236 -12032 17830 13868 -16571
2265a6571J075L0407K116l0522m410K9769P603k8590j0663K7431J3711k6483j5605
$$ -16571 -15496 14911 17027 -13495 -17905 11864 19467 -9123 -19786 7645 21356 -5127 -20732
2278b0732K4349J8249k2592k0635K0771K2608j8368k4061J5580K6011j3639k6935
$$ -20732 3617 21866 -726 -21361 -590 22018 3650 -20411 -4831 21180 7541 -19394
2290a9394J1008K7659p567k8982N325K8913k170k9364p67K9350L921k9400o426
$$ -19394 -8386 19273 11706 -17276 -11951 16962 14792 -14572 -15339 14011 17932 -11468 -17894
2303a7894K8341R145k6999j2056K6024J4502k4763j6970K3255J8745k0885k1508
$$ -17894 10447 19592 -7407 -19463 6561 21063 -3700 -20670 2585 21330 445 -21063
2315b1063J9374K2877j6998k4717J4450K6104j1601k7700Q948K8557o056k9365
$$ -21063 -1689 21188 4190 -20527 -6077 20027 8426 -19274 -10326 18231 12175 -17190
2327a7190L433K9423o23k9529j975K9154N256k8880q585K8317J0632k6995j3404
$$ -17190 -13757 15666 15043 -14486 -16461 12693 17949 -10931 -19516 8801 19433 -7562 -20966
2340b0966K5647J6081k3886j8771K2436K0513j9858k2929J7588K4942j5610k6406
$$ -20966 4681 20762 -3124 -21895 541 21054 1196 -21733 -4145 20797 5187 -21219
2352b1219J3016K7596j0539k8537P580K9259m268l0108J592K9933J682k9836m670
$$ -21219 -8203 19393 8854 -19683 -12103 17156 12888 -17220 -15628 14305 15987 -13849 -18519
2365a8519K9757P280k8426j0780K7696J3480k6150j6250K4676J8702k2753k1069
$$ -18519 11238 18518 -9908 -20688 7008 20488 -5662 -21912 2764 21466 -1287 -22356
2377b2356K0721K2914j8380k4517J5730K6308j3058k7900J0622K9034p463k9597
$$ -22356 -1635 21279 2899 -21618 -5888 20420 7362 -20538 -9916 19118 11655 -17942
2389a7942M123L0388r55l0759j664L0434M711k9915p788K8963J1723k8327j4256
$$ -17942 -13819 16569 15614 -15145 -16809 13625 18336 -11579 -19367 9596 21319 -7008 -21264
2402b1264K6968J6586k5222j9362K3223K2038k0982k3851J8344K6048j6185k6947
$$ -21264 5704 22290 -2932 -22294 929 22967 1985 -21866 -3522 22526 6341 -20606
2414b0606J2884K8853j0334k9983P417L0747l972l1586R76L1392K622l1440o082
$$ -20606 -7722 21131 10797 -19186 -11769 18978 15006 -16580 -15604 15788 18410 -13030 -19112
2427a9112L1124Q862k9512j2523K9025J4771k6926j7799K5094K0342k3521k2267
$$ -19112 12012 20874 -8638 -21161 7864 22635 -4291 -22090 3004 23346 -175 -22442
2439b2442K0764K4766j8088k6976J5490K8557j2656l0335R750L1078o738l1182
$$ -22442 -1678 23088 5000 -21976 -6486 22071 9415 -20920 -11170 19908 13170 -18012
2451a8012K658L2457l61l1877l631L1659P040l0863j0218K9877J3016k8432j6238
$$ -18012 -15354 17103 16742 -15135 -18766 12893 19933 -10930 -21148 8729 21745 -6687 -22925
2464b2925K6635J9349k5271k1536K2831K3839k0267k6120J7347K8071j4262k9520
$$ -22925 3710 23059 -2212 -23748 -917 22922 2655 -23465 -6118 21953 7691 -21829
2476b1829J1196L0724q255l1429M668L2156j439l2167k109L1896N438l1534q677
$$ -21829 -10633 20091 11836 -19593 -14925 17231 15792 -16375 -18484 13412 18850 -12684 -21361
2489b1361L0737J1721k9302j4525K7452J7761k6023k0241K3983K2529k1128k4919
$$ -21361 9376 21097 -8205 -22730 4722 22483 -3540 -23781 202 22731 1603 -23316
2501b3316J8587K7120j5730k9178J3185K9892r529l0944O007L1974l001l1968
$$ -23316 -4729 22391 6661 -22517 -9332 20560 11031 -19913 -13906 18068 15067 -16901
2513a6901k25L1795L965l1479p117L0981J0317k9636j3222K7713J6750k6633j8956
$$ -16901 -17126 14669 18634 -12845 -19962 11019 21336 -8300 -21522 6191 22941 -3692 -22648
2526b2648K4245K1590k1754k4083J9177K6009j6047k8150J3516K9383j0123l0537
$$ -22648 1597 23187 1433 -22650 -3473 22536 6489 -21661 -8145 21238 11115 -19422
2538a9422P054L1098l833l1256N23L1154K803l0613o168L0367Q855k8962j2186
$$ -19422 -12368 18730 14897 -16359 -15836 15318 18121 -12492 -18660 11707 20562 -8400 -20586
2551b0586K7676J5157k6213j7831K4426K0411k2196k2600J9425K4758j6951k6493
$$ -20586 7090 22247 -3966 -21797 2629 23040 844 -21756 -2331 22427 5476 -21017
2563b1017J4048K8122j1032k8867P555K9738m893k9926J283L0422J303k9854m765
$$ -21017 -6969 21153 10121 -18746 -11191 18547 13654 -16272 -14989 15433 16736 -13118 -17883
2576a7883K9347P991k8915j0709K7527J3571k6021j6301K4064J8437k1302k1123
$$ -17883 11464 19455 -9460 -20169 7358 20929 -5092 -21393 2671 21108 -194 -21317
2588b1317J9040K3253j7013k4796J4370K6133j1301k7632Q525K8039n333k8352
$$ -21317 -2277 20976 3963 -20833 -6463 19670 8369 -19263 -10738 17301 11968 -16384
2600a6384K076K8784O68k8839l486K8303O528k7518r439K6279J2344k4989j4851
$$ -16384 -14308 14476 15144 -13695 -17181 11122 17650 -9868 -19307 6972 19316 -5673 -20524
2613b0524K3226J7188k1041j9531J8903K1467j7088k2658J4064K4379j1432k5485
$$ -20524 2702 19890 -1151 -20682 -1779 19688 2600 -20058 -5994 18385 6953 -18532
2625a8532R050K6082o170k6482L245K6898m29k6939k461K6524N507k6011p949
$$ -18532 -9482 16600 10430 -16052 -12807 14091 13662 -13277 -15738 10786 16293 -9718 -17667
2638a7667K5031J0406k3419j2971K2087J5293k0399j7538J8579J9250j6101k0838
$$ -17667 7364 17770 -5649 -18620 3467 18760 -1639 -19177 -598 18652 2551 -18287
2650a8287J3873K2232j1478k3269R249K4204o517k4786L760K5170j078k5327j207
$$ -18287 -4414 17818 6340 -16929 -7680 16524 10007 -14779 -11019 14151 13073 -12254 -13461
2663a3461K4549M229k4127o311K2932Q878k1847j1690K1083J3319j9135j5525
$$ -13461 11088 15317 -8810 -15121 7811 16689 -5158 -16848 4235 17554 -1581 -17106
2675a7106J7591J7313j5721j8617J3383J9979j1574k0884R273K1774o461k2273
$$ -17106 485 17798 2077 -16540 -3157 16822 5248 -15636 -6363 15411 8950 -13323
2687a3323M054K2502j584k2975n40K2730K793k2042n345K1217P411k0191r552
$$ -13323 -9269 13233 11649 -11326 -11866 10864 13657 -8385 -13730 7487 14898 -5293 -14845
2700a4845J9086J1538j8030j3054J6286J4854j4995j6041J3082J7335j1337j8444
$$ -14845 4241 15779 -2251 -15305 981 15835 840 -15201 -2119 15216 3879 -14565
2712a4565R190J8931o994j9634N161J9815k865k0387M98K0417J483j9916l559
$$ -14565 -5375 13556 6562 -13072 -7911 11904 9039 -11348 -10850 9567 11050 -8866 -12425
2725a2425J9271N525j8569p346J7450R342j6515j0848J5433J2208j4048j3496
$$ -12425 6846 12371 -6198 -13544 3906 13248 -3267 -14115 1318 13526 -522 -14018
2737a4018J2553J4249j0692j5511R148J6300p615j6957N713J7445l570j7813J957
$$ -14018 -1465 12784 2092 -13419 -4271 12029 4414 -12543 -6830 10615 7045 -10768 -8811
2750h811J7971j19j7701j739J7449L408j6963n118J6119O915j5270q394J4478
$$ -8811 9160 9041 -8660 -10399 7050 10458 -6505 -11623 4496 11411 -3859 -12253 2225
2763B225R616j3252j0928J2377J1884j0782j2886R080J4019p824j4468O308J5128
$$ 2225 11841 -1411 -12339 38 11922 1140 -11746 -2666 11353 3529 -10939 -4631 10497
2776A0497m658j5367K956J5369j174j5661R1J5073J690j4734k944J4275M510j4203
$$ 10497 5839 -9528 -6572 8797 7623 -8038 -7947 7126 8816 -5918 -8862 5413 9923 -4280
2790d280n720J3576O830j2326q359J1797R262j0484j0199R215J1553q383j2284
$$ -4280 -10000 3576 10406 -1920 -10279 1518 10780 296 -9903 -688 10865 2482 -9802
2803i802P316J2508n496j3313M319J3558l241j3312J495J3757l29j3759q02J3048
$$ -9802 -2486 10022 4526 -8787 -4468 9090 5849 -7463 -5968 7789 7460 -6299 -7101 5947
2817E947K547j3232l371J2287M885j1947o047J1207P103j0318p716R156Q813q580
$$ 5947 8494 -4738 -8109 4178 9063 -2884 -8931 2276 9379 -939 -8655 501 9314 734
2831G34r421P408J0386o950j0552N424J1197m623j1633L517J1924k006j2319J086
$$ 734 -8687 -1279 9107 2157 -8395 -2971 8226 3603 -8030 -4513 7411 5405 -6914 -5828
2845e828J2097J07j2173j639J2214K689j1769l485J0759M774j0793n309R960O460
$$ -5828 6269 6376 -5797 -7436 4778 7467 -4302 -7787 2972 7746 -3047 -8356 1604 8064
2859H064r397p214Q362Q205p662q867O745R728o463r952N085J0526l781j0876
$$ 8064 -1333 -8547 -185 8020 358 -8509 -1764 7964 1501 -8451 -3366 7160 3379 -7497
2873g497K904J0744j356j1423Q31J1010L16j0889j528J1178J982j0496l288J0307
$$ -7497 -4593 6151 4795 -6628 -5797 5213 5529 -5360 -6888 4290 6272 -4224 -7512 2795
2887B795M553j0130n040R386N893q633o938P949P971p240q604O720Q970n691r333
$$ 2795 7348 -2782 -7822 1564 7457 -1176 -8114 -165 7806 566 -8038 -1318 7652 1961 -7372
2902g372M411J0450l923j0348K543J0828j518j0979O24J0841L77j0789j191J0379
$$ -7372 -2961 7489 3566 -6782 -4239 6589 5071 -5908 -5284 5557 5934 -4855 -6046 4333
2916D333K926j0539l488R913M355r840n115R039O769q951p046P932Q055o979r114
$$ 4333 7259 -3280 -6768 3145 7500 -2340 -7455 1584 8353 -598 -7644 288 8343 1364 -7750
2931g750O088R942n502j0090M667J0464l719j0665K189J1206j311j0970K0J0943
$$ -7750 -1662 8280 2778 -7312 -2645 7819 4100 -6565 -4376 6830 5519 -5451 -5431 5512
2945E512J226j1213k084J0773L529j0658m560J0246O135j0600o263R130P199q426
$$ 5512 6738 -4475 -6559 4214 7743 -2915 -7475 2771 8906 -1694 -7957 1173 8372 -54
2959e4q152P703Q529o514r674N860J0176m634j0655L958J0770k799j1519J335
$$ -54 -8206 -503 8026 1512 -8162 -2302 7874 3240 -7415 -3457 7313 4514 -7005 -5670
2973e670J1902j59j1989q15J1626K231j1817l380J1652M009j0395n758J0284O568
$$ -5670 6232 6073 -5916 -6731 4895 7126 -4691 -8071 3581 7590 -2805 -8563 1721 8289
2987H289r549p713Q774Q684p891r585P051J0087o097j0816N059J1421l679j2152
$$ 8289 -1260 -8973 -199 8485 594 -8991 -1940 8147 2050 -8766 -3707 7714 4035 -8117
3001h117K797J2362j740j2188J47J2434J140j2484k626J2178M269j1934n199J1441
$$ -8117 -5320 7042 5302 -6886 -6739 5695 6835 -5649 -8275 3903 8172 -3762 -8961 2480
3015B480O168j0706p443R905Q476q584r439P894J0367p173j1172O007J1438m362
$$ 2480 8648 -2058 -9501 404 8880 296 -9143 -1249 9118 1945 -9227 -3220 8218 3856
3029C856j2029L323J2549j945j3119R73J2897P16j2995j815J2780L286j2243m710
$$ 3856 -8173 -4850 7699 5754 -7365 -6392 6505 7221 -5774 -7589 5191 8477 -3766 -8476
3043h476J1637O132j1196p311J0528Q217r277r590Q996J0028p409j1224O266J2152
$$ -8476 3161 9293 -1903 -9214 1314 9531 254 -9336 -340 9688 2279 -8945 -2679 9473
3057I473n309j2776L940J3255k572j3520R88J3972J70j3591j674J3155L230j2442
$$ 9473 4164 -8612 -4672 8583 6011 -7509 -6521 7451 7621 -5970 -7644 5511 8741 -3701
3071c701n087J2514O145j2100p016J1053Q230j0142r487Q844J0793p801j1504
$$ -3701 -8788 3726 9871 -2229 -9245 1808 10038 -104 -9591 -747 10046 2245 -9259
3084i259O369J2591n621j2667L699J3622k711j3778J089J4049K35j4125j531J3516
$$ -9259 -2890 9701 4080 -8587 -4888 8734 6023 -7755 -6666 7383 7618 -6507 -8038 5478
3098E478L310j3662m861J2986O453j2257p270J0927Q832j0306r923R408J0937
$$ 5478 8788 -4874 -9735 3251 9704 -2553 -9823 1104 9936 -370 -10293 -885 10052
3111A0052q501j1574O795J2494n369j3156M163J3339k669j3954J221J4001L19
$$ 10052 1551 -10023 -3228 9266 3897 -9259 -5096 8243 5574 -8380 -7159 6842 7161
3124G161j3635j914J3593L277j3310m735J2877O109j2195p711J1285R247j0658
$$ 7161 -6474 -8388 5205 8482 -4828 -9563 3314 9423 -2772 -10483 802 10049 -609
3137f09j0185R400J1031p780j2295P006J2751n499j3016L869J3668k461j3992
$$ -609 -10794 -1394 9637 1857 -10438 -3432 9319 3820 -9196 -5327 8341 5880 -8112
3150h112Q72J3956Q96j3877k227J3757L661j3288n212J3001O225j1873p961J1535
$$ -8112 -7240 6716 7612 -6265 -8492 5265 8926 -4362 -9574 3427 9652 -2221 -10182 1353
3164A353R023j0438j0363R528J0904p700j1916O549J2865n168j3454L762J3392
$$ 1353 10376 -62 -10425 -897 10007 2307 -9609 -3060 9805 4637 -8817 -5055 8337
3177H337k046j3750M28J4097J104j3904k029J2919M187j3103n203J2187O672j1594
$$ 8337 6291 -7459 -7031 7066 8170 -5734 -7763 5156 9343 -3760 -8963 3224 9896 -1698
3191a698q040J0978Q948r270j0404Q612J0996p769j1570O289J2046m413j2920
$$ -1698 -9738 1240 10188 918 -9486 -874 10122 2353 -9217 -2928 9118 4705 -8215
3204h215L004J3655j870j3679L41J3344J422j3522k599J3055M192j2513n864J2040
$$ -8215 -5211 8444 6574 -7105 -6764 6580 8002 -5520 -8119 4936 9128 -3385 -9249 2791
3218B791O918j1088q489J0587R115r469r862P994J1060p044j1528N793J2141m136
$$ 2791 9709 -1379 -9868 719 9834 365 -9497 -1503 9557 2513 -9015 -3222 8919 4783
3232D783j2809K459J3092j145j3480j05J3002J771j2657l526J2653M541j2059
$$ 4783 -8026 -5567 7525 6380 -7100 -7205 5797 7568 -5089 -8615 4038 8579 -3480
3245c480n955J1604O975j0428q153R793Q764q517r872P309J0809o412j1556N110
$$ -3480 -9435 2169 9144 -1284 -9437 356 9120 603 -9269 -1960 8849 2437 -9119 -4009
3259d009J2005l467j2502K178J2655o95j2910n15J2629J830j2071l673J2336M321
$$ -4009 7996 4529 -7973 -5795 6860 6165 -6745 -7260 5369 7199 -4872 -8545 3791 8112
3273H112j1215o028J1092O794r879q168R161Q797p828r549O346J0580n173j1137
$$ 8112 -3103 -9131 1961 8755 -1124 -9292 -131 8666 838 -8711 -2365 8215 3042 -8095
3287h095M005J1567l131j1403J780J1878o27j1997o44J1873K159j1582l505J1355
$$ -8095 -4090 7477 4346 -7057 -5277 6601 5974 -6023 -6667 5206 7365 -4217 -7722 3633
3301C633M699j1021n564J0096O852r284p771Q165Q650o870r517O095R948m588
$$ 3633 8332 -2689 -8253 1843 8695 -589 -8360 -195 8455 1585 -7932 -1837 8111 3523
3315C523j0694L720J0915k427j1380J171J1692m28j1218q85J1489J579j0677l326
$$ 3523 -7171 -3451 7464 5037 -6343 -5172 6520 6092 -5126 -6011 5478 7057 -3620 -6946
3329f946J0232M470r808n610R170O539q245p549P485Q301o422r291N571R648m344
$$ -6946 3286 7756 -2052 -7662 1508 8047 -198 -7747 -262 8039 1617 -7674 -2103 7545 3201
3344C201j0250L368J0406j957j0787J053J0687J21j0859r59J0043K557r763l925
$$ 3201 -7049 -3681 6725 4768 -6019 -4966 5721 5842 -5017 -5976 4067 6624 -3139 -7064
3358g064R962M334r079n582Q812N849p739p088O885P938o198q326N232Q950m552
$$ -7064 2898 7232 -1847 -7429 1383 7232 -507 -7595 -710 7228 1030 -7296 -2064 6886 2334
3373B334r295L027R872k223r699J091R646j7r875q14R549J954r208l148Q880M410
$$ 2334 -6961 -3934 5938 3715 -5984 -4893 4753 4736 -5139 -5953 3596 5550 -3658 -6806 2074 6484
3389F484q671m959P845N799o985o621O689P091n779p404M228Q518l748q861L187
$$ 6484 -2187 -7146 699 6498 -487 -7108 -419 6672 893 -6511 -2283 6235 2487 -6374 -3187
3404c187Q871j960r290R79R050K73q933j277Q967J935q657k397P871L968p647
$$ -3187 5684 3724 -5566 -4587 4463 4736 -4197 -5474 3493 5428 -3229 -5626 2245 6213 -1434
3419a434m466O642N586o490n747N618O272m820p157M568P247l561p569K892P976
$$ -1434 -5900 742 6328 -162 -5909 -291 5981 1161 -5996 -1428 5819 2258 -5311 -2419 5557
3434E557j982q427R83Q514O5q316q42Q132J471p570k421P260L069o387m294O414
$$ 5557 3575 -4852 -3869 4645 4710 -3606 -4448 3684 5155 -2415 -4836 2424 5493 -894 -5188 1226
3450A226M820o388m783N157N534m642o323M442O587l907o669K842P206k086p151
$$ 1226 6046 -342 -5125 32 5566 924 -5399 -957 5630 1723 -4946 -2104 5102 3016 -4135
3465d135R67P260l1p627m56P473R89p066j975P023K473o390l192N751L993n871
$$ -4135 -3168 4092 4061 -3566 -4022 3451 4440 -2626 -4601 2422 4895 -1495 -4687 1064 5057 -814
3481h14m296N376M734m686n319L887N754l397n958L068N909k445o199J514O661
$$ -814 -5110 266 5000 314 -5005 -1118 4636 1239 -4719 -1651 4258 1813 -4386 -2872 3789
3496C789j085o577O8O972M42o801r10O281J712o361k108O028L003n619l919N339
$$ 3789 2704 -3873 -3805 3167 3609 -3192 -4102 2179 3891 -2470 -4578 1450 4453 -1166 -5085 254
3512B54L917m497m388M115M763l585n262K988N705k524n743J881O046j475o095
$$ 254 4171 -326 -4714 -599 4164 579 -4683 -1695 4010 1486 -4257 -2376 3670 2195 -3900
3527c900J036N980k61n959m43O317O61n869j337N724J911n653k399M965L251m701
$$ -3900 -2864 3116 2855 -3104 -3547 2770 3431 -2438 -3775 1949 3860 -1793 -4192 773 4024 -677
3543f77l566M496M047m179m317L432M903l199m898K601N212k120n225J379N566
$$ -677 -4243 253 4300 121 -4196 -764 4139 940 -3958 -1357 3855 1735 -3490 -2111 3455
3558C455r15n277K02N440O5n732o09N787J182n575j587N377K157n005k951N114
$$ 3455 2540 -2737 -2535 2905 2970 -2762 -3371 2416 3598 -1977 -3564 1813 3970 -1035 -3986 1128
3574A128K760l953l931M316M171l833m434L088N016l007m964K516N604k482n470
$$ 1128 3888 -65 -3996 320 4491 658 -3776 -688 4328 1321 -3643 -1127 4477 1995 -3475
3589c475J805N307q59n741M20N636L51n977q94N763J368n435k008N454K523n049
$$ -3475 -1670 3637 2778 -2963 -2543 3093 3444 -2533 -3427 2336 3704 -1731 -3739 1715 4238 -811
3605h11l193M373L626m376l777M350M100l642m590L082M670k319n439K078N650
$$ -811 -4004 369 3995 -381 -4158 192 4292 650 -3940 -858 3812 1493 -3946 -1868 3782
3620C782j713o014J322N880l52o161J97N697O68n751j497N946J510n283k371N370
$$ 3782 2069 -3945 -2623 3257 2905 -3256 -3059 2638 3306 -2445 -3942 2004 3514 -1769 -4140 1230
3636A230K768m957l366M657L795m194m374L728M788l063n209K838N271k102n814
$$ 1230 3998 -959 -4325 332 4127 -67 -4441 -713 4075 1012 -4197 -1359 3912 1810 -4004
3651d004J607N957p65o439P40O172l03o314n5O109J259o392j572N698K630o208
$$ -4004 -2397 3560 2795 -3644 -2904 3268 2965 -3349 -3404 2705 3964 -2428 -4000 1698 4328 -1880
3667a880k793N766L449n115m196M749M694l928n496L795N369l176n668K492O143
$$ -1880 -4673 1093 4542 -573 -4769 -20 4674 746 -4750 -955 4414 1238 -4430 -1938 4205
3682D205j825o344J411O443p21o421n8O560P98o677j301O404K067o375k781O406
$$ 4205 2380 -3964 -2553 3890 3169 -3252 -3310 3250 4048 -2629 -3930 2474 4541 -1834 -4615 1791
3698A791L651o207l981N264M993n196n011M016N829l454o174K943O464k561o751
$$ 1791 5442 -765 -4746 518 5511 315 -4696 -680 5149 1695 -4479 -1536 4928 2367 -4384
3713d384K191O781j208p089K92P132K98o998j261P256J761p019k340O362L372
$$ -4384 -2193 4588 3380 -3709 -3417 3715 4013 -2985 -4246 3010 4771 -2248 -4588 1774 5146
3728E146o291m056N992M776n667n276N002N541m072o372L909O333k834p052K473
$$ 5146 -1145 -5201 791 5567 -100 -5376 -374 5167 1095 -5277 -1368 4965 2131 -4921 -2448
3743b448P030j571p616J077P370J2p568q24P729J794p884k376P229L282o969l972
$$ -2448 4582 3011 -4605 -3528 3842 3854 -3714 -4538 3191 4985 -2899 -5275 1954 5236 -1733 -5705
3759e705O770M268n963n098N537N870m818o655M307O731l541p066K948P203j885
$$ -5705 1065 5333 -630 -5728 -191 5679 861 -5794 -1487 5244 1703 -5363 -2415 4788 2903
3774B903p697J064P929l07q015l51P712J559q041j977P507K981p281l745O943
$$ 2903 -4794 -3730 4199 3892 -4123 -4474 3238 4797 -3244 -5221 2286 5267 -2014 -5759 1184
3789A184M762o668n447O268N895n317o911M916P215l824p782L068P867k034q199
$$ 1184 5946 -722 -6169 99 5994 677 -6234 -1318 5897 2073 -5709 -2641 5226 3192 -5007
3804e007J539Q212n41q307n30Q184J443q204k058P970L063q041l296P095M801
$$ -5007 -3468 4744 4203 -4104 -4634 3550 4993 -3211 -5269 2701 5764 -2277 -5573 1522 6323
3819F323p092n193O330N854n571o894N652O504l721p946L602P796k483q093J391
$$ 6323 -769 -5962 368 6222 651 -6243 -591 5913 2192 -5754 -2152 5644 3161 -4932 -3541
3834c541Q516p09q387l96Q544J085q310j887P888K952p580l489P286M321o834
$$ -3541 4975 4266 -4121 -4517 4027 5112 -3198 -5085 2803 5755 -1825 -5314 1972 6293 -541
3849e41n268O409N626n705o524N299O725m183p604L576P647k298q265J605Q512
$$ -541 -5809 600 6226 521 -6003 -704 6021 1838 -5766 -2190 5457 3159 -5106 -3501 5011
3864E011r36q331j20Q368P85q076k458Q600K658p703l824P689M160p003m917O258
$$ 5011 4075 -4256 -4376 3992 4777 -3299 -5757 2843 5501 -2202 -6026 1663 5823 -1180 -6097 161
3880A61O039o146o326M996P345m630p502L393Q095k521q128J876Q140j530q037
$$ 161 6200 54 -6272 -1276 6069 1439 -6063 -2670 5425 2904 -5224 -3348 4792 3262 -4775
3895d775N38Q148L84q104j433P974K439p666l559P501M113p085m601O778N272
$$ -4775 -4237 3911 4295 -3809 -5242 2732 5171 -2495 -6054 1447 5560 -1525 -6126 652 5924
3910E924n913o164N505O610m423p827M072P471k820q239K373Q160j191q268O63
$$ 5924 11 -6153 -648 5962 1539 -6288 -2216 5255 2435 -5804 -3431 4729 3538 -4730 -4067
3925d067Q096O74q549j284Q322K144p725l237P505L620o851m433O551N122n960
$$ -4067 4029 4703 -3846 -5130 3192 5336 -2389 -5626 1879 5499 -1352 -5785 766 5888 -72
3940g2n807N388O420m654o929L784P450l141p607K110P837j305p872Q04P758J97
$$ -72 -5879 -491 5929 1275 -5654 -1870 5580 2439 -5168 -3058 4779 3474 -4398 -3594 4164 4361
3956D361p913r80P993J667p536k610P215L511o987m440O635M950n796n477M983
$$ 4361 -3552 -4532 3461 5128 -2408 -5018 2197 5708 -1279 -5719 916 5866 70 -5407 -424
3971d24O388m690o746M078O704l090p092K594P248j503p728R40P335M9p648r61
$$ -424 5964 1274 -5472 -1394 5310 2220 -4872 -2278 4970 3467 -4261 -3321 4014 4063 -3585 -4546
3987d546P985J337p233k376P093K976o699l665O012M757o119n144N445N588m812
$$ -4546 3439 4776 -2457 -4833 2260 5236 -1463 -5128 884 5641 -478 -5622 -177 5411 599
4002E99n870L756O624l146o787K624O652j733o962R61O971j80p319l79P244J152
$$ 599 -5271 -1515 5109 1963 -4824 -2200 4452 2719 -4243 -3282 3689 3509 -3810 -4189 3055 4207
4018D207p037j820O893K218o440k795N718L602n402m481N190M864m438n632M398
$$ 4207 -2830 -4650 2243 4461 -1979 -4774 944 4546 -856 -5337 -147 4717 279 -5353 -955
4033i55N548l438o375L381O095k222o384J297P006r20o653j47O891N66o647j352
$$ -955 4593 1155 -5220 -1839 4256 2034 -4350 -3053 3953 3033 -3620 -3767 3124 3690 -2957 -4309
4049d309O713J844o399k392O103L050n743l806N407M164m797m587M269N128l458
$$ -4309 2404 4248 -2151 -4543 1560 4610 -1133 -4939 468 4632 -165 -4752 -483 4645 1187
4064A187n544L214N659k684n805K177N699j267o040M62O319m4o364n02O159J334
$$ 1187 -4357 -1143 4516 1832 -3973 -1796 3903 2636 -3404 -2942 3377 3333 -3031 -3533 2626 3960
4080C960o217j251N739K267n744l016N234L762m914m002M246M464l688n056L780
$$ 3960 -2257 -3508 2231 4498 -1246 -4262 972 4734 -180 -4182 64 4528 840 -4216 -436
4095d36M766l229m950K299N986k150n919J223N847n15n928m8O036M95n452j202
$$ -436 4330 1101 -3849 -1550 4436 2286 -3633 -2410 3437 2922 -3006 -3054 2982 3477 -1975 -3177
4111c177N632J486n727k040N464K389m713l330M257M041m338m239L930M490l299
$$ -3177 2455 3941 -1786 -3826 1638 4027 -686 -4016 241 4282 -56 -4295 -365 4125 826
4126H26m865K798N200k448n103K129N068j576n506Q64N932o75n435l82N543Q62
$$ 826 -4039 -1241 3959 1511 -3592 -1463 3605 2029 -3477 -2613 3319 2644 -2791 -3173 2370 3232
4142C232n374j653N424J956n211k407N277K527m471l441M180L837l932m008L254
$$ 3232 -2142 -3795 1629 3585 -1626 -4033 1244 3771 -700 -4141 39 3876 -56 -4064 -810
4157h10M409k860m543K624M727j994n335K067M870r05n155J83N477n7n315n88
$$ -810 3599 739 -3804 -1180 3547 1553 -3782 -1715 3155 2250 -2905 -2722 2755 2698 -2617 -3205
4173c205N112J209n086j648N208J978m947k026M283K911m009l431L634L857l609
$$ -3205 1907 3116 -1970 -3618 1590 3568 -1379 -3405 878 3789 -220 -3651 -17 3840 231
4188B31l861L276M086k493m915K276N009j783m710Q89M989o88n020M44N118J46
$$ 231 -3630 -354 3732 1239 -3676 -1400 3609 1826 -2884 -1995 2994 2306 -2714 -2270 2848 2994
4204B994n472q37N253J470n219j450M664K196m568k632M485L061m175l440L701
$$ 2994 -2478 -3315 1938 3408 -1811 -3261 1403 3599 -969 -3601 884 3945 -230 -3670 31
4219C1L752l372m098K829M761k341n324K490M813j369n282P30N405n32n051j33
$$ 31 3783 411 -3687 -858 3903 1562 -3762 -1272 3541 2172 -3110 -2380 3025 2493 -2558 -2691
4235b691N265M44n089q20M687J536m787k311N169K390m915k505M022L566l783
$$ -2691 2574 3018 -2071 -2891 1796 3332 -1455 -3766 1403 3793 -1122 -3627 395 3961 178
4250A78m302L912M318l520m108K313N256k471n141J270N793j411n358O87N739
$$ 178 -4124 -212 4106 586 -3522 -1209 4047 1576 -3565 -2295 3498 2087 -3271 -2584 3155
4265C155k8n953k01N272J003n438j578N127K099m779k782N083K947m568l656M295
$$ 3155 3127 -2826 -3027 2245 3248 -2190 -3768 1359 3458 -1321 -4103 980 3927 -641 -4297 -2
4281bL900l920m325L579M826l020n354K830M986j474n856J468N375o61n696M78
$$ -2 3898 -22 -4347 -768 4058 1038 -4316 -1486 3500 2026 -3830 -2362 3013 2352 -3344 -2866
4297b866N810K31n649j008N488J771n672k431N692K457m905l222M871L382l992
$$ -2866 2944 3175 -2474 -3482 2006 3777 -1895 -4326 1366 3823 -1082 -4304 567 3949 -43
4312d3m368M117M491l762m553K771N284k283n694K061O000j345n875K79O163j46
$$ -43 -4411 -294 4197 435 -4118 -1347 3937 1654 -4040 -1979 4021 2676 -3199 -2920 3243 3097
4328C097n929l05N651J528n981k008N642K646n675k565M856L683n083l968M708
$$ 3097 -2832 -3137 2514 4042 -1939 -3947 1695 4341 -1334 -3899 957 4640 -443 -4411 297
4343B97M404l962n161L561N258k770n934K341O273j956n951J045O034k06o488
$$ 297 4701 739 -4422 -861 4397 1627 -4307 -1966 4307 2351 -3600 -2555 3479 3273 -3215
4358c215j76O489O34o265j396N999K209n713k835N467L596n530l958M766M332
$$ -3215 -3391 3098 3732 -2533 -3929 2070 4279 -1434 -4269 1198 4794 -736 -4694 72 4404
4373D404l978m845L700N600l661n483L038N947k562o031J390O183p69o793O64
$$ 4404 426 -4419 -719 4881 1220 -4263 -1225 4722 2160 -3871 -2481 3702 2933 -3860 -3196
4388c196O639K57o587j430O406K137o213k359N898K866n593l699N117M500m687
$$ -3196 3443 3700 -2887 -4317 2089 4226 -1987 -4346 1552 4418 -1175 -4874 243 4743 56
4403E6m624L907N283l469n964L072N922k096o290J637O476j103o999J194N996
$$ 56 -4568 -661 4622 1153 -4811 -1739 4183 2087 -4203 -2566 3910 2807 -4192 -2998 2998
4418B998N12o567r29O585J554o152k591O076K969n740l456N334M041m710m951
$$ 2998 3510 -3057 -3986 2599 4153 -1999 -4590 1486 4455 -1285 -4741 593 4634 -76 -5027
4433e027M669M884l629n217K585O289k649o310J839O457j078o611Q00O456J78
$$ -5027 -358 4526 897 -4320 -1735 4554 1905 -4405 -2566 3891 2813 -3798 -2998 3458 3636
4448C636o660p13O313J513n941k226N793K794n708l454N471M060n194m481M746
$$ 3636 -3024 -3737 2576 4089 -1852 -4078 1715 4509 -1199 -4653 818 4878 -316 -4797 -51
4463e1M958m278n387L614N850k977n783K386N843j504o311N56O532J57o648n58
$$ -51 4907 629 -4758 -1144 4706 1729 -4054 -1668 4175 2671 -3640 -3084 3448 3605 -3043 -3601
4479c601O451J248o361j752O176K361n716l275N604L460n083m014M586M630m362
$$ -3601 2850 4098 -2263 -4015 2161 4522 -1194 -4469 1135 4595 -488 -4502 84 4714 352
4494C52m824L782N366l206n728K383O130j727o389J050O603o36o245n16O244Q69
$$ 352 -4472 -690 4676 1470 -4258 -1875 4255 2528 -3861 -2811 3792 3156 -3089 -3605 2639 3508
4510C508n778j579O164J967n732k775N329L195m596m481N009M215l882n191L874
$$ 3508 -2270 -3849 2315 4282 -1450 -4225 1104 4299 -297 -4778 231 4446 564 -4627 -753
4525g53N200l372n331K513N622j869n820Q79O106m38n910j74N760J230o094j092
$$ -753 4447 1075 -4256 -1743 3879 2010 -3810 -2931 3175 2737 -3173 -3347 2413 3643 -2451 -3543
4541c543N495J891n704k313M948L374m763l674M312M084m056m084L368M758l059
$$ -3543 1952 3843 -1861 -4174 774 4148 -615 -4289 23 4107 51 -4033 -665 4093 1034
4556A034n119K425N447j847n813J677N555j008n683K4O115L41n464j233N481K055
$$ 1034 -4085 -1660 3787 1940 -3873 -2196 3359 2351 -3332 -3308 2807 3148 -2316 -3549 1932 3987
4572C987n754k153N044K785m827l125M226L869m047m018L611M246k803m764K375
$$ 3987 -1767 -3920 1124 3909 -918 -4043 183 4052 5 -4013 -402 3844 1041 -3723 -1348
4587a348N116k044n136J285N779j236n168K86N065L92n093r52N270J149m762j776
$$ -1348 3768 1724 -3412 -2127 3652 2416 -2752 -2466 2599 2991 -2102 -3054 2216 3365 -1397 -3173
4603c173M585K269m456k899M291L101l649l767L514M384l349m446K716M398j865
$$ -3173 1412 3681 -775 -3674 617 3718 69 -3698 -184 4200 851 -3595 -879 3519 1654
4618A654n072J671N017j149m986K87N153J23n140j96M841Q89m979j279M784J684
$$ 1654 -3418 -1747 3270 2121 -2865 -2578 2575 2698 -2442 -2638 2203 3092 -1887 -3166 1618 3302
4634C302m023k855M185K724l478l560L598L381k789l997K641M190k246m355J884
$$ 3302 -721 -3576 609 3333 -145 -3705 -107 3274 485 -3512 -871 3319 1073 -3282 -1398
4649a398M109j018m595R69M454j69m970k01M725P85m603r19M337J380m103k104
$$ -1398 2711 1693 -2902 -1933 2521 2352 -2618 -2819 1906 2691 -1912 -2831 1506 2886 -1217 -3321
4665c321M220K110l574k710L256L078k950l346K543L542j970l691J495M023j473
$$ -3321 899 3009 -565 -3275 -19 3059 109 -3237 -694 2848 878 -2813 -1318 2705 1232
4680A232l969J097M000m91m443N00L983J84m032q00M148J294l963j403L428K072
$$ 1232 -2737 -1640 2360 1869 -2574 -2074 1909 2093 -1939 -2739 1409 2703 -1260 -2663 765 2837
4696B837l079k666L172K523k750k721K379K991k201l093J834L666j717l868J653
$$ 2837 -242 -2908 264 2787 37 -2684 -305 2686 485 -2608 -774 2892 1175 -2693 -1040
4711a040L173l30m054M73L815J01l889j45L578O17l660p11L137J301l124j540
$$ -1040 2133 1803 -2251 -1778 2037 2138 -1751 -1896 1682 2299 -1361 -2072 1065 2366 -758 -2298
4727b298K959K094k718k441K412K461k219k519K115K493j584k899J560K927j046
$$ -2298 661 2755 37 -2404 8 2469 250 -2269 -154 2339 755 -2144 -584 2343 1297
4742A297l318P87L336n33l214J52L293Q8l526j07L189O50k978j089K659J617k790
$$ 1297 -2021 -1234 2102 1569 -1645 -1493 1800 1888 -1638 -1745 1444 2094 -884 -1973 686 2303 -487
4759d87j674K633J902k562k312K458K426k218k547J717L168j782l171J359L076
$$ -487 -2161 472 2374 -188 -2500 -42 2384 166 -2381 -664 2504 722 -2449 -1090 1986
4774A986r27l126O38L144j90l246l60L477K57l152k18K895Q26l241p70K478J637
$$ 1986 1059 -2067 -1429 1715 1525 -1721 -2081 1396 1653 -1499 -1717 1178 2004 -1237 -2007 471 2108
4791B108k905j429K248K101k495j888J939K206j526k533J595K634j626k062N71
$$ 2108 -797 -2226 22 2123 -372 -2260 -321 1885 359 -2174 -579 2055 429 -1633 -1062
4806a062K680r16k294J06L143m87k477m46L141J96k634p44K596J074k599j306
$$ -1062 1618 702 -1592 -1486 1657 1170 -1307 -1753 1388 1584 -1050 -1794 802 1876 -723 -2029
4822b029K653J758k911j344J905J991k048j898J975K017j940j989J001L087j529
$$ -2029 624 2382 -529 -1873 32 2023 -25 -1923 52 2069 129 -1860 -859 2228 699
4837F99k637J044K717m90l048K84L350m64k946k00L050L89k984n28K816Q05k785
$$ 699 -1938 -894 1823 1333 -1715 -1431 1919 1455 -1491 -1691 1359 1748 -1236 -1764 1052 1857 -928
4854i28n95K091J484k213j737K070J959k069k158J513K669j260k925J645K475
$$ -928 -1523 568 2052 -161 -1898 172 2131 62 -2096 -583 2086 826 -2099 -454 2021
4869B021q69k982J018K540m36k873M44K840l6k865l02K715O00k840n91K617R33
$$ 2021 1152 -1830 -812 1728 1292 -1581 -1137 1703 1667 -1198 -1500 1215 1815 -1025 -1616 1001 1934
4886A934k634j275K269J740k109j815J932K074k046k059J380K591j642k439J261
$$ 1934 -700 -1975 294 2034 -75 -1890 42 2116 70 -1989 -609 1982 340 -2099 -838
4901h38K630r48k425J88L249o44k677j12K766K35k851n28L194N11k810j116K895
$$ -838 1792 844 -1581 -1393 1856 1212 -1465 -1577 1189 1424 -1427 -1955 1239 1750 -1060 -2176 719
4918G19J550k943j690K290K265k299k261K189K179j710k660J753K690j352k910
$$ 719 2269 -674 -2364 -74 2191 -108 -2369 -180 1999 289 -2371 -618 2072 720 -2190
4933b190J088L086q36l119L17L386k43l170L6K848L35k651j073L006J420l049
$$ -2190 -1102 1984 1148 -1971 -1654 1732 1489 -1681 -1645 1203 1538 -1113 -2186 820 2240 -809
4949h09j457K348K134k382k343K266K495j931k720J928K688j336l162J236L313
$$ -809 -2266 82 2216 -166 -2509 -243 2252 321 -2399 -471 2217 881 -2281 -1045 2268
4964B268r35l264P15K854l07l190L60L057J43l037o27L115J322l471j044K679
$$ 2268 1333 -1931 -1216 1638 1331 -1859 -1499 1558 1701 -1336 -1963 1152 2474 -997 -2041 638
4980F38J603k700j570K125K470k419k140K042K360k144k574J651L043j380l217
$$ 638 2241 -459 -2029 96 2566 147 -1993 49 2409 265 -2309 -658 2385 1005 -2212
4995b212J109K832k50l401M91L159O9l517j95L176J036l130j152K932J360k808
$$ -2212 -1103 1729 1479 -1922 -1431 1728 1797 -1720 -1915 1261 2297 -833 -1985 947 2307 -501
5011e01k007L061K124k731k123K306K310j927l104K012K842j240l196P85L417
$$ -501 -2508 553 2677 -54 -2177 129 2439 512 -2592 -580 2262 1022 -2174 -1389 2028
5026B028n22l340K34L386l0l207n49L320R49l354r63K792J712k893k035K760K143
$$ 2028 1506 -1834 -1600 1786 1756 -1451 -2000 1320 2269 -1085 -2048 744 2456 -437 -2472 288 2431
5043B431k695k263K233K625k019k701J449L190j722k980J204L258p46l544N98
$$ 2431 -264 -2527 -294 2331 312 -2389 -940 2250 528 -2452 -1248 2010 1264 -2280 -1682
5058a682L457j42l439o6K927J132l624p97L003J479l173j186K538J979k594k382
$$ -1682 1775 1633 -1806 -1872 1055 2187 -1437 -2234 769 2248 -925 -2111 427 2406 -188 -2570
5074b570K394K490j811l016K055K725j402l083J241L185r10l429O15L443k90l143
$$ -2570 -176 2314 503 -2513 -458 2267 865 -2218 -977 2208 1298 -2131 -1516 1927 1637 -1506
5090a506n50L457P32l104j160L182J615l441j691K812J792k446k384K782K469
$$ -1506 -2056 1401 2133 -971 -2131 1051 2666 -775 -2466 346 2138 -308 -2692 90 2559
5105B559k255k516J724L011j798k940J327L109j230k768M99L291k20l385j34L210
$$ 2559 304 -2212 -488 2523 725 -2215 -888 2221 991 -1777 -1278 2013 1793 -1592 -1726 1484
5121A484O08l100q92K802J127k921j241K555J928k753j762K246K337k105k854
$$ 1484 2092 -1008 -1900 902 2029 -892 -2133 422 2350 -403 -2165 81 2418 313 -2541
5136b541K200K868j749k871J190K864p19l135M52L184k37l207n6L180M54l137
$$ -2541 -341 2527 778 -2093 -903 1961 1242 -1893 -1441 1743 1506 -1701 -1757 1423 1877 -1260
5152a260r10L379O46k883j003K455J791k532j902K241K035j662k606J619K757
$$ -1260 -2170 1209 1855 -1028 -2031 424 2215 -317 -2219 22 2057 395 -2211 -592 2165
5167B165j370k854J046L103j249k991J050K717j28l073m00L253N36k926o48K494
$$ 2165 795 -2059 -1013 2090 841 -2150 -1100 1617 1489 -1584 -1984 1269 1805 -1121 -1769 725
5183G25J052k730j195K796J332k300j776J762K234j603k548J938K169j135k607
$$ 725 1777 -953 -2148 648 1980 -320 -2096 -334 1900 297 -2251 -313 1856 721 -1886
5198a886J229K501p76k648M22K829l75k898P5K424N48k527j073L033O00k296j251
$$ -1886 -657 1844 1068 -1580 -1158 1671 1296 -1602 -1527 897 1445 -1082 -2155 878 1478 -818 -2069
5215b069K745J490k622j368J565K500k099j975J642K157j523k290O95L152q76
$$ -2069 676 2166 -456 -1824 -259 2241 142 -1833 -191 1966 443 -1847 -1152 2000 1124
5230A124k765O42K511k95k316j78K353N83k737m88K588Q48k670q90K456J001k262
$$ 1124 -1641 -999 1512 1217 -1099 -1277 1076 1659 -1078 -1566 1022 1870 -800 -1690 766 1767 -495
5247d95j148J928J838k336j601J689J719r18k292J007K255q67k290N50K464j43
$$ -495 -1643 285 2123 -213 -1814 -125 1594 676 -1616 -609 1646 779 -1511 -961 1503 1360
5263A360k772K84K371K81k485m94K282R43k508p80K074Q35j785j432J965J506
$$ 1360 -1412 -1128 1243 1524 -961 -1455 827 1770 -738 -1518 556 1391 -394 -1826 139 1645
5279A645j946j471J571J853j339k235J457K136r57k316P43K449p14k272K34K285
$$ 1645 -301 -1772 -201 1652 313 -1922 -465 1671 714 -1602 -859 1590 876 -1396 -1162 1123
5295A123K1k254j75J934P64k160q15K387N05j979j070K146J307k111j123J172
$$ 1123 1144 -1110 -1285 649 1413 -747 -1562 825 1330 -649 -1719 427 1734 -377 -1500 -328
5311c28J828j566j716J352K090j091k124R54K231p23k219J70K342j74j945l82
$$ -328 1500 -66 -1782 -430 1660 569 -1555 -601 1630 907 -1312 -1142 1200 1026 -919 -1301
5327a301K066M50j993j72J908L55j762j062J664J245j498j248J354J311j279j329
$$ -1301 765 1215 -778 -950 958 1313 -449 -1511 153 1398 -100 -1348 6 1317 38 -1291
5343a291J073J634m71k227Q08J471k92j731L63J984k88k028mJ922J65j670o62
$$ -1291 -218 1416 945 -1282 -474 997 705 -1026 -663 1321 1033 -995 -999 923 1088 -582 -1244
5360a244K123M68j672j216J926Q49j569q50J351J480j654j204J322J201j164j297
$$ -1244 879 1347 -325 -1541 385 1234 -335 -1185 166 1646 -8 -1212 110 1311 147 -1150
5376a150R10J247q31j199M56K097o48j703o0J787K20j949j04J905K84j989n28
$$ -1150 -240 1007 176 -1023 -567 1530 882 -821 -881 906 1126 -823 -927 978 1262 -727 -1255
5393a255K201R1j403q42J741O23j323j035J374R60r64j444R60J455j038j402R35
$$ -1255 946 1037 -366 -1208 533 1156 -167 -1202 172 1132 168 -1276 -316 1139 101 -1301 -366
5410c66J541m38k026L01K031m07j518K58J532m09j394j58J327O53j611n16J529
$$ -366 1175 737 -1289 -988 1043 636 -882 -624 908 499 -895 -1053 274 927 -684 -1200 329
5427C29Q50j364r69J312Q44j188j108J188J035r55j198P62J308n08j464P33J365
$$ 329 1179 -185 -1154 158 1002 -186 -1294 -106 929 -26 -1224 -462 846 338 -1126 -393 972
5444I72n70j353L98J422j55j610j27J732J75j713m77J901O98j901k02R20R95j301
$$ 972 402 -951 -553 869 714 -896 -1023 709 884 -829 -1306 595 1293 -608 -810 110 1105 -196
5462a96r02J183J103j128j254J146J336j118j323J064R58m66j408P20J197k71
$$ -196 -1098 85 1188 60 -1194 -48 1288 170 -1153 -89 869 403 -1005 -285 912 641
5478F41j674L36J644q5j376m13J723J48j621l00J461P17j553o45J169Q49j052
$$ 641 -1033 -697 947 862 -514 -927 796 944 -677 -977 484 1201 -352 -997 172 1021 -31
5495c1j129J178J134j034j213P36J592j008j367P77J393o13j307L22J931l99j857
$$ -31 -1160 18 1152 118 -1095 -359 1233 225 -1142 -365 1028 415 -892 -570 1361 962 -895
5512h95R8J780M2j663j28J319O42j843m52J318J168j360j259J328J108r73j434
$$ -895 -797 983 1025 -638 -766 553 1195 -648 -1100 218 1386 26 -1233 95 1203 230 -1204
5529a204J071J314j041j408P38J598n76j570M77J655m62k012K70J923L1j472l31
$$ -1204 -133 1181 140 -1268 -530 1068 492 -1078 -601 1054 592 -1420 -1150 773 804 -668 -999
5546i99J753M15j993l69J774O31j638r38J437J134j561q16R70J854j866j314J129
$$ -999 754 1169 -824 -1193 581 1212 -426 -1364 73 1207 -354 -1170 -200 1654 -212 -1526 -397
5563c97J438p58j546O07J407n94j442N76J581N7k016r9J859J82j781k84J844Q67
$$ -397 1041 283 -1263 -656 751 157 -1285 -709 872 929 -1087 -1186 673 855 -926 -1210 634 1501
5581A501k057j036J725J252j821q00J332J319j360j531J276J445j028j775J276
$$ 1501 -556 -1592 133 1385 -436 -1236 96 1415 55 -1476 -200 1245 217 -1558 -282
5596b82J624o97j716K14J784J19k251M6K636m79j790l66J747P25j803q81J725
$$ -282 1342 645 -1071 -857 927 1046 -1205 -1159 1477 998 -792 -1158 589 1314 -489 -1370 355
5613C55J001j510j076J335J363j165j537R32J731j162j321P31J655o81k161R78
$$ 355 1356 -154 -1230 105 1468 303 -1234 -302 1429 267 -1054 -323 1332 651 -1510 -532
5629e32J686k32j915K17J736L87k385j50J728R75j990j394K333J482k399j070
$$ -532 1154 922 -993 -776 960 1347 -1038 -1188 540 1515 -475 -1869 464 1946 -453 -1523
5645a523J762J206j545j680J779J591j350j545O30K149r56j869O28J819j02k372
$$ -1523 239 1445 -100 -1780 -1 1590 240 -1305 -675 1474 518 -1351 -723 1096 994 -1378
5661a378O81J663J56k054n99K323M27k025p91K039J190j961j234J855J311j687
$$ -1378 -697 966 1122 -932 -1531 792 1219 -806 -1597 442 1632 -329 -1563 292 1603 -84
5677h4j726J689J785j427j637J016J839q63j966J51K580k96k331J36K229j79j915
$$ -84 -1810 -121 1664 237 -1400 -384 1455 592 -1374 -1223 1357 1061 -1270 -1134 1095 916 -999
5694i99k64K029O10k202r61K467N77j679j223J668J610j715j486J393J631r20
$$ -999 -1263 766 1376 -826 -1787 680 1257 -422 -1645 23 1633 -82 -1568 -175 1456 536
5710E36k074R94J962p83j961P39K049o50k219J47K349J32k219l28K172P52k105
$$ 536 -1538 -544 1418 635 -1326 -587 1462 812 -1407 -1260 1089 1221 -998 -1326 846 1598 -507
5727e07p34J876P89j943j001K006J225k084j450J753J837j433k114J446K054j087
$$ -507 -1241 635 1424 -519 -1520 486 1711 -373 -1823 -70 1767 334 -1780 -334 1720 633
5743F33k101Q92K088o02j985m6K112Q1k117j0K028M39j990q78K290Q38k059j084
$$ 633 -1468 -576 1512 910 -1075 -1121 991 1072 -1045 -1055 973 1412 -578 -1456 834 1672 -387 -1471
5761a471J870J161j667j519J596J475j474j659J423J844r61k037P59K104l62k342
$$ -1471 399 1560 -107 -1626 -30 1445 -29 -1688 -265 1579 618 -1419 -660 1444 1082 -1260
5777a260N3K524j02k591j13K383P09k427j037K887K66j972j039K157R94j798j185
$$ -1260 -1207 1317 1215 -1376 -1489 894 1603 -824 -1861 1026 1292 -680 -1719 438 1432 -366 -1551
5794a551J416J719j512j723J245J614p16j932N96K215p44j718J49K009j4k414
$$ -1551 -135 1584 72 -1651 -406 1208 492 -1440 -844 1371 627 -1091 -942 1067 1053 -1361
5810a361P5K319M6k043n36J907P84j636j031J773J498k253j119J546J412j108
$$ -1361 -1286 1033 1079 -964 -1500 407 1191 -445 -1476 297 1795 -458 -1577 -31 1381 273
5826B73j879J320J592q78j752P63J939n67k037K79K048l38k072M41J843L56k120
$$ 273 -1606 -286 1306 428 -1324 -561 1378 811 -1226 -947 1101 763 -1309 -868 975 1331 -789
5843g89o17J732J220k049j008J624J451j938j320J893J288j248j548J023J956
$$ -789 -1406 326 1546 -503 -1511 113 1564 -374 -1694 199 1487 239 -1309 -286 1670
5858A670j302j775R36J739k96k150L78J905J37k300j41K085L97j934p42K217O73
$$ 1670 368 -1407 -471 1268 972 -1178 -800 1105 1242 -1058 -1199 886 1283 -651 -1393 824 1497
5875A497j932j016J996J082j822j297J576J665j575j481J109J794j149j604N04
$$ 1497 -435 -1451 545 1627 -195 -1492 84 1749 174 -1307 -198 1596 447 -1157 -653
5890f53K060o52j606q7K350k01k464M48J795K52k126k07K194K62j978p77J864
$$ -653 1407 755 -851 -938 1412 1211 -1253 -805 990 1242 -884 -1091 1103 1365 -613 -1390 474
5907D74J025j781r60J497J283j372j638J340J192p52j972J336J592r92j249L01
$$ 474 1499 -282 -1242 255 1538 166 -1472 -132 1060 308 -1664 -328 1264 272 -977 -676
5923f76J900o03j757J96J802j31j523k69K106p3j437p77J760P35j554r96J464
$$ -676 1224 621 -1136 -940 862 731 -792 -1061 1045 972 -465 -1242 518 1253 -301 -1297 167
5940A67J038j218j451J405J100r75j096M22J529n47j664P02J760o57j659J17K044
$$ 167 1205 -13 -1464 -59 1041 66 -1030 -608 921 374 -1290 -588 1172 515 -1144 -1027 1017
5957A017p1j758p1J568L44j759k41J392M27j283n20J156R63j414j016J303J137
$$ 1017 946 -812 -883 685 1029 -730 -971 421 848 -435 -955 201 1164 -250 -1266 37 1174
5974A174j100j557J198J597j141j296P90J394n13j326K7J957l46j730R1J399L04
$$ 1174 74 -1483 -285 1312 171 -1125 -335 1059 546 -780 -753 1204 858 -872 -781 618 922
5991I22j468l3J256J92j305o34J643M93j239p67J001R43r37j224P55J716j149
$$ 922 -546 -579 677 869 -436 -1070 573 1066 -173 -940 61 1004 67 -1157 -402 1314 165
6008A65j415Q13J405l06j489J79J707j48j816K68J294J58j466j9J230L69j401
$$ 165 -1250 -437 968 662 -827 -648 1059 911 -905 -637 657 815 -651 -670 560 929 -472
6025d72k78J076Q68j271r36J329P95j236r23J179Q01p62j096R13J330r81j462
$$ -472 -750 326 1194 -77 -1013 316 1111 -125 -1048 131 932 170 -926 -13 1317 336 -1126
6042a126Q65J226n27j434O94J176n2j444j18J305J9j191m89J805N3j185m73J166
$$ -1126 -261 965 438 -996 -302 874 822 -622 -740 565 584 -607 -1096 709 762 -423 -896 270
6060B70O90j327q53J000J404j405q42R14J098o40j396R00R50n53j026J29J704
$$ 270 960 -367 -1220 -220 1184 -221 -1063 -149 949 309 -1087 -187 763 210 -816 -687 1017
6077A017l56j433J00J462l01j170j19J264K62j101n86J134P37j400n05J248P77
$$ 1017 661 -772 -672 790 489 -681 -800 464 726 -375 -961 173 910 -490 -995 253 1030
6094A030j303n68P67J063j181q08R23J226j136r17Q69Q97m73j048M12J109k73
$$ 1030 -273 -841 -74 989 -192 -1000 -77 1149 13 -904 -35 862 389 -659 -247 862 589
6111E89j248K11J490k97j295k33J488L51j712k39J455L52j273o54J359P11q56
$$ 589 -659 -448 1042 745 -550 -783 705 1056 -656 -895 560 912 -361 -1015 344 1055 199
6128A99r72P41J050p31j184Q06J088o51j118N48J450r32j459N34J798o36j437
$$ 199 -773 -32 1018 287 -897 -91 997 346 -772 -224 1226 294 -1165 -631 1167 531 -906
6145i06L18J410J69j724p6J210M78j450m02J474N52j134r57J322R91j310r94J002
$$ -906 -588 822 991 -733 -809 401 879 -571 -973 501 1053 -81 -1038 284 1275 -35 -1029 -27
6163b7J221j160j219J259J138p32j571P91J162n46j263O04J363j47j571j62J445
$$ -27 1194 34 -1185 74 1212 480 -1091 -300 862 316 -947 -343 1020 873 -698 -860 585
6180E85P5j377J06J196K37j228l10J281N66j403p33J296P76r64j380J111J368
$$ 585 660 -717 -611 585 822 -406 -716 565 1131 -272 -1005 291 1067 103 -1277 -166 1202
6197A202r27j312O08J057k31j432M82J553m98j478M2J620J36j784m2J609M74j810
$$ 1202 275 -1037 -429 628 397 -1035 -553 1000 502 -976 -934 686 822 -962 -1004 605 1079 -731
6215g31l55J758K85j419n12J095R54j138j040J276J009j198r59N80J641p18j832
$$ -731 -1086 672 957 -462 -974 121 1075 -63 -1103 173 1182 -16 -975 -395 1246 528 -1304
6232a304R23J483p61r30k55J788k45j526K0J711q9j752j51J664K02j345m79J345
$$ -1304 -381 1102 341 -589 -844 944 699 -827 -807 904 815 -937 -1088 576 778 -567 -1046 299
6250B99P02j467o79J325J420j669j422J145J639j094j450J152J155p55j281K53
$$ 299 1001 -466 -1145 180 1600 -69 -1491 -346 1293 199 -1251 -99 1056 301 -980 -727
6266g27J496Pj766L25J695lj684l43J563L77j728k44J680O28j438r10J451R00
$$ -727 769 776 -990 -665 1030 1027 -657 -1000 563 940 -788 -1032 648 1276 -162 -1072 379 1279
6284A279j308j322J554J161r77j646Q65J530p28k002Q34J839n48j474K81J525
$$ 1279 -29 -1351 203 1364 387 -1259 -394 1136 408 -1594 -760 1079 531 -943 -662 863
6300H63j6j803l11K110J35j559p20J859N38j368j208J673J109j633q60J329J428
$$ 863 847 -956 -1267 843 978 -581 -1301 558 1096 -272 -1480 193 1302 -331 -1191 138 1566
6317A566j153j790J013J410q87j824J169J992j100j426K90J912m53j603o9K050
$$ 1566 413 -1377 -364 1046 159 -1665 -496 1496 396 -1030 -740 1172 719 -884 -953 1097
6333A097P1j810n05J716N98j497q97J476J270j863r80J659P76r48j640J201J587
$$ 1097 1168 -642 -1147 569 1167 -330 -1227 249 1519 -344 -1324 335 1111 163 -1477 -276 1311
6350A311p07j733Q55J467m77j874N39J755j59k169Q2J965lj943j03J784N39j788
$$ 1311 604 -1129 -274 1193 716 -1158 -619 1136 977 -1192 -1110 855 852 -1091 -1194 590 1129 -659
6368f59o01J924Q78j979j043J546J455j263j507P91J641q47j630P35J661n54j903
$$ -659 -1260 664 1542 -437 -1480 66 1521 258 -1249 -458 1183 336 -1294 -559 1102 548 -1355
6385a355J024J503m53j599p7K098j58j841k74J954N23k023p35J953Q21j605q43
$$ -1355 -331 1172 719 -880 -957 1141 983 -858 -1132 822 1345 -678 -1413 540 1361 -244 -1087
6402a087J391J218j440j537J435J358j051j601Q42J765m63j917P36J505k66k071
$$ -1087 304 1522 82 -1455 -20 1338 287 -1314 -472 1293 830 -1087 -351 1154 888 -1183
6418a183L26K225m44j678k50J741M98j888o44J933P77j608q06J340Q49j147j418
$$ -1183 -857 1368 924 -754 -1004 737 1235 -653 -1297 636 1413 -195 -1001 339 1188 41 -1377
6435a377J182J445q61j964J282J420o40j692L44K029l57j854K28K016m6k014k4
$$ -1377 -195 1250 389 -1575 -293 1127 487 -1205 -861 1168 811 -1043 -815 1201 1155 -859 -883
6452h83J734L80k097o09K220N64j531r73J446R42j269j016N72J875j195j636J130
$$ -883 851 1231 -866 -1475 745 1309 -222 -1195 251 1193 -76 -1092 -520 1355 160 -1476 -346
6469c46J631r02j456L56J966m69j884L31J798o0j931J14J630L19j922l18J480
$$ -346 1285 383 -1073 -717 1249 780 -1104 -773 1025 965 -966 -852 778 1097 -825 -1143 337
6486C37O83j488o77J516R69j723o93R80J157j064j067Q27J519p18j770R49J224
$$ 337 1020 -468 -1145 371 1340 -383 -1076 -96 1061 -3 -1070 -243 1276 558 -1212 -263 961
6503I61l36j950N34J954m03j601M3J550K81j693n52J797P50j796o18J178J098
$$ 961 625 -1325 -791 1163 760 -841 -798 752 1033 -660 -1212 585 1335 -461 -1079 99 1197
6520A197j327r29R28J254j063j299R29J317n18j515Q21J124k93j569K15J507j08
$$ 1197 -130 -1059 -131 1123 60 -1239 -310 1007 489 -1026 -205 919 626 -943 -728 779 671
6537F71j760N67J323J71j630m48J616M99j447n59J483M67j105p95P52J338j091
$$ 671 -1089 -522 801 972 -658 -1106 510 1009 -438 -997 486 953 -152 -947 -195 1143 52
6554E2j038J008J149r69j387J023J259p75j301O34J032n9j582L24J474m2j612
$$ 52 -986 22 1171 202 -1185 -162 1097 322 -979 -345 687 628 -954 -630 844 802 -810
6571h10P4J353K61j420m98J191P95j491k47Q72R27j140r48Q02J426j006j381J054
$$ -810 -736 617 878 -542 -1040 151 946 -545 -792 80 1007 -133 -1081 -279 1147 141 -1240 -186
6589a86J104r12r75O26J338m42j562N09J304J03j828K01J284r7q56p95J297O68
$$ -186 918 6 -969 -343 995 553 -1009 -500 804 907 -921 -720 564 467 -389 -1184 113 781
6607G81j264l88J309O04j264r99J092J017q77q28Q89P12l43j349P07J005k56j535
$$ 781 -483 -871 438 1042 -222 -1221 -129 888 11 -817 72 784 441 -908 -201 804 548 -987
6625i87M73J348j08j470J83J440l96j109j94J382L53j373l44R70O51j046m99R16
$$ -987 -514 834 726 -744 -561 879 483 -626 -820 562 915 -458 -802 168 819 -227 -726 190
6643A90P96j248o23Q89R31r48j063R11J028o19j244P46J142k93j458K69J425k05
$$ 190 986 -262 -885 4 935 -13 -1076 -165 863 244 -1000 -254 888 595 -863 -594 831 626
6661F26j129o1J334o4j176o1Q34O20j269m09J285L01r15p20J014O67p16r93Q08
$$ 626 -503 -564 770 706 -470 -531 303 923 -346 -755 530 831 -84 -804 210 877 161 -832 -24
6680b4P54o63p97L07J173n19j021K10J210k31r03P5J069k86q46m0Q16K42p09n27
$$ -24 730 67 -730 -423 750 231 -790 -580 630 399 -504 -429 640 354 -492 -532 284 526 -183 -710
6700g10J213J29q19m50P75M74p38o06M04J279q46p39O13P09n57j100M70J516q95
$$ -710 503 632 -187 -637 138 612 -126 -732 -328 951 105 -634 -21 688 131 -969 -499 1017 122
6719A22q52M23Q22n8r06k23J145L00j589J68Q95N28j260m35J398M63j256m26Q15
$$ 122 -730 -307 515 457 -449 -672 473 773 -816 -648 247 775 -485 -920 478 941 -315 -741 74
6738G4R16j149o20Q00Q26q25r34N58J175q27m95J14J112k48j293K43J355j83j063
$$ 74 990 -159 -779 21 847 22 -912 -354 821 -6 -501 -387 725 477 -816 -573 782 599 -464
6757d64M1R66M17j374l49J205K90j126p19J390P02j102n76O58M49m32n02O49P90
$$ -464 -423 543 960 -414 -763 442 732 -394 -1113 277 979 -123 -699 -41 408 -24 -526 123 913
6776I13o16q08M1J216m66j087O09J080k77j353L05J090o0j053o2O98M72j332M3
$$ 913 297 -511 -470 746 280 -807 -198 882 605 -748 -443 647 587 -466 -528 170 642 -690 -647
6795f47R67L49r03m99J209J92n42j003P30J239r35r47P79R29n13j211P08R20l83
$$ -647 320 669 -234 -733 476 668 126 -877 -147 1092 157 -790 -11 918 405 -806 -98 822 439
6814D39j208K95R31j6j103J62Q61L42j072m90J070L91q72m75P71K40l20p20O40
$$ 439 -769 -474 457 441 -662 -500 361 703 -369 -859 211 602 -270 -745 26 266 -54 -774 -134
6833a34P13o04p81R28R25r69j031Q98P35k39j072N0J252k26j163J60J346l99j369
$$ -134 579 -25 -806 122 1047 78 -953 -55 680 441 -631 -581 671 445 -718 -558 788 389 -980
6852i80L84J336k98n34m52J085n1r98n71J157P37r71r66J052R88q92p16K01J361
$$ -980 -596 740 442 -92 -544 541 490 -508 -1079 78 815 -156 -1122 -70 918 26 -690 -489 872
6871H72o42j113M76R38k97p54R1J147q2j397mJ110K47r28o37J401L36r11l16M41
$$ 872 230 -883 -407 531 234 -520 -429 718 636 -761 -765 345 592 -336 -973 428 764 -147 -463 -22
6891b2J014j013r41J058Q10p87j133J125P60n74r24N04P71k14j158J60J422l30
$$ -22 992 -21 -962 96 906 119 -1014 111 871 297 -627 -123 648 434 -724 -564 858 528
6909E28r77j01J362j07j272j05J091M79j362l40R84Q16j336o82J077Q26j004o22
$$ 528 -449 -550 812 705 -567 -672 419 898 -464 -804 180 996 -340 -1022 55 881 -123 -745
6927g45P46Q89o06r20L77R24k36j061K87J029m43r26M01J239k18j499J33R54N25
$$ -745 1 890 284 -636 -259 665 429 -632 -345 684 241 -685 -284 955 737 -762 -629 325 850
6946H50j195n31J150N07j081n65J175M22p93n24P88M64p88p75M81J197n11j118
$$ 850 -345 -876 274 781 -300 -865 310 732 -61 -585 203 667 -121 -896 -415 782 271 -847
6964h47M13J104k07j075P7J366j40j799K89J311p7j006j76J051M68r91m87P62
$$ -847 -434 670 463 -612 -535 831 691 -1108 -819 492 415 -591 -767 284 752 -239 -726 36
6982C6P66j176n26Q05P76m11q84K58J177l06j411N96J104n48j018M16R79J10j386
$$ 36 802 -374 -900 -95 681 270 -614 -356 821 515 -896 -300 804 256 -762 -346 633 743 -643
7001f43m2J385L15j199o72J218L82j132n58Q36J105j339k46N57R50r54j030J133
$$ -643 -685 700 1015 -184 -856 362 744 -388 -946 -110 995 -344 -590 -33 917 -37 -1067 66
7019F6O50n36r36M67J355p23j188N56Q51j22q87K8R57Q0j049k92J163M55j049
$$ 66 716 180 -756 -289 1066 343 -845 -289 562 440 -447 -419 538 618 -431 -723 440 895 -154
7038a54o13J054N83j012r22J106R67j155n67M02J223o51q46L05J010n17r72L79
$$ -154 -767 287 870 -142 -1064 42 1009 -146 -713 -311 912 261 -585 -280 730 213 -759 -380
7056c80J036j00j305K59J361k33j204j40J069M77r95l07N32O40q86k89N50O38
$$ -380 656 556 -749 -490 871 638 -566 -706 363 840 -155 -462 70 710 -176 -465 85 723
7074G23j001m45M32J131o99q62O60O73j67r95J59J259q44o69J51P56L24r65j87
$$ 723 -278 -723 -291 840 141 -721 -61 612 445 -550 -391 868 24 -645 -494 262 586 -379 -566
7093e66R57M20j284j99J208J26j221j54O81O85r02l69N84P99o96j048O91O75m37
$$ -566 391 811 -473 -672 536 662 -559 -713 -32 653 -249 -618 -34 765 69 -979 -288 387 -50
7112e0m87L79R19l32j092J78J074j12j105J59J150j75q66L9L80P06j081n30J228
$$ -50 -537 -158 761 429 -663 -485 589 477 -628 -469 681 506 -360 -321 59 765 -316 -846 382
7131C82O1n30m95P47M64m34o06L02P32m27r34M89O44k13j004L14J224k61q88k50
$$ 382 443 -87 -582 165 629 195 -411 -109 623 196 -738 -249 395 182 -822 -508 716 455 -433 -683
7151f83J299j6r54j81R53j46p21J6R40K96q13n39R04N31p73r10O55P87m93r15
$$ -683 616 600 -354 -535 418 272 -449 -433 507 803 -10 -549 355 886 113 -797 -142 645 152 -763
7171g63L80P76j9r26M14O33o7p99J9Q56J80j017J13R71k89o61k58O03N28q11m72
$$ -763 -383 393 374 -552 -138 495 428 -371 -352 504 684 -333 -220 751 462 -199 -457 146 674 -137 -609
7192f09Q22M61j062m35P51N14j89q90M75N32Lp55O0P49J14r60m0P27J0j152K40
$$ -609 213 674 -388 -823 -72 442 253 -637 -162 370 373 -382 -322 427 541 -419 -459 268 278 -874 -634
7213f34Q32K42p71j11M43K44n82k63Q28J63o58m53Q96M13o42n80N61Q09n21r88
$$ -634 198 440 -331 -442 1 245 -337 -600 228 391 -267 -720 176 589 -53 -633 -72 737 216 -772
7233g72P40N01k68o06N7Q66m74o44K47P19J11p66mN41K37o17m21P70L37q50k91
$$ -772 -32 469 201 -405 -348 518 44 -600 -353 366 477 -289 -293 248 485 -132 -553 217 554 -296 -587
7254e87O80L90p30m1K04O66n86q07N12P74j55o65J78K23K53o49l10J078k4q72
$$ -587 93 483 -247 -288 -84 582 -4 -811 -299 475 320 -345 -167 56 309 -340 -650 428 404 -468
7274d68Q0N73K45o27k66Q03J84o28l45P53J10j89r83O15P13o39m73M33O60k69
$$ -468 -388 185 430 -197 -463 340 524 -104 -449 304 414 225 -758 -143 570 -69 -542 -109 551 282
7294B82o46J81O22k73l50J83N41n0p60j46Q42J30r32Q6P26K6p33j46K68N54o22
$$ 282 -364 -183 439 166 -184 -1 540 490 -270 -416 426 556 -376 -290 436 462 -271 -417 -149 405 -217
7315b17k56O73L54p10l59M64M23n59l00Q0P26l65n37N28O22r4r42J56N81Np34
$$ -217 -473 200 554 -156 -515 -51 372 -187 -487 -407 319 -46 -583 -55 567 473 -469 -313 268 273 -461
7336d61J16N96L09q41J0O25J60q47k63P10L10k98m76N25J38l89m43L74M55n78
$$ -461 -345 251 560 -281 -271 354 514 -333 -596 114 424 126 -350 175 313 -76 -519 -145 310 -268
7356b68l80O07N44m35q19L94N32K06q56RN53J27o93j48J103j19o28j82R42n0m58
$$ -268 -648 -41 503 68 -751 -357 175 381 -475 -466 87 214 -479 -627 476 357 -271 -453 489 439 -19
7377a9m60P21M19p14l01M21O10n88n89M01M63n02m79M77L64J7n84j02N83J08l65
$$ -19 -479 242 661 -53 -354 67 677 89 -500 -99 364 -138 -617 -140 224 241 -343 -445 138 246 -119
7398a19j98N56m9n26K7O89L03r20J60N15o5n41j99O45Q2k03m28J98Q02p79n59
$$ -119 -317 239 190 -336 -309 380 683 -237 -77 438 373 -168 -367 278 360 157 -271 -73 729 -50 -609
7419f09P48N27k32j059N17N49k33o30K71O48k94o61j50J029J3n01l02N36N61r66
$$ -609 139 666 434 -625 -108 441 208 -422 -151 497 203 -458 -608 421 434 -67 -369 167 728 -238
7439b38j85N06P75r93l41M38M42n00m55K83J028n89o63L18O55m64n69r8J232l03
$$ -238 -423 83 858 -135 -476 -38 404 -96 -551 -268 760 171 -492 -174 481 17 -552 -650 582 279
7459B79r09K76P54l09m86j36Q09M90j236j11P96J01o52k83N12O99p85j22K12Q34
$$ 279 -630 -354 400 91 -395 -531 278 768 -468 -579 217 318 -334 -617 -105 594 -191 -313 -101 733
7479G33m54q69N60N57m68m50J08N03j82o37K20O52j99m01j61N79L98p39l17Q61
$$ 733 279 -590 -30 527 59 -391 -283 220 38 -599 -379 273 74 -327 -488 91 489 -250 -567 294
7499B94J09o80j83Q87o5k49o10O83Q85j204n93O27O75n54m92L22N27m2j001J53
$$ 294 403 -277 -460 427 362 113 -497 186 1071 -133 -726 -99 576 22 -470 -148 379 337 -664 -511
7519e11R14K07r79j25P38K69r31J63O48L5o02n17Q71N44j052p2K02Q07m19o53
$$ -511 403 610 -369 -494 244 513 -418 -255 393 428 -174 -691 180 724 -328 -400 -198 609 190 -463
7539d63L54Q73n36q73O50N36k10p44K13P07n4p03l74J278j02r66n1N78N03q74
$$ -463 -109 764 228 -645 5 541 331 -413 -200 507 453 -250 -624 654 552 -414 -465 113 616 -258
7559b58l40Q19K17o58k42M77O81p24o04O00M71l77p87Q64K95j78r22N41M27k68
$$ -258 -598 221 438 -220 -462 15 696 -28 -632 -32 439 62 -725 139 434 256 -666 -125 302 34
7579C4m22K52O41k12q86K2P99K07o97j77O53K58o50o10O88P08p29l72L41L33j19
$$ 34 -388 -136 505 293 -593 -571 228 435 -262 -439 214 472 -178 -788 -100 608 -121 -493 -152 181 62
7600F2p30L92Q36l35q66L18O93o2j010K00J094j56q08k56Q16L59o37n87P89K78
$$ 62 -668 -276 560 225 -641 -323 370 308 -702 -502 592 436 -372 -628 188 547 -90 -677 112 390
7620C90m27n68P09P64r52m82O80L30l30p26L56Q73l16j133N00R51j73j212M90
$$ 390 -37 -605 104 868 -84 -566 114 444 114 -612 -256 617 301 -832 -332 619 446 -766 -276
7639b76O97N3r58m2P31K09r52P0N79K62l31p46P58O20p54n23R38K22j56j067O57
$$ -276 421 474 -484 -526 205 414 -538 -468 111 373 42 -704 54 674 -80 -603 335 557 401 -666 -9
7660iN32k20o57J69R35k52j152J17R01J02j125J01R53R0p18j95L92O71q11m18
$$ -9 523 303 -354 -185 750 498 -654 -537 364 466 -659 -558 395 485 -233 -428 -36 635 -176 -594
7680e94P88J82k92q33P38L98k26m97o6Q30l72o38L15Q32l4p87k98Q00M57r39j29
$$ -594 194 376 84 -749 -11 387 161 -336 -402 428 56 -582 -267 565 531 -256 -554 246 703 -236 -365
7701c65N87N76j096j08O28R5m29n08N04O10n22o05O48M93p12n08P01N24k49q13
$$ -365 222 798 -298 -406 222 317 -112 -620 -116 494 -28 -633 15 508 -204 -712 -11 513 264 -549
7721e49L64Q16m98p42L60Q87n66m61k1O68M08j133l7N51M88o65n14R06K00o89
$$ -549 -185 631 133 -609 -249 638 72 -389 -410 258 666 -467 -504 47 535 -130 -644 262 462 -227
7741b27m60O31Q45n59m54K4J004o25p45M67P56k65q55L34N80qp05QL11L88n79
$$ -227 -687 -56 789 230 -224 -200 804 179 -566 -99 657 392 -463 -129 451 443 -262 -254 57 445 -134
7762a34m35Q63K08p92j23O01L47n99l29O18L31m60o28N40N38k98p15J90R43l06
$$ -134 -569 294 502 -290 -413 188 535 -64 -393 225 556 96 -532 8 546 248 -467 -277 666 360
7782C60m48j95O81J15j006l1P98l5l74n05P01N25q86j63O78M05p81l36O46L85
$$ 360 -88 -283 398 513 -493 -524 274 239 -135 -640 61 586 -300 -463 215 620 -161 -497 149 534
7802E34m50m81K23O22n94j16K48O61n23n81N64M08L2p31l62Q32m4m32k4M50J81
$$ 534 84 -397 -174 448 -146 -262 -14 647 124 -457 107 515 547 -184 -546 286 242 -190 -214 236 417
7823D17q16QN09K73n02j47M06L51m88n10N40K21J14j043M38Q75k60p14k4Q20k99
$$ 417 -399 -391 118 391 -111 -258 148 499 11 -499 41 262 376 -667 -229 646 386 -328 -352 468 169
7844A69n24J57N88J57p55l63O63J05n82L5O94K13o48n16P23L81q17l33O35M91
$$ 169 -355 -198 390 547 -208 -571 92 197 -385 -350 344 557 -91 -607 116 497 -320 -653 -18 473
7864D73l90o14M34O72o46m85N10M30o6q92M49M61j15m81j69O64o2o33l6R56J04
$$ 473 83 -531 -97 575 -71 -556 -46 384 318 -574 -125 336 221 -260 -429 235 173 -460 -496 460 564
7885E64q21j36L27M17o37k51O92K01n93o7L64L32p02q5J72O71J20p67R3O13l76
$$ 564 -257 -393 -66 351 -286 -537 155 356 -237 -304 60 392 -310 -395 -223 448 568 -199 -106 507 131
7906A31m73J46M96J46q19m2N89L93n57m38P15J71n50k97O00K89o98k55L63P99
$$ 131 -342 -196 300 446 -373 -415 174 567 10 -428 287 458 -92 -389 211 500 -198 -453 -90 709
7926G09n68q88N67P42m31m69K41N11k66m69K31M62J53r86J43L30L08n70l3Q37
$$ 709 141 -747 -180 562 131 -338 -97 414 148 -321 -90 372 525 -461 -318 12 320 -250 -283 554
7946E54p9p04k72O60Mk10m16O33L3j06n82N13O36p73m98M22N95j4p34J13O17l35
$$ 554 475 -229 -501 159 163 -47 -463 170 203 97 -485 28 664 -109 -607 -185 410 396 -338 -225 392 57
7968E7l19j17M62J9o2l27M74K50o11m44O59M71p76j84P16M5k06n13K40O16l33
$$ 57 -262 -379 83 102 40 -287 187 437 -174 -618 41 512 -264 -448 268 313 107 -406 -166 450 117
7989A17o03K48N75l10l21J77M89k27l20k27O46R4o16j50O85J64o02M2K35K64o51
$$ 117 -486 -238 337 27 -294 -117 372 145 -175 -402 244 338 -278 -428 257 421 -181 -139 96 360 -291
8010b91j51P79J47q32Q0L81L60j01o35L22J09n7k16K2P41m44n95o9J052l49n74
$$ -291 -442 337 484 -348 -268 113 473 372 -263 59 168 111 -105 -83 658 214 -381 -450 602 253 -321
8031c21K04L70J67o10l4O29L4m92j75O23j42m71k00Q06K54n06m88K39N49l34k99
$$ -321 -117 253 420 -190 -224 405 439 -53 -228 395 253 -218 -418 388 642 136 -352 -113 436 102 -197
8052a97J13P51o64m36K67L86N3o15p8P88J25q36K24N44j80n76O3M79k3o84j10
$$ -197 -84 667 3 -433 -166 220 273 -342 -420 368 493 -343 -119 425 245 -331 -268 211 188 -496 -606
8073f06J013J65p15k03L64N31o37l46M19L48l92k82K36O80n84m14L19L94l6p97
$$ -606 407 572 -143 -346 18 549 -88 -434 -15 333 -59 -341 -105 575 -9 -423 -104 290 254 -543
8093e43K10N27l36m70p9N91M44m43m96O59K71m66m78Q43N25r40n14Q50K46n13
$$ -543 -333 194 -142 -612 -691 -100 344 -99 -595 64 335 -131 -609 234 759 -181 -695 155 401 -112
8113a12m23N18O00p98l80O19J95J42q64N59K48n6n82r1O97K02p02j16N79K33o96
$$ -112 -535 -17 583 -215 -595 24 219 361 -503 56 304 248 -334 -425 272 474 -228 -344 235 468 -228
8134b28n16R46J43n47m34O19N38p14l28M30N54n96l09K90Q53l12q79Q57Mk32o63
$$ -228 -744 202 345 -202 -636 -17 521 -193 -521 -91 463 -133 -442 -152 701 389 -490 367 371 139 -524
8155e24J27O20J6n04Q1N92L61r55m17Q10J3q3n07L69O28m09p79M05O42m58m64
$$ -524 -397 223 239 -265 -184 408 769 -186 -603 207 220 137 -370 -1 627 218 -561 -156 486 28 -436
8176d36K92O37k44r77N40N02J07r04l8Q72p6r28J52Q27J80
$$ -436 -144 493 249 -728 -188 314 421 -483 -521 351 275 -653 -501 326 506
8191E06
$$ Imaginary data points
##PAGE= N=2
##DATA TABLE= (X++(I..I)), XYDATA
0@%%%qJ6j6J6k4M0m8N6p2Q8j04J28j60J92k24K64l18L74m29M97n79O67p60Q66
$$ 0 0 0 0 -8 8 -8 8 -16 24 -24 32 -40 48 -56 72 -88 104 -120 144 -174 200 -229 268 -311 356 -404 462
27D62r90J123j264J428j612J804k011K248k513K792l097L443l821M228m678N183
$$ 462 -528 595 -669 759 -853 951 -1060 1188 -1325 1467 -1630 1813 -2008 2220 -2458 2725
43B725n741O354p043P829q720R730j0905J2296j3953J5970j8503K1793k6240L2629
$$ 2725 -3016 3338 -3705 4124 -4596 5134 -5771 6525 -7428 8542 -9961 11832 -14408 18221
57A8221m2663O0755j03328L72105K63495r05912k4665P01045R4399q16202j51514
$$ 18221 -24442 36313 -67015 305090 568585 -337327 -361992 339053 433452 -382750 -534264
68e34264P70425L16142p10161l24951O49019L85390o59634m65063N74087N39197
$$ -534264 236161 552303 -157858 -482809 166210 551600 -108034 -573097 990 540187
78E40187n04647n51605M44332N93712m10177o49224L15867O83939k28303o68877
$$ 540187 35540 -516065 -71733 521979 111802 -537422 -221555 462384 234081 -434796
88d34796J76816O95801j15346p21988R048P02171O1672o73575j10095O80398J91027
$$ -434796 -257980 437821 322475 -399513 -390465 311706 373378 -300197 -410292 270106 461133
99D61133o58392k78354O01306L20807n66841l68666N44336M45012m77291m90454
$$ 461133 -197259 -475613 125693 446500 -120341 -489007 55329 500341 23050 -467404
109d67404M13667N14588l69219n57068L09345N92886k35342o08977J69289O17354
$$ -467404 -53737 460851 91632 -465436 -156091 436795 201453 -407524 -238235 379119
119C79119j06190o25057M4491O34637L1309o23143j01570N94758J44790n93504
$$ 379119 272929 -352128 -307637 327000 358309 -264834 -366404 228354 373144 -220360
129b20360k15464N67719K86004n15692l21131M88383L67720m59596m31603L94911
$$ -220360 -435824 131895 417899 -97793 -418924 69459 437179 -22417 -454020 -59109
139e9109M61221l42516m84081L03165N23293k39421n45475J74845N52756j19374
$$ -59109 402112 59596 -424485 -121320 401973 162552 -382923 -208078 344678 225304
149B25304n58192O5368N68189K085n59132o2048N41576J12593n27396j66495N08164
$$ 225304 -332888 -267520 300669 302754 -256378 -318426 223150 335743 -191653 -358148 150016
160A50016K24343m72715k68177M38660L07716m04623l50349L61887L84742l14746
$$ 150016 374359 -98356 -366533 72127 379843 -24780 -375129 -13242 371500 56754
170E6754m10411K69296M32655k23882m53564J73057M66823j20892m70778P4953
$$ 56754 -353657 -84361 348294 124412 -329152 -156095 310728 189836 -280942 -205989
180b05989M76182k5612m77000k6695M68026P3689m56710j20149M41517J65411
$$ -205989 270193 244581 -232419 -259114 208912 282601 -174109 -294258 147259 312670
190C12670m21610k09591L96237K49302l64810k84847L32989L16377k98008l46918
$$ 312670 -108940 -318531 77706 327008 -37802 -322649 10340 326717 28709 -318209
200c18209K55873L67929k16090l85288J77155M03252j31224m10144Q8501M14851
$$ -318209 -62336 305593 89503 -295785 -118630 284622 153398 -256746 -168245 246606
210B46606m6814m16442L688M14261L9374m05628q0785L93333J18728l78352j57327
$$ 246606 199792 -216650 -212962 201299 240673 -164955 -245740 147593 266321 -112031 -269358
221b69358L59351J94032l33719k25601L05983K51905k79566k81876K43802L00880
$$ -269358 89993 284025 -49694 -275295 30688 282593 3027 -278849 -35047 265833
231B65833k10561l17836J77364L32399j40807l42840J02795L46656o8454l50385
$$ 265833 55272 -262564 -85200 247199 106392 -236448 -133653 213003 144549 -205836
241b05836L2107L49970L512l44346l8246L36548P1262l25622j03360L11473J34820
$$ -205836 -173729 176241 179753 -164593 -202839 133709 204971 -120651 -224011 87462 222282
252B22282k93678j62000K74176J88057k52239k12186K27925K32629k01129k50234
$$ 222282 -71396 -233396 40780 228837 -23402 -235588 -7663 224966 23837 -226397
262b26397J74435K65479j45331k76513J16807K86084q6289k90921N6763K94292
$$ -226397 -51962 213517 68186 -208327 -91520 194564 108275 -182646 -125883 168409
272A68409k6741k93938k863K90740L1547k84214n8720K76518Q6028k65570j10866
$$ 168409 141668 -152270 -155133 135607 167154 -117060 -175780 100738 186766 -78804 -189670
283a89670K52453J33700k37184j56952K19246J75663k01385j95119J80061K10492
$$ -189670 62783 196483 -40701 -197653 21593 197256 -4129 -199248 -19187 191305
293A91305j57819k23927J34722K35586j10623k44751Q4999K49622o0499k53727
$$ 191305 33486 -190441 -55719 179867 69244 -175507 -90508 159114 98615 -155112
303a55112L5203K55121r116k52155j3508K48501L8316k42031o0566K33981Q2993
$$ -155112 -119909 135212 126096 -126059 -139567 108934 147250 -94781 -155347 78634 161627
314A61627k23250j02654K12014J23205j97663j40625J82540J56794j64472j70884
$$ 161627 -61623 -164277 47737 170942 -26721 -167346 15194 171988 7516 -163368
324a63368J47223J83902j27132j93743J07586K01633q7145k07624O6385K12229
$$ -163368 -16145 167757 40625 -153118 -45532 156101 68956 -138668 -72283 139946
334A39946m6299k14023K6101K14344n863k13913j3722K11339L3314k07654n3311
$$ 139946 93647 -120376 -94275 120069 114206 -99707 -113429 97910 131224 -76430 -129741
345a29741K01189P1480j94746r0541J84362J07874j73416j25351J60477J39495
$$ -129741 71448 142928 -51818 -142359 42003 149877 -23539 -148890 11587 151082
355A51082j46569j53308J29750J64263j13600j74375R5236J82007p8453j88587
$$ 151082 4513 -148795 -19045 145218 31618 -142757 -47521 134486 56033 -132554
365a32554O0338J92794m2019j95226K3757J97310o010j96966j3071J95063L0784
$$ -132554 -72216 120578 78559 -116667 -92910 104400 98390 -98576 -111647 83416 114200
$$ [...]
8191c17
##END NTUPLES=NMR FID
##END=
