##TITLE=1H_ABBC1310
 CDCl3
 8 sc, 
 17.10.2022
##JCAMPDX= 6.0         $$ Bruker NMR JCAMP-DX V2.0
##DATA TYPE= NMR FID
##DATA CLASS= NTUPLES
##ORIGIN= UXNMR, Bruker Analytische Messtechnik GmbH
##OWNER= root
$$ XWIN-NMR		Version 3.5
$$ Mon Oct 17 14:11:37 2022 Russian Standard Time (UT+4h)  she@DPX200
##.OBSERVE FREQUENCY= 200.1313499994
##.OBSERVE NUCLEUS= ^1H
##.DELAY= (6, 6)
##.ACQUISITION MODE= SIMULTANEOUS
##.ACQUISITION SCHEME= undefined
##.AVERAGES= 8
##.DIGITISER RES= 18
##SPECTROMETER/DATA SYSTEM= spect
##.PULSE SEQUENCE= zg30
##.SOLVENT NAME= CDCl3
##.SHIFT REFERENCE= (INTERNAL, CDCl3, 0, 15.7039)
##AUDIT TRAIL= $$ (NUMBER, WHEN, WHO, WHERE, WHAT)
$$ ##TITLE= Audit trail, XWIN-NMR		Version 3.5
$$ ##JCAMPDX= 5.01
$$ ##ORIGIN= Bruker BioSpin GmbH
$$ ##OWNER= she
$$ F:/spectra/data/she/nmr/H-F/1/audita.txt
$$ ##AUDIT TRAIL=  $$ (NUMBER, WHEN, WHO, WHERE, WHAT)
(   1,<2022-10-17 14:10:42.93 +0400>,<she>,<DPX200>,
      <created by zg, POWCHK disabled, PULCHK disabled
       configuration hash MD5:
       00 E9 B6 7A A2 85 ED C7 34 08 36 98 17 FE 4E 26
       data hash MD5: 16K
       6B 5B 59 92 54 8D 37 12 78 7C 9B 7C 5A 03 4B 22>)
$$ ##END=
$$ 
$$ hash MD5
$$ AD 20 F1 C3 27 17 9F 80 1B 47 D0 43 19 BF 7B 13
##$RELAX= 
##$RELAX= 
##$RELAX= 
##$RELAX= 
##$RELAX= 
##$RELAX= 
$$ Bruker specific parameters
$$ --------------------------
##$DU= <F:/spectra>
##$EXPNO= 1
##$NAME= <H-F>
##$PROCNO= 1
##$TYPE= <nmr>
##$USER= <she>
##$AMP= (0..31)
100 100 100 100 100 100 100 100 100 100 100 100 100 100 100 100 100 100 
100 100 100 100 100 100 100 100 100 100 100 100 100 100 
##$AQSEQ= 0
##$AQ_mod= 1
##$AUNM= <au_zg>
##$AUTOPOS= <>
##$BF1= 200.13
##$BF2= 200.13
##$BF3= 200.13
##$BF4= 200.13
##$BF5= 200.13
##$BF6= 200.13
##$BF7= 200.13
##$BF8= 200.13
##$BYTORDA= 1
##$CFDGTYP= 0
##$CFRGTYP= 5
##$CHEMSTR= <none>
##$CNST= (0..31)
1 1 145 1 1 1 1 1 1 1 1 1 1 1 1 1 1 1 1 1 1 1 1 1 1 1 1 1 1 1 1 1 
##$CPDPRG= <>
##$CPDPRG1= <>
##$CPDPRG2= <>
##$CPDPRG3= <>
##$CPDPRG4= <mlev>
##$CPDPRG5= <mlev>
##$CPDPRG6= <mlev>
##$CPDPRG7= <mlev>
##$CPDPRG8= <mlev>
##$CPDPRGB= <>
##$CPDPRGT= <>
##$D= (0..31)
0 1.2 0 0 0 0 0 0 0 0.06 0 0.03 0 0 0 0 0.0002 0 0 0 0 0 0 0 0 0 0 0 0 
0 0 0 
##$DATE= 1666001442
##$DBL= (0..7)
120 120 120 120 120 120 120 120 
##$DBP= (0..7)
150 150 150 150 150 150 150 150 
##$DBP07= 0
##$DBPNAM0= <>
##$DBPNAM1= <>
##$DBPNAM2= <>
##$DBPNAM3= <>
##$DBPNAM4= <>
##$DBPNAM5= <>
##$DBPNAM6= <>
##$DBPNAM7= <>
##$DBPOAL= (0..7)
0.5 0.5 0.5 0.5 0.5 0.5 0.5 0.5 
##$DBPOFFS= (0..7)
0 0 0 0 0 0 0 0 
##$DE= 6
##$DECBNUC= <off>
##$DECIM= 32
##$DECNUC= <off>
##$DECSTAT= 4
##$DIGMOD= 1
##$DIGTYP= 9
##$DL= (0..7)
0 120 120 120 120 120 120 120 
##$DP= (0..7)
150 150 150 150 150 150 150 150 
##$DP07= 0
##$DPNAME0= <>
##$DPNAME1= <>
##$DPNAME2= <>
##$DPNAME3= <>
##$DPNAME4= <>
##$DPNAME5= <>
##$DPNAME6= <>
##$DPNAME7= <>
##$DPOAL= (0..7)
0.5 0.5 0.5 0.5 0.5 0.5 0.5 0.5 
##$DPOFFS= (0..7)
0 0 0 0 0 0 0 0 
##$DQDMODE= 0
##$DR= 18
##$DS= 0
##$DSLIST= <SSSSSSSSSSSSSSS>
$$ [...]
##$SUBNAM2= <"">
##$SUBNAM3= <"">
##$SUBNAM4= <"">
##$SUBNAM5= <"">
##$SUBNAM6= <"">
##$SUBNAM7= <"">
##$SUBNAM8= <"">
##$SUBNAM9= <"">
##$SW= 18.0517283424941
##$SWIBOX= (0..15)
0 0 2 0 0 0 0 0 0 0 0 0 0 0 0 0 
##$SW_h= 3612.71676300578
##$TD= 16384
##$TD0= 1
##$TE= 0
##$TE2= 300
##$TE3= 300
##$TEG= 300
##$TL= (0..7)
0 120 120 120 120 120 120 120 
##$TP= (0..7)
150 150 150 150 150 150 150 150 
##$TP07= 0
##$TPNAME0= <>
##$TPNAME1= <>
##$TPNAME2= <>
##$TPNAME3= <>
##$TPNAME4= <>
##$TPNAME5= <>
##$TPNAME6= <>
##$TPNAME7= <>
##$TPOAL= (0..7)
0.5 0.5 0.5 0.5 0.5 0.5 0.5 0.5 
##$TPOFFS= (0..7)
0 0 0 0 0 0 0 0 
##$TUNHIN= 0
##$TUNHOUT= 0
##$TUNXOUT= 0
##$USERA1= <user>
##$USERA2= <user>
##$USERA3= <user>
##$USERA4= <user>
##$USERA5= <user>
##$V9= 5
##$VALIST= <valist>
##$VCLIST= <CCCCCCCCCCCCCCC>
##$VD= 0
##$VDLIST= <DDDDDDDDDDDDDDD>
##$VPLIST= <PPPPPPPPPPPPPPP>
##$VTLIST= <TTTTTTTTTTTTTTT>
##$WBST= 1024
##$WBSW= 4
##$XGAIN= (0..3)
0 0 0 0 
##$XL= 0
##$YL= 0
##$YMAX_a= 266348
##$YMIN_a= -266046
##$ZGOPTNS= <>
##$ZL1= 120
##$ZL2= 120
##$ZL3= 120
##$ZL4= 120
##$ABSF1= 10
##$ABSF2= 0
##$ABSG= 5
##$ABSL= 3
##$ALPHA= 0
##$AQORDER= 0
##$ASSFAC= 0
##$ASSFACI= 0
##$ASSFACX= 0
##$ASSWID= 0
##$AUNMP= <proc_1d>
##$AZFE= 0.1
##$AZFW= 0.1
##$BCFW= 1
##$BC_mod= 2
##$BYTORDP= 1
##$COROFFS= 0
##$CY= 11.3945322036743
##$DATMOD= 1
##$DC= 2
##$DFILT= <>
##$DTYPP= 0
##$F1P= 2.36226072786647
##$F2P= -0.459571619588291
##$FCOR= 0.5
##$FTSIZE= 0
##$FT_mod= 4
##$GAMMA= 1
##$GB= 0.15
##$INTBC= 1
##$INTSCL= 1
##$ISEN= 128
##$LB= 0.24
##$LEV0= 0
##$LPBIN= 0
##$MAXI= 10000
##$MC2= 0
##$MEAN= 0
##$ME_mod= 0
##$MI= 1.114404
##$NCOEF= 0
##$NC_proc= 0
##$NLEV= 6
##$NOISF1= 3.799351
##$NOISF2= 2.8
##$NSP= 1
##$NTH_PI= 0
##$NZP= 0
##$OFFSET= 15.70392
##$PC= 1
##$PHC0= -18037.02
##$PHC1= 15.80069
##$PH_mod= 1
##$PKNL= yes
##$PPARMOD= 0
##$PSCAL= 0
##$PSIGN= 0
##$REVERSE= no
##$SF= 200.130013532006
##$SI= 16384
##$SIGF1= 3
##$SIGF2= 2
##$SINO= 400
##$SIOLD= 16384
##$SREGLST= <1H.CDCl3>
##$SSB= 0
##$STSI= 0
##$STSR= 0
##$SW_p= 3612.71676300578
##$SYMM= 0
##$S_DEV= 0
##$TDeff= 0
##$TDoff= 0
##$TI= <>
##$TILT= no
##$TM1= 0
##$TM2= 0
##$TOPLEV= 0
##$USERP1= <user>
##$USERP2= <user>
##$USERP3= <user>
##$USERP4= <user>
##$USERP5= <user>
##$WDW= 1
##$XDIM= 8192
##$YMAX_p= 0
##$YMIN_p= 0
$$ End of Bruker specific parameters
$$ ---------------------------------
##NTUPLES= NMR FID
##VAR_NAME=  TIME,          FID/REAL,        FID/IMAG
##SYMBOL=    X,             R,               I
##VAR_TYPE=  INDEPENDENT,   DEPENDENT,       DEPENDENT
##VAR_FORM=  AFFN,          ASDF,            ASDF
##VAR_DIM=   8192,          8192,            8192
##UNITS=     SECONDS,       ARBITRARY UNITS, ARBITRARY UNITS
##FACTOR=    0.0002768,     1,               1
##FIRST=     0,             0,               0
##LAST=      2.2672688,     0,               0
##MIN=       0,             -266046,         0
##MAX=       2.2672688,     266348,          0
$$ Real data points
##PAGE= N=1
##DATA TABLE= (X++(R..R)), XYDATA
0 0 0 0 0 0 0 0 0 0 0 0 0 8 -8 8 -8 16 -16 24 -24 32 -33 41 -52 63 -72 81 -96 112 -128 147 -169 193 -222
33 -222 248 -280 318 -358 400 -448 498 -557 618 -686 759 -839 929 -1026 1130 -1246 1374
50 1374 -1512 1666 -1835 2025 -2237 2476 -2747 3057 -3415 3837 -4344 4958 -5726 6722 -8063
65 -8063 9981 -12950 18214 -30294 118370 -86930 -200530 216744 4686 -263098 72732
76 72732 225276 -161902 -78834 225177 -27483 -224872 124556 129069 -191879 -17539 221975
87 221975 -88397 -178023 151947 67512 -212721 38489 207756 -113721 -127828 181333 18365
98 18365 -210323 67198 166146 -140195 -67335 196958 -15280 -179007 102835 110823 -168210
109 -168210 -22224 191032 -59596 -148788 133793 66884 -186984 12574 175875 -94770
119 -94770 -117523 160144 35331 -184077 46454 145398 -131543 -80967 173221 -5106 -165234
130 -165234 92651 114648 -153548 -32513 176574 -49441 -141691 126142 75079 -166764
140 -166764 8199 161605 -85262 -108821 147106 38994 -162811 40553 129762 -118228
150 -118228 -76395 151485 -3369 -146164 80080 100816 -137557 -33664 151983 -46355
160 -46355 -128072 112839 69962 -147874 7179 145108 -77742 -98664 133548 35087 -144505
171 -144505 42305 120317 -105267 -63686 139633 -5771 -131502 76557 90340 -126002
181 -126002 -27617 135710 -47355 -115985 103358 60210 -134694 7541 127365 -75256
191 -75256 -89858 118948 28931 -128637 39879 106916 -92406 -54521 122331 -6302 -113197
202 -113197 68738 79314 -106102 -20886 118116 -39036 -96840 89162 51896 -114777 4789
213 4789 107847 -63625 -78162 99786 24295 -112790 30868 92623 -81031 -51832 105436
224 105436 -4895 -103181 58568 73819 -94393 -21099 108187 -33001 -89196 81365 50994
235 50994 -104258 5626 103290 -56796 -72315 94364 23889 -105821 30301 87527 -76526
246 -76526 -49146 98441 -6325 -98223 54772 66548 -91467 -21077 99562 -32870 -83295
257 -83295 75496 44037 -96745 6494 93559 -52447 -62324 87093 19993 -93381 31201
268 31201 78657 -68631 -39667 90146 -6687 -85675 50799 58307 -81721 -17613 88135
279 88135 -30585 -74522 65932 36973 -87588 4843 81774 -48364 -57275 76010 16535
290 16535 -84109 27255 70281 -61724 -35956 82021 -4750 -76144 47148 55003 -72475
301 -72475 -15548 81549 -24685 -66770 59916 35999 -78391 3082 74058 -42626 -53923
312 -53923 67023 15854 -77456 21438 63234 -56453 -35702 72867 -3000 -71387 40015
323 40015 50810 -65475 -15722 75448 -20425 -61852 54612 36014 -70146 3239 70802
334 70802 -37135 -49014 63224 16177 -71300 20822 59834 -52930 -33788 68453 -4154
345 -4154 -68501 37001 46310 -63556 -15739 69470 -21556 -58904 50853 31790 -66888 3372
357 3372 64872 -35466 -43787 60144 14904 -64127 21511 54560 -47750 -27431 63849 -3793
369 -3793 -60329 35209 41292 -56956 -13316 61543 -19890 -52853 43624 27140 -59227 1186
381 1186 55132 -31790 -39846 50878 12235 -56789 17420 47920 -41338 -25165 56293 -1462
393 -1462 -53054 30969 39581 -48748 -12458 56828 -14741 -47637 39514 27815 -52939 -1038
405 -1038 51825 -27477 -39175 45336 13248 -53460 12834 44330 -38338 -26765 50609 -719
417 -719 -51375 26545 37585 -45237 -13885 52871 -11990 -44261 36459 27495 -47789 -264 49293
430 49293 -23153 -34694 42502 13229 -48184 12090 41683 -34106 -24083 45450 -841 -47217
442 -47217 22939 33137 -41890 -13842 46464 -12172 -41831 31913 24311 -43765 -1391 44282
454 44282 -20971 -31759 38723 12891 -43207 11713 39266 -30102 -21803 42977 1396 -42476
466 -42476 20998 32218 -36956 -13860 42647 -9220 -39041 27190 22645 -39916 -4137 39527
478 39527 -18224 -31039 32662 12307 -39985 8174 35763 -25606 -21161 38131 3213 -37836
490 -37836 18138 30877 -31301 -12865 39036 -5154 -34571 23558 23014 -33775 -4997 35934
502 35934 -14148 -28882 27515 12104 -35897 4314 32083 -23099 -22452 32804 3396 -36365
514 -36365 14075 28803 -28456 -14478 36199 -2673 -33032 20867 24060 -30662 -6134 35143
526 35143 -9930 -27336 25430 14485 -32503 2772 30808 -19012 -21237 29142 4560 -34019
538 -34019 10607 26228 -26226 -15125 31528 -2774 -31426 16747 20930 -27799 -6808 30448
550 30448 -8496 -24571 22183 14069 -27083 2390 27476 -14786 -18088 25307 6032 -27404
562 -27404 8795 23707 -20344 -13761 26630 -659 -27350 12272 19168 -23536 -9081 26133
574 26133 -5576 -24490 16324 14487 -24771 -2122 25312 -10641 -19508 21725 9704 -24928
586 -24928 4824 24445 -15234 -15313 24952 4334 -25346 9548 21716 -19506 -10902 25123 -2231
599 -2231 -24277 13745 15490 -23329 -5017 24245 -9500 -20867 18995 9498 -24538 2164 22712
612 22712 -14180 -15571 22024 4697 -22997 8387 20122 -16509 -9581 22773 -607 -20271
624 -20271 12801 15111 -18741 -4158 21220 -6964 -17739 15276 9023 -21236 282 19373
636 19373 -11936 -15263 17693 4714 -21207 4419 17387 -13788 -10986 18732 1503 -19019
648 -19019 8642 15147 -14633 -6043 19492 -2265 -16153 12353 11765 -16767 -1822 18603 -7071
661 -7071 -15142 14549 7235 -19215 1026 17271 -11299 -13141 15942 3521 -19096 4650 15049
674 15049 -13370 -8974 17052 -116 -16560 9223 12452 -14496 -3867 17862 -3884 -14457
686 -14457 12836 9545 -16549 -23 17693 -7967 -13406 15157 6072 -18309 2305 15846 -11656
699 -11656 -11501 15936 1909 -17844 5891 13030 -13698 -7176 16685 -1847 -15749 10422 11090
712 11090 -15171 -2100 17693 -5350 -13616 13623 8348 -15936 1422 17053 -8600 -11451 15059
725 15059 4190 -16585 4168 13700 -12050 -8699 14592 -523 -15841 7245 10364 -13893 -4418
738 -4418 14955 -4055 -14014 10346 8943 -14158 -1151 15880 -5786 -11640 13174 6861 -14601
751 -14601 1965 15050 -8176 -9486 13688 3478 -14982 4592 12585 -11553 -7544 14423 -1155
764 -1155 -15688 7572 10448 -14489 -4991 15501 -4025 -14809 10630 9127 -15284 -1267 16375
777 16375 -6579 -11923 13602 6055 -15246 3543 15143 -9915 -9014 15926 1239 -16422 7159
790 7159 13115 -14065 -6440 16732 -2806 -16285 9958 10054 -16225 -3059 16226 -6452 -14141
803 -14141 12434 6810 -15939 1620 15422 -9459 -10375 15407 3206 -16197 6435 14483 -12371
816 -12371 -7268 17541 -563 -16324 8947 12138 -14571 -4860 16572 -4454 -15015 10634 8047
829 8047 -16196 -1105 15291 -8138 -12460 13505 4543 -16628 3310 14754 -11475 -9340 16923
842 16923 1621 -16798 7818 14232 -13761 -6001 18146 -2004 -15658 10934 10941 -15877 -2593
855 -2593 17135 -7120 -13898 13376 5902 -18188 1943 15993 -12025 -11506 16720 2002 -18932
868 -18932 6585 14698 -14252 -7751 18314 -1306 -16860 10882 12444 -15813 -3005 18614 -5613
881 -5613 -14250 14605 7827 -17817 2045 17140 -10816 -12056 16843 2779 -19216 5674 15222
894 15222 -14785 -9206 17637 -1195 -18134 9489 12158 -16161 -4204 18157 -5207 -15041 13951
907 13951 8815 -17586 1650 18275 -9513 -12414 17159 4582 -18604 5215 16757 -13309
919 -13309 -9794 18318 273 -18659 8598 13189 -16210 -5756 18172 -4864 -16853 12734
931 12734 9373 -18256 -376 18547 -9044 -14026 16792 6084 -19287 4590 17826 -12360
943 -12360 -10249 19334 1846 -18817 8833 14856 -15857 -6188 19143 -3708 -17441 12505 10237
956 10237 -18966 -1432 18456 -9316 -15175 16238 5733 -20320 3643 17815 -12958 -11132
968 -11132 18784 1672 -19298 9055 15722 -16096 -6143 20188 -3451 -17185 13643 11407 -18687
981 -18687 -1054 19701 -8989 -15161 16944 6340 -20525 3098 17921 -13267 -12227 18602
993 18602 1412 -20200 8046 15093 -16501 -7228 19832 -3413 -18274 13540 12343 -18886 -1579
1006 -1579 20685 -7548 -15296 16865 7781 -19832 3168 18988 -12257 -11990 18485 2012 -19868
1019 -19868 7726 15248 -16414 -7836 19332 -3547 -18734 12098 11454 -19226 -2725 20140 -7938
1032 -7938 -16193 16191 8369 -20241 2750 19329 -11614 -12191 18749 3672 -19733 7509 16338
1045 16338 -15550 -8008 20136 -2502 -18812 12408 12637 -19430 -3709 20373 -7784 -17530 15560
1058 15560 8373 -20895 1367 19470 -11942 -13307 18605 3647 -19971 7159 16934 -15577
1070 -15577 -8213 20738 -1739 -18985 12814 13510 -18715 -3073 21139 -7219 -16781 15853 8573
1083 8573 -20462 1702 18897 -12135 -13432 17884 2927 -20144 6740 16372 -15710 -8317 19972
1096 19972 -2059 -19002 11647 13620 -18409 -3739 20696 -5877 -16730 15510 9599 -19366
1108 -19366 1198 19743 -10920 -13509 18108 4201 -20263 6128 16587 -15316 -9428 19558
1120 19558 -1486 -20208 10729 13682 -18726 -4859 20745 -6115 -17763 14857 10369 -19605
1132 -19605 688 19644 -10353 -13291 18257 4703 -19754 6545 17044 -14687 -8771 20102
1144 20102 -1330 -19653 11230 13769 -18499 -4710 20293 -6163 -18288 13963 9758 -19514
1156 -19514 -580 18651 -10024 -13839 17019 4950 -19415 5344 16800 -13708 -8931 19803
1168 19803 -125 -18925 10781 14781 -17240 -5458 20177 -4873 -17396 13632 10622 -18748
1180 -18748 -1077 18668 -9362 -14423 15984 5041 -19548 4347 16425 -13600 -9919 18521
1192 18521 -268 -19321 10174 14600 -16788 -5534 20175 -4220 -17252 13939 11021 -18631
1204 -18631 -744 19192 -8574 -13863 16313 5509 -19237 4364 16698 -13671 -10396 18265
1216 18265 103 -19693 9366 14097 -17416 -6449 19422 -4023 -17641 12832 11058 -18098
1228 -18098 -1186 18999 -7740 -13829 16049 6282 -18626 4397 17277 -12738 -9849 18647
1240 18647 788 -19138 8890 14719 -16555 -7139 19280 -3751 -17927 12086 10597 -18536
1252 -18536 -1918 18521 -8327 -14441 15185 5670 -18534 4234 16974 -12459 -10122 18585
1264 18585 1163 -18058 8918 14660 -15884 -6225 19187 -2826 -17160 11955 10865 -17159
1276 -17159 -2107 17752 -7350 -14407 14106 5833 -17846 3205 15765 -12178 -10362 16762
1288 16762 1523 -18255 7631 14439 -15163 -6620 18818 -2173 -16695 11105 11530 -16280 -2124
1301 -2124 18319 -6672 -14026 14227 6831 -17581 2943 16331 -11835 -10917 16947 1576 -18686
1314 -18686 7351 14256 -15451 -6919 18508 -2385 -17352 10998 11277 -16677 -2137 17923 -6855
1327 -6855 -13873 14507 6736 -17032 3088 16462 -11158 -10181 17127 2229 -17773 7249 14269
1340 14269 -14893 -6769 17779 -2475 -17050 9907 10836 -16308 -3125 16843 -6546 -14091 13299
1353 13299 6798 -16847 2318 15966 -10503 -10388 16384 2354 -17173 6954 14304 -13684 -6669
1366 -6669 17588 -1465 -16312 10090 11311 -15641 -3050 16637 -6010 -14118 12776 6638 -16776
1379 -16776 1761 15289 -10432 -10695 15675 2176 -17291 5808 14068 -12931 -7083 17216 -1372
1392 -1372 -16061 9906 11209 -14961 -2989 16722 -5287 -13551 12640 7157 -16324 1475 15571
1405 15571 -9806 -10573 15022 2405 -17032 5486 13611 -12981 -7645 15974 -1389 -15987 9311
1418 9311 10929 -14954 -3141 16383 -5332 -12943 12754 7118 -16057 1619 15578 -9066 -9912
1431 -9912 15009 2846 -16025 5779 13713 -12642 -7062 15858 -1423 -15420 9015 10280 -14658
1444 -14658 -3365 15706 -5542 -13161 11554 6570 -15422 1150 14841 -8610 -10138 14256
1456 14256 3058 -15292 5243 13447 -11300 -7107 15264 -509 -14465 8535 10519 -13494
1468 -13494 -3213 15120 -4701 -13046 10893 6267 -14924 769 14362 -8638 -10541 13463
1480 13463 2778 -15461 4379 12856 -11364 -7207 14784 -303 -14231 7983 10281 -12713
1492 -12713 -3036 14900 -4272 -12221 11061 6543 -14539 967 14334 -8209 -10125 13155 3069
1505 3069 -14927 4186 12256 -10985 -7416 13994 -700 -13980 7632 9560 -12810 -3164 14531
1518 14531 -4322 -11888 10701 6919 -13810 879 13842 -7686 -9522 12873 3347 -13930 4326
1531 4326 12216 -10433 -6917 13764 -419 -13556 7055 9459 -12440 -3293 13906 -4298 -11962
1544 -11962 9811 6305 -13794 484 13323 -7479 -9550 12275 3242 -13630 3950 11852 -9621
1557 -9621 -6087 13408 -142 -12822 6841 9484 -11258 -2945 13077 -3653 -11207 9341 6306
1570 6306 -12621 19 12347 -7005 -9464 11284 3285 -13079 3187 11090 -8980 -6649 12268
1583 12268 130 -12180 6577 8970 -10717 -2989 12864 -3122 -10723 9665 6466 -12423 -247
1596 -247 12550 -6552 -9334 11134 3299 -13035 2884 10801 -8954 -6436 11815 -190 -12119
1609 -12119 6060 8434 -10523 -2764 12219 -3585 -10649 9123 6342 -11867 502 12140 -6015
1622 -6015 -8607 10800 3251 -11878 3023 10748 -8275 -5908 11142 197 -11472 5771 8005
1635 8005 -10174 -3221 11372 -3236 -10229 8081 5722 -11283 -171 11545 -5697 -8375 10102
1648 10102 3552 -11477 2657 10779 -7322 -6040 10938 607 -10704 5202 8335 -9258 -3153
1661 -3153 11318 -2449 -9818 7613 5701 -10900 -628 10779 -5597 -8754 9211 3208 -11452
1674 -11452 2463 9767 -7204 -6073 10286 652 -10434 4841 8011 -8868 -3002 10739 -2128
1687 -2128 -9076 7529 5854 -10071 -19 10394 -4803 -7950 8745 3223 -10563 1808 9128
1700 9128 -6810 -5746 9529 471 -10154 4315 7565 -8652 -3181 9929 -1967 -8929 6794
1713 6794 5548 -9677 -621 9979 -4283 -7647 8410 3666 -10062 1558 9379 -6148 -5869
1726 -5869 9138 1069 -9601 3899 7450 -8079 -3503 9518 -1924 -8764 6363 5414 -9532
1739 -9532 -1204 9457 -4150 -7704 7896 3758 -9422 1676 9010 -5589 -5683 8521 1513 -8771
1753 -8771 3718 7675 -7232 -3695 9262 -1096 -8341 5524 5256 -8611 -1508 8960 -3875
1766 -3875 -7403 7062 3441 -9582 759 8382 -5562 -5918 7998 1579 -9027 3103 7659
1779 7659 -6802 -3600 8702 -833 -7871 5520 5648 -7999 -1217 8778 -3140 -7126 6982 3659
1793 3659 -8514 919 8026 -5002 -5810 7683 1464 -8729 2719 6727 -6574 -3552 8200
1806 8200 -852 -7817 4840 5403 -7685 -1392 8369 -2755 -6641 6345 3778 -8133 772 8155
1820 8155 -4447 -5257 7075 1874 -7968 2195 6448 -5763 -3467 7467 -600 -7698 3940 5263
1834 5263 -7177 -1621 7841 -2582 -6738 5831 3777 -7575 158 7601 -3857 -5315 7038
1847 7038 2086 -7557 2331 6862 -5131 -3692 7705 111 -6975 4021 5309 -6650 -2184 7558
1861 7558 -2213 -6768 5085 3648 -7510 -175 7146 -3595 -5436 6236 1953 -7359 1798 6445
1875 6445 -4932 -3942 6852 583 -6662 3504 5238 -5983 -1881 7230 -1579 -6367 4675 3891
1889 3891 -6967 -403 6851 -3418 -5620 5768 2190 -6982 1429 6009 -4649 -4083 6213 358
1903 358 -6567 3033 4945 -5748 -2121 6597 -871 -5672 4505 3902 -6059 -471 6759 -2644 -5048
1918 -5048 5376 2483 -6529 1188 5836 -4186 -3892 5825 589 -6686 2223 4825 -5321 -2563
1932 -2563 6272 -873 -5695 3766 3873 -6142 -788 6308 -2413 -4732 5407 2597 -6126 1012 5807
1947 5807 -3274 -3908 5798 966 -5975 2197 4928 -4805 -2496 5865 -987 -5632 3377 3830 -5841
1962 -5841 -989 6068 -2345 -5135 4555 2211 -5951 311 5659 -3015 -3775 5382 1428 -5903 1823
1977 1823 4991 -4284 -2368 5695 -408 -5387 3442 3689 -4803 -1008 5707 -2009 -5043 4062 2475
1992 2475 -5635 -28 5445 -2996 -3940 4893 1361 -5440 1460 4480 -3680 -2674 5068 139 -4919
2007 -4919 2647 3791 -4420 -1387 5470 -1450 -4575 3866 2865 -5113 -83 5325 -2629 -4008 4558
2022 4558 1330 -5453 1000 4542 -3578 -2825 4557 105 -5109 2361 3792 -4474 -1371 5079 -1072
2037 -1072 -4404 3559 2886 -4932 -234 5216 -2105 -3861 4154 1920 -4742 988 4666 -3060 -2789
2052 -2789 4640 459 -4982 1806 3594 -4127 -1675 4583 -1092 -4500 2920 2704 -4529 -548 4707
2067 4707 -1834 -3532 3702 1959 -4743 646 4575 -2742 -2748 4577 931 -4440 1726 3909 -3469 -1965
2083 -1965 4328 -479 -4415 2553 2716 -4162 -1040 4320 -1871 -3940 3097 1851 -4280 -13 4348
2098 4348 -2289 -3254 3645 1100 -4379 1400 3634 -3170 -2069 4138 98 -3961 2257 3130 -3767
2113 -3767 -1302 4481 -1139 -3858 2794 2165 -4019 -247 3911 -1964 -3190 3207 1114 -4099 648
2128 648 3464 -2708 -1995 3773 234 -4034 1955 3390 -3497 -1213 4292 -752 -3703 2927 2586 -3834
2144 -3834 -75 4173 -1564 -3053 3248 1242 -4347 702 3647 -2810 -2483 3315 267 -3976 1455
2159 1455 2974 -3541 -1536 3823 -503 -3769 2310 2498 -3610 -716 4096 -1462 -2928 3185 1930
2174 1930 -3607 564 3932 -2069 -2069 3712 815 -3962 1096 2884 -3155 -2011 3636 -279 -3870 1797
2190 1797 2350 -3396 -941 3825 -1081 -3274 2605 1832 -3371 345 3648 -1874 -2620 3106 1075 -3510
2206 -3510 1120 3506 -2592 -1854 3425 3 -3483 1748 2679 -3226 -1128 3570 -1181 -3276 2159
2221 2159 1967 -3518 -443 3513 -1752 -2733 3187 933 -3690 799 3398 -2069 -2035 3433 291 -3343
2237 -3343 1581 2975 -2935 -1194 3657 -500 -3228 2278 2034 -3627 -718 3747 -1160 -3052 3034
2252 3034 1442 -3906 294 3394 -2202 -2230 3127 703 -3506 979 2927 -2514 -1356 3538 -251
2267 -251 -3439 2330 2546 -3143 -340 3597 -908 -3147 2849 1707 -3524 118 3035 -1785 -2564 2764
2283 2764 637 -3467 751 2958 -2375 -1735 3290 -145 -3364 1724 2463 -3025 -984 3827 -895
2298 -895 -3222 2503 1775 -3300 28 3769 -1509 -2794 3143 1209 -3330 870 3022 -2338 -2153 3110
2314 3110 60 -3509 1685 2500 -3299 -1228 3465 -790 -3216 2132 2215 -3334 -299 3404 -1240 -2510
2330 -2510 2886 1530 -3071 464 3271 -2163 -1949 3320 299 -3343 1389 2659 -2908 -1074 3501
2345 3501 -360 -3452 1970 2095 -3283 -565 3401 -1377 -3015 2474 1604 -3419 27 2928 -1936
2360 -1936 -1812 3347 503 -3118 1511 2730 -2516 -1301 3551 -122 -3299 2026 2574 -3237 -749
2375 -749 3622 -1069 -3063 2458 1673 -3395 139 3066 -1813 -2340 3107 347 -3320 1215 2569 -2499
2391 -2499 -1565 3643 -357 -3163 2011 2526 -2937 -643 3615 -818 -2788 2471 1711 -3130 32 3317
2407 3317 -1434 -2397 2688 685 -3430 1002 3016 -2795 -1725 3259 -114 -3229 1655 2630 -3399
2422 -3399 -827 3479 -806 -3039 2308 1685 -3073 94 3246 -1334 -2265 3058 904 -3183 871
2437 871 3151 -2511 -1929 3325 -26 -3556 1530 2577 -3118 -1354 3139 -480 -3244 2310 1940 -3180
2453 -3180 -406 3394 -1321 -2360 2561 1312 -2908 992 3073 -2272 -1807 3371 256 -3456 1631
2468 1631 2567 -2949 -1291 3350 -494 -3408 1958 2132 -3126 -483 3231 -1300 -2561 2288 1000
2483 1000 -3391 789 2914 -2425 -1707 3267 346 -3214 1385 2780 -2616 -1383 3412 -409 -2807
2498 -2807 1995 2415 -3086 -615 3226 -979 -2561 2514 1253 -3227 661 2947 -2193 -2086 2946
2513 2946 185 -3472 1016 2790 -2565 -1515 3428 -157 -3283 2036 2081 -2771 -560 2926 -1241
2528 -1241 -2727 2596 1121 -2992 464 3007 -1919 -2188 2943 296 -3470 1106 2655 -2609 -1462
2543 -1462 3302 -297 -3129 1708 2012 -2795 -619 3111 -944 -2541 2318 1348 -3288 424 3222
2558 3222 -1988 -1927 3195 713 -3318 1130 2840 -2404 -1334 3169 -234 -3186 1773 2045 -2769 -661
2574 -661 2673 -885 -2742 2250 1444 -3566 258 2976 -1809 -2191 2839 764 -3180 1049 2927 -2157
2590 -2157 -1417 3143 75 -3178 1623 2432 -2719 -762 3092 -834 -2705 2395 1573 -3171 -156 2861
2606 2861 -1627 -2340 2681 719 -3207 938 2910 -2528 -1634 3089 26 -2865 1509 2503 -2588 -741
2622 -741 3137 -768 -2507 2308 1843 -3138 205 3147 -1368 -2188 2600 791 -3220 725 2764 -2285
2638 -2285 -1614 2986 133 -3070 1147 2366 -2534 -1221 3050 -829 -2600 2250 1655 -2870 -309
2653 -309 3201 -1253 -2176 2726 1143 -3360 813 2744 -2057 -1564 3036 310 -2940 1391 2187 -2654
2669 -2654 -1039 3136 -776 -2974 2207 1642 -2983 -224 3096 -1266 -2340 2741 1020 -3180 815
2684 815 2892 -1666 -1417 2927 313 -2921 1581 2585 -2477 -657 3042 -627 -2687 1990 1473 -2915
2700 -2915 -162 2915 -1506 -2678 2509 937 -3031 483 2626 -2020 -1723 2933 -3 -2789 1196
2715 1196 2122 -2256 -1019 3118 -455 -2799 2091 1823 -2689 -151 2782 -1111 -2228 2675 1316
2730 1316 -3070 337 2387 -1690 -1711 2582 57 -2969 946 1982 -2200 -1056 2727 -459 -2628
2745 -2628 1753 1723 -2741 -78 3048 -1142 -2368 2514 1262 -2890 375 2656 -1859 -1776 2796 488
2761 488 -2837 1252 2198 -2326 -991 2901 -344 -2758 1675 1656 -2530 -333 2711 -1198 -2310 2367
2777 2367 969 -3110 306 2634 -1621 -1628 2660 410 -2595 1064 2331 -2081 -973 2906 -378 -2575
2793 -2575 1932 1793 -2544 -453 2715 -1118 -2128 2421 983 -2966 267 2618 -1510 -1677 2346
2808 2346 250 -2771 1013 2113 -1974 -1232 2876 -378 -2302 1620 1899 -2755 -408 2723 -1069
2823 -1069 -2155 2329 1000 -2634 327 2570 -1711 -1550 2543 586 -2677 913 2047 -2003 -1331
2838 -1331 2553 -593 -2571 1844 1701 -2712 -388 2847 -1028 -2393 2104 1269 -2672 75 2478
2853 2478 -1293 -1360 2307 529 -2389 960 2192 -2203 -885 2466 -261 -2759 1741 1539 -2522 -543
2869 -543 2562 -962 -2093 1983 1031 -2563 286 2126 -1452 -1681 2415 591 -2216 883 2066 -2034
2885 -2034 -1013 2452 -94 -2494 1483 1920 -2219 -586 2721 -973 -2362 1625 1235 -2420 -59
2900 -59 2390 -1520 -1935 2003 541 -2497 730 1898 -1509 -1107 2540 -359 -2288 1347 1655 -2158
2916 -2158 -609 2615 -737 -2070 1837 1608 -2331 68 2420 -1249 -1841 2202 662 -2465 602
2931 602 2114 -2030 -1069 2450 -364 -2362 1412 1597 -2425 -236 2511 -866 -2367 1875 974 -2384
2947 -2384 228 2113 -1274 -1496 2076 603 -2306 563 1783 -1718 -855 2275 -92 -2191 1300
2962 1300 1415 -2103 -698 2546 -852 -1949 1808 1126 -2174 -4 2309 -1262 -1599 2103 694 -2282
2978 -2282 957 1899 -1831 -969 2253 147 -2488 1255 1666 -2003 -733 2562 -380 -1995 1779 1094
2994 1094 -2307 -106 2003 -1415 -1701 1792 551 -2189 601 1659 -1621 -997 2265 -117 -2074
3009 -2074 1075 1542 -1967 -540 2069 -677 -2058 1539 1194 -2257 -120 2191 -924 -1627 1710 481
3025 481 -2144 699 2047 -1547 -1075 2076 -53 -2101 1143 1317 -1919 -619 2110 -552 -1899 1358
3041 1358 1172 -1974 306 2172 -951 -1494 1785 737 -2232 443 1800 -1387 -1108 1829 219 -1849
3057 -1849 713 1400 -1702 -634 2164 -484 -1919 1636 911 -2221 -170 2034 -870 -1723 1635 572
3073 572 -1844 568 1521 -1161 -741 1878 -8 -1856 1063 1600 -1880 -540 1924 -511 -1900 1409
3089 1409 960 -2276 -80 1671 -993 -1577 1680 506 -1793 296 1659 -1356 -1205 2006 9 -2070
3105 -2070 721 1343 -1598 -724 2123 -151 -1803 1428 1124 -1671 -44 1794 -823 -1150 1569 618
3121 618 -1960 311 1841 -1390 -1195 1694 -122 -1793 788 1353 -1670 -791 1661 -516 -1475 1337
3137 1337 1181 -1800 -503 1740 -742 -1248 1560 756 -1743 272 1743 -1378 -1061 1619 243 -1621
3153 -1621 668 1436 -1634 -727 1878 -359 -1764 1307 1122 -1738 -245 1628 -555 -1657 1578 733
3169 733 -1724 285 1862 -1015 -894 1659 335 -1706 517 1305 -1274 -962 1756 -441 -1516 985
3185 985 1067 -1684 -128 1747 -801 -1337 1166 537 -1675 135 1627 -962 -1074 1765 329 -1536
3201 -1536 353 1436 -1429 -616 1709 28 -1504 1014 836 -1439 -254 1736 -605 -1211 1347 780
3217 780 -1519 181 1380 -798 -1259 1436 286 -1452 583 1152 -1280 -934 1461 -88 -1413 944
3233 944 1087 -1572 -387 1760 -722 -1040 1347 531 -1388 31 1646 -905 -1154 1471 414 -1560
3249 -1560 268 1295 -854 -571 1315 -322 -1626 553 973 -1368 -365 1621 -400 -1367 994 616
3265 616 -1457 88 1431 -976 -893 1184 412 -1316 374 1285 -1071 -543 1579 62 -1432 620
3281 620 1221 -1184 -206 1429 -573 -1145 972 911 -1347 -153 1458 -433 -1085 1355 500 -1348 286
3298 286 1351 -732 -861 1305 212 -1590 730 1179 -1222 -408 1373 -299 -1295 767 570 -1394
3314 -1394 -185 1213 -550 -1140 1275 507 -1491 43 1004 -851 -801 1366 84 -1473 354 1181
3330 1181 -1237 -396 1356 -333 -1004 912 610 -1434 -181 1494 -307 -1005 994 448 -1485 52
3346 52 1172 -991 -987 1169 154 -1419 292 1186 -1101 -464 1272 -250 -1272 955 799 -1342 144
3363 144 1142 -239 -837 1026 499 -1114 49 1257 -853 -843 1157 57 -1175 282 967 -586 -413
3380 -413 1204 0 -1235 839 988 -1172 -191 1461 -433 -1127 936 552 -1476 96 1147 -721
3396 -721 -574 1315 118 -1229 488 1154 -803 -563 1389 99 -1090 843 768 -1035 -72 1185 -273
3413 -273 -1134 904 359 -1083 40 1007 -267 -979 997 339 -1323 266 977 -1101 -553 1278 -85
3430 -85 -1369 456 866 -1029 -269 1075 -258 -792 715 505 -1264 -323 876 -547 -805 817 446
3447 446 -1320 372 878 -753 -730 796 7 -1497 542 1146 -900 -277 1240 -217 -1180 553 494
3464 494 -1179 -76 879 -604 -686 883 305 -1024 158 1060 -914 -673 1007 374 -1028 342 715
3481 715 -1195 -347 1220 -209 -1182 674 760 -1101 136 1208 -422 -930 822 625 -1204 179 1002
3498 1002 -633 -502 1182 105 -1051 63 890 -851 -544 945 -421 -1185 549 909 -894 -247
3514 -247 1016 -343 -919 723 514 -1254 9 1054 -514 -547 1029 506 -966 430 862 -707 -524
3531 -524 1111 91 -927 628 544 -1093 -367 996 -343 -1073 757 436 -903 -86 911 -691 -855
3548 -855 1028 25 -1264 82 755 -482 -519 1112 -68 -919 654 801 -801 -337 1148 -337 -549
3565 -549 534 747 -1021 -105 867 -375 -817 757 323 -1214 234 924 -783 -532 738 79 -947
3582 -947 391 779 -665 -381 928 -35 -769 734 761 -878 -158 1075 -639 -639 733 593 -979 49
3600 49 1074 -424 -755 816 141 -923 250 779 -838 -376 824 26 -829 789 569 -911 -327
3617 -327 1212 -372 -975 1031 677 -1188 226 925 -367 -592 781 289 -965 410 773 -764 -461
3634 -461 750 53 -785 502 907 -956 -80 950 -76 -896 745 724 -913 -179 885 -446 -498 711
3652 711 316 -1102 307 888 -535 -376 883 -3 -1141 790 751 -779 -169 921 -339 -888 698
3669 698 584 -703 -186 1026 -114 -613 653 152 -839 216 868 -456 -606 930 58 -829 344
3686 344 718 -824 -359 1048 2 -974 763 514 -682 -234 1159 -182 -846 932 351 -1060 22
3703 22 595 -532 -758 819 -44 -1035 270 910 -1032 -670 1170 -105 -1016 828 409 -906 -283 1132
3721 1132 -184 -850 635 530 -959 170 871 -376 -807 865 26 -1129 150 796 -603 -790 787
3738 787 -68 -950 549 810 -739 -114 925 -370 -850 856 283 -823 24 1062 -447 -654 1171
3755 1171 191 -846 350 833 -507 -433 913 -18 -952 429 515 -851 -309 767 -302 -796 657
3772 657 565 -926 -32 942 -626 -652 811 284 -1122 311 734 -583 -557 1151 71 -932 509 811
3790 811 -636 -465 833 -85 -919 445 680 -849 -302 718 -270 -860 390 81 -833 121 765 -723
3808 -723 -579 1093 6 -1156 547 560 -581 -459 932 -104 -1038 780 686 -728 -295 1091 -249
3825 -249 -853 705 352 -930 -111 810 -500 -490 915 80 -1119 5 781 -896 -373 816 -37 -1105
3843 -1105 558 683 -743 -117 1034 -340 -622 537 194 -944 175 927 -431 -828 1109 112 -1014
3860 -1014 -31 1008 -424 -253 794 51 -914 269 622 -824 -332 878 -137 -871 907 314 -888
3877 -888 -16 1153 -451 -439 1016 263 -913 326 997 -648 -700 850 -39 -1002 424 889 -663 -137
3895 -137 1054 -285 -1093 793 522 -956 -228 929 -554 -621 969 330 -923 77 810 -832 -733
3912 -733 859 83 -833 508 995 -497 -195 989 -425 -1012 748 838 -1101 -37 809 -475 -749
3929 -749 980 184 -1080 295 904 -779 -599 932 -143 -956 302 721 -951 -421 867 -94 -989
3946 -989 933 370 -542 4 1186 -365 -1052 661 424 -1132 -113 892 -431 -437 900 317 -1099
3963 -1099 437 665 -866 -369 864 86 -910 516 652 -832 20 1197 -250 -897 852 439 -819
3980 -819 139 887 -555 -459 681 -58 -735 476 674 -784 -237 917 -221 -1185 417 518 -951 37
3998 37 1044 -283 -728 575 560 -844 140 893 -531 -692 772 376 -904 272 886 -731 -447 775
4016 775 97 -826 743 615 -852 -295 918 22 -723 648 682 -954 -187 940 -661 -767 922 211
4034 211 -886 173 907 -672 -437 1040 -219 -962 630 751 -695 -301 953 -301 -798 780 755
4051 755 -917 -151 847 -567 -673 1100 270 -859 228 747 -905 -592 1083 -42 -1024 302 882
4068 882 -849 -196 1133 -66 -942 566 776 -817 -284 852 -452 -720 687 443 -686 56 744
4085 744 -796 -417 1085 49 -912 596 779 -648 -449 1042 -300 -1105 567 651 -931 -326 938
4102 938 -313 -832 720 438 -1086 -104 936 -400 -527 874 183 -976 388 762 -972 -454 1031
4119 1031 -334 -912 449 689 -918 -217 941 -704 -804 532 416 -1129 -70 887 -564 -1002 905
4136 905 173 -1106 461 806 -675 -204 1003 -85 -808 456 650 -1026 -169 1024 -613 -805 847
4153 847 568 -931 128 945 -743 -760 998 -60 -923 432 639 -805 -405 1141 15 -949 587
4170 587 816 -632 -332 1092 -172 -866 925 369 -1003 -29 1219 -500 -550 905 159 -1047 222
4187 222 656 -818 -554 935 30 -966 357 725 -767 -347 990 -229 -841 669 781 -989 81
4204 81 834 -412 -508 978 319 -1189 392 834 -645 -524 844 -154 -1008 464 692 -932 -237 1101
4222 1101 -274 -654 875 430 -733 95 986 -447 -899 849 233 -948 187 905 -822 -610 1011
4239 1011 101 -886 393 831 -611 -367 800 -450 -1041 552 343 -1075 -211 792 -489 -838 654
4256 654 190 -1127 528 916 -768 -692 906 99 -1001 265 681 -803 -164 1023 -74 -992 752
4273 752 335 -811 -45 1161 -620 -718 758 337 -1087 355 1075 -636 -585 720 238 -841 343
4290 343 627 -756 -274 944 -222 -1072 436 552 -517 -40 754 -333 -603 772 537 -775 23
4307 23 1050 -498 -518 994 6 -977 406 821 -421 -263 905 -176 -1050 774 322 -841 223
4324 223 859 -359 -686 568 36 -931 124 822 -321 -384 877 184 -955 264 932 -786 -264 1139
4342 1139 -62 -867 409 477 -1056 -114 947 -95 -757 545 257 -995 52 966 -652 -858 511
4359 511 1 -898 550 930 -565 -426 775 -94 -785 536 665 -668 -53 887 -116 -771 661 163
4377 163 -1030 34 1124 -339 -822 712 128 -770 262 697 -737 -218 665 -158 -967 648 765
4394 765 -903 -294 990 -409 -493 378 379 -791 17 852 -456 -639 854 72 -677 157 580 -807 -606
4413 -606 863 84 -1010 356 570 -848 -365 732 -90 -702 575 451 -501 -35 1110 -570 -824
4430 -824 829 193 -940 108 762 -692 -149 1005 116 -773 706 660 -671 -364 800 29 -804 449
4448 449 558 -773 -434 635 -408 -589 949 62 -929 138 662 -656 -498 1095 -3 -842 553
4465 553 700 -745 -123 1046 -33 -641 502 602 -527 143 807 -471 -479 827 259 -941 -105 1031
4483 1031 -453 -718 725 127 -834 366 745 -678 -330 864 -352 -747 485 697 -898 -200 883
4500 883 -152 -823 592 283 -905 152 635 -453 -631 750 -134 -1069 273 371 -551 -201 798 -72
4518 -72 -1043 593 453 -825 -163 1069 -504 -896 691 415 -679 -100 429 -507 -455 863 346 -796
4536 -796 206 421 -673 -364 783 32 -582 457 658 -535 -231 775 -182 -698 219 452 -605 -78
4554 -78 707 -533 -566 651 204 -790 293 653 -350 -232 1089 12 -590 429 495 -709 -279 845
4572 845 -3 -698 641 506 -918 -26 731 -377 -561 519 329 -707 217 775 -496 -499 779 -168
4590 -168 -692 515 492 -610 -112 1062 -317 -398 592 372 -551 -26 726 -255 -506 541 229 -708 138
4609 138 605 -426 -89 650 128 -596 449 711 -622 -133 758 13 -692 406 299 -667 -119 575 -42
4628 -42 -457 749 257 -584 213 565 -560 -564 836 -115 -676 27 640 -503 -142 691 -184 -338 436 575
4648 575 -547 -182 878 -534 -493 699 282 -797 33 689 -380 -426 947 -91 -543 391 424 -605
4666 -605 143 689 -241 -633 429 307 -618 -338 630 -261 -574 536 389 -590 66 832 -189 -434 780
4685 780 123 -762 233 406 -271 -354 834 -305 -289 463 483 -781 -190 549 -409 -542 396 213 -697 -122
4705 -122 624 -469 -521 501 -93 -746 -5 597 -366 -346 771 -102 -671 441 384 -245 -485 747 -152
4724 -152 -736 415 181 -635 72 786 -362 -494 644 -73 -766 248 590 -433 -271 572 -146 -490
4742 -490 246 388 -652 -167 489 -349 -456 500 360 -494 187 902 -239 -384 636 190 -836 173
4760 173 721 -400 -359 529 -99 -408 24 593 -613 -266 524 -457 -596 337 334 -633 -272 794 -225 -461
4780 -461 576 115 -691 -106 499 -267 -405 723 -79 -601 319 159 -790 -108 923 -237 -544 58 491
4799 491 -488 -80 802 -377 -543 169 200 -901 -112 233 -617 -304 658 119 -557 378 159 -499 -119 594
4819 594 86 -678 469 474 -534 58 478 -259 -604 439 425 -564 82 487 -269 -67 437 -70 -535 143
4839 143 476 -533 -426 770 -30 -519 215 745 -349 -208 725 -53 -277 261 289 -706 108 568 -292
4858 -292 -458 724 323 -492 137 275 -601 -361 642 173 -393 196 241 -593 -194 467 -306 -341 649 191
4878 191 -686 288 595 -435 -423 684 51 -717 45 757 -473 -472 662 105 -536 450 538 -758 -150 711
4898 711 34 -546 532 390 -511 117 511 -234 -482 562 214 -644 478 611 -541 -325 772 124
4916 124 -590 64 410 -545 -190 444 -229 -259 275 339 -239 130 433 -270 -513 436 224 -643 116 769 -392
4937 -392 -163 721 180 -600 290 597 -452 -186 786 21 -739 364 134 -172 -12 644 -283 -424 473
4956 473 223 -748 110 494 -84 -387 558 320 -578 218 280 -565 -215 486 161 -322 148 241 -470 -276 647
4977 647 -266 -320 538 371 -627 47 691 -481 -270 336 113 -483 243 330 -165 -213 445 29 -492 74 260
4998 260 -536 -280 756 -314 -316 456 441 -505 -235 412 -336 -407 352 -17 -479 32 481 -431 -214 500 150
5019 150 -826 205 472 -472 -192 547 -227 -455 689 268 -559 23 572 -238 -412 325 234 -536 176 315
5039 315 -292 -163 592 -105 -399 -17 187 -470 -167 694 -249 -646 287 348 -336 170 636 -476 -560 650
5059 650 -88 -443 -7 452 -291 -170 553 6 -537 228 514 -313 76 901 87 -467 414 454 -450 54
5079 54 449 -72 -466 652 101 -462 31 574 -292 -443 590 -73 -840 326 512 -470 78 639 -73
5098 -73 -413 329 332 -553 -247 796 -353 -438 440 356 -309 -22 889 -157 -230 551 198 -534 239 360 -517
5119 -517 -85 492 96 -361 259 407 -672 -266 730 43 -560 303 265 -639 130 747 -190 -652 586 -199
5139 -199 -321 13 602 -179 -203 228 -100 -675 307 497 -564 -43 558 -160 -282 295 295 -239 -146 637 -163
5160 -163 -592 418 237 -548 453 538 -663 -291 505 -90 -497 128 303 -448 65 696 24 -654 430
5179 430 294 -486 44 503 -46 -553 179 84 -454 146 707 -347 -274 867 -228 -595 311 462 -415 -66
5199 -66 670 -150 -575 501 359 -564 -129 687 -407 -287 513 176 -549 93 311 -691 -304 513 -65
5218 -65 -713 106 299 -413 -148 558 2 -557 332 297 -592 -148 548 -314 -524 318 80 -355 230 490 -273
5239 -273 -154 615 174 -731 256 493 -525 -148 799 -114 -530 303 391 -504 -46 517 -368 -624 356 49
5259 49 -507 105 488 -301 -402 528 -4 -667 148 562 -487 -132 376 144 -629 497 320 -307 7 480
5279 480 -190 -441 555 179 -511 166 398 -541 -239 528 112 -561 381 453 -463 -365 662 -262 -511 144
5299 144 413 -505 -131 375 -154 -437 570 233 -498 -15 568 -478 -528 650 86 -609 294 269 -456 -274
5319 -274 569 -30 -529 388 493 -613 -421 858 -241 -319 467 336 -478 122 707 -332 -560 598 54
5338 54 -694 268 781 -339 -479 518 155 -854 318 365 -565 -104 441 -380 -565 288 109 -338 -116 692
5358 692 -409 -114 598 151 -527 108 570 -265 -630 731 -52 -335 385 250 -294 -299 538 -324 -463 341
5378 341 424 -445 -69 563 -419 -196 353 197 -618 186 411 -276 -329 490 194 -572 366 435 -501 -178 606
5399 606 114 -584 251 240 -618 44 780 -219 -500 730 175 -664 223 555 -214 -461 423 -6 -784 394
5419 394 500 -470 -461 984 -78 -779 141 102 -445 160 533 -278 -576 623 344 -516 163 662 -397 -415
5439 -415 640 -119 -608 190 497 -341 -202 574 -27 -534 410 439 -401 51 484 -54 -535 535 333 -482
5459 -482 277 648 -177 -421 696 25 -650 45 602 -537 -361 488 -104 -468 144 398 -482 -58 440
5478 440 -71 -677 452 405 -757 153 578 -549 -516 382 283 -531 463 414 -414 -132 717 -92 -784 227
5498 227 505 -633 108 475 -48 -576 458 326 -534 14 753 -256 20 575 -165 -729 51 243 -528
5517 -528 -503 767 -32 -456 265 603 -663 -290 503 -153 -532 325 -24 -789 -25 835 -381 -515 712
5536 712 1 -851 70 629 -325 -625 439 146 -625 142 256 -423 -320 734 -82 -841 458 257 -567
5555 -567 -104 667 -189 -507 608 412 -650 77 500 -392 -224 643 55 -442 534 561 -404 -225 460 -293
5575 -293 -416 554 379 -779 156 648 -105 -486 499 271 -533 273 380 -288 -345 594 55 -520 235 461
5595 461 -746 -146 742 -77 -515 659 342 -336 237 600 -246 -329 178 400 -435 -2 415 -404 -359 449
5615 449 109 -448 120 562 -641 -340 604 91 -177 433 347 -781 59 802 -32 -398 427 340 -330 157
5635 157 346 -293 -300 486 116 -572 123 379 -463 -324 795 -40 -731 410 451 -587 -154 457 -81 -390
5655 -390 506 127 -491 233 401 -375 -114 790 -90 -687 251 470 -312 -184 639 88 -633 391 411 -431
5675 -431 -21 483 -349 -660 338 298 -635 117 763 -356 -533 701 55 -751 276 316 -503 -115 671 139
5695 139 -592 479 501 -705 -260 591 -235 -454 279 98 -648 207 988 -320 -200 571 242 -825 434
5714 434 479 -710 -275 617 54 -472 345 283 -234 -20 425 -247 -523 540 188 -600 185 442 -399 -494
5734 -494 426 256 -767 378 286 -524 -137 628 -7 -358 213 243 -702 -339 440 -207 -179 157 517 -603
5754 -603 218 596 -298 -242 480 347 -659 260 364 -176 -160 449 -30 -435 68 381 -367 -225 607 -151
5774 -151 -503 377 209 -534 310 569 -290 -376 295 78 -744 582 538 -536 -227 452 3 -445 255 486
5794 486 -551 -431 778 -151 -741 466 392 -630 21 673 -227 -340 574 22 -573 50 609 -281 -575
5813 -575 486 39 -181 54 367 -330 3 661 -147 -582 448 288 -517 66 562 -522 -666 438 204
5832 204 -670 360 722 -436 -434 508 -15 -649 336 486 -472 -20 674 27 -636 286 473 -588 -320 783
5852 783 -174 -588 559 453 -548 83 387 -106 -341 287 -49 -538 194 500 -749 -382 583 -83 -801
5871 -801 163 310 -788 104 393 -219 -360 523 223 -478 -70 629 -452 -291 459 157 -368 274 437
5890 437 -498 -47 484 138 -426 182 447 -528 -209 758 -98 -404 325 71 -447 -25 480 -451 -428 304
5910 304 -12 -555 119 368 -322 -266 535 -254 -609 273 329 -420 -121 407 -246 -488 584 336 -645 -56
5930 -56 639 -104 -570 429 320 -511 253 607 -477 -342 637 144 -608 327 606 -440 -80 418 -75 -578
5950 -578 318 256 -692 90 524 -254 -441 430 223 -737 294 175 -500 -463 491 41 -450 155 328 -637
5970 -637 -310 586 -147 -445 497 151 -601 82 483 -183 -273 430 303 -386 214 399 -395 -449 763 -75
5990 -75 -604 160 350 -622 71 592 -124 -255 373 238 -510 -249 418 -125 -310 466 245 -758 109 298
6010 298 -504 -181 611 49 -638 355 530 -735 -123 664 67 -432 517 326 -300 39 382 -413 -238 461
6030 461 166 -169 246 682 -303 -411 441 -140 -629 118 586 -504 61 397 -66 -503 237 260 -773 336
6050 336 766 -276 -535 440 79 -467 256 463 -267 -306 347 -209 -551 498 395 -442 -59 429 98 -279
6070 -279 265 327 -504 -193 414 -311 -188 336 63 -354 327 752 -467 -304 402 -202 -555 305 479 -491
6090 -491 -195 690 63 -329 274 285 -312 -33 581 -189 -742 479 106 -389 -55 570 -223 -218 578 48 -360
6111 -360 452 614 -423 -212 775 -148 -711 331 278 -736 -125 504 57 -239 232 163 -377 -143 69 -427
6131 -427 -196 470 179 -350 186 459 -289 -140 346 -11 -567 261 571 -505 -35 545 -271 -190 246 250 -428
6152 -428 84 339 -215 -217 499 205 -568 -62 420 -360 -163 334 61 -451 208 436 -512 -114 463 -84 -427
6173 -427 387 239 -366 -18 530 -342 -458 431 68 -545 266 338 -261 -570 762 104 -521 298 214 -495
6193 -495 -107 584 -231 -415 247 329 -411 -216 536 -324 -284 445 104 -589 261 463 -367 -369 541 75 -596
6214 -596 398 319 -46 -92 312 -54 -405 178 165 -358 73 352 3 -502 419 363 -705 88 413 -349 -315
6235 -315 470 -218 -546 375 341 -526 -83 387 -194 -349 341 163 -567 190 600 -206 -504 306 50 -498
6255 -498 385 389 -289 -246 345 146 -480 148 436 -535 -289 537 -241 -386 314 448 -453 7 628 -195 -477
6276 -477 435 265 -356 -136 577 -350 -319 424 -44 -264 71 342 -169 -370 192 -303 -467 370 281 -333 -120
6297 -120 385 -214 -78 393 18 -525 216 423 -322 -169 477 168 -473 382 212 -357 -72 631 -127 -473
6317 -473 423 175 -541 -108 587 5 -470 520 261 -650 1 618 -148 -352 403 -2 -475 203 394 -572
6337 -572 -284 653 -167 -589 371 431 -452 -102 399 -139 -523 254 7 -405 62 306 23 -257 348 116
6357 116 -521 77 218 -159 -165 371 -194 -462 453 512 -216 -143 642 -24 -373 421 261 -348 148 240 -86 -299
6379 -299 387 202 -729 -130 576 -265 -295 292 -7 -325 52 648 -440 -131 449 -67 -593 35 325 -120
6399 -120 30 447 23 -304 516 502 -590 50 401 -198 -308 435 193 -176 273 224 -248 -169 477 -96 -277
6420 -277 -60 367 -244 -41 341 -128 -501 445 194 -322 -130 383 -343 -210 220 190 -639 309 152 -331
6440 -331 36 525 3 -177 390 205 -294 -189 451 143 -355 346 265 -395 -121 228 -165 -159 412 -13 -410
6461 -410 170 497 -297 -164 645 68 -426 644 74 -466 104 239 -152 -323 592 223 -240 -112 276 -306
6481 -306 -324 374 134 -522 180 112 -187 -277 278 -87 -600 208 541 -508 -198 183 -93 -305 505 430 -423
6502 -423 66 330 -95 -154 347 296 -306 92 366 -204 -299 443 321 -651 225 21 -627 -414 505 -365 -291
6523 -291 -64 340 -344 -112 545 -259 -480 253 64 -475 68 221 -252 -257 584 196 -463 366 421 -426 37
6544 37 356 55 -271 26 148 -273 51 297 -146 -333 296 305 -191 328 470 -345 -170 651 243 -502 474
6565 474 121 -328 -125 145 108 -185 225 389 -642 124 416 -123 -603 216 257 -433 298 204 -190 -245 290
6586 290 156 -392 338 292 -315 56 390 -14 -653 319 369 -190 38 183 -300 -312 503 283 -270 -191 250
6607 250 -207 -348 583 319 -661 -57 130 -297 -224 663 -87 -327 325 40 -410 -81 606 -157 -455 212
6627 212 199 -596 -67 505 -373 -345 549 -99 -533 205 428 -123 -270 355 264 -304 176 380 -332 -75 545
6648 545 17 -564 448 76 -271 30 187 -122 -390 223 -43 -398 -171 331 -195 -187 379 -26 -557 269
6668 269 419 -237 -278 373 -41 -415 316 260 -427 33 419 -454 -299 264 229 -315 173 341 -157 -512 404
6689 404 -1 -272 408 440 -312 -54 487 -33 -381 90 326 -561 295 398 -59 -300 178 185 -614 186 506
6710 506 -262 -308 599 -156 -462 -16 311 -543 -270 293 -231 -359 176 308 -501 -98 116 -60 -600 337
6730 337 -12 -367 186 81 -131 -245 369 120 -399 48 453 -25 -431 587 -30 -438 233 163 -252 -4
6750 -4 454 24 -394 465 109 -386 -128 264 -333 -325 304 204 -263 197 427 -467 -304 391 -207 -368 275
6771 275 578 -308 -228 586 -38 -330 295 365 -409 63 373 -442 -320 378 161 -420 351 260 -402 -222 408
6792 408 210 -608 345 330 -586 -111 277 50 -160 357 135 -753 20 554 -191 -349 254 55 -393 3
6812 3 329 -232 -519 663 -92 -562 293 370 -259 -191 601 -78 -352 514 171 -488 138 418 -189 -224 531
6833 531 -65 -521 -4 466 -356 -346 735 142 -524 210 624 -450 -309 208 -149 -443 224 177 -366 -138
6853 -138 190 -200 -453 351 -75 -593 116 314 -312 -352 369 31 -372 196 351 -388 -165 293 -135 -551
6873 -551 393 20 -275 153 529 -10 -193 364 141 -269 181 413 36 -477 430 30 -340 254 280 -459
6893 -459 -61 323 -2 -402 153 171 -221 -19 303 54 -486 576 140 -515 -174 247 -289 -411 467 16
6913 16 -387 186 431 -412 -198 625 -143 -462 158 263 -471 -34 239 1 -496 523 175 -734 140 391
6933 391 -174 -188 268 -79 -311 -22 307 -413 -368 469 -68 -491 99 114 -312 45 385 -138 -166 306 -103
6954 -103 -334 39 359 -378 -261 654 -122 -388 307 226 -252 -169 436 -168 -397 247 67 -172 -141 296 -230
6975 -230 -475 221 326 -337 59 359 -322 -212 266 129 -247 201 258 -836 -22 231 90 -343 258 484
6995 484 -364 99 469 90 -315 351 19 -674 -9 100 -181 -278 429 222 -298 286 504 -420 -245 377
7015 377 -155 -510 375 315 -412 25 766 32 -386 328 215 -447 101 302 -194 -321 243 209 -447 -93 337
7036 337 -368 -231 412 154 -520 58 283 -392 -112 252 161 -413 204 323 -475 -60 416 113 -172 39
7056 39 396 -262 227 485 -423 -188 400 64 -272 45 322 -228 -279 516 -102 -641 402 288 -127 -65 422
7077 422 -88 -117 582 404 -256 30 346 -211 -272 259 62 -361 -142 306 -418 -277 428 -93 -341 148 75
7098 75 -491 -123 320 -53 -345 199 23 -272 77 409 -290 -104 287 268 -283 -138 330 -206 219 421 -40
7119 -40 -207 75 518 -482 -429 521 215 -226 307 205 -435 42 654 -274 -416 288 407 -138 57 192
7139 192 -372 -189 473 221 -702 325 206 -225 86 325 32 -461 166 622 -180 133 415 -183 -316 410
7159 410 264 -372 135 346 -195 -21 402 -160 -338 168 295 -374 -177 656 -184 -306 80 381 -328 -265
7179 -265 246 -71 -309 513 99 -176 93 208 -269 -353 73 13 -236 133 107 -519 -102 329 -177 -253 301
7200 301 -124 -671 -250 248 -101 -426 329 136 -145 155 78 -188 -256 344 231 -380 405 372 -571 -130 337
7221 337 -125 -424 421 247 -376 -232 403 -385 -327 95 268 -352 -84 318 -263 -57 317 -100 -625 235
7241 235 495 -132 -214 527 -79 -423 124 506 36 -82 409 -412 -205 192 212 -547 -4 454 -283 -288 243
7262 243 20 -346 271 169 -238 -163 312 -138 -318 160 117 -154 -80 370 -151 -241 192 -9 -374 122 393
7283 393 -225 -290 235 121 -422 222 259 -341 -268 389 226 -204 141 287 -74 194 189 -133 -173 55 106 -417
7305 -417 161 465 -346 -260 260 206 -391 95 255 -193 -145 433 38 -525 39 241 -295 -274 365 -104 -202 288
7327 288 138 -504 -97 246 -161 -406 344 -78 -147 181 283 -262 -282 373 -100 -286 137 90 -169 -352 102
7348 102 -102 -66 236 392 -227 66 178 -235 -89 145 207 -398 -45 319 -197 76 410 27 -296 191 246
7369 246 -433 -227 279 52 -522 160 295 -290 -2 500 -26 -210 320 102 -630 -174 212 -552 -465 424
7389 424 -82 -265 -16 246 -268 -92 332 -106 -168 237 214 -334 -16 160 -119 -347 415 410 -343 147 447
7410 447 -90 -128 278 211 -300 164 238 -246 -276 173 -70 -281 258 262 -202 -184 360 -25 -139 203 185 -292 217
7433 217 170 -64 -247 184 162 -123 -7 227 -165 -320 387 -37 -280 267 289 -338 63 605 -84 -377 175
7454 175 163 -248 -49 383 -426 -404 251 89 -451 11 356 -172 -185 523 92 14 198 258 -388 -132 445 -326
7476 -326 -298 566 58 -374 157 384 138 -145 372 -139 -322 -266 24 -102 -314 342 -12 -282 18 117 -443
7497 -443 -256 305 -58 -123 152 173 -353 -30 130 -227 -179 473 5 -373 133 380 -82 207 152 53 -200 208
7519 208 189 -340 99 243 116 -407 180 358 -91 47 314 -431 -374 178 247 -374 -14 235 51 -84 159
7540 159 -50 -375 247 -18 -246 -32 428 -78 -87 146 -135 -233 -23 358 -174 -163 111 197 -227 163 290 -293
7562 -293 -392 245 119 -482 162 53 -501 -264 468 -100 -405 238 38 -369 -118 216 -137 -385 305 209 -159
7583 -159 46 257 -119 86 306 148 -399 5 325 -315 -237 343 130 -362 220 306 -258 -106 412 121 -349
7604 -349 234 310 -287 -199 402 -255 -286 297 179 -646 406 269 -276 -386 480 11 -582 302 67 -286 -112
7625 -112 401 -166 -514 57 -118 -207 182 250 -317 -344 331 45 -263 -24 47 -51 -131 99 259 -476 285 225
7647 225 -98 -78 155 96 -402 358 419 -260 -274 166 -348 -256 316 179 67 144 488 -101 -293 217 -29 -176
7669 -176 351 220 -93 -241 206 -23 -213 192 311 -297 37 340 -23 -81 301 61 -332 119 411 -233
7689 -233 -109 478 93 -259 -47 -11 -48 -73 174 -164 -449 158 332 -345 -124 134 125 -364 268 1 -453 50
7711 50 269 -106 -40 493 37 -246 13 235 -423 -35 517 -132 18 213 190 -100 290 136 -89 -126 240
7732 240 312 -380 179 238 -216 -213 327 -283 -344 16 42 -26 -253 -5 40 -201 162 304 -214 -47 198 -301 -145
7755 -145 298 108 -405 104 224 7 -88 461 -6 -370 13 295 -111 -261 227 -60 -163 35 -32 -348 -41
7776 -41 330 128 -28 128 93 -353 -97 390 -1 -115 224 63 -431 55 433 -320 -20 -14 120 -154 -12
7797 -12 186 -177 -145 384 -110 -244 289 255 -217 -9 220 -200 -565 362 117 -242 86 253 -269 -260 181 3
7819 3 -359 -39 227 -252 -42 95 -15 -140 171 174 -244 -10 355 23 -406 334 -24 -171 57 327 -136
7840 -136 -73 93 141 41 -27 228 -181 -69 117 -120 -234 164 269 -123 49 427 50 -403 87 287 -157
7861 -157 165 209 -75 -196 165 24 -238 109 134 -295 -46 517 -87 -319 107 -94 111 -171 253 -72 -194
7882 -194 301 44 -156 -109 344 -320 -304 382 87 -265 10 222 -69 -238 375 -28 -376 133 373 -181 -91
7903 -91 195 -69 -184 143 321 -448 -152 181 -165 -158 226 445 -213 13 517 -245 -313 179 -11 -125 235
7924 235 397 -306 -164 164 -84 -229 350 201 -323 -151 66 -346 -91 199 237 -127 -2 385 -253 -233 7
7945 7 45 -626 -21 157 -242 -161 377 -32 -6 104 -44 -155 -117 205 -214 77 178 -77 -263 -25 284 -77
7967 -77 -270 310 92 -429 214 219 -341 -65 88 -191 -108 294 73 -8 -54 110 108 -105 223 145 -11 53 44 -65
7991 -65 -110 245 -79 -132 281 375 83 -341 280 221 -481 40 92 -79 76 333 -140 -278 20 80 -124 -62 217
8014 217 -178 -212 289 -20 -12 143 246 -138 -116 56 160 19 229 136 -226 41 138 172 -259 85 107 -106 93
8037 93 351 -29 -120 180 71 -235 -63 -47 -237 -109 239 53 4 200 178 -59 -120 389 92 12 107 193 -267
8060 -267 -102 353 -98 -191 121 -204 -28 5 222 -375 -264 290 106 -139 225 308 -1 -30 115 -25 -279
8081 -279 232 243 -123 -68 52 -268 -210 212 122 -326 -188 192 -229 -125 279 97 -391 -8 236 -249 23
8102 23 238 -109 -229 189 144 -208 -147 163 -97 -140 17 234 25 113 413 -65 -191 186 160 -226 135 381
8124 381 -67 -376 134 -69 -186 237 -34 -511 -129 288 24 -124 170 197 -222 -9 210 27 -51 445 -105
8145 -105 -261 33 165 -123 63 304 8 84 27 262 -184 -164 131 -31 34 84 180 -239 53 292 -237 44
8167 44 220 137 -206 98 292 -121 58 179 -58 -287 -50 263 -113 -21 37 -62 -45 181 263 -217 -5 379
8189 379 -141 -295
8191b95
$$ Imaginary data points
##PAGE= N=2
##DATA TABLE= (X++(I..I)), XYDATA
0 0 0 0 0 0 0 0 0 0 0 0 0 0 0 0 8 -8 8 -8 9 -16 16 -24 24 -28 32 -40 47 -51 59 -67 78 -88 99 -111 126 -142
36 -142 159 -178 198 -220 245 -272 298 -331 367 -404 446 -490 540 -595 657 -723 796 -882 975
55 975 -1083 1205 -1347 1517 -1718 1966 -2273 2673 -3214 3979 -5145 7115 -11052 21741 -106650
70 -106650 -266046 160640 88466 -245510 36433 266348 -113967 -146376 200989 24711
80 24711 -238105 81168 186490 -156979 -72090 214659 -41691 -210121 121934 127342 -187994
91 -187994 -13357 217036 -80270 -177624 146626 67618 -208088 23618 197060 -103615
101 -103615 -118070 172662 22231 -198469 60609 151803 -136571 -65822 187340 -18785
111 -18785 -173846 102152 113469 -164271 -26246 190240 -51478 -148640 131723 75986 -182381
122 -182381 3191 169291 -92089 -117648 155624 36776 -177049 49089 143577 -129364
132 -129364 -78490 169928 -9090 -164300 91326 111103 -152163 -33105 174138 -43154
142 -43154 -135644 122001 76201 -160460 2710 153858 -79836 -105353 139935 38160 -152607
153 -152607 44238 126914 -114820 -72438 147589 -8166 -145977 80976 99833 -137598
163 -137598 -33587 151775 -44073 -126352 108499 68238 -143709 5090 138456 -75585
173 -75585 -93960 128653 32719 -137136 45462 115460 -105208 -60538 136795 -7949 -129139
184 -129139 77791 89519 -125039 -27901 135620 -43536 -114108 97935 58795 -129691 5342
195 5342 120779 -70613 -85072 109942 24994 -121202 39404 99339 -90637 -50389 118155
206 118155 -7447 -109666 67569 78039 -103772 -22024 116792 -34990 -96111 84698
216 84698 53547 -109160 3497 104874 -60114 -76571 95163 23897 -108735 31314 89043
227 89043 -81445 -50180 104599 -6602 -103036 58724 72325 -95748 -22075 108611 -31280
238 -31280 -89714 79590 51911 -101658 4801 101191 -54435 -69571 92123 23073 -101587
249 -101587 31168 84742 -76203 -45571 98141 -8185 -96652 54393 64549 -89940 -20330
260 -20330 97030 -32510 -81990 72095 43048 -93011 6256 89286 -51323 -60301 84313
271 84313 18473 -89716 31154 75609 -67084 -37733 89196 -6629 -83685 50340 58094
282 58094 -79503 -17381 85727 -29230 -72558 63876 37155 -84630 3847 78099 -46874
293 -46874 -54971 73842 15428 -82680 26238 68073 -60718 -35320 80417 -4070 -75882
304 -75882 45542 54947 -69552 -15634 79660 -22533 -65138 57325 36431 -74618 2858
315 2858 72541 -40699 -52340 65702 15424 -76041 21573 62629 -55921 -36123 71381
326 71381 -3251 -71505 38704 50660 -64675 -16795 73509 -20105 -60439 53582 35036
337 35036 -68943 3459 69261 -36654 -47042 63493 15613 -70600 21778 59574 -52466
348 -52466 -32807 68196 -3666 -67520 36278 45730 -62250 -15965 67440 -21159 -57192 48768
360 48768 29398 -64472 3795 62221 -35611 -42184 58309 13179 -62769 21846 53579 -46851
372 -46851 -27123 62186 -2353 -57964 33965 41282 -53881 -13642 58761 -17797 -49884 41757
384 41757 25832 -56714 1334 52980 -31727 -38925 50119 11803 -56813 16567 47848 -41385
396 -41385 -26603 55413 -179 -52905 29265 39902 -46921 -13476 55477 -12752 -46281 38215
408 38215 27013 -50701 119 50734 -27035 -37753 45030 12416 -53410 13281 44786 -38417
420 -38417 -27700 49878 7 -50728 24553 36844 -43385 -14172 50363 -11565 -42405 34915
432 34915 25976 -45735 853 47372 -23123 -32900 42632 13204 -47317 12449 41495 -33699
444 -33699 -24186 45378 107 -46342 21582 32895 -40134 -14141 44726 -11169 -40290 30025
456 30025 22654 -42687 -1033 42947 -21312 -31309 38766 12767 -43535 11092 40067 -28882
468 -28882 -22692 42334 3085 -41932 19269 32707 -34065 -13883 40930 -8178 -37303 25894
480 25894 21535 -38683 -3411 37784 -18971 -30362 32453 11757 -39933 7011 35327 -25780
492 -25780 -22249 36732 4505 -37452 15729 30722 -28566 -13320 36857 -3874 -32626 22346
504 22346 21968 -32573 -3969 34992 -14381 -28206 28363 12358 -36953 4351 32799 -22734
516 -22734 -23496 32526 4833 -36750 11469 29349 -26879 -15321 33861 -1746 -31966 18989
528 18989 22619 -29014 -5491 33813 -10326 -26029 25979 14191 -32167 3509 31476 -18925
540 -18925 -21492 29500 5805 -33084 9403 26289 -24269 -15510 29567 -1669 -29653 15136
552 15136 19430 -26126 -6343 28430 -8539 -23033 21326 12918 -26477 2319 27453 -14085
564 -14085 -18373 25086 7479 -27276 7509 24602 -18224 -14451 25633 1448 -26429 10921
576 10921 19460 -22197 -9089 25114 -5661 -24061 16002 14502 -24645 -2630 25573 -10531
588 -10531 -20702 21154 10569 -25382 3510 25260 -14361 -15776 24026 5385 -24512 9089
600 9089 21413 -18749 -10337 24743 -2070 -23445 14155 15321 -23074 -4709 23664 -9283 -20774
613 -20774 18038 9371 -24394 1090 21911 -13259 -15483 20434 4368 -21982 7143 18653
625 18653 -15398 -9129 21702 -704 -19651 12233 14784 -18052 -4149 21277 -6017 -18032
637 -18032 15000 9932 -20520 -944 19440 -10570 -15694 16080 5403 -20287 2921 16677
649 16677 -12788 -11665 17454 1815 -18270 7849 15014 -14375 -6261 19052 -1945 -16608 11925
662 11925 12467 -16963 -2522 19301 -5781 -15418 14193 8496 -18257 143 17225 -9954 -13161
675 -13161 14930 3631 -18234 3911 14270 -12813 -8988 16568 -162 -17004 8772 12535
687 12535 -14847 -4452 18518 -3308 -15572 12772 10940 -16337 -976 18464 -6704 -13710
699 -13710 14242 6907 -17205 1776 15939 -10535 -11086 15086 1722 -17289 5812 13062 -14158
712 -14158 -7597 16451 -2158 -16425 9682 11162 -15557 -3281 17641 -4784 -14127 12980 8745
725 8745 -15614 590 16406 -7738 -10981 14399 4510 -15554 3868 13622 -11037 -8169 14721
738 14721 -570 -15740 6575 11296 -13792 -5758 15155 -2832 -14694 9301 9523 -14246 -2332
751 -2332 15758 -4640 -12281 11879 7271 -14063 1065 15040 -7821 -9738 14238 3981 -15217
764 -15217 5087 13664 -11509 -8137 15149 -129 -16338 7056 11352 -14322 -5804 15441 -3499
777 -3499 -15065 10141 8933 -15093 -1648 15923 -6958 -12255 14069 5947 -15954 3682 15833
790 15833 -10405 -9142 16758 2204 -16890 6961 13880 -13545 -6730 16581 -1961 -16061 9211
803 9211 9714 -15192 -3364 15495 -6212 -13933 12215 6436 -16568 1462 15612 -9369 -10969
816 -10969 15543 3943 -16366 5237 15410 -11455 -8070 16603 876 -15815 7868 12690
828 12690 -13671 -4993 16233 -3717 -14738 10850 8246 -16219 -1061 15849 -8338 -13223 14087
841 14087 5014 -17890 2766 15983 -11270 -10462 16478 2222 -16969 7047 14314 -13279 -6069
854 -6069 17944 -1946 -15441 11242 10752 -16102 -1953 17713 -7351 -14268 14398 6811 -18766
867 -18766 1651 17116 -11361 -12146 16286 2779 -18559 5883 14560 -14330 -8023 17694 -1331
880 -1331 -16565 10910 12003 -16294 -2560 18977 -5826 -14427 14915 8233 -17852 1690 18147
893 18147 -10254 -12570 16524 3878 -18894 5098 15039 -13744 -9235 17238 -1119 -17751 9288
906 9288 11843 -16609 -4008 18324 -5775 -15935 14241 9024 -18421 798 18877 -8978 -13092
919 -13092 17044 5570 -18488 4777 16717 -12920 -9615 18143 490 -18106 9129 13156
931 13156 -16725 -5567 18508 -5057 -17452 12754 9514 -19311 -1088 18973 -9325 -14971
943 -14971 16265 6738 -19433 3979 17797 -12093 -10351 18772 1901 -18385 9046 14930 -15750
956 -15750 -5863 19911 -3983 -17577 12902 10709 -19015 -1383 19171 -9476 -15786 16158 6382
969 6382 -20100 3441 17509 -13152 -11314 18951 1650 -19848 9005 15423 -16463 -6044 20667
982 20667 -3080 -17818 13721 11947 -18651 -1286 20375 -8483 -15391 16713 7068 -20190 3119
995 3119 18074 -13120 -12045 18613 1439 -20370 7987 15279 -16778 -7352 20113 -3405 -18533
1008 -18533 12734 12037 -18671 -1768 20227 -7453 -15477 16717 7877 -19298 3350 18515 -11772
1021 -11772 -11509 18579 2165 -19928 8129 15489 -16605 -7813 19486 -3079 -19273 11855 12251
1034 12251 -19047 -3415 19809 -7812 -16633 15426 8392 -19601 2359 19095 -11590 -11938 19082
1047 19082 3141 -19887 8007 17211 -15828 -7989 20604 -1889 -19547 11922 13444 -18987
1059 -18987 -4079 20256 -7241 -17205 15433 8200 -20376 1120 18958 -12087 -13195 18485
1071 18485 3010 -20559 7555 17131 -15913 -7928 20725 -1810 -19211 12542 13526 -18544 -3061
1084 -3061 20902 -6653 -16720 15580 8442 -20038 1812 18825 -11795 -13316 17916 2887
1096 2887 -20771 6792 16488 -16230 -9126 20140 -1634 -19236 11194 13701 -18043 -4243 20314
1109 20314 -5676 -16427 15198 9556 -18996 1456 19392 -10674 -13048 18433 4135 -20463
1121 -20463 6638 17308 -15356 -10199 20184 -602 -20287 10133 13739 -18400 -5347 19937
1133 19937 -5761 -17422 14235 9277 -19522 1096 19311 -10734 -13132 18602 4376 -20174
1145 -20174 7249 17860 -15079 -9294 20618 -183 -19469 10175 14253 -17784 -5455 19630
1157 19630 -5242 -17437 13378 9101 -19146 -91 18435 -10894 -13848 17226 4556 -19757
1169 -19757 5472 17111 -14279 -9655 19622 697 -19250 9509 14741 -15932 -5574 19684
1181 19684 -4151 -17058 13064 10211 -18107 -559 18338 -9991 -14119 16462 4643 -19838
1193 -19838 4637 17171 -14363 -10660 19115 544 -19981 9198 14743 -16401 -5910 19590
1205 19590 -4172 -16874 13165 10618 -17603 -75 18697 -8978 -13271 17063 5312 -19811
1217 -19811 4643 17383 -13756 -10753 18926 781 -19898 8424 14500 -16281 -6784 18685
1229 18685 -3846 -17427 12392 10448 -18132 -1093 18574 -8749 -13946 16524 5853 -19321
1241 -19321 4123 17761 -12634 -10852 18805 1483 -19320 8088 15052 -15867 -6827 18808
1253 18808 -3422 -17103 11897 10182 -18190 -1639 17807 -8754 -14229 15539 5286 -19308
1265 -19308 4040 17306 -12489 -10588 18236 1970 -18442 8387 15116 -14838 -6537 18200
1277 18200 -2420 -16104 11679 10413 -16973 -1383 17400 -8042 -13861 14815 5634 -18663
1289 -18663 3002 16468 -12103 -11312 17004 2012 -18703 7001 14577 -14348 -7134 18061 -2205
1302 -2205 -16139 11152 10692 -16382 -1642 17865 -7056 -13542 14895 6250 -18255 3332 17019
1315 17019 -11733 -11154 17213 1975 -18498 7000 14441 -14622 -7374 17781 -2590 -16510 10335
1328 10335 10610 -16335 -1849 17695 -7212 -13555 14814 6555 -17706 3300 16867 -11032 -10614
1341 -10614 17148 2737 -17647 6615 14850 -13717 -7282 17213 -1846 -16135 9544 10197 -15865
1354 -15865 -2680 16776 -6800 -13856 13353 6393 -17411 2266 16061 -10497 -11116 16300 3297
1367 3297 -17107 5964 14394 -13042 -7156 17177 -907 -15720 9946 10729 -15202 -2427 16722
1380 16722 -6268 -13997 13168 6834 -17055 1767 15593 -10520 -11401 15425 2878 -17472 5442
1393 5442 13936 -12774 -7559 16511 -1047 -15675 9629 10700 -14346 -2650 16452 -5675 -13317
1406 -13317 12888 7042 -16320 1625 15830 -9820 -11236 15317 2995 -16910 5178 13253
1418 13253 -12438 -7599 15722 -1677 -15624 8686 10325 -14693 -2732 16276 -6117 -13193
1430 -13193 12722 6928 -16123 1735 15511 -8829 -10075 15180 3464 -16117 5249 13516
1442 13516 -11840 -7137 15735 -1235 -14996 8545 10180 -14074 -3222 15423 -5535 -13313
1454 -13313 11774 6819 -15520 855 14765 -8551 -10431 14114 3241 -15394 4586 13186
1466 13186 -10803 -7059 15013 -480 -14254 8498 10498 -13288 -3136 14937 -4790 -12953
1478 -12953 11110 7009 -15070 350 14291 -8485 -10680 13152 2958 -15237 4151 12741
1490 12741 -10987 -7226 14406 -555 -14137 7900 10292 -13099 -2984 15026 -4111 -12169
1502 -12169 11415 7179 -14355 937 14414 -7642 -10158 13139 3063 -14856 4132 12116
1514 12116 -10872 -7007 13725 -893 -13966 7717 9548 -13061 -2992 14509 -3894 -11983
1526 -11983 10574 6638 -13886 608 14127 -7341 -9908 12683 3527 -13890 4144 12057 -9908
1539 -9908 -6625 13628 -528 -13393 7009 9232 -12709 -3065 13752 -4337 -11950 9784 6306
1552 6306 -13671 249 12991 -7274 -9538 11699 3195 -13328 3671 11442 -9514 -6211 13176
1565 13176 -167 -12178 6692 9127 -11252 -3254 13372 -3685 -11205 9269 6345 -12550 -308
1578 -308 12396 -6587 -9568 10659 3486 -12590 3257 10710 -8999 -6422 12085 -151 -12307
1591 -12307 6583 9057 -11206 -2993 13011 -3080 -11035 9167 6838 -12090 79 12467 -6224
1604 -6224 -8772 10815 3398 -12464 3185 10524 -8855 -5927 11541 -781 -12054 6237 8206
1617 8206 -11039 -2815 12442 -3447 -10638 8799 6352 -11891 -11 11643 -5441 -8434 10533
1630 10533 3531 -11685 3175 10397 -8016 -5631 11058 180 -11455 5587 8095 -10224 -3210
1643 -3210 11554 -3057 -10676 7666 5818 -11373 -973 11163 -5339 -8458 9348 3350 -11161
1656 -11161 2506 9999 -7362 -5489 11009 652 -10756 5593 8459 -9407 -3142 11407 -2568
1669 -2568 -9988 7486 5891 -10565 -849 10706 -5305 -8578 8744 2761 -10951 2045 9216
1682 9216 -6841 -5716 9869 677 -10323 5063 7975 -8835 -2995 10815 -1954 -9334 7209
1695 7209 6121 -9865 -398 10586 -4111 -7825 8558 3615 -10047 1815 8918 -6708 -5633
1708 -5633 9094 499 -10335 4510 7382 -8656 -3250 10024 -1862 -9231 6704 5852 -9581
1721 -9581 -869 9835 -3690 -7313 8096 3543 -9648 1790 8977 -5882 -5498 9348 775
1734 775 -9574 3856 7104 -8095 -3486 9762 -1799 -9247 5740 5675 -9203 -1490 9303 -3681
1748 -3681 -7588 7149 3715 -9091 1070 8452 -5340 -5372 8563 1307 -8631 3695 7390 -7152
1762 -7152 -3303 9395 -1276 -8468 5682 5812 -8436 -1570 9120 -3200 -7425 6742 3689
1775 3689 -9060 605 8017 -5123 -5880 7908 1220 -8603 3055 6891 -6904 -3108 8990 -756
1789 -756 -8197 5442 5530 -7977 -1111 8703 -2939 -7243 6514 3736 -8166 826 7954 -4899
1803 -4899 -5395 7525 1183 -8364 3003 6313 -6549 -3680 8042 -801 -7519 4622 5352 -7670
1817 -7670 -1604 8457 -2510 -6573 6158 4026 -7831 350 7672 -4130 -5140 7097 1817
1830 1817 -8019 2439 6437 -5824 -3668 7514 -550 -7845 3975 5357 -7393 -2085 7822 -2007
1844 -2007 -6737 5476 4064 -7447 -30 7403 -3719 -5383 6829 2077 -7508 2416 6944 -5339
1858 -5339 -3567 7325 -48 -7317 3924 5543 -6538 -1985 7518 -1823 -6643 4985 3889 -7259
1872 -7259 -429 6888 -3572 -5502 6009 2009 -7102 1506 6125 -4903 -3688 6544 312 -6575
1886 -6575 3653 5460 -5751 -1764 7230 -1608 -6036 4988 3847 -6793 -235 6831 -3158 -5182
1900 -5182 5323 2005 -6812 1209 6164 -4691 -3578 6429 554 -6577 2900 5042 -5650 -2131
1914 -2131 6698 -822 -6070 4314 3870 -6106 -791 6757 -2646 -5129 5223 2651 -6025 1043 5960
1929 5960 -4002 -3938 5868 773 -6357 2387 4798 -5353 -2267 6239 -1192 -6006 3903 3907 -5962 -893
1945 -893 6114 -2217 -5094 4795 2621 -5874 549 5918 -3326 -3524 5620 1070 -6179 2276 4966
1960 4966 -4442 -2241 5896 -440 -5919 3604 3931 -5881 -1487 5835 -2190 -4875 4304 2637 -5600
1975 -5600 213 5246 -3047 -3760 5210 1030 -5631 1892 4741 -4084 -2424 5882 -141 -5321 3266
1990 3266 4040 -4898 -1344 5275 -1706 -4692 3905 2468 -5566 -174 5118 -3151 -4017 4379 1246
2005 1246 -5179 1478 4212 -3806 -2548 5125 196 -4976 2733 4119 -4652 -1151 5455 -1073 -4390
2020 -4390 3571 3084 -4930 -292 5294 -2616 -3970 4527 1539 -5256 1036 4416 -3447 -2959 4590
2035 4590 -73 -5037 2146 3657 -4424 -1755 5291 -1170 -4810 3243 2971 -4604 -407 5236 -2050
2050 -2050 -3619 4057 1771 -4645 984 4394 -2841 -2831 4401 382 -4853 1844 3885 -3860 -1920
2065 -1920 4656 -720 -4691 2846 2767 -4599 -787 4781 -1783 -3734 3697 2115 -4415 522 4227
2080 4227 -2599 -2688 4322 862 -4238 1592 3811 -3468 -1666 4653 -143 -4359 2511 3080 -3996 -840
2096 -840 4231 -1234 -3782 2895 1844 -4465 -89 3949 -2057 -3080 3870 865 -4400 1281 3895
2111 3895 -3070 -1966 4403 48 -4188 2213 3230 -3418 -1362 4082 -940 -3799 2866 2073 -3781
2126 -3781 -265 4114 -1941 -3437 3612 1027 -4310 1046 3766 -2961 -2521 4106 296 -4269 1819
2141 1819 3158 -3633 -1341 4141 -387 -3399 2854 2429 -3518 -239 4017 -1698 -3143 3325 1375
2156 1375 -4162 554 3348 -2440 -2458 3452 138 -3830 1314 3306 -3262 -1638 3675 -404 -3857
2171 -3857 2224 2473 -3333 -752 4087 -1267 -3097 2697 1984 -3603 625 3746 -1751 -2442 3428 1190
2187 1190 -3713 1167 3175 -3238 -1788 3506 -210 -3786 1595 2667 -3417 -937 3472 -1132 -3199
2202 -3199 2756 2057 -3743 49 3798 -1633 -2587 3027 1146 -3610 1110 3368 -2213 -1842 3628 9
2218 9 -3408 1796 2760 -2989 -1256 3480 -932 -3053 2320 1949 -3672 -426 3433 -1637 -2922 2838
2234 2838 1273 -3576 575 3206 -2209 -1746 3523 426 -3324 1622 2980 -2959 -1291 4275 -293
2249 -293 -3202 2284 2264 -3353 -721 3493 -1388 -3359 2590 1435 -3420 146 3180 -2140 -2380 3289
2265 3289 634 -3459 1102 3092 -2560 -1556 3447 -219 -3380 1906 2606 -2981 -860 3753 -630
2280 -630 -3040 2561 1855 -3279 61 3061 -1616 -2431 3029 542 -3625 817 3157 -2528 -1831 3499
2296 3499 -157 -3547 1720 2635 -3197 -1244 3588 -707 -2987 2468 2042 -3156 -308 3552 -1584
2311 -1584 -2265 2951 1083 -3175 440 3039 -2309 -1899 3391 36 -3551 1774 2416 -3163 -1300 3388
2327 3388 -761 -3026 2309 2074 -2945 -401 3365 -1011 -2303 2553 1467 -3261 871 2988 -2290
2342 -2290 -1762 3485 457 -3356 1416 2527 -2860 -1477 3550 -205 -3153 1795 2011 -3150 -539
2357 -539 3277 -1284 -2919 2435 1369 -3442 160 3001 -2118 -2276 3429 1021 -3361 1386 3013
2372 3013 -2711 -1446 3565 232 -3172 1830 2307 -2851 -628 3618 -1171 -2747 2449 1273 -3553
2387 -3553 237 3194 -2077 -2367 3200 604 -3582 1111 3033 -2455 -1498 3491 274 -3367 1732
2402 1732 2673 -2750 -725 3290 -806 -2717 2611 1649 -3072 107 3250 -1741 -2403 2992 860 -3531
2418 -3531 671 2930 -2499 -1866 3301 -53 -3612 1325 2498 -2922 -911 3212 -686 -3009 2149
2433 2149 1949 -2968 149 3101 -1590 -2174 2891 864 -3375 989 3139 -2497 -1891 3185 116 -3235
2449 -3235 1326 2428 -2830 -1409 3140 -548 -2987 2141 1615 -3161 -165 3115 -1585 -2454 2856
2464 2856 1004 -3143 815 3266 -2270 -1889 3563 687 -3390 1526 2704 -2640 -1026 3202 -242
2479 -242 -2852 2101 2076 -3194 -232 3170 -1620 -2442 2787 1196 -3404 754 3087 -2108 -2048 3068
2495 3068 595 -3551 1317 2793 -2398 -1367 3177 -243 -2837 2165 1952 -2954 -80 3220 -1190
2510 -1190 -2465 2597 1187 -3215 370 3248 -2187 -2192 2985 516 -3393 1045 2830 -2499 -1414 3173
2526 3173 -236 -2943 1962 1947 -2771 -275 3131 -1193 -2645 3002 1583 -3132 369 3331 -1784
2541 -1784 -1858 3058 478 -3473 1149 2930 -2339 -1528 2859 -81 -3133 1887 2193 -3027 -522 3156
2557 3156 -1245 -2581 2708 1103 -3216 523 3214 -1822 -2209 3147 954 -3198 866 2969 -2226
2572 -2226 -1468 3190 -144 -3074 1762 2001 -3011 -892 2924 -1205 -2724 2599 1493 -3141 115
2587 115 2930 -2073 -2151 2712 778 -3209 951 2740 -2384 -1464 3156 -28 -2867 1687 2253 -2953
2603 -2953 -548 3326 -966 -2573 2261 1479 -3124 279 2952 -1674 -2278 2508 611 -2921 628
2618 628 2620 -2201 -1299 3066 178 -3002 1376 2212 -2637 -813 3047 -971 -2627 2543 1690 -2682
2634 -2682 -53 3106 -1376 -2047 2836 936 -3199 475 2683 -2346 -1688 3073 -91 -3105 1272
2649 1272 2131 -2608 -719 3106 -985 -2921 2275 1345 -3050 -90 3106 -1359 -2138 2962 1120 -3092
2665 -3092 839 2924 -1840 -1702 3150 445 -2872 1399 2279 -2555 -793 2849 -698 -2849 2180
2680 2180 1530 -3075 -391 3011 -1496 -2460 2450 1119 -3059 604 2690 -1930 -1567 2941 202 -2782
2696 -2782 1500 2350 -2377 -1027 2938 -836 -2539 2051 1744 -3102 -256 3017 -1127 -2437 2514
2711 2514 1032 -3055 295 2675 -1853 -1543 2673 131 -3149 1208 2287 -2633 -1180 2802 -394
2726 -394 -2369 2155 2004 -2934 -487 3034 -1030 -2128 2285 1019 -2900 461 2389 -1940 -1854 2474
2742 2474 40 -2800 1508 2182 -2310 -1064 2789 -393 -2996 2011 1656 -2814 -268 2927 -1034
2757 -1034 -2127 2351 1201 -2783 472 2815 -1658 -1735 2549 350 -2788 1117 2074 -2209 -1110 2875
2773 2875 -493 -2951 1609 1652 -2697 -100 2915 -1093 -2521 2156 1123 -2953 295 2783 -1724
2788 -1724 -1608 2828 428 -2728 1307 2431 -1958 -873 2985 -226 -2672 1785 1840 -2342 -749 3071
2804 3071 -1050 -2420 2322 1110 -2683 379 2351 -1745 -1625 2494 310 -2809 1290 2128 -2291
2819 -2291 -1123 2694 -416 -2455 1835 1579 -2312 -313 2921 -1010 -2180 2244 1136 -2631 502
2834 502 2602 -1641 -1729 2469 434 -2785 988 2006 -2347 -1275 2635 -195 -2635 1704 1900 -2489
2850 -2489 -517 2575 -893 -2262 1933 1034 -2576 321 2663 -1276 -1725 2534 236 -2612 967
2865 967 2154 -2160 -1082 2529 -283 -2411 1367 1552 -2571 -453 2685 -947 -2490 1900 1021 -2316
2881 -2316 30 2352 -1555 -1508 2253 557 -2491 1082 2204 -1968 -806 2679 -127 -2225 1569
2896 1569 1854 -2281 -546 2619 -885 -2301 1924 1173 -2759 76 2204 -1314 -1549 2251 609 -2623
2912 -2623 817 2066 -1995 -975 2783 -315 -2344 1299 1743 -2176 -606 2576 -776 -2111 1686
2927 1686 967 -2271 -114 2247 -1278 -1592 2132 231 -2509 817 1899 -1997 -1036 2502 -130 -2611
2943 -2611 1253 1743 -1919 -486 2455 -532 -1945 1566 1252 -2306 318 2283 -1196 -1299 2191 545
2959 545 -2271 575 2000 -1666 -1168 2433 -208 -2585 1195 1453 -2402 -569 2479 -786 -2167 1469
2975 1469 1070 -2354 2 2153 -1506 -1387 1933 396 -2294 418 1965 -1666 -1156 2343 -41 -2066
2991 -2066 1283 1718 -2265 -352 2216 -601 -1998 1370 1022 -2104 -200 2157 -1042 -1435 1910 509
3007 509 -2260 515 1768 -1602 -1019 2288 76 -2253 1159 1668 -2026 -451 2223 -514 -1986 1837
3023 1837 974 -2091 102 1941 -811 -1609 1602 551 -2183 482 2009 -1518 -1022 2005 -380 -2263
3039 -2263 969 1430 -1928 -618 2172 -476 -1737 1512 1048 -2084 -64 2254 -814 -1304 2014 648
3055 648 -2074 941 1851 -1517 -1197 1687 87 -2114 1030 1591 -1970 -884 1827 -475 -1823 1258
3071 1258 1292 -1884 -365 2000 -1172 -1349 1800 582 -1898 510 1821 -1226 -791 1956 52 -2240
3087 -2240 1137 1657 -1905 -461 2162 -396 -1781 1340 1236 -1834 48 1817 -990 -1725 1516 607
3103 607 -1799 532 1612 -1416 -1113 1716 27 -1832 848 1636 -1817 -169 2056 -257 -1862 1306
3119 1306 1100 -1878 84 2200 -808 -1457 1708 442 -1873 308 1832 -1252 -1193 1798 68 -2004
3135 -2004 593 1402 -1506 -791 2053 -261 -1915 1271 1064 -1555 4 1729 -674 -1190 1644 673
3151 673 -1940 466 1691 -926 -631 1731 -39 -2040 485 1295 -959 -834 1522 -341 -1451 876
3167 876 1255 -1659 -167 1650 -783 -1230 1239 868 -1413 301 1443 -838 -1102 1689 205 -1586
3183 -1586 584 1546 -1475 -351 1839 -374 -1527 955 951 -1587 -284 1544 -840 -1507 1175 507
3199 507 -1579 227 1455 -951 -1284 1560 53 -1378 725 1138 -1357 -631 1721 93 -1401 746
3215 746 1038 -1649 -195 1992 -613 -1353 1311 526 -1358 -6 1305 -816 -1392 1303 392 -1683
3231 -1683 503 1118 -1181 -766 1624 -94 -1464 948 1272 -1154 -129 1462 -501 -1422 1095 979
3247 979 -1358 -192 1436 -470 -981 1149 409 -1414 454 1184 -970 -524 1254 48 -1486 510
3263 510 885 -1419 -644 1363 -115 -1374 1135 748 -1504 -86 1235 -895 -1110 1161 679 -1500
3279 -1500 444 1359 -1066 -835 1340 7 -1309 481 952 -1161 -429 1443 -266 -1326 755 594
3295 594 -1499 56 1402 -883 -1112 1229 238 -1572 405 887 -742 -702 1371 -165 -1379 528
3311 528 1107 -1411 -599 1383 -262 -1220 1096 1046 -1421 82 1363 -345 -1085 1010 465 -1325 181
3328 181 1059 -817 -671 1205 222 -1403 595 856 -798 -494 1306 -142 -1296 730 930 -1128 -182
3345 -182 1381 -489 -905 1009 541 -983 65 1169 -753 -921 1244 76 -1375 558 1112 -1359
3361 -1359 -487 1075 -85 -1270 488 683 -1033 -426 1238 -769 -838 866 602 -1282 -7 1233
3377 1233 -676 -840 1160 226 -1031 425 1049 -823 -337 1390 -74 -1412 784 976 -1261 -332
3393 -332 1145 -621 -1008 1055 593 -1091 57 1164 -618 -997 1185 177 -1345 315 975 -845
3409 -845 -572 1039 -54 -1053 401 1090 -1024 -283 996 -337 -1002 918 342 -1113 -91 1018 -371
3426 -371 -926 1004 535 -1451 238 1136 -1027 -599 903 216 -1411 688 715 -1149 6 1254 79
3443 79 -1221 815 658 -1098 73 1179 -591 -990 878 -64 -1298 302 1047 -633 -844 1020 50
3460 50 -1335 239 1114 -767 -405 1030 -365 -1174 783 794 -1178 -145 1217 -387 -653 917 706
3477 706 -713 554 1045 -560 -766 841 165 -927 618 869 -1143 -290 1214 -285 -971 995 394
3494 394 -1183 -128 1073 -482 -935 1074 220 -1305 36 1052 -462 -489 954 284 -1254 503
3510 503 941 -908 -296 1031 -90 -1030 675 596 -967 -210 1101 -127 -724 801 389 -997 -192
3527 -192 816 -329 -884 770 318 -1013 294 845 -815 -585 1091 -125 -700 550 900 -820 -323
3544 -323 1052 -262 -841 742 543 -1038 -162 1107 -341 -624 727 110 -1001 125 922 -863 -515
3561 -515 816 227 -1133 707 946 -1225 -339 855 -10 -926 877 421 -957 81 1240 -327 -803
3578 -803 785 228 -1023 383 873 -688 -479 1004 200 -1082 521 848 -824 -349 984 -161 -1074
3595 -1074 595 507 -1019 -18 1091 -189 -849 999 367 -937 248 790 -337 -385 966 129 -820
3612 -820 169 820 -811 -469 1112 -6 -1085 431 742 -1044 -274 951 -313 -1073 722 232 -1028
3629 -1028 98 753 -762 -692 790 186 -809 212 798 -417 -451 1117 -206 -1057 501 704 -963
3646 -963 -495 970 -187 -815 533 447 -870 -406 759 -410 -809 824 -116 -1045 136 875 -813
3663 -813 -538 1047 -117 -947 361 926 -795 -335 761 -152 -977 594 645 -789 -171 865 -296
3680 -296 -750 720 195 -837 75 691 -607 -428 1173 -79 -1166 398 786 -750 -510 868 -21
3697 -21 -935 612 727 -758 22 970 -211 -777 849 372 -1032 39 866 -719 -764 519 341 -887
3715 -887 102 646 -765 -427 788 9 -1270 370 634 -619 -350 902 -361 -932 560 448 -714
3732 -714 106 832 -526 -447 855 186 -1133 552 810 -658 -672 940 -297 -876 548 518 -747 -553
3750 -553 1137 -33 -917 278 678 -906 -187 996 -326 -514 948 220 -1105 105 982 -663 -678
3767 -678 931 320 -1134 515 879 -828 -452 1060 40 -689 676 571 -1023 -235 890 -643 -848
3784 -848 866 495 -1057 308 830 -692 -465 1042 377 -979 512 1040 -1082 -358 982 19 -968
3801 -968 560 518 -871 -243 1130 -246 -906 799 390 -1013 159 828 -818 -634 968 327 -912
3818 -912 235 844 -576 -664 967 -23 -692 482 347 -892 2 1107 -388 -599 953 320 -1088
3835 -1088 194 1072 -432 -597 801 304 -921 310 718 -1003 -371 912 -29 -829 516 677 -1067
3852 -1067 -105 812 -320 -624 760 594 -793 -96 1200 -493 -589 1022 215 -1086 418 867 -1019
3869 -1019 -469 1220 -62 -932 575 716 -1013 -283 1156 -262 -1153 583 783 -993 205 750 -661
3886 -661 -486 959 399 -954 583 730 -614 -510 942 140 -1021 588 577 -700 -126 986 -256
3903 -256 -969 813 300 -922 -127 1091 -385 -497 818 391 -926 139 961 -716 -480 814 3
3920 3 -987 428 964 -875 -267 930 -147 -835 545 754 -771 -192 951 -291 -890 621 600 -1050
3938 -1050 -34 1013 -829 -349 1005 -105 -1020 280 758 -589 -432 1141 5 -728 631 675 -974
3955 -974 -150 1100 58 -477 874 536 -1107 -60 1003 -464 -700 793 -40 -985 150 798 -791
3972 -791 -702 897 -340 -1044 671 547 -907 -296 1108 -380 -934 849 487 -1266 -78 972 -458
3989 -458 -707 986 153 -1145 329 1055 -722 -370 1126 -138 -1026 416 671 -887 -256 1158 -486
4006 -486 -659 568 512 -1062 -105 930 -577 -467 864 413 -712 287 881 -1031 -547 969 104 -962
4024 -962 885 816 -776 -163 1035 -264 -727 509 523 -830 -145 798 -788 -475 736 289 -894 340
4042 340 872 -835 -486 1295 258 -817 487 596 -862 -307 1159 -320 -704 564 389 -957 33
4059 33 945 -538 -594 893 67 -1174 6 1037 -499 -813 887 42 -1010 437 786 -899 -442
4076 -442 1195 -147 -1044 628 672 -788 -149 1111 -404 -741 886 303 -800 130 1077 -701 -666 1030
4094 1030 1 -1194 195 803 -726 -386 783 -136 -972 750 570 -908 222 962 -301 -732 682
4111 682 435 -983 -30 1043 -650 -765 844 -5 -968 338 545 -786 -277 1007 51 -933 531
4128 531 1052 -913 53 884 -558 -743 807 478 -806 99 1006 -602 -799 1246 29 -921 664
4145 664 879 -673 -208 1162 81 -922 276 647 -647 -64 859 -216 -770 476 239 -883 91
4162 91 952 -634 -725 930 165 -975 352 803 -876 -468 798 -9 -931 426 579 -798 -296 897
4180 897 -122 -965 833 488 -984 12 967 -520 -597 993 105 -1051 159 726 -429 -644 778
4197 778 -105 -831 450 738 -808 -253 1038 -382 -741 666 471 -941 255 992 -582 -668 973
4214 973 319 -1101 209 885 -601 -343 1040 6 -985 282 566 -490 -59 1110 -374 -854 696
4231 696 275 -1118 -87 766 -272 -852 870 171 -966 96 804 -500 -729 910 192 -834 656
4248 656 598 -736 -305 795 -79 -863 613 251 -1103 57 913 -504 -713 812 287 -1098 58
4265 58 853 -764 -615 761 104 -757 750 579 -681 -349 1007 -76 -931 696 689 -935 -58 1105
4283 1105 -315 -654 1051 178 -775 608 776 -358 -626 868 7 -1196 319 805 -820 -414 931
4300 931 -160 -908 683 507 -1096 47 879 -281 -803 745 454 -991 -23 710 -413 -559 1160
4317 1160 14 -998 692 570 -749 -346 696 -137 -1024 732 682 -811 -325 898 -517 -887 732
4334 732 286 -1023 271 955 -734 -694 1007 323 -1062 386 1122 -329 -375 831 93 -751 646 435
4352 435 -857 37 726 -335 -757 591 72 -999 -17 802 -442 -675 773 -35 -747 240 782 -461
4370 -461 -498 921 -2 -967 473 931 -849 -29 1121 -259 -559 692 554 -740 189 892 -339 -741
4388 -741 984 230 -806 320 875 -566 -495 786 -185 -1011 485 595 -795 -149 763 -272 -472 684
4406 684 377 -797 -221 1123 -363 -730 585 -8 -1119 555 930 -638 -478 797 -62 -919 542
4423 542 439 -728 -276 821 -390 -820 448 299 -914 -10 422 -505 -625 706 145 -793 207 671
4441 671 -672 -695 856 164 -750 295 867 -481 -91 914 49 -767 479 482 -940 -12 556 -316 -388
4460 -388 568 481 -833 411 589 -668 -338 722 284 -562 245 773 -474 -374 837 -28 -895 401
4478 401 465 -781 -105 844 -403 -657 684 499 -729 169 777 -738 -258 813 336 -917 294 617
4496 617 -673 -450 1145 158 -666 433 635 -666 23 775 -382 -704 624 518 -851 322 765
4513 765 -573 -806 745 12 -842 167 703 -438 -576 911 -116 -611 290 496 -698 -240 737 -447
4531 -447 -613 567 214 -832 88 1025 -231 -471 923 443 -768 407 679 -577 -204 623 -159 -458
4549 -458 668 550 -761 -34 587 -250 -764 531 292 -896 227 869 -625 -455 759 311 -741
4566 -741 -64 615 -427 -519 552 -10 -692 471 374 -526 -525 657 -172 -630 626 485 -623 -110 867
4585 867 -390 -591 573 -74 -601 76 758 -583 -732 600 -48 -579 434 570 -592 -285 779 -22
4603 -22 -857 330 458 -623 -162 597 -267 -568 628 256 -991 133 426 -576 -524 788 -18 -792
4621 -792 374 550 -750 -178 726 -38 -971 441 325 -414 53 663 -237 -514 896 146 -679 260 831
4640 831 -381 -402 649 -108 -690 435 446 -536 -299 857 -261 -934 530 375 -945 -192 643 -349
4658 -349 -541 425 171 -777 165 584 -472 -443 574 107 -539 194 632 -461 -458 645 -12 -530 385 358
4678 358 -637 -66 702 -480 -607 706 184 -767 -236 595 -349 -742 750 146 -950 300 673 -641
4696 -641 -555 859 51 -608 210 500 -568 11 941 -297 -813 587 354 -751 22 631 -380 -402 668
4715 668 297 -581 38 672 -524 -85 650 -61 -546 305 146 -597 -104 883 -106 -513 373 420 -479 120
4735 120 965 -111 -246 809 112 -731 158 566 -465 -198 606 -282 -596 381 316 -700 -408 724 -19
4754 -19 -483 520 483 -643 -90 672 -114 -623 683 237 -603 153 467 -683 -123 573 58 -808 358
4773 358 586 -605 -267 592 -245 -781 209 257 -767 -13 622 -405 -625 611 42 -588 136 626 -551
4792 -551 -402 382 -16 -739 305 453 -597 -169 808 -111 -719 307 613 -614 -56 503 -474 -461 597
4811 597 132 -590 157 423 -514 -284 544 251 -499 271 583 -236 -160 667 108 -406 457 328 -522 -146
4831 -146 642 -113 -455 499 297 -616 0 534 -413 -347 359 32 -561 106 502 -633 -530 472 -142 -490
4851 -490 299 618 -587 -164 827 -274 -541 565 162 -409 251 474 -189 -283 576 -62 -620 408 691
4870 691 -735 -199 732 -122 -399 313 333 -386 5 370 -169 -403 458 533 -373 62 753 -343 -238 622
4890 622 27 -576 296 560 -310 -148 748 74 -463 279 519 -464 -55 630 -279 -507 389 407 -603 -83
4910 -83 559 -467 -519 669 37 -662 66 726 -142 -505 592 131 -596 225 679 -365 -378 760 -1
4929 -1 -188 474 500 -556 -290 682 -370 -449 406 201 -725 -62 557 -445 -441 744 240 -862 -59 544
4949 544 -574 -301 388 -230 -674 402 125 -901 42 595 -503 -457 524 372 -477 131 730 -138 -487
4968 -487 559 -37 -562 230 546 -155 -274 555 -27 -524 261 384 -561 -185 574 -187 -381 367 207 -697
4988 -697 35 520 -453 -427 370 119 -320 226 495 -501 -330 489 -4 -472 283 305 -752 -181 591 -97
5008 -97 -416 324 444 -623 -89 598 -440 -483 430 281 -621 91 372 -387 -274 528 -182 -449 91 131
5028 131 -374 -76 571 -8 -552 331 315 -1005 91 846 -179 -480 852 -51 -453 -59 740 -174 -542
5047 -542 459 -123 -500 20 403 -587 -292 661 -124 -279 349 404 -507 93 486 -279 -560 501 356 -628
5067 -628 76 398 -113 -200 578 99 -556 428 337 -558 -245 275 -239 -377 515 219 -592 203 586 -217 -427
5088 -427 522 257 -696 263 535 -365 -234 650 34 -422 32 422 -447 -285 523 -162 -680 34 310 -528
5108 -528 -11 812 6 -362 531 236 -505 -189 660 -166 -417 575 4 -498 265 663 -328 -278 523 -174
5128 -174 -522 293 211 -773 -361 464 -425 -483 416 368 -591 -141 625 -98 -609 701 185 -622 464 446 -449
5149 -449 -249 674 149 -399 409 599 -594 -300 435 -254 -317 448 302 -628 140 510 -323 -588 462 48
5169 48 -488 481 608 -587 -270 538 -146 -838 274 344 -373 -191 679 -46 -600 376 243 -453 -13 468
5189 468 -281 -406 518 195 -678 164 132 -239 -320 477 -190 -504 293 323 -341 -417 526 -133 -360 257 212 -657
5211 -657 -107 756 -288 -482 470 513 -364 113 570 -249 -340 763 3 -638 383 509 -410 -242 622 -191
5231 -191 -367 530 211 -702 -113 677 -176 -419 523 164 -671 139 706 -346 -501 589 41 -343 104
5250 104 565 -207 -403 366 -115 -534 261 206 -427 116 457 -105 -422 470 203 -652 50 441 -581 -423
5270 -423 323 -14 -541 122 763 -324 -293 751 -17 -609 130 537 -404 -33 547 -97 -566 496 414 -669
5290 -669 -74 472 -464 -471 414 22 -958 232 274 -195 -296 582 -116 -665 487 343 -224 -44 706 -59
5310 -59 -482 135 452 -386 101 661 -316 -388 751 6 -503 163 504 -478 -417 428 61 -434 59 396 -515
5331 -515 -270 601 -63 -386 431 263 -737 136 585 -514 -284 595 -82 -445 238 458 -367 -335 349 235
5351 235 -776 332 573 -692 152 568 -161 -690 456 436 -756 149 621 -221 -452 731 241 -533
5369 -533 372 615 -90 -152 450 121 -568 301 501 -459 -105 748 -69 -760 276 336 -524 263 726 -213
5389 -213 -366 567 229 -390 292 403 -828 -226 623 -7 -761 403 369 -469 -267 301 -170 -568 609
5408 609 559 -549 -257 674 -176 -388 504 292 -400 181 361 -303 -246 472 174 -721 61 459 -568 -498
5428 -498 526 -310 -546 510 417 -549 51 865 -225 -477 470 296 -695 -16 705 -390 -304 568 219
5447 219 -444 36 239 -404 -209 585 190 -548 351 301 -580 -56 576 -146 -557 298 123 -450 173 451
5467 451 -249 -313 627 -55 -546 590 535 -121 -426 584 -240 -471 370 542 -409 -63 570 -5 -885 491
5487 491 272 -715 206 580 -262 -362 809 -55 -762 265 742 -385 -324 718 12 -574 451 407 -446
5506 -446 -53 939 -28 -243 425 260 -290 3 932 -229 -517 436 212 -689 52 458 -596 -280 654
5525 654 -75 -610 224 288 -608 8 835 -206 -717 491 293 -440 -87 494 -361 -411 231 40 -459 354
5545 354 701 -453 -97 463 -274 -718 72 461 -631 -404 552 -301 -588 535 192 -795 267 590 -333
5564 -333 -236 652 -73 -200 438 319 -473 -480 798 -101 -551 174 111 -548 -81 510 -108 -294 444 434 -579
5585 -579 -26 490 -21 -798 529 -110 -743 -105 507 -452 -341 711 190 -701 292 216 -425 -32 667 -229
5605 -229 -499 712 192 -534 4 455 -174 -470 582 555 -679 286 534 -584 -203 441 -118 -654 241
5624 241 482 -509 -5 439 -233 -816 356 308 -456 -68 714 -333 -311 577 87 -395 20 530 -585 -361
5644 -361 590 163 -797 301 370 -429 -420 499 24 -420 564 189 -533 -343 425 96 -180 564 196 -536 234
5665 234 693 -309 -347 537 83 -414 292 185 -641 -416 568 90 -751 374 111 -579 49 528 -431 -325
5685 -325 557 229 -868 78 251 -349 -392 549 -42 -342 258 728 -392 -75 840 77 -626 324 368 -724
5705 -724 -115 398 -284 -286 500 255 -602 179 635 -91 -351 532 213 -485 193 384 -436 115 491 -148 -617
5726 -617 385 214 -602 -134 541 -160 -571 618 230 -669 123 941 -186 -308 428 146 -827 19 398
5745 398 -590 -255 730 141 -400 397 243 -641 -389 553 -194 -439 466 196 -545 42 528 -261 -576 322
5765 322 -101 -604 145 601 -654 -160 832 -25 -422 146 696 -526 -242 551 -200 -547 285 241 -470 166
5785 166 647 -569 -384 604 285 -571 272 344 -213 -94 764 -41 -268 246 491 -587 -53 602 225 -404
5805 -404 235 169 -911 -25 606 -454 -607 537 284 -488 248 615 -182 -44 294 30 -600 343 366 -435
5825 -435 -25 598 -160 -558 421 85 -600 -5 432 -344 -349 537 153 -657 318 450 -305 -234 643 55 -502
5846 -502 361 610 -460 -380 719 -107 -777 103 303 -621 20 451 -230 -668 587 120 -643 158 477
5865 477 -435 -233 582 -201 -520 123 569 -548 -216 639 -94 -347 356 416 -315 -238 343 -311 -220 630 206
5886 206 -300 -27 776 -359 -165 657 115 -591 -112 455 -493 -218 456 -81 -794 307 285 -475 -1 428
5906 428 -123 -543 612 120 -566 -40 392 -399 -441 460 -170 -558 345 450 -316 -249 806 73 -368 394
5926 394 574 -390 -59 412 -341 -328 570 120 -388 6 450 -365 -630 681 -116 -550 308 170 -659 -429
5946 -429 480 -108 -552 227 394 -589 -261 492 -115 -629 614 46 -559 132 533 -237 -371 436 292 -467
5966 -467 56 547 -527 -247 621 242 -628 130 184 -631 -296 614 -224 -602 427 215 -593 31 491 -404
5986 -404 -276 559 -16 -522 123 563 -375 -235 584 -176 -505 271 152 -617 -25 526 -203 -325 381 165
6006 165 -846 34 446 -320 -120 508 191 -740 77 772 -486 -244 467 -18 -416 307 274 -444 67 389
6026 389 -83 -562 221 216 -432 -56 269 -177 -277 406 73 -381 68 549 -242 -324 449 244 -585 109 564
6047 564 -378 -162 494 -23 -163 436 188 -381 129 265 -262 -445 479 144 -585 42 526 -360 -190 424
6067 424 155 -381 88 458 -623 -198 213 -292 -461 217 62 -558 -8 529 -348 -284 367 245 -547 354
6087 354 588 -475 -365 435 90 -558 272 436 -355 137 601 -339 -496 430 439 -680 -52 520 -170 -772
6107 -772 471 321 -521 304 581 -230 -387 427 72 -564 -30 375 -290 -211 298 41 -563 402 303 -443
6127 -443 -5 422 -277 -459 599 -46 -569 233 428 -196 -352 510 -174 -545 283 453 -794 -356 418
6146 418 90 -300 439 256 -435 -422 338 -103 -336 366 338 -608 98 504 -408 -288 647 80 -507 55 421
6167 421 -516 -368 401 69 -339 402 410 -508 -105 777 -239 -292 240 180 -586 -55 513 -314 -482 267 43
6188 43 -506 102 211 -280 -391 419 44 -574 246 366 -256 77 439 39 -521 306 241 -504 86 384 -160
6209 -160 -449 573 448 -374 -43 621 -76 -134 512 59 -440 272 405 -435 -115 325 -13 -415 322 421
6229 421 -547 89 618 -445 -407 438 130 -372 34 443 -283 -455 650 223 -346 396 173 -464 56 340
6249 340 -23 -351 236 237 -438 14 488 -122 -238 355 75 -613 -216 263 -397 -388 499 -72 -504 75 386
6270 386 -430 -206 252 -241 -669 558 426 -463 -157 330 -265 -350 565 -93 -490 12 498 -366 -456 263
6290 263 163 -492 123 209 -407 -244 391 86 -475 243 257 -302 73 723 -126 -449 444 173 -252 44 323
6311 323 -234 -268 181 63 -488 -80 444 -366 -208 635 -5 -439 217 146 -308 -109 304 -115 -371 427 326
6332 326 -588 109 177 -345 -228 351 16 -488 12 202 -253 -307 601 -25 -324 453 599 -229 -62 396 -287
6353 -287 -495 581 284 -505 147 220 -142 -121 409 1 -636 -1 390 -291 -219 346 28 -455 321 393 -336
6374 -336 -175 525 -163 -420 430 236 -586 168 500 -121 -281 260 118 -490 212 556 -459 -171 495 117
6394 117 -522 -49 464 -547 -286 357 89 -194 302 266 -416 -188 470 -203 -460 276 -41 -550 154 494
6414 494 -225 -167 342 96 -346 49 364 -399 6 318 -25 -460 484 326 -424 -165 444 -241 -415 389
6434 389 10 -358 117 389 -130 -324 587 164 -539 270 534 -371 -399 495 -160 -305 5 465 -429 -143
6454 -143 336 149 -357 131 291 -377 272 304 -208 -322 455 125 -341 322 531 -632 -136 343 37 -284
6474 -284 189 448 -439 154 362 -64 -460 297 353 -432 43 438 -260 -256 559 -73 -632 -144 399 -451 -228
6495 -228 135 172 -496 219 360 -412 -242 273 -155 -388 383 259 -445 148 484 -2 -559 350 114 -407
6515 -407 134 208 -475 -330 528 205 -421 157 417 -105 65 235 -90 -573 355 254 -332 -57 342 -83
6535 -83 -366 285 74 -353 133 201 -306 -526 396 318 -446 175 171 -364 -127 476 27 -282 674 190 -198 60
6557 60 138 -265 -145 388 73 -616 146 253 -123 -405 419 140 -548 176 301 -324 -40 424 -129 -273 294
6578 294 81 -226 -112 645 55 -517 344 125 -479 -277 186 -203 -47 523 -11 -315 175 455 -340 -315
6598 -315 340 -40 -525 62 377 -478 69 465 62 -413 433 282 -480 120 678 -340 -202 402 193 -357
6618 -357 63 397 -280 -177 312 -2 -274 155 281 -544 0 643 -144 -465 120 169 -312 -165 449 -91
6638 -91 -332 393 6 -330 176 381 -448 127 542 -53 -473 264 212 -566 -249 509 -270 -336 269 338 -403
6659 -403 152 345 -267 -375 410 45 -454 304 567 -359 -60 384 164 -425 154 377 -226 -288 631 -296
6679 -296 -364 183 173 -288 5 363 -416 -337 318 162 -636 139 295 -528 9 192 87 -232 161 316 -430
6700 -430 -248 570 18 -486 394 331 -119 -200 425 -155 -370 563 145 -486 94 191 -594 -581 225 85 -380
6721 -380 130 247 -74 -279 381 69 -405 52 339 -478 -228 510 81 -384 157 43 -420 -90 393 -151
6741 -151 -100 280 -15 -417 148 125 -77 -243 412 -191 -572 255 124 -380 -177 621 -425 -311 453 6
6761 6 -214 -135 332 -147 -391 456 71 -635 44 368 -292 -138 422 87 -491 552 366 -405 -267 390 -97
6782 -97 -433 376 135 -433 -197 521 -283 -189 174 179 -477 156 394 -211 -181 512 71 -509 341 391 -360 -168
6804 -168 283 -103 -336 25 73 -547 -208 532 -122 -539 169 113 -540 303 432 -441 -128 485 53 -442 130
6825 130 231 -412 -228 493 -215 -284 451 260 -438 -123 409 -160 -498 377 144 -495 177 406 -317 -445
6845 -445 649 -198 -599 159 295 -332 -166 563 -167 -292 479 237 -304 -105 303 -433 -519 317 183 -602
6865 -602 62 624 -310 -85 396 319 -461 95 376 -555 -330 705 -167 -548 215 374 -430 -128 352 -99
6885 -99 -297 266 -20 -520 -39 428 -253 -310 441 366 -305 225 188 -180 -125 388 -249 -609 320 86 -486 -261
6907 -261 226 -214 -433 357 44 -346 307 479 -464 -480 497 179 -305 191 450 -244 -91 314 -50 -353
6927 -353 414 182 -433 -103 425 -52 -453 180 238 -500 79 466 -300 -246 588 198 -23 184 404 -288 -120
6948 -120 511 285 -359 329 300 -499 91 535 -309 -473 154 261 -471 40 355 -230 -328 516 -19 -400 366
6969 366 495 -524 -443 423 57 -412 306 537 -343 -106 482 -207 -474 93 319 -633 119 540 -73 -412
6989 -412 337 73 -131 305 346 -343 -373 542 57 -311 376 201 -676 -128 361 167 -206 259 228 -359 -37
7010 -37 485 -249 -259 79 264 -316 -12 183 -441 -163 449 129 -269 86 506 -235 79 298 100 -330 126
7031 126 260 -443 -53 441 -330 -259 453 48 -443 123 270 -228 -439 317 -66 -268 182 319 -312 -90
7051 -90 648 -153 -535 448 230 -290 -68 -5 -260 -145 327 194 -508 231 284 -210 -110 406 70 -367 219
7072 219 388 -411 9 287 -239 -484 57 378 -351 -283 507 -98 -210 121 176 -282 263 269 -285 -29 470
7093 470 234 -259 -77 58 -339 -57 552 -192 -315 120 454 -479 -413 553 -162 -379 262 173 -492 236 322
7114 322 -190 -37 269 -74 -489 -32 528 -654 -85 482 123 -255 201 235 -489 -88 282 -96 -439 122
7134 122 84 -238 107 433 -164 -327 62 -147 -541 266 399 -447 -98 488 179 -513 217 539 -203 -368
7154 -368 128 -89 -334 285 -78 -256 143 345 -480 -144 -7 24 -322 380 249 -24 -202 446 165 -531
7174 -531 63 84 -304 -206 480 -336 -563 300 63 -419 161 197 -38 -393 282 200 -262 79 430 -197 -139 530
7196 530 -196 -397 366 224 -662 -258 340 87 -454 290 277 -279 -48 317 -186 -533 528 11 -491 228
7216 228 352 -150 -70 507 292 -542 51 433 -337 13 413 43 -215 389 197 -405 -61 41 -199 -229 385
7237 385 -103 -369 -34 230 -235 -222 303 -212 -496 357 321 -273 -661 403 -61 -331 360 222 -361 67
7257 67 598 -512 -417 243 293 -309 -82 233 -279 -253 301 -212 -370 -83 105 -258 -88 281 -45 -335 211
7278 211 250 -477 -213 191 15 -516 307 162 -201 -62 176 -233 -243 405 36 -523 28 280 -171 -23 220
7299 220 -97 -464 360 -51 -445 62 399 18 -205 91 139 -270 -7 324 -155 -282 263 52 -351 260
7319 260 429 -75 -350 324 -223 -158 233 317 -398 -142 333 -174 -226 167 367 -376 157 603 -64 -384 319
7340 319 286 -321 -28 455 157 43 445 -52 -449 179 -129 -439 -18 26 -10 -689 60 -12 -339 -162 229
7361 229 -109 -460 328 71 -323 -65 535 -367 -301 92 30 -216 123 388 -198 -146 160 -122 -203 333 246 -324
7383 -324 201 520 -108 -206 246 -43 -293 -99 391 -278 -106 251 131 -316 78 399 -510 91 573 -178
7403 -178 -458 134 244 -685 -134 174 -247 -93 448 49 -197 228 402 112 -86 494 -1 -115 319 393
7423 393 -373 -42 382 -108 -391 -40 311 -396 -15 368 34 -216 249 136 -285 -81 318 -289 -7 251
7443 251 99 -175 184 470 -106 -194 302 155 -480 109 380 -296 -181 221 70 -223 235 71 -490 101
7463 101 152 -259 -372 219 198 -536 32 125 -448 -71 336 64 -190 -50 387 -61 -55 241 -310 -11 259 352
7485 352 -145 -175 134 -72 -54 313 -29 -212 -4 176 -324 -229 415 230 -173 246 168 -178 -135 134 7 -247
7507 -247 259 50 -303 38 472 -138 -182 410 189 -304 26 435 -347 -210 239 181 -487 78 311 -281 -258
7528 -258 364 29 -325 170 226 -207 102 340 -165 -77 -16 44 -91 81 375 -117 -197 93 48 -126 308 202
7550 202 -160 -132 297 60 -367 75 356 -211 -138 295 -196 -281 237 98 -502 -66 337 -44 -85 162 -128
7571 -128 -127 -233 150 -273 -76 455 -25 -112 -66 95 -118 -71 174 -180 -246 321 159 -252 95 384 -228 -51
7593 -51 343 86 -417 143 276 -115 -122 188 -65 -201 334 259 -178 114 195 -85 -208 142 61 -182 280 195
7615 195 7 -88 236 349 -546 -130 486 -103 -552 364 -41 -176 300 352 -295 -41 176 121 -209 76 353
7636 353 -454 167 493 -46 -99 -51 -34 -173 -34 502 -209 -89 164 -135 -405 202 169 -325 -57 308 174
7657 174 -199 57 0 -216 -32 361 -166 -426 135 157 -358 -15 405 -131 -80 276 196 -284 351 296 -111 -354
7679 -354 310 160 -443 250 197 -280 -162 337 -40 -134 240 -18 -366 -178 335 -184 -303 284 193 -209 -29
7700 -29 196 -122 -121 313 -185 -155 224 186 -215 -32 308 -9 -191 78 315 -347 -77 399 -283 -476 477 -98
7722 -98 -317 -77 356 -345 -226 243 103 -278 294 -120 -188 86 244 148 -249 217 226 -167 60 368 -208 -419
7744 -419 430 -51 -487 178 332 -316 -146 246 -111 -128 296 345 -241 -102 263 -158 -400 42 142 -74 38
7765 38 232 -51 -404 158 91 29 90 150 -194 -219 402 -40 -40 134 -49 -172 42 200 -231 -146 196 169 -389
7788 -389 -107 168 -305 -139 114 -22 -162 -37 134 -295 -246 405 -65 -214 -151 302 -242 -110 410 -70 -158
7809 -158 171 227 -250 137 313 -125 -352 322 116 -16 1 117 -215 88 214 248 -133 97 122 -243 -2
7830 -2 199 51 -149 167 333 -206 -184 462 38 -255 197 263 -151 226 230 129 -116 420 11 -404 364 627
7852 627 0 171 307 26 -123 322 296 -437 -29 307 -103 -278 80 -4 -219 48 661 49 -333 216 38
7873 38 13 107 411 -300 6 244 -242 -335 -13 85 -305 -110 122 -68 67 221 126 -170 -42 112 23 -152
7895 -152 157 88 -15 146 33 -310 -29 185 15 -260 34 284 -170 -193 37 -332 -314 42 313 -194 102
7916 102 186 -357 -189 143 188 -244 214 180 -324 -26 338 114 -251 -73 24 -89 167 286 -64 -167 180
7937 180 124 -92 85 282 143 -19 353 122 -353 -39 194 -262 30 226 61 -113 230 324 -529 -82 372
7958 372 -76 7 111 -4 -48 225 549 -144 -229 308 181 -175 180 227 12 -218 162 76 -348 312 182 -140
7980 -140 -213 552 105 -350 67 60 -62 -325 155 63 -363 44 11 -195 -165 373 -213 -220 284 370 -253 -137 202
8003 202 -245 -25 372 50 -169 220 238 -388 -180 334 -96 -153 72 198 -324 -115 270 -127 -50 346 25
8024 25 -383 -57 441 52 -129 226 79 -158 37 -133 -50 -64 237 132 -375 148 58 -103 -55 178 -176 -274
8046 -274 139 44 -387 2 548 86 -479 163 123 -365 36 98 63 -281 537 -42 -72 395 73 -290 -182 69
8068 69 58 -176 146 263 -224 -34 398 -29 -171 307 -121 -584 151 125 -44 51 -10 90 -296 187 78 -229
8090 -229 90 395 14 -346 203 -54 -162 -152 405 -118 -182 361 28 59 87 247 -236 -150 247 83 -194 -155
8112 -155 277 -103 -50 48 42 -203 104 8 -196 111 288 40 -396 54 -211 -472 304 56 51 83 325 286 -188
8135 -188 2 31 -39 -207 52 -195 -373 179 79 -195 -180 167 -101 -94 196 119 -167 -82 480 -236 -107 180
8157 180 -89 -250 -184 174 -130 -74 286 -59 -119 144 61 -591 139 191 -47 -387 18 232 -186 -139 51 -397
8179 -397 -148 186 115 -144 143 429 -105 265 181 -13 -332 -64
8191f4
##END NTUPLES=NMR FID
##END=
