##TITLE=1H_ABBC1202
 CDCl3
 8 sc, 
 13.2.2024
##JCAMPDX= 6.0         $$ Bruker NMR JCAMP-DX V2.0
##DATA TYPE= NMR FID
##DATA CLASS= NTUPLES
##ORIGIN= UXNMR, Bruker Analytische Messtechnik GmbH
##OWNER= root
$$ XWIN-NMR		Version 3.5
$$ Tue Feb 13 13:56:30 2024 Russian Standard Time (UT+4h)  she@DPX200
##.OBSERVE FREQUENCY= 200.1313
##.OBSERVE NUCLEUS= ^1H
##.DELAY= (6, 6)
##.ACQUISITION MODE= SIMULTANEOUS
##.ACQUISITION SCHEME= undefined
##.AVERAGES= 8
##.DIGITISER RES= 18
##SPECTROMETER/DATA SYSTEM= spect
##.PULSE SEQUENCE= zg30
##.SOLVENT NAME= D2O
##.SHIFT REFERENCE= (INTERNAL, D2O, 0, 15.7039)
##AUDIT TRAIL= $$ (NUMBER, WHEN, WHO, WHERE, WHAT)
$$ ##TITLE= Audit trail, XWIN-NMR		Version 3.5
$$ ##JCAMPDX= 5.01
$$ ##ORIGIN= Bruker BioSpin GmbH
$$ ##OWNER= she
$$ F:/spectra/data/she/nmr/H-F/1/audita.txt
$$ ##AUDIT TRAIL=  $$ (NUMBER, WHEN, WHO, WHERE, WHAT)
(   1,<2024-02-13 13:54:20.82 +0400>,<she>,<DPX200>,
      <created by zg, POWCHK disabled, PULCHK disabled
       configuration hash MD5:
       00 E9 B6 7A A2 85 ED C7 34 08 36 98 17 FE 4E 26
       data hash MD5: 16K
       64 7C A5 BC A3 40 94 8F CA 56 AA 2D 84 8C 68 8D>)
$$ ##END=
$$ 
$$ hash MD5
$$ C7 C4 E6 63 5E A0 8C B3 30 B6 3F 37 32 85 9F 2B
##$RELAX= 
##$RELAX= 
##$RELAX= 
##$RELAX= 
##$RELAX= 
##$RELAX= 
$$ Bruker specific parameters
$$ --------------------------
##$DU= <F:/spectra>
##$EXPNO= 1
##$NAME= <H-F>
##$PROCNO= 1
##$TYPE= <nmr>
##$USER= <she>
##$AMP= (0..31)
100 100 100 100 100 100 100 100 100 100 100 100 100 100 100 100 100 100 
100 100 100 100 100 100 100 100 100 100 100 100 100 100 
##$AQSEQ= 0
##$AQ_mod= 1
##$AUNM= <au_zg>
##$AUTOPOS= <>
##$BF1= 200.13
##$BF2= 200.13
##$BF3= 200.13
##$BF4= 200.13
##$BF5= 200.13
##$BF6= 200.13
##$BF7= 200.13
##$BF8= 200.13
##$BYTORDA= 1
##$CFDGTYP= 0
##$CFRGTYP= 5
##$CHEMSTR= <none>
##$CNST= (0..31)
1 1 145 1 1 1 1 1 1 1 1 1 1 1 1 1 1 1 1 1 1 1 1 1 1 1 1 1 1 1 1 1 
##$CPDPRG= <>
##$CPDPRG1= <>
##$CPDPRG2= <>
##$CPDPRG3= <>
##$CPDPRG4= <mlev>
##$CPDPRG5= <mlev>
##$CPDPRG6= <mlev>
##$CPDPRG7= <mlev>
##$CPDPRG8= <mlev>
##$CPDPRGB= <>
##$CPDPRGT= <>
##$D= (0..31)
0 1.2 0 0 0 0 0 0 0 0.06 0 0.03 0 0 0 0 0.0002 0 0 0 0 0 0 0 0 0 0 0 0 
0 0 0 
##$DATE= 1707818060
##$DBL= (0..7)
120 120 120 120 120 120 120 120 
##$DBP= (0..7)
150 150 150 150 150 150 150 150 
##$DBP07= 0
##$DBPNAM0= <>
##$DBPNAM1= <>
##$DBPNAM2= <>
##$DBPNAM3= <>
##$DBPNAM4= <>
##$DBPNAM5= <>
##$DBPNAM6= <>
##$DBPNAM7= <>
##$DBPOAL= (0..7)
0.5 0.5 0.5 0.5 0.5 0.5 0.5 0.5 
##$DBPOFFS= (0..7)
0 0 0 0 0 0 0 0 
##$DE= 6
##$DECBNUC= <off>
##$DECIM= 32
##$DECNUC= <off>
##$DECSTAT= 4
##$DIGMOD= 1
##$DIGTYP= 9
##$DL= (0..7)
0 120 120 120 120 120 120 120 
##$DP= (0..7)
150 150 150 150 150 150 150 150 
##$DP07= 0
##$DPNAME0= <>
##$DPNAME1= <>
##$DPNAME2= <>
##$DPNAME3= <>
##$DPNAME4= <>
##$DPNAME5= <>
##$DPNAME6= <>
##$DPNAME7= <>
##$DPOAL= (0..7)
0.5 0.5 0.5 0.5 0.5 0.5 0.5 0.5 
##$DPOFFS= (0..7)
0 0 0 0 0 0 0 0 
##$DQDMODE= 0
##$DR= 18
##$DS= 0
##$DSLIST= <SSSSSSSSSSSSSSS>
##$DSPFIRM= 0
$$ [...]
##$SUBNAM2= <"">
##$SUBNAM3= <"">
##$SUBNAM4= <"">
##$SUBNAM5= <"">
##$SUBNAM6= <"">
##$SUBNAM7= <"">
##$SUBNAM8= <"">
##$SUBNAM9= <"">
##$SW= 18.0517328524113
##$SWIBOX= (0..15)
0 0 2 0 0 0 0 0 0 0 0 0 0 0 0 0 
##$SW_h= 3612.71676300578
##$TD= 16384
##$TD0= 1
##$TE= 0
##$TE2= 300
##$TE3= 300
##$TEG= 300
##$TL= (0..7)
0 120 120 120 120 120 120 120 
##$TP= (0..7)
150 150 150 150 150 150 150 150 
##$TP07= 0
##$TPNAME0= <>
##$TPNAME1= <>
##$TPNAME2= <>
##$TPNAME3= <>
##$TPNAME4= <>
##$TPNAME5= <>
##$TPNAME6= <>
##$TPNAME7= <>
##$TPOAL= (0..7)
0.5 0.5 0.5 0.5 0.5 0.5 0.5 0.5 
##$TPOFFS= (0..7)
0 0 0 0 0 0 0 0 
##$TUNHIN= 0
##$TUNHOUT= 0
##$TUNXOUT= 0
##$USERA1= <user>
##$USERA2= <user>
##$USERA3= <user>
##$USERA4= <user>
##$USERA5= <user>
##$V9= 5
##$VALIST= <valist>
##$VCLIST= <CCCCCCCCCCCCCCC>
##$VD= 0
##$VDLIST= <DDDDDDDDDDDDDDD>
##$VPLIST= <PPPPPPPPPPPPPPP>
##$VTLIST= <TTTTTTTTTTTTTTT>
##$WBST= 1024
##$WBSW= 4
##$XGAIN= (0..3)
0 0 0 0 
##$XL= 0
##$YL= 0
##$YMAX_a= 144533
##$YMIN_a= -143869
##$ZGOPTNS= <>
##$ZL1= 120
##$ZL2= 120
##$ZL3= 120
##$ZL4= 120
##$ABSF1= 10
##$ABSF2= 0
##$ABSG= 5
##$ABSL= 3
##$ALPHA= 0
##$AQORDER= 0
##$ASSFAC= 0
##$ASSFACI= 0
##$ASSFACX= 0
##$ASSWID= 0
##$AUNMP= <proc_1d>
##$AZFE= 0.1
##$AZFW= 0.1
##$BCFW= 1
##$BC_mod= 2
##$BYTORDP= 1
##$COROFFS= 0
##$CY= 11.3945322036743
##$DATMOD= 1
##$DC= 2
##$DFILT= <>
##$DTYPP= 0
##$F1P= 15.7292609196834
##$F2P= 12.9074282941183
##$FCOR= 0.5
##$FTSIZE= 0
##$FT_mod= 4
##$GAMMA= 1
##$GB= 0.15
##$INTBC= 1
##$INTSCL= 1
##$ISEN= 128
##$LB= 0.24
##$LEV0= 0
##$LPBIN= 0
##$MAXI= 10000
##$MC2= 0
##$MEAN= 0
##$ME_mod= 0
##$MI= 1.114404
##$NCOEF= 0
##$NC_proc= 0
##$NLEV= 6
##$NOISF1= 3.799351
##$NOISF2= 2.8
##$NSP= 1
##$NTH_PI= 0
##$NZP= 0
##$OFFSET= 15.70392
##$PC= 1
##$PHC0= -24950.03
##$PHC1= 12.2527
##$PH_mod= 1
##$PKNL= yes
##$PPARMOD= 0
##$PSCAL= 0
##$PSIGN= 0
##$REVERSE= no
##$SF= 200.130013532006
##$SI= 16384
##$SIGF1= 3
##$SIGF2= 2
##$SINO= 400
##$SIOLD= 16384
##$SREGLST= <1H.CDCl3>
##$SSB= 0
##$STSI= 0
##$STSR= 0
##$SW_p= 3612.71676300578
##$SYMM= 0
##$S_DEV= 0
##$TDeff= 0
##$TDoff= 0
##$TI= <>
##$TILT= no
##$TM1= 0
##$TM2= 0
##$TOPLEV= 0
##$USERP1= <user>
##$USERP2= <user>
##$USERP3= <user>
##$USERP4= <user>
##$USERP5= <user>
##$WDW= 1
##$XDIM= 8192
##$YMAX_p= 0
##$YMIN_p= 0
$$ End of Bruker specific parameters
$$ ---------------------------------
##NTUPLES= NMR FID
##VAR_NAME=  TIME,          FID/REAL,        FID/IMAG
##SYMBOL=    X,             R,               I
##VAR_TYPE=  INDEPENDENT,   DEPENDENT,       DEPENDENT
##VAR_FORM=  AFFN,          ASDF,            ASDF
##VAR_DIM=   8192,          8192,            8192
##UNITS=     SECONDS,       ARBITRARY UNITS, ARBITRARY UNITS
##FACTOR=    0.0002768,     1,               1
##FIRST=     0,             0,               0
##LAST=      2.2672688,     0,               0
##MIN=       0,             -143869,         0
##MAX=       2.2672688,     144533,          0
$$ Real data points
##PAGE= N=1
##DATA TABLE= (X++(R..R)), XYDATA
0 0 0 0 0 0 0 0 0 0 0 0 0 0 0 0 0 0 0 0 0 0 8 -8 8 -8 8 -8 8 -9 16 -16 16 -17 23 -24 28 -31 33 -39 44 -46 52 -60
42 -60 63 -69 77 -85 94 -104 113 -124 138 -153 168 -185 205 -229 257 -290 326 -374 431 -506 606
63 606 -746 951 -1278 1861 -3106 6763 -37782 -143869 44607 92939 -112717 -84849 119618
76 119618 39753 -119604 26354 144533 -41734 -99620 93108 67266 -126870 -44465 109927
87 109927 -22026 -123614 49427 103338 -76534 -60239 117426 36682 -114242 12657 107950
98 107950 -55366 -95668 76748 60014 -101806 -25586 114347 -9227 -104684 51885 87217
109 87217 -83494 -60418 96796 20059 -108140 13050 102817 -47334 -83961 81017 58659
120 58659 -98755 -21028 105384 -15163 -97717 49041 82678 -74078 -55255 94469 21645
131 21645 -104800 10784 92761 -50034 -79196 71882 52163 -86013 -18013 98039 -8037
142 -8037 -88093 44154 73937 -70242 -50036 82106 16006 -88805 12400 83577 -38836
153 -38836 -67543 64875 45693 -81552 -17897 83030 -16784 -80078 41020 63401 -61060
164 -61060 -38642 79782 17439 -80352 16249 77195 -43933 -62366 61712 35152 -77892
175 -77892 -12495 78395 -15803 -73504 42569 60132 -62768 -36327 75855 8613 -77885
186 -77885 18092 70708 -40396 -54701 61307 36408 -71636 -9013 75264 -18602 -68967
197 -68967 39813 50124 -59392 -32356 66787 7955 -69874 17054 65132 -38484 -48532
208 -48532 57555 28821 -64510 -4396 66031 -17156 -58966 37826 45851 -54860 -27258 63151
220 63151 2165 -65189 19301 55340 -39910 -42254 53329 24002 -61605 -1232 64147 -19936
232 -19936 -54739 41963 41058 -54403 -20335 61287 -255 -61555 20241 53382 -41128 -41026 53737
245 53737 19413 -61880 1627 59432 -21861 -50691 39721 38896 -51012 -19405 60302 -279
257 -279 -58093 22391 49588 -39303 -35390 49432 16845 -56374 554 54502 -21603 -48350 37878
270 37878 33435 -49764 -14861 54629 -3380 -51044 22535 45327 -36299 -31043 49409 14245
282 14245 -53803 5648 50748 -24720 -42505 37574 27575 -48783 -12744 51937 -6877 -50768
294 -50768 25386 41726 -39353 -25713 49439 10073 -50439 8625 48921 -24377 -40235 38921
306 38921 25989 -49230 -9324 50288 -10321 -47465 24425 37264 -37720 -25141 46381 9435
318 9435 -49196 9657 46832 -24741 -35702 38241 23065 -44249 -7482 46875 -9073 -44470
330 -44470 24070 34854 -38097 -22249 44229 4617 -46290 10579 41693 -24727 -32991 37239
342 37239 21331 -43845 -3342 47020 -12040 -40662 27274 31089 -37809 -18563 43114 2408
354 2408 -46055 12126 40219 -28647 -30772 38773 16267 -43771 -544 44260 -13093 -38596
366 -38596 28262 30378 -37943 -15709 44461 -116 -43541 15131 36806 -28198 -28246 36255 14600
379 14600 -43102 -702 42384 -15515 -37016 28703 26579 -36534 -12429 41908 -233 -40147
391 -40147 15520 36322 -27906 -26047 37441 11501 -42091 2079 39171 -17174 -34714 27607
403 27607 24378 -37204 -11513 41754 -3010 -39635 18694 33986 -28770 -22056 37365 10499
415 10499 -40430 3673 39399 -18442 -33886 29539 21654 -38272 -9196 39714 -5453 -38349
427 -38349 17885 32365 -29080 -21743 38057 9394 -39795 6634 38211 -18516 -30457 29202
439 29202 20829 -36468 -8897 39138 -6004 -38393 18653 29929 -30423 -19906 36034 7109
451 7109 -38150 6383 36890 -18065 -29511 30539 20025 -36509 -5582 38683 -7788 -35747
463 -35747 19223 27838 -30195 -19409 35714 5299 -39174 8018 35458 -20781 -27213 30512
475 30512 17187 -35292 -4622 37992 -7526 -34606 20993 27906 -30475 -16382 35835 3227
487 3227 -37275 7975 32891 -20589 -27588 29210 16616 -35882 -3676 37373 -8982 -32555
499 -32555 21102 26198 -28684 -15683 34888 4433 -36241 9115 33012 -21245 -25959 29295
511 29295 13935 -35087 -3435 34739 -9622 -32651 20941 25622 -29553 -13493 35867 2119
523 2119 -34439 11067 31274 -21142 -24110 29287 13551 -34883 -1587 34958 -11810 -31027
535 -31027 21739 22076 -29994 -12800 33030 1068 -33931 11200 31324 -21185 -21730 30616 12267
548 12267 -33140 34 32849 -11341 -29784 20559 21759 -29644 -12684 33393 -223 -33472
560 -33472 11546 28699 -21269 -21283 28426 12313 -32264 132 33702 -10744 -28524 22132 20903
573 20903 -29038 -10900 31460 -1065 -32664 10614 27885 -21792 -20989 29099 10166 -32131
585 -32131 1732 31526 -12062 -26438 21543 19934 -27682 -9326 32565 -1343 -30998 13261
597 13261 25872 -22516 -18698 26911 7723 -31411 1049 29962 -12586 -26019 22425 18372
609 18372 -27734 -7076 30926 -2492 -28938 12880 25076 -21346 -17866 28032 7748 -31057
621 -31057 3089 28844 -14120 -24729 21109 16265 -27535 -7711 30270 -2596 -28779 14233
633 14233 24831 -21737 -15462 27793 6585 -29094 3434 27721 -13452 -24114 21577 15688
645 15688 -28056 -6356 28806 -4801 -27465 13205 22151 -21076 -14910 26948 6583 -28014
657 -28014 5158 27523 -13670 -21247 21383 13803 -26131 -5692 27089 -4735 -27078 13310
669 13310 21336 -21931 -13860 26181 4302 -26977 5372 25704 -13215 -20536 21361 14186 -25783
682 -25783 -3962 27770 -5623 -25063 14339 19396 -21414 -13176 24739 3521 -27185 5309
694 5309 25011 -14742 -19279 21650 11795 -24639 -2360 26238 -5475 -23480 14607 19187 -21236
707 -21236 -11168 24905 1575 -25752 6347 22009 -14799 -18055 20015 10503 -24537 -2104
719 -2104 25572 -6681 -22030 15569 17250 -20053 -9118 23946 1827 -24319 6569 22225
731 22225 -15126 -17338 20514 8803 -24461 -1159 23543 -7628 -21465 14337 16675 -20273
743 -20273 -9236 24476 895 -23707 8632 21217 -14889 -15244 20161 8541 -23259 -972
755 -972 23260 -8188 -21282 14978 14638 -20880 -7618 22461 -65 -22101 8072 20300 -14364
768 -14364 -14287 20706 7638 -22375 1336 22016 -8837 -18814 14371 13388 -19983 -7438 21812
781 21812 -1349 -22192 9010 18310 -15437 -12296 19845 6300 -21075 1823 21680 -8455
793 -8455 -18244 15950 12737 -20100 -5591 21501 -2659 -20831 8884 17163 -15724 -12983 19546
806 19546 5298 -22085 2655 20944 -9521 -16318 15824 11904 -18674 -4847 21383 -2066
818 -2066 -20541 9624 16725 -16063 -11423 19037 3724 -20753 2457 19076 -9494 -16488 15305
831 15305 11111 -19119 -3568 20763 -3093 -18509 10287 15488 -14817 -10121 18514 3755 -20711
844 -20711 3365 18697 -11034 -15249 15388 9063 -18879 -3111 19786 -3676 -18253 10691
856 10691 15363 -15465 -8866 19510 2349 -19180 4749 17545 -10499 -14519 14989 8606 -19346
869 -19346 -2598 19350 -5410 -17936 10961 13297 -15222 -7854 18433 2419 -18580 5018
881 5018 17867 -10755 -13206 15912 7509 -18182 -1513 17903 -5292 -16886 10342 12646 -15755
894 -15755 -7673 18249 758 -18157 5904 16051 -10564 -11545 15466 7506 -17257 -583 18547
907 18547 -5791 -16215 11701 11472 -15907 -6532 17176 -131 -17986 5431 15792 -11664 -11937
920 -11937 16007 6184 -17600 797 17856 -6009 -14767 11723 11479 -15450 -6085 17705 -766
933 -766 -17767 6641 14379 -12387 -10683 15087 5138 -17068 623 17225 -6479 -14463 12348
946 12348 10523 -15310 -4210 17241 -991 -15966 6880 13963 -11765 -10198 15376 3956 -17539
959 -17539 1463 15857 -7790 -13456 11793 9291 -14972 -4058 17196 -1314 -16042 8201
971 8201 13812 -12298 -8522 15714 3241 -16506 1795 15605 -7894 -13775 12169 8641 -15985
984 -15985 -3180 16641 -2641 -15336 8004 12899 -11925 -8392 15481 3660 -16258 3020
996 3020 15514 -8334 -12183 12049 7653 -14962 -3238 15372 -2885 -15452 7916 12183 -12584
1009 -12584 -7515 15288 2334 -15263 3541 14737 -7435 -11487 12388 7692 -15155 -2084
1021 -2084 15611 -4057 -14680 8447 10672 -12532 -7180 14420 1833 -15706 3742 14667
1033 14667 -8809 -10656 13109 6719 -14282 -1146 15344 -3573 -13971 8605 10988 -13139
1045 -13139 -6737 14850 736 -15286 4000 13167 -8875 -10544 12154 6339 -14382 -995 15560
1058 15560 -4052 -12924 9326 10112 -11850 -5529 14081 1115 -14580 3873 13040 -9166 -10446
1071 -10446 12201 4952 -14293 -206 13982 -4246 -12562 8917 9888 -12036 -5021 14753 319
1084 319 -14231 5297 12202 -9253 -9201 11964 4786 -14448 -503 14106 -5477 -12601 9647
1097 9647 8697 -12630 -4163 14003 -179 -13352 5339 12365 -9103 -8647 12853 4272 -13928
1110 -13928 888 13353 -5727 -11773 9072 7969 -12333 -4396 13622 -911 -13465 5841
1122 5841 11603 -9367 -7383 12433 3980 -12913 983 13352 -5336 -11509 9491 7669 -12699
1135 -12699 -3461 13070 -1796 -12722 5283 10589 -9370 -7639 12256 3364 -13317 1992 13039
1148 13039 -5982 -10177 9819 7269 -11754 -3169 12974 -1514 -12935 6019 10287 -10181 -7106
1161 -7106 11961 2268 -12976 1635 11996 -5779 -10146 9873 7192 -11744 -2128 12986 -1909
1174 -1909 -11606 6127 9589 -9429 -6729 11596 2277 -13057 1926 11802 -6851 -9574 9698
1187 9698 5778 -11570 -1715 12527 -1859 -11437 6671 9669 -9781 -5670 12124 1287 -12220
1200 -12220 2732 10923 -6755 -9289 9416 5456 -12061 -1525 12270 -3310 -10981 7051 8685
1213 8685 -9387 -4923 11845 1771 -11806 3111 11350 -6892 -8694 9941 4458 -11870 -1144
1226 -1144 11327 -3221 -10803 6249 8524 -9883 -4860 11708 878 -11458 3665 10450 -6403
1239 -6403 -7625 9636 5100 -10995 -896 11522 -3623 -10534 6926 7334 -9833 -4187 10674
1252 10674 533 -11234 3163 10380 -6878 -7450 10168 4116 -10846 453 11171 -3505 -9484
1265 -9484 6940 7362 -9741 -4257 10977 -447 -11322 3704 9272 -7530 -6822 9394 3526
1278 3526 -10493 272 10937 -3850 -9306 7817 6820 -9593 -2946 10729 -528 -10426 3788
1291 3788 8852 -7511 -6914 9570 3074 -10979 736 10452 -4372 -8579 7360 6351 -9191
1304 -9191 -2857 10839 -481 -10394 4777 8754 -7668 -5805 9327 2386 -10292 724 9793
1317 9793 -4646 -8836 7364 5764 -9882 -2132 10359 -1380 -9467 4788 8317 -7127 -5430
1330 -5430 9778 2548 -10513 1393 9695 -5190 -7950 7273 4882 -9422 -2296 9642 -1331
1343 -1331 -9869 4929 8074 -7571 -4928 9720 1825 -9635 1823 9192 -4636 -7684 7555
1356 7555 5030 -9651 -1736 9772 -2258 -9334 4786 6886 -7584 -5001 9159 1683 -9836
1369 -9836 2110 9401 -5131 -6928 8119 4450 -8942 -1021 9432 -2169 -9000 5134 6934
1382 6934 -8070 -4576 9217 666 -9546 2409 8560 -5017 -6552 7813 4499 -8754 -697
1395 -697 9845 -2405 -8466 5483 6462 -7538 -3972 8501 651 -9450 2016 8334 -5632
1408 -5632 -6665 7641 3575 -8877 -271 9120 -2221 -7992 5511 6450 -7587 -3572 9264 328
1422 328 -8994 2858 7567 -5649 -6025 7264 2962 -8981 -511 8924 -3053 -7952 5926 5736
1436 5736 -7563 -2680 8713 225 -8297 3066 7730 -5641 -5639 7820 2758 -9021 162 8289
1450 8289 -3508 -7357 5479 5352 -7565 -2990 8755 -50 -8469 3682 7512 -5681 -4848 7681
1464 7681 2622 -8135 317 8381 -3206 -7449 5457 4942 -8001 -2517 8183 -738 -8207 3153
1478 3153 7159 -5488 -5037 7758 2647 -8280 1009 8379 -3494 -6651 5783 4714 -7427 -2307
1492 -2307 8197 -999 -8232 3532 6638 -6306 -4548 7491 1686 -8079 991 7881 -3418 -6451
1506 -6451 6175 4797 -7567 -1451 8154 -1401 -7488 3731 6194 -5913 -4538 7155 1508 -8308
1520 -8308 1210 7500 -4173 -5897 6129 3973 -7102 -1293 8187 -1020 -7241 4142 6319 -6002
1534 -6002 -4027 7463 977 -7763 1340 6834 -4172 -5926 5821 3773 -7431 -977 8105 -1552
1548 -1552 -6936 4353 5865 -5892 -3307 7306 1154 -7898 1486 7040 -4385 -5786 6229 3024
1562 3024 -7620 -1126 7179 -1697 -7001 3989 5638 -5921 -3215 7619 879 -7199 2287 6804
1576 6804 -3901 -5079 6000 3224 -7385 -775 7447 -2230 -6863 4363 4840 -6158 -2645 6878
1590 6878 535 -7260 2080 6712 -4274 -4878 6450 2770 -7028 -56 7009 -2299 -6268 4276
1604 4276 4612 -6232 -3047 7141 16 -7415 2397 6085 -4605 -4556 5981 2689 -6728 88 7335
1619 7335 -2349 -6035 4712 4383 -5998 -2117 6620 -302 -6814 2119 5892 -4743 -4800 6088 2084
1634 2084 -6915 448 6746 -2615 -5412 4578 4449 -5719 -2130 7023 -170 -6924 2803 5643 -4884
1649 -4884 -4069 5790 1789 -6673 14 6443 -2600 -5809 4766 4004 -6032 -1447 6776 -585 -6093
1664 -6093 2915 5482 -4489 -3920 5980 1657 -6857 572 6038 -3297 -5367 4592 3413 -5912 -1726
1679 -1726 6400 -540 -6208 3161 5517 -4653 -3347 6145 1459 -6189 822 6057 -2899 -5192 4669
1694 4669 3332 -6227 -1324 6443 -1285 -6059 2865 4622 -4690 -3199 5909 1450 -6162 1171 6188
1709 6188 -3243 -4630 5069 2992 -5931 -1011 5957 -1149 -6031 2994 4637 -5127 -3040 5925 659
1724 659 -6120 1370 5482 -3084 -4331 4986 3131 -5630 -663 6279 -1309 -5691 3404 4154 -4845
1739 -4845 -2696 5540 600 -6124 1198 5405 -3376 -4487 5027 2533 -5533 -217 5917 -1339 -5172
1754 -5172 3528 4448 -4930 -2535 5783 234 -6080 1431 4960 -3642 -4102 4522 2344 -5701 -293
1769 -293 5914 -1763 -5222 3840 3859 -4808 -1969 5643 340 -5433 1714 5044 -3524 -4157 4855 1946
1785 1946 -5730 -166 5338 -2092 -4837 3330 3630 -4711 -2031 5828 316 -5448 2232 4837 -3609
1800 -3609 -3324 4686 1684 -5419 -83 5405 -2121 -4932 3647 3301 -4986 -1669 5308 -135 -5233
1815 -5233 1928 4647 -3482 -3236 4908 1796 -5338 626 5222 -2215 -4438 3452 3104 -4771 -1616
1830 -1616 5136 -461 -5384 2161 4300 -4028 -2899 4840 1465 -4840 560 5245 -1994 -4199 3895
1845 3895 3027 -4825 -1278 5184 -751 -5018 2179 3819 -3760 -3096 4664 1030 -5199 729 4938
1860 4938 -2473 -3790 3992 2971 -4503 -1152 5112 -647 -4702 2349 4002 -4018 -2757 4666 688
1875 688 -5146 794 4600 -2260 -3916 3641 2627 -4625 -782 5013 -844 -4578 2646 3701 -3642
1890 -3642 -2177 4529 795 -5090 673 4460 -2695 -3772 3724 2200 -4609 -706 4525 -723 -4487
1905 -4487 2524 3806 -3730 -2075 4787 373 -4557 1137 4174 -2319 -3467 3706 2089 -4735 -796
1920 -796 4651 -1245 -4380 2658 3342 -3674 -1936 4472 499 -4334 1251 4559 -2583 -3093 3933 1866
1936 1866 -4527 -250 4385 -1457 -4099 2338 3042 -4052 -1972 4361 58 -4541 1419 3942 -2557
1951 -2557 -2861 3786 1802 -4100 -127 4412 -1439 -3950 2838 2815 -4042 -1482 4204 -112 -4522 1330
1967 1330 3909 -2674 -2910 3894 1685 -4393 288 4335 -1460 -3609 2848 3062 -3543 -1408 4248
1982 4248 -129 -4381 1635 3487 -3140 -2713 3501 1184 -4183 68 4074 -1534 -3627 3085 2673
1997 2673 -3736 -1062 4275 -165 -3916 1681 3342 -2906 -2654 3699 1266 -4458 336 4058 -1856
2012 -1856 -3383 2864 2293 -3620 -986 4117 -284 -3980 1885 3467 -2980 -2222 3772 873 -4166
2027 -4166 309 3875 -1779 -3460 2753 2086 -3834 -962 4071 -783 -3878 2042 3093 -2796 -1949
2042 -1949 3828 1216 -3993 624 4081 -1912 -3051 2908 1849 -3758 -838 3811 -659 -3781 1839
2057 1839 3072 -3023 -1851 3750 674 -3794 771 3605 -1708 -2804 2990 1933 -3568 -724 3890
2072 3890 -909 -3597 2026 2674 -2895 -1802 3288 517 -3742 665 3636 -2119 -2696 3027 1576
2087 1576 -3472 -244 3753 -814 -3443 1860 2691 -3066 -1888 3564 181 -3785 900 3088 -2057
2102 -2057 -2498 2780 1677 -3392 -194 3632 -810 -3194 2264 2447 -2891 -1296 3250 236 -3628
2117 -3628 956 3130 -2325 -2543 2964 1372 -3439 -127 3308 -1111 -2985 2100 2459 -2822 -1434
2132 -1434 3532 97 -3420 955 3065 -2042 -2332 2817 1149 -3285 -226 3142 -1319 -3253 2122
2147 2122 2139 -2949 -1203 3318 125 -3270 1252 2901 -1986 -2064 3185 1225 -3418 108 3398 -1284
2163 -1284 -2856 2144 1909 -3084 -1116 3346 -192 -3418 1264 2975 -2123 -1835 3191 1037 -3050
2178 -3050 102 3173 -1203 -2965 2317 1978 -3128 -891 3183 -530 -3196 1162 2686 -2320 -2038
2193 -2038 2777 862 -3234 384 3175 -1414 -2486 2308 1803 -2620 -785 3042 -174 -3149 1471
2208 1471 2483 -2528 -1841 2832 452 -3173 301 2950 -1362 -2354 2227 1944 -2979 -531 3287 -593
2224 -593 -2768 1603 2349 -2187 -1603 2781 600 -3305 452 2821 -1635 -2575 2395 1337 -2715 -587
2240 -587 3055 -376 -2678 1464 2615 -2216 -1471 3042 353 -2932 687 2657 -1481 -2164 2080 1353
2256 1353 -2991 -543 3077 -570 -2754 1704 2132 -2143 -1260 2914 363 -2892 685 2846 -1645
2271 -1645 -2292 2519 1190 -2841 -233 2737 -687 -2532 1354 2183 -2333 -1447 2798 334 -2801 889
2287 889 2465 -1474 -1820 2275 1252 -2601 -300 2847 -903 -2662 1676 1820 -2416 -1218 2677 217
2303 217 -2737 694 2609 -1587 -2135 2472 1098 -2567 265 2769 -707 -2309 1517 1797 -2261 -1356
2319 -1356 2524 -44 -3058 884 2219 -1871 -1802 2247 1080 -2317 -7 2704 -727 -2561 1911
2334 1911 1839 -2425 -798 2684 -35 -2501 929 2104 -1702 -1794 2384 1058 -2847 115 2537 -929
2350 -929 -2158 1804 1554 -2127 -608 2657 -100 -2470 1068 2070 -1925 -1659 2367 604 -2602 302
2366 302 2562 -999 -2297 1703 1485 -2258 -614 2691 -193 -2286 1055 2267 -1614 -1383 2249 793
2382 793 -2641 223 2426 -1184 -1920 1700 1228 -2267 -775 2229 -225 -2495 1078 2222 -1795 -1232
2398 -1232 2327 547 -2354 374 2414 -874 -1977 1812 1387 -2267 -634 2435 -676 -2346 1128
2413 1128 1738 -1740 -1185 2139 599 -2201 456 2498 -1343 -1728 1907 1233 -2213 -201 2262 -516
2429 -516 -2199 1062 1742 -1956 -1343 2153 103 -2425 544 2118 -1217 -1636 1878 1077 -1883 -459
2445 -459 2546 -435 -2166 1341 1660 -1803 -1014 2049 126 -2247 270 2107 -1301 -1760 1870 1016
2461 1016 -2241 -124 2131 -407 -1932 1450 1606 -1775 -941 2233 199 -2345 626 1979 -1360
2476 -1360 -1568 1697 1077 -2099 -379 2099 -597 -2126 1434 1386 -1875 -688 2212 259 -1970 592
2492 592 1882 -1267 -1583 1850 885 -2228 -18 1894 -738 -1932 1071 1301 -1925 -960 2017 92
2508 92 -2058 711 1839 -1438 -1205 1908 786 -2096 -61 2001 -860 -1823 1160 1191 -2004 -788
2524 -788 1898 -138 -1908 775 1844 -1347 -1371 1929 821 -1978 157 2159 -687 -1677 1364 1367 -1849
2541 -1849 -772 1906 -75 -2064 765 1613 -1488 -1161 1710 576 -1858 145 2176 -612 -1637
2556 -1637 1504 1412 -1679 -557 2039 -324 -1940 789 1491 -1456 -1288 1672 483 -2071 106 1974
2572 1974 -988 -1425 1528 1192 -1691 -371 2001 -166 -1895 750 1648 -1496 -1122 1672 211 -2047
2588 -2047 155 1817 -1118 -1527 1318 1085 -1660 -413 2189 -338 -1682 908 1492 -1290 -858 1895
2604 1895 409 -1776 334 1808 -1095 -1617 1434 812 -1905 -455 1636 -290 -1842 702 1321 -1437
2620 -1437 -909 1796 391 -1896 512 1785 -859 -1240 1439 1029 -1714 -353 1936 -594 -1841 1027
2636 1027 1289 -1385 -777 1646 354 -1745 323 1707 -877 -1487 1490 861 -1761 -183 1440 -426
2652 -426 -1713 1007 1142 -1410 -917 1445 170 -1691 566 1512 -1029 -1226 1488 693 -1658 -221
2668 -221 1817 -266 -1632 1004 1404 -1498 -687 1553 -35 -1933 371 1288 -1035 -1217 1412 644
2684 644 -1690 -14 1677 -676 -1413 1257 1228 -1354 -620 1666 106 -1635 586 1363 -1125 -1088 1244
2701 1244 428 -1673 -10 1415 -498 -1660 1068 1237 -1312 -408 1606 -6 -1496 735 1537 -970
2717 -970 -1195 1338 561 -1612 27 1610 -778 -1353 973 836 -1504 -462 1619 87 -1623 687
2733 687 1413 -1101 -754 1472 445 -1477 -14 1487 -606 -1323 942 814 -1558 -514 1548 -284
2749 -284 -1560 731 1044 -1165 -832 1495 421 -1519 247 1606 -703 -1059 1055 818 -1421 -323
2765 -323 1440 -222 -1590 599 1352 -1306 -1083 1428 291 -1357 250 1415 -715 -1161 928 978
2781 978 -1268 -326 1534 -312 -1414 648 1119 -1050 -886 1367 265 -1609 106 1405 -876 -1168
2797 -1168 1068 759 -1412 -237 1501 -225 -1410 607 1074 -1005 -807 1344 223 -1468 413 1298
2813 1298 -871 -1228 826 537 -1364 -360 1462 -223 -1357 869 1132 -1122 -626 1312 267 -1378
2829 -1378 235 1445 -742 -1212 1159 565 -1460 -163 1308 -561 -1156 729 947 -1130 -502 1420
2845 1420 154 -1391 406 1346 -775 -995 1089 732 -1380 -355 1235 -308 -1419 827 923 -1340
2861 -1340 -540 1358 -54 -1137 377 1202 -654 -874 1184 489 -1152 -46 1193 -387 -1130 865
2877 865 918 -1196 -640 1064 15 -1436 334 1158 -795 -889 861 397 -1278 99 1258 -357 -947
2894 -947 666 865 -1241 -635 1328 -37 -1274 524 1125 -770 -778 1076 343 -1317 -45 1373 -448
2911 -448 -976 842 787 -1033 -429 1135 25 -1213 569 1052 -857 -607 1131 238 -1249 67 1019
2928 1019 -548 -1076 728 773 -960 -326 1405 -30 -1059 447 1043 -808 -570 1067 305 -1294 -17
2945 -17 986 -571 -923 854 622 -1074 -212 1185 -221 -1063 608 931 -705 -680 1062 329 -1074
2962 -1074 318 1042 -449 -940 815 827 -1049 -289 1212 -179 -1083 437 756 -911 -486 927 220
2979 220 -1009 147 1218 -383 -919 1042 487 -1284 -63 1039 -176 -1190 367 777 -851 -524
2995 -524 964 176 -1221 155 1158 -487 -655 804 636 -987 -59 1226 -137 -1033 670 912 -928
3012 -928 -401 890 31 -1250 99 1037 -644 -888 903 657 -1102 -107 1194 -119 -887 461 877
3029 877 -678 -509 919 62 -1114 138 990 -639 -756 766 371 -855 34 1019 -84 -926 713
3046 713 790 -846 -472 1193 105 -1017 165 844 -595 -739 788 459 -995 -120 1001 -349 -985
3063 -985 634 664 -766 -339 1033 -19 -1021 237 959 -657 -717 880 369 -1059 -119 833 -297
3080 -297 -988 414 676 -949 -381 1018 -85 -814 493 971 -518 -633 828 417 -877 143 895
3097 895 -373 -788 630 479 -796 -271 844 9 -947 389 753 -680 -758 891 216 -1005 200
3114 200 911 -393 -742 729 659 -875 -343 1087 -96 -1024 265 766 -681 -653 806 378 -938 64
3132 64 958 -457 -726 709 449 -830 -238 1014 74 -954 316 732 -704 -651 954 71 -942 142
3150 142 975 -612 -731 683 448 -872 -262 959 -61 -784 398 822 -581 -284 655 308 -859
3167 -859 204 867 -485 -869 515 452 -950 -158 870 -361 -752 419 660 -734 -463 883 121
3184 121 -860 180 736 -547 -723 714 466 -872 -273 814 -270 -945 325 646 -789 -380 850
3201 850 46 -743 233 820 -364 -523 708 503 -863 -104 844 -304 -617 430 614 -633 -379 767
3219 767 141 -906 192 843 -396 -410 710 435 -730 65 825 -314 -846 516 583 -779 -342 773
3237 773 -26 -845 254 577 -528 -639 683 336 -867 -45 908 -227 -492 574 610 -632 -240 756
3255 756 107 -698 170 865 -653 -562 728 194 -785 37 722 -215 -650 608 634 -643 -230 815 -156
3274 -156 -791 321 693 -432 -466 634 107 -857 21 876 -270 -711 656 411 -674 -283 607 -29
3292 -29 -816 350 661 -344 -453 656 290 -761 -56 619 -260 -667 497 497 -660 -349 854 -71 -685
3311 -685 421 586 -554 -380 785 307 -648 -44 760 -334 -673 480 392 -799 -189 644 -197 -758
3329 -758 263 538 -562 -295 710 339 -770 235 676 -298 -504 431 465 -682 -100 618 -69 -842
3347 -842 384 622 -601 -536 663 95 -699 26 760 -216 -369 589 332 -645 -80 863 -218 -676 270
3366 270 551 -558 -435 733 148 -771 276 726 -254 -427 333 126 -643 -171 709 -34 -667 464 502
3385 502 -506 -138 616 -61 -745 174 569 -263 -608 592 273 -731 -14 554 -87 -605 328 399 -425
3404 -425 -214 704 137 -558 131 573 -456 -549 514 234 -621 -105 496 -229 -563 334 402 -570 -255 679
3424 679 67 -463 169 644 -440 -367 509 203 -588 69 551 -36 -496 291 315 -629 -265 455 -107 -628
3444 -628 207 736 -346 -284 543 143 -668 100 358 -227 -368 474 429 -710 -369 677 56 -746 197 272
3464 272 -426 -406 419 245 -561 16 579 -137 -463 505 295 -437 -166 588 32 -562 163 572 -339 -487
3484 -487 557 199 -599 127 584 -154 -391 291 447 -551 -170 580 -80 -641 459 454 -478 -506 561 261
3504 261 -660 -32 453 -307 -573 345 340 -571 -38 537 -52 -456 221 449 -228 -302 710 93 -657 163 820
3525 820 -332 -590 402 327 -443 -186 392 -102 -665 343 515 -610 -235 654 214 -417 110 511 -129
3544 -129 -529 352 242 -395 -68 398 -212 -563 224 419 -517 -221 500 219 -476 282 538 -307 -549 339
3564 339 402 -456 -48 633 -272 -372 389 414 -475 -227 625 -74 -455 92 434 -171 -467 227 247 -506 46
3585 46 517 -221 -676 426 405 -379 -131 282 74 -529 108 412 -418 -427 417 224 -519 48 527 -81 -407
3606 -407 139 271 -497 -204 539 47 -672 94 505 -330 -465 279 179 -464 -159 499 -47 -473 339 177
3626 177 -444 -250 441 -19 -412 -49 573 -319 -283 428 115 -627 71 345 1 -287 185 402 -451 -93
3646 -93 486 22 -456 220 436 -456 -287 485 310 -404 -84 395 -212 -649 381 140 -540 -241 486 -86
3666 -86 -575 152 314 -190 -223 546 177 -437 0 521 -130 -491 235 194 -332 -73 451 -7 -402 281 279 -431
3688 -431 -177 443 104 -535 72 522 -15 -337 461 537 -492 -107 289 -115 -397 140 361 -416 -314 374
3708 374 -54 -520 52 435 -83 -334 264 311 -328 -167 427 -108 -532 348 312 -178 -334 302 28 -463 -45
3729 -45 340 -75 -275 260 296 -426 -99 582 -182 -288 155 476 -271 -206 460 23 -357 112 403 -319 -371
3750 -371 311 124 -464 51 500 -122 -394 228 353 -436 -124 500 -118 -510 -39 431 -151 -441 241 317
3770 317 -440 -166 206 -169 -438 235 353 -390 -279 317 -146 -235 186 434 -207 -385 466 157 -369 -33
3790 -33 316 -108 -510 176 311 -277 -118 361 12 -525 165 420 -314 -255 336 293 -497 -127 303 -113 -237
3811 -237 179 225 -239 -180 365 18 -362 -18 229 -231 -374 266 159 -348 98 362 -104 -327 265 338 -278
3832 -278 -48 324 64 -570 72 318 -256 -286 159 122 -466 -64 458 -85 -235 234 308 -274 -176 296 24
3853 24 -290 54 413 -130 -154 240 260 -390 -21 387 -323 -403 294 337 -313 -107 281 67 -549 203 345 -270
3875 -270 -249 275 131 -347 -54 358 -187 -129 199 184 -323 -44 397 -60 -337 19 337 -285 -234 385 123
3896 123 -253 8 488 -158 -207 331 131 -260 -343 342 133 -335 219 179 -331 -252 426 97 -319 146 415
3917 415 -5 -277 288 182 -349 -14 314 -6 -237 203 358 -265 -179 311 104 -283 -76 254 -66 -353
3937 -353 371 125 -182 41 465 -3 -278 106 280 -402 -251 391 76 -356 76 309 -231 -429 243 212
3957 212 -261 -50 337 -41 -319 112 322 -99 -308 304 -106 -302 12 248 -160 -399 272 38 -425 -113
3977 -113 343 10 -468 167 316 -220 -238 291 -97 -327 4 274 -182 -388 230 85 -223 -19 241 -77
3997 -77 -327 74 215 -297 -137 175 -28 -258 168 241 -245 -260 333 47 -295 70 365 -171 -281 122 246
4018 246 -223 -197 250 195 -314 43 370 -220 -199 356 141 -340 43 186 -180 -241 142 272 -90 -263 206
4039 206 1 -223 119 369 -174 -300 152 84 -333 -1 237 -124 -245 143 46 -206 -215 319 142 -252 -88
4060 -88 206 -68 -112 137 55 -275 0 290 -91 -254 154 164 -194 -227 500 20 -186 25 256 -43 -320 231
4082 231 129 -195 -148 268 -276 -243 138 186 -287 -153 212 88 -84 132 196 -190 -10 292 5 -419 52
4103 52 112 -92 -259 181 192 -329 -262 339 -67 -304 214 153 -249 -120 192 120 -111 -11 226 -101 -279 223
4125 223 210 -416 -56 281 -111 -303 -2 227 -232 -46 355 113 -188 -20 304 70 -151 255 149 -204
4145 -204 59 340 62 -131 162 44 32 -176 99 -122 -151 12 243 -161 -245 104 189 -46 122 223 -43
4166 -43 -248 30 242 -155 -64 123 50 -436 61 243 -79 -219 239 -77 -77 4 294 -117 -118 272 292 -171 73
4189 73 377 -61 -91 124 200 -21 -106 127 232 -225 37 445 -157 -160 189 139 -178 -266 172 72 -153 186 293
4212 293 -131 -199 55 -47 -272 -17 315 71 -423 35 115 -180 -183 125 -71 -308 80 177 59 -302 92 32
4234 32 -255 71 188 -119 -70 -2 77 -119 -81 198 61 -350 91 138 -91 -306 101 115 -183 -53 260 -10
4256 -10 -197 198 238 -135 -85 202 45 -42 102 131 -239 -79 235 110 -237 -61 138 -137 -237 28 155 -145
4278 -145 -113 217 -30 -209 -99 171 -112 -138 210 131 -264 -25 173 -2 -231 117 134 -89 -118 163 193 -83
4300 -83 34 307 -102 -186 145 89 -363 -168 145 10 -118 1 70 -267 -17 22 12 -296 63 207 -87 -106
4322 -106 132 -25 -291 86 177 -18 -132 41 84 -138 -207 173 98 -243 -69 153 -140 15 157 122 -235 30
4344 30 102 5 -142 85 134 -236 14 249 71 -258 -48 64 -147 84 282 75 -111 -108 188 -151 -59 -20 127
4367 127 -156 -126 371 -2 -201 231 119 -311 -202 131 53 -239 21 197 -162 -259 23 204 -131 23 202
4388 202 -79 -153 90 166 -132 -112 257 204 -115 -95 91 -107 -257 135 21 -181 -88 331 102 -338 54 190
4410 190 -196 -108 227 -30 -186 2 -99 -117 -204 -24 41 -130 -117 179 -29 -378 161 146 -226 -43 156 96
4432 96 -111 1 162 -59 -244 55 82 -241 -99 59 -25 -204 107 -8 -52 -9 53 -72 -48 -35 213 17 -86
4455 -86 239 34 -43 -148 192 127 -122 119 46 137 -11 104 -78 -196 118 61 -82 -146 133 -71 -186 4
4477 4 91 -46 -80 66 267 -217 -88 120 -33 -178 -13 42 -66 -58 179 45 -63 -113 233 -74 -115 -27 185
4500 185 11 45 160 -67 -144 10 159 -130 -120 112 168 -136 35 86 -96 -278 188 157 -267 -209 5 86 -164
4523 -164 101 206 -98 6 223 122 -285 77 224 49 -207 223 88 -172 -55 173 110 -171 132 370
4543 370 -213 -114 204 45 -60 66 313 72 -22 32 90 -82 -119 284 6 -267 109 22 -375 -116 14 60
4565 60 -114 6 -36 -117 -53 98 208 84 9 170 -2 98 -98 -13 -118 -1 125 34 -69 -30 197 23 -201
4588 -201 -7 60 -290 -20 -6 -81 -128 -40 57 -53 112 295 65 -87 -25 2 31 -111 109 211 -105 -60 189
4611 189 29 -211 -118 54 -184 -168 102 99 -79 -137 218 -62 -139 13 -18 -186 9 144 22 -136 67 88 -46
4634 -46 -75 207 -32 -48 22 142 -18 -135 52 46 -259 -141 185 -76 -263 154 263 2 -40 66 -128 -113 35
4657 35 76 40 -78 102 130 -97 -7 74 16 -113 85 -30 -86 64 75 -211 -287 140 91 -5 -30 164 99 -230 -81
4682 -81 329 12 -115 26 13 -112 -129 136 -11 -241 64 9 152 -94 50 203 -150 -155 85 -103 -100 53 25
4705 25 -46 -38 122 24 -204 85 122 -198 -135 167 8 -188 41 201 -19 -38 -137 198 3 -30 59 -10 -79 110
4729 110 290 -21 -27 115 -114 -243 -172 246 42 -86 27 177 -29 -112 147 29 -193 -9 175 -15 -86 73
4751 73 221 -152 -168 -11 -64 -136 125 114 -91 87 177 6 -127 114 27 -92 -71 108 30 -101 9 39 -65
4774 -65 -324 118 -89 -170 159 6 -34 -258 -74 117 24 -129 263 25 -135 46 250 124 -175 155 118 -10
4796 -10 -73 267 109 -266 165 217 -165 -36 147 -68 -100 -14 125 46 -307 33 122 -16 -65 37 -50 -28 -15 187
4820 187 -74 -160 106 94 -177 -2 96 -238 -23 55 36 -51 -48 97 -36 -118 4 -19 -25 120 30 3 -244 -1 78
4845 78 -135 -209 44 16 -13 -54 94 52 -33 8 135 -29 7 145 -192 -142 41 72 -194 -170 52 -6 -133 -73 142
4870 142 -34 -104 13 197 -33 143 92 -88 33 -29 -57 -81 -113 36 -180 -180 -202 156 -68 -257 86 2 90 155
4894 155 19 16 95 16 153 -170 29 80 -115 -197 -86 134 76 -119 112 58 -211 -43 135 42 -170 0 78
4917 78 -4 -1 65 23 -118 130 235 -75 -176 73 104 -36 33 138 -29 8 97 73 62 -21 10 -55 -106 103 94 59
4943 59 -16 152 286 -68 -21 49 70 -117 45 7 -184 -60 88 -57 -197 75 44 -146 -1 40 49 -132 -83 191
4967 191 33 -165 110 89 -77 13 165 -98 97 -45 176 1 -64 -112 97 79 123 162 -36 37 -105 56 -142
4990 -142 48 57 63 -81 51 67 50 8 75 153 -131 -97 51 -59 -88 32 46 -9 -252 182 -13 13 -56 -25 -64 -138
5016 -138 -111 20 -262 -130 88 -100 -191 38 269 -146 -28 164 44 -139 70 86 1 30 87 -53 -77 -60 41
5039 41 57 -94 -53 216 -138 -8 -52 -61 -145 89 24 -83 -186 151 21 -128 -76 239 116 -228 36 167 -192
5062 -192 -84 127 -96 -59 -4 59 -63 -130 111 -18 9 124 91 -99 -235 83 76 -117 -66 61 19 -83 167
5085 167 304 84 -62 170 10 70 17 39 -143 -14 45 153 -90 -74 224 -191 65 72 173 -70 81 8 102
5108 102 -58 18 198 9 -54 54 -27 -90 -66 -68 -27 -160 -14 81 -200 11 45 -17 -27 69 164 48 109 36 80 1
5134 1 -86 162 96 -158 -6 157 -88 22 97 -62 -221 78 202 -122 0 103 51 -147 -5 -48 97 -38
5156 -38 84 0 -47 -52 113 18 -119 13 54 128 -25 -2 16 -37 -115 -18 20 -98 167 93 -131 -3 132 24 -126
5181 -126 83 39 65 -39 143 76 -18 143 50 66 14 -30 -99 -7 28 77 -93 -24 -94 56 -185 -177 185 89 29 -132
5207 -132 88 -108 -73 145 96 -235 -48 140 -107 -37 -63 66 20 38 118 49 -120 30 -68 -51 -204 -26 48 -36
5231 -36 -31 107 112 -109 116 146 -117 -326 110 147 -70 -66 169 41 -68 138 -61 -115 -86 62 -119 -73 49 -138
5255 -138 -81 -106 21 -75 -228 -147 93 58 -124 -4 -127 -158 52 7 -87 -91 -62 149 -17 -51 108 41 54 16 126
5280 126 149 -52 -76 84 -50 10 77 -70 -10 -51 40 172 -141 -7 48 -115 80 147 -132 -161 -59 24 -86 36
5304 36 171 56 -77 7 23 -191 -11 192 134 -43 -81 22 -117 81 37 110 -179 -9 210 27 -131 185
5326 185 36 -14 56 80 3 -152 226 61 -52 -102 109 132 -38 51 -10 80 -147 94 84 -102 -124 11 -38 -83
5350 -83 17 -15 -20 -24 -141 216 -54 13 -8 43 22 198 182 -216 106 13 177 -100 -77 143 -69 47 86 7 -128
5375 -128 -3 29 151 -125 102 -29 83 2 -3 -48 -65 73 244 -192 21 101 -85 50 -31 0 17 -77 100 159
5399 159 -106 31 63 99 -49 -42 95 184 -135 82 52 -231 -115 94 -39 -94 -36 124 88 -176 51 -183 -160
5422 -160 56 33 -61 -45 -59 20 -3 121 83 -115 -98 14 52 141 -17 145 -113 113 164 248 -148 56 48 0 -185
5447 -185 -49 100 -94 -88 94 -70 -216 -42 -44 -64 25 172 69 -5 163 87 -82 56 -126 26 46 -77 107
5470 107 187 -11 -31 90 -44 8 17 159 -114 28 31 164 68 229 -73 -12 -147 -64 -111 19 24 131 86 -3 36
5495 36 17 186 71 62 30 -6 192 143 -190 -89 73 77 -144 67 102 -17 -130 -105 6 -79 -12 116 186 -180 62
5520 62 69 2 -38 -38 31 -106 -141 109 -66 -145 70 5 -84 -179 54 -93 -1 25 116 -218 -10 60 31 -87 -118 87
5546 87 -47 -81 -57 148 -54 38 31 -26 -67 149 47 -59 -114 37 223 -31 64 144 78 -121 -30 111 -14 50 83
5571 83 101 -40 -6 125 -13 31 15 70 -58 98 149 22 -97 24 136 -47 -86 -139 -84 -7 60 57 -60 -119 77
5596 77 -41 -60 -102 36 -170 96 -10 55 22 -42 26 -41 -100 -94 43 -130 19 85 10 200 -57 154 91 -182 5
5621 5 47 -88 5 155 43 132 141 185 7 -77 270 -93 -35 -66 117 99 -101 116 56 -46 83 74 -91 46 121
5646 121 70 94 -33 74 78 -38 -46 20 -87 40 -86 35 22 79 71 -155 -65 -14 8 47 70 45 22 -121 -39 12 12
5673 12 -10 9 83 -81 -18 73 16 70 23 191 144 -21 50 -2 -28 147 141 58 -154 -28 -39 16 -65 -21 -38 134 -8
5700 -8 141 26 -116 268 -13 -24 -85 60 16 -64 9 51 0 -76 -114 80 -159 -23 -100 -54 176 -51 40 -176 -39
5725 -39 8 -6 -26 70 141 -30 -13 108 84 -51 -52 148 -256 -179 97 15 -104 -31 -47 42 104 120 -22 -176 -193 167
5751 167 -64 79 -82 195 -79 14 146 -45 -166 95 207 -124 79 39 -59 -7 -68 56 16 -70 115 -32
5773 -32 -52 -29 74 88 -56 3 150 14 -101 -79 -206 -46 97 152 -83 24 93 -20 -203 -41 30 -50 15 -6
5797 -6 167 35 -18 72 34 -240 -125 133 -88 -99 77 73 106 54 -53 -9 4 -29 -120 -43 -42 102 -64 -36 -33 105 -26
5824 -26 -75 135 -69 -76 115 33 -15 -158 -84 -24 106 190 2 48 -9 81 34 -65 -114 -17 38 -31 32 27 -71 27 -1 24
5852 24 74 -132 14 -57 -150 -120 164 -68 -57 178 15 -75 26 14 -122 -116 -152 0 -122 53 75 13 -246 32
5876 32 46 -72 -92 -11 -26 21 -70 64 -38 -29 15 40 14 -85 88 -108 -89 -3 85 -11 32 76 107 -127 -6 -40 107
5903 107 171 101 6 -80 11 91 -2 -178 -47 58 68 -27 -24 39 -41 -97 8 60 -106 -12 144 28 -82 153 -66
5928 -66 66 -7 97 41 -80 -57 6 -207 12 130 -5 -53 20 98 97 -53 84 8 -164 -35 -36 -58 -149 119 -92
5953 -92 -57 -17 53 -40 69 158 22 -72 -70 -20 -35 -36 48 -7 -172 -22 190 23 -139 -49 162 16 -95 13 113
5978 113 -74 -79 -58 -26 -165 22 145 -17 8 -54 38 -67 -89 179 104 -84 73 9 65 -61 16 93 -1 -28 -63
6003 -63 -2 -125 46 122 -93 53 4 -162 -153 -67 106 -39 -174 3 2 -138 -5 160 -18 -13 -1 66 -103 -13 46
6028 46 -57 -60 -89 -61 74 54 -51 -26 78 27 7 39 -99 145 55 39 12 84 -78 -147 -114 -9 -32 -115 156 39
6054 39 -55 145 255 -123 -67 -125 39 9 -182 -52 22 -77 5 -41 -27 76 91 3 -186 61 30 -70 -4 8 91
6079 91 20 22 -102 74 46 -48 32 -99 -67 92 -49 -10 -6 60 -92 -164 51 72 -52 130 -36 -27 92 50 -3 -128
6105 -128 -12 -81 7 -8 62 9 46 97 214 91 157 47 -116 -35 28 195 -20 88 82 2 -147 -70 161 47 78
6130 78 68 75 100 154 -113 -46 -53 85 35 -238 -77 -73 35 67 -38 21 -48 -1 -109 -121 -97 -4 98 158 -49 31 0
6157 0 112 6 90 52 -40 13 -17 4 -109 52 75 164 -44 38 31 155 234 109 -52 -91 -16 102 -79 70 -93
6182 -93 41 -50 42 75 -16 -2 39 -41 -55 207 38 128 -60 -58 -17 -25 -95 10 69 -30 114 -43 59 -54 20 68 10
6209 10 -122 177 -23 31 8 20 15 -14 5 57 31 53 -3 35 -64 40 -96 -33 133 102 -113 -75 -43 68 -22 -49 -12
6236 -12 -26 -36 -48 -6 -184 -87 28 -84 54 -54 27 47 -23 14 -1 0 -28 76 -93 -138 -102 -45 -65 -115 257 96
6262 96 55 -15 77 47 3 -33 17 -38 4 212 96 -108 -33 92 -73 161 -32 76 -242 190 -104 41 -36 25
6286 25 -123 -18 -14 31 38 -46 135 157 -29 3 -49 -179 -105 22 -59 -17 16 36 15 -98 -63 28 72 95 22 59 -50
6313 -50 16 -32 80 -9 -138 11 57 53 -16 79 -109 -54 18 -170 -23 35 -41 5 -12 120 22 39 -26 139 -56 81
6339 81 -32 15 13 1 64 78 23 -39 30 34 50 58 -51 -61 -101 -158 19 4 -4 -13 5 1 25 98 -31 52 23 -16 41 55 -51
6370 -51 -100 38 70 -22 -139 54 87 -68 -78 63 -5 45 -109 15 -52 -215 -16 -67 -17 9 18 -137 90 123 -2
6395 -2 2 -140 2 8 -15 0 -126 -69 -52 110 -12 -202 -201 -110 2 0 220 122 -73 -13 12 -58 44 32 70 -135 -180
6422 -180 47 -17 -77 -14 183 20 -26 56 -13 -57 68 -35 201 -94 66 37 -38 27 21 76 -71 -83 6 -89 -77 246
6448 246 63 85 -72 27 -2 -96 -52 -163 84 -53 -45 -50 28 -59 -77 -80 5 -87 7 -152 26 79 203 -62 -239 -35
6474 -35 -122 37 -21 87 -253 -18 133 -59 57 132 -24 23 72 -45 19 -180 47 73 -119 -8 40 -95 -39
6497 -39 -59 198 -13 56 115 -225 42 -39 -20 72 26 26 -62 5 -87 86 -152 38 -24 -98 10 -106 124 10 -38
6522 -38 170 83 -16 -59 67 70 15 145 -130 -31 -126 -3 8 109 63 17 -59 -100 38 -55 -100 62 -119 19 -36 -169
6548 -169 38 110 -137 -186 146 -148 -170 64 -186 0 -19 52 160 15 -133 174 -67 67 -16 -4 7 -9 -62
6571 -62 37 -77 -45 127 -29 102 -34 125 46 -5 -36 -111 -28 -35 156 11 23 75 -91 65 2 87 -34 18 -76
6596 -76 -100 -16 -88 -31 26 78 -11 -49 237 12 79 -28 -62 122 95 -215 65 100 -121 58 -114 -68 11 -49 185
6621 185 -80 -119 -85 9 -11 -110 -7 -127 29 22 34 -118 122 3 -60 -87 -9 -71 59 132 -174 13 20 51 -33 -84
6647 -84 -31 98 17 8 57 7 9 16 -74 -73 -26 -14 81 36 -45 39 28 -80 -1 49 74 16 -116 74 41 -33 -55 81 111 71
6677 71 11 -20 40 41 -62 75 2 5 97 -33 -75 30 -22 -125 -166 -37 117 -108 12 -93 -25 -119 152 -62 36
6702 36 86 80 -45 65 8 23 4 -107 -180 -55 -72 -133 2 54 -4 0 -4 19 39 2 141 -80 117 88 -40 81 118
6729 118 3 22 -2 -178 -61 -8 13 -99 -54 -88 -8 -11 0 58 26 -96 -100 121 55 -65 8 20 -75 -66 55 -47 132
6756 132 64 12 -100 149 166 70 -3 183 165 -39 -77 -83 -63 -7 24 -38 87 -27 4 -40 10 14 -191 105 -58 58
6782 58 -76 -34 22 -148 -9 -87 35 231 125 -9 -124 -207 -30 -93 110 61 44 -128 28 -105 155 -57 109
6805 109 72 68 114 -5 -28 151 -4 -31 42 40 98 -87 129 8 -18 -4 -30 12 -21 137 -119 -2 104 100 173 49
6831 49 83 -228 36 -56 29 -14 -110 -78 -27 5 -18 134 61 39 -26 21 -165 115 47 17 78 -58 11 103 -93 -20 -30
6858 -30 -116 30 111 12 21 -82 24 91 69 -68 33 42 -114 111 26 -56 133 44 90 -194 -37 145 -27 116 -37
6883 -37 182 -72 35 -198 -110 -6 -139 -70 -70 192 22 49 -7 101 4 131 -44 17 -177 -1 107 89 -8 80
6907 80 93 -70 -127 114 100 -23 59 -157 73 78 -43 34 -150 -7 -181 33 26 97 -126 -62 12 149 135 27 81
6932 81 3 19 -101 95 73 136 -143 -19 -82 -36 -83 4 -115 -9 -131 52 -96 -48 108 -33 72 55 12 49
6956 49 -12 15 8 -65 -81 -13 2 -203 -216 -35 45 -109 -150 31 -73 -32 97 -80 -61 -69 -61 -61 41 -25 -10 20 5 111
6984 111 -77 -73 95 118 115 43 17 -63 5 8 -96 -2 -96 -20 -117 -105 -78 22 38 -61 83 35 -31 20 -168 11 -168
7011 -168 11 -53 99 -109 -1 46 -31 -114 31 -198 98 172 37 97 31 -39 -148 106 60 104 2 95 -108 31
7035 31 -39 -75 69 -26 -187 -55 -6 -22 -20 10 122 -69 121 6 53 101 -16 -9 55 20 130 -16 24 40 24 -163
7061 -163 75 -26 82 -22 -74 83 97 -72 -13 13 -127 47 228 -16 -21 6 50 -83 -28 118 -196 101 65
7084 65 -61 -122 139 -189 148 -3 -29 -54 66 24 55 -57 75 -65 -150 42 -62 55 -15 71 9 -68 3 -62
7108 -62 68 -46 19 -22 49 3 -156 23 -14 -67 -5 83 11 69 -86 32 10 10 114 4 148 -70 65 67 132 7
7134 7 42 -26 97 97 115 -37 -42 32 -15 66 45 60 -5 119 -24 83 -123 14 -117 3 -78 -2 -12 11 -48 -59 145
7161 145 -169 -142 -34 22 17 84 -16 -131 -99 60 29 37 17 -60 -145 -1 -28 122 -85 88 6 -84 0 -45 -116 -89
7187 -89 -86 -10 64 -77 47 31 -33 67 39 -157 -115 62 179 -141 81 -53 -53 -89 76 78 -39 -72 38 38 52 -86
7213 -86 -47 -96 75 37 -65 -10 -8 44 -82 -90 93 -6 63 67 -58 86 70 -49 30 -40 -33 164 -40 -74 -77 20 -56 -65 98
7242 98 -27 -58 -88 98 18 -25 -7 69 -142 3 33 -66 -84 -175 -18 159 -176 -45 4 -11 -102 -40 1 -41 66 113
7268 113 70 48 -119 -21 -100 151 179 -68 168 22 98 14 53 101 50 51 -128 -44 19 67 64 71 -95 -232 4 1 74
7295 74 100 59 -86 -51 -9 -23 -140 -131 41 -31 0 -35 104 -97 78 -159 100 47 -48 32 64 -193 28 -36 -57 -98
7321 -98 53 45 23 -90 186 159 -65 23 62 84 -119 -167 -90 -105 -53 -213 49 -36 -56 4 46 95 -149 47 66 159
7347 159 24 26 -5 108 -91 -35 -95 142 -2 178 137 99 -45 -77 200 -33 64 -198 -108 -28 16 38 91 37 -207
7372 -207 64 -76 44 -4 -29 -114 -34 -62 -82 44 147 -129 21 11 49 43 55 106 -3 -94 22 127 -59 14 -175
7397 -175 73 -56 -54 16 -33 -88 82 -42 116 43 -34 -90 -82 22 24 -114 4 48 -85 48 -64 154 -74 72
7421 72 -184 282 34 27 -8 46 85 32 84 78 -43 45 85 -247 73 -73 17 27 69 58 -13 125 -2 -96 -75 109
7447 109 17 -86 49 79 -13 33 -76 36 46 68 -11 24 8 -60 -55 73 28 24 -33 -59 -147 39 -35 -264 80 87 170
7474 170 -25 0 45 -84 -51 38 -8 -22 23 -60 -6 15 -137 -56 25 -92 56 -99 49 -21 35 -66 59 9 -61
7499 -61 1 105 77 52 77 -93 14 31 109 -97 -93 -31 21 10 33 124 -70 -32 112 121 -89 56 25 -73 -90 -74 -28
7526 -28 -25 -19 26 142 -66 129 66 62 36 -80 60 199 24 -118 57 -30 57 -5 4 51 -27 192 28 32 -70 -69 92
7553 92 -166 -83 79 -2 -147 137 -71 212 170 66 145 65 -92 141 51 -47 31 -108 -116 193 66 -82 110 -35
7577 -35 21 -111 98 110 51 -76 210 79 32 -52 48 53 75 6 -2 66 7 76 -21 5 25 -1 -65 -93 34 -125 83
7604 83 -93 -95 -43 20 89 -13 7 -90 -9 -84 -66 -12 -37 -69 54 106 -108 -13 -27 105 57 58 30 -3 -157 1 -44 -191
7632 -191 -130 160 -39 -102 13 -52 43 -28 80 174 -30 -19 -19 39 85 -41 37 113 45 -32 84 5 -45 -119 35 180
7658 180 -131 -6 -91 101 -26 210 -158 -76 -97 -90 102 94 10 -19 171 24 66 124 32 12 -12 -20 123 130 49 -175
7684 -175 -104 -114 134 8 -74 -178 -68 89 -24 -86 -12 48 -95 -136 -84 17 -86 -172 -127 82 30 122 -2 -12
7708 -12 -80 -52 190 -29 28 -68 51 272 80 2 4 47 -36 106 -42 -169 78 74 135 23 129 55 116 43 13 42
7734 42 84 34 18 59 -18 -102 -210 65 6 -17 -24 -6 68 24 -71 156 -76 110 -99 -42 97 15 -7 28 -19 155 -12
7761 -12 -163 -27 218 -55 48 44 28 90 78 -70 87 -95 37 39 -1 -171 -24 -246 -89 212 -150 128 32
7784 32 -34 77 151 -29 178 41 -78 17 18 47 -116 -77 -31 -88 58 -32 -109 -19 -60 -157 -26 2 162 73 -12 57
7810 57 -36 -16 -181 -245 119 22 -48 27 11 -66 60 40 54 47 136 23 8 109 142 -100 -84 -100 -73 -8 -66 -78 16 40
7838 40 -65 44 96 -83 -38 74 -84 -51 -178 -86 -175 -31 -7 -65 -48 26 -126 3 32 -75 98 38 258 90
7862 90 -40 -71 -149 125 160 -43 40 26 -8 44 34 -179 -72 138 -141 83 -33 174 -40 -48 95 124 67 -5 -107
7887 -107 -18 -40 30 -66 -181 48 57 -56 -51 -18 -81 80 -8 94 -56 20 -99 -86 -21 -75 123 -174 -93 -25 137 130
7913 130 63 22 -129 -9 1 10 240 55 116 32 181 -52 101 92 133 -115 -58 20 42 -169 19 -28 141 100 -24
7938 -24 2 -21 3 51 184 44 64 -54 26 -16 55 -59 18 -28 116 36 102 -43 -2 -10 -56 -9 15 -75 -13 -77 -28 7
7966 7 -47 -108 -48 8 19 -11 -5 -129 -151 -15 -17 -119 10 -120 -50 162 -181 40 -3 -51 -32 -122 -146 -18 0 -136 -63
7993 -63 81 65 95 2 -64 -75 -64 -62 49 -26 -75 59 84 -83 -58 6 11 3 -74 -57 -46 -60 65 -86 -68 -40 104 136
8021 136 -111 30 103 -223 -121 138 37 -50 87 30 176 -188 131 -55 -46 -22 33 -149 -129 -41 -56 -23 -47 95
8045 95 -36 37 112 12 46 83 -175 -110 -23 55 -66 -79 -120 141 -83 93 -2 75 -7 57 -30 53 79 16 75 -38
8071 -38 -49 -86 116 124 -88 59 28 14 -81 37 -31 43 57 124 -54 -13 129 -37 -103 125 -43 16 -7 -18 98 -116
8097 -116 66 86 60 148 225 27 -29 -95 -85 96 105 -186 21 131 176 98 0 -1 -46 -172 57 -42 -30 6 -4 76 61
8124 61 -210 35 -54 187 42 61 -99 81 122 5 56 -66 -51 -131 86 -89 67 36 -47 7 19 47 115 1
8148 1 143 -62 -28 26 50 9 38 -27 12 60 -16 -24 -52 -75 -6 30 -19 28 85 -93 37 -32 -11 -24 -1 53 -49 -38 135
8177 135 100 -66 0 -94 119 -85 -22 -29 17 -122 -80 23 29 -132
8191a32
$$ Imaginary data points
##PAGE= N=2
##DATA TABLE= (X++(I..I)), XYDATA
0 0 0 0 0 0 0 0 0 0 0 0 0 0 0 -8 8 -8 8 -8 16 -16 18 -24 24 -32 40 -48 54 -61 72 -80 93 -104 120 -135 152
35 152 -171 192 -215 240 -269 299 -333 366 -407 451 -498 548 -605 667 -735 809 -893 983
53 983 -1085 1198 -1327 1472 -1640 1834 -2063 2338 -2673 3095 -3642 4390 -5464 7158 -10228
68 -10228 17554 -74139 2305 124684 -90011 -81498 120200 75885 -114689 4060 136794
79 136794 -30754 -127901 65814 77409 -116498 -61421 119858 10848 -114218 39893 120230
90 120230 -61030 -80979 97241 46857 -122957 -16784 108067 -38084 -105012 68001 81150
101 81150 -86334 -39294 114027 11854 -109001 32072 97437 -70236 -76092 89940 38881
112 38881 -105403 -4747 105720 -31335 -96436 63791 71646 -92187 -40270 104416 3870
123 3870 -101227 34868 93382 -60616 -68524 86048 39173 -101769 -6431 99537 -32057
134 -32057 -88059 61709 66085 -80428 -36322 92213 3991 -96033 25147 81638 -58508
145 -58508 -62484 78889 35333 -84163 984 89825 -24054 -75626 52536 56551 -76409
156 -76409 -34714 81621 -1682 -84548 28697 72226 -51628 -51059 71723 29337 -80869
167 -80869 -344 80478 -30306 -70393 54931 50439 -69524 -22735 80041 -1195 -77105
178 -77105 28764 66887 -55265 -51029 68912 21211 -79374 4503 75272 -29187 -62509
189 -62509 52727 47663 -66215 -22091 75893 -4063 -72941 30284 60471 -50585 -41715 63557
201 63557 19525 -70382 3443 67539 -29422 -58920 48118 38620 -62285 -16347 66724 -5731
213 -5731 -62084 29127 54781 -45621 -36204 60775 15227 -65400 8446 60749 -31001 -50498
225 -50498 46182 32462 -59372 -14129 63134 -9886 -60744 31791 49187 -48395 -30152 59743
237 59743 11234 -60974 11366 58979 -30566 -48016 48298 30502 -59774 -9906 60596 -13104
249 -13104 -56942 30217 44728 -46373 -29843 56504 9976 -59561 12450 55702 -30420 -42126
261 -42126 45897 27276 -52854 -8023 56286 -11310 -52752 29652 40629 -45855 -25363 51896
273 51896 4746 -54377 12753 48676 -29499 -38231 44310 24082 -51536 -3207 54304 -14886
285 -14886 -46749 31905 35501 -43832 -20933 50422 2321 -53182 15293 46200 -33814 -35045
297 -35045 44751 17821 -50586 -312 50859 -15857 -44534 33092 34753 -44007 -17226 51184
309 51184 -332 -49448 17487 42215 -32317 -32569 41667 16685 -49542 -706 48403 -17712
321 -17712 -41851 32492 30044 -40905 -14559 47033 217 -45641 17246 41238 -31353 -29036
333 -29036 41728 13029 -46609 2181 43686 -18654 -38769 30609 27194 -41607 -12757 46442
345 46442 -4012 -43997 20766 37169 -32084 -24199 41785 11406 -44846 5114 43937 -21200
357 -21200 -36819 33685 23008 -42786 -9354 43715 -7026 -42378 20744 35123 -33206 -22944
369 -22944 42555 8771 -43774 8878 41659 -21370 -32473 32983 21711 -40593 -8339 42946
381 42946 -8448 -41318 21645 31255 -34008 -20241 39472 6293 -41198 8236 39725 -21249
393 -21249 -30870 34055 19859 -39787 -4218 41284 -9816 -37434 22227 29398 -33463 -19163
405 -19163 39244 3577 -42299 10715 37133 -24402 -28091 33833 16936 -38585 -2644 41468
417 41468 -10231 -36551 25020 28652 -34506 -15619 39286 1243 -40129 11048 34862 -24598
429 -24598 -28459 33602 15465 -39809 -1244 40129 -12441 -33992 25012 26888 -32248 -14469
441 -14469 39010 2132 -39227 12378 34536 -25477 -25912 32951 12859 -38367 -1130 37443
453 37443 -12665 -33964 24792 25618 -33815 -12384 38830 -589 -36939 14522 32791 -24566
465 -24566 -23679 33612 12533 -38492 940 37393 -15716 -32873 25303 21647 -33908 -11430 37043
478 37043 -1309 -36445 15203 32668 -25643 -21696 34528 10623 -36532 2585 35642 -14529
490 -14529 -31057 24811 22128 -33755 -11194 36441 -3554 -35914 14840 29333 -25070 -20828
502 -20828 32616 10853 -35378 3176 36410 -14766 -29664 26036 20338 -32908 -8958 34992
514 34992 -3676 -34792 14734 28966 -26344 -20537 32622 7622 -35979 4595 33560 -15892
526 -15892 -27315 26235 19847 -31544 -7079 36110 -4693 -33574 16670 26347 -27077 -18340 31241
539 31241 6203 -34733 4599 32775 -16654 -26883 26640 17503 -32175 -5541 34135 -5236
551 -5236 -31201 16722 26876 -24994 -17269 31975 6042 -34631 5493 30648 -17767 -26025 24674
564 24674 16396 -30858 -6089 33860 -5138 -31227 17450 25683 -25488 -15525 31298 5211 -32033
577 -32033 6133 30915 -16260 -24909 25321 15383 -32086 -5025 31341 -7822 -29818 16585
589 16585 23572 -24578 -14411 31262 5005 -31608 8048 29644 -17826 -22229 25142 13274
601 13274 -29713 -3395 30724 -7380 -28973 17328 22205 -26113 -13488 29554 2119 -30444
613 -30444 7944 27959 -16636 -21232 25862 13918 -29512 -1931 30775 -8761 -27170 17528
625 17528 20379 -25202 -12806 28763 2189 -30607 8264 26987 -18524 -20470 25338 11329
637 11329 -28417 -911 29516 -7704 -25763 18248 20672 -25072 -11210 28613 327 -28963
649 -28963 8676 24412 -18009 -19382 23653 10644 -28171 -973 28479 -9259 -24586 18567
661 18567 18279 -23495 -9390 27407 993 -27101 9168 24609 -18054 -18346 23946 8579 -27709
674 -27709 -113 26116 -9783 -23706 17352 17482 -23642 -8825 27880 -413 -26359 10909
686 10909 23147 -17432 -16198 23614 8400 -26607 490 26030 -10922 -23194 18032 15139
698 15139 -23987 -7136 25676 -1606 -24915 10459 22314 -17435 -14989 24249 7161 -25420
710 -25420 2809 24427 -10825 -20532 17552 14215 -23079 -6975 24717 -2825 -24658 10955
722 10955 19806 -18095 -13323 22406 6023 -24030 2946 24285 -10311 -19723 18558 13581 -22840
735 -22840 -4946 24091 -3821 -23357 10442 18744 -18217 -13707 22329 4897 -24626 3770
747 3770 23129 -11617 -18043 18320 12724 -21663 -4455 24200 -3264 -22483 11815 18028 -18410
760 -18410 -11805 21561 3256 -23226 3639 21297 -11568 -17920 17768 11277 -21694 -2885 23003
773 23003 -4485 -20014 12189 16660 -17075 -10369 21146 2950 -22684 4820 20061 -13032
785 -13032 -16209 17349 9034 -21015 -2531 21743 -4844 -20017 12774 16315 -17729 -8544 21895
798 21895 1736 -21297 5855 19392 -12307 -15431 17362 9018 -21813 -1807 21306 -6834
810 -6834 -19408 12650 14272 -17443 -8229 20775 1941 -20623 6261 19360 -12594 -13942 18061
823 18061 7642 -20111 -748 20007 -6400 -18446 12161 13583 -17823 -7911 19973 44
835 44 -19885 7108 17356 -12239 -12498 17261 7689 -19386 290 20264 -7080 -17244 13289
848 13289 11895 -17664 -6560 18808 -795 -19860 6840 16901 -13368 -12328 17842 5665
860 5665 -19361 1665 19195 -7118 -15757 13439 11972 -17212 -5737 19594 -1399 -19187 7982
873 7982 15410 -13800 -11139 16588 4936 -19052 1184 18560 -7848 -15489 14143 10868 -16756
886 -16756 -3800 18744 -1607 -17281 7962 14846 -13271 -10747 16691 3884 -18977 2173
898 2173 16902 -9035 -14288 13078 9786 -16523 -3846 18726 -2213 -17157 9256 14656 -13672
911 -13672 -8684 16891 3138 -17838 2594 16937 -9167 -14414 13641 8634 -17700 -2892 17836
924 17836 -3595 -16411 9203 13666 -13335 -8564 17438 3156 -17627 4138 16763 -9653
936 -9653 -12582 13782 7694 -16543 -2722 16824 -3921 -16516 9353 12510 -14107 -7381 16645
949 16645 1767 -16267 4277 15649 -8830 -11993 14063 7658 -16508 -1284 16702 -5079
961 -5079 -15329 9505 11072 -14043 -7206 15988 1035 -17028 4775 15272 -10255 -11126 14538
974 14538 6324 -15877 -368 16477 -4705 -14440 10140 11275 -14417 -6216 16267 -224 -16458
987 -16458 5183 13990 -10274 -10869 13718 6232 -16157 -128 16669 -5125 -13708 10973 10540
1000 10540 -13424 -5424 15456 4 -15923 5051 13513 -10905 -10570 13716 4651 -15701 424
1013 424 14965 -5517 -13127 10509 10200 -13605 -4628 16153 -599 -15256 6524 12937 -10584
1026 -10584 -9306 13625 4271 -15692 400 15121 -6829 -13198 11050 8636 -14148 -3827 15252
1039 15252 -954 -14411 6494 13105 -10593 -8546 14535 3803 -15289 1736 14174 -6785
1051 -6785 -12172 10028 8265 -14097 -4159 14883 -1726 -14599 6888 11999 -10551 -7532 13628
1064 13628 3687 -14259 1667 14351 -6332 -11875 11000 7854 -13808 -2792 14065 -2567
1076 -2567 -13833 6295 11248 -10975 -7843 13610 3051 -14652 2971 13909 -7078 -10445 11071
1089 11071 7361 -12885 -2511 14403 -2522 -13755 7305 10437 -11735 -7000 13031 1611
1101 1611 -14033 2364 13177 -7115 -10612 11346 7133 -13215 -1290 14269 -3003 -12437 7440
1114 7440 9969 -10774 -6526 13007 1672 -14254 2950 12574 -8038 -9720 10861 5827 -12873
1127 -12873 -1333 13543 -2964 -12184 7861 10059 -11005 -5434 13300 944 -13093 3542
1139 3542 11771 -7851 -9595 10519 5227 -13527 -914 13175 -4134 -11451 8100 8882 -10668
1152 -10668 -4959 13126 1148 -12956 4160 12161 -8280 -8769 11417 4370 -12742 -776 12214
1165 12214 -4104 -11694 7565 8697 -11312 -4686 13006 117 -12406 4549 11230 -7488 -7914
1178 -7914 11011 4727 -12467 -5 12679 -4466 -10984 8136 7467 -11086 -4078 11808 -232
1191 -232 -12137 4277 10616 -8124 -7642 11414 3813 -12076 1092 12107 -4526 -10168 8139
1204 8139 7511 -10896 -3960 12091 -1082 -12107 4994 9492 -8670 -6859 10638 3443 -12043
1217 -12043 690 11974 -4730 -9793 8979 6959 -10930 -2634 11804 -908 -11438 4665
1229 4665 9769 -8564 -7349 10698 2624 -12198 1321 10984 -5328 -9036 8443 6781 -10220
1242 -10220 -2706 11932 -964 -10866 5611 9395 -8744 -5861 10206 2021 -11436 1144 10443
1255 10443 -5520 -9502 8335 5939 -10798 -1933 11371 -1842 -9994 5656 8840 -8051 -5476
1268 -5476 10832 2137 -11361 2262 10287 -6164 -8133 8390 4913 -10502 -2168 10844 -2115
1281 -2115 -10450 5805 8180 -8593 -4631 10648 1445 -10334 2510 10013 -5478 -7952 8739
1294 8739 4975 -10653 -1234 10511 -2765 -9954 5549 7302 -8626 -4965 10152 1250 -10442
1307 -10442 2768 9978 -6007 -7130 8975 4269 -9744 -904 10166 -2698 -9504 5885 7316
1320 7316 -9244 -4505 10199 243 -10335 2939 8899 -5970 -6871 8572 4461 -9852 -95
1333 -95 10531 -3076 -8747 6504 6697 -8575 -3770 9512 423 -10401 2771 8691 -6808 -6900
1347 -6900 8642 3277 -9956 129 9764 -3079 -8384 6429 6808 -8535 -3205 10142 -136
1360 -136 -9647 3561 7986 -6476 -6367 8030 2979 -10086 -122 9477 -3887 -8376 6810 5908
1374 5908 -8449 -2519 9587 -125 -9087 3867 8427 -6559 -5583 8620 2504 -9658 639
1387 639 8801 -3993 -7941 6148 5578 -8513 -2934 9617 -712 -9291 4103 7824 -6352 -4865
1401 -4865 8581 2592 -8947 793 9178 -3981 -7723 6609 4800 -8689 -2142 8880 -1397
1414 -1397 -8730 4013 7387 -6619 -4937 8714 2345 -9022 1681 8749 -4157 -6820 6651
1427 6651 4714 -8297 -2002 8988 -1345 -9009 4351 6559 -7086 -4374 8267 1376 -8656
1440 -8656 1462 8403 -4200 -6685 7115 4483 -8047 -970 8943 -1881 -7888 4304 6249
1453 6249 -6782 -4607 8091 1082 -9072 1727 7935 -4709 -6197 7114 3917 -7774 -1027
1466 -1027 8907 -1448 -7795 4815 6589 -6856 -3586 8121 525 -8369 1664 7456 -4727
1479 -4727 -6395 6708 3797 -8203 -780 8461 -2280 -7517 5050 5863 -6424 -3460 7988 1056
1493 1056 -8267 2149 7572 -5013 -5762 6786 2952 -7970 -719 7838 -2390 -7429 4856 5703
1507 5703 -6853 -3007 8227 362 -7770 2798 7029 -4714 -5261 6663 3143 -7930 -371 7894
1521 7894 -2802 -7258 4951 4806 -6851 -2784 7571 346 -7648 2744 7249 -4823 -4910 7171
1535 7171 2541 -7648 308 7469 -2810 -6656 4873 4847 -7095 -2799 7701 -488 -7870 2969
1549 2969 6291 -5315 -4522 6622 2536 -7316 385 7788 -2690 -6268 5613 4449 -6646 -2226
1563 -2226 7260 -531 -7550 2717 6176 -5388 -4761 6809 1888 -7542 962 7025 -2912 -5780
1577 -5780 5321 4484 -6357 -1932 7412 -554 -7105 3279 5940 -5562 -4051 6422 1447 -7217
1591 -7217 634 6995 -3415 -6048 5382 3991 -6895 -1045 7397 -868 -6564 3457 5781 -5268
1605 -5268 -3889 6871 1393 -7437 1070 6422 -3864 -5351 5261 3355 -6484 -1509 6989 -1114
1619 -1114 -6717 3772 5626 -5276 -3120 6714 1167 -6815 1365 6581 -3411 -5436 5239 3244
1633 3244 -6823 -1108 6739 -1762 -6285 3529 4851 -5188 -3198 6591 1092 -6725 1758 6519
1647 6519 -3521 -4626 5675 2910 -6489 -745 6306 -1662 -6415 3468 4832 -5788 -3031 6452
1661 6452 384 -6831 1653 6078 -3504 -4466 5598 3066 -6387 -543 6819 -1821 -5906 3814 4213
1676 4213 -5661 -2787 5962 412 -6632 1630 5868 -4116 -4355 5686 2296 -6184 -33 6403 -1719
1691 -1719 -5449 4030 4454 -5371 -2293 6461 -28 -6329 2151 5417 -4166 -4156 5113 2050 -6125 -92
1707 -92 6378 -2313 -5359 4421 3939 -5353 -1771 6282 178 -6005 2228 5409 -4203 -3944 5238 1707
1723 1707 -6315 158 5837 -2392 -5215 4017 3857 -5205 -1889 6306 -285 -5717 2563 5067 -4011
1738 -4011 -3422 5315 1570 -5864 220 5860 -2561 -5250 3988 3212 -5505 -1527 5694 -633 -5593
1753 -5593 2375 5097 -4121 -3285 5594 1773 -5831 1001 5579 -2595 -4525 4059 3009 -5507 -1504
1768 -1504 5657 -908 -5777 2605 4476 -4366 -2884 5332 1199 -5429 934 5552 -2566 -4452 4534
1783 4534 2995 -5301 -985 5506 -1051 -5313 2614 4265 -4224 -3155 5130 952 -5757 942 5364
1798 5364 -3085 -4088 4476 2852 -4873 -832 5533 -926 -5114 2870 4226 -4397 -2697 5019 617
1813 617 -5517 1052 4879 -2846 -4208 4202 2590 -5285 -638 5575 -1096 -4800 3177 3898 -4029
1828 -4029 -2367 5029 593 -5536 1238 4747 -3232 -3882 4215 1931 -5269 -519 5299 -1354 -4711
1843 -4711 3132 3659 -4245 -1941 5302 417 -5035 1499 4452 -3029 -3561 4083 2103 -5189 -319
1858 -319 5161 -1838 -4693 3098 3371 -4295 -1744 4895 459 -4765 1587 4574 -2873 -3424 4424 1656
1874 1656 -4925 -91 4625 -1500 -4494 3023 3066 -4490 -1981 4910 -26 -4855 1786 4172 -3028
1889 -3028 -2972 4261 1904 -4483 54 5009 -1777 -4195 3323 2816 -4465 -1631 4506 -353 -4699 1469
1905 1469 4144 -3280 -3039 4363 1374 -4694 538 4436 -1522 -3587 3145 2785 -3994 -1374 4761
1920 4761 -220 -4584 1917 3629 -3486 -2714 4022 1121 -4616 204 4447 -1947 -3697 3466 2488
1935 2488 -4038 -815 4573 -500 -4179 1921 3776 -3307 -2648 4142 991 -4832 523 4195 -2411
1950 -2411 -3410 3046 2337 -3992 -1027 4533 -402 -4070 2392 3665 -3436 -2240 4041 788 -4205
1965 -4205 442 4089 -2233 -3588 3280 1990 -4387 -775 4275 -1067 -3869 2233 3316 -3005 -2055
1980 -2055 4203 910 -4279 931 4158 -2312 -3222 3274 1920 -4120 -721 4040 -992 -4184 2213
1995 2213 3130 -3594 -2038 4127 393 -3860 1099 3752 -1951 -3072 3343 1982 -3997 -219 4167
2010 4167 -1110 -3779 2309 2637 -3480 -1821 3597 314 -4276 1058 3922 -2556 -2639 3700 1737 -3755
2026 -3755 -193 4040 -1072 -3555 2332 2792 -3533 -1698 3897 -62 -4013 1243 3232 -2497 -2678
2041 -2678 3193 1727 -3725 -181 4105 -1181 -3397 2561 2532 -3221 -1321 3904 164 -3792 1110
2056 1110 3250 -2423 -2759 3251 1043 -3867 87 3722 -1284 -3416 2435 2698 -3408 -1279 3952
2071 3952 71 -3670 1381 3233 -2633 -2323 3255 1282 -3877 -42 3632 -1558 -3400 2561 2234
2086 2234 -3347 -897 3553 -115 -3408 1336 3266 -2357 -2210 3350 1160 -3829 330 3592 -1556
2101 -1556 -2963 2386 2043 -3339 -1231 3749 -350 -3595 1576 2931 -2646 -1934 3352 981 -3273
2116 -3273 441 3647 -1412 -2904 2709 1983 -3315 -760 3515 -644 -3345 1456 2654 -2730 -2045
2131 -2045 3269 889 -3553 522 3517 -1839 -2548 2767 1674 -3193 -745 3373 -383 -3439 1507
2146 1507 2796 -2975 -1737 3170 547 -3501 605 3033 -1653 -2632 2480 1855 -3234 -569 3451
2161 3451 -681 -2982 1685 2506 -2576 -1597 2985 546 -3456 595 3079 -1901 -2463 2624 1195 -3028
2177 -3028 -346 3301 -632 -3003 1881 2649 -2643 -1270 3456 253 -3255 838 2853 -1917 -2232
2192 -2232 2423 1332 -3230 -218 3207 -979 -2737 1950 2189 -2538 -1025 2945 482 -3194 770
2207 770 3016 -1916 -2211 2807 1089 -3026 -178 3041 -998 -2905 1733 2082 -2734 -1389 3083 31
2223 31 -3062 1197 2775 -1659 -1857 2580 1272 -2868 -143 3217 -972 -2718 2062 1981 -2791 -1068
2239 -1068 2907 108 -3064 923 2744 -1944 -1807 2859 1040 -2997 268 3001 -934 -2399 1842
2254 1842 1825 -2559 -1137 2849 -192 -3176 991 2494 -2148 -1787 2425 913 -2864 130 2997 -1036
2270 -1036 -2447 2258 1881 -2560 -688 2811 -456 -2591 968 2382 -2006 -1731 2553 820 -3045
2285 -3045 67 2737 -1344 -2192 1855 1718 -2451 -866 2948 88 -2862 1301 2333 -2074 -1655 2519
2301 2519 594 -2744 224 2529 -1127 -2301 1959 1635 -2553 -638 2751 -536 -2494 1405 2158
2316 2158 -1790 -1482 2720 729 -2798 540 2528 -1410 -2093 2008 1304 -2590 -733 2513 -431 -2530
2332 -2530 1242 2091 -2024 -1249 2684 576 -2434 592 2431 -1168 -1862 1971 1454 -2557 -470 2609
2348 2609 -658 -2466 1346 1807 -2112 -1215 2322 391 -2576 583 2627 -1403 -1880 2179 1231 -2211
2364 -2211 -196 2532 -515 -2460 1341 1899 -2358 -1355 2526 -15 -2698 566 2115 -1374 -1676
2379 -1676 1975 1316 -2296 -191 2649 -756 -2234 1579 1532 -2011 -1138 2386 304 -2655 567 2234
2395 2234 -1577 -1668 2019 875 -2292 73 2252 -506 -1980 1356 1852 -2038 -917 2706 201 -2455
2411 -2455 898 2016 -1474 -1539 1908 832 -2535 -76 2435 -937 -2141 1655 1467 -2084 -543 2302
2427 2302 129 -2273 778 2100 -1554 -1539 2167 758 -2430 127 2144 -1020 -1929 1494 1301 -1963
2443 -1963 -866 2352 -194 -2243 1102 2064 -1668 -1181 2022 725 -2204 65 2267 -774 -1863
2458 -1863 1688 1289 -2124 -521 2193 -179 -2202 915 1893 -1606 -1365 2077 581 -2138 293 2271
2474 2271 -861 -1587 1531 1354 -1874 -752 2174 -129 -2244 963 1771 -1724 -1184 1964 398 -2091
2490 -2091 189 2173 -879 -1555 1700 1270 -2025 -369 2215 -357 -1888 843 1638 -1586 -1258 1905
2506 1905 508 -2176 205 1883 -1128 -1535 1850 1171 -1905 -320 2287 -253 -1910 1120 1885 -1653
2522 -1653 -1044 2071 55 -2024 315 1944 -1202 -1615 1451 952 -1920 -377 1993 -418 -1875 1258
2538 1258 1467 -1485 -894 1754 329 -1889 438 1976 -1311 -1604 1712 812 -1881 -172 1903 -541
2554 -541 -1765 1015 1523 -1597 -722 2199 441 -1994 701 1865 -1054 -1359 1653 854 -1861 -201
2570 -201 1907 -699 -1958 1185 1291 -1720 -791 1794 87 -1914 305 1757 -1105 -1337 1782 984
2586 984 -1835 103 1933 -545 -1767 1032 1377 -1833 -867 1901 -21 -2108 614 1680 -1161 -1006
2602 -1006 1648 634 -1822 -17 1987 -698 -1603 1378 1206 -1450 -617 1715 -10 -1908 674 1538
2618 1538 -1221 -1199 1585 554 -1846 69 1689 -679 -1326 1132 1164 -1410 -507 1853 -244 -1904
2634 -1904 870 1476 -1078 -1078 1685 370 -1897 -57 1678 -627 -1676 1180 1040 -1669 -416 1778
2650 1778 -87 -1589 713 1415 -1162 -1083 1395 559 -1882 92 1778 -830 -1540 1378 923 -1514
2666 -1514 -480 1746 -133 -1785 833 1516 -1281 -1005 1669 133 -1568 205 1530 -747 -1428 1206
2682 1206 833 -1637 -477 1578 -230 -1625 848 1152 -1315 -871 1482 369 -1797 368 1794 -858
2698 -858 -1261 1178 886 -1538 -251 1442 -323 -1706 637 1392 -1416 -983 1761 221 -1477 256
2714 256 1405 -874 -1187 1477 986 -1367 -283 1753 -283 -1406 828 1091 -1407 -803 1533 138
2730 138 -1606 263 1486 -860 -1125 1254 714 -1582 -261 1749 -237 -1370 717 1171 -1459 -760
2746 -760 1475 85 -1706 347 1306 -957 -1150 1138 600 -1560 -185 1600 -513 -1350 1064 1135 -1351
2763 -1351 -517 1486 99 -1431 357 1302 -857 -1173 1060 579 -1599 -39 1393 -617 -1336 862
2779 862 989 -1227 -608 1596 214 -1322 478 1409 -850 -1056 1338 603 -1452 -21 1417 -611
2795 -611 -1475 838 762 -1416 -465 1387 -57 -1278 443 1124 -877 -971 1334 688 -1415 13 1382
2812 1382 -570 -1204 943 936 -1203 -598 1398 -77 -1798 343 1184 -1020 -736 1295 405 -1198 93
2829 93 1387 -276 -1083 1099 928 -1338 -329 1450 -367 -1332 434 1077 -939 -950 1285 335 -1396
2846 -1396 129 1491 -585 -1199 985 885 -1159 -256 1166 -22 -1446 683 1168 -1062 -751 1193
2862 1193 287 -1297 59 1206 -550 -1079 977 845 -1195 -290 1424 -31 -1217 812 1151 -781
2878 -781 -528 1216 366 -1316 182 1221 -557 -1056 999 501 -1254 -271 1271 -183 -1222 783
2894 783 1037 -1012 -528 1309 222 -1201 357 1188 -645 -860 1075 537 -1176 -134 1248 -317
2910 -317 -1091 789 878 -904 -547 1163 240 -1183 439 1251 -676 -783 983 648 -1364 -9 1341
2927 1341 -437 -1078 425 862 -1008 -588 1150 42 -1239 328 1094 -508 -771 1007 630 -1171
2943 -1171 -68 1241 -276 -1076 735 623 -918 -453 1121 82 -1059 223 1062 -737 -808 1096
2959 1096 490 -1014 117 1127 -318 -1066 702 800 -911 -668 917 -118 -1222 397 899 -873
2975 -873 -749 902 565 -976 -31 1134 -381 -1127 857 645 -977 -403 1133 -56 -1034 302 959
2992 959 -717 -837 1045 415 -1135 -161 1070 -379 -993 739 623 -1022 -325 1046 205 -995 308
3009 308 998 -690 -755 1098 373 -1036 -35 1026 -365 -1100 761 693 -1053 -413 1111 101 -1052
3026 -1052 604 1070 -727 -537 1052 450 -992 121 1141 -408 -946 789 540 -878 -398 1065
3042 1065 -204 -987 288 819 -680 -609 1177 251 -962 132 1167 -297 -828 841 578 -1035 -218
3059 -218 1094 -185 -1063 482 976 -777 -550 926 337 -937 110 1079 -400 -808 811 607 -943
3076 -943 -19 953 -216 -836 382 787 -760 -552 933 -95 -1101 137 806 -503 -768 778 407
3093 407 -900 -333 1085 -74 -962 615 841 -604 -317 935 156 -1002 -15 948 -524 -746 722
3110 722 424 -1033 -156 1014 -198 -716 492 826 -557 -502 1071 170 -846 281 1000 -422 -756
3127 -756 739 277 -923 -80 1148 -114 -976 595 605 -1052 -401 953 180 -874 270 863 -377
3144 -377 -581 783 453 -956 -152 997 -380 -989 507 580 -888 -423 902 -127 -913 290 751
3161 751 -679 -776 862 363 -697 -148 806 -312 -747 529 555 -763 -318 832 -67 -909 333 690
3179 690 -554 -567 753 322 -738 40 931 -315 -738 592 639 -624 -220 746 128 -933 319 767
3197 767 -696 -643 823 31 -969 2 730 -58 -896 518 573 -725 -260 789 46 -924 375 678
3215 678 -548 -516 658 125 -910 58 854 -348 -640 625 292 -670 -153 853 -20 -767 337 794
3233 794 -442 -331 818 230 -827 204 709 -386 -554 453 570 -642 -326 762 -266 -864 459
3250 459 449 -570 -280 881 323 -921 192 941 -257 -637 689 435 -607 -47 586 -114 -812 326
3268 326 755 -691 -411 851 134 -601 134 653 -394 -569 544 530 -754 -213 740 -252 -807 404
3286 404 622 -588 -215 810 48 -649 95 688 -329 -521 695 565 -667 -98 792 -251 -577 522
3304 522 586 -721 -395 557 172 -936 197 720 -496 -563 496 258 -647 53 746 -61 -679 525 548
3323 548 -568 -392 749 64 -689 323 650 -399 -544 704 162 -786 10 698 -348 -674 502 515
3341 515 -668 -415 580 86 -812 313 586 -604 -384 594 161 -772 -28 539 -309 -732 337 540 -698
3360 -698 -224 767 171 -492 337 609 -525 -365 596 324 -789 96 734 -293 -527 509 226 -712 -368
3379 -368 686 106 -704 202 658 -553 -402 485 213 -786 119 684 -356 -550 366 370 -642 -243 749
3398 749 -85 -554 266 526 -459 -518 554 81 -580 135 730 -180 -695 551 462 -739 35 520 89 -649
3418 -649 388 483 -552 -510 557 169 -725 69 586 -382 -605 413 408 -468 -252 805 -142 -597 441
3437 441 408 -361 -241 506 103 -643 -31 611 -296 -512 591 363 -586 -48 631 9 -558 207 381 -339
3457 -339 -318 673 177 -714 115 642 -250 -452 464 260 -502 -271 678 -151 -704 251 351 -426 -264 686
3477 686 178 -565 73 577 -265 -563 364 328 -797 -47 568 -191 -502 179 291 -482 -429 640 216 -712
3497 -712 72 515 -386 -434 679 184 -490 -165 667 -38 -579 412 362 -644 -208 570 1 -464 176 451
3517 451 -252 -275 409 271 -428 84 725 -307 -560 420 476 -599 -365 525 60 -617 161 445 -383 -306
3537 -306 450 135 -565 14 584 -195 -449 387 522 -403 -148 767 -10 -576 149 502 -419 -418 333 84 -440
3558 -440 -42 636 -187 -547 427 316 -339 -103 575 -14 -568 212 453 -403 -445 415 204 -538 126 521
3578 521 -282 -501 279 281 -449 -156 648 -119 -407 283 558 -363 -426 470 211 -526 79 506 -366 -521 415
3599 415 202 -566 -127 347 -109 -576 125 440 -306 -426 480 137 -553 95 483 -143 -399 274 368 -444
3619 -444 -230 482 44 -295 135 499 -438 -362 302 146 -346 73 505 -290 -439 522 356 -377 59 425
3639 425 -86 -417 121 388 -410 -303 510 -98 -451 76 482 -181 -500 416 253 -407 81 475 -19 -337
3659 -337 388 398 -204 -251 466 52 -395 26 472 -236 -381 465 144 -683 -116 397 -119 -325 370 329 -314
3680 -314 -374 514 160 -694 101 392 -490 -220 463 22 -317 -197 375 -130 -497 201 319 -399 -182 417
3700 417 234 -403 -3 443 -244 -438 406 169 -341 -129 544 -125 -534 195 331 -415 -263 326 104 -237
3720 -237 170 467 -162 -284 368 229 -305 -38 416 -165 -238 287 155 -271 -270 374 -84 -508 244 454 -231
3741 -231 -335 449 179 -439 -16 436 17 -387 367 458 -375 35 312 -57 -489 82 410 -370 -287 392 140
3762 140 -478 -4 309 -142 -274 339 303 -244 4 541 72 -407 202 235 -376 -205 133 146 -455 29 539
3783 539 -142 -537 293 328 -446 -24 334 -46 -223 31 220 -306 -297 318 -6 -415 -53 284 -286 -331 280
3804 280 204 -229 -143 416 65 -442 249 314 -393 -51 248 256 -222 90 239 -160 -269 341 359 -446 -106 271
3826 271 -199 -486 183 225 -249 -111 287 136 -458 119 466 -196 -168 239 176 -376 -173 387 68 -389 110
3847 110 328 -257 -164 400 156 -417 63 315 -122 -129 364 74 -186 -96 508 -47 -314 211 153 -287 -331 306
3869 306 102 -354 135 299 -211 -250 418 221 -196 54 470 17 -283 232 273 -248 -147 409 29 -386 188
3890 188 488 -235 -254 291 126 -303 -23 303 47 -316 177 299 -293 -276 239 127 -347 130 286 -80 -304
3911 -304 296 139 -380 -95 211 -57 -329 231 232 -98 23 429 28 -406 144 227 -146 -80 237 76 -387
3932 -387 -170 136 -20 -171 155 326 -409 -190 285 235 -249 -43 341 -86 -286 343 244 -339 46 221 -116
3953 -116 -136 186 222 -371 -81 392 -212 -267 -49 311 -181 -264 338 194 -371 -3 412 112 -258 247 245 -313
3975 -313 132 242 -116 -185 99 284 -221 -151 165 110 -321 137 279 -167 -230 251 235 -360 -159 363 -47 -359
3997 -359 59 294 -290 -39 84 116 -337 -16 357 -105 -265 198 155 -460 -163 176 89 -85 70 355 -167
4018 -167 -112 427 185 -352 -79 385 -116 -106 231 93 -49 -76 485 -21 -330 107 190 -239 -91 453 54
4039 54 -150 7 246 -71 -254 230 -18 -340 5 289 4 -245 176 127 -275 -159 171 81 -275 -113 306
4060 306 -29 -378 48 56 -188 -164 326 -51 -234 85 276 -253 -90 350 -42 -240 88 237 -79 -45 232
4081 232 111 -227 -168 349 66 -184 94 245 -204 -167 130 -19 -203 31 314 -35 -280 262 248 -325 -41
4102 -41 347 -29 -85 214 146 -102 -110 356 20 -220 101 133 -183 -97 321 210 -243 -151 233 -147 -136 223 96
4125 96 -212 -63 279 16 -262 73 174 -98 -186 139 124 -277 -7 167 -85 -241 30 133 -133 -52 159
4146 159 -43 -332 61 260 -126 -211 106 187 -403 -123 349 -116 -333 184 288 -293 63 273 -42 -400 81
4167 81 54 -267 -284 143 265 -269 -89 274 -164 -180 -108 114 -34 -147 249 68 -342 -23 174 -131 -63 298
4189 298 58 -418 -148 366 -60 -49 87 146 -249 -130 163 124 -274 77 201 -161 -228 73 15 -267 -36 213
4211 213 20 -222 132 157 -111 5 347 9 -121 40 190 -229 -180 257 239 -194 -128 301 -105 -157 235 256
4233 256 -281 -161 193 -31 -213 78 225 -164 -117 108 57 -239 -46 170 -125 -245 288 93 -364 57 184
4254 184 7 -186 117 206 -121 -206 170 136 -73 -67 15 18 -215 72 -22 -93 -20 277 -97 -219 -44 163 -103 -118
4278 -118 289 104 -214 57 224 -107 -228 251 193 -238 66 157 53 -2 -274 123 -209 -104 275 9 -188
4299 -188 -55 281 -26 -106 114 192 -197 -69 182 -99 -169 -10 174 -188 -106 17 -1 -211 24 195 -158 -213
4321 -213 180 192 8 66 273 -174 -81 236 250 -43 -147 132 23 -251 102 242 -25 -159 204 -11 -59 -58
4343 -58 154 46 -203 34 273 -233 54 195 -39 -3 70 242 -67 -158 138 151 -216 -137 155 45 -125 172
4365 172 152 -258 36 270 113 -247 120 324 -45 -71 157 114 -84 -189 157 12 -77 -20 286 -103 -183 198
4387 198 -216 -141 -1 33 -38 -158 116 66 -81 23 175 -41 -182 177 61 -225 -114 181 124 -223 -27 291
4409 291 -169 -151 22 0 -109 33 133 -26 -161 -86 223 -149 -7 193 -154 -12 128 180 123 -107 135 125
4431 125 -118 150 175 52 -287 130 124 -215 -46 24 -82 -82 -75 189 -60 -125 210 115 -189 -4 80 -264 -6 142
4455 142 41 -121 50 180 -31 -396 246 260 -155 -18 246 61 -100 29 204 -123 -59 -41 98 -253 55
4476 55 165 -82 -117 -39 248 -11 -123 152 57 -341 75 124 -11 -260 140 197 -98 20 113 -44 -124 160 143
4499 143 -32 -60 71 128 -215 52 -58 -163 -144 150 108 -71 -52 144 -18 -59 252 99 -110 -67 77 155 -206
4522 -206 9 152 -211 -188 168 108 -53 -70 167 -94 -152 75 8 -181 -129 224 45 -139 -16 41 -133 -226 78
4545 78 239 -255 -83 255 -120 -44 -31 121 -8 -124 207 124 -167 40 24 -102 -318 85 -65 -98 97 175
4567 175 135 10 180 186 -17 28 163 35 -104 3 217 -54 -23 36 48 -144 34 75 28 -157 132 82 -28
4590 -28 -78 69 -104 -165 85 133 -97 -358 134 28 -100 167 218 -60 -209 134 92 -149 -36 140 -117 -24
4612 -24 87 98 -244 40 61 54 -38 -14 -48 -104 -153 201 171 -168 -21 49 -184 -193 -146 288 -100 -95 259 28 -118 51
4638 51 204 72 -1 41 49 19 -184 250 -117 -119 49 76 -86 -186 60 -67 -90 -40 146 -54 -75 41 219 -227
4662 -227 68 177 -70 -146 -51 91 -85 -162 207 -19 -261 78 5 109 -77 252 55 -84 -21 178 108 -184
4684 -184 29 151 -191 -116 158 105 -29 -11 105 -119 -39 81 59 -101 35 2 -215 -85 150 67 -119 -4
4706 -4 195 6 -27 66 280 -106 -135 78 -2 -155 16 209 -52 -282 -39 38 -110 -15 81 132 -117 6 123
4729 123 -91 -93 58 -50 -173 -76 27 -68 -230 6 109 -190 -7 129 -84 -281 -101 31 -65 -228 38 110
4751 110 12 41 172 -34 -174 87 75 22 15 9 100 46 110 283 -6 -50 118 -104 -103 126 257 -197 -44 42 341
4776 341 -228 -54 259 123 -209 -32 228 -101 -152 78 -28 -246 142 103 119 -10 88 236 44 -39 314 153
4798 153 -181 5 103 -56 -20 238 88 -10 -13 198 -77 -201 162 201 -56 -7 126 -27 -98 61 155 -112 82
4821 82 179 59 -254 -32 84 -103 -57 -11 52 -60 21 -57 4 -135 74 7 -91 -140 -19 50 -48 -46 166 1 -97
4846 -97 -14 119 -154 -121 47 -14 -137 98 44 31 51 85 -41 -111 -7 144 -74 -100 214 -4 -200 108 18 -59
4870 -59 -107 -42 -3 -95 -327 68 -47 -66 -16 92 -215 -88 130 167 -153 -83 163 181 -33 170 -60 -33 -180 88
4894 88 72 -122 49 78 22 0 79 32 -107 17 172 -21 -99 7 75 -6 -82 79 21 -12 96 145 -131 -112 56
4919 56 224 -67 -127 141 24 -59 199 242 -173 -94 145 184 -83 96 142 -34 -176 -49 129 -158 -56 144
4941 144 -115 87 2 162 -133 -23 142 -46 -75 -40 25 -172 -69 152 37 -134 124 92 -72 -172 117 3
4963 3 9 -65 100 110 -246 13 96 -122 -108 224 6 -217 -48 143 61 -288 298 8 -75 123 37 -46 -79 22
4987 22 108 -141 -80 251 124 -170 2 220 -102 -74 72 89 -203 -153 209 -115 -85 -94 72 3 -27 36 -83 -101
5011 -101 -33 -72 70 -1 53 -2 7 16 -4 -169 -195 35 3 -181 -42 151 122 -77 0 36 -129 -86 153 162 -136 -9
5037 -9 163 -5 -36 -85 143 -73 -174 -6 8 17 62 26 -63 -80 47 182 9 5 191 -22 -65 189 183 -120 -44 168
5063 168 -105 -92 193 84 -46 -219 102 -114 -113 83 133 -78 -124 -2 -29 -158 -16 40 36 -84 -86 92 33 -108
5087 -108 128 -48 -100 36 -8 28 -139 57 74 -163 -216 178 86 -60 -63 56 -62 -32 135 99 -127 -93 111 16
5111 16 -123 -90 142 -124 -74 28 -99 -139 -131 11 89 -96 113 179 -189 -2 58 55 -134 21 153 -18 -27 140
5135 140 13 -172 35 -6 -57 -24 98 -56 -152 -6 86 -87 -113 39 -62 -66 -137 98 64 -119 -63 75 -15 -77
5159 -77 208 -59 36 -157 -28 -96 0 -7 89 -245 2 108 5 -73 -46 220 -70 -69 201 144 -78 44 168 -66
5183 -66 -119 54 215 -98 -39 -66 6 -18 176 64 103 -5 213 -57 -33 116 -32 -27 -41 -9 8 68 24 23 142 -117
5209 -117 -62 161 -112 -154 142 54 -180 155 97 -68 -88 233 146 -165 60 101 84 28 94 14 -187 -120 -9 198
5233 198 -184 76 127 -25 110 94 92 -16 103 -25 -98 -102 12 24 -62 -25 89 42 -141 17 197 -63 37 -34
5257 -34 -35 -87 113 -23 -62 129 -39 168 -59 -99 29 -33 21 69 292 -105 42 42 107 -113 -127 142 -70 -138 95
5282 95 69 -44 -104 215 219 -41 -60 83 -49 -34 -18 -120 -192 -176 -83 18 -142 -103 -14 -146 64 170 45 -183
5306 -183 -14 68 60 -25 92 124 -263 -37 -27 -7 -193 -127 -3 17 51 48 -6 -277 -81 82 -104 -29 14 -68 -63 33
5332 33 -3 134 -151 6 194 -137 -125 86 -97 106 72 18 0 -26 65 -58 -3 28 65 -34 -144 146 99 75 -107
5357 -107 91 -39 -181 -44 15 -150 17 90 16 3 45 173 -17 64 200 47 -164 16 118 -23 -44 121
5379 121 30 65 -189 185 81 -135 84 47 60 -102 -47 49 -41 -81 84 177 -140 36 106 53 -41 175 26 -72
5403 -72 65 74 59 -339 27 39 -140 -80 108 118 -175 66 -37 107 -7 63 -74 79 75 60 -10 -127 59 -10
5427 -10 -126 -14 96 57 -1 51 -139 26 65 268 96 -114 83 59 -16 203 54 142 72 -47 -12 -191 -162 -96
5451 -96 -27 142 -29 116 237 -159 50 155 -64 -119 38 54 6 -27 -132 120 -58 78 122 -77 -49 -136 97
5474 97 -96 -155 137 -100 -58 46 -85 -143 -58 48 57 -36 210 216 69 -83 -43 -113 -73 106 41 -72 -27 88 -3
5499 -3 54 -17 64 -112 -133 69 -64 -64 -49 231 72 -135 13 -5 -149 -71 51 32 -87 -158 60 2 -184 159 98
5524 98 -71 -57 54 79 -66 -55 148 96 -10 109 40 28 107 36 -89 -15 152 119 40 -62 -81 28 -211 -82
5548 -82 -18 16 48 2 -64 -104 -63 135 -53 -19 19 -32 37 -50 156 185 -59 -40 179 -176 -88 -8 42 33 -41 -13 -118
5575 -118 -119 -24 -129 -212 -126 188 53 -187 2 87 -152 -46 71 -76 -35 27 28 -28 -137 -168 138 -35 120 132
5599 132 -15 -72 29 33 -20 115 192 -6 -149 -85 -29 -88 -92 5 -38 -155 -186 171 -64 -73 45 125 -219 2 91 36
5625 36 -100 26 63 0 -102 117 3 -16 -121 98 55 -30 19 100 85 -19 -4 140 14 19 -55 -112 5 63 -130
5650 -130 -95 -136 -35 -81 -67 101 144 3 -3 106 100 57 72 31 137 -88 127 -83 -12 -43 82 145 60 -21 -33 -77
5676 -77 54 45 -33 -117 25 -44 -203 77 -107 -23 -70 40 -29 1 125 82 -95 201 -65 -75 179 -94 64 155
5700 155 -122 -292 7 -26 -75 -58 96 17 37 92 69 -155 -24 -31 -35 71 6 -1 145 -14 -17 30 89 127 -55 -104 74
5727 74 103 108 -17 136 32 -48 -100 59 83 -94 57 -12 311 -49 5 21 143 -80 33 77 -106 -5 64 -94
5751 -94 -75 158 -11 -172 -82 71 261 -72 -33 111 -84 -6 156 -15 -185 105 101 173 -47 -13 68 -160 -33
5774 -33 40 0 -46 136 133 -94 104 86 8 -26 35 34 -80 -157 62 87 -129 55 -12 25 -20 118 128 -65 -53 94
5800 94 142 -6 69 85 -30 88 82 5 6 -68 -73 21 -7 12 -73 147 176 -46 111 23 -75 17 -190 -133 -24 -45 -56 -88
5828 -88 24 -19 36 123 146 -43 5 -2 68 47 53 70 -71 35 54 53 -3 0 238 -47 -80 87 50 19 -25 221 98 -41
5856 -41 45 122 -48 -144 41 228 -150 -142 109 -98 26 52 -45 1 25 133 -5 107 58 47 -104 -147 -169 121 -157
5881 -157 -80 61 51 -89 -63 -129 -87 81 192 29 -42 120 94 43 -145 69 118 -58 -97 45 -78 -28 92 158
5905 158 15 -147 132 -40 -86 -1 -81 -33 -136 36 21 -130 98 119 11 -43 -115 27 -45 13 -15 65 -125 -123 251
5930 251 -52 -102 -50 46 -53 10 200 68 -134 38 20 -83 99 31 -17 -44 -40 73 138 -30 63 -117 115 104 -42
5955 -42 -9 49 230 195 41 -113 235 -67 -57 95 31 -38 -62 -65 -132 -37 -149 72 -10 -113 -23 -42 -54 62 71 -33
5981 -33 -48 -89 -56 -58 53 107 110 -27 -69 -58 115 -42 83 250 -122 -38 78 -39 -90 56 56 -109 -24 -56 -30 -79
6007 -79 52 137 -52 -131 32 3 -128 -112 99 -22 143 -69 67 17 108 -61 89 203 85 195 -172 48
6029 48 -35 109 48 -143 80 -21 -43 -51 84 -179 14 -99 -125 -138 -39 47 -53 -85 -54 43 -136 89 81 81 -169 -149
6055 -149 -13 -87 -92 -45 -89 -72 21 148 -203 -87 52 24 14 -57 -16 -34 87 98 126 -119 -56 45 36 -124 -7 6
6081 6 -100 -144 -49 -21 27 80 78 -20 50 -60 58 34 -14 -28 51 101 110 14 -154 48 -10 24 -164 22 9 -126 -34 49
6109 49 7 -58 -38 96 130 -54 6 66 121 140 61 -13 -103 -31 -34 136 51 74 -54 -137 103 75 -136 -11 134 135 54
6136 54 -46 86 78 -103 -10 66 -157 51 114 -47 17 78 9 146 -106 40 86 58 -33 3 -49 -175 40 76 32
6161 32 25 -3 -40 60 -166 41 -57 51 -13 -89 -131 -132 -89 -54 -28 79 23 -136 -144 178 22 92 -66 19 97 -1 23
6188 23 59 -69 11 -22 -115 -31 129 -101 -18 60 66 -74 -161 40 45 -80 88 29 -73 2 -57 -138 -231 -100 -140 71
6214 71 -166 -25 -101 -65 -78 -73 -18 -190 110 115 -2 -48 -69 -17 -32 -109 -44 135 -67 -89 17 -126 -62 52 100 129
6240 129 -82 -20 -167 -104 115 -83 -175 -181 75 48 10 80 7 18 -84 -24 13 -5 -25 -62 44 82 51 79 28 -109
6266 -109 -41 30 145 -179 111 -164 25 -199 1 -24 -13 -115 74 -45 -4 109 109 -56 -142 95 4 10 -4 -108
6290 -108 227 66 51 104 -64 22 91 -56 60 52 62 11 -78 40 -70 94 -56 121 11 147 -16 -23 48 -48
6314 -48 -59 175 35 -74 -129 55 180 175 -114 44 210 -102 49 -51 -1 45 -96 -25 7 -235 92 131 96 -24
6338 -24 164 -25 3 158 -48 85 -60 114 55 18 49 -12 -10 136 -112 154 10 123 -55 117 14 -28 -9
6361 -9 -81 51 190 105 41 82 88 134 258 154 -37 101 -168 61 49 14 -77 43 79 -90 22 6 -76 -27 -11 -59
6387 -59 -70 30 -100 79 39 84 -200 -43 77 2 47 -82 -23 -90 -74 63 52 34 -172 161 175 34 -269 -56
6411 -56 -91 -31 92 -43 -68 67 87 -42 181 -160 133 -4 -127 23 -5 -17 120 -67 13 -85 54 30 49 -106
6435 -106 92 108 45 -50 37 87 -74 -120 -49 -75 4 86 97 6 -68 -17 40 26 39 -8 -115 48 -21 38 38 -52 -53 90
6463 90 -13 28 -201 -19 77 -34 122 -86 137 78 38 -25 28 -62 -69 -87 34 -99 -125 80 188 -62 -78 64
6487 64 41 -126 31 37 -45 80 100 67 2 170 133 -48 16 191 46 -20 68 65 -158 115 88 70 144 60 -15 101
6513 101 -28 87 -13 52 -49 -87 -22 -60 -107 59 -78 49 29 77 73 117 94 48 -2 69 128 41 -60 -66 73 -135
6539 -135 -17 -11 78 -28 -103 74 40 91 -81 -11 -7 31 78 -69 -45 -59 -113 -7 39 -142 -39 -73 32 -33 14 -5
6565 -5 213 20 -120 -33 59 -63 -60 114 7 -69 -34 -30 -91 33 -163 -121 79 -7 5 -85 5 162 39 -75 -14 61
6591 61 -166 -115 2 60 -134 51 85 28 -45 -167 144 -56 157 64 40 54 -90 64 -36 -127 33 127 23 4
6615 4 -87 96 69 -41 -29 -107 -129 65 -67 -53 -1 8 247 -216 36 67 -101 158 -12 -21 -14 -266 38 -92 31
6640 31 72 28 -106 -104 35 -132 -158 35 29 25 107 105 148 -98 33 -123 71 -25 -28 88 8 -48 113 -73 -107 12 11
6667 11 -1 -172 54 -80 -64 -15 -68 10 -39 -148 95 25 -87 -45 9 7 44 22 -121 35 -2 35 -133 2 -117
6692 -117 -40 17 -25 -18 -97 -54 166 -10 -253 -90 -92 -21 -73 -77 -50 34 27 85 141 36 29 59 101 -64 101 125 -81 3
6720 3 153 -161 -32 48 -233 -90 -103 21 150 -46 141 -95 -14 -33 -107 -92 27 14 16 -17 85 -58 75 -123
6744 -123 -29 -9 201 37 45 -62 66 -41 100 25 -73 177 222 24 -21 33 49 -208 -35 22 -115 -94 -14 41 -5
6769 -5 81 -47 -145 -105 66 42 86 -64 -19 193 54 -7 40 14 52 -29 29 60 -122 75 34 28 -22 117 134 -14 -114
6796 -114 54 83 77 223 96 -11 26 -68 -96 244 106 25 -121 -97 38 6 -133 112 102 51 28 9 -8 39 48 227
6822 227 -23 -44 109 59 -90 -52 -76 44 41 154 110 62 -21 42 -48 -31 182 5 200 20 -29 -91 27 -54 27
6847 27 42 50 261 109 -169 -49 20 -14 -18 84 42 67 162 25 -99 -264 87 58 162 -158 -48 -84 -100 -14 -60
6872 -60 -38 -171 13 36 -3 -21 98 146 25 44 60 51 56 144 41 -59 -28 47 -22 -19 65 -20 -38 -224 -75 -148 20
6899 20 6 49 -166 -26 92 7 235 16 4 -63 134 40 33 57 97 149 -118 71 -60 36 40 17 -27 -103 10 -116
6925 -116 48 -158 70 89 11 47 -96 20 55 69 -64 33 -149 -136 117 38 -23 39 -3 -81 -60 97 -16 -165
6949 -165 -31 169 34 12 21 148 -30 -50 42 39 -95 -121 79 -28 71 179 132 41 94 -97 148 34 -95 -20
6973 -20 -35 15 -84 27 -90 174 71 -44 120 81 -239 41 -59 88 -4 -7 119 91 -85 51 151 -17 -26 -158
6997 -158 150 156 -49 -2 -41 0 -20 7 -14 151 33 46 55 39 187 107 43 71 -123 -61 93 -63 113 -177 -29
7022 -29 -85 -109 -3 -34 -160 14 -62 -101 126 -54 9 -35 -100 -6 46 29 38 -96 52 6 74 38 11 21 27 45 56 -83
7050 -83 -66 46 37 13 -35 -39 166 -6 19 -17 -62 98 103 -90 -35 -28 -3 48 -6 26 -215 -62 14 71 -43 39 204 19
7078 19 -117 -21 -5 2 -155 -1 56 97 -11 -166 -9 -53 15 91 7 87 180 -56 6 -145 36 -50 -161 -8 -141
7103 -141 84 -130 115 12 117 -68 -125 -109 -29 100 68 20 64 -92 -96 46 119 46 -99 -53 -10 -34 -47 10 6 72
7129 72 38 -55 -16 47 1 -64 -72 51 64 -231 -15 0 -47 -7 -3 -5 -91 20 -64 2 -60 16 144 33 -12 -88 -16 -82 -4
7158 -4 56 -52 17 120 -65 -106 62 142 -76 -68 146 101 33 126 -43 47 9 40 -138 85 -101 42 -18 43 121 82
7184 82 58 105 -32 38 -11 -163 -7 35 34 45 -8 100 18 177 -81 4 -102 -97 179 -135 23 -185 -43 -104 -63
7209 -63 -59 -42 6 2 16 -94 13 -43 -21 36 -71 -156 -24 -21 127 -21 -7 105 -43 52 17 54 119 -154 -111 61 54
7236 54 45 -70 -5 -85 128 145 -79 -106 164 42 130 2 36 59 4 -47 46 -20 -8 -26 -119 -53 2 -241 83 70 -29
7263 -29 -11 -23 34 6 124 -242 103 -28 15 -5 -16 168 -66 -32 -23 1 -163 -13 45 20 -36 64 50 -66 101
7288 101 -8 -63 -42 31 -40 78 74 -115 -41 -142 -43 15 -50 -86 -27 228 -11 70 107 -130 -73 46 -46 -63 -19 -110
7314 -110 45 -50 36 4 -80 -46 91 -51 -68 -28 -74 -82 -111 -35 -8 -173 20 3 -173 48 83 75 163 -74 -57 -59 -119
7341 -119 -16 112 -37 154 31 70 11 -134 71 202 -90 170 83 67 3 -70 26 -139 30 125 -19 -46 -10
7364 -10 75 -156 62 67 36 -11 101 27 -5 -9 144 -21 -93 175 -159 78 28 24 -6 -63 55 -62 36 -35 102 33
7390 33 0 9 109 124 32 131 -5 -47 -25 27 -106 -2 -58 120 -55 19 2 5 157 -18 53 -49 53 27 60 100
7416 100 155 78 89 -212 -89 1 56 55 -13 -53 -188 61 -1 -61 52 61 -146 7 114 26 -30 -20 111 -3 12 126
7442 126 105 -47 -181 -18 -78 79 -154 83 32 -17 100 164 103 11 118 111 154 -98 73 -40 -42 -100 203 14
7466 14 87 -120 38 6 -101 -71 -51 -64 105 71 -154 86 30 -33 14 69 -18 -92 -94 -59 -113 -86 45 -81 55 117
7492 117 -92 43 88 56 139 47 -38 -8 22 -46 99 79 25 -37 90 99 -23 -258 95 46 16 -100 -21 -82 -3 -30
7518 -30 -41 -45 22 -14 -19 45 -113 137 -131 -2 -74 -3 3 -62 35 -39 -136 8 -51 5 23 46 46 -26 -60 26 80 -164 39
7547 39 -43 -21 -94 15 46 -61 162 86 -85 -48 -100 -63 37 44 -46 -50 -201 55 -111 -98 61 123 -51 -50 3 96 -86
7574 -86 -50 -52 19 19 75 63 216 -21 48 -48 -83 24 -32 -90 -66 26 50 48 44 157 -70 -114 23 82 29 -2 70 74 -35
7603 -35 1 -39 64 -123 -71 39 -174 -13 -30 150 -72 20 75 129 30 -105 62 -154 130 -60 154 -158 -110
7626 -110 37 -156 -73 119 -115 -73 -45 -88 -16 16 10 -36 -4 11 56 77 -88 -68 -23 4 -105 67 -198 -1 -213
7651 -213 68 -40 -22 101 113 -111 -70 -106 3 55 -35 126 23 45 -40 22 -53 -75 -12 133 -174 -104 -9 36 87
7676 87 -63 -131 89 37 82 -72 -75 94 -196 -15 -60 -48 67 -53 4 -6 17 156 -54 70 63 -62 -224 9
7700 9 61 -53 24 6 152 -21 120 -38 -63 81 67 55 91 80 -33 44 64 135 308 101 -41 -98 26 41 9
7725 9 24 -27 -50 -70 -73 -40 128 -22 -176 41 -122 64 50 104 -178 -117 56 28 73 -156 -119 39 -15 -59 138 -13
7751 -13 22 149 -66 69 -58 -65 -76 -114 36 -65 78 115 62 108 40 -84 -111 11 34 -11 65 23 -44 -11 32 -108
7777 -108 -114 -126 93 61 -159 -49 -48 75 -14 -60 -72 -82 -29 -153 36 76 -29 -67 61 -118 -126 -6 -38 37 -12 -44
7803 -44 -51 111 -124 -73 3 143 -9 -48 81 14 34 23 -42 68 -104 6 -53 114 -153 49 83 -22 10 153
7827 153 35 -75 -147 -45 56 -12 -88 72 -24 32 -40 79 -7 159 97 -32 -15 0 -73 -81 -174 44 -20 78 59 20
7853 20 -60 -89 128 53 119 -28 19 -132 27 37 -117 77 -61 53 304 90 71 -90 -12 -106 83 -60 -35 43
7877 43 0 -87 -55 -44 -50 138 27 97 -50 -11 -55 -22 -59 117 -18 -100 10 32 -21 -86 31 65 -56 63 -74 48
7903 48 -27 -10 -77 -14 -45 103 18 37 -69 98 24 141 5 -99 -110 -47 142 -12 31 228 31 -20 19 12 -106
7928 -106 -62 103 -79 -23 -116 -151 -12 104 35 26 -143 -66 14 -14 181 72 -9 -32 -54 -143 -9 25 176 -83 8
7953 8 251 3 106 93 -70 2 -8 199 89 49 4 34 -108 3 45 -128 15 115 -6 -25 -41 24 -21 2 -103
7978 -103 -68 -30 64 -28 149 -140 7 -23 -34 -239 74 59 -13 37 24 -62 25 -19 -145 -8 -76 15 24 103 -114 141
8004 141 -6 -37 -59 7 -20 103 104 -22 -71 100 65 -27 -32 -9 189 94 84 -49 -15 66 51 -17 28 50 105 -55 -48 -113
8032 -113 -64 -35 32 -92 23 -85 -58 -66 81 -43 14 74 -113 157 2 -164 86 56 -61 -17 -14 -3 6 -43 -113 61
8058 61 50 -43 -6 103 72 13 114 -99 -59 -79 -52 119 48 -61 140 41 -145 99 -114 122 16 117 -214 40
8082 40 195 44 -41 99 -70 -111 -99 -28 -84 -62 -69 -79 14 -90 -90 54 55 -22 83 -116 -150 24 -20 256 30 -48
8108 -48 3 -65 87 151 20 -158 77 -89 148 -46 -77 -66 -150 136 -23 17 -167 53 39 68 -32 28 36 -100
8132 -100 91 18 151 15 108 -82 17 -3 39 51 53 60 101 0 26 174 108 49 51 90 47 46 79 167 -71 -26 3 120
8160 120 -37 -35 38 -13 6 124 -61 -35 63 86 -32 67 7 -139 77 -74 -48 -25 60 -28 15 82 51 -5 -204 -178
8186 -178 14 -44 49 3 32
8191C2
##END NTUPLES=NMR FID
##END=
