##TITLE=1H_ABBC0602
 CDCl3
 8 sc, 
 7.2.2024
##JCAMPDX= 6.0         $$ Bruker NMR JCAMP-DX V2.0
##DATA TYPE= NMR FID
##DATA CLASS= NTUPLES
##ORIGIN= UXNMR, Bruker Analytische Messtechnik GmbH
##OWNER= root
$$ XWIN-NMR		Version 3.5
$$ Wed Feb  7 14:10:37 2024 Russian Standard Time (UT+4h)  she@DPX200
##.OBSERVE FREQUENCY= 200.1313
##.OBSERVE NUCLEUS= ^1H
##.DELAY= (6, 6)
##.ACQUISITION MODE= SIMULTANEOUS
##.ACQUISITION SCHEME= undefined
##.AVERAGES= 8
##.DIGITISER RES= 18
##SPECTROMETER/DATA SYSTEM= spect
##.PULSE SEQUENCE= zg30
##.SOLVENT NAME= CDCl3
##.SHIFT REFERENCE= (INTERNAL, CDCl3, 0, 15.7039)
##AUDIT TRAIL= $$ (NUMBER, WHEN, WHO, WHERE, WHAT)
$$ ##TITLE= Audit trail, XWIN-NMR		Version 3.5
$$ ##JCAMPDX= 5.01
$$ ##ORIGIN= Bruker BioSpin GmbH
$$ ##OWNER= she
$$ F:/spectra/data/she/nmr/H-F/1/audita.txt
$$ ##AUDIT TRAIL=  $$ (NUMBER, WHEN, WHO, WHERE, WHAT)
(   1,<2024-02-07 14:09:12.85 +0400>,<she>,<DPX200>,
      <created by zg, POWCHK disabled, PULCHK disabled
       configuration hash MD5:
       00 E9 B6 7A A2 85 ED C7 34 08 36 98 17 FE 4E 26
       data hash MD5: 16K
       88 FC C8 4C 98 96 36 5E 3A 8D F3 82 EF 57 CB 1C>)
$$ ##END=
$$ 
$$ hash MD5
$$ C8 C8 36 29 4E 87 08 D0 0D 4A D9 B9 7C B4 8C E1
##$RELAX= 
##$RELAX= 
##$RELAX= 
##$RELAX= 
##$RELAX= 
##$RELAX= 
$$ Bruker specific parameters
$$ --------------------------
##$DU= <F:/spectra>
##$EXPNO= 1
##$NAME= <H-F>
##$PROCNO= 1
##$TYPE= <nmr>
##$USER= <she>
##$AMP= (0..31)
100 100 100 100 100 100 100 100 100 100 100 100 100 100 100 100 100 100 
100 100 100 100 100 100 100 100 100 100 100 100 100 100 
##$AQSEQ= 0
##$AQ_mod= 1
##$AUNM= <au_zg>
##$AUTOPOS= <>
##$BF1= 200.13
##$BF2= 200.13
##$BF3= 200.13
##$BF4= 200.13
##$BF5= 200.13
##$BF6= 200.13
##$BF7= 200.13
##$BF8= 200.13
##$BYTORDA= 1
##$CFDGTYP= 0
##$CFRGTYP= 5
##$CHEMSTR= <none>
##$CNST= (0..31)
1 1 145 1 1 1 1 1 1 1 1 1 1 1 1 1 1 1 1 1 1 1 1 1 1 1 1 1 1 1 1 1 
##$CPDPRG= <>
##$CPDPRG1= <>
##$CPDPRG2= <>
##$CPDPRG3= <>
##$CPDPRG4= <mlev>
##$CPDPRG5= <mlev>
##$CPDPRG6= <mlev>
##$CPDPRG7= <mlev>
##$CPDPRG8= <mlev>
##$CPDPRGB= <>
##$CPDPRGT= <>
##$D= (0..31)
0 1.2 0 0 0 0 0 0 0 0.06 0 0.03 0 0 0 0 0.0002 0 0 0 0 0 0 0 0 0 0 0 0 
0 0 0 
##$DATE= 1707300552
##$DBL= (0..7)
120 120 120 120 120 120 120 120 
##$DBP= (0..7)
150 150 150 150 150 150 150 150 
##$DBP07= 0
##$DBPNAM0= <>
##$DBPNAM1= <>
##$DBPNAM2= <>
##$DBPNAM3= <>
##$DBPNAM4= <>
##$DBPNAM5= <>
##$DBPNAM6= <>
##$DBPNAM7= <>
##$DBPOAL= (0..7)
0.5 0.5 0.5 0.5 0.5 0.5 0.5 0.5 
##$DBPOFFS= (0..7)
0 0 0 0 0 0 0 0 
##$DE= 6
##$DECBNUC= <off>
##$DECIM= 32
##$DECNUC= <off>
##$DECSTAT= 4
##$DIGMOD= 1
##$DIGTYP= 9
##$DL= (0..7)
0 120 120 120 120 120 120 120 
##$DP= (0..7)
150 150 150 150 150 150 150 150 
##$DP07= 0
##$DPNAME0= <>
##$DPNAME1= <>
##$DPNAME2= <>
##$DPNAME3= <>
##$DPNAME4= <>
##$DPNAME5= <>
##$DPNAME6= <>
##$DPNAME7= <>
##$DPOAL= (0..7)
0.5 0.5 0.5 0.5 0.5 0.5 0.5 0.5 
##$DPOFFS= (0..7)
0 0 0 0 0 0 0 0 
##$DQDMODE= 0
##$DR= 18
##$DS= 0
##$DSLIST= <SSSSSSSSSSSSSSS>
$$ [...]
##$SUBNAM2= <"">
##$SUBNAM3= <"">
##$SUBNAM4= <"">
##$SUBNAM5= <"">
##$SUBNAM6= <"">
##$SUBNAM7= <"">
##$SUBNAM8= <"">
##$SUBNAM9= <"">
##$SW= 18.0517328524113
##$SWIBOX= (0..15)
0 0 2 0 0 0 0 0 0 0 0 0 0 0 0 0 
##$SW_h= 3612.71676300578
##$TD= 16384
##$TD0= 1
##$TE= 0
##$TE2= 300
##$TE3= 300
##$TEG= 300
##$TL= (0..7)
0 120 120 120 120 120 120 120 
##$TP= (0..7)
150 150 150 150 150 150 150 150 
##$TP07= 0
##$TPNAME0= <>
##$TPNAME1= <>
##$TPNAME2= <>
##$TPNAME3= <>
##$TPNAME4= <>
##$TPNAME5= <>
##$TPNAME6= <>
##$TPNAME7= <>
##$TPOAL= (0..7)
0.5 0.5 0.5 0.5 0.5 0.5 0.5 0.5 
##$TPOFFS= (0..7)
0 0 0 0 0 0 0 0 
##$TUNHIN= 0
##$TUNHOUT= 0
##$TUNXOUT= 0
##$USERA1= <user>
##$USERA2= <user>
##$USERA3= <user>
##$USERA4= <user>
##$USERA5= <user>
##$V9= 5
##$VALIST= <valist>
##$VCLIST= <CCCCCCCCCCCCCCC>
##$VD= 0
##$VDLIST= <DDDDDDDDDDDDDDD>
##$VPLIST= <PPPPPPPPPPPPPPP>
##$VTLIST= <TTTTTTTTTTTTTTT>
##$WBST= 1024
##$WBSW= 4
##$XGAIN= (0..3)
0 0 0 0 
##$XL= 0
##$YL= 0
##$YMAX_a= 847235
##$YMIN_a= -864588
##$ZGOPTNS= <>
##$ZL1= 120
##$ZL2= 120
##$ZL3= 120
##$ZL4= 120
##$ABSF1= 10
##$ABSF2= 0
##$ABSG= 5
##$ABSL= 3
##$ALPHA= 0
##$AQORDER= 0
##$ASSFAC= 0
##$ASSFACI= 0
##$ASSFACX= 0
##$ASSWID= 0
##$AUNMP= <proc_1d>
##$AZFE= 0.1
##$AZFW= 0.1
##$BCFW= 1
##$BC_mod= 2
##$BYTORDP= 1
##$COROFFS= 0
##$CY= 11.3945322036743
##$DATMOD= 1
##$DC= 2
##$DFILT= <>
##$DTYPP= 0
##$F1P= 15.7292609196834
##$F2P= 12.9074282941183
##$FCOR= 0.5
##$FTSIZE= 0
##$FT_mod= 4
##$GAMMA= 1
##$GB= 0.15
##$INTBC= 1
##$INTSCL= 1
##$ISEN= 128
##$LB= 0.24
##$LEV0= 0
##$LPBIN= 0
##$MAXI= 10000
##$MC2= 0
##$MEAN= 0
##$ME_mod= 0
##$MI= 1.114404
##$NCOEF= 0
##$NC_proc= 0
##$NLEV= 6
##$NOISF1= 3.799351
##$NOISF2= 2.8
##$NSP= 1
##$NTH_PI= 0
##$NZP= 0
##$OFFSET= 15.70392
##$PC= 1
##$PHC0= -24605.93
##$PHC1= 23.65268
##$PH_mod= 1
##$PKNL= yes
##$PPARMOD= 0
##$PSCAL= 0
##$PSIGN= 0
##$REVERSE= no
##$SF= 200.130013532006
##$SI= 16384
##$SIGF1= 3
##$SIGF2= 2
##$SINO= 400
##$SIOLD= 16384
##$SREGLST= <1H.CDCl3>
##$SSB= 0
##$STSI= 0
##$STSR= 0
##$SW_p= 3612.71676300578
##$SYMM= 0
##$S_DEV= 0
##$TDeff= 0
##$TDoff= 0
##$TI= <>
##$TILT= no
##$TM1= 0
##$TM2= 0
##$TOPLEV= 0
##$USERP1= <user>
##$USERP2= <user>
##$USERP3= <user>
##$USERP4= <user>
##$USERP5= <user>
##$WDW= 1
##$XDIM= 8192
##$YMAX_p= 0
##$YMIN_p= 0
$$ End of Bruker specific parameters
$$ ---------------------------------
##NTUPLES= NMR FID
##VAR_NAME=  TIME,          FID/REAL,        FID/IMAG
##SYMBOL=    X,             R,               I
##VAR_TYPE=  INDEPENDENT,   DEPENDENT,       DEPENDENT
##VAR_FORM=  AFFN,          ASDF,            ASDF
##VAR_DIM=   8192,          8192,            8192
##UNITS=     SECONDS,       ARBITRARY UNITS, ARBITRARY UNITS
##FACTOR=    0.0002768,     1,               1
##FIRST=     0,             0,               0
##LAST=      2.2672688,     0,               0
##MIN=       0,             -864588,         0
##MAX=       2.2672688,     847235,          0
$$ Real data points
##PAGE= N=1
##DATA TABLE= (X++(R..R)), XYDATA
$$ plain form
0 0 0 0 0 0 0 0 0 0 0 0 8 -8 8 -8 8 -16 16 -20 24 -32 40 -44 48 -60 72 -84 92 -108 124 -142 164 -180 207
33 207 -236 264 -296 328 -368 413 -455 505 -561 621 -686 757 -833 922 -1015 1115 -1226 1352
51 1352 -1492 1647 -1817 2012 -2240 2498 -2795 3149 -3580 4109 -4775 5644 -6828 8537 -11181
66 -11181 15752 -25128 51579 -272238 -864588 292012 417332 -734857 -342866 831597
76 831597 172557 -635705 327193 734498 -496392 -579423 549616 163363 -799507 14165
86 14165 771339 -193783 -531965 554645 450055 -677328 -265325 634068 -134590 -717701
96 -717701 320026 603545 -442327 -296359 683503 153450 -693186 67245 579304 -386831
106 -386831 -529278 523442 328410 -593792 -37825 669061 -160788 -602275 339559 416781
$$ packed form
0@%%%%%%%%%%Qj6J6j6J6k4L2l6M4n6P2q4R2j08J32j56J76k00K32k66L06l44L87
33B07m43N00n60O24o96P81q68R60j066J182j307J443j590J755j937K130k341K578
51A352k844L139l464L829m252M738n293N944o729P689q884J0419j2472J5365j9718
66a1181K6933m0880P6707l23817n92350J156600J25320j152189L91991J174463
76H31597o59040q08262R62898M07305j230890q3031J129039l86253r62870Q13672
86A4165P57174r65122l38182J086610j04590j127383M12003Q99393p68658n83111
96g17701J037727K83519j045872J45968R79862n30053q46636P60431N12059r66135
106c86831j42447J052720j95032r22202N55967P06886q29849m41487R41834P7222
$$ plain form
116 416781 -553684 -258043 637838 53300 -593979 232279 558485 -403866 -414845 507650
126 507650 172853 -622109 13686 603438 -214529 -480238 435091 352313 -540906 -159728
136 -159728 559071 -83950 -559093 261598 460537 -405263 -274947 539761 101891 -560307
146 -560307 96191 492714 -302997 -402958 428755 247120 -497349 -41038 534788 -137981
156 -137981 -477665 300722 339339 -447452 -195234 499258 13854 -487173 181585 442448
166 442448 -323302 -313251 437640 142619 -498069 30962 474388 -203737 -391960 348234
176 348234 269785 -442087 -111814 473906 -72935 -454631 233057 363275 -358578 -219685
186 -219685 443360 67342 -456509 99580 417496 -252897 -325864 368860 186831 -432551
$$ packed form
116D16781r70465K95641Q95881n84538o47279Q26258L26206r62351j0979R22495
126E07650l34797p94962O35795N89752q17967k65709R15329q2778q93219L81178
136a59728P18799o43021m75143Q20691J98939q65800J30316Q14708m37870o62198
146e60307O56498L96523p95711r9961Q31713j81635p44469M56311N75826o72769
156a37981l39684P78387L8617p86791K52218O94492m85404n01027O68758K60863
166D42448p65750J0051P50891k95021o40688N29031M43426o78125j88223P40194
176C48234p8449p11872L30273N85720n46841l81696O87688J30218p21853J38893
186b19685O63045l76018n23851N56089L17916o70393p2967O94724j82029o19382
$$ plain form
196 -432551 -24261 435574 -134761 -384207 265162 278453 -370665 -146941 421477 -5794
206 -5794 -411695 163969 352511 -287005 -241679 370606 104651 -406789 41302 391360
216 391360 -181667 -321337 302367 209373 -378637 -71592 395428 -78890 -369193 206782
226 206782 291355 -310869 -175535 379109 40494 -388794 106330 348342 -231807 -259507
236 -259507 323815 141839 -371415 -6396 373384 -130012 -326913 246823 229841 -333724
246 -333724 -109350 365471 -26247 -351990 152874 296282 -255690 -199868 330756 80526
256 80526 -355203 53758 333359 -173188 -265235 266466 165893 -325404 -50614 339866
266 339866 -76397 -314643 189421 240978 -278089 -137350 325415 19099 -327976 100607
$$ packed form
196d32551M08290M59835n70335k49446O49369J3291o49118K23724N68418m27271
206e794m05901N75664J88542o39516M5326O12285k65955n11440M48091L50058
216C91360n73027j39670O23704r2994n88010L07045M67020m74318k90303N75975
226B06782Q4573o02224J35334N54644l38615m29288M95124K42012n80149k7700
236b59507N83322j81976n13254L65019L79780n03396j96901N73736j6982n63565
246c33724K24374M74821l91718l25743N04864J43408n51972N5822N30624k50230
256H0526m35729M08961K79601n06547r2047N31701j00573m91297K74790L90480
266C39866m16263k38246N04064N1557n19067J40739M62765l06316l47075M28583
$$ plain form
276 100607 293354 -203683 -216805 286055 113985 -325380 8116 321277 -125609 -274057
286 -274057 221308 190225 -291657 -87551 320758 -31423 -310910 145032 255831 -237767
296 -237767 -165223 296887 58138 -312818 56933 293466 -159579 -233178 245646 143580
306 143580 -297199 -34206 304538 -79181 -274417 173667 206990 -248442 -118959 288753
316 288753 13442 -292809 95200 257111 -186422 -183573 253354 92658 -281486 10597
326 10597 278346 -110055 -238198 196632 164456 -259075 -70599 280402 -34841 -267233
336 -267233 128805 218167 -207413 -143798 260595 50460 -276963 54551 258768 -146641
346 -146641 -200162 220063 120447 -260661 -25973 269006 -72526 -244378 159716 182332
$$ packed form
276A00607J92747m97037j3122N02860j72070m39365L33496L13161m46886j48448
286b74057M95365l1083m81882K04106M08309l52181k79487M55942J10799m93598
296b37767P2544M62110k38749l70956L69751K36533m53045p3599M78824j02066
306A43580m40779K62993L38744l83719j95236M48084L3323m55432J29483M07712
316B88753k75311l06251L88009J61911m43533K849M36927j60696l74144K92083
326A0597K67749l88401j28143M34830l2176m23531J88476L51001l15243k32392
336b67233L96038Q9362m25580O3615M04393k10135l27423L31514K04217m05409
346a46641n3521M20225r9616l81108K34688K94979l41532j71852M04094K2616
$$ plain form
356 182332 -229400 -99097 261055 878 -259310 91979 224368 -170479 -160747 230262
366 230262 78908 -255797 18039 249192 -107282 -206033 180724 138173 -228701 -56805
376 -56805 245654 -33882 -235371 117434 189023 -188608 -119476 229669 34877 -238941
386 -238941 52972 220620 -129472 -171461 194054 103088 -230653 -16667 236332 -70140
396 -70140 -209496 144408 153842 -200580 -84164 228225 -652 -230349 83295 198397
406 198397 -156757 -139041 207273 63822 -226156 19701 219306 -96116 -182529 163689
416 163689 123973 -208549 -46706 223410 -37238 -208997 109824 165184 -169278 -105266
426 -105266 204667 30361 -215568 48494 197769 -119564 -150151 175018 86909 -201837
$$ packed form
356A82332m11732J30303L60152k60177k60188L51289J32389l94847R732L91009
366B30262j51354l34705K73836K31153l56474r8751L86757m2551l66874J71896
376e6805L02459k79536k01489L52805P1589l77631O9132L49145j94792k73818
386b38941K91913J67648l50092m1989L65515r0966l33741K13986K52999l06472
396g0140j39356L53904R434l54422J16416L12389k28877k29697L13644J15102
406A98397l55154J7716L46314j43451k89978K45857J99605l15422q6413L46218
416A63689l9716l32522J61843K70116k60648j71759L18821N5360l34462O4012
426a05266L09933j74306k45929K64062J49275l17333l0587L25169q8109k88746
$$ plain form
436 -201837 -11609 206225 -60941 -183409 127387 136210 -178576 -71405 202058 -5219
446 -5219 -200411 75255 169918 -137028 -121227 180455 56908 -200351 18119 196017 -88442
457 -88442 -160097 148193 106594 -184025 -39163 197461 -32193 -187144 98342 149361 -155616
468 -155616 -93829 187297 22732 -194549 46980 175394 -108966 -134773 158241 79041
478 79041 -184879 -9193 189703 -58329 -164745 118772 120124 -160463 -62501 179659 -3513
489 -3513 -180433 66415 153759 -124558 -108584 162591 47736 -177323 17648 170663 -76235
500 -76235 -140525 128998 96107 -162629 -35468 176306 -29251 -164119 88637 129589 -135785
511 -135785 -82506 162573 21926 -172892 38685 157562 -97884 -121278 142460 69552
$$ packed form
436b01837J90228K17834k67166j22468L10796Q823l14786J07171K73463k07277
446e219j95192K75666R4663l06946J5801L01682j23547k57259K18470J77898k84459
457h8442p1655L08290m1599k90619J44862K36624k29654j54951K85486N1019l04977
468a55616O1787K81126j64565k17281K41529J28414k84360k5807K93014p9200
478G9041k63920J75686J98896k48032j06416K83517J352k80587R7962K42160j83172
489c513j76920K46848Q7344k78317J5974K71175j14855k25059J94971J53015k46898
500g6235o4290K69523l2891k58736J27161K11774k05557j34868K52756M0952k65374
511a35785N3279K45079j40647j94818K11577J18877k55446k3394K63738p2908
$$ plain form
521 69552 -164026 -7668 167656 -50120 -147442 104147 110874 -144561 -57957 164510 -4110
532 -4110 -163241 61202 136873 -111470 -97693 144034 44487 -160893 13447 155892 -69794
543 -69794 -128320 118135 85855 -145335 -30170 156536 -23982 -146411 76549 118087 -120829
554 -120829 -75505 146004 18791 -153880 35387 137921 -85651 -106914 123060 62927
564 62927 -145739 -9137 150991 -44691 -131725 95247 97678 -128023 -49348 145608 -2581
575 -2581 -144750 52756 123635 -100480 -89224 130915 38058 -145081 13952 137746 -62932
586 -62932 -113479 104084 77548 -130504 -28219 142298 -22273 -131760 71614 104939 -107856
597 -107856 -65337 129255 17664 -136907 29047 124029 -76430 -97481 110680 55266 -129851
$$ packed form
521F9552k33578J56358J75324k17776r7322K51589O727k55435Q6604K22467j68620
532d110j59131K24443P5671k48343J3777K41727r9547k05380J74340J42445k25686
543f9794n8526K46455l2280k31190J15165J86706j80518j22429K22960M1538k38916
554a20829M5324K21509j27213j72671J89267J02534k23572k1263K29974o0133
564F2927k08666J36602J60128j95682q7034K26972K431k25701P8675J94956j48189
575b581j42169J97506P0879k24115J1256K20139r2857j83139J59033J23794k00678
586f2932n0547K17563k6536k08052J02285J70517j64571j09487K03374L3325k12795
597a07856M2519J94592j11591j54571J65954R4982k00459k1051K08161n5414j85117
$$ plain form
608 -129851 -7263 132166 -38217 -115572 81105 88339 -111330 -46339 129864 -1228 -128686
619 -128686 48142 109124 -88508 -77400 114359 35147 -128491 9282 124270 -56274
629 -56274 -103895 94498 68923 -117917 -23896 127123 -19582 -117188 63113 96157 -96710
640 -96710 -60418 118374 15575 -125208 28697 111012 -70100 -86255 98162 49784 -116347
651 -116347 -8328 119356 -34526 -105182 74201 78118 -100574 -39595 114975 -214 -112514
662 -112514 40782 98377 -76215 -71560 101102 32312 -114275 7513 108035 -47939 -91263
673 -91263 79119 62542 -100952 -25010 112245 -14230 -105402 54625 85949 -84552 -53604
684 -53604 103752 16571 -109147 22035 100971 -59744 -80858 88058 46583 -106601 -8718
$$ packed form
608a29851J22588J39429j70383p7355J96677P234j99669O4991J76203j31092j27458
619a28686J76828O0982j97632J1108J91759p9212j63638J37773J14988j80544
629e6274m7621J98393k5575j86840R4021J51019j46705r7606J80301L3044j92867
640i6710L6292J78792j02799j40783J53905Q2315j81112j6155J84417m8378j66131
651a16347J08019J27684j53882p0656J79383L917j78692O0979J54570j15189j12300
662a12514J53296N7595j74592M655J72662o8790j46587J21788J00522j55974m3324
673i1263J70382j6577j63494P5942J37255j26475r1172J60027L1324j70501L0948
684e3604J57356q7181j25718J31182P8936j60715k1114J68916m1475j53184R7883
$$ plain form
695 -8718 107075 -30394 -95148 64679 73349 -88738 -39400 105360 2935 -104604 36691
706 36691 90698 -69415 -64957 90694 31271 -102002 3725 99492 -40479 -86026 70757
717 70757 58231 -92738 -24340 100020 -10905 -93916 45518 79437 -71513 -51823 92697
728 92697 19248 -98779 17092 90984 -51247 -73114 74802 44098 -92033 -12605 95760
739 95760 -22527 -88273 55397 67917 -79401 -37498 93126 4699 -93320 29308 83752
750 83752 -57962 -62341 81778 32481 -93833 1608 91161 -36175 -78919 62106 54549
761 54549 -82581 -26118 91495 -6679 -88566 40656 74467 -65817 -48125 83716 18649
772 18649 -88270 13258 83924 -42853 -68611 67384 42987 -84313 -13318 86627 -20180
$$ packed form
695h718J15793j37469o4754J59827Q670j62087M9338J44760j02425j07539J41295
706C6691N4007j60113M458J55651n9423j33273J05727R5767j39971m5547J56783
717G0757j2526j50969O8398J24360j10925q3011J39434L3919j50950J9690J44520
728I2697p3449j18027J15871P3892j42231k1867J47916l0704j36131P9428J08365
739I5760j18287o5746J43670J2520j47318M1903J30624q8427r8019J22628N4444
750H3752j41714m379J44119m9297j26314R5441Q9553j27336m2744J41025p557
761E4549j37130N6463J17613r8174q1887J29222L3811j40284J7692J31841o5067
772A8649j06919J01528P0666j26777k5758J35995k4397j27300P0995R9945j06807
$$ plain form
783 -20180 -79736 47202 61872 -68939 -36784 83782 8257 -85050 25054 77024 -51648
794 -51648 -56516 72085 30302 -82329 -1622 82412 -28640 -73287 54380 51823 -75128
805 -75128 -25672 82333 -5619 -79954 33581 68049 -56632 -46524 75179 21391 -80924
816 -80924 9657 77839 -37801 -63357 59272 40476 -73960 -15297 78236 -13406 -74497
827 -74497 39826 59036 -61848 -36499 74280 8906 -76063 18677 69927 -41962 -53537
838 -53537 63092 32528 -73802 -4063 75229 -24081 -66691 46332 47931 -64547 -26817
849 -26817 72403 -381 -73428 27232 63808 -50089 -43760 66867 20033 -71783 6965 70413
861 70413 -30541 -59017 52754 40335 -67801 -15735 72117 -12331 -68666 34788 53765
$$ packed form
783b0180n9556J26938J4670j30811L2155J20566p5525r3307J10104N1970j28672
794e1648m868J28601m1783j12631Q0707Q4034j11052m4647J27667k557j26951
805g5128M9456J08005q7952p4335J13535L4468j24681J0108J21703n3788j02315
816h0924R0581O8182j15640k5556J22629j8796j14436N8663R3533r1642o1091
827g4497J14323J9210j20884K5349J10779o5374q4969R4740N1250j11889j1575
838e3537J16629l0564j06330O9739P9292r9310m2610J13023J599j12478L7730
849b6817R9220p2784p3047J00660L6576j13897O329J10627m6834r1816P8748O3448
861G0413j00954k8476J11771j2419j08136N2066Q7852q4448n6335J03454J8977
$$ plain form
872 53765 -54718 -35414 66493 11519 -70608 15016 66066 -37787 -50044 57042 30203
883 30203 -65826 -6060 67938 -17614 -61997 39660 47081 -57889 -26706 66120 707 -66856
895 -66856 21679 57475 -42279 -42458 58095 22449 -65441 2552 66031 -25730 -54593 46151
907 46151 37823 -58734 -17061 64055 -6837 -63223 28559 51957 -49054 -34610 60643 11171
919 11171 -64289 11599 59715 -32540 -47391 50546 30914 -60622 -7144 64149 -15703 -57468
931 -57468 36496 43042 -52109 -25735 59492 3363 -61994 17983 54717 -38640 -40295 53243
943 53243 20690 -59416 1394 59497 -21064 -50508 40126 37276 -53094 -17323 59713 -5151
955 -5151 -57713 24738 47201 -42761 -32932 53021 13133 -58768 7552 56105 -28026 -44843
$$ packed form
872E3765j08483J9304J01907n4974q2127Q5624N1050j03853j2257J07086k6839
883C0203r6029N9766P3998q5552m4383J01657P421j04970L1183R2826o5413o7563
895f6856Q8535L5796r9754j79J00553l5646q7890O7993O3479r1761k8863J00744
907D6151q328r6557M1673Q1116p0892n6386R1782K3398j01011J4444R5253m9472
919A1171p5460P5888M8116r2255j4851R7937j9632r1536N3478P1293p9852m1765
931e7468R3964O546r5151K6374Q5227n6129o5357P9977L6734r3357j655R3538
943E3243l2553q0106O0810N8103q0561k9444R0634k850r0370L5771P7036o4864
955e151n2562Q2451K2463q9962R829Q5953l9888p1901O6320M8553q4131j6817
$$ plain form
967 -44843 45622 28964 -54089 -8196 57702 -11019 -52664 30886 42615 -46527 -25704 55450
979 55450 4316 -57745 15403 50192 -34021 -38840 46858 21755 -55089 -1921 56465 -18086
991 -18086 -48636 36875 35625 -47987 -17275 54317 -1433 -53777 20242 46094 -38206 -33131
1003 -33131 49041 13435 -54784 5265 51396 -23948 -42932 39317 29685 -49089 -10564 54585
1015 54585 -8294 -50254 27782 40243 -41375 -25114 49890 6789 -53424 11101 48481 -30226
1027 -30226 -38225 43475 21054 -51911 -2565 51957 -15603 -45786 32551 35192 -44319 -18038
1039 -18038 52389 -315 -51147 19768 43413 -34994 -31355 45088 14343 -51405 2587 49481
1051 49481 -21651 -42064 37147 28137 -46447 -10601 50267 -6397 -46850 23982 39489 -37508
$$ packed form
967d4843R0465j6658q3053M5893O5898o8721m1645Q3550J1729q9142K0823Q1154
979E5450n1134o2061P3148L4789q4213m819Q5698k5103p6844N3168N8386p4551
991a8086l0550Q5511j250q3612L0712P1592n5750n2344P4019K5852q4300N075
1003c3131Q2172l5606o8219O0049M6131p5344j8984Q2249r632p8774L8525O5149
1015E4585o2879m1960P8036J2461q1618J6261P5004m3101o0213O4525L7380p8707
1027c0226p999Q1700k2421p2965M9346N4522o7560l0183P8337K641p9511K6281
1039a8038P0427n2704n0832P0915K3645p8407L639P6443l0745o5748N3992M6894
1051D9481p1132k0413P9211r010p4584L5846O0868n6664m0453P0832J5507p6997
$$ plain form
1063 -37508 -25747 47516 8188 -50342 9963 45203 -27198 -36490 38556 21616 -47345 -5322
1075 -5322 49175 -13219 -44520 29996 33865 -41024 -17591 48276 1620 -47640 16162 42796
1087 42796 -31765 -31434 43049 14747 -49260 2302 46944 -20295 -40152 33181 27834 -43708
1099 -43708 -12068 48557 -5117 -46213 23420 38216 -35517 -24261 44627 8673 -47426 8201
1111 8201 44554 -24764 -36580 37262 21299 -45979 -5523 46384 -11938 -42060 26607 32916
1123 32916 -37999 -18660 46071 2734 -45933 15380 40694 -29149 -29704 39586 15398 -45456
1135 -45456 -78 44626 -17085 -39674 30991 26990 -41850 -12121 45557 -4047 -43387 20152
1147 20152 37390 -32277 -24701 42944 9966 -45643 7655 42939 -23360 -34123 34720 20924
$$ packed form
1063c7508J1761P3263l9328n8530O0305L5240p2401r292P5046j6940o8961M2023
1075e322N4497o2394l1301P4516L869p4889K3433O5867m6656m9260O3802K6634
1087D2796p4561L31P4483k8302o4007N1562M4642o7239j9857P3333n347p1542
1099d3708L1640O0625n3674m1096O9633J4796p3733J1256O8888l5954n6099N5627
1111H201L6353o9318j1816P3842j5963o7278M0456N1907n8322l0122O8667O309
1123C2916p0915J9339O4731m3337m8667O1313K5314o9843n55O9290k4188o0854
1135d5456M5378M4704o1711k2589P0665m001o8840K9729N7678m9604l9340O3539
1147B0152J7238o9667P576O7645l2978n5609N3298L5284o6299j0763O8843j3796
$$ plain form
1159 20924 -43184 -6762 44658 -10578 -41992 25487 32204 -37152 -17902 43866 3118 -43476
1171 -43476 13505 40082 -26329 -29641 38408 16011 -44010 124 43152 -16228 -37499 28789
1183 28789 26155 -38901 -13202 43258 -3244 -42812 19172 35862 -31360 -22923 40449 9781
1195 9781 -42621 6173 41411 -20557 -33803 33071 21449 -41607 -6671 42633 -9988 -39431
1207 -39431 22866 30650 -34212 -18841 41494 4067 -42474 12556 38603 -25477 -27813 36205
1219 36205 15724 -40789 -1039 41411 -14032 -37143 27120 26271 -37635 -13238 41195 -2519
1231 -2519 -40637 16582 34354 -28497 -23735 38265 11140 -41323 5610 40069 -19403 -32164
1243 -32164 31199 20542 -38733 -7696 40786 -8187 -39181 21486 30281 -33711 -18203 39622
$$ packed form
1159B0924o4108L6422N1420n5236l1414O7479O717o9356J9250O1768m0748m6594
1171d3476N6981K6577o6411l312O8049k2397o0021M4134M3028n9380k1271O6288
1183B8789k634o5056K5699N6460m6502l9568O1984J6690o7222Q437O3372l0668
1195I781n2402M8794L5238o1968j3246O6874j1622o3056L4936M9304n2621k9443
1207c9431O2297P784o4862J5371O0335l7427m6541N5030K6047o4080k336O4018
1219C6205k0481n6513L9750M2450n5443k3111O4263q49o3906K4397N4433m3714
1231b519l8118N7219J7772o2851M762O2000k7125n2463M6933L4459n9472j2761
1243c2164O3363j0657n9275L1037M8482m8973l0994O0667Q795o3992J5508N7825
$$ plain form
1255 39622 3073 -40366 11650 37136 -23993 -27709 34949 15445 -40389 106 40565 -14670
1267 -14670 -34869 26728 24265 -35925 -12266 39403 -2733 -39840 16638 32872 -29306 -22124
1279 -22124 37215 8983 -38998 5922 37919 -18425 -30876 30432 20500 -37772 -6692 39412
1291 39412 -8692 -36716 20928 28060 -31456 -17918 37350 4017 -39243 10537 35830 -23421
1303 -23421 -26006 33589 14737 -37505 -266 38504 -12829 -33483 25302 24680 -34950 -12093
1315 -12093 38504 -3123 -38138 15876 31120 -27357 -21730 35398 9353 -38541 5749 37276
1327 37276 -18748 -29226 29783 18749 -35758 -5587 37960 -7961 -35409 20386 27427 -31538
1339 -31538 -16197 36521 2113 -37496 10808 33245 -22597 -24566 32002 13907 -36325 469
$$ packed form
1255C9622l6549m3439N2016K5486o1129l716O2658j9504n5834M0495M0459n5235
1267a4670k0199O1597k463o0190K3659N1669m2136l7107N6478J6234o2178P182
1279b2124N9339k8232m7981M4920L1997n6344j2451O1308r932n8272L1080M6104
1291C9412m8104k8024N7644P132n9516J3538N5268l3333m3260M9780K5293n9251
1303b3421k585N9595j8852n2242L7239L8770n1333k0654N8785o22n9630K2857
1315a2093N0597m1627l5015N4014J5244n8477N627N7128k6045m7894M4290L1527
1327C7276n6024j0478N9009j1034n4507L0171M3547m5921k7448N5795P041n8965
1339c1538J5341N2718l4408l9609M8304K2437n5842j969N6568j8095n0232L6794
$$ plain form
1351 469 37351 -13598 -31400 24750 22169 -32594 -10804 36038 -2849 -36030 14980 29841
1363 29841 -26972 -20643 33793 7260 -36447 5916 34156 -17455 -27364 28082 18405 -34108
1375 -34108 -4846 36513 -8202 -33501 19972 25374 -29763 -15468 34237 2336 -36021 10344
1387 10344 31822 -22119 -23578 30971 12345 -34757 707 34861 -12142 -30093 23772 22011
1399 22011 -31597 -10219 35172 -3134 -34064 14806 27602 -25537 -19493 31801 7661 -34605
1411 -34605 5192 33428 -17131 -26333 27529 16526 -32277 -4367 34370 -7541 -31093 18914
1423 18914 24633 -28225 -14747 33100 1000 -34239 9770 29326 -21151 -22295 29021 12028
1435 12028 -33479 427 33642 -12217 -28439 23380 20196 -29933 -9015 33235 -2773 -32111
$$ packed form
1351D69L6882n0949j7802N6150k581n4763K1790M6842l8887l3181N1010J4861
1363B9841n6813O329N4436k6533m3707M2363K8240n1611r909N5446r677n2513
1375c4108K9262M1359m4715k5299N3473N402n5137J4295M9705l1901l8357M6365
1387A0344K1478n3941j459N4549j8626m7102L5464L4154m7003j7951N3865j761
1399B2011n3608K1378M5391l8306l0930M8870J2796n3139O044N1294k4140m2266
1411c4605L9797K8236n0559r202N3862j1003m8803K7910L8737m1911k3552N0007
1423A8914N719n2858J3478M7847l2100l5239M4009J9556n0477j144N1316j6993
1435A2028m5507L3906L3215m5859j6222N1819l184n0129K0918M2250l6008k9338
$$ plain form
1447 -32111 14144 26658 -24507 -18514 30598 6388 -33418 5218 30938 -16416 -24821 25477
1459 25477 16331 -30692 -4185 33284 -7181 -29830 18713 22978 -26584 -13399 31086 1576
1471 1576 -32484 9328 28447 -20676 -21390 28210 10712 -31889 1084 31440 -12155 -26453
1483 -26453 22352 19453 -28809 -8118 32619 -3157 -30724 14620 24644 -24204 -16590 29041
1495 29041 5140 -31901 5396 29271 -16802 -23288 25591 14125 -29918 -2568 31103 -7963
1507 -7963 -27652 18499 21486 -26025 -12031 30568 668 -30867 10472 26278 -20634 -19581
1519 -19581 26517 9504 -30204 1291 30095 -12410 -25175 22123 17226 -27448 -6791 30371
1531 30371 -3784 -28532 14104 23490 -22853 -15432 28413 4308 -30693 6305 27293 -16459
$$ packed form
1447c2111M6255J2514n1165N993M9112k4210l9806L8636K5720m7354q405N0298
1459B5477r146m7023K6507L7469m0465k2649M8543M265m9562J3185M4485k9510
1471A576l4060M1812J9119m9123p14M9600j7498m2601L2973L0356m3595j4298
1483b6453M8805k899m8262K0691M0737l5776k7567M5344J0024m8848P614M5631
1495B9041k3901l7041L7297K3875m6073o486M8879j1466m4043K7350L3671l9066
1507g963j9689M6151K987m7511J3994M2599k9900l1535M1339J5806m6912J053
1519a9581M6098j7013l9708L1495K8804m2505j2765M7298m897m4674K0657L7162
1531C0371l4155k4748M2636R386m6343P421M3845k4105l5001L6998K0988m3752
$$ plain form
1543 -16459 -21803 23789 13003 -28570 -2275 29946 -8084 -26124 18780 20008 -25333 -10077
1555 -10077 28855 -336 -28834 10255 24816 -20018 -18087 26187 7721 -29532 2506 27543
1567 27543 -13008 -23169 21044 15576 -26425 -5465 29214 -4430 -26859 15191 21598 -22688
1579 -22688 -13206 26839 2983 -28356 6212 25443 -16345 -19879 23559 10833 -27406 -782
1591 -782 27689 -9104 -23673 17977 17941 -24114 -8850 27917 -1411 -27229 11410 22474 -20019
1604 -20019 -15477 24769 5848 -27505 3085 25915 -13068 -21549 20932 13928 -25522 -3602
1616 -3602 27004 -5318 -24491 14597 19731 -21178 -11537 25850 2154 -26687 7666 23337
1628 23337 -16597 -17503 21817 8883 -25675 -55 26030 -9284 -21992 18012 16099 -22976
$$ packed form
1543a6459n344M5592j0786m1573K6295L2221l8030j8040M4904J228m5341J5256
1555a0077L8932k9191k8498L9089J4561m4834J931M4274j8466l7253L2038K5037
1567B7543m0551j0161M4213n468m2001K0960L4679l3644k2429M2050O407m4286
1579b2688R482M0045k3856l1339L4568J9231m1788l534M3438j2726l8239K6624
1591g82K8471l6793j4569M1650l6m2055J5264L6767k9328k5818L8639J1064m2493
1604b0019M542M0246j8921l3353L0590K2830l8983q481M2481p004l9450K1920
1616c602L0606l2322j9173L9088N134m0909R641L7387k3696k8841L4353J5671
1628B3337l9934r06L9320j2934l4558K5620K6085l5314j2708M0004j913l9075
$$ plain form
1640 -22976 -6787 25813 -2174 -24430 11473 20444 -18866 -14002 23836 4468 -26316 4516
1652 4516 23521 -13771 -18902 20034 11442 -24115 -2659 25332 -6294 -22586 15714 17642 -21367
1665 -21367 -9005 24708 173 -24533 8602 21312 -16426 -15966 21700 6999 -24888 1775
1677 1775 23706 -10454 -19797 17722 13538 -22206 -4963 24580 -3180 -23006 12464 18525 -18841
1690 -18841 -11364 22665 2914 -23821 5262 21664 -13396 -17477 19159 9647 -23193 -1496
1702 -1496 23504 -7276 -20388 14808 15279 -19781 -7686 23373 -372 -22976 8952 19172
1714 19172 -16358 -13538 20644 5753 -23248 2324 21792 -10886 -18629 17510 11982 -21449
1726 -21449 -3371 23066 -4431 -20816 12427 16890 -17852 -9979 21696 2318 -22794 6128
$$ packed form
1640b2976J6189L2600k7987k2256L5903Q971l9310M864L7838j9368l0784L0832
1652D516J9005l7292n131L8936q592l5557K1456K7991l1626j6292L8300J928l9009
1665b1367J2362L3713k4535k4706L3135J2710l7738M60L7666j4701l1887K6663
1677A775K1931l4160r343L7519m184l5744J7243K9543k7760j9826L5470O061l7366
1690a8841P477L4029j9751k6735K9083J6402l5060m081L6636r512l2840K1697
1702a496K5000l0780j3112L5196M71l5060J2095L1059k3745k2604L1928J0220
1714A9172l5530K820L4182j4891k9001K5572J9468l2678p743L6139n528l3431
1726b1449J8078K6437k7497j6385L3243M463l4742P873L1675j9378k5112K8922
$$ plain form
1738 6128 19932 -14047 -15200 18449 7625 -21996 -7 21584 -7786 -19021 14997 13528
1750 13528 -19941 -5400 22345 -2177 -20540 9800 17487 -16056 -11638 19959 4042 -22097
1762 -22097 3882 20301 -11609 -16293 16570 9801 -20392 -2203 21392 -4904 -19135 12625
1774 12625 15080 -17467 -7951 20814 286 -20444 6965 17952 -13850 -13520 18196 6233 -21277
1787 -21277 801 20318 -8762 -16821 14866 11432 -18648 -4518 20954 -2401 -19638 10560
1799 10560 16047 -15899 -9691 19519 2493 -20531 4539 18416 -11444 -14739 16425 8459 -19873
1812 -19873 -1100 20057 -6513 -17245 12911 12837 -17110 -6280 20016 -294 -19594 8089
1824 8089 16556 -14052 -11526 17939 4613 -19598 2083 18354 -9273 -15180 14721 9892 -18456
$$ packed form
1738F128J3804l3979j153L3649j0824k9621K1989K1591k9370j1235L4018j469
1750A3528l3469J4541K7745k4522j8363L0340P687l3543M418L1597j5917k6139
1762b2097K5979J6419l1910m684L2863o769l0193J8189K3595k6296j4231L1760
1774A2625K455l2547R516K8765k0528k0730K7409J0987l1802L30L1716j1963k7510
1787b1277K2078J9517k9080q059L1687l434l0080J4130K5472k3355j7237L0198
1799A0560N487l1946O208K9210j7026k3024K5070J3877k9860l295L1164p966k8332
1812a9873J8773K1157k6570j0732L0156p4k9947J0830K6296k0310j9300K7683
1824H089Q467l0608K526K9465j3326k4211K1681J6271k7627n907K9901m829k8348
$$ plain form
1837 -18456 -3015 19481 -4100 -17282 10679 14069 -15344 -8110 18454 1798 -18899 5360
1849 5360 16885 -11957 -12448 15896 6306 -18592 -23 18497 -6529 -16300 12545 11548 -16572
1862 -16572 -5105 18701 -1452 -17516 8197 14760 -13174 -9787 16994 3709 -18732 2708
1874 2708 16946 -9889 -13925 14223 8038 -17364 -2104 17859 -4261 -16201 10861 12910 -15218
1887 -15218 -6605 17790 468 -17299 6088 15106 -11751 -11102 15160 4980 -17901 1026 16884
1900 16884 -7760 -14130 12747 9457 -15943 -3438 17326 -2526 -15881 8870 13507 -13306
1912 -13306 -7713 16592 1747 -16981 3978 15094 -9911 -11903 13644 6683 -16600 -852
1924 -852 16677 -5833 -14529 10881 10459 -14080 -4963 16594 -355 -16100 6825 13807 -11747
$$ packed form
1837a8456J5441K2496k3581j3182K7961L390k9413P234K6564j6656k0697K4259
1849E360J1525k8842m91K8344r590k4898J8569J8520k5026r771K8845r97k8120
1862a6572J1467K3806k0153j6064K5713O563k7934L387K6781j3285k2441K1440
1874B708J4238k6835m036K8148o185k5402J5260J9963k2120j1940K7062K049k8128
1887a5218Q613K4395j7322j7767K3387R018k6857O49K6262j0180k2881J8927J5858
1900A6884k4644o370K6877l290k5400J2505K0764j9852j3355K4751M637k6813
1912a3306N593K4305j4845j8728K0959J1116k5005j992K5547o961k3283J5748
1924h52J7529k2510q696K5410m22k4539R117K1557j6949j5745K2925O982k5554
$$ plain form
1937 -11747 -9473 14764 3594 -16445 1912 15040 -7911 -12835 12004 8122 -15393 -2267
1949 -2267 16338 -3449 -14340 8900 11379 -12907 -6184 15509 1227 -15622 4844 13770 -9989
1962 -9989 -10714 13254 4740 -15648 392 14868 -5873 -13036 10751 9232 -13806 -3612 15889
1975 15889 -1615 -14391 7510 11805 -11362 -7716 14001 2636 -15193 2907 13888 -8350
1987 -8350 -11283 11975 6112 -14595 -1181 14751 -4148 -12954 9202 10214 -12556 -5162 14794
2000 14794 -292 -14251 5675 12045 -9870 -8736 12691 3749 -14796 1070 13980 -6825
2012 -6825 -11717 10873 7340 -13341 -2291 14659 -2128 -13049 7656 11026 -11455 -6306 13818
2025 13818 1353 -14420 3692 12522 -8555 -9655 11571 5303 -13585 -373 13914 -5106
$$ packed form
1937a1747K274K4237j1170k0039J8357J3128k2951m924K4839l882k3515J3126
1949b267J8605j9787j0891K3240K479k4286O723K1693j4282j6849K0466Q926k3759
1962i989p25K3968q514k0388J6040J4476k0741p163K3787j519k3038J0194J9501
1975A5889j7504j2776K1901M295k3167L646K1717j1365j7829J8100J0981k2238
1987h350k933K3258n863k0707J3414J5932j8899q806K2156J012k2770P394J9956
2000A4794j5086j3959J9926O370k1915J134K1427q942j8545J5866J2910k0805
2012f825m892K2590l533k0681J1050J6950j6787j0921K0705L370k2481N149K0124
2025A3818j2465j5773J8112Q830k1077j100K1226o268j8888J3212J4287j9020
$$ plain form
2037 -5106 -12018 9655 8619 -12184 -3758 13799 -894 -13126 6006 11167 -10114 -7514 12610
2050 12610 2663 -13818 2151 12356 -7173 -10347 10303 6641 -12935 -1777 13733 -3153
2062 -3153 -12214 7854 9203 -10906 -4967 12982 682 -13071 4452 11344 -8582 -8293 11207
2075 11207 3717 -13044 415 12427 -5463 -10514 9034 7300 -11674 -2835 13279 -1725 -12102
2088 -12102 6533 9910 -9363 -6084 12177 1829 -12774 2547 11576 -7342 -9376 10514 4896
2101 4896 -12166 -954 12184 -3936 -10744 7847 8630 -10484 -3672 12589 -173 -11934 4897
2114 4897 10238 -8630 -7174 10833 2870 -12273 1002 11609 -5804 -9894 9087 6102 -11101
2127 -11101 -1721 11996 -2117 -10951 6544 9051 -9512 -5066 11607 929 -11812 3284 10324
$$ packed form
2037e106o912K1673j036k0803Q426J7557j4693j2232J9132N161k1281K600K0124
2050A2610r947j6481J5969J0205j9529l174K0650l662j9576J1158J5510j6886
2062c153r061K0068J349k0109N939J7949j2300j3753J7523O892j9926K89J9500
2075A1207p490j6761J3459J2012j7890n051J9548j734j8974Q839J6114j5004j0377
2088a2102J8635L377j9273L279J8261j0348j4603J5321R029j8918k034J9890n618
2101D896j7062J1212J3138j6120o808J8591P83j9114O812J6261j2762j1761J6831
2114D897N341j8868J456J8007p963j5143J3275J0607j7413m090J8981k985j7203
2127a1101R380J3717j4113q834J7495K507j8563M446J6673j0678j2741J5096P040
$$ plain form
2140 10324 -7420 -8152 9804 3927 -11522 -429 11979 -4255 -10072 7942 7086 -10238 -3004
2153 -3004 11754 -633 -11005 5083 9667 -8285 -6273 10387 2383 -11425 1731 10508 -6031
2166 -6031 -8606 8594 5223 -10760 -1569 11462 -2661 -10001 6591 7901 -9350 -4255 10898
2179 10898 484 -10849 3178 9509 -7120 -7362 9603 3286 -10950 373 10423 -4427 -8876
2192 -8876 7495 6258 -9838 -2740 11014 -1025 -10065 5292 8563 -8099 -5194 10082 1978
2205 1978 -10755 1544 9826 -5716 -8408 8577 4456 -10395 -975 10264 -3083 -9286 6094
2218 6094 7260 -8581 -3848 10617 184 -10297 3923 9055 -7105 -6539 8923 2763 -10657
2231 -10657 732 9837 -4437 -8502 7646 5840 -9950 -1899 10344 -1556 -9479 5181 8128
$$ packed form
2140A0324j7744p32J7956n877j5449J1093J2408j6234n817J8014q56j7324P234
2153c004J4758j2387j0372J6088M584j7952K012J6660q004j3808J3156Q777j6539
2166f031k575J7200l371j5983R191J3031j4123p340J6592J310j7251N095J5153
2179A0898j0414j1333J4027O331j6629k42J6965o317j4236J1323J0050j4850m449
2192h876J6371j237j6096P098J3754j2039r040J5357L271j6662K905J5276q104
2205A978j2733J2299Q282j5542k692J6985m121j4851R420J1239j3347o203J5380
2218F094J166j5841M733J4465j0433j0481J4220N132j6160N66J5462o160j3420
2231a0657J1389R105j4274m065J6148j806j5790Q051J2243j1900p923J4660K947
$$ plain form
2244 8128 -7748 -4707 9873 1310 -10387 2605 9103 -5909 -6982 8229 4134 -9875 -919
2257 -919 9691 -3165 -8974 6484 6786 -8644 -3290 10059 -128 -9562 3777 8513 -6648
2270 -6648 -6069 8755 2642 -10101 840 9425 -4895 -8095 7148 5103 -9336 -2082 9961
2283 9961 -1815 -9251 5379 7587 -7800 -4245 9705 1040 -9665 2559 8973 -5635 -7016
2296 -7016 8260 3886 -9708 -443 9685 -3296 -8707 6057 6167 -8519 -3009 9505 -300
2309 -300 -9449 4143 8178 -6793 -5555 8868 2279 -9453 1184 9009 -4628 -7708 7076
2322 7076 5067 -9385 -1860 9338 -2205 -8951 5028 7065 -7296 -4240 9268 1196 -9338
2335 -9338 2582 8843 -5502 -6338 7892 3175 -9423 -274 9041 -3336 -8496 6091 5813 -8475
$$ packed form
2244H128j5876L041J4580q563j1697J2992O498j5012j073J5211m095j4009Q956
2257i19J0610j2856n809J5458L02j5430N354J3349j0187r434J3339M736j5161
2270f648N79J4824o113j2743J0941Q585j4320l200J5243k045j4439P254J2043
2283I961j1776p436J4630K208j5387L555J3950q665j0705J2224O414j4608j381
2296g016J5276m374j3594R265J0128j2981n411J4764J10j4686N510J2514r805
2309c00r149J3592M035j4971J238J4423o589j1732J0637P825j3637l080J4784
2322G076k009j4452P525J1198j1543o746J3979K037j4361L056J3508q072j0534
2335i338J1920O261j4345q36J4230m717j2598R149R315j2377n160J4587k78j4288
$$ plain form
2349 -8475 -2626 9346 -390 -9099 3955 7810 -6485 -5284 8620 2325 -9544 1390 8716
2362 8716 -4682 -7485 6960 4351 -8808 -1989 9179 -2137 -8822 4916 6716 -7399 -3828
2375 -3828 9164 535 -8920 2743 8348 -5233 -6188 7833 3651 -9319 -226 8990 -3716 -8070
2389 -8070 5922 5394 -8128 -2880 8963 -328 -8684 4103 7587 -6360 -4733 8603 2011 -8949
2403 -8949 1468 8623 -4163 -7053 6767 4406 -9019 -1419 8909 -2371 -8242 4963 6459
2416 6459 -7277 -3913 8751 803 -8603 2767 8194 -5453 -5597 7776 3145 -8529 -89 8584
2430 8584 -3490 -7780 5647 5257 -8122 -2592 8745 -1021 -8579 3799 7147 -6422 -4676 8295
2444 8295 1985 -8723 1711 8589 -4279 -6527 6727 4153 -8595 -1234 8529 -2148 -8100
$$ packed form
2349h475N849J1972r736q709J3054L855j4295J201J3904o295j1869J0934P326
2362H716j3398k803J4445k609j3159O819J1168j1316o685J3738J800j4115L571
2375c828J2992q629r455J1663N605j3581r55J4021m182j2970R093R216j2706m354
2389h070J3992n28j3522N248J1843r291q356J2787L484j3947J627J3336o592j0960
2403h949J0417P155j2786k890J3820k361j3425P600J0328j1280n871J3205J496
2416F459j3736L364J2664p948r406J1370N427j3647j44J3373m631j1674Q440Q673
2430H584j2074m290J3427l90j3379N530J1337r766p558J2378L348j3569J746J2971
2444H295o310j0708J0434O878j2868k248J3254k574j2748P361R763j0677n952
$$ plain form
2457 -8100 4921 6213 -7311 -3695 8692 662 -8564 2831 7761 -5246 -5756 7598 3210 -8603
2471 -8603 270 8618 -3378 -7312 6024 5027 -7586 -2423 8325 -510 -8297 3454 6980 -6153
2485 -6153 -4475 8105 1822 -8407 1049 8125 -4064 -6589 6735 4297 -8404 -1251 8650 -2121
2499 -2121 -8030 4705 6313 -7166 -3874 8032 598 -8641 2588 7908 -5217 -5290 7648 3086
2513 3086 -8190 22 8412 -3015 -7409 5808 5224 -7955 -2535 8440 -945 -8793 3634 6671
2527 6671 -6023 -4659 7733 1997 -8435 1421 8254 -4109 -6480 6831 4395 -7946 -1111
2540 -1111 7828 -1900 -8059 4464 6060 -6992 -3756 8314 265 -8242 2343 7474 -4941 -5423
2554 -5423 7457 3126 -8368 -171 8318 -2964 -7067 5360 5092 -7553 -2400 8135 -916 -8412
$$ packed form
2457h100J3021J292j3524L616J2387q030r226J1395M930j3007n10J3354m388j1813
2471h603Q873Q348j1996l934J3336r97j2613N163J0748q835p787J1751L526j3133
2485f153J678J2580o283j0229R456P076j2189k525J3324k438j2701P153R901j0771
2499b121n909J2735J608j3479L292J1906p434r239J1229N320j3125p3J2938m562
2513C086j1276Q212Q390j1427m394J3217n84j3179N420J0975r385p848J2427L037
2527F671j2694J364J2392n736j0432R856O833j2363k371J3311k436j2341O835
2540a111Q939r728o159J2523J596j3052L236J2070q049q507J0585N131j2415m82
2554e423J2880m331j1494Q197Q489j1282m103J2427k68j2645N153J0535r051p496
$$ plain form
2568 -8412 3368 6975 -6300 -4808 7759 1640 -8143 1535 7905 -4025 -6304 6406 4239 -8067
2582 -8067 -1370 8408 -1886 -7624 4837 5821 -6947 -3500 8202 670 -8432 2131 7302 -5119
2596 -5119 -6022 7290 2891 -8483 598 8454 -2754 -7167 5593 5093 -7460 -2471 8428 -975
2610 -975 -8368 3753 6726 -5975 -4592 7723 1714 -8183 1101 8150 -3997 -6231 6625 4114
2624 4114 -7938 -818 8372 -1727 -7595 4463 5966 -7025 -3957 7862 701 -8362 2525
2637 2525 7429 -5098 -5582 7040 2969 -8158 365 8383 -2991 -7043 5668 5164 -7271 -2393
2651 -2393 8298 -745 -8178 3423 6627 -6135 -4946 7599 1449 -8410 1159 7907 -3933 -6328
2665 -6328 6310 4266 -7743 -1130 8849 -1827 -7623 4655 6125 -6434 -3621 7883 378
$$ packed form
2568h412J1780L607j3275J492J2567o119r783R678O370j1930k279J2710k167j2306
2582h067O697R778j0294n738J2461R84j2768L447J1702p532r102J0563N171j2421
2596e119r03J3312m399j1374R081P856j1208m413J2760n00j2553M989J0899r403
2610i75p393J2121K973j2701J383J2315o009r897R284P049j2147k234J2856k511
2624D114j2052P120R190j0099n868J2058J503j2991L068J1819p161r063J0887
2637B525M904j2527m84J2622m071j1127Q523Q018j1374m052J2711n04j2435M878
2651b393J0691r043p433J1601L204j2762J189J2545o150r859R569O748j1840k395
2665f328J2638k044j2009O613R979j0676n796J2278J470j2559K813J1504p505
$$ plain form
2678 378 -8460 2088 7239 -4689 -5783 6832 2950 -8257 168 8431 -2903 -6937 5621 5518
2692 5518 -7220 -2499 8358 -425 -8212 3165 6815 -5913 -4649 7242 1871 -8362 844
2705 844 7962 -3672 -6448 6378 4251 -7541 -1183 7965 -1588 -7419 4324 6141 -6316 -3999
2719 -3999 8027 820 -8425 2069 7291 -5058 -5651 6778 3194 -8378 -357 8386 -2690 -7176
2733 -7176 5201 5420 -7233 -2658 8070 -186 -8070 3258 7086 -5782 -4960 7674 2135 -8467
2747 -8467 629 8146 -3758 -6748 6114 4414 -7782 -1300 8297 -1302 -7663 4664 6529 -6511
2761 -6511 -3851 7722 1227 -8142 1768 7577 -4740 -6149 7061 3335 -8156 -473 8304 -2449
2775 -2449 -7271 5224 5358 -6878 -2935 8429 113 -8129 2908 7209 -5605 -4989 7507 2373
$$ packed form
2678C78q838J0548N151j1928j094J2615l882j1207Q425Q263j1334m034J2558j03
2692E518j2738M721J0857q783p787J1377L650j2728J264J1891n371j0233R206
2705H44P118j1634k776J2826k127j1792O358R148r553n831J1743J817j2457K317
2719c999J2026p207r245J0494N222j2349n93J2429l584j1572Q021Q743j1076m486
2733g176J2377K19j2653M575J0728q256p884J1328L828j2868Q22J2634n539j0602
2747h467R096P517j1904k990J2862j700j2196O482R597r599o361J2327J865j3040
2761f511K660J1573o495r369R910N809j2317j409J3210l726j1491P683Q777j0753
2775b449m822J2495J34j2236L943J1364q316q242J1037M301j2814O16J2496n134
$$ plain form
2789 2373 -8453 693 7944 -3633 -7222 5995 4855 -7583 -1785 8165 -1335 -7654 3991 6244
2803 6244 -6130 -4059 7921 1541 -8416 1526 7692 -4734 -6091 6569 3556 -8061 -869 8355
2817 8355 -2461 -7665 4866 5575 -6849 -2780 8333 327 -8078 2613 7190 -5472 -5403 7257
2831 7257 2505 -8640 382 7995 -3314 -6739 5639 4759 -7358 -2224 8198 -1108 -7796 4246
2845 4246 6742 -6222 -4003 8064 1404 -8539 1743 7566 -4501 -6130 6929 3794 -8267
2858 -8267 -837 8228 -2586 -7530 5100 5516 -6947 -3202 8339 308 -8372 2846 7559 -5406
2872 -5406 -5202 7343 2651 -8139 104 8078 -3191 -7046 5725 4790 -7734 -2102 8175 -1011
2886 -1011 -8145 3796 6630 -6087 -4510 7947 1643 -8581 1477 7957 -4203 -6377 6369
$$ packed form
2789B373j0826R146P251j1577l589J3217j140j2438N798R950r500o319J1645K253
2803F244j2374K071J1980o380r957R942O166j2426j357J2660l013j1617P192R224
2817H355j0816n204J2531P09j2424M069J1113q006q405J0691M577j2662O9J2660
2831G257m752j1145R022P613j1309l425J2378q80j2117N134J0422r306o688J2042
2845D246K496j2964K219J2067o660r943J0282N823j2067j629J3059l135j2061
2858h267P430R065j0814m944J2630M16j2463L745J1541q031q680J1218M713j2965
2872e406K04J2545m692j0790Q243P974j1269l855J2771r35j2524N632J0277r186
2886a011p134J1941K834j2717J577J2457o304j0224J0058O480j2160k174J2746
$$ plain form
2899 6369 3724 -7967 -1218 8290 -2151 -7799 4646 5982 -7099 -3534 8240 160 -8154 2731
2913 2731 7250 -5321 -5483 7479 3079 -8197 267 8342 -3332 -7289 5714 4675 -7336 -2175
2927 -2175 8249 -642 -8394 3659 6837 -6331 -4447 8174 1849 -8119 1464 7268 -4159 -6434
2941 -6434 6599 3812 -8161 -765 8377 -2360 -7834 4812 5845 -6766 -3493 8141 440
2954 440 -8389 2804 7580 -4924 -5295 7265 2823 -8261 75 8220 -3190 -7160 5689 5014
2968 5014 -7786 -2414 8446 -834 -8253 3626 6587 -6114 -4638 7764 1849 -8459 1572
2981 1572 8157 -4304 -6412 6719 3949 -8125 -1102 8208 -1846 -7788 4625 6291 -7183
2994 -7183 -3830 8117 503 -8317 2482 7373 -5057 -5649 7532 3080 -8327 74 8463 -3008
$$ packed form
2899F369k645j1691O749R508j0441n648J2445J336j3081L565J1774q080q314J0885
2913B731M519j2571j62J2962m400j1276Q464Q075j1674l957J3003j039j2011N161
2927b175J0424q891p752J2053L178j3168J884J2621o325r968R583N804j1427k275
2941f434J3033k787j1973P396R142j0737n474J2646J033j2611L273J1634p701
2954D40q829J1193M776j2504l71J2560m442j1084Q336Q145j1410l970J2849o75
2968E014j2800N372J0860r280p419J1879K961j2701J476J2402n915j0308J0031
2981A572O585j2461k108J3131k770j2074P023R310j0054n942J2413J666j3474
2994g183L353J1947p614q820J0799M891j2430n92J3181m452j1407Q401Q389j1471
$$ plain form
3008 -3008 -7097 5766 5193 -7366 -2363 8404 -820 -8352 3440 6796 -6194 -4431 8191 1780
3022 1780 -8271 1408 8015 -3899 -6323 6619 4359 -7883 -1317 8349 -2215 -7638 4537
3035 4537 5781 -6744 -3571 7971 640 -8428 2384 7595 -5208 -5885 7258 3027 -8190 20
3049 20 8220 -2840 -7147 5630 5140 -7397 -2630 8327 -857 -8347 3433 6938 -6282 -4848
3063 -4848 7488 1764 -8492 1319 8276 -4123 -6223 6605 4169 -8116 -1187 8329 -2092
3076 -2092 -7499 4655 6202 -6832 -3795 8155 330 -8498 2390 7527 -5255 -5574 7159 3088
3090 3088 -8524 244 8400 -3013 -7113 5767 5113 -7510 -2152 8359 -781 -8186 3434 6864
3104 6864 -6326 -4654 7436 1495 -8341 1409 7825 -4054 -6108 6570 4298 -7889 -1232 8586
$$ packed form
3008c008m089J2863n73j2559N003J0767r224p532J1792L356j2990J763J2622o411
3022A780j0051R679O607j1914k424J2942k260j2242O566R666j0564n423J2175
3035D537J244j2525L173J1542p331r068J0812N211j2803o77J3143m231j1217Q210
3049B0Q200j1060m307J2777m90j2537M767J0957r184p490J1780L505j3220J434
3063d848J2336n724j0256R811O957j2399k100J2828k436j2285O929R516j0421
3076b092n407J2154J547j3034L037J1950p825q828J0888N137j2782l19J2733m071
3090C088j1612Q768Q156j1413m100J2880o54j2623N358J0511r140p405J1620L430
3104F864j3190J672J2090n941r836R750O416j1879k054J2678k272j2187O657R818
$$ plain form
3118 8586 -1710 -7719 4754 5985 -6721 -3607 8012 602 -8372 2326 7600 -5366 -5653 7380
3132 7380 2977 -8447 17 8140 -2929 -6862 5733 5284 -7808 -2286 8315 -989 -7884 3596
3146 3596 6616 -6115 -4528 7734 1759 -8041 1419 7893 -3995 -6528 6765 3968 -7637 -1057
3160 -1057 8332 -1998 -7401 4505 6076 -6680 -3705 8062 536 -8273 2584 7108 -5138
3173 -5138 -5271 6984 2922 -7896 -18 8210 -2832 -6761 5583 4919 -7237 -2261 7904 -551
3187 -551 -7776 3362 6511 -6056 -4716 7449 1523 -8040 1085 7519 -4131 -6172 6168 4020
3201 4020 -7763 -1161 8388 -1944 -7316 4894 5600 -6503 -3099 7724 398 -8205 2409 6987
3215 6987 -5322 -5325 7190 2506 -7990 167 7928 -2986 -6903 5711 4883 -7263 -2005 8169
$$ packed form
3118H586j0296o009J2473J231j2706L114J1619p410q974J0698N274j2966k87J3033
3132G380m403j1424Q464Q123j1069l933J2595m49j3092N522J0601r304o895J1480
3146C596L020j2731J587J2262n975r800R460O474j1888k533J3293k797j1605O580
3160a057R389j0330n403J1906J571j2756K975J1767p526q809J0857M524j2246
3173e138j33J2255m062j0818P878Q228j1042l929J2344o64j2156M976J0165q455
3187e51p225J1138L149j2567J340J2165n926r563R125O434j1650k041J2340k148
3201D020j1783O602R549j0332n372J2210P06j2103L404J0823p326q603J0614M578
3215F987j2309lJ2515m684j0496Q157P761j0914l917J2614q28j2146N258J0174
$$ plain form
3229 8169 -583 -7893 3641 6537 -5797 -4074 7259 1339 -8232 1219 7587 -4090 -5832 6228
3243 6228 3612 -7735 -675 7718 -1710 -7154 4628 5720 -6527 -3190 7773 144 -7749 2523
3257 2523 6728 -5055 -5033 6628 2510 -7664 55 7846 -3026 -6636 5534 4816 -7196 -1786
3271 -1786 7770 -839 -7130 3370 6310 -5738 -4342 7485 1359 -7950 1348 7167 -4158 -5666
3285 -5666 6112 3400 -7212 -950 7706 -1697 -6965 4727 5294 -6503 -2776 7582 307 -7458
3299 -7458 2429 6617 -4950 -4907 6888 2441 -7607 300 7485 -3237 -6364 5271 4295 -6664
3313 -6664 -1817 7667 -757 -7414 3427 6120 -5727 -4036 6961 1260 -7610 1189 6910 -3855
3327 -3855 -5803 5791 3407 -7389 -656 7548 -1757 -6513 4375 5151 -5933 -3085 7398 644
$$ packed form
3229H169q752p310J1534K896j2334J723J1333n920r571R451O368j1677j742J2060
3243F228k616j1347P060Q393r428n444J1782J092j2247L337J0963p629p893J0272
3257B523M205j1783K2J1661m118j0174P719P791j0872l610J2170p18j2012N410
3271a786R556q609o291J0500K940j2048J396J1827o126r309R298N819j1325j508
3285e666J1778k712j0612O262Q656r403n268J1692N67j1797L727J0358p275p765
3299g458R887M188j1567M3J1795m447j0048P907P185j0722l127J1635r76j0959
3313f664M847R484q424o657J0841K693j1847J691J0997n701q870Q799N721j0765
3327c855j948J1594k384j0796O733Q204r305m756J0888P76j1084K848J0483o754
$$ plain form
3341 644 -7404 2566 6366 -4690 -4520 6387 2201 -7335 272 7121 -2940 -6355 5312 4112
3355 4112 -6665 -1582 7515 -842 -7046 3415 5351 -5491 -3662 7054 1243 -7281 1463 6779
3369 6779 -4099 -5291 5567 3221 -6787 -929 7286 -1891 -6559 4336 5120 -6186 -2455 6995
3383 6995 297 -6941 2476 5953 -4576 -4682 6169 2254 -7182 493 6982 -2971 -5896 4640
3397 4640 4063 -6240 -1727 7181 -900 -6737 3378 5743 -5317 -3282 6615 1259 -6777 1530
3411 1530 6154 -3780 -5484 5670 3127 -6823 -501 6587 -2179 -6094 4308 4785 -5714 -2569
3425 -2569 6724 219 -6867 2515 6114 -4714 -4089 6099 2077 -6721 -86 6677 -2819 -5851 4721
3440 4721 3826 -6186 -1839 6926 -845 -6189 3339 5201 -4876 -3338 6469 1339 -6617 1572 6313
$$ packed form
3341F44q048R970L800j1056J70J0907m186r536P607O849j0061l415J1667j200
3355D112j0777N083R097q357o204J0461J936j0842J829J0716n811q524Q744N316
3369F779j0878j192J0858k346j0008N858Q215r177m668J0895P84j1306L731R450
3383F995o698p238R417L477j0529j06J0851l915r436P675O489r953k925J0536
3397D640n77j0303M513Q908q081n837J0115K365j1060K035R897n356q036Q307
3411A530M624r934j704J1154k543r950O322P088q766l915J0402M77j0499L145
3425b569R293o505p086R382L599j0828O25J0188m022q798O635O763r496l032J0572
3440D721q95j0012M347Q765p771n344R528J862j0077J538R807n130p956Q189M741
$$ plain form
3455 6313 -3459 -4943 5162 2747 -6615 -862 6386 -1935 -6015 3929 4221 -5842 -2443 6387 -3
3470 -3 -6398 2279 5706 -4319 -4190 5706 2125 -6452 260 6120 -2755 -5535 4658 3474 -6000
3485 -6000 -1498 6325 -969 -6023 3108 5054 -5015 -3041 6227 1023 -6392 1487 5733 -3126 -4437
3500 -4437 5276 2877 -6208 -572 6441 -1707 -5580 4092 4145 -5521 -2195 5889 22 -6070 2430
3515 2430 5393 -4060 -3696 5639 1544 -6054 444 5969 -2589 -5107 4279 3311 -5636 -1388 5859
3530 5859 -994 -5802 2956 4772 -4730 -3127 5636 1002 -6111 1509 5359 -3341 -4194 5166 2362
3545 2362 -5820 -419 5997 -1903 -5063 3583 4064 -5162 -2089 5860 -120 -5768 2324 4967 -4172
3560 -4172 -3396 5245 1832 -5802 766 5736 -2484 -4769 4505 3025 -5563 -880 5678 -877 -5403
$$ packed form
3455F313r772j484J0105k415r362N753P248q321m080R944K92j0063L399Q830o390
3470co395Q677L427j0025J29R896l581q577O712N860q875k780J0193j184r474
3485f000M502P823p294n054R131J946j0069J974R268n204p415P879M246q859j311
3500d437R713k399r085N636P013q148l873R672N3r666L326Q084n867o092Q500
3515B430K963r453L64R335m095p598O498N525q558k518R386r68q947M248P247
3530E859o853m808Q758J816r502J603Q763m634p113P620L850q700q53R360k804
3545B362q182N401O416p900l160Q646M81r226L073P949n980n648Q092K643r139
3560d172P76Q641l413p634O568M970q220k285R274j480q588M683O558o555m526
$$ plain form
3575 -5403 2869 4275 -4637 -2640 5432 772 -5513 1308 5073 -2906 -3914 4670 2317 -5444 -466
3590 -466 5501 -1752 -5071 3491 3565 -5037 -1989 5614 -138 -5378 2322 4821 -3838 -3269 5213 1570
3606 1570 -5765 580 5305 -2492 -4619 4085 3070 -5156 -955 5876 -1172 -5326 2954 4221 -4199
3621 -4199 -2634 5091 528 -5340 1545 5303 -3191 -3848 4645 2548 -5401 -55 5076 -1838 -4766
3636 -4766 3300 3508 -4621 -1759 5213 -218 -5437 1733 4113 -3729 -2987 4788 1414 -5202 486
3651 486 5180 -2274 -4259 3737 2530 -4899 -797 5495 -928 -5028 2701 4013 -4099 -2495 4929
3666 4929 477 -4937 1334 4608 -2996 -3624 3977 1963 -4846 -59 5244 -1606 -4573 3364 2992
3681 2992 -4278 -1663 4775 -434 -4605 1808 4209 -3594 -3107 4877 817 -4857 871 4611 -2112
$$ packed form
3575e403Q272J406q912J997Q072m660o285O821L765p979j008Q584k353p761M978
3590d66N967p253l319Q562P4q602L048P603n752n240P700K499q659N69Q482l643
3606A570p335O345M725p797k127Q704j015q226M201O831p048m154Q280J267q420
3621d199J565P725m563n868O885L758q494o57Q493k097p949N346N131o914k928
3636d766Q066K08q129K862O972n431n219P170K380p842P42P775l374o616N688
3651D86M694p454j985P996j207p429M102O292o423m100P729J312q112J604P424
3666D929m452n414O271L274p604o28P601k014o809M787N303o850k967P937l72
3681B992p270K615O438n209m171O413K401p803M87P984m060n674N728L740o723
$$ plain form
3696 -2112 -3750 3761 2557 -4646 -958 4529 -917 -4482 2734 3284 -3831 -2060 4635 579 -4943
3711 -4943 1257 4308 -2858 -3137 4225 1670 -4329 202 4691 -1555 -3925 2975 2676 -4178 -1298
3726 -1298 4852 -387 -4554 1910 3461 -3634 -2312 4123 962 -4175 671 4466 -2077 -3548 3746
3741 3746 2281 -4189 -600 4481 -977 -4028 2297 3409 -3470 -2144 4281 459 -4547 1459 3806
3756 3806 -2475 -2766 3666 1723 -4325 -345 4185 -1506 -3479 2797 2760 -3629 -1501 4356 -303 -3956
3772 -3956 1760 3392 -3125 -2619 4006 1066 -4346 722 3885 -1966 -3061 3402 2281 -3911 -617
3787 -617 4167 -839 -3846 2180 2899 -3600 -1704 4097 303 -4155 923 3545 -2539 -2693 3598 1506
3803 1506 -4055 101 3891 -1380 -3355 2634 2489 -3478 -1193 4051 -229 -3717 1678 2940 -3041
$$ packed form
3696b112j638P511j204p203L688N487n446l565P216N50p115J771O695m056n522
3711d943O200L051p166k79P362k555n999M531M489o246k370O900k99o854K880
3726a298O150n239m167O464J551p095J322O435l161n137M846L795o543j471P294
3741C746j465o470L589N081n458l051O325J112o879J326O425l822n006O006K347
3756C806o281k91O432j943o048L980M530n691j973O276l7o389K128N857m659l653
3772c956N716J632o517N06O625k940n412N068L163n851j095O463j121o192L294
3787f17M784n006l007O026P19o499J896N801l794m458N078K622o084j54O291k092
3803A506n561M156L790n271j975N989j45n967K285N244m280l488N395J262n981
$$ plain form
3818 -3041 -2302 3478 860 -3955 537 3706 -1780 -2950 3073 2001 -3630 -642 3883 -740 -3416
3833 -3416 2001 2623 -2891 -1681 3629 55 -3940 1051 3360 -2459 -2610 3091 1324 -3602 -40
3848 -40 3610 -1356 -3047 2533 2398 -3191 -922 3619 -317 -3257 1638 2681 -2439 -2182 3474 695
3864 695 -3731 482 3342 -1615 -2574 2704 1656 -3318 -223 3539 -766 -2997 2138 2315 -2930 -1386
3880 -1386 3130 66 -3410 855 3082 -1992 -2345 2885 1250 -3410 24 3391 -1295 -2705 2562
3895 2562 2039 -2897 -835 3365 -235 -3058 1557 2500 -2531 -1986 3043 466 -3117 437 2820 -1368
3911 -1368 -2595 2547 1449 -2832 -408 3356 -601 -2653 1868 2269 -2364 -1418 2995 50 -2946
3926 -2946 801 2481 -2060 -2153 2469 903 -3084 119 2876 -999 -2514 2139 1930 -2505 -670 3011
$$ packed form
3818c041P39N780k618m815M492L169n486j170O023j072n631K988M525m623k676
3833c416N417O22n514J210N310l574l995M991K309n819j51N701j767m926L562
3848d0L650m966j691N580j35n589K269M541l936k940M895J043n120K57N656k779
3864F95m426M213K860m957r59N278j048m974L095L762m305k231N135J77n245J544
3880a386M516l064l476M265K227n074l53N230j635m660L434L367m686j410N267
3895B562n23m936K062M200l600k823M615R43n031N45N029k577l583L554K383m188
3911a368j227N142j098m281K424L764l957k052M521M01m633R46M413k945k996
3926b946L747J680m541r3M622j566l987L203K757l875j515M653k09m435J835L681
$$ plain form
3942 3011 -334 -2737 1346 2165 -2067 -1826 2538 503 -3374 224 2736 -1643 -2435 2405 1400 -2537
3958 -2537 -295 2832 -475 -2369 1584 2127 -2510 -904 2882 78 -2897 1002 2263 -1804 -1839 2392
3974 2392 937 -2999 205 2447 -1108 -2419 1720 1493 -2316 -979 2566 -433 -2421 1111 2140
3989 2140 -1945 -1382 2094 413 -2966 254 2584 -1544 -1966 1921 1067 -2790 -55 2651 -846 -2200
4005 -2200 1462 1798 -1929 -973 2515 468 -2393 873 2500 -1378 -1547 2443 586 -2491 75 2326
4021 2326 -781 -2412 1464 1474 -1829 -623 2288 -362 -2337 1338 1878 -1495 -1149 2306 572 -2382
4037 -2382 368 2330 -1134 -1892 1680 947 -2274 -146 2193 -383 -1863 1489 1621 -1762 -610 2369
4053 2369 3 -2370 991 1671 -1594 -1548 1927 635 -2338 174 2086 -789 -1921 1533 1235 -2054
$$ packed form
3942C011l345k403M083Q19m232K41M364k035l877L598K512m379p92M840j005l937
3958b537K242L127l307j894L953N43m637J606L786k804k975L899J261m067l5M231
3974B392j455l936L204K242l555j311M139k27l809J337L545k999j988L532J029
3989B140m085N63L476j681l379L220K330m128m22L887q54l857K735K706l497j354
4005b200L662L36l727R56L488k047k861L266J627l878j69L990j857l077K566K251
4021B326l107j631L876J0l303J206K911k650j975L675N40l373L46L455j734k954
4037b382K750J962l464p58L572p33l221K128K339k576j480L352J32l383J152K979
4053B369k366k373L361O80l265M6L475j292k973K512J912k875j132L454k98l289
$$ plain form
4069 -2054 -415 2164 -326 -1935 1133 1716 -1665 -854 1967 353 -1934 355 1756 -1306 -1493 1500
4085 1500 891 -2075 -7 1993 -526 -1817 1070 1214 -1616 -541 1900 155 -2046 532 1748
4100 1748 -1349 -1215 1605 752 -2039 -85 1963 -865 -1392 1303 1047 -1834 -500 2307 -307 -1811
4116 -1811 825 1742 -1160 -876 1728 310 -1933 345 1760 -1109 -1540 1652 910 -1754 -285 1415
4132 1415 -567 -1757 1093 1344 -1472 -647 1743 2 -1896 531 1631 -1275 -1018 1726 503 -1878
4148 -1878 -29 1878 -691 -1632 1206 797 -1434 -335 1846 -222 -1800 690 1362 -1467 -1144 1600
4164 1600 214 -1625 476 1578 -839 -1246 1371 786 -1748 -235 1416 -419 -1425 861 602 -1443
4180 -1443 -328 1577 61 -1420 613 1357 -954 -820 1493 485 -1571 172 1546 -748 -1166 1073
$$ packed form
4069b054J639K579k490j609L068N83l381Q11K821j614k287K289J401l062j87K993
4085A500o09k966K068K000k519j291K887J44k830J075K441j745k201K578J216
4100A748l097J34K820q53k791J954K048k828n27K695k56k881J334K807k614j504
4116a811K636R17k902K84K604j418k243K278J415k869m31L192p42k664J469J700
4132A415j982j190K850K51k816Q25K390j741j898K427J100k906K57K744j223k381
4148a878J849J907k569r41K838m09k231J099K181k068j578K490O72k829L23K744
4164A600j386j839K101J102k417m07K617n85k534J513J651j835j006K286k59k045
4180a443J115J905j516j481K033P44k311J34K313j008k056J743J374k294m18K239
$$ plain form
4196 1073 779 -1245 -217 1505 -237 -1104 960 1226 -1226 -777 1440 112 -1496 253 1514 -860
4212 -860 -1094 1377 400 -1493 -104 1198 -549 -1339 804 868 -1168 -558 1389 -99 -1331 702 1391
4229 1391 -811 -522 1208 271 -1119 -143 1111 -789 -993 1000 673 -1204 -252 1089 -430 -1320 431
4246 431 770 -1097 -371 1222 242 -1203 487 1240 -481 -629 1037 478 -1349 47 1176 -393 -1204
4263 -1204 676 472 -1128 -324 1094 -218 -1091 428 984 -659 -744 913 144 -1149 232 1271 -595
4280 -595 -468 887 469 -1168 -361 949 -266 -942 647 821 -1214 -111 909 -168 -1010 254 1024
4297 1024 -913 -619 1060 237 -1202 39 1049 -447 -670 455 633 -923 -106 1089 -209 -966
4313 -966 543 830 -873 -525 1088 148 -980 396 825 -522 -751 573 240 -1115 -51 794 -246
$$ packed form
4196A073k94k024J028J722j742q67K064K66k452M49K217j328j608J749J261k374
4212h60k34K471r77j893J389J302j747p90K143O4k036O10J947j488j232K033O89
4229A391k202K89J730r37j390R76J254j900k04J993l27j877R52J341j519q90J751
4246D31L39j867P26J593r80j445J690P53j721j48J666n59j827J396J129j569q11
4263a204J880k04j600Q04J418j312q73J519N56j643q5J657p69j293J381J039j866
4280e95J27J355m18j637Q07J310j215o76J589J74k035J103J020j077q42J264P70
4297A024j937K94J679q23j439J241J010j496k23J125J78j556Q17J195j298p57
4313i66J509K87j703L48J613r40j128J376M29j347k29J324l33j355J064Q45j040
$$ plain form
4330 -246 -729 566 580 -716 -250 807 164 -866 357 816 -464 -557 827 40 -742 93 870 -517
4348 -517 -794 542 197 -900 -201 1141 -213 -808 464 554 -606 -332 977 72 -854 408 858 -631
4366 -631 -258 812 217 -881 -104 846 -376 -691 451 18 -908 -163 703 72 -915 432 680 -416
4384 -416 -578 661 125 -819 397 712 -397 -441 783 272 -581 203 868 -266 -642 481 407 -654
4402 -654 -145 846 -78 -825 273 820 -545 -317 757 155 -808 248 631 -486 -651 594 242 -859
4420 -859 21 583 -299 -574 508 372 -645 -233 668 184 -610 503 482 -500 -188 416 171 -440 125
4439 125 611 -473 -566 415 132 -684 22 814 -231 -701 401 263 -477 -5 675 -130 -588 34 419
4458 419 -460 -323 617 209 -634 357 568 -418 -464 407 62 -749 -220 553 -145 -582 585 296 -854 -118
$$ packed form
4330b46m83J295J4j296M66J057o43j030J223M59j280r3J384p87p82Q35P77j387
4348e17k77J336l45j097O99J342j354n95J272R0j160K74J309r05r26J262M50j489
4366f31L73J070n95j098P77R50j222l15J142m33r26P45Q66o31r87J347K48j096
4384d16j62J239n36r44J216L15j109m4J224n11q53P84O65j134l76J123p4j061
4402f54N09R91r24p47J098N47j365K28J074o02r63J056L83j117j65J245l52j101
4420h59Q80N62q82k75J082j36j017M12R01m84p94J113k1r82L12O04k45o11N65
4439A25M86j084r3R81k83q16P06P92j045m70J102j38p40M72O80q05m58O22L85
4458D19q79J37R40m08q43R91K11r86m6Q71l45q11N29P73o98m37J167k89j150P36
$$ plain form
4478 -118 735 -205 -797 339 483 -442 -477 441 155 -686 -41 430 -262 -529 355 289 -480 49 549 23
4498 23 -790 309 358 -813 -45 533 -187 -538 257 399 -589 -391 749 175 -839 205 515 -160 -527
4517 -527 541 235 -551 264 467 -194 -591 415 477 -413 -218 612 -68 -668 50 390 -641 -574 575
4536 575 -95 -533 354 927 -332 -634 658 416 -434 -195 563 -218 -607 308 387 -750 -315 631 -31
4555 -31 -750 295 448 -352 -522 644 240 -684 153 613 -395 -628 717 201 -487 93 613 -107 -910
4574 -910 312 472 -796 -119 686 -98 -797 212 418 -580 -286 523 -31 -645 169 664 -461 -514 554
4593 554 591 -626 -49 575 -158 -749 527 622 -641 -190 734 177 -801 177 475 -607 -520 697 467
4612 467 -812 -55 691 -425 -681 397 363 -709 -274 994 -387 -590 472 441 -708 -179 795 3
$$ packed form
4478a18Q53r40n92J136J44r25l5R18k86q41O45M71o92k67Q84o6p69N29N00n26
4498B3q13J099M9j171P68N78p20l51P95J42r88J98J140n74j014J044L10o75l67
4517e27J068l06p86Q15K03o61l97J006O2q90J95Q30o80o00P18L40j031O7J149
4536E75o70m38Q87N73j259l02J292k42q50K39P58p81l89R15P9j137M35R46o62
4555c1p19J045J53q00j70J166m04r24Q37M60j008k33J345n16o88N80N20p20q03
4574i10J222J60j268O77Q05p84o99J009K06r98K94Q09n54o14Q14M95j125n3J068
4593E54L7j217N77O24p33n91J276R5j263M51R24n57r78R78K98j082Q7J217k30
4612D67j279P57P46j116k56J078l4j072M35J268j381k03J062l1j149N29R74p92
$$ plain form
4630 3 -712 309 839 -520 -471 516 76 -662 -151 769 -292 -800 167 326 -887 -388 639 -126 -626
4649 -626 196 791 -627 -262 787 145 -808 150 775 -625 -666 390 489 -741 -162 741 -275 -949 532
4668 532 444 -789 -383 967 138 -885 362 966 -423 -620 888 253 -825 48 865 -395 -774 603
4686 603 472 -850 -422 982 3 -925 431 564 -565 -229 873 73 -637 99 595 -621 -576 833
4704 833 382 -708 129 938 -347 -782 479 347 -586 -392 949 -138 -1022 373 772 -499 -529 806
4722 806 95 -863 128 997 -261 -653 533 367 -1040 -85 911 -342 -1077 449 633 -819 -259 973
4740 973 254 -856 332 1217 -496 -387 1025 435 -868 23 926 -208 -881 650 515 -779 -364
4757 -364 1109 -170 -845 487 1161 -887 -551 1101 373 -1101 168 965 -431 -940 1102 372 -1023
$$ packed form
4630Cp15J021N30j359M9R87m40p38N11R20j061n08R67J59j213M99J027p65n00
4649f26Q22N95j418L65J049o42r53R58O25j400m1J056R9j230N79R03j016o74J481
4668E32q8j233M06J350q29j023J247O04j389j97J508o35j078Q73Q17j260l79J377
4686F03j31j322M28J404r79r28J356J33j129L36J102q00p10P36M96j216M5J409
4704H33m51j090Q37Q09j285m35J261j32r33J94J341j087q84J395L99j271l0J335
4722H06p11r58R91Q69j258l92J186j66j407R55R96j253p35J526J84j452N60J232
4740I73p19j110J188Q85j713J09J412n90j303Q91R03j134o73J531j35j294M15
4757c64J473j279o75J332O74k048L36J652p28j474J269P97j396n09K042p30j395
$$ plain form
4774 -1023 -139 960 -134 -982 611 716 -1005 -464 902 41 -998 281 956 -735 -905 849 493
4791 493 -1192 290 903 -380 -811 975 575 -1008 -58 1261 25 -1203 620 858 -915 -787 992
4808 992 136 -1244 325 973 -717 -902 931 682 -1030 -90 1128 -402 -690 557 914 -903 -467
4825 -467 1040 -39 -1021 585 911 -827 -827 1016 495 -1220 81 1405 -239 -835 1095 590 -1225
4842 -1225 -153 1272 -205 -1005 577 949 -948 -746 1261 -52 -1139 480 978 -919 -1002 1311
4858 1311 461 -1064 -222 1037 -443 -1137 817 1049 -1173 -554 1144 -256 -1239 247 1036 -597 -702
4875 -702 1154 580 -1301 70 1294 -528 -891 810 836 -1355 -301 1165 -339 -1291 667 691 -1214
4892 -1214 -673 1173 178 -1356 783 1186 -648 -1004 833 562 -1347 -191 1205 -515 -1222 976
$$ packed form
4774a023Q84J099j094q48J593J05j721N41J366q61j039J279O75j691j70J754l56
4791D93j685J482O13j283m31J786m00j583R50J319j236j228J823K38j773J28J779
4808I92q56j380J569O48j690j85J833k49j712R40J218j530k88J247L57j817M36
4825d67J507j079r82J606L26j738%J843n21j715J301J324j644n96J930n05j815
4842a225J072J425j477q00J582L72j897K02K007j313j087J619M98j897q3K313
4858A311q50j525Q42J259j480o94J954K32k222O19J698j400r83J486P89j633j05
4875g02J856n74j881J371J224j822l63J701K6k191J054J466j504r52J958K4j905
4892a214N41J846r95j534K139M03j834l56J837k71j909J156J396j720p07K198
$$ plain form
4908 976 955 -1221 -634 1192 161 -1772 662 1364 -821 -1002 1107 198 -1401 327 1318 -583 -1018
4925 -1018 1012 1006 -1160 -54 1344 -281 -1210 736 972 -1456 -817 1231 273 -1679 415 1589 -662
4942 -662 -685 1183 531 -1474 -166 1414 -444 -1207 936 933 -1420 -442 1530 -113 -1746 864 1288
4959 1288 -1075 -826 1345 243 -1567 -136 1383 -401 -1117 1142 852 -1485 -182 1702 -240 -1373
4975 -1373 805 1060 -978 -792 1284 126 -1466 346 1494 -885 -1042 1304 647 -1414 -24 1558
4991 1558 -548 -1436 989 1019 -1226 -305 1478 106 -1568 498 1183 -1048 -1111 1102 531 -1708 122
5008 122 1664 -680 -1124 1055 923 -1462 -293 1695 -287 -1540 904 1166 -1471 -690 1647 168
5024 168 -1739 94 1409 -597 -1233 1603 765 -1543 198 1585 -501 -1444 957 824 -1292 -683
$$ packed form
4908I76k1k176N87J826j031j933K434P02k185j81K109r09j599J728R91j901m35
4925a018K030ok166J106J398j625r29J946K36k428O39K048r58j952K094J174k251
4942f62k3J868o52k005J308J580j858p63K143lk353R78J972j643j633K610M24
4959A288k363K49K171j102j810J431J519j784p16K259k90k337J303J884j942j133
4975a373K178K55k038J86K076j158j592J812J148k379j57K346o57k061J390J582
4991A558k106q88K425L0k245R21J783j372j674K066O85k231o3K213n71k239J830
5008A22J542k344m44K179j32k385J169J988j982j253K444K62k637P81K337j479
5024A68j907J833J315k006o36K836q38k308J741J387k086r43K401j33k116O09
$$ plain form
5040 -683 1501 -100 -1835 710 1303 -1153 -1072 1581 529 -1656 56 1555 -925 -1474 1220 909
5056 909 -1436 -330 1797 -265 -1465 679 1400 -1166 -661 1632 424 -1744 385 1613 -927 -1341
5072 -1341 1549 645 -1777 -108 1855 -534 -1602 1093 1010 -1297 -501 1700 26 -1882 607 1533
5088 1533 -1239 -1103 1332 730 -1725 24 1612 -580 -1264 1170 1010 -1620 -7 1766 -116 -1620
5104 -1620 751 1269 -1604 -855 1417 611 -1758 522 1698 -1012 -1309 1469 948 -1672 -157 1859
5120 1859 -175 -1363 1070 1513 -1441 -504 2176 183 -1737 524 1521 -1200 -1060 1715 603 -1741
5136 -1741 -39 1754 -542 -1332 1334 966 -1578 -754 2005 -431 -1604 929 1405 -1388 -975 1777
5152 1777 195 -1704 216 1721 -866 -1353 1501 740 -1692 -289 1888 -532 -1811 1323 1410 -1561
$$ packed form
5040f83K184j601j735K545N93k456Q1K653j052k185J712J499k480n49K694l11
5056I09k345J106K127k062j200K144P21k566N05K293j208k168K129J228k540m14
5072a341K890r04k422J669J963k389j068K695q3k307P96K201j674j908K489R26
5088A533k772J36K435o02k455J749J588k192o84K434j60k630J613J773j882j504
5104a620K371N18k873P49K272q06k369K280J176k710k97K778n21k620J515K016
5120A859k034j188K433M43k954R37K680j993j920K261R97k721J40K775j112k344
5136a741J702J793k296p90K666l68k544Q24K759k436j173K533M76k793M13K752
5152A777j582j899J920J505k587m87K854p61k432J403K177k420j279L134Q7k971
$$ plain form
5168 -1561 -894 1733 107 -1918 497 1794 -1118 -1272 1668 608 -1981 -61 1786 -432 -1644
5183 -1644 1308 1020 -1601 -450 1886 -57 -1896 691 1735 -1269 -1089 1409 183 -1932 288
5198 288 1478 -823 -1328 1239 737 -1907 -138 1944 -367 -1688 1140 1409 -1512 -769 1890 349
5214 349 -1810 386 1715 -1050 -1222 1328 684 -1905 83 2000 -745 -1371 1415 1084 -1604 -531
5230 -531 1710 -301 -1912 956 1591 -1386 -1045 1841 530 -1877 299 1856 -1079 -1557 1300 1070
5246 1070 -2158 -331 1850 -492 -1653 1084 1464 -1666 -784 1948 270 -1863 619 1740 -1150
5261 -1150 -1438 1527 526 -2086 -108 1989 -743 -1970 1212 1147 -1531 -720 2130 -163 -1621 760
5277 760 1581 -1198 -1170 1682 405 -1812 176 1998 -965 -1595 1587 1001 -1653 -373 2113 -484
$$ packed form
5168a561O67K627j626k025K415J297k912j54K940j060k589J920J847k218j212
5183a644K952k88k621J151K336j943j839K587J044l004J80K498j226k115K220
5198B88J190k301n05K567n02k644J769K082k311j321K828K69k921P43K659j541
5214C49k159K196J329k765j72K550o44k589J988J917k745o26K786l31k688J073
5230e31K241k011j611K868O35k977L41K886j311k407K176J557k935m78K857k30
5246A070l228J827K181k342j161K737L80l130Q82K732j678k133K482J121k890
5261a150k88K965j001k612J978K097k732j227L182o5k678Q11K850k293j458K381
5277G60Q21k779K8K852j277k217J988J822k963o30L182n86k654J280K486k597
$$ plain form
5293 -484 -1883 1158 1340 -1612 -1061 1917 277 -2041 688 1880 -1162 -1275 1515 923 -1918 -177
5309 -177 1893 -604 -1982 935 1282 -1796 -590 2155 98 -1923 546 1860 -1542 -1260 1668 485
5325 485 -2235 307 1920 -809 -1758 1374 892 -1825 -528 1886 -172 -1960 888 1400 -1451 -784
5341 -784 1798 387 -1939 234 1800 -1089 -1406 1765 940 -1923 -271 1863 -560 -1859 915 1403
5357 1403 -1700 -846 2024 -21 -2038 383 1805 -1345 -1394 1528 742 -1895 237 1956 -1001 -1900
5373 -1900 1250 1324 -1770 -552 2090 -176 -1856 1128 1590 -1415 -1051 1673 349 -1841 402 2221
5389 2221 -1170 -1432 1561 838 -2010 -444 2180 -805 -2054 1021 1587 -1652 -907 2041 215 -1878
5405 -1878 592 1820 -1338 -1271 1939 685 -2065 -14 2108 -744 -1627 1596 1296 -1824 -632 1936
$$ packed form
5293d84j399L041J82k952N51K978j640k318K729J192l042j13K790n92k841J741
5309a77K070k497j378K917L47l078J206K745k057k021K469J314l402K82K928j183
5325D85k720K542J613k729r49L132m82k717J297K414k058j788K848N12k851O67
5341g84K582j411k326K173J566k889l17L171q25k863J652K134k423j299K774M88
5357A403l103Q54K870k045k017K421J422l150m9K922p86k637K132J719k957q99
5373a900L150P4l094J218K642k266j680K984M62l005L64K724j324k190K243J819
5389B221l391k62K993p23k848J566K624k985j249L075N66l239P45K948j826k093
5405a878K470J228l158O7L210j254k750K051K122k852q83L223l00l120J192K568
$$ plain form
5421 1936 -82 -1802 616 1812 -1306 -1204 1943 659 -1984 69 2297 -797 -2020 1852 1004
5436 1004 -2061 -429 1977 -213 -1966 983 1836 -1921 -897 2080 297 -2219 498 2144 -1109
5451 -1109 -1587 1684 929 -2051 -4 1948 -764 -2137 1364 1429 -1848 -841 2093 9 -1902 859
5467 859 1932 -1600 -1184 1833 696 -2135 164 1929 -1103 -1631 1640 1145 -2306 -381 2191 -90
5483 -90 -2100 943 1595 -1705 -1400 2096 256 -2088 542 2174 -1172 -1570 1586 915 -2135 -112
5499 -112 2165 -395 -1988 1512 1461 -1740 -777 2109 173 -2068 669 1906 -1447 -1227 1792 514
5515 514 -2101 -145 2172 -916 -1933 1394 1209 -2053 -328 2423 -22 -1993 1000 1783 -1710 -1232
5531 -1232 2083 453 -1885 322 2257 -1112 -1686 1645 948 -2084 -355 2062 -555 -2017 1274
$$ packed form
5421A936k018j720K418J196l118J02L147j284k643K053K228l094j223L872q48
5436A004l065J632K406k190j753K949Q53l757J024K977j783k516K717J646l253
5451a109m78L271p55k980K047J952k712j373L501O5l277J007K934k084j911K761
5467H59J073l532M16L017j137k831K299J765l032n28L271m95l451J925K572k281
5483i0k010L043O52l300L05L496j840k344K630J632l346l98L156o71l050K023
5499a12K277k560j593L500n1l201R63K886j936k241K737J237l353K20L019j278
5515E14k615J956K317l088j017L327j85l262J725K751k445j971K993P83l493M78
5531a232L315j630k338K207J935l369n74L331o97l032J729K417k617j462L291
$$ plain form
5546 1274 1632 -1732 -1096 2593 -50 -2263 649 1937 -1308 -1785 2055 834 -2330 -170 2457 -579
5562 -579 -1930 1566 1290 -2151 -928 2219 -182 -2253 928 1818 -1399 -1219 2120 561 -2200 666
5578 666 2019 -937 -1846 1707 1033 -1763 -471 2298 -491 -2261 1131 1727 -1726 -1110 2280 429
5594 429 -2391 632 2000 -1234 -1471 1907 866 -2480 -181 2452 -809 -2333 1486 1743 -2005 -1013
5610 -1013 2326 -17 -2277 1021 1873 -1593 -1275 2431 270 -2315 252 2277 -1023 -2062 1704
5625 1704 1224 -2170 -395 2282 -640 -2152 1202 1985 -1812 -1123 2352 115 -2363 427 2079 -1216
5641 -1216 -1770 1925 1106 -2324 -405 2522 -683 -2126 1560 1744 -2356 -893 2513 -247 -2303 857
5657 857 2106 -1529 -1346 2203 787 -2416 342 2349 -916 -2086 1495 1310 -2234 -601 2535 -147
$$ packed form
5546A274L58l364O36L689k643k213K912J288l245m77L840j221l164K160K627l036
5562e79j351L496k76l441J223L147k401k071L181Q90l217J80L339j559k761K866
5578F66J353k956r09L553o74k796J292K769k789j770L392N96l453O16L390j851
5594D29k820L023J368l234k37L378j041l346K299K633l261j524L819K57l748R92
5610a013L339k343k260L298Q52l466L18L706k161k585K567K025l300j039L766
5625A704m80l394J775K677k922j512L354P83l797O89L475k237k478K790J652l295
5641a216n54L695q19l430J919K927l205j443L686J84m100J463L406k760k056L160
5657H57J249l635J83L549j416l203K758K007l265j170L581j85l544J633L136k682
$$ plain form
5673 -147 -2265 782 1916 -1784 -1221 2294 335 -2486 698 2404 -1242 -1788 1835 1150 -2511 -393
5689 -393 2368 -479 -2214 1211 1644 -2049 -1219 2511 8 -2515 663 2241 -1500 -1715 2004 731
5705 731 -2393 123 2348 -866 -2088 1700 1716 -2259 -648 2747 -165 -2456 1269 1993 -1608 -1336
5721 -1336 2358 489 -2505 552 2397 -1077 -2078 2193 1327 -2571 -446 2326 -266 -2198 1192
5736 1192 1688 -2152 -988 2279 26 -2388 775 2008 -1440 -1637 2239 819 -2342 -151 2668
5751 2668 -845 -2557 1480 1645 -2298 -725 2558 -167 -2689 975 2164 -1827 -1571 2327 706
5766 706 -2232 487 2413 -1107 -1752 2148 1430 -2294 -296 2582 -500 -2577 1430 2045 -1933 -1313
5782 -1313 2281 263 -2290 655 2125 -1573 -1889 2098 895 -2576 -97 2582 -669 -2460 1806
$$ packed form
5673a47k118L047J134l700N63L515j959k821L184J706l646n46L623o85l661K118
5689c93K761k847j735L425M33l693Q30L730k503k523L178J578l741k15L719j273
5705G31l124K516K225l214j222L788J6l975J611L395k912k291L725P24l601K72
5721a336L694j869k994L057J845l474j001M271q66l898K125K772k592j932L390
5736A192M96l840J164L267k253k414L163J233l448j97L876j420l161K191K819
5751B668l513j712M037J65l943J573L283k725k522L664J189l991K56L898j621
5766G06k938K719J926l520o45L900p18l724J998K878l082k077M007O15l978O20
5782a313L594k018k553K945J470l698l16L987j203l471K479K679l251j791M266
$$ plain form
5797 1806 1555 -2314 -1062 2458 -160 -2562 837 2261 -1974 -1463 2225 748 -2542 57 2292
5812 2292 -1126 -1983 1984 1505 -2353 -541 2467 -428 -2264 1352 1969 -1934 -1313 2311 451 -2732
5828 -2732 459 2439 -1653 -1889 2156 782 -2534 -112 2565 -797 -2326 1337 1737 -2163 -869
5843 -869 2829 74 -2436 682 2260 -1612 -1840 2189 765 -2749 146 2258 -1221 -2281 1843
5858 1843 1404 -2457 -718 2557 -297 -2536 1500 1916 -2048 -1240 2518 567 -2631 580 2492 -1320
5874 -1320 -1827 2005 1363 -2623 -274 2706 -878 -2600 1301 2239 -2081 -1120 2576 -30 -2548 799
5890 799 2354 -1668 -1737 2433 882 -2535 65 2520 -1092 -2108 1588 1483 -2200 -582 2632 -291
5906 -291 -2239 1392 2330 -1859 -1623 2624 585 -2553 745 2883 -1264 -2010 2059 1272 -2606 -495
$$ packed form
5797A806k51l869J252L520k618k402L399J424m235N11L688j477l290K599K235
5812B292l418q57L967m79l858J812L008k895j836L616O17l903O21L624j860l183
5828b732L191J980m092k36M045j374l316K422K677l362j529L663M00l900J294
5843h69L698k755k510L118J578l872k28M029j424l514K895K112l479j060M124
5858A843m39l861J739L275k854k239M036M16l964Q08L758j951l198L211J912l812
5874a320n07L832o42l986K349K980l584j722L901R38m320R61L696k606k518L347
5890G99J555m022o9M170j551l417K600K455l612j016L696j05l683J618L214k923
5906b91j948L631R38m189K36M247k039l138L298K138m147p46M069p87l878K111
$$ plain form
5922 -495 2685 -508 -2535 1797 1584 -2240 -1267 2624 167 -2791 754 2406 -1682 -1778 2147 896
5938 896 -2603 -235 2707 -1120 -2445 1972 1816 -2458 -827 2886 -316 -2779 1258 2488 -1934
5953 -1934 -1274 2586 651 -2988 321 2742 -1441 -2198 2230 1104 -2861 -312 2787 -394 -2555
5968 -2555 1545 1907 -2139 -1296 2566 348 -2688 823 2352 -1662 -2032 2417 1186 -2812 -18 2709
5984 2709 -883 -2389 2058 1620 -2395 -909 3011 -235 -2845 1087 2484 -2093 -1589 2432 737
5999 737 -2634 52 2654 -1557 -2347 2128 1389 -2846 -299 2876 -573 -2750 1496 2220 -2375 -1083
6015 -1083 2715 418 -2820 697 2827 -1771 -1931 2483 1101 -2604 -200 2739 -939 -2600 1867
6030 1867 1847 -2537 -1234 2776 -167 -2921 958 2183 -1917 -1702 2507 718 -2813 229 2584 -1218
$$ packed form
5922d95L180l193k027M332k13l824R73L891k457k958L545J652m088r6L925j251
5938H96l499K368K942l827j325M417j56m274J631L713l202k463M037J230m422
5953a934O60L860j935l639L309K421m183p57M428j126l965K549L099l181k161
5968b555M100L62m046Q43L862k218l036L511J529m014l70M449j231l998K794K727
5984B709l592j506M447m38m015J486L920l246k610L932J397m577N04M021j695
5999G37l371K686K602m211p90M475p39m235K547L175l449k177M246P24m595J292
6015a083L798k297l238L517K130m598j60M414j382l705K404K939l678j661M467
6030A867k0m384J303M010k943k754L879J225m100K15M209j789l531L042K355l802
$$ plain form
6046 -1218 -2194 2365 1444 -2698 -527 2766 -362 -2695 1240 2141 -2196 -1386 2913 528 -2724 529
6062 529 2794 -1819 -2204 2278 1303 -3086 -71 2769 -905 -2603 1824 2179 -2284 -1042 3050 59
6078 59 -2797 1257 2632 -1899 -1997 2563 790 -2798 479 2791 -1156 -2406 1976 1555 -2682 -859
6094 -859 2984 -724 -2678 1192 2292 -2217 -1788 2728 338 -2921 872 2689 -1714 -2085 2550 1307
6110 1307 -2757 -170 2942 -809 -2883 1750 1988 -2381 -839 2798 -74 -2861 1050 2682 -1782
6125 -1782 -1656 2727 925 -2854 182 2853 -1105 -2591 2168 1791 -2627 -879 2896 -427 -2915
6140 -2915 1139 2395 -2275 -1577 2590 528 -2867 252 2967 -1541 -2070 2240 1485 -3117 -255 3009
6156 3009 -566 -2744 1655 2136 -2655 -921 2771 279 -2957 943 2448 -1891 -1949 2394 768 -2873
$$ packed form
6046a218r76M559r21m142K171L293l128k333L935R01m337Q10M299k385l252L253
6062E29K265m613l85M482r75m389L015K840l674j698M427L55m463J242M092k991
6078E9k856M054J375m531r8M560j773l588L277K312l947j250M382m21m237J823
6094h59L843l708j954L870J100m509M29M516k390l259L793J817m403l71M635j243
6110A307m064K587L112l751k074M633K38m369J542L637k872k787L911J632m464
6125a782J26M383j802l779L036K671l958j486M759l77m418J748L775l323k488
6140b915M054J256m670O98M167k062l395L119K715m508n29M310p55m602K862L264
6156C009l575k178M399M81m791J734L692k492l236L900J505m339n8M343j626l641
$$ plain form
6172 -2873 146 2915 -1132 -2206 1818 1843 -2692 -743 3043 -420 -2981 1385 2257 -2180 -1814 2899
6188 2899 427 -2829 580 2774 -1317 -2513 2363 1265 -2954 -503 2868 -747 -2546 1522 2085
6203 2085 -2448 -1194 2881 38 -3030 1059 2467 -1725 -1937 2317 1087 -2925 53 2847 -1180
6218 -1180 -2506 1727 1670 -2686 -951 2856 -200 -2722 1197 2333 -2273 -1775 2885 675 -2713 506
6234 506 2764 -1506 -2218 2552 1550 -2551 -469 3005 -862 -2646 1563 1786 -2442 -1326 2854 72
6250 72 -3256 716 2454 -1876 -1975 2400 1367 -2785 -15 2749 -1007 -2566 2120 1797 -2605 -927
6266 -927 2996 -204 -2773 1253 2272 -2356 -1668 2777 744 -2959 210 2805 -1262 -2381 2126
6281 2126 1427 -2646 -441 2868 -558 -2621 1596 1863 -2304 -1357 2564 261 -2912 710 2628 -1970
$$ packed form
6172b873L019K769m047j074M024K5m535J949L786l463k561M366Q72m437L66M713
6188B899k472l256L409K194m091j196M876j098m219K451L371l615j799M068N63
6203B085m533J254M075k843l068M089J408m192k12M254j230m012K978K794m027
6218a180j326M233n7m356J735L807l056k522L919J136m606M98M660k210l388L219
6234E06K258m270p12M770j002m101K082L474l867j784M209K23m228J116M180k782
6250G2l328L972J738m330r9M375j033m152K770K764l756j559M686l23m402J678
6266i27L923l200k569M026J019m628O88M445k033l703L169K595m067j119M507
6281B126o99m073K205L309l426k063M217K67m167R47L921k303l173L622J918m598
$$ plain form
6297 -1970 -1975 2348 1074 -2931 -182 2984 -872 -2394 2051 1824 -2638 -931 2836 -22 -2484 1282
6313 1282 2604 -2064 -1762 2648 595 -2914 425 2761 -1303 -2331 2171 1460 -2619 -520 2863
6328 2863 -634 -2784 1867 2238 -2261 -1400 2844 233 -2893 875 2718 -1871 -2121 2667 1073 -2779
6344 -2779 -109 3099 -1152 -2568 1979 1673 -2537 -936 2798 -200 -2847 1105 2468 -2176 -1742
6359 -1742 2653 733 -3120 370 2641 -1260 -2313 2157 1510 -2855 -601 2839 -485 -2924 1263
6374 1263 2387 -2167 -1492 2919 216 -2815 783 2543 -1610 -2067 2347 1272 -2929 -249 3261
6389 3261 -1026 -2492 1742 2135 -2538 -822 3035 -185 -2920 917 2757 -2201 -1866 2701 720
6404 720 -3021 220 2685 -1243 -2372 2144 1466 -2732 -636 3072 -407 -2679 1622 2311 -2311 -1482
$$ packed form
6297a970nM323j274m005K749L166l856j522M445k27m462J707L767k858k462L766
6313A282J322m668L02M410k053l509L339K336m064j028M502p11m079K099L383
6328B863l497k150M651L71m499Q61M244k611l126L768J843m589k50M788j594l852
6344b779K670L208m251j416M547l06m210J601L734k998k647L952J363m644M34
6359a742M395j920l853L490K271l901j053M470o47m365K254L440l324k439M187
6374A263J124m554O75M411k703l031L598J760m153m57M414j075m201K680L510
6389C261m287j466M234L93m673J716L857l220k735L837J840m958L35M567j981
6404G20l741L241K465l928j129M516o78m198K096L708l479k272M301O89m622Q29
$$ plain form
6420 -1482 2778 622 -2909 546 2607 -1431 -2157 2286 1271 -2831 -393 2864 -923 -2684 1728
6435 1728 2089 -2328 -1298 2899 -61 -2928 1199 2649 -2011 -1813 2694 809 -2844 63 2837
6450 2837 -1240 -2356 2111 1623 -2457 -708 3150 -323 -2747 1146 2468 -2078 -1528 2575 399
6465 399 -2936 676 2710 -1633 -2192 2502 1397 -2955 -290 2766 -843 -2691 1970 1957 -2388 -1106
6481 -1106 2960 114 -2906 1186 2670 -1946 -1935 2624 936 -3034 109 2772 -1307 -2446 2081
6496 2081 1600 -2688 -708 2690 -295 -2847 1333 2033 -1999 -1342 2616 672 -2851 602 2438 -1307
6512 -1307 -2276 2223 1290 -2772 -256 2976 -629 -2454 1533 1964 -2340 -1018 2855 280 -2668 851
6528 851 2329 -1607 -1893 2303 865 -2803 105 2825 -931 -2551 1954 1620 -2831 -966 3035 -275
$$ packed form
6420a482M260k156l531L455K061m038p26M443j015m102K438L257l787j761M412
6435A728L61m417J030M197k960k867M127J450m660J98M507j885l653K907K774
6450B837m077j116M467m88m080J749L858l473k424L893J322m546N50M103k176
6465C99l335L612K034m343n59M694j105m352K665L056l609j848M661j3m345J282
6481a106M066k846l020M092J484m616J1M559j688l970L143K663m079j139M527
6496B081m81m288J980L398k985k552M180P00m032O57L958j944l523L453J836l745
6512a307r69M499r33m062K516L232l605j825L987M31m304J322L873k575k948L519
6528H51J478l936k86M196j438l668K908K720l756j620M505l34m451J865M001l310
$$ plain form
6544 -275 -2820 1281 2312 -1757 -1346 2574 660 -2693 520 2711 -1533 -2085 2050 1349 -2319 -412
6560 -412 2934 -765 -2805 1441 1860 -2562 -1178 2417 -8 -2344 1098 2497 -1895 -1768 2245 904
6576 904 -2740 122 2656 -836 -2193 1937 1526 -2346 -581 2863 -384 -2892 1354 2095 -2043 -1480
6592 -1480 2646 436 -2730 297 2435 -1232 -2015 2374 1477 -2607 -595 3006 -671 -2630 1365
6607 1365 1911 -2197 -1158 2671 -62 -2580 756 2282 -1849 -1896 2488 1087 -2794 -47 2595 -1098
6623 -1098 -2426 1675 1929 -2574 -819 2867 -298 -2279 1289 2104 -2081 -1307 2659 756 -2655 519
6639 519 2772 -1328 -2080 2242 1308 -2568 -220 2700 -402 -2452 1235 1947 -2239 -985 2697 -31
6655 -31 -2865 681 2358 -1887 -1817 2667 800 -2582 8 2494 -976 -2329 1754 1564 -2446 -851
$$ packed form
6544b75k545M101J031m069M11L920j914l353L213K191m244n52M135p01l668J907
6560d12L346l699k040M246M19m422J384L595k425k336L442J399m392J27M013j341
6576I04l644K862K534l492j357M130m11l872J765L444l247k508M246P41m138N63
6592a480M126k210l166L027K138l667p83M389q97m084K012L601l677j959L995
6607A365N46m108J039L829k733k518L336J526m131m7M384j401l881K747K642l693
6623a098j328M101K54m503J755L686l165j981L568Q15m185P74L966j903l411L174
6639E19K253m100p52M322r34l876K348K920l102k050L687P12m186J254L682k728
6655c1k834L546J677m245P0M484j867l382K590K486l470j353M083j90m010J595
$$ plain form
6671 -851 2541 -25 -2518 1010 2186 -1903 -1564 2253 682 -2827 378 2483 -1146 -2202 2199
6686 2199 1465 -2381 -712 2840 -628 -2633 1458 1776 -2104 -1057 2606 306 -2811 778 2447
6701 2447 -1790 -1648 2379 1081 -2568 66 2460 -788 -1931 1730 1764 -2268 -1047 2770 -202 -2696
6717 -2696 927 2306 -1955 -1471 2244 762 -2536 479 2500 -1005 -2143 1717 1310 -2537 -627
6732 -627 2688 -318 -2675 1363 2092 -2123 -1188 2645 406 -2653 503 2308 -1606 -1753 2436 941
6748 941 -2531 -233 2624 -805 -2531 1646 1659 -2337 -950 2446 -414 -2703 976 2046 -1818 -1525
6764 -1525 2439 605 -2494 136 2561 -1120 -2161 1814 1584 -2398 -502 2803 -398 -2453 1329
6779 1329 1938 -2138 -1275 2558 401 -2559 679 2423 -1698 -1777 2250 942 -2712 -123 2521 -904
$$ packed form
6671h51L392k566k493L528J176m089L39L817j571l509L205K105l629j056M401
6686B199p34l846J669L552l468k005M091L18l880J047L663k300l117L589J669
6701B447m237J42M027j298l649K634K394l248j143L661L4m032J221L817k972k494
6717b696L623J379m261M84L715j482l298L015K021l505j138L860m07l847J910
6732f27L315l006k357M038P29m215R35L833k239l059L156J805l914j47M189j495
6748I41l472K298K857l429j726M177J3l996J387L396k860k289L679J070l864K93
6764a525L964j834l099K630K425l681j041L975k30l982J896L305l201k055L782
6779A329O09m076Q63L833k157k960L238J744m121p9M027j308l654K589K644l425
$$ plain form
6795 -904 -2310 1647 1563 -2250 -648 2696 -290 -2322 850 2150 -1635 -1472 2267 725 -2634 -14
6811 -14 2551 -1111 -2182 1963 1451 -2478 -541 2528 -571 -2636 1235 2208 -1970 -1493 2380 382
6827 382 -2647 484 2512 -1428 -1828 1934 1095 -2496 -316 2473 -872 -2141 1506 1768 -2270 -895
6843 -895 2527 -202 -2431 950 1938 -1724 -1878 2420 751 -2704 202 2338 -1020 -2127 1887 1230
6859 1230 -2201 -818 2577 -238 -2386 1298 1939 -2089 -1352 2582 393 -2184 424 2426 -1298
6874 -1298 -1826 2224 1171 -2490 -354 2540 -737 -2438 1394 1737 -2189 -1004 2510 -25 -2721
6889 -2721 939 2140 -1540 -1619 2361 557 -2497 88 2121 -960 -2214 1869 1253 -2181 -489 2408
6905 2408 -466 -2488 1116 2053 -1702 -1070 2458 440 -2402 531 2266 -1286 -1748 1945 1260 -2392
$$ packed form
6795i04j406L957q4l813J602L344k986k032L172J300l785J63L739j542l359K620
6811a4K565l662j071M145n12l929J937L069l099k065L871R73m178M77L873j998
6827C82l029L131K028l940m00L762q39l591K180K789l345j269L647K62m038J375
6843h95L422k729k229L381R88l662j54M298j669l455K906K136l358j107M014o57
6859A230l431J383L395k815k148L684O41m028P37L934k189k577K608K002l724
6874a298n28M050j053l661K136K894l277j701L832L43l926J185L514k535k696
6889b721L660J201l680p9L980j804l054K585K033l081j254M083o16l434J692K897
6905B408k874k022L604R37l755O32L528k018k842K933J735l552m62L693o85l652
$$ plain form
6921 -2392 -287 2660 -454 -2281 1497 1621 -1766 -563 2302 131 -2111 601 2109 -1417 -1424 2158
6937 2158 732 -2431 385 2454 -986 -2075 1870 1211 -2299 -487 2689 -164 -2362 1191 1938
6952 1938 -1867 -1184 2324 375 -2265 709 2064 -1249 -2092 1898 1235 -2289 -215 2455 -654 -1848
6968 -1848 1571 1743 -1963 -692 2530 78 -2414 860 2286 -1437 -1488 1946 951 -2434 173 2377
6984 2377 -911 -2141 1764 1344 -2191 -613 2278 -365 -2232 1001 1864 -1696 -1293 2074 568 -2606
7000 -2606 492 2406 -1197 -1508 1968 1179 -2237 -183 2160 -549 -2294 1477 1826 -2077 -798 2453
7016 2453 -18 -2055 695 2103 -1360 -1727 1966 1301 -2222 52 2234 -917 -2262 1453 1629 -1980
7032 -1980 -843 2252 -263 -2344 1064 1993 -1865 -1349 2072 405 -2341 496 1890 -1211 -1608 1801
$$ packed form
6921b392K105K947l114j827L778J24l387J203K865k171k242K712J508l526pL582
6937B158j426l163K816K069l440j089L945o59l510J812L176k853k198L553P47
6952A938l805O83L508j949k640K974J355l313q43L990o63l524K074K670l109j194
6968a848L419J72l706J271L222k452k492L274J426l723n1L434r95l385K607K204
6984B377l288j230L905m20l535J578K891k643j867L233Q63l560M03L367j506l174
7000b606L098J914l603l11L476p89l416K054K343k709j745L771L49l903J279L251
7016B453k471k037K750J408l463l67L693o65l523K274K182l151j345L715J76l609
7032a980J137L095k515k081L408R29l858N16L421j667k746K837J394l101l97L409
$$ plain form
7048 1801 1113 -2176 -389 2150 -564 -2044 1329 1414 -1838 -693 2119 51 -2332 647 2063 -1348
7064 -1348 -1639 1871 781 -1948 34 2267 -619 -1806 1285 1541 -2104 -740 2417 -203 -2118
7079 -2118 790 1923 -1494 -1399 2089 632 -2345 372 2142 -1228 -1698 1673 984 -2270 -330 2376
7095 2376 -445 -1943 1269 1733 -1644 -936 2479 -18 -2216 580 1934 -1177 -1661 2179 664 -2149
7111 -2149 32 2126 -853 -1590 1551 1167 -1715 -504 2321 -82 -2007 949 1925 -1562 -1051 2096
7127 2096 387 -2309 279 2226 -1182 -1755 1814 1255 -1954 -58 2206 -672 -1869 1289 1539 -1937
7143 -1937 -924 2194 76 -2186 552 1892 -1271 -1826 1972 526 -1993 200 2316 -672 -1700
7158 -1700 1288 1291 -1952 -847 2012 -184 -2033 564 1730 -1443 -1275 1955 426 -2595 344 1730
$$ packed form
7048A801o88l289J787K539k714j480L373Q5l252J145K812k068k383K979J416l411
7064a348k91L510j090k729J982K233k886j187L091K56l645J364L157k620j915
7079b118K908J133l417R5L488j457k977K717J770l370m70L371o89l254J940K706
7095B376k821j498L212M64l377P08L415k497k198K796J354l111m84L840j515k813
7111b149K181K094k979p37L141l84k882J211K825k403j925K956R76l487N11L147
7127B096j709k696K588J947l408n73L569n59l209J896K264k878j197L158K50l476
7143a937J013L118k118k262K738J340l163n55L798j446k519K193K116k988j028
7158a700K988Ll243J105K859k196j849K597J166l173J68L230j529l021K939J386
$$ plain form
7174 1730 -1033 -1439 1649 1105 -2048 -492 2296 -445 -1906 1173 1531 -2104 -1136 2057 320 -1971
7190 -1971 560 1787 -1407 -1681 1736 642 -1743 101 1982 -732 -1751 1471 1415 -1906 -427 2102
7206 2102 -67 -2050 866 1464 -1552 -1151 1862 324 -2079 358 2157 -1141 -1460 1758 919 -1821
7222 -1821 -311 2156 -612 -1771 1284 1518 -1854 -957 2213 365 -1974 329 1744 -1455 -1478 1815
7238 1815 792 -2104 -126 2005 -842 -1637 1128 1172 -1820 -653 2145 -216 -2103 868 1633 -1526
7254 -1526 -1150 1832 303 -2132 106 1698 -921 -1640 1673 1107 -1759 -89 2128 -337 -1916 1097
7270 1097 1461 -1570 -791 2009 -57 -2086 460 1789 -1278 -1147 1707 828 -1763 199 1843 -825
7286 -825 -1910 1473 1260 -1873 -470 1782 -116 -1886 917 1522 -1414 -1128 2094 293 -2151 305
$$ packed form
7174A730k763m06L088n44l153J556K788k741j461L079L58l635R68L193j737k291
7190a971K531J227l194k74L417j094k385J844J881k714j019L222n6l321J479K529
7206B102k169j983K916N98l016M01L013j538k403K437J799l298l19L218q39k740
7222a821J510K467k768j159L055K34l372Q97L170j848k339K303J415l199k3L293
7238A815j023k896J978K131k847p95K765M4k992J167K798k361j887K971P65l159
7254a526L76K982j529k435K238J592k619p19L313n66k866J670K217k465j579L013
7270A097L64l031P79K800k066k029K546J329l067J31K854q79k591J962J644k668
7286h25j085L383k13l133J403K252j898j770K803O05k936K86L222j801k444K456
$$ plain form
7302 305 1772 -871 -1670 1520 876 -1752 -431 1999 -634 -1708 806 1322 -1607 -858 1889 0
7318 0 -1846 403 1805 -1087 -1583 2015 722 -1947 92 1971 -764 -1516 1499 1136 -1789 -360
7334 -360 1933 -217 -1931 837 1601 -1343 -940 1540 156 -1898 393 1647 -918 -1396 1478 1101
7350 1101 -1692 65 1904 -463 -1714 827 1306 -1413 -641 1757 -25 -1805 610 1737 -1176
7365 -1176 -1225 1430 550 -1808 -165 2054 -645 -1569 1340 1142 -1869 -519 1557 -205 -1691 838
7381 838 1809 -1618 -1164 1737 564 -1778 485 1809 -1058 -1581 1341 693 -1825 -226 1942 -369
7397 -369 -2004 1304 1692 -1457 -513 1705 38 -1721 483 1677 -1021 -1127 1638 454 -1872 103
7413 103 1751 -809 -1197 1146 1282 -1466 -697 2050 0 -1738 613 1643 -1229 -780 1712 203
$$ packed form
7302C05J467k643p99L190o44k628J321K430k633j074K514N16k929P49K747j889
7318@j846K249J402k892m96L598j293k669K039J879k735p52L015l63k925J429
7334c60K293k150j714K768P64k944M03K480j384k054K291J254k565m78K874l77
7350A101k793J757J839k367j251K541M79k719P72K398j782j780K415J127k913
7365a176m9K655q80k358J643K219k699r24K909j98l011J350K076j762j486K529
7381H38R71l427M54K901j173k342K263J324k867n23K922o48k518J599K168k311
7397c69j635L308L88l149R44K218j667j759K204J194k698j06K765j184k326J975
7413A03J648k560l88K343J36k748P69K747k050j738K351J030k872M49K492j509
$$ plain form
7429 203 -1524 309 1578 -786 -1652 1442 743 -1677 31 1847 -417 -1595 1162 1163 -1198 -817 1735
7446 1735 403 -1910 722 1765 -1115 -984 1299 637 -1656 86 1610 -827 -1530 1375 932 -1724
7462 -1724 -445 1805 -153 -1815 529 1064 -1221 -936 1594 246 -1754 416 1580 -1108 -1405 1363
7478 1363 794 -1755 -183 1446 -520 -1307 951 1401 -1480 -553 1670 -71 -1787 358 1546 -918
7494 -918 -1208 1581 670 -1547 -181 1528 -362 -1617 1114 1066 -1528 -486 1652 -134 -1754 572
7510 572 1197 -1242 -696 1503 246 -1619 279 1535 -808 -1427 1406 781 -1688 -61 1612 -602
7526 -602 -1614 832 1120 -1368 -681 1682 121 -1564 613 1274 -1153 -935 1412 317 -1543 88
7542 88 1465 -573 -1424 969 850 -1392 -308 1368 -246 -1567 740 1169 -1442 -787 1662 252
$$ packed form
7429B03j727J833J269k364q66L094o99k420J708J816k264j178K757Jk361L81K552
7446A735j332k313K632J043k880J31K283o62k293J742J524k437p03K905m43k656
7462a724J279K250j958j662K344N35k285K85K530j348k000K170J164k688k97K768
7478A363n69k549J572J629j966p87K258M50k881R27K223j741j716K145J188k464
7494i18k90K789r11k217J366J709j890j255K731m8k594J042K138j786j620K326
7510E72O25k439N46K199j257j865J898J256k343o19K833o25k469J627J673k214
7526f02j012K446K88k488O87K363j561j685K177O61k427K18K347j095j860J631
7542H8J377k038q51K393j19k242J084J676j614j321K307M29k611O55K449j410
$$ plain form
7558 252 -1696 356 1261 -783 -1020 1265 703 -1595 -5 1529 -497 -1559 783 1257 -1512 -765
7574 -765 1366 98 -1451 611 1604 -921 -865 1313 716 -1772 -64 1429 -454 -1271 979 927 -1415
7591 -1415 -621 1573 -140 -1640 791 1386 -1549 -711 1381 130 -1334 -25 1389 -796 -1438 1127
7607 1127 741 -1314 -86 1212 -581 -1489 1027 1052 -1478 -400 1371 -47 -1493 715 1360 -1149
7623 -1149 -800 1533 499 -1144 233 1398 -731 -1219 1061 973 -1514 -384 1487 -396 -1436 1019
7639 1019 1067 -1231 -770 1312 252 -1321 266 1479 -866 -1150 1195 511 -1378 -66 1315 -417
7655 -417 -1341 608 975 -1217 -576 1533 182 -1376 415 1336 -972 -1013 1122 467 -1564 107 1584
7672 1584 -470 -1123 1149 802 -1558 -304 1491 -399 -1622 829 1075 -1269 -636 1234 14 -1299
$$ packed form
7558B52j948K052R05k044k37K285n62k298J590J534k026j062K342M74k769P47
7574g65K131j268j549K062R93k525N6K178n97k488J708J493j883q17K250n2k342
7591a415P94K194j713j500K431N95k935Q38K092j251j464J309J414k185o42K565
7607A127l86k055J228J298j793r08K516K5k530J078J771j418j446K208O45k509
7623a149L49K333j034j643J377J165k129m88K280q8k487J130J871j883j040K455
7639A019M8k298M61K082j060j573J587J213k345k84K345o84j889J312J381j732
7655d17r24J949L67k192O41K109j351j558J791R21k308m1K135o55k031J671J477
7672A584k054o53K272l47k360J254J795j890j223K451K46k344O33J870j220j313
$$ plain form
7688 -1299 208 1312 -792 -753 1149 688 -1548 -107 1456 -467 -1268 836 911 -1189 -513 1350 39
7705 39 -1402 319 1246 -868 -740 1252 335 -1487 143 1452 -560 -967 944 717 -1153 -386 1379
7722 1379 -321 -1309 792 842 -1015 -444 1179 46 -1222 497 1126 -733 -907 1306 441 -1295 -158
7739 -158 1291 -438 -1074 832 836 -1269 -651 1280 -53 -1432 614 1091 -1103 -918 973 222 -1409
7756 -1409 103 1150 -545 -992 852 694 -1163 -122 1238 -448 -1188 313 1189 -1087 -552 1291
7772 1291 239 -1448 305 1270 -670 -982 898 428 -1290 -162 1054 -351 -1138 897 924 -1266
7788 -1266 -514 1324 -194 -1213 472 1318 -884 -611 1156 250 -1054 162 1157 -497 -955 955
7804 955 681 -1283 -86 1194 -106 -1333 753 872 -1119 -409 1182 86 -1459 362 1398 -694
$$ packed form
7688a299J507J104k104L9J902m61k236J441J563j923q01K104P5k100O76J863j311
7705C9j441J721R27k114J28J992r17j822J630J309k012m07J911k27j870P67J765
7722A379j700r88K101N0j857N71J623j133j268J719O29j859j74K213q65j736J137
7739a58J449j729o36J906Mk105O18J931j333j379K046M77k194J85J891p51j631
7756a409J512J047j695m47J844j58j857J041J360j686p40J501Q76k276N35J843
7772A291j052j687J753R65j940l12J880m70j718J128J216j405p87K035K7k190
7788a266P52J838j518j019J685Q46k202K73J767r06j304J216R95j654m58J910
7804I55k74j964J197J280j300j227K086J19j991P10J591j096j545J821J036k092
$$ plain form
7820 -694 -876 1293 520 -1036 -90 1242 -298 -819 801 1006 -1177 -186 1451 -127 -1142 580 1036
7837 1036 -816 -770 927 175 -1422 276 1127 -539 -1330 809 488 -1139 42 1312 -162 -1055 608
7854 608 762 -1106 -490 1156 -199 -1138 309 1202 -715 -877 980 431 -1157 73 1150 -548 -943
7871 -943 713 477 -1068 -465 1201 -142 -1215 558 978 -804 -676 1174 98 -1303 274 949
7887 949 -694 -753 867 672 -1104 10 1348 -367 -1116 976 950 -1144 -261 1135 256 -1245 410
7904 410 943 -782 -909 896 212 -1338 22 1249 -712 -1167 614 504 -859 -432 1032 -138 -1109
7921 -1109 738 742 -741 -542 972 194 -931 281 1041 -450 -836 862 332 -915 -237 1085 -296
7938 -296 -1066 650 762 -907 -399 1176 -49 -1188 205 893 -728 -565 1151 474 -1028 159 1066
$$ packed form
7820f94j82K169p73j556R46J332j540n21J620K05k183R91J637j578j015J722M56
7837A036j852M6J697p52j597J698Q51j666p91K139l21j627J181J270j474q93J663
7854F08J54j868O16J646j355r39J447Q93j917j62J857n49j588J230J077j698l95
7871i43J656k36j545O03J666j343j073J773M20j782J28J850j076j401J577O75
7887I49j643n9J620j95j776J114J338j715p49K092k6k094Q83J396q79j501J655
7904D10N33j725j27J805o84j550J360J227j961m55J781j10j363M27J464j170r71
7921a109J847Mj483J99J514p78j125J212P60j491l86J698n30j247O78J322j381
7938b96p70J716J12j669N08J575j225j139J393O88j621J63J716o77j502J187R07
$$ plain form
7955 1066 -396 -892 994 835 -1092 -442 847 -125 -890 696 827 -659 -339 1266 224 -1188 181
7972 181 1066 -896 -518 834 358 -1101 136 1109 -188 -995 792 674 -1076 -584 988 105 -1081
7989 -1081 418 742 -522 -561 988 172 -1274 246 1093 -643 -722 739 502 -821 -348 864 -104
8006 -104 -1121 319 721 -822 -579 1294 40 -887 83 934 -502 -957 750 318 -1121 112 926
8023 926 -523 -1088 502 659 -836 -230 1068 -143 -1255 347 1173 -680 -690 1248 137 -1082 384
8040 384 1098 -394 -819 661 681 -1083 -196 1192 -299 -932 527 980 -767 -607 1122 369 -1247
8057 -1247 205 1062 -724 -860 702 474 -859 167 1078 -180 -811 534 532 -1019 -337 1159 37
8074 37 -1102 729 721 -778 -818 1092 140 -1417 147 1184 -494 -853 775 523 -1029 -243 1002 -357
$$ packed form
7955A066j462m96J886j59j927O50J289r72p65J586J31j486L20J605j042j412J369
7972A81Q85j962L78J352m76j459J237R73j297q07J787j18j750M92J572q83j186
7989a081J499L24j264l9J549q16j446J520Q47j736p9J461k37j323M73J212r68
8006a04j017J440M02j543K43J873j254r27R70Q51j436m55J707m32j439J233Q14
8023I26j449n65J590J57j495O06J298j211j112J602Q26j853j0J938j111j219J466
8040C84P14j492m25J480K0j764Q87J388j491o33J459M53j747J60J729p53j616
8057a247J452Q57j786j36J562k28j333J026R11j258o31J345kj551O82J496j122
8074C7j139J831qj499m0J910r52j557J564J037j678l59J628k52j552P86J245j359
$$ plain form
8092 -357 -1007 741 419 -800 -271 906 218 -996 359 787 -426 -965 1029 401 -913 -36 1339
8109 1339 -325 -929 795 159 -722 -740 1048 -127 -791 631 971 -562 -392 758 338 -1045 425
8126 425 785 -514 -728 675 330 -1074 -86 919 -148 -988 616 683 -823 -526 805 91 -1020
8143 -1020 297 886 -834 -443 718 465 -980 -83 873 -436 -801 703 205 -959 -334 1155 -370
8160 -370 -1071 714 827 -909 -430 849 7 -1137 -20 935 -534 -744 816 170 -688 157 798 -205
8178 -205 -978 716 433 -520 -422 1123 97 -1009 281 1008 -451 -456 1018
8191 1018
$$ packed form
8092c57o50J748l22j219N29J177o88j214J355M28j213n39J994o28j314Q77J375
8109A339j664o04J724o36q81j8J788j175o64J422L40j533J70J150m20j383J470
8126D25L60j299k14J403l45j404R88J005j067q40J604O7j506K97J331p14j111
8143a020J317N89j720L91J161k53j445Q97R56j309l65J504m98j164O25J489j525
8160c70p01J785J13j736M79J279q42j144J117R55j469k10J560o46q58Q45O41j003
8178b05p73J694k83r53R8J545j026j106J290P27j459nJ474
8191A018
$$ Imaginary data points
##PAGE= N=2
##DATA TABLE= (X++(I..I)), XYDATA
$$ plain form
0 0 0 0 0 0 0 0 0 -8 8 -8 8 -16 24 -24 32 -40 55 -64 72 -88 112 -136 153 -184 216 -254 295 -337 389 -449
30 -449 515 -587 662 -753 854 -960 1077 -1206 1351 -1507 1678 -1862 2066 -2292 2534 -2797
46 -2797 3087 -3406 3755 -4134 4553 -5015 5531 -6103 6741 -7461 8279 -9220 10306 -11586
60 -11586 13122 -14997 17352 -20404 24541 -30493 39823 -56595 96047 -385151 98696 695286
72 695286 -545177 -301602 837719 342051 -726847 98306 657981 -452074 -726329
81 -726329 508161 358831 -663537 -44752 847235 -77300 -639718 368892 475074 -669412
91 -669412 -399066 638089 62112 -677474 262670 702684 -359318 -443859 571308 209431
101 209431 -723017 -69022 632341 -234392 -553264 482083 457798 -552931 -177002 638920
$$ packed form
0@%%%%%%%qJ6j6J6k4M0m8N6p2R5j19J36j60K00k48K89l37M00m70N49o32P26q38
30d49R64j102J249j415J607j814K037k283K557k858L185l540L928m358M826n331
46b797N884o493P161p889Q687r568J0546j1634J2844j4202J5740j7499J9526k1892
60a1586K4708k8119L2349l7756M4945n5034P0316r6418J52642m81198M83847N96590
72F95286j240463K43575J139321m95668j068898Q25153N59675j110055k74255
81g26329J234490j49330j022368O18785Q91987r24535n62418J008610J06182j144486
91f69412K70346J037155n75977p39586R40144M40014j062002q4541J015167l61877
101B09431r32448O53995P01363q66733l18872J035347k4285j010729L75929Q15922
$$ plain form
111 638920 -75102 -662319 239869 508724 -454268 -336781 617529 168924 -620809 91086
121 91086 578373 -336342 -505603 455637 297038 -567797 -68811 637724 -102982 -543285
131 -543285 332271 417889 -507343 -270664 549859 32088 -568250 179727 523597 -334152
141 -334152 -372047 479485 186914 -565907 -6758 533269 -202050 -448730 380937 338785
151 338785 -463533 -143350 523587 -54168 -522407 216379 409416 -384353 -271607 483605
161 483605 108728 -498395 86564 472002 -258183 -387198 384961 231678 -475319 -53251
171 -53251 498867 -116021 -436687 282765 335950 -402631 -196206 463268 17770 -474181
181 -474181 154785 415860 -302371 -296595 407340 143881 -458579 15596 444033 -177948
$$ packed form
111F38920p14022n87217R02188K68855r62992J17487R54310m48605p89733P11895
121I1086M87287r14715j69261R61240j58599q64835M98986P06535p40706m40303
131e43285Q75556Q5618r25232K36679Q20523n17771o00338P47977L43870q57749
141c34152l7895Q51532k92571p52821N59149N40027p35319k46680Q29667m2152
151C38785q02318L20183O66937n77755m68239P38786J93037p93769J12746P55212
161D83605l74877o07123N84959L85438p30185j29015P72159j53283p06997M22068
171e3251N52118o14888l20666P19452N3185p38581K06425O59474m45498m91951
181d74181O28966K61075p18231N776P03935k63459o02460M74175M28437o21981
$$ plain form
191 -177948 -376531 319265 263827 -405594 -104828 442809 -56994 -416885 202864 335189
201 335189 -324329 -217323 401625 70688 -425773 84903 386722 -232208 -303226 333886
211 333886 175830 -393563 -29858 408465 -110221 -360274 247991 270854 -346804 -143143
221 -143143 393242 -5057 -389245 144407 334668 -263964 -238635 349238 108539 -392365
231 -392365 32584 374848 -172304 -307783 284831 205807 -350966 -73185 380408 -61293
241 -61293 -355591 191968 283046 -296275 -173127 354591 40180 -366338 89718 327690
251 327690 -208961 -253317 297449 142457 -348958 -12600 351430 -114931 -302451 225772
261 225772 220267 -299295 -108832 338706 -12445 -333048 134482 281621 -239240 -193742
$$ packed form
191a77948j98583O95796n5438o69421L00766N47637m99803l59891O19749J32325
201C35189o59518J07006O18948l30937m96461N10676L01819o18930p1018O37112
211C33886j58056n69393L63705M38323n18686k50053O08265K2863o17658K03661
221a43143N36385l98299l84188N33652J90261n98632K5329N87873k40699n00904
231c92365M24949L42264n47152j35479N92614p9024n56773K77781M53593m41701
241f1293k94298N47559R1078n79321J23148N27718l14411m06518M56056K37972
251C27690n36651m4356N50766j54992m91415L36358L64030m66361j87520N28223
261B25772n505n19562J90463M47538l51151l20603M67530J47139n20861M5498
$$ [...]
8191D25
##END NTUPLES=NMR FID
##END=
