##TITLE=1H_ABBC0503
 CDCl3, 8 sc, 
 6.3.2020
##JCAMPDX= 6.0         $$ Bruker NMR JCAMP-DX V2.0
##DATA TYPE= NMR FID
##DATA CLASS= NTUPLES
##ORIGIN= UXNMR, Bruker Analytische Messtechnik GmbH
##OWNER= root
$$ XWIN-NMR		Version 3.5
$$ Fri Mar  6 13:51:48 2020 Russian Standard Time (UT+4h)  she@DPX200
##.OBSERVE FREQUENCY= 200.1315
##.OBSERVE NUCLEUS= ^1H
##.DELAY= (6, 6)
##.ACQUISITION MODE= SIMULTANEOUS
##.ACQUISITION SCHEME= undefined
##.AVERAGES= 8
##.DIGITISER RES= 18
##SPECTROMETER/DATA SYSTEM= spect
##.PULSE SEQUENCE= zg30
##.SOLVENT NAME= D2O
##.SHIFT REFERENCE= (INTERNAL, D2O, 0, 15.7039)
##AUDIT TRAIL= $$ (NUMBER, WHEN, WHO, WHERE, WHAT)
$$ ##TITLE= Audit trail, XWIN-NMR		Version 3.5
$$ ##JCAMPDX= 5.01
$$ ##ORIGIN= Bruker BioSpin GmbH
$$ ##OWNER= she
$$ F:/spectra/data/she/nmr/H-F/1/audita.txt
$$ ##AUDIT TRAIL=  $$ (NUMBER, WHEN, WHO, WHERE, WHAT)
(   1,<2020-03-06 13:50:42.26 +0400>,<she>,<DPX200>,
      <created by zg, POWCHK disabled, PULCHK disabled
       configuration hash MD5:
       00 E9 B6 7A A2 85 ED C7 34 08 36 98 17 FE 4E 26
       data hash MD5: 16K
       2D 1A 2B B2 F9 3E 2B 28 86 86 A6 CB A9 D9 45 E8>)
$$ ##END=
$$ 
$$ hash MD5
$$ 0A 65 F3 F9 15 29 D8 81 AB E9 D4 2E 67 CE 8A 18
##$RELAX= 
##$RELAX= 
##$RELAX= 
##$RELAX= 
##$RELAX= 
##$RELAX= 
$$ Bruker specific parameters
$$ --------------------------
##$DU= <F:/spectra>
##$EXPNO= 1
##$NAME= <H-F>
##$PROCNO= 1
##$TYPE= <nmr>
##$USER= <she>
##$AMP= (0..31)
100 100 100 100 100 100 100 100 100 100 100 100 100 100 100 100 100 100 
100 100 100 100 100 100 100 100 100 100 100 100 100 100 
##$AQSEQ= 0
##$AQ_mod= 1
##$AUNM= <au_zg>
##$AUTOPOS= <>
##$BF1= 200.13
##$BF2= 200.13
##$BF3= 200.13
##$BF4= 200.13
##$BF5= 200.13
##$BF6= 200.13
##$BF7= 200.13
##$BF8= 200.13
##$BYTORDA= 1
##$CFDGTYP= 0
##$CFRGTYP= 5
##$CHEMSTR= <none>
##$CNST= (0..31)
1 1 145 1 1 1 1 1 1 1 1 1 1 1 1 1 1 1 1 1 1 1 1 1 1 1 1 1 1 1 1 1 
##$CPDPRG= <>
##$CPDPRG1= <>
##$CPDPRG2= <>
##$CPDPRG3= <>
##$CPDPRG4= <mlev>
##$CPDPRG5= <mlev>
##$CPDPRG6= <mlev>
##$CPDPRG7= <mlev>
##$CPDPRG8= <mlev>
##$CPDPRGB= <>
##$CPDPRGT= <>
##$D= (0..31)
0 1.2 0 0 0 0 0 0 0 0.06 0 0.03 0 0 0 0 0.0002 0 0 0 0 0 0 0 0 0 0 0 0 
0 0 0 
##$DATE= 1583488241
##$DBL= (0..7)
120 120 120 120 120 120 120 120 
##$DBP= (0..7)
150 150 150 150 150 150 150 150 
##$DBP07= 0
##$DBPNAM0= <>
##$DBPNAM1= <>
##$DBPNAM2= <>
##$DBPNAM3= <>
##$DBPNAM4= <>
##$DBPNAM5= <>
##$DBPNAM6= <>
##$DBPNAM7= <>
##$DBPOAL= (0..7)
0.5 0.5 0.5 0.5 0.5 0.5 0.5 0.5 
##$DBPOFFS= (0..7)
0 0 0 0 0 0 0 0 
##$DE= 6
##$DECBNUC= <off>
##$DECIM= 24
##$DECNUC= <off>
##$DECSTAT= 4
##$DIGMOD= 1
##$DIGTYP= 9
##$DL= (0..7)
0 120 120 120 120 120 120 120 
##$DP= (0..7)
150 150 150 150 150 150 150 150 
##$DP07= 0
##$DPNAME0= <>
##$DPNAME1= <>
##$DPNAME2= <>
##$DPNAME3= <>
##$DPNAME4= <>
##$DPNAME5= <>
##$DPNAME6= <>
##$DPNAME7= <>
##$DPOAL= (0..7)
0.5 0.5 0.5 0.5 0.5 0.5 0.5 0.5 
##$DPOFFS= (0..7)
0 0 0 0 0 0 0 0 
##$DQDMODE= 0
##$DR= 18
##$DS= 0
##$DSLIST= <SSSSSSSSSSSSSSS>
##$DSPFIRM= 0
$$ [...]
##$SUBNAM2= <"">
##$SUBNAM3= <"">
##$SUBNAM4= <"">
##$SUBNAM5= <"">
##$SUBNAM6= <"">
##$SUBNAM7= <"">
##$SUBNAM8= <"">
##$SUBNAM9= <"">
##$SW= 24.9337058887773
##$SWIBOX= (0..15)
0 0 2 0 0 0 0 0 0 0 0 0 0 0 0 0 
##$SW_h= 4990.01996007984
##$TD= 16384
##$TD0= 1
##$TE= 0
##$TE2= 300
##$TE3= 300
##$TEG= 300
##$TL= (0..7)
0 120 120 120 120 120 120 120 
##$TP= (0..7)
150 150 150 150 150 150 150 150 
##$TP07= 0
##$TPNAME0= <>
##$TPNAME1= <>
##$TPNAME2= <>
##$TPNAME3= <>
##$TPNAME4= <>
##$TPNAME5= <>
##$TPNAME6= <>
##$TPNAME7= <>
##$TPOAL= (0..7)
0.5 0.5 0.5 0.5 0.5 0.5 0.5 0.5 
##$TPOFFS= (0..7)
0 0 0 0 0 0 0 0 
##$TUNHIN= 0
##$TUNHOUT= 0
##$TUNXOUT= 0
##$USERA1= <user>
##$USERA2= <user>
##$USERA3= <user>
##$USERA4= <user>
##$USERA5= <user>
##$V9= 5
##$VALIST= <valist>
##$VCLIST= <CCCCCCCCCCCCCCC>
##$VD= 0
##$VDLIST= <DDDDDDDDDDDDDDD>
##$VPLIST= <PPPPPPPPPPPPPPP>
##$VTLIST= <TTTTTTTTTTTTTTT>
##$WBST= 1024
##$WBSW= 4
##$XGAIN= (0..3)
0 0 0 0 
##$XL= 0
##$YL= 0
##$YMAX_a= 321956
##$YMIN_a= -318436
##$ZGOPTNS= <>
##$ZL1= 120
##$ZL2= 120
##$ZL3= 120
##$ZL4= 120
##$ABSF1= 10
##$ABSF2= 0
##$ABSG= 5
##$ABSL= 3
##$ALPHA= 0
##$AQORDER= 0
##$ASSFAC= 0
##$ASSFACI= 0
##$ASSFACX= 0
##$ASSWID= 0
##$AUNMP= <proc_1d>
##$AZFE= 0.1
##$AZFW= 0.1
##$BCFW= 1
##$BC_mod= 2
##$BYTORDP= 1
##$COROFFS= 0
##$CY= 11.3945322036743
##$DATMOD= 1
##$DC= 2
##$DFILT= <>
##$DTYPP= 0
##$F1P= 16.9975609425685
##$F2P= -3.02152046262296
##$FCOR= 0.5
##$FTSIZE= 0
##$FT_mod= 4
##$GAMMA= 1
##$GB= 0.15
##$INTBC= 1
##$INTSCL= 1
##$ISEN= 128
##$LB= 0.24
##$LEV0= 0
##$LPBIN= 0
##$MAXI= 10000
##$MC2= 0
##$MEAN= 0
##$ME_mod= 0
##$MI= 1.114404
##$NCOEF= 0
##$NC_proc= 0
##$NLEV= 6
##$NOISF1= 3.799351
##$NOISF2= 2.8
##$NSP= 1
##$NTH_PI= 0
##$NZP= 0
##$OFFSET= 15.70392
##$PC= 1
##$PHC0= -9787.499
##$PHC1= 16.60082
##$PH_mod= 1
##$PKNL= yes
##$PPARMOD= 0
##$PSCAL= 0
##$PSIGN= 0
##$REVERSE= no
##$SF= 200.130013532006
##$SI= 16384
##$SIGF1= 3
##$SIGF2= 2
##$SINO= 400
##$SIOLD= 16384
##$SREGLST= <1H.CDCl3>
##$SSB= 0
##$STSI= 0
##$STSR= 0
##$SW_p= 3612.71676300578
##$SYMM= 0
##$S_DEV= 0
##$TDeff= 0
##$TDoff= 0
##$TI= <>
##$TILT= no
##$TM1= 0
##$TM2= 0
##$TOPLEV= 0
##$USERP1= <user>
##$USERP2= <user>
##$USERP3= <user>
##$USERP4= <user>
##$USERP5= <user>
##$WDW= 1
##$XDIM= 8192
##$YMAX_p= 0
##$YMIN_p= 0
$$ End of Bruker specific parameters
$$ ---------------------------------
##NTUPLES= NMR FID
##VAR_NAME=  TIME,          FID/REAL,        FID/IMAG
##SYMBOL=    X,             R,               I
##VAR_TYPE=  INDEPENDENT,   DEPENDENT,       DEPENDENT
##VAR_FORM=  AFFN,          ASDF,            ASDF
##VAR_DIM=   8192,          8192,            8192
##UNITS=     SECONDS,       ARBITRARY UNITS, ARBITRARY UNITS
##FACTOR=    0.0002004,     1,               1
##FIRST=     0,             0,               0
##LAST=      1.6414764,     0,               0
##MIN=       0,             -318436,         0
##MAX=       1.6414764,     321956,          0
$$ Real data points
##PAGE= N=1
##DATA TABLE= (X++(R..R)), XYDATA
$$ [...]
$$ plain form
3028 586 1286 -279 -1663 87 1535 112 -1392 -587 1473 439 -1456 -607 1454 762 -1545 -771
3044 -771 1424 940 -1139 -809 1292 1376 -1013 -1548 1292 1572 -850 -1746 717 1980 -377 -1512 610
3061 610 2415 15 -1606 -31 1998 501 -1563 -530 1748 641 -1388 -632 1880 1117 -1906 -935
3077 -935 1384 1127 -1378 -1343 1268 1742 -1361 -1460 1161 1762 -674 -1927 441 1797 -227 -2178 -103
3094 -103 2279 270 -1938 -711 2184 820 -1727 -899 1662 939 -1613 -1131 1386 1183 -1770 -1351
3110 -1351 1142 1499 -1331 -1875 1041 1626 -996 -1868 463 1855 -612 -2573 95 1967 39 -2394
3126 -2394 -612 2068 612 -2114 -1453 2050 849 -1747 -1393 1224 1288 -1667 -1617 1190 1602 -1345 -1694
3143 -1694 1034 1582 -1387 -2104 593 2220 -1023 -2421 335 2486 -103 -2644 -261 2400 360
$$ packed form
3028E86P00j565j384J750J448j423j504Q05K060j034j895Q49K061o92k307P74
3044g71K195m84k079L30K101Q4k389n35K840K80k422q96K463J263k357j135K122
3061F10J805k400j621J575K029j497k064J033K278j107k029P56K512p63l023R71
3077i35K319k57k505L5K611M74l103r9K621O01k436j253K368J356k024j951K075
3094a03K382k009k208J227K895j364k547Q28K561p23k552M82K517k03k953M19
3110a351K493L57k830n44K916N85k622q72K331J392k467j961K668J872j928k433
3126b394J782K680j456k726O61L503j201k596L54K617O4k955N0K807M12k947l49
3143a694K728N48k969p17K697J627l243j398K756K151k589k541K383K661k040
$$ plain form
3158 360 -2315 -1147 2595 1224 -1928 -1471 2085 1414 -1729 -1588 1880 2024 -1521 -1973 1068 1990 -861
3175 -861 -1988 1000 2432 -936 -2518 802 2229 -126 -2562 246 2718 414 -2172 -523 2518
3190 2518 1161 -2239 -1247 2020 1552 -1545 -1652 2224 2093 -1584 -1770 1525 2163 -1356 -1988 1297 2649
3207 2649 -782 -2294 464 2293 -63 -2633 -55 2926 315 -2681 -612 2688 1149 -2457 -1066
3222 -1066 2649 1661 -2380 -1962 1991 1999 -1655 -2290 1552 2309 -1562 -2434 978 2292 -1054 -2668 606
3239 606 2835 -359 -2803 11 2526 125 -2951 -403 2673 523 -2953 -1162 2785 1554 -2491
3254 -2491 -2034 2194 1882 -2137 -2513 1616 2628 -1399 -2838 944 2413 -969 -3013 481 2526 -722
3270 -722 -3054 353 2924 -100 -2939 -652 2816 600 -3054 -887 2971 1144 -2924 -1870 2370
$$ packed form
3158C60k675J168L742j371l152M57L556o71l143J41L468J44l545m52L041R22k851
3175h61j127K988J432l368j582L320J427k355k436K808K472k304k586J649L041
3190B518j357l400R92L267m68l097j07L876j31l677j86L295O38l519o32L285J352
3207B649l431j512K758J829k356k570K578K981k611k996K069L300j539l606J391
3222a066L715r88m041M18L953Ql654o35L842P57l871q72L412J314l346j614L274
3239F06K229l194k444K814K515k401l076K548L076k150l476J791L947j231m045
3254b491M57M228l12m019l76M129J012m027j439L782J469l382k044L494K045l248
3270g22k332L407K571l024k839K287L468k216l654K167L858j827m068J054M240
$$ plain form
3285 2370 1830 -2397 -2330 2068 2386 -1475 -2725 1254 2841 -976 -2874 706 2839 -86 -2791 298
3301 298 3011 78 -2689 -517 3016 706 -3214 -788 2936 1313 -2607 -1318 3020 2283 -2397
3316 -2397 -2439 2198 2823 -1708 -2684 1375 3309 -1072 -2869 935 3146 -529 -2667 75 3050 185
3332 185 -2727 -243 3050 1107 -2864 -919 2898 1322 -2827 -1182 2653 1545 -2731 -2112 2480
3347 2480 2546 -1995 -2837 1748 3134 -1628 -3045 1078 3215 -656 -3228 351 3229 168 -3337 -526
3363 -526 2938 391 -3064 -782 2986 1447 -2990 -1271 2847 1720 -2890 -2143 2679 2129 -2413 -2560
3379 -2560 1838 3054 -1380 -3336 939 3199 -1036 -3365 430 3368 70 -3567 -581 3125 524
3394 524 -3130 -1242 2947 968 -2973 -1793 2973 1739 -2552 -1961 2157 2361 -2471 -2653 1974 2884
$$ packed form
3285B370n40m227O7M398L18l861j250L979J587l817j898L580K133k925k705L089
3301B98K713k933k767K172L533k310l920K426L724j623l920J289M338p37m680
3316b397m2M637O25m531r76M059J934m381j797L804K211l675k138K742K975k865
3332A85k912K484L293j943l971J945L817j576m149J645L835j108m276O19M592
3347B480O6m541q42M585J386m762j417M123K137l871k572L579K878l061l505K811
3363e26L464k547l455K282L768j539m437J719M118j127m610P47M822n50m542j47
3379b560M398J216m434j956M275K260m235k329L795K938l298l637K986L706k601
3394E24l654J888M189j979l941J180M766j234m291N91M118K04m832j82M627R10
$$ plain form
3410 2884 -1480 -3222 1228 3305 -808 -3634 161 3679 -141 -3813 -389 3475 1050 -3185 -1103
3425 -1103 3252 1292 -2832 -1624 2675 1476 -2628 -1910 2639 2525 -2199 -2204 2366 2863 -1615 -2940
3441 -2940 2005 3277 -976 -3344 748 3774 -10 -3562 203 3513 715 -3199 -1017 3481 1609
3456 1609 -3115 -1746 2989 1895 -2467 -2403 2678 2190 -1999 -2416 2083 2973 -1668 -3238 1560 3272
3472 3272 -1224 -2972 836 3508 -69 -3674 -102 3743 502 -3737 -1267 3546 1045 -3154 -1802
3487 -1802 3075 2012 -2779 -2490 2539 2566 -2139 -2681 1705 2708 -1943 -3164 1273 2910 -1485 -3185
3503 -3185 711 3402 -619 -3523 305 3565 60 -3872 -1042 3494 1099 -3689 -2068 3013 1989
3518 1989 -3076 -2471 2669 2500 -2500 -2562 1752 2481 -2086 -2847 1461 3115 -879 -3525 601 3159
$$ packed form
3410B884m364j742M450K077m113k826L795L518l820l672L424L864k425m235K082
3425a103M355j960m124J208M299j199m104P18M549j14m724nM570M97m478j325
3441b940M945J272m253k368M092L026l784l552L765L310k798l914K182M498j872
3456A609m724J369M735j094m362O4N081m88m189m17M499Q90m641j570M798J712
3472C272m496j748L808K672l577l605L572L845l241m239K470M813k501m199J352
3487a802M877j063m791K89N029K7m705n42M386J003m651j221M437J637m395j700
3503c185L896K691m021k904L828L260l505l932K830M536k395m788J621N081j024
3518A989n065O05N140j69n000o2M314P29m567p61M308J654l994k646M126K558
$$ plain form
3534 3159 -745 -3627 -76 3799 218 -3545 -753 3578 1212 -3766 -1655 3076 1792 -2958 -2271
3549 -2271 2882 2639 -2646 -3003 2111 2975 -1631 -2978 1411 3406 -1110 -3085 839 3676 -321 -3525
3565 -3525 405 3229 261 -3237 -378 3509 644 -3258 -1460 3451 1639 -3006 -1725 2978 2667
3580 2667 -2653 -2530 2487 3101 -1862 -3020 1584 3459 -1171 -3444 920 3526 -217 -3407 211
3595 211 3499 406 -3345 -769 3587 916 -3196 -1086 3623 1516 -3198 -2003 2843 2400 -2786
3610 -2786 -2895 2453 3027 -1965 -3472 1397 3275 -1278 -3732 625 3824 -360 -3585 118 3570
3625 3570 597 -3734 -684 3411 698 -3539 -1500 3127 1685 -3299 -2144 3240 2448 -2750 -2878
3640 -2878 2597 2997 -2318 -3195 1402 3357 -1424 -3414 717 3591 -535 -3889 -5 3634 66
$$ packed form
3534C159l904k882L551L875l581l763K792M331k366m978K111M731j284m750O87
3549b271N153k43n285l57N114Q64m606j347M389J995m516j975L924K837l997l204
3565c525L930K824k968l498K859L887k865l902J798M911j812m645J281M703l11
3580B667n320J23N017O14m963j158M604J875m630k273M364K606l743l190L618
3595B11L288l093l751K576M356k671m112K110M709k107m714J195M846m43n186
3610b786j09N348N74m992j507M869J878m553k454M357L199m184l225L703L452
3625C570k973m331L050M095k713m237K039M627j442m984J155N384p92n198j28
3640b878N475M00n315q77M597J955m781j990M131K874m126l354L884L639l568
$$ plain form
3655 66 -3525 -460 3486 985 -3659 -1287 3158 1508 -3348 -1740 2831 2388 -2836 -2553 2657 2629
3671 2629 -1889 -2890 1410 3151 -1324 -3606 1500 3642 -709 -3599 507 3566 588 -3594 -563
3686 -563 3236 1059 -3157 -1403 3298 1551 -2849 -1936 2884 2526 -2689 -2243 2662 2914 -2093 -2733
3702 -2733 1853 3377 -1578 -3472 990 3658 -586 -3500 351 3636 225 -3184 -629 3556 874
3717 874 -3267 -1079 3300 1400 -2863 -2031 2992 2557 -2476 -2323 2606 2622 -1897 -2571 1463 2986 -1265
3734 -1265 -3411 1213 3372 -522 -3642 88 3553 65 -3709 -178 3699 1194 -3425 -1509 3354
3749 3354 1752 -2785 -2084 2457 2376 -2527 -2581 2307 2465 -2149 -3014 1549 2983 -1630 -3503 1195 3173
3766 3173 -943 -3513 512 3265 -191 -3559 -597 3478 839 -3321 -1293 3249 1407 -3277 -2071
$$ packed form
3655F6l591L065L946k501m644K372M445j650m856J608M571m43n224K83N210k8
3671B629m518j001M300J741m475k282N106K142m351k890M106L059k978m182L031
3686e63L799k177m216J754M701j747m400R13M820l58n215M46M905K52n007o40
3702b733M586J524m955j894M462K668m244k914L851L285l411l409K555M185k682
3717H74m141K188M379j900m263Q32N023m35n033J53M929J6m519o74M034J523m251
3734a265k146M624K159l894l120L730L465l488l774L531L877k505m619J916M863
3749C354j602m537P01M541q1m903n4M888J58m614q65M563J434m613j873M698J978
3766C173m116k570M025K753l456l368K962M075k639m160K028M542j842m684J206
$$ plain form
3781 -2071 2592 2215 -2712 -2525 2409 2747 -1838 -2900 1579 2671 -1676 -3510 931 3153 -929 -3341
3797 -3341 356 3362 49 -3754 -97 3641 916 -3459 -1302 3453 1647 -3024 -1690 2697 2144
3812 2144 -2608 -2610 2487 2402 -1891 -2719 1835 2967 -1402 -2921 1082 3292 -673 -3180 380 3484
3828 3484 45 -3260 -380 3613 638 -3202 -858 3471 1506 -3233 -1257 3053 2283 -2849 -2096
3843 -2096 2447 2796 -1731 -2456 1870 3175 -1203 -2904 915 3212 -853 -2811 852 2986 -102
3858 -102 -2970 -437 3289 538 -3280 -595 3199 1095 -2881 -1576 2641 2126 -2977 -2138 2650 2759
3874 2759 -2226 -3274 1450 2882 -1644 -3110 939 3105 -754 -3287 218 3578 111 -3269 -333
3889 -333 3216 603 -3190 -930 3163 1023 -3062 -1815 2936 1684 -2774 -2211 2239 2360 -2108 -2569
$$ packed form
3781b071M663l77m927J87M934L38m585j062M479J092m347j834M441K222m082k412
3797c341L697L006l313l803L657L738k725m375K157M755j806m671J334M387n53
3812B144m752kN097q5m293q28M554J132m369j519M003K210l965k507L560L104
3828C484l439l305K880L993k975l840K344M329j965m739J976M310p70n132P53
3843b096M543L49m527p25M326J305m378j701L819K297m065j958L663K134l088
3858a02k868K533L726k751l818K685L794k104l976J305M217n15n103Q39M788J09
3874B759m985j048M724J432m526j466M049K166l859k533L505L360l467l380K936
3889c33L549k613l793K260M093k140m085J247M751j252m458N63M450J21m468m61
$$ plain form
3905 -2569 1775 2751 -1564 -3248 943 3281 -535 -3145 142 2765 -475 -3241 -513 3073 462
3920 462 -3055 -657 2831 1096 -2822 -1277 2482 1894 -2784 -2112 2403 2103 -2208 -2570 1957 2660
3936 2660 -1278 -2979 1228 3020 -389 -3037 575 3136 55 -3111 -29 3208 459 -2803 -726
3951 -726 2906 1112 -2640 -1454 2715 1510 -2173 -1837 2479 2223 -2089 -2327 1812 2795 -1609 -2651
3967 -2651 1489 2850 -1051 -2720 468 3170 229 -2886 -308 3151 901 -2703 -766 2903 1320
3982 1320 -2962 -1249 2586 1802 -2560 -1641 2111 2030 -1771 -2166 1662 2503 -1440 -2568 1233 2912
3998 2912 -886 -2788 673 2843 13 -3081 91 3169 371 -2982 -960 2729 954 -2471 -1346
4013 -1346 2541 1519 -2433 -1939 1819 2051 -2065 -2186 1644 2467 -1626 -2348 1272 2501 -1257 -2964
$$ packed form
3905b569M344R76m315j684M191K338l816k610L287K623l240k766K728L586k611
3920D62l517K398L488j735l918J545L759n88m678O72M515l00m311l62M527P03
3936B660l938j701M207J792l409k648L612K561l081l166L082L237k749l262K077
3951g26L632j794l752J186M169j205l683L36M316k56m312k38M139R83m404j042
3967b651M140J361l901j669L188K702k941l115K578L459k250l604J937L669j583
3982A320m282J713L835p84m362R19L752q1l801l95L828Q41l943j128L801J679
3998B912l798j902L461K170k830l094L172L078k798l353K022L689j775l425J125
4013a346L887j022l952M94L758K32m116j21L830Q23m093p22L620J229l758j707
$$ plain form
4029 -2964 377 2676 5 -2604 -22 2732 244 -2999 -821 2596 724 -2909 -1502 2508 1569
4044 1569 -2216 -1375 1919 1903 -1637 -2137 1335 2319 -1211 -2382 942 2696 -795 -2445 549 2683
4060 2683 -194 -2811 44 2748 243 -2777 -472 2699 873 -2482 -1123 2380 1590 -2061 -1752
4075 -1752 2153 1742 -1779 -2170 1596 2341 -1294 -2420 1187 2411 -1057 -2347 663 2545 -313 -2525
4091 -2525 105 2665 304 -2623 -779 2649 547 -2315 -1208 2297 1440 -2156 -1710 2140 1874 -1621
4107 -1621 -1992 1478 2284 -1177 -2104 1095 2288 -752 -2480 736 2627 -201 -2351 48 2708 225
4123 225 -2409 -664 2469 837 -2219 -1087 2188 1240 -2241 -1550 1958 1770 -1946 -2042 1490 1978 -1545
4140 -1545 -2267 942 2134 -894 -2405 507 2357 -365 -2387 -98 2590 -30 -2163 -292 2200
$$ packed form
4029b964L341K299k671k609K582K754k488l243K178L417j872l633J407M010r39
4044A569l785Q41L294j6l540n00L472R84l530j171L324J754l491j650K994K134
4060B683k877k617K855K704k505l020K305L171j826l355J359L503p90l651L09
4075a752L905m11l521l91L766P45l635j126L607J224l468j290L010J882k858k212
4091b525K630K560k361k927J844L428k102k862J107L505q57l596M46L850k66l495
4107a621l71L470Q06l461r27L199J193l040j728L216J891k828k150K399K660k483
4123B25k634J745L133j632l056J132L275r48l481O91L508j88l716r6L532M88l523
4140a545p22L209J192l028j511K912J850k722k022K289K688k620k133J871K492
$$ plain form
4155 2200 330 -2341 -1021 2162 1198 -2034 -1362 1520 1516 -1839 -1763 1234 2029 -1349 -2287 1055 1977
4172 1977 -879 -2170 638 2097 -238 -2351 284 2048 1 -2373 -435 2191 762 -2261 -891
4187 -891 2136 914 -1688 -1314 1718 1523 -1446 -1909 1510 1714 -1494 -1883 1294 2239 -738 -1928 538
4204 538 1919 -424 -2168 96 1888 -136 -2213 -91 2189 489 -1877 -494 1993 1046 -1909
4219 -1909 -1192 1798 1521 -1646 -1614 1659 1789 -1123 -1721 1145 1956 -850 -2196 661 2207 -285 -1835
4236 -1835 263 2161 281 -1908 -386 1998 609 -1912 -745 1697 1134 -1692 -1066 1652 1266 -1308
4252 -1308 -1359 1202 1378 -992 -1776 1110 2013 -795 -1734 625 1788 -580 -2177 36 2100 -266
4268 -266 -1612 -556 1649 418 -1869 -805 1512 688 -1711 -1104 1696 1055 -1682 -1414 1393 1429 -1035
$$ packed form
4155B200j870k671J320L183r64l232O72K882ml355P6K997P95l378r38L342R22
4172A977k856j291K808J459k335k113K635J764k047k374J938K626j429l023J370
4187h91L027j222k602L74L032j95k969m63L419K04l208l89L177R45k977j190K466
4204E38J381k343j744K264J792k024k077K122K280j700k366J383K487r47k955
4219a909P17K990k77l167L2L273J30k912n98K866Q11k806j346K857J546k492j550
4236a835K098J898j880k189J522K384j389k521J167K442n63k826O26K718l86k574
4252a308n1K561J76k370p84K886R03k808r39K359J163k368j597K213K064k366
4268b66j346J056K205j231k287J064K317q24k399O07K800o41k737K68K807L6k464
$$ plain form
4285 -1035 -1586 878 1675 -863 -1771 369 1874 -420 -1985 70 1887 -163 -1803 -257 1458 452
4301 452 -1908 -662 1692 655 -1650 -996 1377 1021 -1427 -1380 1367 1496 -1292 -1408 1094 1400 -597
4318 -597 -1811 400 1691 -544 -1682 130 1609 235 -1869 18 1668 682 -1704 -626 1716
4333 1716 855 -1421 -813 1545 1084 -977 -969 1108 1382 -1111 -1281 605 1373 -395 -1384 309 1709
4350 1709 -319 -1458 248 1720 157 -1435 -207 1471 483 -1272 -657 1389 985 -1391 -679 1393
4366 1393 678 -1051 -990 1234 1504 -849 -1239 662 1286 -329 -1211 282 1670 -87 -1279 97 1423
4383 1423 169 -1210 -155 1603 454 -1375 -609 1547 439 -1460 -666 1106 1064 -1188 -1004 911
4399 911 796 -655 -1165 609 1569 -581 -1288 444 1528 -405 -1729 60 1207 -83 -1698 -386
$$ packed form
4285a035n51K464P97k538r08K140J505k294j565K055J817k050j640J546J715j006
4301D52k360J246K354j037k305O54K373l56k448M7K747J29k788j16K502L06j997
4318e97j214K211J291k235j138J812J479j374k104J887J650r86k386J078K342
4333A716q61k276O08K358m61k061QK077K74k493j70J886P68j768r89J693J400
4350A709k028j139J706J472j563j592J228J678r88j755O15K046m04k376P12K072
4366A393p15j729O1K224K70k353l90J901O24j615q82J493J388j757j192J376J326
4383A423j254j379J055J758j149j829P66K156j108j899P94J772m2k252J84J915
4399I11j15j451n10J774R60k150p07J732J084j933j324J789J147j290j615J312
$$ plain form
4415 -386 1145 272 -1218 -539 1075 677 -1039 -454 1090 546 -1127 -777 1122 790 -770 -1170 393
4432 393 1354 -592 -875 421 1285 -289 -1278 442 1080 -56 -1281 -262 1150 548 -1282 -368 1331
4449 1331 491 -1146 -976 1072 925 -665 -1085 968 802 -679 -823 463 1076 -401 -1033 478 1380
4466 1380 -156 -1212 -126 1473 166 -912 -219 1199 334 -947 -486 1044 450 -685 -786 838
4482 838 778 -450 -704 923 851 -674 -856 528 1016 -177 -1188 88 1164 -432 -926 -6 928 -16
4500 -16 -1226 -123 1005 300 -914 -271 848 557 -904 -755 725 489 -572 -452 493 620 -526
4517 -526 -658 273 954 -493 -647 437 640 -287 -953 229 856 -40 -1173 -95 1000 -127 -849 -629
4535 -629 789 642 -612 -601 781 519 -527 -866 396 872 -231 -622 385 708 -181 -663 65 570
$$ packed form
4415c86J531q73j490O79J614l98j716N85J544n44j673L50J899l32j560m00J563
4432C93R61j946k83J296Q64j574r89J720O38j136j225J019J412o02j830R14J699
4449A331q40j637J70K048j47j590m20K053j66j481j44J286O13j477o32J511R02
4466A380j536j056J086J599j307j078O93J418q65j281M61J530n94j135j01J624
4482H38o0j228k54J627p2j525j82J384M88j193j011J276J076j596m94R20R34r44
4500a6j210J103J128p05j214O43J119k91j461J49J480k36j061J20R45J27j146
4517e26j32R31O81j447j54J084K03r27o66J182O27q96j133J078J095j127p22K20
4535f29J418j47j254J1J382k62j046l39J262M76j103l91J007L23q89m82P28N05
$$ plain form
4553 570 -19 -778 -380 620 -117 -786 -250 807 230 -783 -432 625 225 -725 -367 673 763 -562
4571 -562 -790 329 616 -452 -363 377 463 -407 -468 26 758 9 -566 -124 513 -58 -947 258 412 165
4591 165 -532 -101 472 94 -386 45 657 390 -278 -515 495 663 -163 -237 417 481 -272 -857 49 732
4611 732 9 -210 32 412 471 -140 270 724 194 -506 24 395 453 -395 -173 317 363 -252 -433 550 540
4632 540 -245 -246 89 482 -81 -314 258 293 10 -298 -150 399 197 -785 -359 317 32 -696 -359 267 -146
4653 -146 -394 -298 375 510 -419 -418 374 445 -176 -406 9 243 -185 -502 -204 235 228 -366 -33 -73 421 -379
4675 -379 -17 404 392 -490 -379 239 638 -331 -236 303 282 -16 -313 298 34 -201 -401 458 374 -189 -339
4696 -339 -40 75 -166 -220 155 133 210 -523 -299 173 176 -347 -205 -38 213 -23 -327 46 -62 65 -302 -96
$$ packed form
4553E70n89p59L98J000p37o69N36J057n77j013L51J057m00r50L58J040R0j325
4571e62k28J119K87j068Q9P40Q6q70o1M94P32p49n75M42O37n71q89J205J54k47
4591A65o97M31N73l78m80M31O12k67o68k37J010J68q26p4O54O4p53n85R06O83
4611G32p23k19K42L80N9o11M10M54n30p00N30L71N8q48K22M90M6o15j81R83j0
4632E40p85jL35L93n63k33N72L5k83l08J48N49k02r82M26O76k85p28L37O26m13
4653a46k48R6O73J35r29JP92P1o21k30M15K34m28l17K98M39pn94L33m0M94q00
4675c79L62M21j2q82J11O18L99r69R5N39k1k98k97O11k64k35k00Q59q4n63j50
4696c39K99J15k41n4L75k2P7p33K24M72Ln23J42J67K51k36l04L73j08J27l67K06
$$ plain form
4718 -96 106 55 -130 -63 297 31 -210 125 379 78 -70 92 318 433 -136 -123 212 97 -101 -170 17 120
4740 120 -253 -387 96 231 217 -204 66 213 215 -137 -37 240 76 129 82 -117 -81 142 81 188 80 -195
4762 -195 225 97 -20 -95 -72 307 261 194 -343 35 97 29 -249 -106 -233 310 -63 -522 -165 97 15 -255
4784 -255 -95 4 158 -111 -92 59 -262 -273 92 -13 33 -100 -214 134 130 3 -134 -22 372 -108 -292 34
4806 34 148 -236 -396 20 334 53 -292 -277 152 51 75 -423 73 264 -187 -218 30 27 17 -377 32 129 -139
4829 -139 -178 -265 44 62 120 54 194 33 -307 -320 -62 -26 -301 -117 242 252 -195 -189 -13 497 -97 -402 389
4852 389 269 -34 -484 -14 273 126 -337 -126 275 498 -286 -123 230 399 -181 -47 12 30 -109 -250 292
4873 292 382 -64 -258 453 505 57 -165 15 387 -294 -436 -94 -4 156 -261 -258 570 287 -487 43 357 480
$$ packed form
4718i6K02n1j85O7L60k66k41L35K54l01j48J62K26J15n69J3L35j15j98o9J87J03
4740A20l73j34M83J35j4m21K70J47Kl52J00K77j64N3m7j99L6K23o1J07j08k75
4762a95M20j28j17p5K3L79m6o7n37L78O2o8k78J43j27N43l73m59L57K62q2k70
4784b55J60R9J54k69J9J51l21j1L65j05M6j33j14L48mj27j37J12L94m80j84L26
4806C4J14l84j60M16L14k81l45J5M29j01K4m98M96J91m51l1K48lj0l94M09R7k68
4829a39l9q7L09J8N8o6J40j61l40j3K58L6k75J84L59J0m47OJ76N10n94l05P91
4852C89j20l03m50M70K87j47m63K11M01K23p84J63L53J69n80J34N9J8j39j41N42
4873B92R0m46j94P11N2m48k22J80L72o81j42L42R0J60m17LQ28k83p74N30L14J23
$$ plain form
4895 480 -40 -142 515 283 -453 -399 13 387 -122 -236 70 509 -151 -727 327 558 -136 -635 -127 785
4915 785 208 -513 -209 522 323 -662 -307 508 341 -616 -239 -195 86 -515 -380 148 377 -365 -406 214 384
4936 384 -46 -449 27 423 -272 -822 -138 617 -47 -476 -327 811 266 -588 -334 196 628 -543 -476 358
4956 358 370 -526 -296 232 336 -181 -637 343 579 24 -881 219 881 39 -399 -105 707 88 -872 -198
4976 -198 564 223 -597 -395 507 516 -374 -280 124 481 93 -532 86 688 11 -470 418 569 -299 -417 354
4997 354 597 -90 -499 128 954 125 -725 54 771 377 -850 -409 708 581 -468 -456 622 517 -574
5016 -574 -711 453 951 -199 -513 328 605 -300 -722 79 866 -15 -777 -19 728 176 -676 83 604
5035 604 337 -919 -297 618 352 -501 -664 296 741 -712 -1026 336 892 -419 -647 340 796 -210
$$ packed form
4895D80n20j02O57k32p36N4M12L74n09j14L06M39o60n76J054K31o94m99N08R12
4915G85n77p21L04P31j99r85L55Q15j67r57L77M4K81o01J35N28K29p42m1O20J70
4936C84m30m03M76L96o95n50O84P55o64m29J49J138n45q54K54N30M32j171O7Q34
4956C58J2q96K30N28J04n17m56R80K36n55r05J100O62q42m38K94Q12o19r60O74
4976a98P62l41q20K02R02Rq90R4M04L57l88o25O18O02o77m81Q88J51q68j18P71
4997C54K43o87m09O27Q26q29q50P79P17l94j227M41J117j27j049J2J078j05j091
5016e74j37J164M98j150l14Q41K77r05m22Q01P87q81p62P58P47n52q52P59N21
5035F04k67j256O22R15k66q53j63R60M45j453l14J362N56j311k28R87M56j006
$$ plain form
5053 -210 -1187 -103 535 -17 -951 -1 673 8 -742 -99 689 454 -925 -542 681 584 -1060 -689 747
5072 747 639 -612 -920 482 913 -674 -562 364 899 -205 -1052 -127 767 -6 -834 -18 816 104 -630
5091 -630 -291 1014 337 -741 -487 1033 318 -687 -482 499 792 -754 -944 502 926 -575 -935 649
5109 649 921 -52 -910 325 1120 86 -655 -116 759 20 -1089 -45 757 490 -576 -409 788 564
5127 564 -603 -622 942 684 -712 -756 849 903 -287 -875 614 1237 -350 -1138 -156 946 -268 -931
5145 -931 -367 761 279 -1170 -569 826 260 -1070 -429 970 500 -730 -552 657 747 -1050 -867 229
5163 229 831 -391 -1019 343 1136 -517 -1327 95 988 -83 -1110 -68 930 180 -1228 -139 892
5180 892 566 -1038 -718 846 284 -629 -712 422 937 -727 -828 387 738 -257 -1138 400 793 -438
$$ packed form
5053b10r77J084O38n52r34R50O74o65p50O43P88k35j379L83J223r7j644L71J436
5072G47j08j251l08J402M31j587J12R26N35j104q47R25Q94p73q28Q16Q34p12p34
5091f30L39J305o77j078K54J520p15j005K05R81K93j546j90J446M24j501l60J584
5109F49K72r73q58J235P95j034p41N39Q75p39j109J044Q02k67j066J67J197k24
5127E64j167j9J564k58j396m4J605N4j190n88J489O23j587p88R82J102j214o63
5145i31N64J128m82j449O01J395n66j330O41J399m70j230J78J209R0j797J83J096
5163B29O02j222o28J362P93j653q10J422Q93j071j027J042R98p50j408J089J031
5180H92l26j604L20J564n62r13q3J134N15j664j01J215L51r95q81J538L93j231
$$ plain form
5198 -438 -780 302 1330 -132 -1448 -65 1136 190 -1045 -618 1230 891 -1156 -403 834 729 -928
5215 -928 -830 740 982 -456 -744 619 978 -445 -714 409 1030 -241 -1217 155 1183 -205 -1186
5232 -1186 154 1314 105 -1084 -299 1321 571 -966 -490 1029 818 -872 -666 778 974 -774
5248 -774 -795 643 910 -342 -848 460 1214 -503 -627 513 1124 -253 -1138 52 1261 408 -1393
5265 -1393 2 1199 256 -848 -619 926 924 -1050 -1078 763 958 -730 -1115 784 1511 -263 -1350
5282 -1350 100 1015 18 -1138 -22 885 -97 -1363 -94 996 101 -1219 -241 1498 409 -1329
5298 -1329 -644 1297 467 -1065 -1207 745 1098 -1028 -1027 539 1208 -692 -1174 240 891 -383 -1369 221
5316 221 983 -304 -919 -22 1346 212 -1404 -18 1307 335 -1230 -472 1103 541 -1274 -1097 719
$$ packed form
5198d38l42J082J028j462j316J383J201r46j235M27J848l39k047P53J237j05j657
5215i28R8J570K42j438k88J363L59j423k69J123O21j271r76J372J028j388r81
5232a186J340J160j209j189P85J620p50j537M76J519k11j690K06J444J96j748
5248g74k1J438K67j252n06J308P54j717j24J140O11j377q85J190J209q53j801
5265a393J395J197r43j104K29J545kj974k8J841J95j688l85J899P27j774j087
5282a350J450R15r97j156J116R07r82j266J269J090q95j320R78J739j089j738
5298a329O85J941q30j532j42J952L53k126JJ566O69j900m82J414O51j274r86J590
5316B21P62j287o15Q97J368j134j616J386J325r72j565P58J575n62j815J77J816
$$ plain form
5333 719 848 -780 -1223 470 1136 -563 -1198 487 1349 -100 -1493 113 1190 406 -1294 87 1006
5350 1006 325 -1145 -384 1360 488 -1184 -265 1170 755 -1063 -1016 1451 901 -1061 -915 842 1230
5367 1230 -280 -1110 674 1400 -342 -1294 34 993 233 -1485 166 1301 509 -1137 -175 1368 674
5384 674 -801 -423 1122 586 -977 -652 1006 950 -1021 -1147 780 1083 -535 -1311 415 1512 -309
5401 -309 -1580 250 1297 36 -1250 -368 1123 306 -1461 -640 1355 430 -1241 -478 979 558 -1048
5418 -1048 -956 879 1153 -920 -1128 755 841 -366 -1267 509 1150 -444 -1531 155 1288 -146 -1514
5435 -1514 -296 1574 208 -1142 -433 1169 626 -1272 -664 941 739 -1072 -880 739 766 -1124 -895
5452 -895 747 928 -579 -1004 535 1158 -567 -1276 627 1424 -328 -1138 -191 1534 201 -1009 -425
$$ packed form
5333G19J29j628m43J693O66j699o35J685Q62j449j393J606J077p84j700J381R19
5350A006o81j470P61J744q72j672R19J435m15j818M7K467n50j962J46J757L88
5367A230j510q30J784P26j742r52J328R59p60j718J651J135p92j646R62J543o94
5384F74j475L78J545n36j563L25J658n6j971j26J927L03j618p76J726J097j821
5401c09j271J830J047j261j286Q82J491q17j767Q21J995r25j671P63J457m21j606
5418a048R2J835K74k073k08J883Q6j207r01J776O41j594j087J686J133j434j368
5435a514J218J870j366j350P09J602n43j898O08J605k02j811J92J619K7j890K29
5452h95J642J81j507m25J539O23j725p09J903P97j752q10R47J725j333j210N84
$$ plain form
5469 -425 1146 527 -1248 -592 1104 1060 -1113 -746 1041 676 -658 -1053 548 1300 -649 -1426 655
5486 655 1346 -223 -1217 416 1237 -168 -1464 320 1269 379 -1437 -422 1237 985 -1454 -473 1252
5503 1252 985 -660 -784 848 1072 -726 -865 733 1140 -381 -1406 383 889 -107 -1168 371 1481
5520 1481 -204 -1073 180 1428 -43 -1497 -314 1448 412 -1331 -802 1179 1121 -1073 -934 969
5536 969 1200 -968 -1166 739 1155 -974 -1195 490 1632 -305 -1151 65 1401 -42 -1395 -325
5552 -325 1128 134 -1217 -410 1358 368 -1224 -916 1107 809 -1263 -973 1065 1086 -977 -1165 464
5569 464 937 -561 -1409 419 1242 -677 -1326 14 1136 -153 -1250 -136 1299 201 -1238 -463
5585 -463 786 275 -1090 -564 1142 776 -1145 -994 1441 1121 -1094 -1019 589 1214 -830 -1053 412
$$ packed form
5469d25J571o19j775O56J696m4k173L67J787l65j334l95J601P52j949p77K081
5486F55O91j569r94J633Q21j405j296J784R49q90j816J015J659k52k439R81J725
5503A252k67j645j24J632K24j798j39J598M07j521j025J789N06r96j061J539J110
5520A481j685q69J253J248j471j454J183J762j036j743N29J981n8k194J39J903
5536I69K31k168j98J905M16k129k21J685J142j937q46J216J336j443j353J070
5552c25J453r94j351Q07J768r90j592L08K023k98k072K90K038K1k063j88J629
5569D64M73j498q48J828Q23j919o49J340J122j289j097J114J435j098j439P75
5585d63J249n11j365N26J706l66j921J51K435l20k215P5J608O25k044k23J465
$$ plain form
5602 412 1330 -576 -1373 -1 1506 -20 -1460 -63 1454 178 -1158 -320 1334 479 -923 -555
5618 -555 1099 854 -1303 -715 1006 1391 -811 -1020 902 1139 -707 -1272 326 1622 129 -1467 51
5635 51 1410 64 -1290 -60 1454 517 -1191 -476 1197 457 -998 -649 1144 669 -1228 -531 862
5652 862 970 -955 -1153 872 706 -701 -1168 663 1454 -101 -1276 124 1238 -124 -1381 -344
5668 -344 1413 270 -981 -203 1354 565 -1131 -629 1036 709 -1030 -790 1102 753 -915 -962 775
5685 775 951 -734 -1294 307 962 -541 -1306 83 1325 -52 -1250 -18 945 21 -1465 -415 1217
5702 1217 676 -1024 -420 1009 620 -1242 -1030 781 729 -1012 -947 667 1002 -569 -991 699 1090 -270
5720 -270 -1470 287 1353 -343 -1458 -400 1334 783 -1458 -221 1256 560 -1167 -576 1014 805
$$ packed form
5602D12R18j906p97J372J507j526j440J397J517j276j336Q38J654q55j402L68
5618e55J654k45k157N88J721L85k202k09J922K37j846n65J598J296j493j596J518
5635E1J359j346j354J230J514r37j708P15J673p40j455L49J793m75j897O97J393
5652H62J08j925j98K025j66j407m67J831P91j555j175J400J114j362j257J037
5668c44J757j143j251P78J557p89j696N02J665l27j739K40J892l49j668m7J737
5685G75J76j685n60J601O55j503p65J389J242j377j198J232R63r24j486J050J632
5702A217n41j700O04J429l89j862K12J811n2j741O5J614L35j571m22J690L91j360
5720b70j200J757J066j696j115J058J734n51k241J237J477o96j727N91J590k09
$$ plain form
5736 805 -1063 -1012 972 980 -762 -1058 770 1246 -499 -1335 356 1207 -40 -1289 113 1554 -173
5753 -173 -1436 120 1228 29 -1225 -406 1297 661 -1027 -280 947 743 -938 -852 852 975 -1084
5770 -1084 -1053 656 1347 -314 -1119 574 1081 -285 -1009 114 1107 26 -1222 -24 1378 185 -1357
5787 -1357 -586 1240 470 -1201 -842 852 678 -1078 -947 713 806 -918 -1132 821 1400 -617 -1029
5804 -1029 696 1384 -703 -1419 279 1055 -127 -1507 -27 1176 -65 -1183 -302 1030 451 -1415
5820 -1415 -636 1059 826 -1154 -772 746 997 -797 -1079 709 1146 -586 -1353 270 1314 -561 -1212
5837 -1212 214 860 -29 -1097 -160 1210 492 -1262 -468 1210 655 -1189 -634 765 652 -1160 -359
5854 -359 944 833 -827 -929 625 1349 -427 -922 484 1219 -176 -1290 182 1223 -21 -1321
$$ packed form
5736H05j868N1J984Qj742k96J828M76j745q36J691Q51j247j249J402J441j727
5753a73j263J556J108j199j254Q19J703o36j688P47J227k04j681Q6J704J23k059
5770a084L1J709O91j661q05J693N07j366p24J123R93j081j248J198J402j193j542
5787a357P71J826p70j671L59J694j74j756J31J660R3j724k14J953N79k017m12
5804a029J725O88k087p16J698P76j182j380J480J203j241j118Q81J332n79j866
5820a415P79J695k33j980L82J518K51j794k82J788M37j732p67J623J044j875o51
5837a212J426O46q89j068R37J370p18j754P94J678n55j844N55J399j13j812Q01
5854c59J303j11j660j02J554P24j776m95J406P35j395j114J472J041j244j300
$$ plain form
5870 -1321 47 1146 499 -1193 -265 864 548 -960 -481 990 802 -1040 -541 1014 1055 -802 -973
5887 -973 794 1047 -339 -1104 852 1339 -117 -1395 362 1272 87 -1040 -31 941 187 -1092 -231
5904 -231 1190 519 -1208 -484 990 546 -866 -506 817 647 -514 -714 691 854 -372 -1134 338
5921 338 1285 -420 -925 211 1140 -141 -1206 -383 1200 315 -1179 -557 1182 716 -1130 -519 615
5938 615 483 -830 -609 691 584 -799 -1352 418 989 -618 -1011 170 855 -1 -1219 -306 711
5955 711 -149 -1136 59 1074 105 -1232 -374 901 479 -1061 -618 975 711 -942 -861 891 593 -716
5973 -716 -830 828 1089 -388 -952 209 1284 -261 -859 500 934 20 -1069 -106 1291 -42 -1115
5990 -1115 -262 1191 364 -1149 -508 832 797 -766 -683 692 768 -902 -935 783 917 -557 -848 557
$$ packed form
5870a321J368J099o47j692R28J129l16j508M79J471j88j842M99J555M1j857j71
5887i73J767K53j386p65J956M87j456j278J757R10j185j127J009R72p54j279Q61
5904b31J421o71j727P24J474m44j412L60J323j70j161k00J405J63j226p62J472
5921C38R47j705n05J136R29j281j065Q23J583q85j494O22J739m66j846O11J134
5938F15j32j313K21J300j07j383n53J770N71j607l93J181O85q56j218R13J017
5955G11q60r87J195J015r69j337Q58J275m22j540M43J593k64j653Q1J752k98j309
5973g16j14J658K61j477n64J161J075j545n98J359M34r14j089R63J397j333j073
5990a115Q53J453q27j513O41J340l5j563Q3J375P6j670l3J718J34j474k91J405
$$ plain form
6008 557 826 -61 -1013 279 991 -274 -1375 -261 1102 436 -915 -341 1036 542 -715 -668 1083
6025 1083 962 -607 -719 761 654 -532 -787 676 539 -483 -658 447 995 -189 -921 229 941
6042 941 -144 -934 -189 1257 24 -1165 -482 789 379 -1140 -415 886 786 -1029 -809 830 267
6059 267 -565 -1049 284 766 -495 -621 427 992 -423 -1133 58 819 -303 -927 -121 836 6 -1129
6077 -1129 -161 1017 453 -511 -717 651 771 -577 -867 451 564 -493 -848 316 727 -392 -834
6094 -834 459 811 -370 -983 -84 651 -1 -1256 5 1274 101 -892 -456 509 309 -834 -780 846
6112 846 547 -649 -858 665 757 -352 -832 387 1064 -416 -852 175 959 -135 -762 -79 746 -254
6130 -254 -785 -251 974 194 -889 -100 872 330 -1040 -435 851 536 -485 -565 639 530 -169 -472
$$ packed form
6008E57K69q87r52J292P12j265j101J114J363o66j351N74J377m94j257M7J751
6025A083j21j569j12J480j07j186k55J463j37j022j75J105N48j184p32J150P12
6042I41j085p90P45J446j233j189O83J271m10j519P25J301j00j815K20J639n63
6059B67q32m84J333M82j261j26J048N65j415p10J191P61j122o24Q06R57q30j135
6077a129R68J178n64r64k06J368J20j348k90J318J13j057l55J164M11j119m42
6094h34J293L52j181o13Q99P35o52j255J261J269j173r93M36R65k00j143N4J626
6112H46k99j196k09J523R2j109m80J219O77j480m36J027P84j094o27O83Q25j000
6130b54n31N34J225p80j083P89R72n42j370O05J286l15j021q0J204j09o99l03
$$ plain form
6148 -472 475 910 -525 -523 380 798 -263 -798 151 868 127 -864 -388 736 157 -929 -291 971 395
6167 395 -752 -392 867 318 -813 -587 601 704 -316 -598 252 734 -228 -634 8 691 -118 -963
6185 -963 163 692 396 -808 -370 1000 280 -886 -309 750 63 -869 -560 538 495 -542 -615 563
6203 563 808 -366 -642 219 570 -514 -829 65 502 -315 -656 -63 758 62 -709 -331 712 254 -890
6222 -890 -421 460 608 -915 -94 388 721 -909 -678 705 807 -378 -718 300 503 -172 -809 217
6240 217 824 -47 -787 99 667 -145 -589 -31 600 196 -545 -66 738 491 -465 -207 725 493 -427 -436 253
6261 253 348 -438 -374 311 485 -26 -446 141 1052 380 -586 243 336 489 -457 -126 309 26 -577 63 575
6282 575 564 -472 -242 804 496 -297 -376 480 530 -389 -581 602 615 -176 -600 -114 775 102 -779 71
$$ packed form
6148d72R47M35j435KR03M18j061n35R49P17p41r91M76J124n79j086O38J262n76
6167C95j147L60J259n49j131K26J188J03j020k82Q50M82r62m06O42O83q09q45
6185i63J126N29k96j204M38J370p20j166N77J059o87r32L09J098m3j037p3J178
6203E63K45j174k76Q61L51j084l15Q94M37q17l41N93Q21o96p71L78J043m58j144
6222h90M69Q81J48j523Q21M82L33j630K31J383J02j185l40J018K03o75o37J026
6240B17O07q71p40Q86N68q12m44N58O31m04p41M79Q04k47r56K58R32k32r20rO89
6261B53R5p86O4O85J74n11m20N87R11o72r66Q29R3J53r46L31M35k83o03O40N12
6282E75j1j036K30J046l08p93p9Q56N0r19j92J183J3p91m24M86Q89o73q81Q50
$$ plain form
6302 71 665 -69 -691 133 439 491 -413 -425 417 152 -548 -313 410 433 -387 -501 70 415 -421 -413 329 633
6324 633 -302 -719 187 480 -99 -565 81 536 -64 -679 -180 590 277 -366 -414 553 -28 -497 -651 135
6344 135 364 -530 -500 381 109 -265 -479 5 632 -323 -822 371 745 -248 -746 -70 629 293 -546 -217
6364 -217 694 242 -453 -489 35 415 -316 -366 450 86 -314 -230 293 486 -166 -613 16 248 -141 -332 409
6385 409 259 419 -542 77 477 -191 -330 16 532 434 -609 -366 549 122 4 -387 330 518 -189 -182 157
6406 157 508 -117 -557 123 699 -340 -632 104 514 134 -283 306 430 -41 -552 -385 340 120 -652 -158
6426 -158 440 261 -423 -618 104 612 -259 -302 -29 331 -288 -221 -21 200 -169 -582 -414 202 192 -407 -132
6447 -132 189 72 -515 68 232 377 -332 -399 443 246 -471 -512 472 467 -353 -690 282 218 -510 -77 25 398
$$ packed form
6302G1N94p34o22Q24L06N2r04j2Q42k65p00K35P23K3q20j14N71L45q36QP42L04
6324F33r35m17R06K93n79m66O46M55o00o15M99P70l13o43m8R67n81m69j54P86
6344A35K29q94L0Q81k72l74k14M84O27r55m99J193L74r93m98O76O99l36q39L29
6364b17R11m52o95l6N24L80p31n0Q16l64m00Q4N23J93o52m47O29K32l89j91P41
6385D09j50J60r61O19M00o68j39L46N16r8j043K43R15m27j18l91P17J88p07PL39
6406A57L51o25m40O80N76j039k92P36M10l80m17N89J24m71n11J67P25k20p72M94
6426a58N98j79o84j95P22N08q71m3K73L60o19O7K00K21l69m13J68O16j0n99K75
6447a32L21j17n87N83J64J45p09o7Q42j97p17m1R84nq20l37R72o4p28M33J02L73
$$ plain form
6469 398 241 -426 -215 92 87 -258 -362 105 22 -346 -68 246 269 -368 -407 342 265 -437 -338 128 453 -400
6491 -400 -348 148 364 59 -517 -122 263 146 -536 -414 436 322 -66 -265 685 188 -500 -178 238 413
6511 413 -273 -236 218 173 -267 74 442 321 -286 -383 10 229 409 -217 5 395 183 -482 -68 303 366
6532 366 -248 -213 235 249 -181 -161 266 49 -183 -248 47 421 -32 -387 171 52 -88 161 9 254 150
6553 150 -173 0 260 55 -192 -70 454 109 -322 -57 -18 8 -402 -51 62 140 -24 77 96 276 -106
6574 -106 -139 39 409 -268 20 204 134 -98 -199 37 -24 -102 -19 -43 340 294 2 27 176 325 -128 4 77
6597 77 173 -178 -279 129 62 -154 -371 141 175 13 -33 -156 -28 -44 -404 -75 85 196 81 91 175 143 -291
6620 -291 -25 -20 141 -59 56 -61 433 -271 -310 -59 520 70 -267 120 462 -255 -334 -102 137 -4 -149
$$ packed form
6469C98j57o67K11L07nl45j04M67q3l68K78L14K3o37l9P49p7p02R9M66L25q53
6491d00N2M96K16l05n76L95L85j17o82J22Q50j14l88j99R50m97o88L22M16J75
6511D13o86L7M54m5m40L41L68j21o07r7L93K19J80o26K22L90k12o65M14L71O3
6532C66o14L5M48J4m30K0M27k17k32o5K95L74m53l55N58j19j40K49j52K45j04
6553A50l23J73K60k05k47J22N24l45m31K65L9K6m10L51J13P8j64J01J9J80l82
6574a06l3J78L70o77K88J84p0k32j01K36o1p8Q3k4L83m6k92K5J49J49m53J32P3
6597G7R6l51j01M08o7k16k17N12L4j62m6j23J28j6l60L29J60J11j15J0Q4l2m34
6620b91K66NJ61k00J15j17M94p04l9K51N79m50l37L87L42p17p9K32K39j41j45
$$ plain form
6641 -149 -140 62 141 -199 -264 164 173 115 13 221 -14 278 -150 117 382 -31 -283 28 212 267 -311 -25 413
6664 413 53 -306 -16 315 -69 254 -68 272 326 144 -277 -73 105 -2 -177 79 195 -14 -219 166
6684 166 165 -131 -33 -45 297 65 -225 -87 599 225 -102 -232 254 671 -207 -289 276 71 45 -267 285 252
6706 252 -138 -562 127 152 -298 -113 -49 193 -100 -224 -347 -59 -5 -525 -66 486 322 -343 -224 222 266
6727 266 -273 -598 147 98 -479 -468 127 319 -76 -563 -84 316 189 14 -25 174 343 -330 -123 271 -49
6748 -49 -277 -136 135 -140 -213 42 -4 -166 -480 -101 -98 260 -224 -54 88 402 -125 -169 50 344 430 -213
6770 -213 -164 578 295 -202 -36 -332 313 -7 74 -44 164 -285 -210 46 185 -91 -294 243 322 -155 -210 279
6792 279 256 -32 -387 68 614 172 -165 -183 196 67 -224 -141 102 6 27 -337 172 387 78 -210 -11 481
$$ packed form
6641a49RK02P9l40o5M28Rn8j02K08k35K92m28K67K65m13k52L11J84N5n78K86M38
6664D13l60l59K90L31l84L23l22L40N4j82m21K04J78j07j75K56J16k09k05L85
6684A66jk96R8j2L42k32k90J38O86l74l27j30M86M17q78q2N65k05k6l12N52l3
6706B52l90m24O89K5m50J85O4K42k93j24j23K88N4n20M59N52j64o65J19M46M4
6727B66n39l25P45m9n77J1N95J92l95m87M79M00j27j75l9J99J69o73K07L94l20
6748d9k28J41K71k75p3K55m6j62l14L79LL58m84J70J42L14n27m4K19K94Q6o43
6770b13M9P42k83m97J66k96O45l20Q1j18K08m49P5K56J39k76k03N37P9m77n5M89
6792B79k3k88l55M55N46m42l37j8L79j29k91Q3K43r6K1l64N09K15l09k88J99M92
$$ plain form
6814 481 70 -244 11 572 57 -242 -98 583 -24 -499 -258 481 144 -165 -10 455 427 -54 -247 375
6834 375 340 -150 -394 149 326 39 -479 92 239 -127 -573 -116 55 -249 -197 286 304 -180 -280 -14 395
6855 395 199 -316 -222 117 235 -251 -353 141 365 -297 -280 136 249 -55 -586 81 252 294 -415 -430 177
6876 177 202 -397 -266 455 260 -328 -96 67 39 -46 -487 339 169 -378 -363 317 297 -289 -213 103 448 -96
6898 -96 -673 -121 533 -185 -380 146 22 141 -369 -46 474 -18 14 -83 432 344 -362 -189 388 328 -305 -344
6920 -344 185 510 147 -572 306 413 -43 -412 -157 470 -138 -233 -104 607 192 -152 167 384 368 -488 -273
6941 -273 194 256 -236 -279 -37 369 -303 -239 256 470 -216 -431 101 667 -61 -148 94 518 131 -686 -306
6962 -306 346 162 -152 -37 461 472 -254 -107 341 473 -132 -361 288 283 -172 -364 88 445 -367 -449 43
$$ packed form
6814D81m11l14K55N61n15k99J44O81o07m75K41P39l37l09J55M65k8m81j93O22
6834C75l5m90k44N43J77k87n18N71J47l66m46M57J71l04N2M83J8m84j00K66M09
6855C95j96n15R4L39J18m86j02M94K24o62J7M16J13l04n31O67J71M2p09j5O07
6876A77K5n99J31P21j95n88K32J63k8q5m41Q26j70n47J5O80k0n86P6L16L45n44
6898i6n77N52O54p18j95N26j24J19n10L23N20m92L2r7N15q8p06J73N77o0o33l9
6920c44N29L25l63p19Q78J07m56l69K55O27o08r5J29P11m15l44L19K17j6q56K15
6941b73M67O2m92m3K42M06o72O4M95K14o86k15N32N66p28q7K42M24l87q17L80
6962c06O52j84l14J15M98J1p26J47M48J32o05k29O49nm55j92M52L57q12q2M92
$$ plain form
6983 43 140 -251 -284 277 388 -226 -367 118 543 367 -269 -255 90 217 -321 -517 287 288 -266 -326 222 267 -64
7006 -64 -277 -33 448 176 -404 183 472 43 -197 80 157 11 -767 -162 723 161 -522 220 522 233 -400
7027 -400 -1 656 593 -262 -801 377 145 -111 -670 287 467 -231 -264 224 324 350 -186 -106 350 251 -566
7048 -566 -133 725 77 -607 -396 331 343 -384 -234 430 577 -469 -358 588 442 -159 -301 122 568 -300
7068 -300 -508 -7 773 -4 -351 70 417 112 -341 -194 650 -45 -329 -108 336 133 -166 -444 467 312
7088 312 -574 -447 341 302 -667 -497 -83 651 -11 -276 29 666 -173 -804 -164 326 -60 -302 -202 259
7108 259 -145 -379 -522 403 34 -465 -396 417 489 -516 -642 385 563 -608 -759 497 595 -716 -493
7127 -493 259 450 -296 -432 -172 679 223 -689 -300 501 375 -571 -316 546 242 -412 -423 239 316 -318 -387
$$ packed form
6983D3R7l91l3N61J11o14j41M85M25j76o36J4L45J27n38j96Q04Jn54o0N48M5l31
7006f4k13K44M81k72n80N87K89m29k40K77P7j46p78O05Q85n62o83P42L02k89o33
7027d00L99O57o3q55n39J178k32k56n59R57J80o98l3M88J00K6n36Q0M56r9q17
7048e66M33Q58o48o84K11P27J2p27J50O64J47j046J11R46j46o01j42M23M46q68
7068c00k08N01P80p77l47M21L47l05m53J47Q44o95k84K21M44k03k99k78R11j55
7088C12q86J27P88l9r69J70M14P34o62k65L05O37q39o31O40M90l86k42J00M61
7108B59m04k34j43R25l69m99O9Q13P2j005j26J027J78j171j51J256R8j311K23
7127d93P52J91p46j36K60Q51m56r12L89Q01j26r46K55Q62l04o54j1O62P7o34o9
$$ plain form
7148 -387 779 148 -362 -925 77 754 -150 -330 235 576 -150 -385 98 650 -15 -848 -370 462 420 -534
7168 -534 -295 684 423 -469 -442 381 705 -377 -350 462 527 -55 -562 460 820 -131 -699 -103 553 103
7188 103 -804 -54 565 97 -810 -163 770 249 -424 -274 614 648 -468 -622 344 591 -464 -384 258 1011
7208 1011 -233 -662 108 428 -468 -654 202 659 14 -768 -246 660 111 -607 -21 628 199 -976 -261
7227 -261 256 158 -409 -434 246 640 -343 -737 172 784 -344 -488 497 465 12 -782 -103 633 75 -479 -35
7248 -35 485 98 -560 -258 408 349 -759 -332 557 788 -286 -845 659 531 -294 -286 196 516 -320 -705
7268 -705 112 341 -247 -289 60 566 180 -704 -435 555 203 -713 -256 375 280 -808 -193 640 590 -389 -515
7289 -515 650 608 -335 -842 438 373 -179 -657 251 595 17 -654 298 824 263 -431 217 660 294 -325
$$ packed form
7148c87J166o31n10n63J002O77r04j80N65L41p26k35M83N52o65q33M78Q32m2r54
7168e34K39R79k61q92K7Q23L24j082K7Q12O5n82n07J022L60r51n68N96O56m50
7188A03r07P50O19m68r07O47R33n21o73J50Q88L4j116j54R66K47j055Q0O42P53
7208A011j244m29P70L20q96j86Q56M57o45p82N22R06n49p18N86O49m29j175P15
7227b61N17r8n67k5O80L94r83l94R09O12j128j44R85l2m53p94O79P36n58n54M44
7248c5N20l87o58L02O66n9j108M27Q89K31j074n59J504j28q25QM82L20q36l85
7268g05Q17K29n88m2L49N06l86q84K69R90l52r16M57O31r5j088O15Q33n0r79j26
7289e15J165m2r43n07J280o5n52m78R08L44n78o71R52N26n61o94O48M43l66o19
$$ plain form
7309 -325 -201 680 250 -345 -412 449 516 -541 -807 392 709 -367 -450 300 638 -161 -846 65 703 20
7329 20 -619 283 910 66 -732 -186 407 232 -327 -385 701 207 -706 -323 407 448 -601 -563 460 764
7349 764 -432 -827 368 680 -245 -662 143 929 -199 -712 115 741 -169 -564 -553 635 210 -700 -639
7368 -639 360 489 -484 -154 306 666 -377 -714 577 310 -288 -478 196 312 -381 -427 226 756 -175 -679
7388 -679 94 541 -31 -927 -297 672 216 -441 9 508 503 -644 -662 692 552 -97 -621 615 684 -554
7408 -554 -493 639 636 -366 -503 3 926 -479 -632 -142 520 20 -765 -292 444 178 -381 -361 539 489 -691
7429 -691 -525 331 359 -285 -488 485 658 -300 -745 479 537 -117 -676 124 412 -110 -384 -36 526 -13
7449 -13 -729 -215 747 -115 -548 -519 758 571 -473 -685 149 591 -512 -257 207 667 -367 -693 130
$$ packed form
7309c25J24Q81m30n95o7Q61O7j057k66J199L17j076q3P50L38p99o85R11O38o83
7329B0o39R02O27q44p98N46N93j75n59n8J086m94r13L83P30M1j049L8J023L04
7349G64j196l95J195L12r25m17Q05P86j128n13Q27O26r10l95J1J188m25r10O1
7368f39R99J29r73L30M60L60j043l37J291k67n98j90O74J16o93m6O53N30r31n04
7388f79P73M47n72q96O30R69m56o57M50M99nj147j8J354j40o49n24J236O9j238
7408e54O1J132lj002j37N06R23j405j53M90O62n00p85M73P36k66n59K0R00n0j180
7429f91J66Q56K8o44k03R73J73r58m45J224N8o54n59Q00K88n22k74L48N62n39
7449a3p16N14R62q62m33K9J277j87j044k12Q34M42j103K55M64M60j034l26Q23
$$ plain form
7468 130 429 -403 -712 98 777 86 -603 6 388 92 -596 15 661 -198 -609 -182 664 285 -903 -514
7488 -514 352 243 -354 -650 423 543 -176 -690 162 302 -171 -424 201 481 235 -699 434 724 64
7507 64 -1305 -249 524 186 -441 -299 681 379 -478 -541 777 578 -699 -513 395 791 -463 -728 276
7526 276 733 -211 -770 97 800 116 -880 15 639 29 -683 -405 408 550 -432 -173 619 601 -465 -646
7546 -646 431 821 -847 -630 212 476 -145 -573 197 479 -3 -660 128 771 244 -869 -30 695 315
7565 315 -746 -124 551 402 -582 -463 637 523 -590 -506 589 387 -439 -708 483 571 -262 -616 497
7584 497 611 229 -658 156 501 226 -558 -90 576 215 -554 -128 679 330 -709 -412 466 32 -215 -403
7604 -403 593 240 -423 -599 537 540 -508 -660 231 371 -384 -597 210 867 -159 -727 -357 729 100
$$ packed form
7468A30K99q32l09Q10O79o91o89O09L82k96o88O11O46q59m11M27Q46l79j188L89
7488e14Q66j09n97k96J073J20p19n14Q52J40m73k53O25K80k46r34J133K90o60
7507F4j369J056P73l38o27J42R80l02q57o3J318j99j277J86R08L96j254k65J004
7526B76M57r44n59Q67P03o84r96Q95O24o10p12K78Q13J42r82K59P92j8j066j81
7546f46J077L90j668K17Q42K64o21m28P70K82m82o57P88O43n27j113Q39P25l80
7565C15j061O22O75j49r84J19J100j14j113Q4J095k02q26k69J191Q8q33l54J113
7584D97J14l82q87Q14L45k75p84M68O66l61p69M26Q07l49j039K97Q78m34k47j88
7604d03R96l53o63j76J136Lj048j52Q91J40p55k13Q07O57j026n68L70J086o29
$$ plain form
7623 100 -709 -249 602 79 -484 -652 455 299 -781 -666 589 459 -343 -1065 196 744 -215 -573 335
7642 335 844 46 -665 314 819 43 -668 207 679 48 -680 -112 693 413 -623 -448 625 59 -517
7661 -517 -556 455 599 -627 -721 80 639 -687 -474 261 603 121 -520 122 790 214 -754 41 459 76
7681 76 -523 -250 715 608 -477 -315 537 275 -531 -350 293 354 -372 -562 227 617 -405 -636 502 522
7701 522 -138 -295 -101 498 45 -787 -105 897 263 -630 -411 725 -56 -799 -476 488 552 -569 -321
7720 -321 172 534 -381 -680 312 682 -275 -724 155 574 -20 -318 28 628 -23 -499 157 591 120 -592
7740 -592 77 328 190 -450 -452 471 351 -480 -105 295 383 -387 -586 161 369 -101 -603 475 650 -341 -1028
7761 -1028 -126 501 39 -823 11 605 131 -483 -240 623 570 -339 -327 427 448 -423 -310 683 542 -454 -520
$$ packed form
7623A00q09M60Q51n23n63j68J107j56j080J15J255j30q02p22J261N48r59l58R08
7642C35N09p98p11R79N05p76p11Q75M72o31p28N68Q05k80j036J75J073n66n76
7661e17l9J011J44j226r4Q01N59j326K13P35L42m82o41O42O68n76r68P95M18l83
7681G6n99K73R65j07j085J62Q52k62q06J81O43O1p26j90P89L90j022k31J138K0
7701E22o60j57J94N99m53q32O82J002o34q93K19J136p81p43L23R64O4j121K48
7720c21M93L62r15k99R92L70r57m49Q79M19n94k98L46O00o51m76O56M34m71p12
7740e92O69K51j38o40kR23j20q31L75M00Q8p70j99P47K08m70n02J078J75r91o87
7761a028R02O27m62q62Q34N94m74o14K43Q63n3r09J2P54K1q71J13R93j41r96o6
$$ plain form
7782 -520 322 873 -134 -606 274 842 -47 -864 -168 855 31 -650 -173 481 317 -744 -16 610 355
7801 355 -336 -600 571 408 -259 -467 443 545 -66 -774 447 581 -452 -301 72 761 98 -662 -149
7820 -149 468 81 -704 -149 727 282 -302 -204 349 277 -377 -150 283 566 -378 -507 490 408 -383 -326 178
7841 178 616 -78 -612 96 569 56 -512 -156 694 206 -332 -311 641 250 -744 -388 204 323 -354 -55
7861 -55 313 227 -414 -592 498 654 -174 -472 305 240 -163 -421 83 339 42 -906 -251 537 124 -623 -106
7882 -106 667 38 -767 -246 421 58 -476 -386 680 601 -352 -356 181 278 -444 -638 76 564 -83 -852 -121
7903 -121 262 -182 -340 -133 641 6 -551 110 352 105 -538 -621 347 239 -434 -243 476 646 -98 -295
7923 -295 255 443 -7 -352 228 277 -238 -394 168 666 337 -534 100 469 85 -423 -307 334 168 -355
$$ packed form
7782e20Q42N51j007m72Q80N68q89q17O96J023q24o81M77O54j64j061P28O26k55
7801C55o91k64J171j63o67k08R10J02o11p08J221J34j033J51L73O89o63p60N13
7820a49O17l87p85N55Q76m45n84R8N53p2o54K27M33K83r44j29R97q2p91N7N04
7841A78M38o94n34P08M73n13n68L56Q50m88n38K1R52l91r94L56N92J19o77K99
7861e5L68q6o41j78J090J56q28k98P77o5m03k58N04K56k97r48O55P88m13p47N17
7882a06P73o29q05N21O67l63n34R0J066p9r53mN37R7p22j94P14M88o47p69P31
7903a21L83m44j58K07P74o35n57O61K42k47o43q3R68j08o73J91P19J70p44j97
7923b95N50J88m50l45N80M9n15j56N62M98l29q71O34L69l84n08J16O41j66n23
$$ plain form
7943 -355 -185 372 532 -115 -85 406 384 -168 -109 561 289 -381 -409 460 638 -10 -470 174 461 95 -564
7964 -564 104 486 114 -206 -142 634 302 -199 -91 331 286 -644 -334 332 374 -407 -610 412 710 -304
7984 -304 -492 -25 551 -412 -218 226 462 150 -317 166 230 233 -706 -179 56 538 -614 -124 323 51 -189
8005 -189 -364 459 220 -326 -615 420 92 -311 -456 213 561 213 -487 -48 397 -431 -731 -98 477 165
8025 165 -239 12 415 24 -388 -274 397 456 -169 -117 353 221 -324 -405 -84 403 -424 -661 -9 712 -143
8046 -143 -650 90 420 -298 -450 -134 301 113 -656 -38 684 198 -754 -179 248 252 -484 -245 413 208 -507
8067 -507 -146 285 398 -117 -370 267 90 -48 -337 130 561 -94 -314 -220 376 -35 -556 -139 289 188
8087 188 -416 -216 513 248 -477 -258 429 437 -234 -202 9 284 -217 -455 180 464 -491 -621 -137 384 -42
$$ packed form
7943c55J70N57J60o47L0M91k2n52N9O70k72o70k8Q69J78o48m60O44K87l66o59
7964e64O68L82l72l20O4P76l32n01J08M22m5r30L10O66M2p81k03J022K98j014
7984c04j88M67N76r63J94M44K36l12m67M83O4Lr39N27K35M82j152M90M47k72k40
8005a89j75Q23k39n46k89J035l28m03j45O69L48l48p00M39M45q28l00O33N75l12
8025A65m04K51M03l91m12J14O71N9o25N2M70j32n45q1L21M87q27k37O52P21q55
8046a43n07P40L30p18j52L16M35j88p69O18P22m86r52N75M27Mp36K39O58k05p15
8067e07L61M31J13n15k53O37j77j38k89M67M31o55k20R4N96m11n21M17M28j01
8087A88o04K00P29k65p25K19O87Qo71L2K11K75n01k38O35K84r55j30M84N21m26
$$ plain form
8108 -42 -268 -174 324 -198 -405 -366 182 68 -482 -281 322 119 -361 -278 448 196 -187 -165 324 229 42 -188
8130 -188 155 358 -79 -296 -359 427 338 -191 -171 379 -42 -276 -248 452 187 -340 -250 268 333 -259 -152 169
8152 169 76 -136 -378 91 356 63 20 -33 144 -63 -280 77 518 -36 -238 -267 407 -57 -223 -45 171
8173 171 181 -393 -89 242 142 -543 -249 171 323 -245 -137 -1 -27 84 -758 202 291 354
$$ packed form
8108d2k26R4M98n22k07L9N48j14n50K01O03k03m80Q3P26k52l83K2M89r5j87k30
8130a88L43K03m37k17o3P86q9n29K0N50m21k34K8P00k65n27R0N18O5n92J07L21
8152A69r3k12k42M69K65k93m3n3J77k07k17L57M41n54k02k9O74m64j66J78K16
8173A71J0n74L04L31j00o85K94M20J52n68J08J36k6J11q42R60Q9O3
8191C54
$$ Imaginary data points
##PAGE= N=2
##DATA TABLE= (X++(I..I)), XYDATA
$$ plain form
0 0 0 0 0 0 8 0 8 -8 9 -12 16 -24 24 -32 40 -48 56 -64 80 -96 112 -128 147 -172 196 -223 256 -291 328
29 328 -368 420 -470 526 -587 656 -733 812 -900 1001 -1109 1227 -1358 1506 -1667 1845 -2047
46 -2047 2279 -2540 2838 -3191 3607 -4107 4724 -5509 6542 -7971 10085 -13537 20131 -37211
60 -37211 170645 316615 -198530 -225648 173632 245191 -208481 -307017 122028 313108 -76792
71 -76792 -269855 87560 316870 -39903 -309597 -5564 293066 15741 -295550 -48892
81 -48892 297031 89364 -266939 -98351 276422 140398 -252655 -173272 219037 177082 -209815
92 -209815 -199932 201111 245854 -143524 -241345 118681 239193 -110776 -267275 70992 275474
103 275474 -26040 -256124 14058 260134 8202 -269094 -50287 251602 71756 -240481
$$ packed form
0@%%%%QqQj6J7k1K8m0M8n6P2q8J04j20J44j76K08k40K75l19L68m19M79n47O19
29C28o96P88q90R96j113J243j389J545j712J901k110K336k585K864l173L512l892
46b047M326m819N378o029O798p714Q831j0233J2051j4513J8056k3622L3668n7342
60c7211K07856J45970n15145k7118L99280P1559m53672r8536M29045J91080l89900
71g6792j93063L57415K29310l56773k69694L04033K98630k77325l11291K46658
81d8892L45923k07667l56303J68588L74773j36024l93053P9383L92309m1955l86897
92b09815R883M01043M4743l89378r7821L60026J20512l49969j56499L38267K04482
103B75474l01514k30084K70182K46076k51932k77296K18807L01889j79846l12237
$$ plain form
113 -240481 -90212 236675 116249 -227937 -147893 205244 166436 -187862 -185703 167251 200986
124 200986 -151711 -227903 116179 233374 -91576 -242373 64630 246218 -40408 -254017
134 -254017 6036 245343 12925 -248207 -45190 235238 63503 -230801 -88243 220016
144 220016 110567 -209436 -135664 187330 145234 -181453 -172503 157833 189425 -131672 -197310
155 -197310 111847 205414 -96210 -226268 58443 222440 -35056 -220416 16801 224846
165 224846 10950 -221229 -38833 207423 53503 -203185 -74539 195151 98322 -177645
175 -177645 -110139 168439 128087 -155532 -145618 137702 158986 -119867 -169311 106107 186964
186 186964 -78173 -189471 60359 196775 -38806 -201632 15297 204360 14074 -192359
$$ packed form
113b40481J50269L26887j20426l44186Q0044L53137l8808l54298K159L52954L3735
124B00986l52697p6192L44082J17195l24950j50797L07003J81588k86626k13609
134b54017K60053K39307k32418k61132K03017K80428j71735k94304J42558L08259
144B20016j09449l20003P3772L22994m2096l26687Q950L30336L1592l21097o5638
155a97310L09157R3567l01624j30058K84711J63997k57496j85360K37217K08045
165B24846k13896k32179J82396K46256j53920k56688J28646K69690r6829k75967
175a77645O7506K78578m0352k83619R914K83320K1284k78853m9444K75418Q0857
186A86964k65137j11298K49830J36416k35581j62826K16929J89063j90286k06433
$$ plain form
196 -192359 -26230 194865 52079 -185379 -70870 175635 89335 -161606 -99940 157624
206 157624 122765 -138099 -131278 127162 145961 -110669 -155686 97153 169478 -75124 -173657
217 -173657 59911 183572 -36192 -184163 18072 187562 4518 -184032 -23838 181371
227 181371 45156 -172154 -61325 164937 79137 -153936 -93533 141540 106472 -129866
237 -129866 -118447 115909 128209 -103192 -138434 87923 145256 -74175 -153947 55872 156764
248 156764 -41590 -164268 21256 162858 -5354 -164775 -15189 159474 29634 -158474
258 -158474 -51262 146568 62590 -141159 -79477 128765 90076 -120391 -104863 104314 109351
269 109351 -96971 -122474 80372 127476 -69046 -136048 53169 138581 -42024 -146808 22396
$$ packed form
196a92359J66129K21095j42786k37458J14509K46505q6300k50941O1666K57564
206A57624l4859k60864O821K58440J8799k56630m5017K52839P2325k44602r8533
217a73657K33568J23661k19764j47971K02235J69490j83044j88550J60194K05209
227A81371j36215k17310J10829K26262q5800k33073O0403K35073l5068k36338
237a29866J1419K34356J2300k31401l5242K26357N7333k19431p9772K09819J00892
248A56764j98354j22678J85524J41602j68212j59421J49586J74663j29840j88108
258a58474J07212J97830q3978k03749O1682K08242l8689k10467J5528K09177N037
269A09351k06322k5503K02846M7104j96522o7002J89217Q5412j80605j04784J69204
$$ plain form
280 22396 145194 -10118 -149002 -8502 147250 24137 -144963 -41491 137736 53924
290 53924 -133683 -71399 122511 83134 -112521 -93972 101238 103812 -89849 -112882 75984
301 75984 118123 -64192 -123403 52448 129475 -37284 -131079 25878 134455 -11179 -135041
312 -135041 -1987 136326 18627 -131038 -29839 130728 47466 -121736 -58581 116410
322 116410 72483 -105253 -80840 98068 94076 -82749 -97169 75292 107057 -61052 -109708
333 -109708 51542 116127 -36974 -115384 29181 121564 -13215 -119440 4174 122287
343 122287 10558 -119047 -20995 119366 36485 -112546 -45736 109832 60397 -101039 -70009
354 -70009 93623 80459 -82699 -87694 74161 96281 -61652 -100825 50690 104899 -40235
$$ packed form
280B2396J22798j55312j38884J40500J55752j23113j69100J03472J79227q3812
290E3924j87607O2284J93910l9377j95655J8549J95210K574j93661k3033J88866
301G5984M2139j82315n9211J75851P7027j66759r3795J56957J08577j45634j23862
312a35041J33054J38313j17699j49665J01199J60567q3262j69202O3155J74991
322A16410m3927j77736K4413J78908l992j76825j4420J72461L1765j68109m8656
333a09708J61250O4585j53101p8410J44565R2383j34779j06225J23614J18113
343A22287j11729j29605R8052J40361q2881j49031O6810J55568m9435j61436L1030
354g0009J63632j3164j63158m995J61855K2120j57933l9173J51515N4209j45134
$$ plain form
365 -40235 -108308 28348 110538 -17190 -111139 6337 111172 4082 -112407 -17182 108751
376 108751 25906 -107552 -39793 101847 49374 -97925 -62037 88566 69281 -83726 -80798
387 -80798 70504 84687 -62734 -93088 49885 94903 -41887 -100921 27679 98786 -21184
398 -21184 -103154 7399 100840 64 -102346 -12725 97939 19460 -99093 -32511 92769
409 92769 39990 -90442 -51314 83390 58556 -78476 -69204 68578 74600 -61761 -82334
420 -82334 50781 86618 -41438 -90136 31073 92461 -21612 -94116 11011 93716 -1975
431 -1975 -93364 -6615 93101 17177 -89926 -25031 88133 34350 -84215 -42361 81250
442 81250 52580 -73898 -58319 69793 68234 -60074 -73166 53808 80614 -42282 -82034
$$ packed form
365d0235o8073J36656Q2190j27728r3949J17476J04835j07090j16489R5225J25933
376A08751q2845j33458O7759J41640n2473j47299L5888J50603j9285j53007K928
387h0798J51302J4183j47421l0354J42973M5018j36790n9034J28600P1107j19970
398b1184q1970J10553R3441j00776j02410Q9621J10664p8479j18553O6582J25280
409I2769n2779j30432L9128J34704k4834j37032R272J37782O022j36361k0573
420h2334J33115L5837j28056m8698J21209O1388j14073p2504J05127Q2705r5691
431a975r1389Q6749R9716p5924j07103O4895J13164n3783j18565M1854J23611
442H1250k8670j26478J5579J28112j559j28308j3092J26974K6806j22896l9752
$$ plain form
453 -82034 35367 88445 -22710 -86387 16178 89851 -4148 -86591 -2180 87887 13663
464 13663 -83423 -18902 83693 29754 -78067 -34819 76198 44300 -69959 -49571 66668
475 66668 59356 -57844 -62852 52939 70403 -43510 -73417 35871 78154 -25899 -78761
486 -78761 18135 81376 -8499 -80171 65 79174 7948 -77850 -15674 74990 22674 -72464
498 -72464 -29865 68746 36237 -65873 -43974 60051 48727 -56688 -56171 49536 59870 -44527
510 -44527 -66486 35138 68168 -29823 -73936 19010 73392 -12763 -76045 2159 73453 3070
522 3070 -74859 -13711 70098 18042 -69947 -27105 64625 31498 -63293 -39872 56607 42655
534 42655 -55025 -50581 47703 53526 -44098 -60244 35942 62006 -30482 -66870 21478 67266
$$ packed form
453h2034J17401N3078j11155o3677J02565P3673r3999q2443Q4411R0067p4224
464A3663r7086O4521J02595n3939j07821M3248J11017l1898j14259K0388J16239
475F6668p312j17200n008J15791J7464j13913k9907J09288M2283j04053n2862
486g8761R6896O3241q9875p1672Q0236P9109p1226q5798O2176R0664n2316r5138
498g2464M2599R8611l2509j02110K1899J04025j1324j05415N17J05707J0334j04397
510d4527k1959J01624L3030r7991m4113R2946N4382q6155o3282P8204P1294p0383
522C070p7929O1148Q3809n2056q7989M2842R1730l3127r4791K3421R6479j3952
534D2655r7680M444R8284N823r7624j6146R6186K6064r2488l6388Q8348M5788
$$ plain form
546 67266 -15401 -70042 6571 69289 495 -68876 -8267 66760 14770 -64965 -21726 61880
558 61880 27547 -57995 -32785 54940 37860 -50349 -42543 46342 47559 -40473 -50408 36460 55633
571 55633 -29045 -56794 25075 61435 -16447 -61040 11522 63837 -2432 -62081 -2440 63238
583 63238 11723 -58941 -15226 58726 23285 -53573 -27035 52256 34418 -46556 -35996 45039
595 45039 42866 -38155 -44055 35566 49449 -28455 -50816 25105 55594 -17497 -55447 13013
607 13013 58530 -5335 -57716 137 58662 7501 -56431 -12730 55480 20066 -51904 -24262
619 -24262 48955 29259 -45416 -33552 41547 37339 -37407 -40998 32975 43537 -29442 -47089
631 -47089 23674 48484 -19683 -51794 13092 51731 -9228 -53975 1944 52376 2312 -53426
$$ packed form
546F7266q2667n4641P6613O2718o8794o9371O0609P5027n1990p9735M3239Q3606
558F1880l4333q5542K5210Q7725j7080q8209P806Q8885J217q8032r935Q6868J9173
571E5633q4678k7749Q1869L6360p7882m4593P2562N2315o6269n9649N9641O5678
583F3238n1515p0664M3715P3952l5441p6858K6538P9291j7838q0974J0560Q1035
595D5039k173q1021n900P9621J3883p7904k2361P5921L0489p3091l7950O8460
607A3013M5517o3865n2381N7853N8525n1161o3932M3701O8210l5414p1970K7642
619b4262P3217j9696p4675J1864P5099m208p4746l591P3973J0562p2979j7647
631d7089P0763K4810o8167l2111O4886L8639o0959m4747N5919N0432n0064n5738
$$ plain form
643 -53426 -9778 50231 13350 -50120 -20641 45390 22919 -44690 -29507 38785 30898 -37776
655 -37776 -36404 31375 37463 -29622 -41584 23370 41713 -21249 -45731 14440 45267 -11588
667 -11588 -48103 5138 46969 -1339 -48601 -5452 46399 8971 -46308 -15275 43610 18792
679 18792 -41654 -24028 37744 27251 -34845 -30900 31334 34096 -27437 -36228 23622 38552 -19379
692 -19379 -40036 15496 41980 -10652 -42109 7073 43980 -1571 -42612 -1695 43659 7292
704 7292 -42159 -11099 41875 17146 -38114 -19220 37783 25317 -32845 -26586 31024 31440 -25993
717 -25993 -32013 24597 36607 -18310 -35393 16797 38977 -11112 -38031 9235 40629 -3224
729 -3224 -39165 1599 40858 4439 -39032 -7146 39452 12486 -36800 -15160 36439 20034
$$ packed form
643e3426M3648O0009l6881o3470K9479O6031k2471o7609J5183O8292p887o8674
655c7776J372O7779O088o7085j1962O4954J8343o2962k4482O0171L0827n6855
667a1588l6515N3241M1831m8308m7262M3149N1851l7428n5279L1033N8885k4818
679A8792o0446J7626O1772j0493o2096L945O2234K762o1533q791N9850J4930n7931
692a9379k0657N5532K6484n2632l1457M9182L6907m5551m1041M0917M5354l6367
704G292m9451L1060N2974k4729n5260J8894N7003j2466n8162O259N7610M16n7433
717b5993o020N6610J2010n4917j7083N2190K2180n0089k6919M7266L1394m3853
729c224l5941M0764L9259l6419m3471L1886M6598k6966m9286K1640N1599j6405
$$ plain form
741 20034 -32598 -22626 30754 26176 -27567 -27563 24615 30245 -20962 -32159 17905 33266 -14364
754 -14364 -34832 10248 34820 -7006 -35823 3098 35438 -365 -35968 -4559 34590 6844
766 6844 -34551 -11469 32108 13927 -31773 -18910 27714 19888 -26985 -24446 22547 24982 -21181
779 -21181 -28587 15931 28323 -15101 -31334 9544 30000 -8147 -32363 3138 31344 -1546
791 -1546 -32588 -3635 30682 4963 -31959 -9857 29237 11815 -29232 -15856 26490 17701
803 17701 -25451 -21511 21838 22825 -20199 -25317 17322 26644 -14701 -28171 11153 28934 -8715
816 -8715 -29705 5555 30263 -2502 -29954 253 30461 3643 -29388 -5841 29552 9469
828 9469 -27471 -11273 27600 15273 -24728 -16106 24191 20013 -20520 -20601 19677 24055 -15463
$$ packed form
741B0034n2632R972N3380m578n3743MN2178N630n1207j1197N0064J5361m7630
754a4364k0468M5080K4572m1826k8817L8921L2340l5803l5603L1409L9149k7746
766F844m1395K3082M3577j8181m5700J2863M6624p826m6873K539M6993K435m6163
779b1181p406M4518J2392m3424j6233M0878K0456l8147k4216L5501K8206l2890
791a546l1042K8953L4317k5719l6922K2102L9094j7422m1047J3376M2346q789
803A7701m3152L940M3349R87m3024n118M2639R322m1345j3470L9324J7781l7649
816h715k0990L5260K4708l2765k7452L0207L0208k6818l3031K3547L5393k0083
828I469l6940J6198L8873j2327m0001Q622M0297m178m0533q1M0278M378l9518
$$ plain form
841 -15463 -23715 14453 26251 -10136 -25757 9201 27996 -4429 -26498 3726 28305 804
853 804 -25977 -1927 27136 5927 -24995 -7258 25651 11402 -23041 -12070 22775 15594 -19341
866 -19341 -16705 18699 19292 -15401 -19796 14394 22046 -10897 -22710 8998 23594 -6014 -24099
879 -24099 3947 24616 -1375 -24236 -1260 23749 3440 -23600 -6313 22536 8057 -22237
891 -22237 -11022 20390 12014 -19923 -15079 17170 15713 -16786 -18375 13604 18573 -12828 -21146
904 -21146 9606 20762 -9149 -22983 4685 21963 -4318 -23773 519 21896 45 -23612
916 -23612 -3860 21365 4339 -22481 -8224 20173 8818 -20693 -12191 17625 12310 -17647
928 -17647 -15235 14921 15308 -14569 -17550 11412 17850 -10550 -19748 7936 19495 -6466 -20471
$$ packed form
841a5463q252L8168J1798l6387j5621L4958J8795l2425k2069L0224K4579k7501
853H04k6781K4050K9063k1209l0922J7737L2909j4249l4443J0971L4845p181l4935
866a9341K636L5404N93l4693m395L4190P652l2943j1813L1708J4596k9608j8085
879b4099K8046K0669k5991k2861K2976K5009k0309k7040J7287K8849j4479l0294
891b2237J1215L1412q376l1937M844L2249j457l2499j589L1979M969l1401q318
904b1146L0752J1156k9911j3834K7668J7278k6281j9455K4292K1377k1851k3657
916b3612J9752K5225j7026k6820J4257K8397j1355k9511Q502K9816n315k9957
928a7647K412L0156L87k9877k981K8962O438k8400r198K7684J1559k5961j4005
$$ plain form
941 -20471 3997 20145 -1977 -20433 -162 20257 2463 -19792 -4136 19185 6594 -17942
953 -17942 -7866 17520 10473 -15713 -11344 15306 13150 -12741 -13601 12827 15947 -9678 -15265
966 -15265 9393 17903 -6260 -16852 6115 18869 -2316 -18062 1827 19864 1354 -17810
978 -17810 -1625 19299 5009 -17264 -5704 17846 8458 -15662 -8630 16039 11594 -13707 -11805
991 -11805 13507 13922 -10948 -14445 10696 16151 -8411 -16276 7872 17618 -5307 -17457 4326
1004 4326 18306 -1942 -18273 423 18594 1310 -18143 -3239 17887 4792 -17419 -6913
1016 -6913 16287 8069 -16002 -9917 14112 10681 -13617 -12838 11544 12733 -11346 -14748 8600
1029 8600 14687 -8323 -16529 5624 15549 -5416 -17559 2241 16601 -2032 -17947 -1325 16036
$$ packed form
941b0471K4468J6148k2122j8456K0271K0419j7794k2255J5656K3321j2591k4536
953a7942J0076K5386p047k6186M369K6650k156k5891q60K6428L120k5625n587
966a5265K4658Q510k4163j0592K2967J2754k1185j5746J9889J8037j8510j9164
978a7810J6185K0924j4290k2273J1560K3550r388k4120P032K4669m445k5301J902
991a1805K5312M15k4870l497K5141N455k4562p865K4148R746k2925j2150K1783
1004D326J3980k0248j6331J8696J8171j7284j9453J4904K1126j3095k2211J0506
1016f913K3200q218k4071O085K4029l431k4298P79K4382J189k4079l402K3348
1029H600O087k3010q206K2153R925k0965j2143J9800J4360j8633j5915J6622J7361
$$ plain form
1042 16036 1828 -17697 -4959 16134 5147 -16519 -8158 14070 8501 -14517 -10742 11848
1054 11848 10831 -11998 -13002 10274 13073 -9499 -14456 7391 14927 -6548 -16188 4318 16138
1067 16138 -3432 -16664 1390 17073 275 -17155 -2031 16996 3982 -16296 -5536 16036
1079 16036 7330 -14661 -8685 14104 10403 -12588 -10818 12201 12971 -10332 -12830 9669 14487
1092 14487 -7589 -14568 7030 16153 -4656 -15597 4137 17622 -1219 -16265 855 18125
1104 18125 2221 -16366 -2872 17169 6154 -15482 -6333 16156 9201 -13537 -9250 13813
1116 13813 11883 -11394 -11989 11172 13467 -8763 -13748 8228 15640 -6348 -15271 5293 16889
1129 16889 -3191 -16526 2324 17214 -266 -17077 -1258 17168 3516 -16841 -5292 16371
$$ packed form
1042A6036j4208j9525J2738K1093j0987k1666Q361K2228n569k3018L775K2590
1054A1848j017k2829j004K3276K799k2572m957K1847P536k1475r640K0506J1820
1067A6138j9570j3232J8054J5683j6798j7430J5124J9027j3014k0278J0760K1572
1079A6036q706k1991N976K2789l701k2991J770K3019P70k3303k498K2499M818
1092A4487k2076o979K1598R123k0809j0941J9734J3485j8841j5046J7120J7270
1104A8125j5904j8587J3494K0041j1015k1636R149K2489o955k2738M287K3063
1116A3813j930k3277n95K3161K295k2230m985K1976P412k1988q923K0564J1596
1129A6889k0080j3335J8850J4890j7480j6811J5819J8426j3652k0357J1549K1663
$$ plain form
1141 16371 6871 -15831 -8919 14303 10012 -13501 -11446 11780 12580 -11238 -13954 9306 14366
1154 14366 -8421 -15830 6349 15639 -5839 -16764 2742 16337 -2641 -17809 -434 16666
1166 16666 1139 -18428 -4410 16815 4915 -17205 -8216 15070 8494 -15197 -11042 12464
1178 12464 11517 -13150 -14061 10205 13389 -9756 -15496 7353 14918 -6851 -16642 4357 16198
1191 16198 -3383 -17626 1253 17210 182 -17602 -2421 17400 4251 -17149 -6612 16701
1203 16701 7863 -15423 -9678 14714 11392 -12927 -12560 11915 14197 -10058 -14395 8729 15952
1216 15952 -6689 -15709 5961 16841 -3647 -16947 2757 18019 -710 -17134 97 18596
1228 18596 3418 -17251 -4109 18181 7118 -16077 -8104 16581 11019 -14313 -11352 14281
$$ packed form
1141A6371r500k2702O912K3222m291k3513K055K3226Q00k3818k716K3260N060
1154A4366k2787p409K2179R290k1478j0925J9506J3595j8978j5168J7375J7100
1166A6666j5527j9567J4018K1225j1900k2120Q989K3286o576k3691M155K3506
1178A2464r47k4667r11K4266L184k3145n740K2849P565k1769r791K0999J1841
1191A6198j9581j4243J8879J5957j7028j7784J5181J9821j3149k1400J0537K3313
1203A6701q838k3286N745K4392l322k4319L67K4475K282k4255m337K3124P223
1216A5952k2641r020K1670J0880k0488j3300J9704J5262j8729j6424J7231J8499
1228A8596j5178k0669J3142K2290j1063k3195P973K4685n562k5332K961K5633
$$ plain form
1240 14281 14278 -11283 -14139 11066 16233 -8207 -15874 7468 17333 -4850 -16657 3963 17875
1253 17875 -1774 -17482 575 18327 1494 -17861 -2963 18360 5658 -17297 -7227 16807
1265 16807 9209 -15761 -10663 14715 12785 -13234 -14055 11370 14759 -9730 -16337 7714 16383
1278 16383 -6530 -17689 4235 17469 -3153 -17917 637 17301 297 -18272 -3028 17070
1290 17070 3510 -17988 -6372 16686 7492 -16963 -10512 14634 11426 -14556 -13849 11961 14137
1303 14137 -11255 -16325 8693 16405 -7660 -18045 4897 17865 -3941 -18565 847 17944
1315 17944 -444 -18741 -2023 17562 3112 -18347 -5434 17626 6896 -17185 -9143 16269
1327 16269 10512 -15449 -12920 13840 14119 -12312 -15622 10595 17023 -8320 -17720 6855 18609
$$ packed form
1240A4281lk5561k856K5205N167k4440p667K3342R865k2183j1807K0620J3912
1253A7875j9649j5708J8057J7752j6833j9355J4898K1323j2702k2955J0070K4034
1265A6807p598k4970N098K5378j930k6019q21K5425L389k4489o607K4051Q669
1278A6383k2913j1159K1924J3234k0622j4764J8554J6664j7004j8569J5244K0098
1290A7070j3560k1498J1616K3058r194k4455O451K5146l208k5982P07K5810K176
1303A4137k5392n070K5018P712k4065j0385K2942J2968k1806j4624J9412J7097
1315A7944j8388j8297J6718J9585j4450k1459J2913K3060j0730k4081Q042K5412
1327A6269n757k5961K529K6760K79k6431l310K6217O428k5343r400K4575J1754
$$ plain form
1340 18609 -4448 -18076 2694 18831 -547 -18021 -563 18548 3099 -17900 -3928 17953
1352 17953 6661 -16592 -7527 17026 10101 -15011 -10483 15170 13321 -12923 -14370 11985 16464
1365 16464 -9218 -16296 8431 18578 -5073 -18062 3962 18709 -1196 -18096 30 18505
1377 18505 2769 -17686 -3501 17997 5598 -16991 -6975 16605 8948 -15413 -10067 14976
1389 14976 12606 -13478 -14160 12409 15414 -10591 -16968 8716 18076 -6666 -18819 4571 19125
1402 19125 -2379 -19429 -134 18792 1680 -19179 -4070 17969 5337 -17592 -7661 16685
1414 16685 8307 -16620 -10832 14792 11443 -14755 -13964 12790 14534 -12280 -16751 9452 17143
1427 17143 -8815 -19129 5950 18856 -4271 -19783 1027 19263 196 -19922 -3163 18315
$$ packed form
1340A8609k3057j3628K0770J6137j9378j7474J7458J9111j5449k0999J3972K1881
1352A7953j1292k3253R065K4553o925k5112M528K5653j849k6244j447K6355M479
1365A6464k5682p078K4727J0147k3651j2989K2024J4747j9905j6900J8126J8475
1377A8505j5736k0455J4185K1498j2399k2589J0016K3580p657k4361N346K5043
1389A4976k370k6084o82K6569L005k6005o377K5684R360k4742j2153K3390J4554
1402A9125k1504j7050J9295J8926j7112k0859J5109K2039j2632k2929R931K4346
1414A6685q378k4927N788K5624l349k6198P91K6754J744k6814m471K6203P691
1427A7143k5958j0314K5079J2906k3127j5512K0810J8236j9067k0118J6759K1478
$$ plain form
1439 18315 4239 -18698 -6778 17495 7801 -16952 -9807 14695 10572 -14939 -12508 13183 13804
1452 13804 -12223 -15206 10502 16232 -8734 -18157 6843 18378 -4962 -19052 2820 19764
1464 19764 -339 -19573 -1828 19430 4280 -18500 -5548 17971 8279 -16227 -8924 15975
1476 15975 11259 -14085 -12019 13692 13639 -11732 -14581 11091 16771 -8383 -16515 7868 18745
1489 18745 -4953 -18598 3873 19913 -682 -19185 -931 20341 4231 -18480 -5472 18474
1501 18474 7808 -17183 -9123 16379 11335 -14373 -11905 13842 14029 -12140 -14558 11231 15736
1514 15736 -9119 -16403 8243 18063 -6312 -18614 4295 19272 -2210 -19874 23 20019
1526 20019 2421 -19768 -4627 18863 6688 -18409 -9002 16575 10203 -15664 -12009 13787
$$ packed form
1439A8315j4076k2937J1920K4273r694k4753P145K4502m123k5511K431K5691O21
1452A3804k6027k983K5708N730k4966r423K5000J1535k3340j4090K1872J6944
1464A9764k0103j9234J7745K1258j5150k2780J2952K3519r692k4506P303K4899
1476A5975m716k5344K066K5711n3k5371k849K5672N680k5154q132K4383J0877
1489A8745k3698j3645K2471J6040k0595j8503J8254K1272j6110k2711J3008K3946
1501A8474j0666k4991Q060K5502n044k5708K468K5747J87k6169k418K5789M505
1514A5736k4855p284K4646R820k4375j2302K2909J4977k1482j7664J9897J9996
1526B0019j7598k2189J5141K3490j2175k5097R407K5577o372k5867L655K5796
$$ plain form
1538 13787 13272 -13025 -14852 11034 14685 -10191 -16908 7778 16810 -7113 -18194 4554 18005
1551 18005 -3380 -19355 499 19057 669 -19970 -3904 18648 5506 -18680 -8243 16939
1563 16939 9617 -16475 -12500 14039 12809 -13290 -14685 11155 15079 -9801 -16464 7694 16684
1576 16684 -6539 -17903 4475 18189 -2953 -18456 860 18795 1094 -19470 -3181 18741
1588 18741 5519 -18288 -7446 17583 9806 -16246 -11271 15139 13141 -13554 -14776 11978 15859
1601 15859 -9353 -16026 8241 17126 -6097 -17057 5061 18248 -2710 -18274 1753 19188
1613 19188 1041 -18010 -2128 18946 4520 -17994 -6313 18401 9189 -16423 -9797 16220
1625 16220 12896 -13436 -13585 12708 15570 -10130 -16049 9202 17226 -6452 -17001 5075 18261
$$ packed form
1538A3787n15k6297j827K5886L651k4876o717K4686R032k3923j1081K2748J3451
1551A8005k1385j5975J9854J8558j8388k0639J6066K2552j3142k4186J0437K5182
1563A6939p322k6092L975K6539j230k6099j395K5840L924k4880o663K4158Q990
1576A6684k3223j1364K2378J3714k1142j5503J9316J7935j7701k0564J6289K1922
1588A8741j3222k3807J0842K5029p777k6052M975K6410j998k6695j222K6754L881
1601A5859k5212o673K4267Q885k3223j0960K2118J3187k0958j5564K0027J7435
1613A9188j8147j9051J5882K1074j4426k2514J1681K4714r212k5612O626K6017
1625A6220l324k6332j49K6293K862k5700n919K5251Q024k3678j0549K2076J3186
$$ plain form
1638 18261 -3038 -17603 1178 18158 692 -17812 -1872 18244 4218 -17759 -5895 17271
1650 17271 8223 -16499 -10113 15437 12002 -14147 -13254 12529 14869 -11225 -16030 8405 16956
1663 16956 -6914 -17551 4689 17822 -3287 -18178 900 17518 66 -18390 -2805 17021
1675 17021 3991 -17266 -5885 16551 7101 -16662 -9593 14599 10654 -14959 -13299 12799 13967
1688 13967 -11578 -16201 9253 16332 -8018 -18098 5127 17602 -3807 -18146 1502 17989
1700 17989 -36 -18328 -2424 17360 2987 -17457 -5273 16560 6720 -15720 -8465 15203
1712 15203 10051 -14452 -12311 13045 13141 -11842 -14609 10651 16034 -7868 -16572 6337 17306
1725 17306 -3818 -17922 2152 18002 464 -17046 -1749 17576 4082 -16305 -5077 16077
$$ packed form
1638A8261k1299j4565J8781J6980j7466j8504J5940K0116j4026k1977J1864K3166
1650A7271r048k4722O386K5550l435k6149Q93K5783K340k6094m805K4435Q551
1663A6956k3870j0637K2240J3133k1109j4891J9078J6618j7452j8456J5585J9826
1675A7021j3030k1257J1381K2436r450k3763P069K4192l945k5613J660K6098J168
1688A3967k5545m623K5454P079k4350j0080K3225J2475k1409j4339J9648J6487
1700A7989j8025j8292J5904J9784j4373k0444J2184K1833r840k2440P255K3668
1712A5203n152k4503K141K5356R6k4983k767K5260N383k3902q704K2909J0969
1725A7306k1124j4104K0074J5850j7538j7510J5297J9325j3494k0387J1228K1154
$$ plain form
1737 16077 7153 -15113 -7927 14798 10376 -12875 -10740 12836 12815 -11113 -13912 10141 15371 -8081
1751 -8081 -15853 6914 17542 -4039 -17442 2520 18253 -273 -17618 -1014 17679 3926
1763 3926 -16349 -5074 16275 7136 -15028 -8178 14228 9305 -13450 -10294 13089 12418 -11249
1776 -11249 -13011 10061 14483 -8881 -15686 7199 16578 -5065 -17160 3504 17740 -1421 -18203
1789 -18203 -991 17438 2499 -17387 -4683 16212 6399 -15323 -7864 14079 8890 -13489
1801 -13489 -10667 11793 11335 -11385 -12957 9911 13358 -9363 -15359 6578 14986 -5763 -16590
1814 -16590 3342 16865 -1887 -17432 -709 16662 1864 -17649 -4602 15717 5848 -15606
1826 -15606 -7915 13964 9010 -13486 -10588 11371 10963 -11034 -12727 9638 12875 -8004 -14269
$$ packed form
1737A6077q924k2266P186K2725m422k3251K135K3576k1k3928k799K4053N230k3452
1751h081p772K2767J0628k1581j3403J9962J5733j8526j7345J6604J8693j3753
1763C926k0275J1275K1349r139k2164O850K2406m923k2755L156K3383o71k3667
1776a1249j762K3072M422k3364o805K2885R379k1643j2095K0664J4236j9161j6782
1789a8203J7212J8429j4939j9886J2704K0895r813k1722P459K1943n189k2379
1801a3489K822K2460m58k2720j572K2868L447k2721n996K1937Q408k0749j0827
1814a6590J9932J3523j8752j5545J6723J7371j4798j9513J3047K0319r869k1454
1826a5606P691K1879m954k2496K898K1959m08k1997j693K2365L237k0879o265
$$ plain form
1839 -14269 7001 14894 -5546 -15524 3682 15954 -2367 -16440 576 17094 1667 -16616
1851 -16616 -3569 16034 5455 -15345 -7055 15082 9110 -13040 -10067 12415 11369 -10641 -12386
1864 -12386 9569 13164 -7706 -13466 7036 14953 -4771 -14852 4360 15881 -2646 -15540
1876 -15540 1119 16690 1462 -15835 -2280 16146 5227 -15329 -6187 14829 8615 -13341
1888 -13341 -9261 12593 11318 -10533 -11473 9919 12995 -7742 -13283 6854 14333 -4969 -14304
1901 -14304 4016 14760 -1975 -15243 835 15105 732 -15646 -2120 15625 4194 -15060
1913 -15060 -5966 14478 7579 -14006 -9302 12192 10175 -10841 -11840 9533 12553 -8318 -13685
1926 -13685 6769 13570 -5202 -14506 3168 14167 -2404 -15021 791 14519 362 -14964
$$ packed form
1839a4269K1270P893k0440r978J9206J2272j8321j4073J7016J6518j5427j8283
1851a6616J3047J9603j0579k0800Q290K2137n972k2150K973K2482j046k2010j745
1864a2386K1955L595k0870n760K0502P917j9724j0081J9212J1521j8527j2894
1876a5540J6659J5571j5228j7297J3555J8426j0919k0556R142K1016o214k1956
1888a3341M080K1854j275k1851r40K1392L076k0737n541K0137P479j9302r335
1901a4304J8320J0744j6735j3268J6078J4270j4373j6378J3526J7745j1431j9254
1913a5060R094K0444o899k1585M704K1494k017k1016r99K1373L020k0871n367
1926a3685K0454O801j8772r304J7674J0999j6571j2617J5812J3728j4157j5326
$$ plain form
1938 -14964 -2628 13907 3301 -15140 -5363 13820 6596 -13812 -8498 11900 9835 -11680 -11511
1951 -11511 9497 11703 -8536 -13295 6891 13500 -5617 -14143 3290 14025 -2374 -14556 621
1964 621 14013 668 -14278 -2140 13851 3185 -14042 -4725 13275 6231 -12774 -7398 12218
1977 12218 9241 -11061 -10323 9815 11280 -8576 -12322 7013 13317 -4845 -13218 4313 14258
1990 14258 -2124 -13623 1157 14197 680 -13615 -1749 13840 3860 -12922 -4173 13132
2002 13132 5959 -12093 -6838 11890 8611 -10631 -9234 10171 10952 -8185 -11446 7713 12787
2015 12787 -5550 -13485 4511 14109 -2292 -13605 1262 13946 247 -13389 -1835 13030
2027 13030 3216 -12442 -4164 12313 5482 -11540 -6355 11018 7605 -10521 -9013 9581 9717
$$ packed form
1938a4964J2336J6535j0606j8441R777J9183p224k0408N314K0398k065k1515J69
1951a1511K1008K206k0239m759K0186O609j9117q526J7433J0735j6399j2182J5177
1964F21J3392j3345j4946J2138J5991j0666j7227R317J8000p044j9005N376J9616
1977A2218k977k0302P38K0138J465j9856l746J9335O304j8162q373J7531R945
1990A4258j6382j1499J4780J3040j3517j4295J1866J5589r980j6782Q749J7305
2002A3132p173j8052N255J8728l279j9242J397J9405P81j9137l261J9159N074
2015A2787j8337p935J7996R598j6401j1313J4867J2684j3699j3636J1554J4865
2027A3030r814j5658Q278J6477o831j7022N185J7373l413j8126J508J8594J36
$$ plain form
2040 9717 -8733 -10920 7324 11830 -6244 -12795 4284 12924 -2853 -13397 866 13391 366
2053 366 -13463 -1819 12841 2884 -12786 -4267 11728 5025 -11360 -6784 10355 6999 -10253
2066 -10253 -8874 8617 9118 -8448 -10458 6858 10725 -6323 -12171 4396 12210 -3622 -13286
2079 -13286 1833 12731 -265 -13350 -1349 12666 2439 -12585 -4206 11655 5039 -11188
2091 -11188 -6626 10495 6806 -9809 -7952 8866 8903 -7985 -9882 6969 10247 -6030 -10995 4942
2105 4942 11274 -3352 -12359 2064 12482 -847 -12031 -493 12327 2274 -11672 -3208 11634
2118 11634 4740 -10409 -5688 10399 6652 -8878 -7147 8768 8637 -7172 -8819 6482 9890
2131 9890 -5494 -9997 4688 10903 -3245 -10553 2359 11851 -586 -11127 -205 12124 2004
$$ packed form
2040I717j8450k187J8244M506j8074o551J7079Q640j5777j0544J4263J2525j3025
2053C66j3829J1644J4660r957j5670Q519J5995o703j6385M576J7139l356j7252
2066a0253J379J7491N01j7566k010J7316L867j7048n848J6567P814j5832r664
2079a3286J5119J0898j2996j3085J2001J4015j0227j5024Q379J5861o616j6227
2091a1188M562J7121l689j6615J857J6818L7j6888j897J6851L278j6277m965J5937
2105D942O332j4626r007J4423J0418j3329j1184J1538J2820j0053j3946Q464J4842
2118A1634o894j5149M721J6087l747j5530J731J5915j31j5809j647J5301L408
2131I890j5384m503J4685O215j4148p308J2912R492j2437j0541J0922J2329j0120
$$ plain form
2144 2004 -11254 -2974 11572 4629 -10053 -5202 9870 6750 -8914 -7177 7996 8182 -7074
2157 -7074 -8840 6302 9540 -5066 -10083 4000 10435 -3459 -10631 2063 10928 -1309 -11330
2170 -11330 118 11297 1274 -11233 -2808 10633 3654 -10499 -5042 9705 6189 -9227 -7052
2183 -7052 7748 7771 -7277 -8695 6109 8795 -5372 -9816 4196 9313 -3599 -10430 2265 10040
2197 10040 -1921 -10773 90 10288 200 -11048 -1808 10385 2823 -10308 -4618 9140 5153
2210 5153 -9140 -6582 7853 7060 -7016 -8297 5936 8406 -5264 -9008 3949 9280 -3787
2223 -3787 -9221 1975 9411 -1367 -9518 459 9717 511 -9889 -1661 9800 2891 -9298 -3642
2237 -3642 9071 4864 -8413 -5472 7913 6978 -6565 -6968 6434 8106 -4836 -8468 4136 9090
$$ packed form
2144B004j3258Q280J4546o943j4682M851J5072l120j5664J737J5173J86j5256
2157g074j766J5142L238j4606n017J4083O435j3894p172J2694Q865j2237j0021
2170a1330J1448J1179j0023j2507Q425J3441o979j4153N457J4747l516j5416K175
2183g052J4800K3j5048j418J4804K686j4167m444J4012N117j2912o831J2695P775
2197A0040j1961q852J0863J0198j0088j1248R240J2193p562j3131N690J3758l987
2210E153j4293K558J4435p93j4076j281J4233K470j3670l744J2957N331j3067
2223c787n434J1196P436j0778q151R977R258r206j0400Q228J1461o909j2189N656
2237c642J2713m207j3277K941J3385r35j3543m03J3402J672j2942l632J2604M954
$$ plain form
2251 9090 -3076 -8745 2326 9923 -762 -9186 791 9347 924 -9081 -1435 9344 2780 -8712
2265 -8712 -2657 8922 4536 -8056 -4981 7808 6403 -7057 -6837 6825 7902 -5360 -8057 4494
2279 4494 8738 -3184 -8588 2607 9151 -1354 -8722 646 8886 339 -8493 -1215 8452 2258
2293 2258 -8129 -2767 8241 3489 -7753 -4508 7289 5297 -6486 -6174 5840 6461 -5279 -7363
2307 -7363 3984 8020 -3406 -8330 2176 7981 -1548 -8561 259 8076 153 -8646 -1735 7857
2321 7857 1910 -7706 -2902 6984 3347 -7625 -4399 6584 4525 -6222 -6060 5621 6554 -5254
2335 -5254 -6882 3821 7372 -3790 -7891 2373 7811 -1658 -8478 222 7900 -75 -8377 -1500
2349 -1500 7378 1605 -7256 -2593 7161 3301 -6914 -3899 6680 4677 -6078 -5165 5657 5622 -4613
$$ packed form
2251I090j2166n669J1071P597j0685q424R977Q556q423j0005P646J0779o564j1492
2265h712O055J1579m386j2592L075J2789j405j3460K20J3662J077j3262k697J2551
2279D494M244j1922n404J1195O544j0505p368R368Q240q547q832P278R667o194
2293B258j0387N362J1008m752j1242L245J1797j992j1783L12J2014O21j1740k084
2307g363J1347M036j1426m924J0506N805r529p013Q820P817p923q799O911R592
2321G857n947r616M804R886l637j0972L226J0983k059j0747J62J1681R33j1808
2335e254j628J0703L551j1162m101J0264N438r469o820Q700P678p975q302O877
2349a500Q878n773q861M663R754l860j0215L015J0579k003j0755R13J0822l5j0235
$$ plain form
2364 -4613 -6018 4159 6971 -3374 -7081 2908 7494 -1630 -7475 815 8033 -162 -7483 -497
2378 -497 7772 1827 -6805 -2222 6676 3220 -6503 -3260 6183 4242 -5399 -4708 5016 5310 -4476 -5273
2394 -5273 4389 6552 -2767 -6539 2620 7343 -1546 -6927 1188 7495 -86 -6933 -474 7241 1643
2409 1643 -6716 -2026 6660 2994 -6113 -3450 5962 3956 -5149 -4572 4914 4880 -4287 -5322 3434 5948
2425 5948 -2915 -5975 2410 6148 -1760 -6771 1239 6417 -416 -6992 -404 6584 1065 -6629 -2287
2440 -2287 5998 2358 -5947 -3404 5520 3638 -5152 -3987 4460 4667 -4185 -5327 3375 5214 -2898
2455 -2898 -5673 1904 5728 -2124 -6539 1081 5938 -914 -6413 -389 5858 182 -6110 -1792 5560
2470 5560 1973 -5932 -3097 5011 3644 -5013 -3970 4077 4412 -3704 -4572 3005 4832 -2821 -5057
$$ packed form
2364d613j405J0177K812j0345l707R989M586r124n845Q290P218q195p321O986
2378d97Q269n945q632M583Q898l456r723L243R443j941r641O91R724K94r786p97
2394e273R662K163r319l772R159M723q889n381Q115O307p581o847O459P715n598
2409A643q359M690Q686l666r107K663R412k006r105N77R486l4r167j035Q756K514
2425E948q863l060Q385L738p908n011Q010N178o833o576O588O988n519p694M342
2440b287Q285l640q305K543Q924j882q790J165Q447K07q852j142Q702J839q112
2455b898k775P577L824p852m415P620M857o852n499O024O247n676o292M318P352
2470E560l587p905K835Q108j367q657J043Q047L35q116q68P577J827p653k236
$$ plain form
2485 -5057 2098 5323 -1549 -5460 1343 5811 -520 -5952 52 5593 695 -5465 -1026 5562 1962
2500 1962 -4935 -2267 4812 3014 -4309 -3276 3909 4022 -3321 -3921 3421 4821 -2624 -4585 2239
2515 2239 5141 -1426 -4994 1305 5407 -329 -4790 528 5052 951 -4928 -713 5005 1504 -4529
2530 -4529 -1936 4697 2812 -3658 -2910 3964 3753 -3324 -3683 3235 4068 -2332 -4191 2143 4497 -1438
2546 -1438 -4826 1098 4716 -659 -4689 239 4668 42 -4325 -888 4299 976 -4480 -1747 3970
2561 3970 2032 -4070 -2986 3470 2910 -3328 -3645 2712 3447 -2337 -3876 1303 3705 -1650 -4370 879
2577 879 4152 -719 -4336 -204 4026 -105 -4321 -831 4055 911 -3712 -1446 3496 1660 -3693
2592 -3693 -2338 2932 2301 -2834 -3294 2680 3031 -2663 -3392 1428 3556 -1591 -3762 1113 3715 -915
$$ packed form
2485e057P155L225o872l911O803M468o331n432O004N541m898o160M439O588l600
2500A962o897K668P079j798p323J033P185J13p343o00P342J400p445j961O824
2515B239K902o567l568O299M102n736m461N318M524m101n879M215N718l501o033
2530d529K593O633j885o470P48O874k11p077l59O918Q33o400j859O334K354n935
2546a438l388N924L618n375m030M928M429m626m367L437N187l323n456K733N717
2561C970j938o102J084O456n60o238l17O357P35n784j539N179K402n355k720N249
2577H79L273m871l617M132M230m131m216L490M886l144m623K266M942j836n353
2592c693J355N270o31n135m60N974L51n694p29M820K128n147k171M875K602m630
$$ plain form
2608 -915 -3785 153 3732 -194 -3769 -408 3872 757 -3349 -1588 3279 1611 -3099 -1760 2811
2623 2811 2155 -2702 -2463 2565 2975 -2237 -3029 1905 3015 -1103 -3036 938 3402 -829 -3104 692
2639 692 3457 333 -3093 -194 3457 899 -3040 -834 3315 1290 -2460 -1485 2963 1834 -2380
2654 -2380 -1985 2161 2621 -1867 -2214 1731 3029 -1060 -2681 894 3322 -700 -2794 630 2737 -39
2670 -39 -2690 32 3019 628 -2694 -676 2394 961 -2639 -1241 2297 1403 -2204 -1784 2150 1733
2686 1733 -1297 -2265 1495 2238 -1403 -2356 794 2362 -969 -2532 657 2592 -472 -2545 114 2562
2702 2562 13 -2726 -566 2424 543 -2680 -1225 1895 1166 -2192 -1781 1761 1436 -1957 -2011 1436
2718 1436 1835 -1528 -2045 907 1663 -1033 -2340 397 2286 -582 -2327 -164 1917 -75 -2460 -361
$$ packed form
2608i15k870L938L579l926l575L361M280l115m106J761M867j668m710J339M571
2623B811o56m857K39N028M10n212p92M934J110m118j933L974K464m231k275L796
2639F92K765l124l426K899L651k558l939K206M149k025l750R75M448j129m214
2654b380L95M146M60m488l47L945J298m089j621L575K428m022k094L424K107k776
2670c9k651K722K987k391l322K018L070j433l600J398L538q94l607M20L934m17
2686A733l030r68L760P43l641r53L150J568l331j563L189J935l064k073K659K448
2702B562k549k739K160K990j881l223J455L120p29l358M11L542l25l393n4L447
2718A436L99l363n17K952P56k696j307K737J889k868j745K163K081j992k385K099
$$ plain form
2734 -361 1567 374 -1973 -883 1933 834 -2066 -1114 1451 1133 -1747 -1304 1148 1314 -1230 -1551
2750 -1551 946 1737 -690 -1729 793 1823 -122 -1810 399 2146 185 -1576 229 2145 10
2765 10 -1318 -24 1781 534 -1634 -376 1869 1153 -1290 -925 1469 1155 -873 -999 1359 1276 -668
2782 -668 -1187 791 1247 -630 -1481 525 1531 -380 -1223 -41 1659 85 -1223 -172 1700 464
2798 464 -1367 -335 982 431 -1146 -465 964 862 -863 -932 1028 1061 -835 -1106 585 1165 -1061
2815 -1061 -995 471 797 -106 -1252 -76 721 -189 -1321 -268 1027 -64 -1681 147 1168 209 -1311
2832 -1311 -275 1101 105 -1275 -722 993 361 -1128 -586 716 740 -987 -1301 313 547 -519 -951
2849 -951 403 789 -532 -1068 158 633 -401 -1212 -192 522 -525 -1050 47 1029 -158 -1004 -230
$$ packed form
2734c61J928j193k347J090K816j099k900R52K565l18k880M43K452J66k544l21
2750a551K497P91k427j039K522J030j945j688K209J747j961j761J805J916k135
2765A0j328J294J805j247k168J258K245p16k443L65K394l14k028j26K358q3j944
2782f68n19J978M56j877q51K006J006j911q43J182J700j574j308J051J872j236
2798D64j831J032J317n51j577O81J429j02j725o9J960L3j896k71J691N80k226
2815a061O6J466L26r03j146J176P97r10j132J053J295j091j617J828J021r59j520
2832a311J036J376r96j380N53J715o32j489N42J302K4j727l14J614K34j066m32
2849i51J354L86j321n36J226M75j034q11J020P14j047n25J097R82j187q46P74
$$ plain form
2866 -230 1159 -95 -1214 -308 937 409 -996 -701 822 472 -672 -881 716 744 -609 -566 430 572
2884 572 -396 -947 581 421 -277 -539 566 885 -274 -693 558 769 -111 -812 516 1199 -179 -746
2902 -746 105 1033 539 -516 -365 1014 724 -654 -177 797 642 -612 -495 772 429 -509 -325 672
2920 672 633 -622 -639 587 687 -51 -599 594 885 -409 -797 483 973 -182 -1019 -18 737 332
2938 332 -933 -18 667 269 -875 -424 924 442 -708 -355 629 416 -609 -715 667 295 -818 -1073
2956 -1073 551 902 -742 -957 410 1158 -487 -1461 -73 968 -400 -1418 -318 1001 67 -1437
2972 -1437 7 1186 327 -1385 -797 1082 605 -1163 -533 972 530 -1189 -644 1041 669 -1053 -753
2989 -753 897 1068 -1121 -1360 583 1224 -536 -1419 312 1268 -167 -1348 -78 1358 -22 -1069
$$ packed form
2866b30J389j254j119R06J245n28j405K95J523l50j144k09J597K8j353M3R96J42
2884E72r68n51J528j60o98k62J105L19j159m19J251K11q80p01J328O83j378n67
2902g46Q51R28m94j055J51J379k90j378M77R74j55j254J17J267l43r38J84R97
2920F72l9j255j7J226J00p38n48J193K91j294l88J280M90j155q37J001P55m05
2938C32j265R15O85l98j144M51J348m82j150L53R84k13j025j06J382l72j113k55
2956a073J624L51j644k15J367P48j645r74J388J041j368j018J100J319r34j504
2972a437J444J179q59j712N88J879m77j768O30J505m42j719N45J685l72j722L00
2989g53J650J71k189k39J943O41j760q83J731R56j435j181J270J436j380j047
$$ plain form
3005 -1069 -195 1516 539 -1289 -327 1438 910 -892 -551 1150 644 -1049 -1025 1374 1171 -789 -999
3022 -999 1068 1559 -626 -1400 419 1578 -111 -1611 51 1909 135 -1719 -73 1810 871 -1151
3038 -1151 -205 1599 923 -1324 -559 1629 973 -1207 -599 1499 1086 -1054 -1204 1332 1496 -807 -1453
3055 -1453 715 1931 -516 -1663 588 1955 -221 -1800 -246 2150 284 -1663 -563 1498 619
3070 619 -1541 -804 1596 791 -1385 -1117 1282 1049 -1350 -1395 1223 1588 -1252 -1727 954 1668 -861
3087 -861 -1923 598 1718 -501 -2160 96 1861 126 -1989 -663 1985 560 -2127 -1118 1595
3102 1595 874 -1799 -1117 1575 964 -1608 -1338 1396 1479 -1308 -1794 1217 1430 -1258 -1784 625 2052
3119 2052 -583 -2227 92 2268 -373 -2397 -294 2596 237 -2046 -776 1935 878 -1823 -1313
$$ packed form
3005a069Q74J711r77j828R62J765n28j802L41J701n06j693K4K399k03j960k10
3022i99K067M91k185p74J819J159j689j500J662J858j774j854J646J883r39k022
3038a151R46J804o76k247P65K188o56k180O08K098m13k140j50K536J64k303o46
3055a453K168J216k447j147K251J367k176j579J554K396j866j947J100K061q79
3070F19k160P37K400q05k176K68K399k33k399m5K618L65k840m75K681P14k529
3087h61j062K521J120k219j659K256J765j735k115J326K648j425k687J009K713
3102A595p21k673O82K692o11k572K70K734Q3k787m86L011K13k688n26K409J427
3119B052k635j644K319K176k641k024K103K890k359k283J270K711j057k701N10
$$ plain form
3134 -1313 1888 1355 -1777 -1242 1476 1600 -1568 -1763 1293 1999 -1273 -1966 1033 2624 -911 -2382
3150 -2382 516 2421 -241 -2435 -122 2655 557 -2191 -623 2646 816 -1982 -1045 2334 1724
3165 1724 -1498 -1591 1881 1810 -1185 -1596 1459 1956 -1260 -2099 929 2303 -736 -2156 907 2489 -488
3182 -488 -2555 314 2590 410 -2589 -465 2696 1082 -2712 -1014 2470 1500 -2180 -1810 2047 1611
3198 1611 -1520 -1840 1345 2112 -1031 -2328 681 2221 -983 -2522 560 2576 -333 -2760 91
3213 91 2581 -13 -3099 -747 2477 321 -2888 -953 2531 1621 -2700 -1814 2121 1976 -2060 -2145 1752
3230 1752 2157 -1234 -2611 855 2278 -1333 -2742 779 2453 -493 -2600 275 2530 -201 -2768
3245 -2768 -766 3108 422 -2852 -1107 2948 1181 -2803 -1910 2505 2231 -2340 -2295 1855 2521 -1658
$$ packed form
3134a313L201n33l132N35K718J24l168j95L056P06l272o93K999J591l535j471
3150b382K898J905k662k194K313K777k098k748J568L269j830k798R37L379o10
3165A724l222r3L472p1k995m11L055M97l216q39L028J374l039j420L063J582k977
3182d88k067K869K276k180k999K124L161j614l794J698L484r70l680L70L857m36
3198A611l131l20L185P67l143j297L009J540l204j539L082K016k909k427K851
3213I1K490k594l086K352L224k156l209J935L484r10m321Q86L935j45m036q5L897
3230A752M05l391j377L466J423l611j409L521J674k946k107K875K255k731k567
3245b768K002L874k686l274J745M055j767l984Q93M415k74m571M5M150O66m179
$$ plain form
3261 -1658 -2700 1331 2506 -909 -2639 621 2745 -499 -2784 272 2904 -245 -2677 -319 2727
3276 2727 627 -2827 -746 2787 1227 -2487 -1078 2648 2367 -2112 -2159 2126 2715 -1629 -2456 1570
3292 1570 3077 -1127 -2640 810 3048 -347 -2822 52 3088 77 -2956 -152 3253 695 -2714
3307 -2714 -656 3076 971 -2726 -1622 2816 1906 -2618 -2389 2456 2406 -1895 -2405 1654 2774 -1317
3323 -1317 -3063 866 2954 -821 -3137 121 3018 83 -3128 -476 2778 520 -3014 -738 3101
3338 3101 955 -2880 -1602 2764 1644 -2735 -2418 2201 2332 -2550 -2522 2038 2853 -1587 -3419 870
3354 870 3119 -783 -3306 208 2919 -79 -3273 -568 3139 336 -3177 -944 2845 1169 -3189
3369 -3189 -1355 3083 1529 -2683 -2045 2241 2159 -2546 -2734 2031 3024 -1907 -3109 1426 3159 -930
$$ packed form
3261a658j042M031J175l415j730L260K124l244k285L056K632l149k432K358L046
3276B727k100l454K081L533j560l714J409L726k81m479m7M285N89m344q27M026
3292A570J507m204j513L450K238l395k475K874L036l011l033K804L405k558l409
3307b714K058L732k105l697J104M438r10m524K29M845n0m301n10M059J120m091
3323a317j746L929K088l775k316L258K897k935l211K652L254k258l534K276L839
3338C101k146l835J278M366j120m379L17M619J31m882K8M560Q15m440j832M289
3354H70K249l902k523L514K711k998l194K705L707k803l513K233L789j676m358
3369c189J834M438j554m212O38M286q2m705j88M765R93m931j202M535J733m089
$$ plain form
3385 -930 -3343 799 3270 228 -3577 -321 3265 527 -3282 -598 3086 932 -2815 -1204 2710
3400 2710 1857 -2706 -1703 2612 2219 -2138 -2417 2292 2906 -1627 -3021 1742 3095 -1339 -3326 838
3416 838 3501 -389 -3551 -210 3517 794 -3189 -1079 3140 1348 -3217 -1465 2891 1953 -2386
3431 -2386 -2048 2406 2327 -2196 -2194 2418 2871 -1873 -2905 1695 3295 -1396 -3148 981 3816 -168 -3447
3448 -3447 249 3841 538 -3542 -906 3499 1329 -3030 -1755 3408 1770 -2962 -2318 2705 2142
3463 2142 -2560 -2644 1965 2856 -1895 -2741 1485 3056 -1454 -3624 1017 3370 -919 -3717 195 3684
3479 3684 258 -3847 -821 3231 1137 -3679 -1743 3542 1793 -2984 -2467 2796 2614 -2502 -2799 2084
3495 2084 2538 -2072 -3111 1539 3135 -1304 -3066 1152 3330 -513 -3591 640 3405 372 -3514
$$ packed form
3385i30k413M142K471l042l805L256L586k738l809K684L684k154l747J611L914
3400B710q53m563J003M315l93m357k79M709O14m533j394M763J353m434j987M164
3416H38K663l890l162L341L727k723l983K110M219j792m565J752M356r38m339
3431b386L38M454p9m523KM612M53m744j032M600J600m691j752M129K835l984l279
3448c447L696L592l303m080K636M405k170m359J275N163j638m732O44N023n63
3463B142m702q4M609Q91m751q46M226J571m510k170M641K353m289k798L912L489
3479C684l426m105L026M052k094m816J936N285j749m777N17N263j82n116k97M883
3495B084M54m610j039M650J596m439j762M218K178l843l078M231K765l033l886
$$ plain form
3510 -3514 -438 3665 779 -3702 -1608 3427 2135 -3021 -2357 2824 2528 -2447 -2666 2049 2782 -1603
3526 -1603 -3036 1425 3103 -1408 -2984 1041 3450 -643 -3242 240 3809 -48 -3733 -138 3626
3541 3626 731 -3682 -1295 3663 1673 -3430 -1916 3145 2475 -2633 -2655 2188 2966 -1857 -2960 1988
3557 1988 3147 -1133 -3229 1173 3530 -514 -3732 584 3806 424 -3515 -495 3249 662 -3664
3572 -3664 -1246 3444 2079 -3361 -1954 2946 2266 -2654 -2918 2506 2923 -1969 -3100 1688 3065 -1116
3588 -1116 -3470 806 3290 -682 -3337 373 3497 -205 -3660 -445 3477 786 -3583 -1840 3191
3603 3191 1376 -3643 -1859 2921 2008 -2965 -2700 2143 2808 -2251 -3265 1615 3416 -1457 -3391 903
3619 903 3195 -602 -3780 44 3020 -150 -3824 -134 3218 702 -3308 -1088 3041 1409 -3275
$$ packed form
3510c514L076M103k886m481K094N035j292n156O64N181k96m975k19M715P33m385
3526a603j433M461J678m511j576M025K409m093k599L482L569l857l685L595L764
3541C626k895m413K387M958j990n103J514N061o70n108k2M843P78m823j103M948
3557A988J159m280k096M402K357m044l218M316L222l382l939L020L744k587m326
3572c664K418M690j365n440J407M900o80m920k64N424M17m892j131M788J377m181
3588a116k354M276K484l972k655L710L124l702l455L215L922k691m369J743N031
3603C191j815n019J784M780r13m973K65M843O65n059j014M880J801m873j934M294
3619I03K292l797l178L824K976l170l674L690L352k516m010K220M129j632m684
$$ plain form
3634 -3275 -2041 3109 2235 -2755 -2535 2461 2684 -2437 -3162 1699 3307 -1183 -3452 1054 3599 -718
3650 -718 -3941 122 3521 339 -3672 -858 3623 1028 -3650 -982 3485 1520 -2897 -1778 3194
3665 3194 2206 -2684 -2108 2666 3020 -2031 -2967 2098 3048 -1487 -3420 1297 3788 -654 -3535 535
3681 535 3839 230 -3548 -318 3606 757 -3199 -842 3267 1503 -2756 -1672 2944 2168 -2728
3696 -2728 -2013 2656 2560 -2288 -2741 1958 3196 -1446 -3055 1381 3615 -769 -3803 231 3794 -248
3712 -248 -3572 -573 3507 866 -3515 -1219 3048 1653 -3325 -1809 2868 1737 -2566 -2345 2116
3727 2116 2557 -2108 -2944 1734 2583 -1723 -3252 1168 3664 -1036 -3776 756 3557 -324 -4033 -184
3743 -184 3616 420 -3276 -1240 3201 1351 -3087 -1979 2573 2082 -2632 -2608 2683 2302 -2278 -2864
$$ packed form
3634c275J234N150q74m990K20M996K23n121p25M861J608m490k269M506K545m317
3650g18l223M063L399l182m011K814M481k595m678K668M467j965m417J119M972
3665C194r88m890N76M774L54n051r36N065R50m535j933M717K491m442k881M070
3681E35L304l609l778L230L924k849l956K357M109j764m259J084M616p76m896
3696b728P15M669r6m848m53M699J238m642j609M436K234m384l034M034L563m042
3712b48l324K999M080k641m381K296M267j395m978J516M677j131m303K21M461
3727B116M41m665q36M678Q49m306j529M420K496m700k740M532K801l881l709L849
3743a84L800l196l696K036M441j850m438J108M552m91m714K4N291l81m580n86
$$ plain form
3759 -2864 1882 2670 -2000 -3041 1093 3192 -975 -3520 522 3531 -312 -3665 -387 3460 680
3774 680 -3345 -1052 3222 1511 -3208 -1638 3008 2104 -2481 -1989 2340 2675 -1996 -2584 1812 2669
3790 2669 -1319 -3014 1218 3240 -781 -3325 826 3430 -81 -3298 381 3614 772 -3188 -891
3805 -891 3637 1511 -3118 -1793 2980 2268 -2495 -2359 2474 2475 -2064 -2561 2128 2875 -1334 -2982 1184
3822 1184 3371 -1004 -2922 536 3284 -478 -3326 36 3358 688 -3535 -692 3094 1151 -3185
3837 -3185 -1429 3059 1863 -2661 -2486 2358 2407 -2087 -3120 1916 2612 -1399 -2950 1321 3101 -845
3853 -845 -2986 716 3258 -563 -3292 -47 3283 27 -3065 -673 3314 1225 -3180 -1102 2703
3868 2703 1895 -2727 -2330 2207 2347 -2294 -2594 1941 2441 -1729 -3138 956 2970 -810 -3054 152
$$ packed form
3759b864M746P88m670j041M134K099m167k545M042L009l843l353L278L847k780
3774F80m025K293M274j711m719J570M646r04m585M92M329L35m671n88M396Q57
3790B669l988j695M232K022m021k544M151K604l511l217L679L233k842l960K297
3805h91M528k126m629J325M773p12m763J36M833Jm539m97M689P47m209j648M166
3822A184K187m375j918L458K748l762k848L362L322k670m223K843L786j943m336
3837c185J756M488j196m524J75M844M9m494j033N036O96m011j551M271J780l946
3853h45k141L702K542l821k729L245L330l256l092K392L987k089m405K078L805
3868B703q08m622L97M537J40m641l00M535N00m170j409M094K014l780k244L206
$$ plain form
3884 152 3208 -466 -3214 -104 2821 208 -3450 -473 3282 928 -3133 -1302 2733 1477 -2793
3899 -2793 -2234 2500 2085 -2139 -2612 2055 2689 -1564 -3161 1253 3013 -647 -3175 465 3353 -247
3915 -247 -3189 -73 3185 554 -2589 -774 2935 1088 -2753 -1223 2976 1486 -2692 -1737 2760
3930 2760 2192 -2322 -2224 2116 2830 -1891 -2558 1309 3279 -753 -2870 879 3170 71 -3108 273
3946 273 3086 388 -2970 -561 3143 1072 -2623 -1200 2695 1496 -2654 -1739 2591 2120 -2419 -2338
3962 -2338 1775 2534 -1548 -2789 1390 2855 -1048 -3077 559 2943 -329 -3386 -157 3206 278
3977 278 -3013 -796 2957 757 -2759 -1281 2438 1236 -2630 -1935 2195 1743 -2259 -2330 1575 2153
3993 2153 -1723 -2799 1258 2821 -884 -3360 818 2940 -495 -2973 19 2743 205 -2986 -946
$$ packed form
3884A52L056l674k748L110K925k613l658K977L755k354m061J831M035j256m270
3899b793N59M734m15m224m73M667O34m253j597M414J760l660k528L640K888l600
3915b47k942L116L258k631l143J815L709j847l841J530M199j490m178R55M497
3930B760n68m514R8M340P14m721o67L867J970m032k117L749K291l099l179L381
3946B73K813k698l358K409L704k071l695J423L895j199m150R15M330m71m539Q1
3962b338M113P59m082j241M179J465l903k029L636K384l272l057L229L363k928
3977B78l291K217L753k200l516J478L719j202l866O95M130m52m002p1L905N78
3993B153l876j076M057J563l705k476M178K122l435k478K992K724k538l191K040
$$ plain form
4008 -946 3024 1069 -2555 -1272 2483 1395 -2170 -1714 1809 1805 -1709 -2309 1917 2143 -1756 -2554 1021
4025 1021 2520 -1082 -2813 639 2852 -498 -2908 -32 3006 288 -2743 -521 2895 779 -2741
4040 -2741 -1136 2575 1525 -2182 -1456 2155 1792 -1707 -2170 1784 2534 -1140 -2125 1160 2658 -955
4056 -955 -2581 907 2902 -309 -2585 281 2957 390 -2633 -635 2855 1012 -2511 -1001 2795
4071 2795 1518 -2249 -1550 2116 2083 -1846 -1918 1333 2039 -1586 -1992 1401 2659 -819 -2766 751 2427
4088 2427 -271 -2594 364 2635 167 -2695 -648 2628 913 -2473 -908 2387 1174 -2223 -1579
4103 -1579 1863 1763 -1864 -1742 2001 1927 -1650 -2252 1069 2165 -962 -2453 664 2477 -619 -2471
4119 -2471 421 2268 112 -2159 -371 2204 750 -2392 -958 2362 1167 -2366 -1187 2151 1569
$$ packed form
4008i46L970j955l624J283L755j088l565M56L523ml514o00M226K26l899p98L575
4025A021J499l602j731L452K213l350k410K876L038k718l031K222L416k116l520
4040b741J605L711j050l707P26L611l63l499m63L954P50l674r85L285J498l613
4056i55j626L488J995l211k276K866K676k567l023J998L490j843l523J510L796
4071B795j277l767O99L666l3l929p2L251P06l625m06L393J258l478j947L517J676
4088B427k698k323K958K271k468k862K047L276j715l386J565L295j213l397O44
4103a579L442j00l627J22L743p4l577o02L321J096l127j491L117J813l096j852
4119b471K892J847k156k271J788K575j454l142J434L320j195l533J179L338n82
$$ [...]
8191d58
##END NTUPLES=NMR FID
##END=
