##TITLE=1H_ABBC0204
 CDCl3
 8 sc, 
 3.4.2024
##JCAMPDX= 6.0         $$ Bruker NMR JCAMP-DX V2.0
##DATA TYPE= NMR FID
##DATA CLASS= NTUPLES
##ORIGIN= UXNMR, Bruker Analytische Messtechnik GmbH
##OWNER= root
$$ XWIN-NMR		Version 3.5
$$ Wed Apr  3 13:48:50 2024 Russian Standard Time (UT+4h)  she@DPX200
##.OBSERVE FREQUENCY= 200.1309
##.OBSERVE NUCLEUS= ^1H
##.DELAY= (6, 6)
##.ACQUISITION MODE= SIMULTANEOUS
##.ACQUISITION SCHEME= undefined
##.AVERAGES= 8
##.DIGITISER RES= 18
##SPECTROMETER/DATA SYSTEM= spect
##.PULSE SEQUENCE= zg30
##.SOLVENT NAME= MeOD
##.SHIFT REFERENCE= (INTERNAL, MeOD, 0, 15.7039)
##AUDIT TRAIL= $$ (NUMBER, WHEN, WHO, WHERE, WHAT)
$$ ##TITLE= Audit trail, XWIN-NMR		Version 3.5
$$ ##JCAMPDX= 5.01
$$ ##ORIGIN= Bruker BioSpin GmbH
$$ ##OWNER= she
$$ F:/spectra/data/she/nmr/H-F/1/audita.txt
$$ ##AUDIT TRAIL=  $$ (NUMBER, WHEN, WHO, WHERE, WHAT)
(   1,<2024-04-03 13:46:34.15 +0400>,<she>,<DPX200>,
      <created by zg, POWCHK disabled, PULCHK disabled
       configuration hash MD5:
       00 E9 B6 7A A2 85 ED C7 34 08 36 98 17 FE 4E 26
       data hash MD5: 16K
       12 2B 14 1D 3E 45 91 2A 2B 9B F7 40 62 12 8B 51>)
$$ ##END=
$$ 
$$ hash MD5
$$ E6 21 04 D2 56 79 13 26 FB 7E 97 86 C6 BD 99 53
##$RELAX= 
##$RELAX= 
##$RELAX= 
##$RELAX= 
##$RELAX= 
##$RELAX= 
$$ Bruker specific parameters
$$ --------------------------
##$DU= <F:/spectra>
##$EXPNO= 1
##$NAME= <H-F>
##$PROCNO= 1
##$TYPE= <nmr>
##$USER= <she>
##$AMP= (0..31)
100 100 100 100 100 100 100 100 100 100 100 100 100 100 100 100 100 100 
100 100 100 100 100 100 100 100 100 100 100 100 100 100 
##$AQSEQ= 0
##$AQ_mod= 1
##$AUNM= <au_zg>
##$AUTOPOS= <>
##$BF1= 200.13
##$BF2= 200.13
##$BF3= 200.13
##$BF4= 200.13
##$BF5= 200.13
##$BF6= 200.13
##$BF7= 200.13
##$BF8= 200.13
##$BYTORDA= 1
##$CFDGTYP= 0
##$CFRGTYP= 5
##$CHEMSTR= <none>
##$CNST= (0..31)
1 1 145 1 1 1 1 1 1 1 1 1 1 1 1 1 1 1 1 1 1 1 1 1 1 1 1 1 1 1 1 1 
##$CPDPRG= <>
##$CPDPRG1= <>
##$CPDPRG2= <>
##$CPDPRG3= <>
##$CPDPRG4= <mlev>
##$CPDPRG5= <mlev>
##$CPDPRG6= <mlev>
##$CPDPRG7= <mlev>
##$CPDPRG8= <mlev>
##$CPDPRGB= <>
##$CPDPRGT= <>
##$D= (0..31)
0 1.2 0 0 0 0 0 0 0 0.06 0 0.03 0 0 0 0 0.0002 0 0 0 0 0 0 0 0 0 0 0 0 
0 0 0 
##$DATE= 1712137593
##$DBL= (0..7)
120 120 120 120 120 120 120 120 
##$DBP= (0..7)
150 150 150 150 150 150 150 150 
##$DBP07= 0
##$DBPNAM0= <>
##$DBPNAM1= <>
##$DBPNAM2= <>
##$DBPNAM3= <>
##$DBPNAM4= <>
##$DBPNAM5= <>
##$DBPNAM6= <>
##$DBPNAM7= <>
##$DBPOAL= (0..7)
0.5 0.5 0.5 0.5 0.5 0.5 0.5 0.5 
##$DBPOFFS= (0..7)
0 0 0 0 0 0 0 0 
##$DE= 6
##$DECBNUC= <off>
##$DECIM= 32
##$DECNUC= <off>
##$DECSTAT= 4
##$DIGMOD= 1
##$DIGTYP= 9
##$DL= (0..7)
0 120 120 120 120 120 120 120 
##$DP= (0..7)
150 150 150 150 150 150 150 150 
##$DP07= 0
##$DPNAME0= <>
##$DPNAME1= <>
##$DPNAME2= <>
##$DPNAME3= <>
##$DPNAME4= <>
##$DPNAME5= <>
##$DPNAME6= <>
##$DPNAME7= <>
##$DPOAL= (0..7)
0.5 0.5 0.5 0.5 0.5 0.5 0.5 0.5 
##$DPOFFS= (0..7)
0 0 0 0 0 0 0 0 
##$DQDMODE= 0
##$DR= 18
##$DS= 0
##$DSLIST= <SSSSSSSSSSSSSSS>
$$ [...]
##$SUBNAM2= <"">
##$SUBNAM3= <"">
##$SUBNAM4= <"">
##$SUBNAM5= <"">
##$SUBNAM6= <"">
##$SUBNAM7= <"">
##$SUBNAM8= <"">
##$SUBNAM9= <"">
##$SW= 18.0517689322627
##$SWIBOX= (0..15)
0 0 2 0 0 0 0 0 0 0 0 0 0 0 0 0 
##$SW_h= 3612.71676300578
##$TD= 16384
##$TD0= 1
##$TE= 0
##$TE2= 300
##$TE3= 300
##$TEG= 300
##$TL= (0..7)
0 120 120 120 120 120 120 120 
##$TP= (0..7)
150 150 150 150 150 150 150 150 
##$TP07= 0
##$TPNAME0= <>
##$TPNAME1= <>
##$TPNAME2= <>
##$TPNAME3= <>
##$TPNAME4= <>
##$TPNAME5= <>
##$TPNAME6= <>
##$TPNAME7= <>
##$TPOAL= (0..7)
0.5 0.5 0.5 0.5 0.5 0.5 0.5 0.5 
##$TPOFFS= (0..7)
0 0 0 0 0 0 0 0 
##$TUNHIN= 0
##$TUNHOUT= 0
##$TUNXOUT= 0
##$USERA1= <user>
##$USERA2= <user>
##$USERA3= <user>
##$USERA4= <user>
##$USERA5= <user>
##$V9= 5
##$VALIST= <valist>
##$VCLIST= <CCCCCCCCCCCCCCC>
##$VD= 0
##$VDLIST= <DDDDDDDDDDDDDDD>
##$VPLIST= <PPPPPPPPPPPPPPP>
##$VTLIST= <TTTTTTTTTTTTTTT>
##$WBST= 1024
##$WBSW= 4
##$XGAIN= (0..3)
0 0 0 0 
##$XL= 0
##$YL= 0
##$YMAX_a= 669394
##$YMIN_a= -715706
##$ZGOPTNS= <>
##$ZL1= 120
##$ZL2= 120
##$ZL3= 120
##$ZL4= 120
##$ABSF1= 10
##$ABSF2= 0
##$ABSG= 5
##$ABSL= 3
##$ALPHA= 0
##$AQORDER= 0
##$ASSFAC= 0
##$ASSFACI= 0
##$ASSFACX= 0
##$ASSWID= 0
##$AUNMP= <proc_1d>
##$AZFE= 0.1
##$AZFW= 0.1
##$BCFW= 1
##$BC_mod= 2
##$BYTORDP= 1
##$COROFFS= 0
##$CY= 11.3945322036743
##$DATMOD= 1
##$DC= 2
##$DFILT= <>
##$DTYPP= 0
##$F1P= 15.7292609196834
##$F2P= 12.9074282941183
##$FCOR= 0.5
##$FTSIZE= 0
##$FT_mod= 4
##$GAMMA= 1
##$GB= 0.15
##$INTBC= 1
##$INTSCL= 1
##$ISEN= 128
##$LB= 0.24
##$LEV0= 0
##$LPBIN= 0
##$MAXI= 10000
##$MC2= 0
##$MEAN= 0
##$ME_mod= 0
##$MI= 1.114404
##$NCOEF= 0
##$NC_proc= 0
##$NLEV= 6
##$NOISF1= 3.799351
##$NOISF2= 2.8
##$NSP= 1
##$NTH_PI= 0
##$NZP= 0
##$OFFSET= 15.70392
##$PC= 1
##$PHC0= -25299.92
##$PHC1= 12.78731
##$PH_mod= 1
##$PKNL= yes
##$PPARMOD= 0
##$PSCAL= 0
##$PSIGN= 0
##$REVERSE= no
##$SF= 200.130013532006
##$SI= 16384
##$SIGF1= 3
##$SIGF2= 2
##$SINO= 400
##$SIOLD= 16384
##$SREGLST= <1H.CDCl3>
##$SSB= 0
##$STSI= 0
##$STSR= 0
##$SW_p= 3612.71676300578
##$SYMM= 0
##$S_DEV= 0
##$TDeff= 0
##$TDoff= 0
##$TI= <>
##$TILT= no
##$TM1= 0
##$TM2= 0
##$TOPLEV= 0
##$USERP1= <user>
##$USERP2= <user>
##$USERP3= <user>
##$USERP4= <user>
##$USERP5= <user>
##$WDW= 1
##$XDIM= 8192
##$YMAX_p= 0
##$YMIN_p= 0
$$ End of Bruker specific parameters
$$ ---------------------------------
##NTUPLES= NMR FID
##VAR_NAME=  TIME,          FID/REAL,        FID/IMAG
##SYMBOL=    X,             R,               I
##VAR_TYPE=  INDEPENDENT,   DEPENDENT,       DEPENDENT
##VAR_FORM=  AFFN,          ASDF,            ASDF
##VAR_DIM=   8192,          8192,            8192
##UNITS=     SECONDS,       ARBITRARY UNITS, ARBITRARY UNITS
##FACTOR=    0.0002768,     1,               1
##FIRST=     0,             0,               0
##LAST=      2.2672688,     0,               0
##MIN=       0,             -715706,         0
##MAX=       2.2672688,     669394,          0
$$ Real data points
##PAGE= N=1
##DATA TABLE= (X++(R..R)), XYDATA
0 0 0 0 0 0 0 0 0 0 0 0 0 0 0 0 0 -2 0 0 0 -1 4 -2 0 -1 4 -4 4 -2 2 -4 4 2 -2 2 -2 2 -7 8 -10 12 -17 19 -24 25 -29 36 -42 47 -51 56
50 56 -64 69 -74 77 -81 84 -81 73 -60 36 5 -77 199 -401 762 -1451 2901 -6493 18608 -126102
70 -126102 -715706 173475 482171 -619170 -369447 659745 39285 -602580 390067 594947
80 594947 -485849 -239726 641185 -94250 -685472 276485 413186 -572676 -196918 658036
90 658036 -59361 -541710 398969 422309 -548418 -158675 588325 -164244 -557763 375471
100 375471 348460 -542583 -84908 593155 -169199 -485375 412916 304764 -533279 -35880
110 -35880 559458 -215127 -451424 411778 228658 -550265 -8480 514313 -250931 -389905
120 -389905 453127 212724 -501715 63701 488740 -292601 -372623 417548 120744 -513616
130 -513616 94135 462768 -280421 -276194 463131 109300 -471045 121665 389002 -339938
140 -339938 -273641 414417 42270 -438676 174796 378957 -310750 -191462 419370 -2413
150 -2413 -425047 173777 302902 -345518 -158401 408831 -26279 -369893 226256 285384
160 285384 -338154 -114089 386243 -77477 -357880 232348 235845 -343071 -69106 376951
170 376951 -102504 -319243 253742 193735 -346540 -34029 352329 -137456 -285821 269695
180 269695 154920 -340183 6865 331418 -164200 -249627 281812 117640 -326703 46057
190 46057 308092 -184516 -213567 281615 73836 -318005 71327 274539 -202171 -174560
200 -174560 284157 41374 -296537 100771 243268 -218807 -142778 276132 3560 -278602
210 -278602 127460 217486 -223834 -102020 276681 -24548 -258380 148537 185059 -236647
220 -236647 -72767 267347 -55652 -237816 169888 157288 -241607 -40339 257806 -84897
230 -84897 -219163 184321 125169 -246108 -10070 246946 -108206 -192640 199986 97226
240 97226 -242471 21018 232035 -129371 -166227 208912 66933 -236816 48218 213092
250 213092 -147869 -139737 212962 37202 -228985 70455 191211 -163023 -113795 212750
260 212750 9320 -217305 92074 169854 -173121 -86207 212372 -15335 -202104 112948
270 112948 148606 -181280 -59118 210333 -39579 -188185 130728 126439 -189110 -34718
280 -34718 205317 -63340 -174495 145400 102729 -195267 -11499 197520 -85345 -158063
290 -158063 158432 79857 -196653 14052 188955 -103343 -137330 169412 57143 -194002
300 -194002 37412 176883 -119647 -116929 176013 33718 -189239 57360 160997 -133305
310 -133305 -96303 176944 9908 -182001 74539 142727 -144471 -75124 177106 -11407
320 -11407 -171720 92157 126477 -151673 -52820 176883 -30352 -159871 108002 109173 -157927
331 -157927 -31635 173519 -49960 -147886 121526 89901 -163542 -11651 168248 -69750
341 -69750 -136051 132659 69966 -167815 8181 161641 -86610 -121104 143075 51789 -167083
352 -167083 28258 153607 -100106 -103578 150644 32930 -164058 46755 141990 -112663
362 -112663 -86099 154162 13206 -159085 62631 127435 -123737 -69594 154155 -6149
372 -6149 -152247 76395 113265 -131171 -51275 153840 -22524 -142116 90321 98829 -136127
383 -136127 -32667 152383 -38698 -131665 103177 83962 -141107 -14896 148966 -55447
393 -55447 -121961 113101 66903 -145972 1193 143448 -71725 -111050 122626 50507 -147379
404 -147379 19181 137626 -85061 -96694 131309 34294 -146425 36268 129621 -96617
414 -96617 -81795 136757 18188 -142801 51720 119063 -106732 -67237 138115 677 -138858
425 -138858 63669 105983 -115401 -52007 138223 -14996 -131165 76370 93723 -121173
435 -121173 -36082 137311 -29568 -122531 88763 81517 -125076 -19646 136386 -43160 -113870
446 -113870 98590 67432 -130217 -5769 132392 -57920 -104677 107302 52844 -133668
456 -133668 8825 127056 -71984 -94910 115379 39003 -133972 24879 122413 -82448
466 -82448 -82157 121726 24575 -132621 39142 114812 -91844 -68679 126319 11008 -129300
477 -129300 51325 104069 -101705 -57151 126068 -4717 -124477 62934 94246 -107075
487 -107075 -42978 126435 -18139 -118968 72501 82509 -112253 -28655 126634 -29018
497 -29018 -109516 84341 71893 -116273 -16077 123228 -43568 -103404 92046 59784 -119542
508 -119542 -1587 121274 -55466 -95337 99105 45502 -123865 10456 116396 -66589
518 -66589 -84452 107753 34752 -122451 24343 110880 -77370 -74618 112164 21422 -120453
529 -120453 38071 105115 -84489 -62058 114947 7217 -119728 46452 94019 -93182
539 -93182 -50832 116512 -3612 -113143 57904 84905 -98853 -40419 114312 -16988 -107910
550 -107910 67696 76803 -100897 -24648 116285 -27122 -101219 75061 64220 -107230 -14920
561 -14920 113283 -38288 -93131 84701 55005 -109385 -3058 108831 -51604 -88358 89484
572 89484 42466 -110651 10584 107438 -58902 -76643 96830 31292 -111714 20659 100693
583 100693 -68234 -67184 101984 21375 -108909 32628 94282 -76961 -58869 101999 7679
594 7679 -107135 41580 86633 -81600 -46708 103831 -2722 -103063 49554 76787 -88102
605 -88102 -36489 104604 -11851 -95644 60388 69852 -90885 -25365 102720 -24001 -92224
616 -92224 66486 59914 -94416 -13620 102126 -33486 -85407 73840 48704 -99273 -4649
627 -4649 98329 -44134 -78470 81255 40724 -98757 7685 95664 -52568 -70662 85565
638 85565 29754 -99014 18319 91660 -59400 -60676 89650 19621 -98154 26513 83698
649 83698 -67410 -53165 90889 9218 -95305 35665 77423 -72760 -43978 91927 -1005
660 -1005 -91624 43704 70599 -76161 -33290 92934 -9024 -86560 51135 63033 -80322
671 -80322 -24305 92196 -18760 -82345 58352 54828 -84063 -14998 90421 -29036 -77929
682 -77929 64233 45690 -87128 -5377 88882 -36795 -70998 70833 37846 -87770 4435
693 4435 85934 -44432 -63723 75429 29058 -87459 13734 81944 -51596 -56418 78376
704 78376 18908 -87479 21415 75785 -58181 -49131 79706 10014 -85107 29197 70219
715 70219 -62713 -40304 81109 1824 -81464 37243 64270 -66532 -31819 82172 -6316
726 -6316 -77689 44135 57393 -70607 -23355 81601 -15343 -74809 50112 49831 -74523 -15467
738 -15467 80216 -23622 -69837 56127 42555 -76552 -6935 79494 -30589 -64461 61460
749 61460 35382 -77221 2050 76951 -37520 -57869 65625 27562 -77646 9264 72685
760 72685 -44266 -52255 67552 19360 -77647 16342 68325 -49312 -45523 69788 11836 -75393
772 -75393 23460 63819 -53373 -37918 71597 4652 -72275 30344 58581 -56972 -30402
783 -30402 72322 -2945 -69736 36420 52209 -61241 -23491 71586 -10965 -66799 42050
794 42050 45751 -64341 -15947 71483 -18198 -62829 47725 39655 -66469 -8372 70334 -24908
806 -24908 -57751 52871 33389 -67397 -188 68315 -31270 -52583 55691 25732 -68227
817 -68227 5902 64478 -37256 -47255 58227 18692 -67664 12842 60778 -41713 -41047 60496
829 60496 11963 -65907 19448 56661 -45331 -34508 62368 5906 -63717 25382 52144 -49351
841 -49351 -28188 62640 -1304 -61821 30466 46837 -53040 -22264 63018 -8345 -59315 35975
853 35975 41743 -56007 -15650 62964 -14571 -55900 41029 36465 -57522 -8584 62092 -19959
865 -19959 -51218 45505 30692 -59055 -2070 59705 -26150 -47399 47915 24075 -59807 3632
877 3632 56831 -31366 -42737 50418 17738 -59326 9589 53961 -35206 -37108 53094 12220
889 12220 -57844 15587 50948 -39155 -31160 54336 6403 -56542 21059 46572 -42778 -26203
901 -26203 54684 -152 -55236 25876 41889 -46249 -20667 55027 -6698 -52536 30924 37558
913 37558 -48869 -14008 55543 -11745 -49090 35805 32972 -50643 -8160 54834 -17023 -46040
925 -46040 39402 27391 -52203 -2475 53044 -22426 -42303 41992 21852 -52759 2510 50391
937 50391 -27102 -38165 44489 16785 -52417 8342 48240 -30400 -33064 46526 11658 -50978
949 -50978 13263 45121 -34083 -28489 47972 5914 -50438 17874 41760 -37576 -23939 48460
961 48460 151 -49408 22236 37653 -40986 -18991 49350 -4905 -46934 27242 34149 -42890
973 -42890 -12861 49563 -9893 -44328 31200 29432 -44801 -8051 48645 -14723 -41153 34631
985 34631 24765 -46083 -2946 46767 -20006 -38073 37016 19871 -47230 1977 45193 -23563
997 -23563 -33821 39910 15592 -46424 7232 43127 -26886 -29492 41816 10624 -45691 11753
1009 11753 40213 -30532 -25713 42536 5244 -44927 15780 36893 -33808 -21695 43025 290
1021 290 -43996 20071 33962 -36299 -16668 44314 -4010 -41899 24493 30660 -38205 -11911
1033 -11911 44398 -8555 -39575 28323 26811 -40141 -7260 43791 -13374 -37322 30462 22092
1045 22092 -41878 -3444 41987 -17517 -34399 33109 18280 -41768 1865 41037 -20953 -30482
1057 -30482 35786 13953 -41569 6282 39180 -23964 -26807 37397 9835 -41240 9940 36421
1069 36421 -27561 -23571 38135 4956 -41087 13849 33529 -30444 -19527 39088 603 -39585
1081 -39585 18270 31014 -32772 -14598 40226 -3572 -37812 22246 27606 -34904 -10647 40383
1093 40383 -7759 -35906 25346 24119 -36703 -6753 39235 -12529 -33883 27655 19896 -37780
1105 -37780 -2528 38383 -15833 -31073 30162 16286 -37947 1583 37164 -18925 -28032 32468
1117 32468 13222 -37725 5616 35849 -22098 -24598 33933 8782 -37953 9226 33022 -25179
1129 -25179 -21728 34801 4635 -37679 13028 30657 -27856 -17692 36265 590 -36388 16741
1141 16741 28374 -29627 -13977 36862 -3002 -34825 20227 25949 -31854 -10077 37009 -7040
1153 -7040 -33292 23108 22337 -33710 -6575 36188 -10911 -31105 25277 18795 -34603 -2634 35604
1166 35604 -14023 -28889 27664 15769 -34715 1102 34414 -16925 -25909 29836 12147 -35004
1178 -35004 4634 32863 -20274 -23301 30946 8443 -35021 8060 30826 -22785 -20040 32089
1190 32089 4409 -34734 11502 28592 -25234 -16687 33215 977 -33430 15274 26830 -27271
1202 -27271 -13306 34012 -2665 -32532 18413 23909 -29517 -10137 33909 -6327 -31193 20530
1214 20530 20953 -30713 -6760 33421 -9427 -29321 23018 17865 -31649 -3088 32814 -12190
1226 -12190 -26868 25624 15437 -31907 338 31847 -15152 -24297 26949 11543 -32280 3383
1238 3383 30284 -18076 -22187 28278 8097 -32624 7084 28759 -20765 -19331 29553 4834
1250 4834 -32132 10038 27249 -22592 -15960 30793 2136 -30787 13243 25249 -24626 -12720
1262 -12720 31212 -1549 -30113 15857 22568 -26848 -10086 31049 -5118 -28943 18547 19689
1274 19689 -28262 -7090 30933 -8071 -26905 20668 17705 -28584 -3738 30588 -10250 -25225
1286 -25225 22445 14729 -29284 -511 29609 -13313 -22939 24236 11419 -29704 2179 28180
1298 28180 -16255 -21060 25311 8338 -30035 5569 26738 -18280 -18241 27082 5700 -29381 8682
1311 8682 25316 -20468 -15068 28078 2305 -28678 11362 23503 -22115 -12718 28267 -916
1323 -916 -28100 13865 21076 -24312 -10065 28264 -3933 -26982 16078 18864 -25158 -6908 28282
1336 28282 -6510 -25198 18481 16669 -25825 -4224 28191 -8953 -23343 20134 14271 -26513
1348 -26513 -1364 27484 -11396 -22035 21440 11163 -27450 1158 25896 -14159 -19639 22968
1360 22968 8399 -27437 4411 25055 -16043 -17013 24502 5977 -27048 7243 23865 -17763
1372 -17763 -14672 25425 2946 -26387 9648 21807 -20078 -12509 25592 -219 -26174 11836
1384 11836 19734 -21575 -10082 25841 -2801 -24759 13941 17988 -22422 -7048 25929 -5063
1396 -5063 -23243 16656 16058 -23258 -4503 25724 -7267 -21783 17948 13341 -24162 -1992 24884
1409 24884 -9975 -20556 19096 10956 -24749 618 24134 -12171 -18485 21145 8629 -24607
1421 -24607 3196 23103 -14158 -15942 22026 5859 -24497 5966 22026 -15864 -14016 22750
1433 22750 3145 -24352 8249 20130 -18088 -12046 23301 507 -23699 10188 18589 -19443
1445 -19443 -9529 23568 -1787 -23035 12520 16820 -20136 -6975 23846 -3831 -21444 14341
1457 14341 14730 -21382 -4678 23309 -6240 -20432 15805 12485 -22087 -2695 22953 -8648
1469 -8648 -18871 16943 10311 -22307 -204 22209 -10389 -17044 18753 8469 -22404 2813
1481 2813 21245 -12150 -15070 19715 5978 -22203 4635 20078 -14467 -13501 20631 3458 -22539
1494 -22539 7109 18641 -16033 -11437 20829 1185 -21950 8957 17162 -17057 -9106 21457
1506 21457 -879 -20654 10891 15909 -17968 -6642 21816 -3000 -19717 12857 13908 -18920
1518 -18920 -4747 20840 -5414 -18731 13790 11586 -19734 -2621 20878 -7568 -17303 15274
1530 15274 10021 -20263 -478 20261 -9222 -15626 16769 8179 -20367 1892 19527 -10994
1542 -10994 -14031 17712 5810 -20389 4011 18270 -12781 -12361 18497 3655 -20437 5937
1554 5937 16922 -14107 -10378 18811 1407 -19589 7907 16023 -15341 -8466 19488 -582 -19064
1567 -19064 9453 14724 -16399 -6483 19510 -2222 -18086 10961 12919 -17230 -4679 19328
1579 19328 -4602 -17345 12001 11095 -17786 -2715 18820 -6187 -15826 13983 9249 -18111 -766
1592 -766 18467 -7912 -14525 14997 7301 -18362 1368 17851 -10089 -13014 15824 5258 -18834
1605 -18834 3018 16977 -11424 -11877 16508 3709 -18460 4842 15643 -12654 -10090 17210
1617 17210 1672 -17877 6887 14647 -13602 -7830 17790 83 -17073 8317 13352 -14665
1629 -14665 -6271 17850 -1790 -16691 9736 11947 -15512 -4748 17305 -3767 -16043 10771
1641 10771 10130 -16119 -2771 17270 -5531 -14527 12232 8774 -16358 -989 17111 -6970 -13530
1654 -13530 13476 7271 -16399 971 16394 -8367 -12279 14187 5258 -16754 2387 15363
1666 15363 -9924 -10915 14922 3455 -16719 4479 14504 -11096 -9526 15549 2034 -16207
1678 -16207 5564 13722 -12133 -7476 15834 410 -15691 7247 12254 -13164 -6139 15741 -1439
1691 -1439 -15166 8434 10729 -14059 -4519 15731 -3334 -14478 10015 9905 -14648 -2879 15823
1704 15823 -4465 -13096 11163 8360 -14711 -1235 15503 -5875 -12245 11917 7046 -14923 608
1717 608 14624 -7398 -11436 12776 5030 -15398 1929 13947 -8978 -9980 13519 3373 -15226
1730 -15226 3764 13619 -9838 -8401 14134 2207 -14942 5084 12538 -10928 -7144 14471 503
1743 503 -14386 6474 11363 -11769 -5935 14269 -1173 -14148 7383 9714 -12509 -4569 14304
1756 14304 -2650 -13328 8864 9068 -12796 -2585 14635 -3721 -12160 9991 7794 -13188 -1437
1769 -1437 13964 -5378 -11246 10537 6221 -13991 49 13625 -6726 -10382 11261 4663 -13968
1782 -13968 1458 12760 -7901 -9204 12231 3600 -13382 3141 12273 -8851 -7695 12436 2316
1795 2316 -13201 4480 11289 -9542 -6855 12764 645 -13207 5486 10386 -10695 -5520 12886
1808 12886 -855 -12495 6526 9362 -11059 -4146 12906 -2081 -11937 8000 8395 -11516 -2714
1821 -2714 13047 -3376 -11285 9157 7106 -12032 -1585 12339 -4613 -10572 9374 5644 -12797
1834 -12797 174 12418 -5954 -9542 10183 4514 -12310 1269 11781 -6975 -8507 11043
1846 11043 3564 -12215 2883 11139 -8052 -7295 11291 1838 -12338 3679 10397 -8760 -6244
1859 -6244 11482 821 -12065 4653 9535 -9317 -5164 11562 -674 -11699 6163 8524 -10113
1872 -10113 -3986 11876 -1823 -10985 6952 7846 -10640 -2326 11945 -2631 -10573 7815 6422
1885 6422 -11069 -1390 11619 -4302 -9662 8215 5336 -11093 -380 10854 -5094 -8633 9288
1898 9288 4286 -11283 1195 10832 -5982 -7573 9974 3336 -11054 2020 10188 -6877 -6691
1911 -6691 9929 1938 -10970 3154 9600 -7879 -5599 10313 980 -10740 3900 8917 -8353
1924 -8353 -4763 10772 -148 -10392 5265 7927 -8998 -3443 10653 -1351 -9790 6162 7156
1937 7156 -9637 -2617 10791 -2542 -9402 6963 5861 -9813 -1763 10144 -3801 -9004 7322
1950 7322 5284 -10104 -422 9830 -4292 -8047 8314 4305 -9832 820 9661 -5176 -6998
1963 -6998 8577 3222 -9887 1670 9182 -6204 -6348 8814 1917 -10081 2686 8521 -6907
1976 -6907 -5605 9112 798 -9809 3603 8009 -7183 -4382 9791 100 -9293 4730 7595
1989 7595 -7807 -3654 9768 -1028 -9040 5374 6302 -8557 -2184 9519 -1975 -8818 6402
2002 6402 5484 -8767 -1509 9306 -3124 -8077 6662 4759 -8952 -276 9407 -3709 -6906 7489
2016 7489 3883 -9033 789 8719 -4721 -6489 7927 2786 -9036 1544 8131 -5765 -5804 8157
2030 8157 2063 -9195 2354 8024 -6282 -5121 8211 1264 -8935 3149 7186 -6725 -3938
2043 -3938 8541 2 -8529 4219 6601 -7270 -3284 8819 -958 -8146 4817 5891 -7474
2056 -7474 -2553 8535 -2028 -7918 5467 4987 -7958 -1515 8630 -2587 -7216 6141 4277
2069 4277 -8109 -467 8443 -3117 -6376 6840 3570 -7965 218 7868 -3933 -5962 7006
2082 7006 2343 -8387 1044 7470 -4791 -5243 6871 1899 -7861 1685 7399 -5397 -4361 7469
2096 7469 1005 -7822 2697 6855 -5895 -3858 7627 -41 -7776 3355 6116 -6636 -2738 7912
2110 7912 -868 -7655 4138 5318 -6808 -2244 7913 -1734 -7038 4730 4435 -6832 -1258 7470
2124 7470 -2486 -6362 5498 3869 -7168 -504 7557 -2986 -5966 5799 3044 -7444 312 7047
2138 7047 -3526 -5411 6064 2460 -7342 875 6791 -4219 -4703 6697 1632 -7481 1888 6195
2152 6195 -4748 -3940 7001 1187 -6700 2735 6114 -5376 -3329 7077 95 -6922 3095 5293
2166 5293 -5853 -2668 6837 -810 -6558 3805 4712 -5909 -1894 7093 -1582 -6254 4306 4234 -6679
2181 -6679 -1361 7087 -2070 -5837 5023 3576 -6375 -351 6809 -2690 -5303 5327 2736 -7063
2195 -7063 174 6372 -3472 -4845 5530 2403 -6708 590 6019 -4063 -4458 5948 1500 -6526
2209 -6526 1942 5854 -4375 -3415 6041 477 -6382 2476 5451 -4999 -2965 6319 25 -6168 2935
2224 2935 4823 -5480 -2246 6249 -831 -6069 3560 4135 -5543 -1825 6469 -1413 -5492 4240 3853
2239 3853 -5547 -845 6249 -1916 -5092 4640 3072 -5994 -467 5944 -2718 -4762 4696 2183 -5975
2254 -5975 448 5970 -3200 -4682 4894 1933 -6125 765 5357 -3442 -3888 5329 1212 -5885 1645
2269 1645 5297 -4064 -3462 5556 537 -5864 2107 4724 -4436 -2635 5683 13 -5713 2634 4369
2284 4369 -4824 -1881 5938 -746 -5725 3054 3757 -5200 -1244 5886 -1308 -5018 3675 3226 -5411
2299 -5411 -793 5581 -1898 -4633 4076 2985 -5705 -383 5625 -2255 -4483 4362 2380 -5456 238
2314 238 5468 -2897 -4036 4841 1680 -5515 810 5174 -3375 -3402 5252 1220 -5383 1692 4835 -3609
2330 -3609 -2912 5343 485 -5312 2158 4382 -4110 -2566 5102 -139 -5316 2365 4022 -4327 -1988
2345 -1988 5281 -465 -5020 2971 3829 -4596 -1556 5281 -995 -4626 3387 3068 -4659 -811 5185
2360 5185 -1426 -4503 3845 2997 -5158 -316 4966 -2122 -4093 3927 1857 -5176 266 4868 -2591
2375 -2591 -3449 4149 1475 -5129 854 4595 -3078 -3177 4682 1296 -4922 1506 4365 -3304 -2584 4862
2391 4862 603 -4753 1948 3944 -3982 -2393 4887 -227 -4902 2385 3759 -3951 -1510 4766 -611
2406 -611 -4530 2793 3283 -4265 -1113 4939 -1074 -4309 3066 2938 -4434 -700 4654 -1465 -3911 3488
2422 3488 2225 -4493 -77 4631 -1966 -3990 3719 2100 -4370 193 4642 -2462 -3368 3921 1525
2437 1525 -4423 636 4256 -2771 -2866 3963 1251 -4525 1300 4015 -3368 -2380 4334 536 -4672 1772
2453 1772 3575 -3632 -2015 4561 10 -4406 2314 3478 -3652 -1575 4522 -523 -4361 2608 3198
2468 3198 -3710 -941 4638 -1307 -3731 2526 2724 -4144 -428 4185 -1359 -3534 3016 2171 -4057
2483 -4057 -101 4365 -1762 -3174 3246 1523 -4090 413 4113 -2327 -3177 3677 1272 -3994 833
2498 833 3992 -2575 -2646 3813 816 -4164 1103 3535 -2768 -2128 3942 351 -4216 1525 3425 -3364
2514 -3364 -1678 4088 -39 -4086 2322 2969 -3505 -1515 4206 -616 -3831 2551 2859 -3792 -1172
2529 -1172 4017 -881 -3813 2644 2320 -4022 -512 4009 -1123 -3294 3067 1802 -4003 -197 3991
2544 3991 -1733 -3028 3195 1730 -4142 142 3959 -2099 -3013 3403 1124 -4052 641 3622 -2374
2559 -2374 -2560 3583 540 -4110 931 3442 -2694 -2065 3402 453 -3817 1532 3122 -3148 -1405
2574 -1405 3929 124 -3995 1917 2861 -3067 -1283 3973 -343 -3763 2134 2657 -3485 -827 3770
2589 3770 -764 -3228 2367 1982 -3516 -353 3519 -1290 -2897 2586 1882 -3672 -114 3703 -1686
2604 -1686 -2877 3005 1625 -3765 192 3341 -1588 -2363 2939 1117 -3848 830 3248 -2394 -2235
2619 -2235 3352 610 -3633 1001 3317 -2220 -2003 3440 356 -3557 1340 2771 -2938 -1641 3571
2634 3571 226 -3326 1856 2560 -3082 -1220 3204 -318 -3121 2003 2480 -3071 -1036 3502 -680
2649 -680 -3132 2336 1820 -3385 -410 3516 -1242 -2915 2564 1692 -3418 -134 3294 -1338 -2828 2829
2665 2829 1488 -3437 307 3160 -1479 -2422 2780 933 -3400 681 3102 -2056 -2385 3329 529
2680 529 -3328 992 2885 -2145 -1968 3382 406 -3195 1148 2852 -2157 -1514 3287 -34 -3535 1481
2696 1481 2407 -2871 -1093 3264 -216 -3155 1793 2248 -2772 -1001 3503 -851 -2771 1977 1968 -3128
2712 -3128 -626 3221 -1078 -3024 2436 1594 -3250 -28 3389 -1266 -2583 2505 1332 -3166 22
2727 22 2983 -1485 -2099 2627 1014 -3206 498 2840 -1945 -2154 2751 783 -3056 855 2783 -2028
2743 -2028 -1839 2940 267 -3017 1187 2622 -2070 -1435 3118 23 -2965 1457 2273 -2607 -1178 2697
2759 2697 -483 -2621 1509 2119 -2641 -838 3122 -560 -2704 1944 1889 -2729 -593 3021 -825 -2618
2775 -2618 2203 1622 -2923 -160 2970 -953 -2371 2366 1260 -3054 57 2587 -1479 -2088 2445
2790 2445 839 -2877 583 2642 -1898 -2037 2667 588 -2716 818 2564 -1811 -1549 2319 355
2805 355 -2839 1179 2281 -2094 -1476 2633 105 -2430 1408 2573 -2133 -1175 2583 -341 -2633 1906
2821 1906 1740 -2229 -810 2848 -569 -2596 1797 1605 -2449 -467 3012 -934 -2316 1926 1626 -2632
2837 -2632 -127 2981 -999 -2299 2032 1201 -2568 136 2696 -1384 -2116 2385 804 -2730 444
2852 444 2275 -1378 -1622 2364 560 -2638 851 2224 -1487 -1480 2345 110 -2704 979 2150 -1813
2868 -1813 -1403 2491 -116 -2606 1174 1730 -2169 -1177 2780 -301 -2378 1380 1640 -2292 -961 2819
2884 2819 -671 -2605 1623 1495 -2464 -387 2454 -1149 -2164 1969 1349 -2531 -197 2479 -1051
2899 -1051 -1896 2228 1117 -2380 -117 2106 -1503 -1715 2227 843 -2438 518 2326 -1374 -1562 2130
2915 2130 601 -2335 507 2177 -1717 -1411 2488 449 -2303 863 2113 -1935 -1298 2213 -246
2930 -246 -2522 1260 1685 -1797 -1039 2202 -270 -2369 1447 1790 -1969 -553 2398 -394 -2004 1347
2946 1347 1396 -1981 -531 2270 -730 -2213 1572 1244 -2498 -91 2471 -1074 -1669 1874 837 -2150
2962 -2150 294 2567 -1772 -1713 2130 649 -2326 351 2065 -1395 -1373 1906 625 -2150 595 2192
2978 2192 -1754 -1477 2291 200 -2437 712 1831 -1664 -1003 2323 -50 -2363 1111 1952 -1961 -842
2994 -842 2149 -486 -2185 1239 1518 -2149 -837 1998 -569 -1837 1346 1240 -2088 -453 2203 -551
3010 -551 -1727 1508 1263 -1921 -229 1998 -852 -1863 1689 759 -2079 93 1978 -1206 -1600 1790
3026 1790 646 -2370 371 2041 -1323 -1320 1762 623 -2126 385 1814 -1488 -1216 2145 99 -1999
3042 -1999 534 1941 -1658 -987 1974 -10 -1996 1015 1832 -1787 -724 2082 -239 -2053 1065
3057 1065 1321 -1815 -445 1976 -326 -2071 1421 1430 -1996 -439 2040 -558 -1764 1554 1006 -1988
3073 -1988 -219 2090 -1033 -1823 1582 832 -1908 192 2082 -1071 -1535 1773 609 -2027 464 1735
3089 1735 -1078 -1409 1936 428 -1932 656 1617 -1183 -986 1699 210 -2159 473 1550 -1217 -834
3105 -834 1691 -94 -1803 928 1658 -1963 -688 1992 -25 -1841 1389 1364 -1738 -439 1779 -340
3121 -340 -1580 1254 1241 -1793 -403 2126 -785 -1822 1168 900 -1736 -35 2088 -538 -1278 1359
3137 1359 695 -1645 60 1608 -1095 -1507 1678 327 -1882 367 1835 -1119 -1114 1319 505 -1945
3153 -1945 324 1584 -1274 -1137 1664 153 -1691 751 1335 -1390 -753 1426 -17 -1800 813 1361
3169 1361 -1474 -481 1911 -221 -1493 1018 1157 -1493 -671 1772 -300 -1645 1155 1080 -1502 -487
3185 -487 1920 -408 -1545 1420 1023 -1671 28 1618 -741 -1181 1380 950 -1763 135 1801 -790
3201 -790 -1649 1401 681 -1765 346 1647 -1057 -913 1544 422 -1697 381 1728 -1142 -1288 1693
3217 1693 316 -1862 487 1432 -1447 -831 1648 231 -1837 550 1202 -1444 -575 1802 -95 -1841
3233 -1841 829 1072 -1588 -539 1754 -218 -1217 802 930 -1497 -331 1545 -592 -1610 1305 726
3249 726 -1715 -320 1579 -600 -1578 1433 442 -1466 187 1573 -800 -1202 1300 695 -1703 224
3265 224 1468 -844 -1010 1315 414 -1520 68 1536 -1046 -1045 1586 -123 -1489 555 1349 -1005 -735
3282 -735 1737 118 -1515 792 1088 -1303 -530 1539 -19 -1391 514 1089 -1361 -571 1643 -285
3298 -285 -1383 967 1142 -1290 -394 1655 -399 -1498 966 897 -1571 -139 1688 -494 -1215 1050
3314 1050 330 -1569 210 1338 -686 -1014 1285 525 -1488 383 1261 -860 -1016 1128 430 -1618
3330 -1618 173 1231 -994 -667 1177 85 -1238 765 1039 -988 -446 1656 -40 -1465 632 1053
3346 1053 -1024 -629 1480 -126 -1463 738 941 -1446 -495 1301 -246 -1402 781 1081 -1081 -261
3362 -261 1176 -434 -1212 977 836 -1356 -178 1455 -808 -1263 1329 805 -1146 281 1283 -722
3378 -722 -856 1330 462 -1384 257 1091 -739 -847 1314 427 -1180 308 1038 -1047 -826 1435 -173
3395 -173 -1441 664 1139 -952 -593 1403 -84 -1299 440 1033 -1179 -505 1579 -348 -1426 535
3411 535 1007 -1104 -288 1408 -29 -1141 940 885 -1181 221 1298 -514 -1233 1036 523 -1100 124
3428 124 1253 -615 -1014 846 567 -1282 -162 838 -1023 -1050 1090 549 -1252 317 1104 -874 -773
3445 -773 1031 108 -1087 10 1113 -757 -438 1222 100 -1109 460 935 -949 -571 1321 -103
3461 -103 -1343 515 765 -869 -612 1385 24 -1130 601 1019 -1116 -626 952 -361 -1098 594
3477 594 644 -1129 -318 1117 -341 -1010 853 881 -1326 -346 1135 -685 -993 932 394 -1225 -174
3494 -174 1009 -677 -777 1022 268 -1039 220 1259 -629 -697 1017 65 -1026 409 1170 -789 -566
3511 -566 900 189 -1101 492 825 -675 -534 972 107 -1206 311 800 -957 -8 1094 -462 -1009
3528 -1009 445 987 -1009 -351 1151 -33 -982 757 661 -991 -153 951 -381 -806 952 609 -1097
3545 -1097 87 1180 -446 -814 955 496 -1134 92 1089 -618 -659 817 410 -1055 157 1140 -507
3562 -507 -949 984 511 -924 149 856 -819 -641 781 163 -1079 308 864 -589 -598 1125 195 -1085
3580 -1085 266 708 -1059 -367 1055 -220 -867 309 848 -953 -271 1143 -62 -861 708 806 -901
3597 -901 -260 997 0 -942 742 423 -1113 -183 838 -432 -754 798 192 -1112 -37 1036 -530
3614 -530 -673 726 72 -838 154 1016 -630 -557 811 -21 -829 69 963 -671 -645 971 287 -1169 89
3633 89 801 -805 -655 930 -83 -1098 361 583 -838 -439 977 -186 -1085 495 662 -904 -467
3650 -467 942 -66 -914 756 209 -815 -206 720 -324 -762 656 267 -1317 174 1199 -671 -773
3667 -773 843 408 -1153 57 952 -475 -820 673 358 -732 243 757 -691 -427 1085 159 -821
3684 -821 187 806 -816 -408 838 -195 -1054 181 804 -551 -600 821 61 -538 509 916 -682
3701 -682 -291 1167 -96 -1072 613 859 -919 -586 789 -74 -921 769 338 -854 -105 780 -255
3718 -255 -772 672 223 -856 -228 843 -218 -641 627 308 -768 -26 953 -203 -701 1049 185
3735 185 -957 153 954 -609 -447 914 342 -832 86 794 -607 -332 809 239 -858 443 789
3752 789 -617 -398 808 82 -727 454 787 -705 -433 910 145 -690 615 743 -483 -264 828
3769 828 101 -854 613 482 -693 -69 753 -549 -620 573 410 -750 6 1166 -428 -593 882 468
3787 468 -793 73 962 -457 -551 548 557 -729 28 683 -379 -285 886 129 -843 293 802 -474 -587
3806 -587 881 220 -759 255 614 -774 -375 898 -52 -653 447 790 -548 -386 584 -68 -956 217
3824 217 418 -691 -274 768 -104 -563 392 284 -907 1 702 -160 -621 614 448 -698 32 961
3842 961 -190 -638 632 402 -897 35 866 -578 -740 655 357 -898 123 846 -618 -460 707
3859 707 168 -870 -178 630 -504 -255 1008 32 -616 266 620 -601 -213 666 178 -506 303 358 -369
3878 -369 -448 1078 -105 -777 427 479 -604 -436 577 1 -457 330 287 -772 -161 737 -215 -750 478
3897 478 472 -809 -139 580 -546 -493 645 211 -569 -133 550 0 -555 348 57 -722 213 530 -354 -543
3917 -543 470 102 -681 312 733 -488 -539 669 140 -601 186 427 -436 -555 557 76 -853 233 594
3936 594 -722 -169 692 -295 -741 446 532 -364 -373 605 24 -592 302 539 -519 -217 684 -66 -712 189
3956 189 720 -553 29 586 -72 -540 655 342 -678 196 608 -12 -564 509 327 -677 126 694
3974 694 -128 -577 648 226 -718 53 875 -556 -169 493 30 -591 27 581 -236 -172 531 -34 -798 429
3994 429 574 -625 -361 288 83 -698 240 485 -493 -376 603 -121 -527 110 617 -470 164 610 -38
4013 -38 -456 489 575 -515 -2 457 -342 -695 357 421 -549 -146 726 -8 -583 803 512 -473 -252 661
4033 661 -424 -554 530 208 -568 -74 741 -414 -196 422 -62 -464 1 600 -287 -390 259 41 -677
4052 -677 14 465 -165 -488 738 151 -567 429 311 -553 -418 652 -128 -591 389 350 -577 -209 571 130
4072 130 -556 239 441 -617 180 685 -106 -348 229 329 -568 -52 301 -149 -679 349 134 -389 -302 395
4092 395 -206 -461 611 174 -489 -38 389 -437 -377 371 324 -574 -48 556 -284 -235 504 -8 -385 86 624
4113 624 -527 -444 394 -72 -613 107 198 -209 -325 689 -259 -444 132 444 -268 -261 502 -2 -590 328 604
4134 604 -429 -161 513 133 -297 98 328 -325 40 482 -114 -328 360 300 -523 115 413 -241 -316 394
4154 394 227 -373 88 402 -3 -320 293 136 -622 176 534 -195 -229 435 73 -453 117 468 -337 -393 437
4175 437 -156 -566 220 452 -230 -336 464 33 -630 218 93 -307 -189 621 5 -750 417 280 -472 44
4195 44 429 93 -542 361 48 -420 -132 334 -25 -516 186 375 -344 146 370 -119 -154 357 124 -187 50
4216 50 232 -240 -49 179 237 -687 113 265 -521 -172 449 4 -468 217 256 -169 -292 528 12 -498 207
4237 207 463 -389 -325 518 -40 -377 132 231 -313 -165 466 -210 -458 212 270 -302 -119 258 173 -282 79
4258 79 345 -345 25 526 -62 -443 459 585 -426 -143 543 29 -235 425 186 -355 158 469 -49 -361
4278 -361 182 168 -120 -18 352 -317 -261 329 11 -438 -57 406 -132 -314 510 154 -502 56 527 -219 -104
4299 -104 698 35 -468 77 532 -338 -52 560 178 -350 128 181 -362 -206 551 8 -438 426 459 -424 107
4320 107 394 -21 -568 398 243 8 -135 257 -39 -453 263 -155 -240 -64 203 -129 -351 348 308 -515 -259
4341 -259 428 -112 -289 247 49 -609 63 531 -373 -398 423 295 -485 189 -75 -240 -320 319 565 -280 118
4362 118 267 -326 -185 289 177 -250 39 457 -280 -208 565 -14 -431 252 236 -316 136 190 -31 -493 177
4383 177 241 -433 -188 591 47 -94 192 437 -363 -167 339 -90 -298 234 248 -430 417 239 5 -367 536
4404 536 235 -369 323 167 -204 -140 379 177 -282 17 424 -347 -396 159 220 -509 -176 385 -210 -306 321
4425 321 -139 -302 221 360 -302 -147 443 -335 -303 -192 237 -117 -224 149 -149 -425 390 136 -215 -239 457
4446 457 78 -357 64 199 -273 49 159 161 -191 154 -140 -530 -81 184 -152 -314 318 257 -149 314 367
4467 367 -244 -237 129 97 -384 130 366 -69 -99 114 281 27 30 425 -410 -257 175 20 -60 -18 348 -467 -143
4490 -143 454 11 -240 156 238 -84 -187 265 -285 -338 99 323 -30 -262 231 72 -116 260 237 -264 -260 265
4512 265 99 -430 368 414 -279 38 234 -123 -281 26 366 -391 -5 302 -117 -274 196 55 -254 -120
4532 -120 95 -33 -219 107 79 -745 111 342 -89 -52 104 -46 -311 -6 179 -107 -333 407 93 -302 247
4553 247 193 -161 -167 478 -46 -187 326 522 -167 -89 239 -13 -460 102 110 -65 -288 80 -292 -308 256 46
4575 46 -307 -187 219 -230 -104 216 87 -188 -71 322 -62 -451 258 154 -306 -251 121 -295 -55 378 -34
4596 -34 -421 -99 251 -185 41 150 90 -346 -56 224 -334 -278 301 134 -388 1 13 -71 -251 59 159 -263
4618 -263 394 352 -288 -146 432 -10 -445 179 312 29 -109 206 41 -205 127 -31 -330 -278 412 19 -201
4639 -201 255 359 23 -179 248 -184 -191 28 82 -43 -203 42 56 -508 127 63 -307 37 457 -272 -351 20
4661 20 74 -216 -143 223 -105 -88 479 -115 -380 97 392 -232 -297 274 16 -343 21 373 -345 -199 389 119
4683 119 -538 155 87 -200 -140 277 158 -213 92 100 -11 -366 208 -258 -278 125 41 -342 -231 477 -76 -474
4705 -474 -6 159 -357 -228 146 -54 -339 247 280 -251 159 148 -65 -194 215 145 -313 47 308 13 -296
4726 -296 263 -147 -116 -39 117 -15 -152 -15 22 73 26 210 -92 -114 61 27 -190 336 157 -94 67 456
4748 456 -88 -364 86 124 -243 -122 230 211 -189 100 -122 -266 -93 132 -107 -109 231 -17 -291 -50 376
4769 376 -199 -101 299 232 -307 -28 11 1 -503 99 86 -250 -172 319 -173 78 236 374 -334 -34 463 -311
4791 -311 -186 292 146 -147 68 305 -219 -362 309 -70 -99 141 305 -110 -293 9 -57 -215 112 259 -339
4812 -339 142 342 10 -464 298 343 -130 -176 234 -89 -161 198 330 -311 4 148 -83 -225 -93 422 -115
4833 -115 -28 -31 -114 -243 417 66 -296 150 180 13 -212 132 271 -145 -183 98 -101 -140 59 56 -324 201 210 -118
4857 -118 -284 -45 175 -160 -105 65 -122 102 93 1 -337 -66 299 -201 -304 198 -108 -436 257 53 -80
4878 -80 -280 257 -413 -305 249 -71 -217 24 174 -114 -224 132 131 -539 -47 -44 -228 -120 79 177 -184 101
4900 101 -85 25 -44 -208 110 -208 13 352 142 -188 231 56 -45 -78 421 -19 -143 422 -319 -418 -275
4921 -275 179 158 -109 309 380 -208 -145 157 -141 -97 330 15 -163 -47 356 104 -94 284 166 -213 -14
4942 -14 2 -211 -146 165 -9 154 139 154 -184 -130 397 -69 -283 60 -271 -197 -75 189 -114 -304 71 290
4964 290 -252 137 315 -220 91 211 218 102 13 277 -192 -145 323 70 -102 172 86 -48 -72 353 97 -149
4986 -149 -57 292 -129 -195 24 -149 -145 -159 77 -117 75 353 -132 -239 251 56 60 57 152 -15 -265 9 134
5009 134 -378 53 477 119 44 -35 277 -263 -101 351 87 -216 20 308 -272 -290 406 -179 -180 43 102 -73
5031 -73 -80 89 -256 -116 244 457 -193 121 105 -220 -228 88 253 -289 -160 178 -193 -250 60 -43 16 86 360
5054 360 -31 -21 -29 -85 -289 179 182 -127 -221 -25 26 45 103 209 -192 -273 415 10 -166 91 99 -379 -192 182
5078 182 171 -58 121 -108 -323 166 -217 2 -200 -37 -118 -194 170 132 -160 -419 470 240 -88 135 346
5099 346 -295 -158 276 168 -95 69 -16 -281 -210 398 -12 -360 244 114 -85 -37 168 -138 -247 201 312
5120 312 -61 164 249 244 -358 129 177 -454 -18 206 410 -314 101 95 -351 159 402 -45 -126 179 377 -60
5142 -60 162 398 59 -56 154 84 -209 -67 154 -237 -493 -17 24 -417 21 187 -230 62 57 -69 -409 37
5164 37 60 -6 -346 377 -15 -103 46 213 -106 -110 329 188 28 -1 161 -177 -53 137 -236 -209 150 -21 -47
5187 -47 -174 197 101 -62 11 166 -333 -276 222 113 -136 90 281 -115 -61 114 -174 -227 107 -118 -100 104
5209 104 324 -45 -188 243 -53 -16 65 61 -286 19 30 -256 -228 -175 396 28 -315 92 204 -2 268 291 -54
5232 -54 -102 114 35 -308 141 -103 -54 26 366 -172 -79 215 240 -203 -184 374 162 17 219 253 -36 -221 53
5255 53 -84 -193 -31 81 -121 -155 99 131 -556 182 -59 13 -76 235 -138 -368 189 -80 -202 -97 303 -226
5277 -226 -30 246 -279 -167 171 27 -29 -207 -6 -70 -429 117 327 -189 -175 -108 -2 -161 176 473 65
5298 65 -144 -56 -113 -183 117 355 -127 -182 408 159 -365 219 188 -238 -35 164 -86 -108 196 227 -330 64 -100
5321 -100 -66 -241 392 -82 -420 78 9 -238 -329 166 -29 -85 32 112 -117 -6 46 -41 -351 99 505 -259
5343 -259 98 -103 14 -280 155 117 -338 -228 170 79 -544 293 188 -9 15 126 48 -80 304 332 -13 -85
5365 -85 230 196 -282 -91 -91 -404 -52 314 -144 54 -78 298 -203 -49 234 -83 -88 141 413 -181 16 53
5387 53 -185 -195 320 201 -5 -199 211 93 -156 253 183 -152 -4 343 56 182 391 86 43 93 59 -177
5409 -177 -159 23 67 -449 -179 81 -84 -1 41 147 -155 -219 139 -125 -6 49 92 -53 -254 319 -311 33
5431 33 481 -81 -73 236 201 -194 74 38 -295 -273 -37 -33 99 102 501 63 -64 186 374 -288 215 276 7 -179
5455 -179 213 67 -163 -214 122 135 50 288 85 136 97 284 239 -235 399 63 -422 -46 277 -219 -31 270
5477 270 174 23 -59 137 -225 -278 139 0 -150 26 233 -135 -144 34 -122 -194 110 150 -390 -270 311 54
5499 54 -102 -30 -107 -102 -375 -32 -25 -203 153 165 -128 -45 253 -248 35 35 75 42 -17 76 -18 -248 187 177 -272 165
5525 165 225 -290 -66 70 -216 -156 -176 45 -268 89 274 240 -19 139 123 -79 175 30 122 -170 -9 461
5547 461 -281 11 446 -127 -327 -117 70 -147 49 -42 72 -496 79 207 -299 -191 178 35 -79 192
5567 192 138 -123 -188 383 29 -31 255 51 149 78 133 -82 -192 313 21 -113 251 109 72 -27 23 -43 -123 41
5591 41 89 -103 -182 172 68 -149 -23 249 -235 -7 285 201 -302 281 132 0 286 165 -111 -264 305
5612 305 361 9 -67 112 -43 -133 67 -78 31 115 304 -37 -335 31 89 -154 -15 -11 64 -346 48 314 -118
5635 -118 93 333 -245 -231 253 58 -212 272 -16 20 -183 206 -129 -60 79 213 216 -244 218 59 -35 -52
5657 -52 200 -217 -176 177 -89 -147 -23 212 -229 -223 332 -44 -307 190 106 -290 96 47 -17 167 -184 11 -162
5680 -162 4 334 120 154 -38 -23 121 190 138 49 -117 152 194 -260 -32 258 -251 -137 418 137 -67 -145
5702 -145 59 -238 -208 197 63 -203 -127 468 31 -100 77 190 -298 249 40 -84 -259 564 -13 -290 207
5723 207 86 -164 59 347 -128 -318 245 -26 -103 -408 89 204 -396 179 -80 -133 -232 211 99 -1 -48
5744 -48 98 -341 -78 313 -22 -134 56 32 -299 42 46 -61 70 180 83 -346 21 101 -108 -104 451 169 48
5767 48 73 149 -89 -419 260 26 -152 -25 275 41 -152 -27 -60 -161 411 -116 -86 -301 93 -14 181 -9
5789 -9 250 -166 79 -66 -291 -294 206 139 -235 -40 237 -109 106 -226 -73 -401 -77 274 5 -29 110 36
5811 36 -194 242 356 -197 -324 195 -6 -217 -8 200 -279 -226 -71 29 -237 -168 176 161 -136 120 -46
5832 -46 -139 -170 138 4 -38 317 211 -147 200 54 8 -16 213 -49 -235 -56 28 -77 -135 223 62 51 81
5855 81 362 -211 -11 -10 -17 -267 203 287 -39 57 130 -21 94 147 -76 -340 32 204 17 -147 398 53 -97
5878 -97 -2 -41 -74 -81 -64 149 -79 82 104 26 35 351 131 -132 5 -24 -112 -29 124 -35 -109 99 296 -357 -24
5903 -24 93 43 -270 75 428 -58 144 116 57 -243 -56 -169 -375 -207 257 185 -251 99 -20 122 -43 161
5925 161 173 -161 88 -179 -168 -139 128 -97 -51 34 216 -95 -17 271 -97 -224 159 27 -149 -104 96 -251
5947 -251 -79 -71 44 -90 39 -28 -219 -129 60 54 -224 87 49 -209 -55 124 -10 -115 143 -90 -341 -38
5969 -38 41 -136 9 135 173 -41 -133 149 -51 -228 60 -48 -205 170 228 147 129 410 23 -39 64 235 -167
5992 -167 -162 140 -71 -214 -244 19 -150 120 -26 68 -292 -233 -15 24 -61 100 159 -113 47 33 107 -134 7
6015 7 -42 -175 78 36 -131 133 67 -91 -171 -2 147 -45 150 78 -208 -199 -111 106 56 -4 331 -233 -244 -54
6039 -54 86 -334 -134 249 -259 -201 151 -146 71 -3 66 169 -18 334 77 -242 39 270 -153 -320 6
6060 6 2 -51 165 334 -295 -171 140 133 -27 -77 60 -43 -101 138 169 -255 342 179 -48 67 -175 -31 -71 111
6084 111 155 -134 112 77 -99 -311 150 168 -86 -122 97 75 -34 168 248 -8 -10 -181 -180 15 22 221 -195 95
6108 95 23 65 -355 144 95 -24 -24 16 -167 -132 221 239 -318 201 120 -225 -76 -4 39 -260 135 295 -155 18
6132 18 148 -43 -112 -63 125 -13 -13 79 184 -14 237 67 -443 -45 140 -77 -130 20 112 -235 -114 246 -94
6155 -94 -131 126 168 1 40 -131 -32 122 130 3 -192 -145 227 8 23 198 -39 -127 13 181 11 -241 171
6178 171 95 -130 106 47 -94 -181 104 73 90 -6 206 -272 -53 -93 -117 -192 315 14 -265 -58 273 46 -359
6201 -359 383 203 -160 225 113 50 -293 -181 98 -28 10 13 -288 -44 -24 -35 68 -40 -3 -217 -160 140 50
6224 50 -160 -187 80 -242 105 -45 109 158 61 110 -7 -62 -22 136 68 217 180 -137 122 160 90 -112 -34 100
6248 100 -179 2 196 -193 -117 11 44 -27 -17 312 -80 -241 248 210 -9 24 274 26 -70 -232 -52 147
6270 147 35 111 -114 94 123 72 -227 353 364 -74 -93 150 -193 -104 259 235 -22 -7 -259 167 -229 105 0
6293 0 218 -381 183 -2 -116 190 87 -65 -57 -113 101 94 494 -114 136 134 -21 -89 -184 36 -124 150 141 96 -278
6318 -278 -4 162 28 -59 -67 24 -173 -128 -100 -96 -43 -143 225 -156 -98 -167 -134 145 336 43 -5 -226 12 -82 -163
6343 -163 155 308 50 69 125 -318 92 145 -12 -152 214 103 -197 -134 -2 183 -128 159 181 -99 -346 82
6365 82 70 -192 -11 -13 -130 -123 -16 108 -8 -105 112 49 -127 54 -5 -204 69 333 -300 -30 -46 -17 -68 160
6389 160 108 129 -219 -120 14 -122 -178 256 -54 248 190 -181 -42 -138 105 87 -129 -38 -107 -18 354 140 11
6412 11 -107 -210 -44 106 -78 253 -131 33 -105 130 -14 -93 -27 -51 42 -2 186 10 5 238 -20 -15 145
6435 145 -203 -82 23 -186 -160 -280 97 -73 -246 98 -129 -105 -162 222 -99 -164 29 11 -17 103 234 95
6457 95 -127 301 89 17 81 -340 16 -195 115 331 -151 26 -120 194 -170 51 -179 -202 106 134 -181 -25
6479 -25 113 9 -174 93 136 -82 2 -164 -224 -60 -94 -71 -157 124 148 80 -91 -123 186 -354 -219 -26 -149
6502 -149 10 -3 50 202 -55 163 -163 -113 -115 82 -75 91 -39 282 66 103 191 -61 -82 148 221 -351 -72
6525 -72 69 -109 -79 395 125 177 -228 -5 -59 -113 94 -92 93 16 24 -255 141 110 83 12 -30 122 39 -56 88
6550 88 -3 227 -63 50 -310 126 -115 -139 -140 -138 65 58 254 52 -59 150 283 -90 -26 -104 -299 -15 -37 195
6574 195 72 191 8 -77 -247 241 62 66 -241 51 -175 -161 129 67 11 66 -6 -33 -327 143 -68 -160 99
6597 99 230 114 29 167 -70 -57 80 122 -89 -204 -108 124 -66 27 88 -39 -107 266 164 -139 -194 79 -174
6620 -174 16 160 143 -5 -9 146 -32 44 304 -38 111 -93 264 -31 151 193 297 -7 -132 120 1 17
6642 17 133 215 93 111 236 -31 -88 100 -41 -46 156 362 -408 124 -7 88 129 251 -130 21 -69 -228 -61
6665 -61 49 -58 -122 121 19 265 66 1 300 188 -27 -46 58 -186 -85 3 103 -137 88 90 40 85 151
6688 151 320 36 191 -129 -76 -232 -50 37 -293 7 -6 -206 -216 -51 247 -45 -202 -4 -63 51 221 -167
6710 -167 -124 -32 208 5 67 -135 373 -27 -38 98 -388 36 -59 -14 -222 198 175 -38 -132 155 115 -78 215
6733 215 111 29 -114 241 -183 -18 31 27 -79 -204 198 -108 125 169 -61 11 -4 123 22 -238 6 179
6755 179 115 -166 207 -192 104 31 64 17 38 144 -58 -89 124 24 103 275 -208 -86 -40 -92 147 1 76
6778 76 66 -84 -203 -96 -384 128 78 -151 -10 -59 218 45 -128 -133 77 -113 -128 164 13 122 133 -82 -14
6801 -14 -40 136 107 -142 38 109 -123 51 298 -85 -145 109 15 -229 -16 262 -156 -42 346 -102 -299 48
6823 48 -106 284 133 53 103 -180 -100 104 24 -19 -145 273 -153 157 133 -77 -62 48 -92 -365 -38 -68 -144
6846 -144 -128 -45 -49 -46 300 190 -5 -47 -38 12 83 48 101 175 -15 227 90 227 144 -18 -109 -258 -3 -186 -123 171
6872 171 163 -59 11 131 187 -35 111 124 102 159 38 23 -132 56 14 -117 99 39 -117 -221 73 333 -353
6895 -353 -57 -149 -230 -273 89 86 -9 245 237 -5 -214 137 -25 111 -7 61 -164 120 233 214 -103 214 -250
6918 -250 -70 -284 37 35 5 131 -26 -166 -320 -47 -101 130 106 124 16 342 -1 -105 -212 261 -14 -239
6940 -239 74 223 -12 -16 13 -146 -133 15 -6 -58 -204 363 180 -183 156 -120 163 -283 45 -126 -92 224
6962 224 -69 -255 -186 58 39 35 268 230 -178 21 -156 -180 -206 79 102 -92 209 21 183 134 14 -80 -139 -213
6986 -213 23 145 -374 99 141 -30 78 208 -289 -168 61 -7 35 -38 307 -133 63 -12 -67 -154 67 -106
7008 -106 -232 -188 138 27 161 -172 240 -38 -64 248 57 -125 -26 347 122 -115 233 -54 -142 278 150
7029 150 -175 -260 26 25 -223 193 -48 -36 124 -37 -40 82 53 -57 -76 -109 49 135 -46 -103 47 10 -43 -8 156
7054 156 -35 -41 -89 37 143 62 -142 90 117 -215 1 -38 31 159 -44 -260 51 -122 153 -270 -291 -226 31
7077 31 181 -135 -159 49 89 -116 84 -194 -122 -68 117 -235 -424 200 -168 -158 50 -36 -42 107 178 -5 -141
7100 -141 -47 41 -93 7 -28 -43 -71 152 203 65 -169 148 -180 -56 199 19 -69 -50 -106 -49 -266 110 -158
7123 -158 46 -105 -98 -125 -131 -136 121 -97 -72 -41 45 271 267 20 -295 85 17 30 -183 -133 -97 14 -68 41 -295 125
7149 125 -44 163 50 -18 -103 -257 43 -80 -273 -25 220 -58 -35 -141 -39 -34 -142 154 31 -151 -173 7
7171 7 -59 -314 21 71 -112 -94 -34 50 71 -309 77 28 61 136 -68 -176 -7 -94 -144 81 -124 -108 42 314 -149
7196 -149 5 -60 -134 32 121 -44 -14 238 -32 -183 -110 74 -79 329 42 178 93 -22 -327 309 90 -147
7218 -147 85 -68 -44 -19 -125 -128 -49 -102 89 -184 71 -37 156 -234 326 67 -117 25 -38 -61 -38 41 1 199
7242 199 -32 305 -72 -114 -161 194 -15 -154 -156 -160 -171 60 -22 148 -101 8 -254 -253 -16 -17 -193 103 -91 -267
7266 -267 98 -175 -80 -299 -73 -14 78 314 -149 -100 -51 13 111 -95 72 169 332 30 150 234 -185 25 54
7289 54 -163 66 -91 -178 -248 -153 -46 45 -15 310 172 41 103 -206 133 -29 29 110 34 19 -2 -39 166 -217
7313 -217 -29 -175 141 -195 111 -205 -115 -174 4 160 27 63 -26 123 111 34 -239 168 28 -27 110 72 -221
7336 -221 -2 -155 18 -15 54 -356 -198 72 76 -186 -209 55 184 60 194 183 -10 -153 -135 11 -129 47
7358 47 170 -15 140 193 59 224 67 -247 -98 267 258 -339 -44 -61 2 -101 202 42 94 -22 -287 -23
7380 -23 -207 -122 -37 -32 -139 -43 -152 -272 66 1 -85 -105 356 241 17 35 132 -33 -114 84 -133 19 -7 352
7404 352 -248 -305 166 138 -340 -43 232 -90 35 208 -56 84 27 -175 -19 -69 136 -90 -10 128 6 -159
7426 -159 248 56 -32 -216 40 -141 125 90 63 -72 34 192 207 1 66 198 10 37 -63 83 -395 -57
7448 -57 202 -111 -75 -36 -34 -90 131 -139 -174 5 -20 -108 57 229 240 -136 -1 -69 96 -17 -128 81 63 -169
7472 -169 47 159 45 111 202 16 -57 165 -43 7 43 -79 164 -82 1 -122 11 56 -108 -15 -148 -91 -3
7495 -3 -30 -100 -334 -186 131 58 -296 279 -179 -124 35 98 -163 3 30 190 95 -27 48 -291 -45 -80 443 -296
7519 -296 30 130 149 -1 -114 98 -67 -90 57 120 -242 54 390 201 26 92 -68 -151 -17 120 -76 -19
7541 -19 103 -121 113 -211 -67 136 43 65 -63 -115 68 177 47 -22 313 103 -101 15 263 -111 -75 -128
7563 -128 99 13 146 68 178 -50 -125 189 -9 -48 243 -41 173 55 -13 76 76 101 -9 -64 -78 279 -29 -104
7587 -104 -175 -10 51 66 -121 -115 -114 48 137 -7 -5 275 51 -133 -63 -254 -69 246 -21 195 -218 -89 67 -143
7611 -143 -20 23 37 24 34 -130 215 -17 -286 -175 -7 112 122 63 41 91 -56 13 32 -281 -46 113 -93
7634 -93 -115 -188 -349 -171 166 412 -7 107 -63 -299 -47 -190 93 46 -107 185 -39 -145 182 -130 -252
7655 -252 -4 -39 -121 48 7 -141 123 174 138 -40 -220 158 104 -40 -20 -231 -94 150 -262 -49 -137 144 75
7678 75 -27 -89 19 -120 -390 64 31 31 225 -52 64 63 -115 -40 -90 110 24 3 -15 -58 222 -40 34 28 -202
7703 -202 10 149 191 60 102 45 87 263 166 84 -130 134 99 8 -84 18 61 -57 -59 149 54 -86 -11 -6 -62 -154
7729 -154 114 -33 9 92 157 -43 93 222 105 81 -70 -52 127 178 50 160 -72 -9 -302 113 272 161
7751 161 -43 190 -177 -54 -193 94 173 37 32 128 43 -35 262 5 -32 36 101 -306 3 40 29 201 -36 66
7775 66 195 -83 180 -25 -240 -253 111 61 -151 39 309 191 -38 -18 -197 -121 -87 31 -224 240 -115 17
7797 17 235 24 33 -155 -6 -339 19 -154 124 23 -72 -6 3 155 58 -87 55 -160 -5 -111 -114 -246 6
7820 6 4 5 -118 238 19 -85 101 -52 61 95 98 -115 -90 -289 142 -81 269 -146 118 81 191 -109 -20 -343
7844 -343 117 191 98 54 13 5 145 104 -176 -199 41 -22 -151 212 -66 6 42 75 13 14 51 14 23 318 238 159 9
7871 9 -92 27 208 41 -76 24 35 110 -14 139 -79 -224 140 37 58 -280 -73 90 132 -232 32 425
7893 425 77 -118 127 58 -169 -37 -105 -242 -25 168 206 117 -128 30 -94 -47 -127 -160 -135 50 156 21 -24
7916 -24 -180 77 -21 60 115 -370 -58 89 59 -35 205 291 -137 18 -13 -4 13 17 -65 -15 -63 310 74 44 -50 -33
7942 -33 29 299 10 -28 40 -25 -126 -147 -66 326 -169 15 -83 -115 -52 -111 136 31 271 375 77 -175 -196 34
7966 34 82 -6 5 -41 193 -103 -168 161 193 49 -207 155 -128 63 160 -117 271 178 183 -391 148 -42 218 38
7990 38 110 -71 -204 120 30 45 239 88 -85 98 -276 -149 4 242 -147 -131 -14 -39 102 -157 196 -101
8012 -101 6 -173 -130 197 225 23 -286 -148 -24 -73 10 72 -159 -66 -45 10 164 11 65 -72 4 -109 299
8035 299 -112 -241 -9 100 -85 -124 -54 -34 60 229 -55 82 -17 -172 207 -30 -280 -38 71 367 13 -69
8057 -69 -172 -47 134 -96 59 239 -14 17 -7 -52 3 -39 -253 39 -216 -29 -94 403 28 180 14 -124
8079 -124 176 50 156 -26 -109 -93 -129 45 28 40 -19 -17 0 -20 64 285 -32 122 -95 -239 174 227 161 133 116
8104 116 145 -197 -6 114 145 158 2 -87 -34 129 -3 152 -261 97 407 139 -71 -108 141 -260 -155 150
8126 150 32 20 0 -38 -235 -49 -176 -308 -41 -220 -25 -137 48 77 -211 -95 -16 -61 -69 8 -57 45 -67
8149 -67 97 33 274 111 -124 107 -6 61 -172 -19 -271 122 -107 154 -104 -157 14 73 53 32 75 -83 -15
8172 -15 28 -53 95 -150 2 -25 173 135 -74 319 -110 -1 42 -16 63 329 28 -14 145
8191A45
$$ Imaginary data points
##PAGE= N=2
##DATA TABLE= (X++(I..I)), XYDATA
0 0 0 0 0 0 0 0 0 -8 8 -8 8 -16 16 -24 24 -38 48 -56 70 -80 101 -120 143 -167 193 -231 268 -309 352 -406
30 -406 465 -532 600 -680 768 -869 974 -1088 1216 -1359 1514 -1682 1862 -2062 2284 -2523
46 -2523 2781 -3066 3380 -3725 4103 -4518 4981 -5497 6074 -6725 7464 -8314 9303 -10470
60 -10470 11868 -13580 15740 -18556 22390 -27943 36729 -52757 91229 -376507 -69532 646795
72 646795 -456132 -391710 669394 272572 -622458 225857 616191 -447719 -461276 555586
82 555586 33682 -699313 175018 574395 -425087 -282622 656875 96408 -606921 241563
92 241563 483392 -501772 -318796 568926 -19241 -594867 275162 469841 -467875 -214228
102 -214228 588968 -38954 -552144 302866 406557 -485972 -175209 560360 -96483 -522869
112 -522869 319335 347273 -495059 -117251 554912 -115468 -455219 370368 312120 -494345
122 -494345 -84096 496827 -198386 -455005 357486 250820 -474977 -3342 513930 -182745
132 -182745 -372180 385202 193920 -488512 -2557 433111 -243805 -340228 393946 171225
142 171225 -427311 80136 428027 -248004 -295427 369159 86845 -444195 84107 370070
152 370070 -267810 -234074 392667 71924 -397211 131585 335293 -294242 -208872 369224
162 369224 15314 -382801 162253 308396 -292142 -152059 374369 -15473 -357159 184110
172 184110 262795 -310305 -117173 359215 -54810 -329572 208895 224796 -316126 -77135
182 -77135 344176 -90158 -299582 230073 188697 -313087 -36031 326813 -119442 -268598
192 -268598 240749 147950 -307837 1710 307465 -138995 -228467 252535 111057 -299423
202 -299423 30092 276073 -167007 -200179 253788 73755 -286114 64199 255100 -181858
212 -181858 -164547 257022 37934 -276784 88508 227563 -198384 -131061 261292 10375
222 10375 -258115 118381 204916 -211032 -100633 257695 -23380 -245810 138742 176831
232 176831 -222381 -69620 253201 -51678 -227458 158012 147961 -229125 -39836 243287
242 243287 -78708 -205214 174332 120089 -229214 -8535 232837 -100172 -180095 187167
252 187167 91817 -226770 18814 216936 -120565 -156747 193747 62867 -222219 42617
262 42617 198343 -137537 -132428 197734 35088 -214433 65512 179667 -152208 -107335 201357
273 201357 9968 -204730 88396 162665 -163695 -81532 204451 -13887 -194544 108796
283 108796 143685 -175249 -58114 202464 -38675 -183222 124948 121936 -183899 -34776
293 -34776 197480 -61508 -169283 140215 99411 -188327 -10346 190776 -80938 -150590
303 -150590 152696 77893 -187285 13493 181559 -97367 -131284 161080 55191 -184378
313 -184378 34232 167537 -113197 -112438 165436 32028 -180309 52663 152436 -126523 -92977
324 -92977 168335 10425 -174033 71048 138178 -137168 -71895 171332 -9051 -164940
334 -164940 89395 123444 -145997 -51245 171542 -29329 -156103 104598 106163 -154706 -31879
345 -31879 169485 -49138 -146034 117768 88238 -161040 -13056 164577 -67394 -133056 128961
356 128961 69957 -162037 7505 157812 -81879 -117149 138245 51946 -160335 26464
366 26464 148217 -95305 -100651 143599 32501 -157514 42909 136220 -107642 -85180 146043
377 146043 13568 -153237 57550 123367 -117958 -68164 147994 -3470 -146333 73373
387 73373 111384 -125379 -50019 150226 -20068 -138793 87794 97811 -133241 -33348 149635
398 149635 -37200 -130931 100206 82971 -139709 -16822 146451 -54488 -121620 110580
408 110580 66871 -143856 585 141786 -68957 -108852 120424 52038 -143698 17962
418 17962 135640 -80893 -95251 126890 35741 -141847 33332 126732 -91663 -81233 130756
429 130756 18770 -139333 46539 114844 -102821 -67855 132194 2400 -134743 60166
439 60166 104858 -110421 -52188 134741 -12143 -128583 73570 93881 -116861 -36593 136231
450 136231 -26023 -121714 85804 81622 -123757 -22473 134416 -41628 -114711 95948 68505
461 68505 -129240 -7780 131364 -56272 -106301 104704 54473 -131543 7466 127746
471 127746 -66997 -94027 112789 41149 -131151 21417 120796 -78433 -82271 118173 27741
482 27741 -128493 35378 113007 -87857 -71290 119646 11498 -127741 45684 102969 -95351
493 -95351 -57469 122952 -321 -121995 57788 93278 -103658 -45558 123637 -13592 -116063
504 -116063 71220 85418 -108140 -30555 124878 -27562 -111653 79463 71980 -114995 -18164
515 -18164 123781 -39857 -103696 89502 60711 -119565 -6224 119222 -53308 -95928 97492
526 97492 49762 -119266 9221 116898 -62905 -85875 103022 35936 -120340 20804 110815
537 110815 -70670 -73531 108671 24607 -118299 31100 100982 -81739 -65416 108983 11023
548 11023 -114842 43614 94994 -87091 -52644 111248 -1862 -112536 52547 85324 -93376
559 -93376 -39524 114797 -10689 -105457 64168 76875 -99710 -30081 111967 -25356 -101480
570 -101480 72653 67124 -103159 -16509 112138 -36456 -96003 79154 54739 -108385 -5759
581 -5759 109645 -45762 -86065 88253 46086 -108271 6059 104464 -56243 -78362 92196
592 92196 34948 -106956 18184 100576 -63232 -68687 95124 21559 -107655 26189 91885
603 91885 -71551 -58399 99007 12340 -103400 36941 84907 -78378 -49640 99517 751
614 751 -99919 47562 79066 -81888 -36670 101741 -9462 -96442 55149 68827 -89001
625 -89001 -27653 101755 -20205 -91046 64152 60941 -92963 -17635 99158 -32034 -86709
636 -86709 70774 51380 -94997 -5531 98453 -39724 -78104 77432 41976 -96272 4018
647 4018 94282 -48134 -69856 81991 32227 -95547 13857 88972 -56236 -63087 83853
658 83853 21436 -94957 22554 83044 -62208 -53959 86730 12140 -92729 31032 76960
669 76960 -67826 -44602 89232 2963 -89090 40527 71075 -72952 -35807 89892 -7159
680 -7159 -86745 47746 63726 -77968 -26512 90171 -16587 -82916 54879 54937 -82498 -17889
692 -17889 89121 -25658 -77271 61805 48279 -83777 -7291 87516 -33214 -70519 67027
703 67027 39488 -84913 1728 84303 -40635 -63865 71324 30417 -84883 9735 79404
714 79404 -47891 -57529 73550 21340 -84738 17501 74622 -53654 -49326 76902 13215
725 13215 -82189 26246 70222 -58509 -41321 78979 4656 -79958 34177 64500 -63615
736 -63615 -33554 79530 -4188 -77531 40380 57743 -68512 -25952 79789 -12851 -74539
747 -74539 47050 51205 -71776 -17539 79332 -20121 -69575 53328 44221 -73647 -9108 78115
759 78115 -26940 -64332 57845 37462 -74450 -1329 74690 -33765 -58656 60803 29172
770 29172 -75354 5566 70807 -40199 -52458 63796 21607 -74070 13461 67421 -44810
781 -44810 -45714 67035 14466 -72603 20599 63269 -49783 -38876 68799 6875 -71120 27602
793 27602 58221 -55139 -32322 69235 -1937 -69426 33601 52389 -59321 -25565 70564
804 70564 -8830 -66124 39880 46855 -61759 -17209 69875 -15650 -61665 45244 40662 -63611
816 -63611 -9655 68864 -21812 -57201 49259 34057 -64877 -3074 65968 -28645 -52802 52219
828 52219 26850 -65586 3249 62850 -33650 -47343 55266 20507 -64694 10288 59995 -38234
840 -38234 -41160 58118 14307 -64014 17070 56678 -42589 -35068 59934 7000 -62933 22431
852 22431 51653 -47590 -29651 60613 107 -61328 28143 47101 -51121 -23506 61491 -6157
864 -6157 -58543 33694 42552 -53202 -16579 61493 -12017 -54768 38824 37302 -55426 -10193 60375
877 60375 -17746 -51344 42055 30946 -56919 -4843 57927 -23537 -47128 45082 25198 -57396
889 -57396 1514 55502 -28399 -42230 48027 19521 -56684 8225 53302 -32577 -36769 50751
901 50751 13768 -56463 13826 49928 -37067 -32344 52014 7087 -55551 18687 46176 -41508
913 -41508 -26921 52926 889 -54227 24288 42185 -44742 -20906 54123 -4427 -51628 29301
925 29301 38433 -46606 -15254 54455 -9781 -48890 33488 33253 -48826 -9900 52995 -15357 -45784
938 -45784 36263 27747 -50064 -4653 51308 -20272 -42043 39542 22769 -50376 968 49819
950 49819 -24288 -37714 42362 18220 -50067 6518 47836 -28108 -33330 44558 12469 -50053
962 -50053 11400 44787 -32454 -29421 45940 6716 -49838 15996 41210 -36332 -24669 47046
974 47046 1674 -48756 20887 37985 -39153 -19036 48506 -3086 -45963 25970 34185 -41338
986 -41338 -13968 48342 -8525 -43892 29332 29802 -43407 -9207 47222 -13527 -41242 32341
998 32341 24714 -44753 -4373 45954 -17435 -37810 35347 20764 -44558 828 44418 -21650
1010 -21650 -33504 37775 15996 -44780 5531 42471 -25569 -29870 39980 11250 -44877 9975
1022 9975 39800 -29553 -26566 41239 6302 -44791 14455 36908 -32420 -21893 42386 1754
1034 1754 -43084 19071 34376 -34827 -17508 43352 -2745 -41478 22569 30875 -37184 -13206
1046 -13206 43055 -7374 -39580 25435 26642 -38810 -8833 42163 -11745 -37144 28721 22740
1058 22740 -39747 -3957 41348 -15354 -33905 31894 19153 -40123 507 40277 -19168 -30717
1070 -30717 33998 14913 -40527 4560 38455 -23030 -27494 35404 10035 -40772 8861 35923
1082 35923 -26510 -23892 37397 5382 -40401 13202 33531 -29251 -19850 38956 1770 -39169
1094 -39169 17299 30786 -31381 -15577 39251 -2809 -37401 21065 27882 -33660 -11522 38915
1106 38915 -7038 -35998 23337 24128 -35513 -7858 38328 -10800 -33685 26430 21069 -36106
1118 -36106 -3471 38151 -13938 -30575 29001 17376 -36432 439 37075 -17454 -27997 31198
1130 31198 13354 -37205 4038 34978 -21397 -25499 32563 9633 -37737 7877 33432 -24444
1142 -24444 -21883 34177 5713 -36942 11892 31319 -26603 -18116 35533 1613 -35762 15795
1154 15795 28949 -29150 -14388 36284 -1916 -34862 18713 25996 -30962 -11472 35529 -6021
1166 -6021 -33295 21211 22517 -32505 -7420 35774 -9538 -30972 24054 19908 -33292 -3869
1178 -3869 35086 -12574 -28577 26785 16509 -33814 69 34017 -15976 -26320 28236 12541
1190 12541 -34702 3455 32521 -19473 -23650 29914 9140 -34446 7070 31020 -22086 -20576
1202 -20576 31487 5476 -34115 10863 29164 -24062 -17238 32894 1944 -33028 13938 26916
1214 26916 -26276 -14048 33242 -1878 -32413 16366 23990 -28495 -10934 32913 -5264 -30842
1226 -30842 19132 21259 -29381 -7584 33126 -8060 -28903 21831 18876 -30358 -3623 32654
1238 32654 -10969 -26939 24024 15497 -30986 -563 31365 -14271 -25109 25696 12173 -32024
1250 -32024 2379 30202 -17129 -22438 27298 9286 -31663 5669 29074 -19459 -19659 29150
1262 29150 5968 -31121 9087 27514 -21696 -16254 29927 2743 -30817 12262 25095 -23890
1274 -23890 -13960 30350 -578 -30117 14695 22540 -25449 -11057 30213 -3429 -28917 16891
1286 16891 20390 -26547 -7567 30279 -6225 -26799 19840 18179 -27381 -4430 30025 -9407
1298 -9407 -25219 21100 14856 -28600 -1533 28883 -12329 -23471 23037 11723 -29177 1565
1310 1565 28053 -15177 -21459 24951 9251 -29298 4918 27017 -17294 -18282 26518 6582 -29020
1323 -29020 7516 25348 -19423 -16080 26978 3125 -28559 9837 23348 -21323 -13485 27413
1335 27413 210 -28011 12400 21285 -22939 -10810 27770 -2312 -26480 15087 19547 -24075
1347 -24075 -7844 28170 -5046 -25312 17229 17272 -24887 -4973 27488 -8066 -23779 18863
1359 18863 14359 -25747 -2200 26657 -10617 -22050 20519 11854 -26428 353 26323 -12905
1371 -12905 -19898 22626 9499 -26519 3620 25268 -15160 -17704 23827 6790 -26224 6246
1383 6246 23464 -17250 -15417 24499 3527 -26083 8622 21698 -19224 -13517 24852 761
1395 761 -25419 10821 20086 -20436 -10642 25484 -1509 -24094 13219 18288 -21503 -7794 25819
1408 25819 -4160 -23128 15078 16218 -22798 -5245 24937 -6660 -22083 16746 13551 -23674
1420 -23674 -2766 24510 -9223 -20595 18577 11529 -23788 118 23958 -11005 -18119 20270
1432 20270 8949 -23932 2652 23190 -12982 -16384 21337 6517 -24034 4969 21460 -15638
1444 -15638 -14688 21879 3875 -24142 7269 20244 -16834 -12366 22562 1506 -23164 9633
1456 9633 19068 -18294 -9591 22784 -858 -22251 11474 17377 -19393 -7529 23089 -3056 -21527
1469 -21527 13242 15086 -20580 -5538 22806 -5569 -20224 15045 12953 -21042 -3247 22560
1481 22560 -7542 -18768 16710 11059 -21250 -560 22053 -9538 -17159 18345 8927 -21802
1493 -21802 1812 21352 -11772 -15654 19098 6404 -22017 3834 19778 -13690 -13987 19544
1505 19544 4127 -21922 6031 18669 -15096 -11547 20334 1831 -21150 8380 17473 -16118
1517 -16118 -9388 20949 -204 -20283 10126 15798 -17220 -7398 20964 -2582 -19787 11638
1529 11638 13880 -18715 -5785 20403 -4709 -18700 13251 12118 -19289 -3421 20523 -6695
1541 -6695 -17244 15095 10513 -19387 -1032 20155 -8427 -15708 16077 8448 -19959 1249 19254
1554 19254 -10381 -14259 17115 6271 -20124 3159 18286 -12081 -12877 17886 4180 -19618
1566 -19618 4905 17386 -13239 -10881 18328 2360 -19296 7220 16068 -14456 -8737 18925
1578 18925 198 -18847 8778 14406 -15701 -7221 18687 -1805 -18084 10432 12891 -16715
1590 -16715 -5107 18857 -4001 -17002 11746 11279 -17332 -3169 18898 -5771 -15745 13535
1602 13535 9814 -17456 -832 18332 -7311 -14708 14444 7948 -17795 563 17518 -9291
1614 -9291 -13400 15346 5785 -18152 2581 16792 -10542 -11715 16032 4326 -18261 4508 15961
1627 15961 -11689 -10199 16710 2372 -17657 6031 14781 -12821 -8588 16914 418 -17268
1639 -17268 7199 13259 -13982 -6724 16970 -1233 -16519 8840 11983 -14871 -5086 17156 -3150
1652 -3150 -15294 10597 10761 -15270 -3334 17142 -4290 -14428 11805 9261 -15857 -1319 16753
1665 16753 -6499 -13589 12622 7340 -16376 46 16076 -8093 -12368 13564 5744 -16372 1763
1678 1763 15117 -9345 -10903 14538 4293 -15942 3847 14699 -10350 -9428 14906 2445 -15657
1691 -15657 5086 13595 -11718 -7978 15220 763 -15582 6554 12430 -12640 -6551 15185 -1025
1704 -1025 -15200 8043 11162 -13328 -4843 15542 -2403 -13930 9164 10115 -13853 -3101 15617
1717 15617 -4161 -13235 10411 8480 -14144 -1649 14972 -5595 -12503 11421 6865 -14825 -180
1730 -180 14513 -7014 -11627 12016 5378 -14863 1588 14158 -7742 -10030 13269 4266 -14663
1743 -14663 3117 13356 -9097 -8692 13582 2577 -14360 4386 12444 -10472 -7572 13667 806
1756 806 -14472 5672 11352 -11312 -5933 13897 -542 -13535 7120 10466 -12178 -4557 14352
1769 14352 -1944 -12990 8398 9334 -12498 -3327 14278 -3537 -12321 9455 7653 -13141 -1616
1782 -1616 13560 -4878 -11348 9977 6593 -13559 -247 13299 -6074 -10539 11171 4992 -13272
1795 -13272 1270 12883 -7280 -9193 11720 3913 -13151 2458 12253 -8178 -7911 11905 2506
1808 2506 -13317 3742 11143 -9345 -7153 12231 1171 -13119 4979 10660 -9983 -5558 12812
1821 12812 -375 -12550 6242 9850 -10804 -4281 12856 -1652 -11708 7354 8595 -11108
1833 -11108 -2715 12707 -3098 -11248 8401 7264 -11976 -1978 12402 -4265 -10719 9452 6030
1846 6030 -12249 -445 11987 -5290 -9411 9713 4851 -12010 924 12029 -6167 -8597 10414
1859 10414 3683 -12120 2124 11220 -7133 -7706 10850 2409 -12018 3214 10451 -8057 -6440
1872 -6440 11036 897 -11648 4324 9854 -8852 -5390 11436 224 -11197 5556 8824 -9530
1885 -9530 -4124 11671 -1306 -10887 6550 7831 -10019 -2876 11517 -2757 -10327 7257 6851
1898 6851 -10587 -1801 11289 -3731 -9550 8246 5585 -10819 -407 11081 -4591 -8720 8781
1911 8781 4857 -10873 560 10578 -5227 -8039 9218 3637 -11220 1715 9911 -6598 -6812
1924 -6812 9779 2276 -10698 2610 9313 -7353 -6178 9951 1433 -10666 3626 9068 -7798
1937 -7798 -4781 10316 298 -10092 4896 8398 -8493 -3624 10334 -1116 -9868 5780 7163
1950 7163 -9045 -2937 10516 -2054 -9398 6414 6237 -9393 -1854 10314 -3241 -8702 7249
1963 7249 5568 -9521 -441 10270 -3824 -7836 7794 4345 -9653 370 9609 -5025 -7235
1976 -7235 8483 3259 -9948 1003 8880 -5736 -6398 8681 2275 -9744 2307 8631 -6326
1989 -6326 -5449 9073 1237 -9694 3392 8122 -6802 -4331 9391 221 -9208 4222 7567 -7702
2003 -7702 -3943 9272 -725 -8652 4946 6636 -8017 -2675 9285 -1646 -8478 5884 5597 -8694
2017 -8694 -1627 8935 -2523 -7849 6529 5016 -8325 -657 9309 -3474 -7214 7056 4071
2030 4071 -8733 91 8609 -4604 -6501 7603 2801 -9198 1121 8069 -5271 -5933 7636
2043 7636 2354 -8698 1937 7940 -5612 -4935 8287 1139 -8796 2842 7441 -6407 -4083 8330
2057 8330 132 -8416 3735 6636 -7017 -3333 8455 -726 -8069 4123 6058 -7253 -2666 8334
2071 8334 -1383 -7554 5149 5285 -7590 -1700 8587 -2202 -7252 5936 4532 -7664 -630 8008
2085 8008 -2802 -6575 6589 3515 -7898 87 7386 -3928 -6303 6690 2703 -8107 1018
2098 1018 7539 -4446 -5171 7020 2042 -7859 1666 7065 -4987 -4481 7543 1039 -7862 2731
2112 2731 6504 -5645 -3791 7651 323 -7702 3384 5868 -6214 -3007 7756 -384 -7679 4132
2126 4132 5447 -6472 -2238 7662 -1443 -6737 4645 4540 -6749 -1599 7326 -1936 -6396 5155
2140 5155 4189 -6869 -795 7525 -2947 -5674 5816 3462 -7102 80 7020 -3701 -5324 5881
2154 5881 2540 -7150 1131 6699 -3879 -4845 6404 1980 -7147 1820 6184 -4568 -3931 6441
2168 6441 947 -7088 2455 5930 -4824 -3247 6750 415 -6812 2790 5273 -5400 -2859 6656
2182 6656 -420 -6669 3807 4826 -5898 -1833 6919 -1392 -6101 4219 4257 -5960 -1065 6805
2196 6805 -1813 -5562 4507 3559 -6487 -728 6381 -2599 -5718 4841 2698 -6666 137 6486
2210 6486 -3129 -4910 5410 2332 -6150 747 6156 -3513 -4226 5679 1545 -6181 1623 5799 -4077
2225 -4077 -3638 5912 905 -6336 2206 5276 -4692 -3130 6010 -55 -6448 2583 4795 -5168 -2601
2240 -2601 6113 -491 -5945 3174 4215 -5338 -1638 6373 -1317 -5748 3585 3935 -5600 -1236 5975
2255 5975 -1930 -5167 4301 3219 -5844 -334 5989 -2489 -5018 4621 2411 -6185 82 5752 -2892
2270 -2892 -4425 5054 2376 -5803 843 5503 -3494 -3708 5169 1530 -5738 1251 5246 -3630 -3500
2285 -3500 5634 866 -5948 1761 4539 -4457 -3063 5572 223 -5535 2647 4401 -4648 -2426 5425
2300 5425 -497 -5322 3170 3880 -4991 -1436 5587 -1048 -5131 3427 3522 -5119 -869 5605 -1485 -4511
2316 -4511 3857 2744 -5187 -571 5348 -1941 -4528 4324 2409 -5383 113 5123 -2593 -3897 4654
2331 4654 1859 -5367 951 5083 -3100 -3489 4942 1133 -5460 1468 4836 -3454 -3095 5048 744
2346 744 -5275 1612 4207 -3892 -2710 5053 112 -5237 2365 4176 -4370 -2099 5349 -401 -4990
2361 -4990 2802 3878 -4183 -1566 5423 -903 -5086 3156 2984 -4501 -989 5290 -1327 -4399 3611
2376 3611 2569 -4826 -520 5105 -2055 -4053 3991 2260 -4789 124 4861 -2239 -3568 4305 1732
2391 1732 -4938 804 4667 -2812 -3501 4622 1285 -5057 1347 4226 -3286 -2737 4441 456 -4965
2406 -4965 1490 3826 -3869 -2277 4745 117 -4659 2220 3702 -3974 -1959 4894 -102 -4485 2416
2421 2416 3246 -3967 -1330 4817 -958 -4320 3013 2873 -4372 -884 4519 -1429 -4307 3126 2430 -4609
2437 -4609 -458 4396 -1976 -3817 3681 2268 -4413 211 4385 -2311 -3300 3867 1454 -4654 893
2452 893 4084 -2650 -2688 4258 951 -4787 1181 3971 -3223 -2589 4331 636 -4472 1578 3617 -3323
2468 -3323 -2106 4488 158 -4331 1944 3274 -3781 -1589 4588 -58 -4422 2416 2768 -3632 -1204
2483 -1204 4314 -1060 -4123 2605 2474 -3981 -793 4466 -1300 -3463 3043 2177 -3905 -276 4170
2498 4170 -1734 -3702 3516 1764 -4078 -6 4427 -2260 -3048 3497 1491 -4249 515 3932 -2610
2513 -2610 -2649 3452 811 -4222 1321 3554 -3067 -2273 3795 488 -3935 1356 3264 -3124 -2016 3956
2529 3956 151 -3840 1590 3341 -3324 -1620 4046 -435 -3732 2178 2834 -3445 -1283 3931 -924
2544 -924 -3634 2702 2501 -3607 -699 3960 -1352 -3535 2839 1936 -3968 -492 3787 -1720 -3207 3494
2560 3494 1700 -3615 20 3729 -1695 -2709 3061 1185 -3917 523 3495 -2488 -2625 3548 726
2575 726 -3782 655 3260 -2507 -2157 3615 392 -3616 1356 3387 -2831 -1905 3735 67 -3826 1844
2591 1844 2949 -2842 -1683 3985 -228 -3516 2028 2482 -3189 -847 3544 -816 -3573 2355 2202
2606 2202 -3341 -599 3614 -969 -3135 2568 2094 -3381 -256 3499 -1384 -2932 2787 1428 -3662
2621 -3662 213 3346 -1639 -2674 3214 1001 -3698 472 3036 -2131 -2398 2965 609 -3259 885
2636 885 3020 -2376 -2064 3263 541 -3546 1401 3079 -2444 -1630 3476 197 -3298 1517 2582 -2876
2652 -2876 -1217 3532 -289 -3256 1829 2569 -2817 -1108 3403 -861 -3217 2160 2176 -2991 -604 3534
2668 3534 -1001 -2867 2627 1946 -3251 -347 3662 -1381 -2802 2640 1457 -3444 200 3173 -1691
2683 -1691 -2418 3022 1260 -3276 338 2879 -1954 -2303 3024 626 -3381 722 2958 -2184 -1905 3085
2699 3085 743 -3390 1421 2734 -2464 -1776 3150 139 -3194 1618 2527 -2575 -1382 3216 -398
2714 -398 -2952 1701 2193 -2867 -1114 3061 -717 -2795 2188 2006 -2931 -550 3047 -856 -2572 2048
2730 2048 1959 -2894 -162 3263 -1247 -2417 2122 1292 -3094 26 2928 -1455 -2289 2705 1052 -3251
2746 -3251 370 2823 -1824 -2259 2691 802 -2997 752 2815 -1816 -1655 2606 360 -2855 971
2761 971 2365 -2249 -1553 2841 27 -2805 1281 2153 -2236 -1163 2876 -479 -2724 1625 1954 -2659
2777 -2659 -791 2878 -645 -2681 1668 2021 -2847 -580 2921 -812 -2495 2081 1562 -2737 -270
2792 -270 2868 -995 -2412 1988 1378 -2875 -102 2754 -1447 -2264 2256 887 -2985 534 2511 -1513
2808 -1513 -1888 2389 760 -2829 875 2644 -1598 -1571 2868 563 -2913 1016 2066 -1921 -1465 2819
2824 2819 -36 -2817 1252 2014 -2091 -1199 2683 153 -2674 1482 2140 -2441 -746 2795 -482 -2382
2840 -2382 1712 1543 -2355 -573 2980 -694 -2217 1827 1396 -2632 -318 2576 -933 -2051 2217
2855 2217 1146 -2542 -84 2822 -1050 -2076 2218 957 -2718 136 2491 -1510 -1771 2311 897
2870 897 -2531 462 2421 -1609 -1762 2466 390 -2538 807 2142 -1921 -1496 2419 56 -2258 1043
2886 1043 1931 -2110 -1051 2682 -143 -2586 1173 1724 -2378 -613 2407 -455 -2543 1487 1566 -2250
2902 -2250 -544 2715 -368 -2177 1706 1176 -2519 -44 2608 -959 -2105 1658 1075 -2376 16
2917 16 2580 -1375 -1566 1951 727 -2555 204 2458 -1229 -1643 2315 785 -2243 882 2012 -1838
2933 -1838 -1443 2263 175 -2280 1038 1864 -1808 -1270 2031 161 -2244 788 1830 -1809 -717 2422
2949 2422 -214 -2484 1301 1488 -2128 -690 2519 -52 -1913 1259 1393 -2084 -592 2662 -605
2964 -605 -2131 1299 1221 -2168 -300 2230 -777 -1855 1672 901 -2098 179 2182 -1078 -1619 1926
2980 1926 802 -2063 336 2035 -1274 -1517 2087 619 -2488 471 2001 -1519 -1464 2216 493 -2302
2996 -2302 592 1979 -1877 -1188 2142 -6 -2185 875 1885 -1759 -809 2181 153 -2081 1022
3011 1022 1533 -1771 -460 2090 -336 -1941 1422 1496 -1982 -428 2099 -475 -2085 1533 1157 -2002
3027 -2002 -259 2154 -1096 -1784 1452 865 -1802 23 1950 -1081 -1613 1891 835 -2121 339 2008
3043 2008 -1210 -1454 2111 388 -2244 547 1979 -1691 -1023 2021 -33 -2211 786 1797 -1522
3058 -1522 -1060 2009 30 -1965 1006 1605 -1741 -728 2251 -18 -2057 1107 1629 -1752 -563 1949
3074 1949 -120 -1647 1031 1287 -1922 -286 1953 -655 -1563 1399 990 -1766 -274 2142 -577 -1467
3090 -1467 1359 1062 -1973 -53 2012 -1147 -1647 1544 470 -1903 196 1955 -779 -1092 1821 668
3106 668 -1750 362 1813 -1278 -1056 1678 401 -1940 663 1710 -1213 -783 1877 63 -1890 1077
3122 1077 1286 -1588 -792 2117 -81 -1811 742 1377 -1357 -493 1876 -447 -1836 1198 799 -1896
3138 -1896 -420 1852 -339 -1620 1325 1063 -1717 5 1770 -812 -1472 1405 1003 -1728 184 1919
3154 1919 -668 -1252 1230 811 -1653 -15 1606 -1268 -1239 1516 762 -2084 404 1761 -1380 -1001
3170 -1001 1507 665 -1494 502 1522 -1247 -580 1677 277 -1863 841 1423 -1533 -574 1486 -20
3186 -20 -1946 933 1229 -1551 -650 1845 -123 -1611 1038 994 -1510 -442 1787 -410 -1540 1352
3202 1352 816 -1732 -182 1708 -567 -1505 1288 663 -1860 293 1770 -884 -1382 1275 712 -1565
3218 -1565 304 1511 -862 -1103 1520 349 -1992 369 1554 -1068 -1146 1571 472 -1631 562 1448
3234 1448 -969 -751 1591 422 -1385 694 1282 -1474 -738 1706 34 -1755 910 1395 -1564 -367
3250 -367 1584 -227 -1518 1066 903 -1496 -397 1333 -277 -1436 1082 840 -1268 -402 1443 -723
3266 -723 -1408 1174 935 -1620 43 1518 -469 -1211 1370 700 -1589 352 1701 -710 -1107 1220
3282 1220 386 -1823 136 1654 -872 -1089 1649 249 -1221 571 1401 -1086 -737 1398 55 -1398
3298 -1398 769 1049 -1247 -773 1949 8 -1283 941 1367 -1263 -545 1458 -267 -1244 1133 809
3314 809 -1435 -364 1549 -343 -1300 959 947 -1371 -175 1436 -565 -1495 996 900 -1352 100 1568
3331 1568 -708 -1035 1260 476 -1235 205 1591 -694 -872 1088 409 -1510 417 1206 -1097 -790
3347 -790 1537 324 -1360 201 1033 -1225 -828 1270 52 -1389 794 875 -861 -601 1282 -136
3363 -136 -1332 434 826 -1380 -339 1560 -237 -1363 978 919 -1292 -260 1302 -463 -1054 890
3379 890 489 -1412 -255 1356 -536 -1135 962 598 -1277 -187 1307 -533 -1107 1107 341 -1324
3395 -1324 576 1480 -909 -834 1260 195 -1370 46 1232 -761 -985 1002 379 -1500 339 1173
3411 1173 -962 -822 1096 60 -1194 483 815 -1163 -399 1478 239 -1138 818 883 -675 -566
3427 -566 953 -388 -1328 1173 892 -1059 -372 1186 -75 -908 1282 915 -1132 -249 1427 -466 -1103
3444 -1103 792 456 -1267 121 1144 -711 -975 960 397 -1246 143 1275 -722 -650 1136 261
3460 261 -1292 243 1111 -805 -680 1229 154 -1056 415 1092 -934 -703 1078 -24 -1227 467
3476 467 951 -990 -331 1317 45 -1086 703 745 -866 -556 1287 -458 -963 723 852 -1340 -300
3493 -300 1373 -294 -940 658 532 -1106 -169 1233 -634 -903 898 728 -1262 118 1324 -738
3509 -738 -831 1118 437 -900 73 967 -623 -474 1071 162 -825 260 1163 -570 -796 1169 127 -1204
3527 -1204 312 831 -919 -502 1111 225 -1035 364 905 -742 -594 990 -268 -1189 632 699 -986
3544 -986 -400 1102 -240 -944 707 438 -1083 -118 1015 -280 -1056 869 510 -1063 5 1109 -417
3561 -417 -681 790 420 -959 85 1003 -766 -914 1079 510 -1114 199 982 -763 -728 974 163
3578 163 -1338 209 740 -445 -493 898 333 -1074 325 754 -778 -376 802 -27 -796 352 675
3595 675 -859 -401 1080 -154 -859 742 824 -980 -264 1157 -121 -1051 507 437 -1156 -46 1020
3612 1020 -539 -613 745 475 -1122 -260 1134 -519 -862 744 650 -798 -19 1037 -511 -400 770
3629 770 292 -915 288 870 -631 -474 1124 310 -1174 101 1016 -814 -469 1248 -101 -1055 454
3646 454 905 -698 -549 951 -40 -889 512 829 -646 -254 869 -172 -810 582 893 -761 -134
3663 -134 1020 87 -1089 513 610 -888 -278 896 -475 -791 819 313 -817 -70 1108 -223 -949
3680 -949 953 42 -1045 202 1068 -467 -622 834 395 -1044 21 816 -816 -671 913 144 -1270
3697 -1270 216 808 -717 -658 865 81 -973 344 1031 -762 -521 1174 165 -923 474 736 -907
3714 -907 -389 901 -33 -979 326 431 -610 -159 868 -320 -986 506 646 -681 -362 887 -440
3731 -440 -200 612 496 -950 -73 753 -228 -557 775 515 -984 -12 574 -457 -749 1074 459 -1069
3749 -1069 240 854 -275 -586 812 93 -995 153 892 -407 -446 537 120 -825 218 1007 -832
3766 -832 -380 916 -51 -881 556 758 -947 -87 890 -95 -859 208 550 -519 -531 953 -107 -910
3784 -910 548 546 -778 -373 1064 -61 -653 542 399 -698 340 884 -218 -673 539 708 -952
3801 -952 70 736 -445 -467 626 278 -1160 343 846 -576 -580 744 174 -743 268 822 -596 -214
3819 -214 713 217 -953 389 591 -506 -341 873 62 -836 169 501 -618 -222 432 83 -727 479
3837 479 496 -1042 -297 737 -21 -1088 476 441 -536 -395 814 -323 -735 445 238 -919 -124 656
3855 656 -351 -555 415 369 -784 228 727 -391 -521 649 223 -813 -192 822 -443 -690 674
3872 674 418 -942 -3 381 -685 -319 789 224 -473 193 774 -597 -527 828 69 -531 428 758 -377
3891 -377 -235 865 -152 -781 229 634 -675 -28 774 -155 -567 743 525 -353 -218 635 -141 -554
3909 -554 468 487 -561 -283 833 -184 -761 543 222 -722 150 720 -447 -630 270 360 -677 167
3927 167 766 -465 -529 700 441 -553 199 806 -604 -304 672 -145 -580 234 595 -344 -426 777 -166
3946 -166 -553 614 683 -710 -447 851 31 -712 196 572 -736 -358 697 -125 -253 445 431 -974 -92
3965 -92 798 -274 -618 231 372 -646 -161 706 16 -349 356 388 -516 -251 365 -160 -368 371 423 -832
3985 -832 -74 527 -349 -378 590 138 -501 -3 494 -178 -538 684 332 -563 79 712 -458 -241 460 129
4005 129 -861 76 272 -319 -379 456 63 -713 323 691 -418 -296 562 97 -489 307 463 -533 -152 569
4025 569 -111 -429 420 337 -537 -303 596 -205 -227 296 283 -697 9 601 10 -591 386 160 -636 43 633
4046 633 -278 -686 614 296 -561 145 606 -252 -523 388 189 -521 -35 616 -425 -437 391 47 -365 98
4066 98 400 -471 -472 640 70 -593 316 490 -616 -285 501 -4 -485 571 776 -430 -108 301 -10 -418
4086 -418 333 271 -504 -249 596 -106 -791 401 535 -552 -187 352 45 -565 498 315 -696 74 388
4105 388 -273 -359 437 212 -444 38 377 -358 -402 452 161 -365 250 611 -444 -483 423 102 -564 146 651
4126 651 -422 -79 280 30 -623 96 489 -500 -256 454 -25 -404 304 453 -599 -267 424 -174 -596
4145 -596 327 461 -361 30 478 -72 -292 243 241 -745 -216 503 -98 -522 569 523 -395 -6 335 -187 -690
4166 -690 259 302 -477 70 578 -218 -333 482 -73 -511 -204 472 -382 -434 389 9 -614 -5 433 -338 -451
4187 -451 383 101 -244 -75 273 -397 -355 393 239 -278 125 640 -728 -68 531 -158 -568 23 441 -395
4207 -395 -138 455 -94 -585 354 373 -264 -160 181 -130 -383 247 68 -389 -209 418 -116 -605 455 172
4227 172 -357 38 325 -127 -492 236 265 -557 88 430 -115 -192 429 184 -492 -57 495 -259 -246 355 179
4248 179 -226 337 462 -473 -86 485 -166 -546 71 370 -239 -249 797 -10 -386 266 185 -440 -62 747
4268 747 -204 -536 174 435 -443 -262 379 101 -474 256 437 -287 132 204 -167 -525 392 105 -339 6
4288 6 143 -441 -508 276 74 -308 63 455 -155 -129 485 -51 -629 108 255 -454 -253 571 284 -587 -54
4309 -54 206 -352 -280 398 68 -292 300 416 -375 -369 409 213 -313 235 388 -525 -238 482 -45 -641 269
4330 269 423 -102 -112 532 233 -264 187 215 83 -123 334 -37 -437 329 297 -394 -39 419 -197 -190 335 142
4352 142 -542 -218 460 -257 -109 344 484 -308 203 542 -343 -292 316 47 -241 203 556 -196 -223 387 83
4373 83 -293 -69 303 -383 -412 344 149 -95 -35 151 -174 135 284 238 -239 168 355 -580 82 526 -84
4394 -84 -268 -118 330 -422 -167 263 -336 -157 229 234 -275 -253 315 25 -438 388 324 -77 -88 318 -24 -535
4416 -535 193 -32 -378 -64 251 -268 -385 376 265 -319 -13 475 -484 -292 327 -14 -528 299 441 -583
4436 -583 -245 384 116 -598 -3 186 -144 -219 622 111 -253 187 408 -200 -243 258 -158 -127 48 130 -455
4457 -455 132 327 -105 -393 222 346 -168 199 282 -195 -143 96 250 -504 -81 369 -120 -272 254 290 -308
4478 -308 -270 395 -100 -207 -84 223 -71 -149 10 -119 1 140 250 -267 42 516 -11 -139 203 1 -423
4499 -423 -119 414 -30 5 206 -119 -318 -144 143 -236 -334 249 91 -181 -147 414 -180 -66 309 -128 -162
4520 -162 139 177 -225 15 157 -173 -367 201 235 -170 -36 438 52 -185 179 219 -147 -19 278 -71 -75 17
4542 17 -146 -281 13 189 -316 -281 375 -40 -113 52 222 -146 -88 551 146 -402 -158 530 -424 -203 315
4563 315 169 -313 -13 250 -371 -173 373 -193 -478 -71 58 -86 -326 351 85 -476 108 296 -542 10
4583 10 552 -156 -303 62 304 -172 -319 255 -110 -325 -193 365 -157 -401 453 -78 -303 227 237 -357 -46
4604 -46 436 -81 -66 206 207 -185 102 183 -75 -338 95 341 -500 256 326 -228 -130 44 -70 -463 -10 183
4626 183 -233 -254 378 194 -459 107 206 -305 -213 118 127 -254 -82 322 -473 -132 128 31 -359 103 345 -268
4648 -268 -153 321 50 -485 -8 392 -378 -187 362 -265 -123 300 203 -117 -14 131 -29 -201 -29 127
4668 127 -256 52 197 82 -147 227 -264 -218 88 339 -322 -252 -20 17 -186 -101 570 -245 -88 181 164 -425
4690 -425 52 132 -177 -407 -22 96 -335 295 234 -129 -46 294 -94 -322 289 423 -345 -312 343 -233 -280 194
4712 194 66 -85 -60 397 -88 -319 120 187 -148 -46 190 -112 -53 73 116 -90 11 96 -47 -246 449 163
4734 163 -199 122 141 69 -516 46 107 -117 222 136 -192 210 36 -1 -138 78 375 264 -229 388 292 -482
4756 -482 -86 318 -53 -231 288 -12 -349 80 -216 -179 -346 311 45 -409 85 225 -169 -166 205 -105 -234
4777 -234 197 337 -305 -237 194 -156 -526 10 78 -240 -66 150 -161 -195 156 276 -222 190 332 147 -83
4798 -83 302 81 -148 -18 136 -77 -243 -153 176 -280 16 39 19 -49 313 -30 -243 -79 234 -230 -154 208
4820 208 -64 -245 -183 381 -13 -197 -48 -147 -127 29 -6 -190 -46 222 -298 -142 152 257 -430 195 267 -101
4842 -101 -394 168 336 -182 -80 205 276 -232 180 -103 -417 69 126 -237 -220 107 314 -293 163 155 -122 -235
4864 -235 50 -102 -5 66 299 -105 -414 -148 -73 -254 313 265 -249 -345 348 154 -425 64 154 11 108 50 -52
4887 -52 -301 297 104 -77 -40 358 -339 -368 212 85 -95 -90 151 61 -217 178 328 -123 -202 248 -56 -239
4909 -239 291 109 -344 -202 109 -54 -368 -45 39 -383 14 152 -333 -95 188 20 -223 86 258 -243
4929 -243 -165 -141 -22 -46 -12 415 -253 -185 284 126 -177 115 218 -112 24 457 70 -121 99 308 -155 -33
4951 -33 82 -29 -276 -90 173 -346 -155 384 107 -63 -193 88 -339 -145 201 -42 85 300 72 -222
4971 -222 127 101 -9 -209 205 57 24 127 209 -255 -233 38 47 -231 -13 112 101 -28 149 158 -380 192 283
4994 283 -142 149 50 -33 -161 216 129 -126 -5 43 19 -97 58 327 -217 -59 158 8 -227 273 411 -18
5016 -18 -16 237 127 -359 316 384 -400 210 181 -51 -279 335 -56 9 -69 -28 -14 6 6 187 -157 -190 313 46
5040 46 -188 -8 148 -55 -158 289 -549 -236 402 -41 -205 -149 281 -52 -150 -21 -13 -49 336 212 -48 -7
5062 -7 132 -150 -130 -151 204 -134 -360 17 9 -439 254 178 -36 142 51 159 -165 -179 -132 -268 136 107 157 -105
5086 -105 39 97 -309 -72 212 -145 -128 328 293 -90 -29 187 123 270 180 161 -121 4 388 120 -149 -19
5108 -19 162 -263 23 188 -181 -217 158 58 -45 131 241 -315 -103 368 -15 -56 13 149 -263 -10 -38 54
5130 54 -45 212 189 237 81 96 48 -262 14 307 298 -205 6 94 -11 74 83 -175 41 212 44 -177 293 104
5154 104 -261 -9 73 93 -341 163 83 -192 33 31 28 -110 71 411 -315 -78 292 -122 -66 213 68 -166 295
5177 295 157 -259 -112 206 138 -572 182 101 179 187 92 -37 -212 147 61 -194 47 239 312 -4 70 308 51
5200 51 -381 49 81 -321 -190 90 -177 76 65 -65 -164 3 55 -166 -55 63 -206 -19 153 306 127 127
5222 127 418 125 -48 244 42 -224 -150 124 -191 -190 436 -3 177 -49 279 -325 -109 143 193 -102 41
5243 41 32 23 -305 612 79 -76 -76 212 -93 -323 172 19 -364 281 -60 -210 -60 -17 -120 -230 145 276 -148
5266 -148 -30 258 -131 -306 107 230 -170 26 1 -339 -258 -5 61 97 -239 260 -194 -64 242 -26 -252
5287 -252 255 253 -90 -418 -108 -6 82 -138 317 -158 -170 -23 262 -423 43 196 -166 -52 152 67 -425 99
5309 99 183 -242 -111 100 124 -189 100 202 -172 24 224 82 13 114 190 -284 -249 82 -140 -257 242 -97
5331 -97 -112 218 335 -133 -158 79 171 -124 -76 121 -7 -215 281 29 -237 76 90 -212 -211 268 43 -289 271
5354 271 105 71 -290 144 -60 -291 -22 -21 -264 -121 89 170 -254 -106 327 5 -109 206 175 -72 208 130
5376 130 -69 -197 133 -223 -107 273 220 6 -95 72 34 -427 377 135 -268 9 180 -112 -155 267 -7
5397 -7 -333 -226 -84 30 -372 363 98 -293 -33 280 51 -220 -7 115 -377 -149 297 -98 136 183 45
5418 45 -13 -68 262 20 56 82 -212 -558 175 195 -90 34 124 18 -224 -57 8 -211 -104 0 -185 -2 -98
5441 -98 95 -169 -62 311 -68 -593 156 77 -211 230 193 120 14 202 123 -195 -16 256 168 -86 -40 38 154
5464 154 59 90 -75 -250 106 124 -470 -124 251 -203 -305 218 133 -392 67 222 40 -202 280 -167 -195 120
5486 120 146 -160 -86 24 36 -198 -51 254 -37 -30 305 -11 -80 82 424 -400 54 132 -10 126 140 246 -268
5509 -268 -388 56 -108 -296 209 108 -436 -93 -169 -61 -192 187 166 -29 17 362 59 -208 9 48 -169
5530 -169 -14 301 -181 -148 164 -34 -248 18 145 149 -186 18 -27 -338 -21 109 -45 -93 59 8 -64 313
5552 313 220 73 218 275 -36 -317 281 176 -249 -223 229 -284 -379 110 -147 -117 -78 345 37 -194 314 71
5574 71 -557 -101 103 -128 9 73 249 -164 102 43 246 -124 24 -56 -51 28 189 146 -167 81 128 -43 148
5597 148 258 -358 -51 287 -215 -83 143 222 -166 -239 296 -82 -337 237 487 -202 -66 -65 -2 51 56 50 87 36
5621 36 -72 156 80 237 133 -157 -119 131 -183 -259 2 243 -76 -282 154 -166 -211 -124 5 -70 172 406
5643 406 24 92 31 -52 -142 117 102 -50 9 359 67 -257 1 -45 141 -96 14 91 -69 70 -202 -187 -47
5666 -47 -115 12 -99 78 236 -138 203 59 -45 -233 -12 180 -84 56 245 44 -335 184 89 14 -185
5687 -185 155 219 -346 -21 -67 -219 -220 225 -23 -296 145 49 -68 -28 127 -68 -160 84 -1 -64 111 -25 -263
5710 -263 -109 163 -142 -113 -308 120 -14 -166 296 -34 10 42 18 -143 -80 47 -230 -167 319 235 -268 -109
5732 -109 125 -92 -19 92 245 92 -118 -67 -32 -57 46 232 -302 -176 341 101 73 89 -35 -67 -123 229 36
5755 36 -43 223 -1 -208 -106 82 -118 76 -94 -87 137 -57 308 -83 31 156 188 -55 95 323 -113 48
5777 48 229 12 -289 -208 209 -134 -259 -30 -44 -324 200 165 -278 -216 289 -12 -111 127 47 -389 1 101
5799 101 -6 -204 129 179 3 -114 311 -76 -327 -16 31 -314 -260 186 -255 -178 216 -90 -367 9 240
5820 240 -153 20 8 113 -128 -5 190 -108 26 -112 -200 -201 -51 240 113 -302 152 302 -239 218 120 162
5842 162 -45 245 121 -238 -83 -19 9 -273 12 115 -213 -173 -136 -120 -52 366 27 -246 -33 304 -131 -102
5864 -102 374 -139 -151 166 170 -129 -58 208 21 0 217 208 65 -46 -24 183 -356 4 -112 -237 160 237 -225
5887 -225 -228 253 120 -116 17 107 -236 32 -14 101 -200 51 339 -3 85 308 -124 -203 100 313 -69 -20
5909 -20 311 78 -107 -193 -122 -265 -68 205 408 -55 23 419 -267 -39 9 65 -419 76 -47 -153 -266 -17
5931 -17 -60 -196 209 40 10 -243 114 159 100 -94 -24 22 -118 -115 -315 -321 65 -100 -259 -8 123 -168 -183 176
5955 176 105 9 -48 91 -250 -182 238 12 -119 -335 2 -150 -22 319 121 -166 29 105 83 -1 367 32
5977 32 -69 -67 65 -61 -172 295 -238 -229 46 -80 -193 -97 37 16 -312 -60 -63 -305 -280 171 -67 -349 -85
6000 -85 34 -419 -27 493 -9 -113 170 107 12 -22 236 -47 -65 -8 67 -291 243 102 -186 -66 268 262 -278
6023 -278 195 -229 109 -35 -35 -106 1 118 132 22 -46 59 -35 -93 109 82 -98 -11 205 -369 -362 158 6 -62
6047 -62 68 -89 -30 -204 275 72 -66 39 239 -211 -83 41 18 231 -228 71 -193 31 358 141 -135
6068 -135 20 51 87 -95 103 210 -29 26 259 -70 -199 135 199 -118 313 -38 100 -7 -149 263 -133
6089 -133 -153 72 -37 273 -132 -96 54 215 308 7 -153 -122 -79 -147 56 158 -32 13 125 -51 -49 70 129
6112 129 -180 145 133 -4 -248 147 203 -156 30 -157 32 -469 400 -84 -455 -15 146 -182 65 345 -41
6133 -41 -86 7 157 -340 -126 -45 31 -330 -354 77 -106 -259 415 -8 -117 138 64 22 -217 158 22 -58 143
6156 143 -149 -199 -205 -18 17 176 -5 108 -161 -35 66 18 -69 37 94 -94 44 361 20 6 197 78 48
6179 48 183 67 -138 -67 36 -115 -93 26 299 -160 -257 3 245 -74 128 208 -279 -98 337 -20 -254 82
6201 82 162 -28 -108 211 62 -93 -70 255 -35 207 195 -109 21 3 -163 -80 187 159 -137 -236 -180 -178 -132 208
6225 208 41 -214 -115 138 -49 -113 -21 -329 19 170 122 -115 -78 111 117 -83 -46 -19 92 263 64 -52 -130
6248 -130 318 195 -131 -15 -122 -26 -245 37 -19 109 -96 291 204 -162 12 -13 78 -193 -36 164 -129 -90
6270 -90 -135 -43 -52 -179 -83 -118 -142 238 -52 -273 235 57 -245 -116 236 -112 -75 -75 -50 -156 78 339 87 -187
6294 -187 70 66 -23 -101 207 -161 -5 26 7 130 72 118 -4 36 189 184 65 13 -105 107 -97 -55 -210 -118 -230
6319 -230 40 76 139 -81 77 50 -7 -71 -87 132 26 -170 -62 -10 -250 -79 114 345 -346 194 4 -15 -167
6342 -167 -161 -119 -36 116 -17 -163 -244 42 191 70 -117 197 -179 -57 -81 47 -41 -112 240 -138 -82 -92 -96 26
6366 26 -104 157 -117 -14 249 17 -199 -95 -26 -45 -94 173 -17 -356 -1 37 152 -297 45 151 256 -114
6388 -114 -157 -183 -228 -20 36 217 -23 140 83 21 -9 143 91 100 39 18 -295 -116 141 -207 -58 37 -125 -269
6412 -269 -205 221 -288 305 107 -210 22 -127 -91 99 -272 -4 -131 -102 235 -18 20 -66 -202 -105 -135 145
6434 145 -171 34 32 54 -305 -28 -136 -12 152 138 9 -72 -156 -94 54 -245 88 128 -207 -73 -107 -173 -25
6457 -25 72 28 -188 -284 442 -116 -125 299 180 32 88 128 18 -294 319 -48 -128 92 122 200 -38 92 -94 48
6481 48 229 -79 -60 246 61 -173 -205 -215 -76 -88 126 73 61 -25 172 169 19 78 1 -11 -123 128 -72 -154 6
6506 6 94 -64 -24 26 248 -52 123 157 -145 -146 -69 156 0 -11 238 -37 -203 336 -127 25 95 217 1 14
6530 14 272 56 -108 97 105 0 71 -75 -94 16 187 179 -320 120 137 147 -12 -11 -133 -31 -41 -32 -35 239 -110
6555 -110 31 73 -63 -54 -93 -23 -76 -8 15 -66 101 100 20 56 58 -212 -104 -294 -206 0 212 67 -303 274 161
6580 161 160 66 -47 -63 -194 28 -6 -331 -144 442 397 -238 123 -92 -224 74 13 -135 169 -246 125 -258
6602 -258 -148 104 80 -33 112 176 141 -108 -22 208 -42 -168 244 -30 213 65 175 -299 -285 -210 -164 123
6624 123 57 133 -29 125 114 -155 -277 271 126 173 163 88 -138 -87 -45 21 -56 9 22 -29 129 -90 151 9
6648 9 126 -99 90 -123 112 135 -20 209 -120 73 59 223 -293 134 81 -22 -288 116 167 -126 -7 217
6670 217 -96 45 82 -19 -48 -168 -143 0 -25 116 183 -418 -108 109 69 -64 133 141 -190 124 52 57 -25 70
6694 70 -49 -236 92 -18 110 -36 -40 -184 -52 224 -20 119 35 -20 26 98 184 -67 -163 -162 226 -78 -21 198
6718 198 -123 -161 -5 252 276 -61 12 130 -103 -175 105 77 -253 -28 225 -167 104 -62 16 -63 -98 98 -15
6741 -15 -162 336 207 -168 -117 90 -133 134 99 -76 43 140 197 204 80 33 -7 72 -114 -117 -81 132 159 62 -94
6766 -94 -28 -173 -103 -120 41 -183 -27 109 8 -21 -12 31 -97 -87 -39 -23 -271 66 106 -241 -164 92 -136 82
6790 82 -136 207 -271 4 -10 281 71 -205 67 73 -19 -133 -140 -199 -120 252 -7 147 220 -5 -371 188 -217
6813 -217 -89 -56 73 -81 165 17 -235 -54 2 217 267 -232 119 336 -311 126 -75 38 -82 -19 102
6834 102 153 35 0 -98 -256 242 -255 24 150 69 -122 202 143 36 -6 311 303 75 84 46 -125 -120 127 318
6858 318 -67 -157 -101 79 43 137 89 61 -140 -10 72 -5 -7 -131 117 133 189 34 -238 -267 77 -113 -101 -274 -206
6883 -206 29 -35 113 -216 -118 141 -255 -71 -91 223 -19 275 41 232 -43 -2 91 -107 -118 1 16 123
6905 123 105 109 -213 207 72 -499 163 9 198 -339 -42 -36 -62 17 150 6 -225 86 4 -98 77 123 146
6928 146 3 294 -172 -98 73 95 120 3 -59 147 -95 -35 208 33 -101 184 158 -144 -85 -119 -170 44 112
6951 112 -62 -11 214 70 90 268 47 119 -84 -187 237 -256 -16 169 -168 -281 10 187 145 -156 139
6972 139 23 -5 181 53 -186 215 18 145 137 165 -78 -253 66 326 -169 -70 -71 104 38 -182 -225 31 -217
6995 -217 173 -1 -49 -45 21 150 -150 -94 78 136 269 55 -197 2 -31 -156 -2 257 328 108 -105 -37 239
7018 239 26 -96 339 -41 9 79 -271 164 219 -95 2 -76 466 -6 131 113 293 36 -162 -160 -152 -131 -27 106
7042 106 -9 -37 -217 1 -124 20 -18 -148 277 142 88 -73 -63 -201 -19 -141 45 -37 105 267 54 -13
7064 -13 72 26 -35 -5 9 -251 -9 1 76 19 210 337 -16 -134 -382 160 -61 32 313 -33 -354 -34 98
7087 98 180 -108 69 -50 -194 -87 -37 -137 2 13 219 -141 102 195 -109 30 99 -82 -96 -150 -26 53 -94
7110 -94 230 -34 35 -70 159 59 -34 -226 -22 -127 265 101 -37 -109 178 -140 83 31 -125 -34 242 101
7132 101 -85 4 93 131 -81 109 192 -155 -207 -109 -127 -345 61 70 -57 -116 -48 -257 -16 -276 -5 -191 10 203
7156 203 82 -246 177 119 -28 380 -106 13 -185 157 53 -79 -222 69 -366 28 29 273 67 11 243
7177 243 48 -77 241 56 86 95 -164 98 -1 20 69 -111 209 11 128 15 94 82 -286 232 100 -120 -96
7200 -96 -13 43 31 -62 213 -153 -114 87 -96 -260 46 149 -88 -29 -64 -152 -3 -33 74 -69 60 256 -73
7223 -73 143 -26 -8 84 264 183 38 -35 4 -38 -291 -43 122 246 -106 -38 -77 -324 136 116 53 -47 20 -66
7247 -66 -222 -102 -115 -25 61 183 -91 -48 67 143 34 -42 230 77 59 -85 -100 -26 5 327 218 -416 42 -109
7271 -109 -220 -99 27 -101 -203 131 172 95 -142 3 -51 -6 -242 244 -86 84 48 237 -128 115 187 -150
7293 -150 15 163 111 -34 -93 184 173 -95 40 67 25 -15 -28 -40 300 139 -199 105 -137 41 52 -211 179
7316 179 93 174 139 61 -25 -52 -150 -139 -159 -126 -24 -266 203 56 40 -46 -2 -159 106 -5 145 -99 151 83 -23
7341 -23 -68 18 -280 -133 -40 183 -119 32 -17 -94 112 315 110 -7 160 74 191 -27 31 150 -57 73 -28
7364 -28 125 -243 171 109 14 242 -5 84 -192 -62 40 56 112 149 -127 -6 9 15 -5 50 -16 21 196 -23 6
7389 6 134 -284 40 -37 -38 22 204 108 83 149 -161 -192 -51 -47 3 -4 487 -7 -192 49 123 82 86 88 -228 -296 22
7416 22 40 -72 279 -22 77 115 40 -5 -15 247 -76 28 144 -37 172 -135 -124 -60 106 -143 256 284 53
7439 53 221 119 -68 -6 -210 -38 20 -157 144 168 305 162 124 -236 239 -162 -100 -44 62 -118 -118 -12 34
7462 34 -116 -230 271 0 28 -66 -291 6 -71 -123 56 -29 43 -242 -74 234 -5 23 -18 -11 -140 -165 247 142
7486 142 -334 -37 -28 138 9 -102 80 -42 98 -108 107 -256 87 106 112 -40 128 119 154 168 -157 171 252
7509 252 94 -79 56 22 47 46 -113 154 35 245 70 30 -38 -255 92 -89 58 -178 -209 71 -213 103
7531 103 46 -97 -38 -325 -302 -53 116 -94 -128 92 -22 38 -86 96 211 132 53 -6 33 16 105 39 -97 1
7555 1 69 -140 32 53 -76 -30 280 -51 -292 132 100 -89 38 132 -28 -58 -279 172 -228 -56 22 61 -49
7578 -49 390 118 14 84 -5 -41 93 136 -237 -209 -14 7 -62 61 182 294 -76 -59 -21 199 121 204 152 109 105
7603 105 76 -38 -117 -120 125 69 -29 -131 -57 -289 -140 -50 -143 -166 -82 6 -150 -26 14 0 134 220 -106 -75 271
7628 271 106 -149 20 -86 117 -92 113 26 -25 -63 19 182 -13 441 -70 -189 142 142 -130 59 91 -238
7650 -238 57 -4 -124 109 83 -19 144 92 56 110 -88 -142 -142 41 -77 -37 21 -60 26 89 -156 -217 166 -29 -53
7675 -53 267 39 -169 63 -56 -85 -117 75 -58 -72 -90 -161 207 -303 137 -101 10 19 -6 23 79 -105 -137 -112
7699 -112 27 53 46 -65 161 201 -28 -38 25 -126 188 -11 -9 -170 -108 95 -76 -154 147 39 -77 -159 270 -29
7723 -29 21 65 2 -39 104 58 19 64 -90 128 48 20 211 74 -35 -18 130 84 -1 121 -153 -256 -41 -242
7747 -242 -18 -145 -141 -60 -60 96 -104 156 -147 80 -32 172 47 83 44 1 -76 -19 153 45 97 -43 -58 99
7771 99 -120 -219 99 17 -56 -98 38 255 83 42 -367 -220 67 50 -54 -32 -27 -181 24 53 99 72 107 124 -53
7796 -53 -82 -80 26 -285 43 11 37 85 65 86 -152 -22 -65 -137 80 -58 -122 -185 -258 -111 -262 57 272 64 133
7821 133 258 -22 91 -78 -7 -73 -112 -64 120 24 39 43 136 113 248 20 -83 287 -61 50 -112 143 52 224
7845 224 138 -6 242 55 231 -155 -216 -45 -239 9 -92 -76 -52 355 -196 93 -147 97 355 95 -115
7866 -115 -228 -114 -271 112 -81 -88 158 272 193 9 41 -6 -142 31 -76 168 -131 236 -87 -117 -172 -270 -352
7889 -352 166 92 196 -141 -76 47 261 -55 -238 -126 -88 -108 -52 13 -52 -44 190 -70 -7 -77 160 -10 162 -13
7913 -13 -118 -79 167 75 -113 115 -191 293 162 -217 -261 -65 -24 76 32 -65 229 -158 -38 296 -92 -49 31
7936 31 71 -126 -133 229 -169 -196 -19 16 -19 -83 93 -19 -41 111 -15 -20 -65 -131 61 -301 -160 186 124 -103 -205
7961 -205 42 121 -76 -136 153 -151 -21 -160 -59 -50 -150 -213 -92 154 -50 -39 289 -1 -35 103 -53 -315
7983 -315 65 -3 151 148 20 103 340 -54 265 -33 101 69 -56 89 2 161 -142 -27 84 201 -92 -21
8005 -21 92 379 -49 -8 -11 -74 -128 288 14 -190 -30 -98 -175 -144 22 131 93 -69 408 -89 153 30 -46 -61
8029 -61 -74 107 42 132 -65 193 56 107 119 -94 150 192 62 -248 -75 233 -74 -152 -189 -51 -83 6 -160 -152
8053 -152 115 99 206 -42 48 -209 -53 97 287 158 -16 -71 -13 90 148 92 160 -4 2 199 -190 200 158
8076 158 157 -82 -91 136 -17 -27 -110 -383 33 84 12 166 -191 103 86 -13 31 -183 160 102 91 214 244 -220 -122
8101 -122 -214 209 91 68 -270 2 237 -102 140 -43 20 21 -51 -136 18 -179 -85 -78 42 67 -88 -100 174 -84
8125 -84 -148 -8 2 173 82 96 255 361 31 -41 39 76 51 -123 62 -137 -180 -240 -69 124 -118 -138 215 -35
8149 -35 3 -177 56 -213 117 111 216 49 28 225 -23 -199 -18 221 13 -97 74 159 -140 -130 42 265
8171 265 321 -24 -24 249 -52 -66 208 78 -67 14 187 -190 177 13 138 25 -124 249 74 62
8191F2
##END NTUPLES=NMR FID
##END=
