##TITLE=1H_ABBC-1-3d
 CDCl3
 8 sc, 
 20.2.2024
##JCAMPDX= 6.0         $$ Bruker NMR JCAMP-DX V2.0
##DATA TYPE= NMR FID
##DATA CLASS= NTUPLES
##ORIGIN= UXNMR, Bruker Analytische Messtechnik GmbH
##OWNER= root
$$ XWIN-NMR		Version 3.5
$$ Tue Feb 20 14:48:51 2024 Russian Standard Time (UT+4h)  she@DPX200
##.OBSERVE FREQUENCY= 200.1313
##.OBSERVE NUCLEUS= ^1H
##.DELAY= (6, 6)
##.ACQUISITION MODE= SIMULTANEOUS
##.ACQUISITION SCHEME= undefined
##.AVERAGES= 8
##.DIGITISER RES= 18
##SPECTROMETER/DATA SYSTEM= spect
##.PULSE SEQUENCE= zg30
##.SOLVENT NAME= CDCl3
##.SHIFT REFERENCE= (INTERNAL, CDCl3, 0, 15.7039)
##AUDIT TRAIL= $$ (NUMBER, WHEN, WHO, WHERE, WHAT)
$$ ##TITLE= Audit trail, XWIN-NMR		Version 3.5
$$ ##JCAMPDX= 5.01
$$ ##ORIGIN= Bruker BioSpin GmbH
$$ ##OWNER= she
$$ F:/spectra/data/she/nmr/H-F/1/audita.txt
$$ ##AUDIT TRAIL=  $$ (NUMBER, WHEN, WHO, WHERE, WHAT)
(   1,<2024-02-20 14:47:18.43 +0400>,<she>,<DPX200>,
      <created by zg, POWCHK disabled, PULCHK disabled
       configuration hash MD5:
       00 E9 B6 7A A2 85 ED C7 34 08 36 98 17 FE 4E 26
       data hash MD5: 16K
       E4 18 B3 79 E6 97 D3 AB 21 51 E7 F3 75 16 35 3F>)
$$ ##END=
$$ 
$$ hash MD5
$$ 80 91 99 DD 2F C3 B6 A9 15 F4 C4 D0 F4 82 FE E4
##$RELAX= 
##$RELAX= 
##$RELAX= 
##$RELAX= 
##$RELAX= 
##$RELAX= 
$$ Bruker specific parameters
$$ --------------------------
##$DU= <F:/spectra>
##$EXPNO= 1
##$NAME= <H-F>
##$PROCNO= 1
##$TYPE= <nmr>
##$USER= <she>
##$AMP= (0..31)
100 100 100 100 100 100 100 100 100 100 100 100 100 100 100 100 100 100 
100 100 100 100 100 100 100 100 100 100 100 100 100 100 
##$AQSEQ= 0
##$AQ_mod= 1
##$AUNM= <au_zg>
##$AUTOPOS= <>
##$BF1= 200.13
##$BF2= 200.13
##$BF3= 200.13
##$BF4= 200.13
##$BF5= 200.13
##$BF6= 200.13
##$BF7= 200.13
##$BF8= 200.13
##$BYTORDA= 1
##$CFDGTYP= 0
##$CFRGTYP= 5
##$CHEMSTR= <none>
##$CNST= (0..31)
1 1 145 1 1 1 1 1 1 1 1 1 1 1 1 1 1 1 1 1 1 1 1 1 1 1 1 1 1 1 1 1 
##$CPDPRG= <>
##$CPDPRG1= <>
##$CPDPRG2= <>
##$CPDPRG3= <>
##$CPDPRG4= <mlev>
##$CPDPRG5= <mlev>
##$CPDPRG6= <mlev>
##$CPDPRG7= <mlev>
##$CPDPRG8= <mlev>
##$CPDPRGB= <>
##$CPDPRGT= <>
##$D= (0..31)
0 1.2 0 0 0 0 0 0 0 0.06 0 0.03 0 0 0 0 0.0002 0 0 0 0 0 0 0 0 0 0 0 0 
0 0 0 
##$DATE= 1708426037
##$DBL= (0..7)
120 120 120 120 120 120 120 120 
##$DBP= (0..7)
150 150 150 150 150 150 150 150 
##$DBP07= 0
##$DBPNAM0= <>
##$DBPNAM1= <>
##$DBPNAM2= <>
##$DBPNAM3= <>
##$DBPNAM4= <>
##$DBPNAM5= <>
##$DBPNAM6= <>
##$DBPNAM7= <>
##$DBPOAL= (0..7)
0.5 0.5 0.5 0.5 0.5 0.5 0.5 0.5 
##$DBPOFFS= (0..7)
0 0 0 0 0 0 0 0 
##$DE= 6
##$DECBNUC= <off>
##$DECIM= 32
##$DECNUC= <off>
##$DECSTAT= 4
##$DIGMOD= 1
##$DIGTYP= 9
##$DL= (0..7)
0 120 120 120 120 120 120 120 
##$DP= (0..7)
150 150 150 150 150 150 150 150 
##$DP07= 0
##$DPNAME0= <>
##$DPNAME1= <>
##$DPNAME2= <>
##$DPNAME3= <>
##$DPNAME4= <>
##$DPNAME5= <>
##$DPNAME6= <>
##$DPNAME7= <>
##$DPOAL= (0..7)
0.5 0.5 0.5 0.5 0.5 0.5 0.5 0.5 
##$DPOFFS= (0..7)
0 0 0 0 0 0 0 0 
##$DQDMODE= 0
##$DR= 18
##$DS= 0
##$DSLIST= <SSSSSSSSSSSSSSS>
$$ [...]
##$SUBNAM2= <"">
##$SUBNAM3= <"">
##$SUBNAM4= <"">
##$SUBNAM5= <"">
##$SUBNAM6= <"">
##$SUBNAM7= <"">
##$SUBNAM8= <"">
##$SUBNAM9= <"">
##$SW= 18.0517328524113
##$SWIBOX= (0..15)
0 0 2 0 0 0 0 0 0 0 0 0 0 0 0 0 
##$SW_h= 3612.71676300578
##$TD= 16384
##$TD0= 1
##$TE= 0
##$TE2= 300
##$TE3= 300
##$TEG= 300
##$TL= (0..7)
0 120 120 120 120 120 120 120 
##$TP= (0..7)
150 150 150 150 150 150 150 150 
##$TP07= 0
##$TPNAME0= <>
##$TPNAME1= <>
##$TPNAME2= <>
##$TPNAME3= <>
##$TPNAME4= <>
##$TPNAME5= <>
##$TPNAME6= <>
##$TPNAME7= <>
##$TPOAL= (0..7)
0.5 0.5 0.5 0.5 0.5 0.5 0.5 0.5 
##$TPOFFS= (0..7)
0 0 0 0 0 0 0 0 
##$TUNHIN= 0
##$TUNHOUT= 0
##$TUNXOUT= 0
##$USERA1= <user>
##$USERA2= <user>
##$USERA3= <user>
##$USERA4= <user>
##$USERA5= <user>
##$V9= 5
##$VALIST= <valist>
##$VCLIST= <CCCCCCCCCCCCCCC>
##$VD= 0
##$VDLIST= <DDDDDDDDDDDDDDD>
##$VPLIST= <PPPPPPPPPPPPPPP>
##$VTLIST= <TTTTTTTTTTTTTTT>
##$WBST= 1024
##$WBSW= 4
##$XGAIN= (0..3)
0 0 0 0 
##$XL= 0
##$YL= 0
##$YMAX_a= 412222
##$YMIN_a= -424606
##$ZGOPTNS= <>
##$ZL1= 120
##$ZL2= 120
##$ZL3= 120
##$ZL4= 120
##$ABSF1= 10
##$ABSF2= 0
##$ABSG= 5
##$ABSL= 3
##$ALPHA= 0
##$AQORDER= 0
##$ASSFAC= 0
##$ASSFACI= 0
##$ASSFACX= 0
##$ASSWID= 0
##$AUNMP= <proc_1d>
##$AZFE= 0.1
##$AZFW= 0.1
##$BCFW= 1
##$BC_mod= 2
##$BYTORDP= 1
##$COROFFS= 0
##$CY= 11.3945322036743
##$DATMOD= 1
##$DC= 2
##$DFILT= <>
##$DTYPP= 0
##$F1P= 15.7292609196834
##$F2P= 12.9074282941183
##$FCOR= 0.5
##$FTSIZE= 0
##$FT_mod= 4
##$GAMMA= 1
##$GB= 0.15
##$INTBC= 1
##$INTSCL= 1
##$ISEN= 128
##$LB= 0.24
##$LEV0= 0
##$LPBIN= 0
##$MAXI= 10000
##$MC2= 0
##$MEAN= 0
##$ME_mod= 0
##$MI= 1.114404
##$NCOEF= 0
##$NC_proc= 0
##$NLEV= 6
##$NOISF1= 3.799351
##$NOISF2= 2.8
##$NSP= 1
##$NTH_PI= 0
##$NZP= 0
##$OFFSET= 15.70392
##$PC= 1
##$PHC0= -24960.12
##$PHC1= 12.25264
##$PH_mod= 1
##$PKNL= yes
##$PPARMOD= 0
##$PSCAL= 0
##$PSIGN= 0
##$REVERSE= no
##$SF= 200.130013532006
##$SI= 16384
##$SIGF1= 3
##$SIGF2= 2
##$SINO= 400
##$SIOLD= 16384
##$SREGLST= <1H.CDCl3>
##$SSB= 0
##$STSI= 0
##$STSR= 0
##$SW_p= 3612.71676300578
##$SYMM= 0
##$S_DEV= 0
##$TDeff= 0
##$TDoff= 0
##$TI= <>
##$TILT= no
##$TM1= 0
##$TM2= 0
##$TOPLEV= 0
##$USERP1= <user>
##$USERP2= <user>
##$USERP3= <user>
##$USERP4= <user>
##$USERP5= <user>
##$WDW= 1
##$XDIM= 8192
##$YMAX_p= 0
##$YMIN_p= 0
$$ End of Bruker specific parameters
$$ ---------------------------------
##NTUPLES= NMR FID
##VAR_NAME=  TIME,          FID/REAL,        FID/IMAG
##SYMBOL=    X,             R,               I
##VAR_TYPE=  INDEPENDENT,   DEPENDENT,       DEPENDENT
##VAR_FORM=  AFFN,          ASDF,            ASDF
##VAR_DIM=   8192,          8192,            8192
##UNITS=     SECONDS,       ARBITRARY UNITS, ARBITRARY UNITS
##FACTOR=    0.0002768,     1,               1
##FIRST=     0,             0,               0
##LAST=      2.2672688,     0,               0
##MIN=       0,             -424606,         0
##MAX=       2.2672688,     412222,          0
$$ Real data points
##PAGE= N=1
##DATA TABLE= (X++(R..R)), XYDATA
$$ [...]
1596b47M098m917k377N731j3n514J932M905l548l810N013J943n613J34N613k290
1612A040m524L725L152m828j436N289l01n448K432M340l822l037M929J083n192
1627b598O24N224k471m122L744K910n058q22N245j170m838K852L677l790k457
1642c050M659O89m907J203M721l067l425M210J710m618k05M705j462m161K981
1657a7L279m354j622M651J61m762J608M078l099k961M262J195m516K74M687k088
1673G76l719L466K291m227r75M627n31m348K029L617l401k344M239P28m522P88
1689a506M103k078l455L383K217m179o12M474j186l873K420L051l373j837M134
1704A683J95l996R93L688k558k769L404J763m055m4M141j484l494K471K642l509
$$ y = [-247, 3851, -1066, -3443, 2288, 2275, -3239, -1307, 3598, 50, -3760, 1253, 3196, -2417, -2283, 3330, 1040, -3484, 241, 3393, -1435, -2871, 2418, 2117, -3331, -899, 3441, -381, -3418, 1511, 2594, -2598, -1974, 3250, 779, -3343, 401, 3311, -1747, -2569, 2676, 1506, -3332, -480, 3197, -593, -3050, 1609, 2298, -2609, -1406, 3315, 248, -3177, 1033, 2743, -1875, -2080, 2625, 1163, -2998, -17, 3262, -1092, -2714, 1937, 2098, -2664, -1056, 3022, -77, -3038, 1224, 2419, -2097, -1823, 2864, 776, -2943, 523, 2814, -1413, -2388, 2239, 1708, -2640, -611, 3006, -395, -2739, 1500, 2228, -2294, -1506, 2597, 519, -2936, 447, 2664, -1515, -2127, 2347, 1161, -2712, -292, 2759, -614, -2451, 1683, 1878, -2118, -1125, 2563, 5, -2764, 640, 2403, -1652, -1696, 2445, 961, -2533, -62, 2580, -929]
1720i29j243L975k70l782J652K962k485k256L594Q58l869M24L685j886k944K827
1736C13K126l752m92L730p73l551J976K777k969j643L709K25l670J029L254j975
1752C14k763L050J493l735m3L744j201l204K292K209k906j275L481J4l455J253
1768g32L011k197k369L272R77l575K21L557j486k851K292K042l108r96L573m99
1784A132l117J590K546k589j613L198N37l239M48L132j572k673K744J449l037
1799a064n43K978l24l037J624K378k586j355K974L42l092P90K816j812j971K306
1815D24J318l017r3L128r99k622J852J950k747p13K753N6k972R54K681j988k035
1832b070K900Q27k924K01K869j373k220J873J628k515n95K704l85k618J313K252
$$ y = [-929, -2172, 1803, 1533, -2249, -597, 2365, -120, -2376, 1218, 2076, -1793, -1369, 2316, 430, -2514, 313, 2439, -1313, -1805, 1925, 1152, -2399, -423, 2354, -615, -2258, 1451, 1676, -1994, -965, 2289, 314, -2449, 601, 2094, -1641, -1684, 2060, 859, -2345, -53, 2156, -750, -2025, 1456, 1470, -1985, -732, 2279, 82, -2287, 985, 1962, -1613, -1392, 2165, 679, -2172, 120, 2162, -946, -1942, 1631, 1132, -1985, -395, 2151, -438, -2051, 1147, 1684, -1555, -1107, 2025, 453, -2220, 524, 1973, -1064, -1607, 1371, 1047, -1990, -366, 2012, -574, -1929, 1045, 1387, -1705, -915, 1901, 89, -1882, 424, 1742, -1275, -1368, 1760, 761, -1861, -9, 1941, -806, -1519, 1234, 1290, -1682, -728, 1953, -35, -2070, 830, 1657, -1267, -1066, 1803, 430, -1790, 83, 1711, -804, -1399, 1305, 920, -1698, -385, 1867]
1848A867k081j478K592L72k553L96K577j400k180K148J333k657k09K780o67k593
1864a753J553J930k193j305K562L62k573P11K271j497j883K346Q83k568R4K515
1880A455q22k439J813J786k495n48K440k11k474J068K038j743j547K371N84k402
1896a126J99K308r52j967J718J327k193l46K232l81k242J106J928j898j141K319
1912H91J51k331N07K258j409j696K024J005k222k20K266p55j769J147J729j918
1928c42r08K180O5k222O96J988j421j431J977O46k146R8J860n79j855J603J160
1945A369k006m81K037j97j928Q29J667j418j131J892M99k038PK142r92j421J423
1962B53J043j986l60K047l90j877J046J395j468r06J911L02k117Q48J379j005
$$ y = [1867, -214, -1692, 900, 1272, -1281, -885, 1692, 292, -1888, 260, 1593, -1064, -1273, 1507, 840, -1753, -200, 1730, -463, -1768, 794, 1156, -1417, -706, 1565, 68, -1815, 531, 1414, -1154, -1060, 1455, 633, -1806, 7, 1793, -702, -1250, 1190, 979, -1495, -427, 1611, -132, -1679, 692, 1276, -1126, -927, 1381, 429, -1538, 180, 1507, -686, -1032, 1200, 819, -1423, -317, 1611, -287, -1428, 891, 1042, -1289, -782, 1476, 67, -1629, 395, 1400, -822, -1042, 1224, 469, -1300, -153, 1576, -342, -1250, 930, 995, -1227, -531, 1457, 36, -1395, 582, 1228, -918, -820, 1040, 461, -1394, 209, 1369, -637, -1118, 919, 722, -1206, -377, 1290, -128, -1259, 633, 1132, -906, -899, 1243, 251, -1170, 253, 1296, -690, -1050, 997, 607, -1270, -224, 1171, -297, -1203, 708, 1010, -1107, -259, 1120, 115]
1978A15j524J726R48k038o8J844p49j452J236R34j347p33J879r8j613P08J496
1995A264j227j099J676K02j637M6J762o51j478J215J078j685m16J784j65j754
2011a085R14J261j317q99J692L66j607L7J700q09j177J393N62j659p1J580l61
2028E20j597Q91J085j163q31J768o4j391L84J448j183r69J463M74j613R3J517
2045H32l51j495J080R74j443l31J348p0j313M77J312j216p82J519J58j360Q4J535
2063I58q00j030J077P58j461k62J549l59j392O98J264j271o94J634n1j324K63
2080d43J239q88q91J252N67j364k7J322m73j257R53Q94j200l26J339k43j172N07
2098b11J081q84q80J284L01j395J47J321o07j002R32Q19j312l06J354j77j271
$$ y = [115, -1409, 317, 1265, -773, -841, 1003, 254, -1198, 38, 972, -375, -1108, 771, 673, -940, -232, 1264, 37, -1062, 614, 816, -821, -775, 987, 336, -1142, 73, 1151, -534, -950, 834, 669, -1085, -171, 1090, -227, -1126, 566, 932, -675, -638, 1062, 253, -924, 469, 1031, -628, -699, 881, 520, -1077, -186, 899, -264, -1095, 673, 609, -782, -398, 1050, -133, -1102, 361, 835, -778, -685, 832, 481, -1014, 66, 1040, -403, -734, 614, 544, -769, -292, 1020, -196, -978, 541, 699, -661, -577, 958, 158, -872, 205, 963, -498, -760, 789, 430, -962, -264, 1000, -271, -965, 669, 618, -706, -443, 796, -92, -983, 269, 836, -528, -555, 767, 294, -963, -10, 884, -316, -642, 697, 454, -718, -211, 870, -14, -894, 390, 691, -704, -557, 764, 157, -845, 87, 906, -406, -712, 642, 465, -806]
2115h06P12Q45r11o03J132K94j198K38J160q85n08Q14M66j280k15J499m20r50
2133f16M75R05j061m94J178J50j059L01R58o80r47J358L26j204j30J224m01j112
2151h29Q67O69r11m50J129Nj119L96R25q17n03R44L29j346L09J177o64r53J133
2170B91M82j173m5J026m75q89P82O73r42m89J138J99j178L45P50m70q76J158L50
2189F57j136K21Q26l93q03P30N37j093j77J030p3q76L87Q75o85o19Q16J80r75
2208e71J70R48n41o66Q43L61r43k16J146j17j093N65O15o41m80R77O8j074K68
2227c81J141p43o44Q97M70j089j43J038l61q71O52N06o47m08Q79J28r58K94P82
2246E42n03n87O70L60r10R5Q52l36n23K79N26o73k79R15j14r17N38M82m28o63
$$ y = [-806, -94, 751, -160, -763, 369, 663, -535, -297, 863, -22, -530, 284, 750, -530, -745, 754, 334, -616, -141, 764, -297, -791, 387, 537, -522, -221, 737, 57, -890, 468, 794, -410, -540, 684, 283, -829, 38, 707, -204, -654, 475, 480, -639, -243, 682, -135, -638, 306, 635, -711, -402, 775, 111, -842, 291, 773, -400, -445, 581, 106, -783, -1, 672, -270, -759, 379, 578, -600, -255, 495, 25, -851, 307, 657, -479, -258, 568, 175, -628, 102, 639, -454, -631, 399, 326, -550, -163, 712, 27, -592, 224, 404, -571, -401, 547, 6, -660, 183, 544, -399, -615, 531, 414, -679, -114, 501, -140, -620, 357, 425, -649, -381, 760, 17, -627, 270, 740, -349, -492, 546, 185, -686, -34, 472, -175, -583, 296, 424, -534, -240, 542, 39, -548, 122, 482, -428, -333, 519, 183, -340, -61, 465, -208, -487, 428, 314, -603, -65, 417, -11, -674]
2266f74Q72K87r94K09R51o58p63R82K42q34m8Q67j49q74M91O26p48m09R09J01
2286C86p79K18P21m85n13O08K68p37L0P41k93n70L39O95q73j81P06Jq69K88P47
2307D48o17m58P64R8p52M62O07l15q00N73L98o87Q6N87j95p42L74N72o15k70O78
2328A96J83q43L75N98m12m12N16J16p81J72N72j59n54L86M94p19k63P84Q4p90
2348d57K52P42o61l30O60J20q20L01M94j25p11N51M31q06J03N33j41n70L03M99
2368C68m05j89L77K30q42L72N29l67m70N07K73p45K09N93l40n64M99M21o98J3
2388b29N58j71o52M41M38m84k85O46l2o50K69N73m20k69L65L75n62k49N40q0m50
2409c28L53M39n50k88O22J39p19J17M73j63m60L48L31o83J22N36j60m25K14N58
$$ y = [-674, 198, 485, -509, -300, 651, -7, -770, 212, 454, -380, -428, 439, 290, -584, -93, 533, -215, -624, 285, 386, -393, -175, 546, 61, -452, 156, 424, -313, -283, 458, 165, -405, -66, 629, -244, -425, 281, 282, -587, -299, 448, -169, -627, 137, 235, -517, -55, 552, 237, -563, 10, 408, -279, -193, 394, 199, -543, -169, 403, -212, -482, 196, 379, -464, -89, 509, 97, -315, 201, 317, -464, -292, 280, 121, -433, -47, 447, -272, -535, 249, 333, -457, -205, 537, -124, -454, 206, 326, -494, -193, 301, 176, -535, 16, 447, -359, -256, 277, 136, -434, -131, 368, -37, -226, 151, 381, -461, -89, 440, 73, -397, 110, 383, -362, -153, 440, 100, -464, 35, 456, -242, -229, 329, 158, -494, -53, 385, -99, -384, 262, 230, -420, -151, 422, 2, -267, 98, 473, -89, -338, 202, 122, -328, 25, 464, -86, -374, 248, 387, -332, -215, 258, 95, -365, -17, 314, -369, -247, 289, 129, -296, -82, 476]
2429D76o14j92L40K54p35L14N32m32j38M15K7n70N6O34n59k83N47K61n25J2N31
2450C51j73m66L16K96m51q0M18J09o72K41N17l44l28N60K4n04J95K32j40l11L39
2471A29K13o09jM69K1m88K77L44n65n9M59J99n77J84L19k74k45K65J59m37K3O60
2493D66m79l59L61L79m89k10N43j01l98J63M66m76j83M66k12j20j35N26Ll94L35
2514A52L15o78J11K71j8l71K02L69m52k38L55L41n82J3M73m6o12L83K78k83m48
2535d65O95j55k76J95J99l18j10M62K4n07R5M72k04l45M71j41j21m3K18r6l21
2556b71J09M27m14p6L86q5n03M81K27l02j09J87O6l64o1M20k28j87L78M5j95j7
2578h6L26k08l17K58L98m15j12J19J23l18K20K75j29l30J25J82k12j14M43j34
$$ y = [476, -138, -330, 10, 264, -471, -157, 375, -57, -195, 220, 247, -323, -267, 367, -192, -475, 72, 333, -192, -180, 351, 178, -288, 28, 324, -127, -207, 211, 320, -352, -111, 406, 62, -266, 294, 318, -186, 9, 241, 101, -210, 129, 342, -267, -268, 201, 222, -266, 11, 355, -210, -269, 190, 389, -188, -4, 315, 41, -204, 61, 220, -217, -194, 466, -13, -372, -11, 368, -121, -331, 212, 111, -287, -124, 342, -134, -317, 149, -63, -183, -318, 208, 211, -183, 152, 467, -211, -100, 171, 153, -218, -16, 353, -99, -337, 18, 359, -223, -210, 263, 217, -395, -12, 266, -17, -465, 230, 75, -201, -6, 193, -125, -235, 227, 251, -256, -161, 311, 107, -238, 233, 92, -29, -72, 146, 50, -271, -162, 265, -149, -225, 161, 76, -427, 54, 281, -21, -130, 57, 123, -241, -302, 118, -110, -297, 81, 126, -69, -86, 240, 32, -285, -27, 371, -44, -156, -37, 86, -232, -12, 263, 134, -196, -71, 111, -101, -215, 228, 94]
2598I4l39J87L77m07j65N41o1n58K99M56m94j64K17K16m60K60Qm0m03M72K17l13
2620f0k75N64j52r9kN8k27l4L57Q1n72J91L55j77k30L61P8l62Q7K23k3m10J64
2643a04K63k17p7M40l1o49K54L55k45l09M89M3k90J59K06j99l01K45J91m56J41
2664i2M36r2m88K26K31l64J0K44M7l08j1M20k74k59M51J6k03j54N76m03j66K19
2686F2K77l23k28L57O0l98K39K03j83q7K24o2k93p9N49k94l86M26J24l46j6M38
2708B64k91k89M83p3j06j06K67O5l04P7J61k39j99L36K26l71j00L27j7k25oL09
2730A89k71j98N22j99k97J34M22j61m63M05R6k18j27K96p1k47L35J59n54j13O81
2751C20q7n15K75K39k89j1J25Q2m23K43J98r5k72L09J76l94L3K58j22k13K27L09
$$ y = [94, -245, -58, 319, -88, -253, 288, 227, -331, -32, 424, -70, -234, -17, 199, -261, -1, 7, -33, -436, 36, 253, -60, -335, 229, 77, -22, -24, 34, -193, -227, 130, 211, -361, -170, 185, 8, -222, 139, 217, -145, -58, 165, 142, -268, -104, 159, -58, -135, 305, 274, -375, -121, 234, -11, -320, 169, 212, -78, 81, 287, 88, -213, 32, 223, -233, -92, 344, 252, -236, -10, 221, -143, -133, 111, 158, -150, -161, 259, -15, -274, 177, 193, -10, -164, 412, 9, -157, 62, 339, 16, -212, 145, 205, -193, 46, 249, 66, -21, 203, 141, -152, -231, 318, 24, -362, 64, 188, -158, -174, 264, -27, -316, 167, 94, -12, -118, 149, 214, -90, -13, 148, -91, -290, 46, 272, -99, -199, 128, 111, -114, -120, 189, -82, -280, 242, 43, -254, -120, 302, 141, -322, 83, 179, -39, -166, 130, 59, -188, 147, 306, -248, -361, 320, 233, -282, -7, 232, -57, -68, 57, 139, -284, -41, 157, 62, -210, 99, 275, -119, -86, 172, 50, -163, 64, 373]
2773C73l28j20K06J7m21K56L30k62j92K14J10m54j6M45k18l0K02J14j53l30L69
2794A12J17n55K47L19j66k51K11K91l21j47K91o0r1Q5J91l05j77K54N8l35L46
2815A14J29l03j71L32J1l31R5K92j76j24K97R8m76k3M77k24j05J24J03j55j35
2836a51L82p3j22j58K50l2l04J90P8j68J20L21k46k74K15K51l28j14L57o5m03
2857b74J98L78m76OL77L2m42O1K57k06M1O3J68l91P0K31o0j67N0M39j95m08L65
2880A17J52n62L4N48l9m41J34J60l62P2K58J64m27J78K51l26l4K63M7k48j9M45
2902C65k46m22L86J19k89m8L61j20j94j5K88j24l74L94pm51M45K32m23r0L24o1
2924E0l38L11J46l42N0J74K6k41n2L62n6j84N3K41m49J18K49Q2k86J17K90k68
$$ y = [373, 45, -75, 131, 148, -273, -17, 313, 51, -141, 73, 183, -271, -287, 158, -60, -90, 112, 226, 73, -257, 112, 229, -326, -79, 240, 74, -177, 34, 325, 4, -143, 148, 88, -3, 82, 273, -32, -209, 45, 103, -232, 114, 243, -60, -231, 101, 112, -219, -124, 168, -8, -132, 165, 263, -213, -236, 241, 17, -88, 36, 139, -16, -151, 231, 158, 36, -122, 128, 96, -208, -18, 60, -108, 12, 333, 87, -187, 28, 279, -49, -163, 194, 129, -274, -76, 302, -174, -168, 209, 241, -201, -140, 117, -89, -48, 15, 183, -208, -138, 93, 33, -134, -84, 355, 160, -248, 117, 269, -293, -259, 289, 250, -191, -57, 103, -259, -187, 71, 235, -192, -14, 237, -89, -123, 140, 187, -61, -80, 365, 119, -303, 83, 202, -87, -135, 226, 106, -88, -103, 185, 61, -313, 81, 74, -377, 68, 300, -123, -213, 111, 50, -288, 23, 169, -173, -123, 51, 77, -164, -216, 146, 90, -94, -41, 200, -249, -131, 118, 200, -86, 31, 321, 53]
2946E3k50K96R3l47O3J85J8l09Q0M46l02l04K41K24m02J54M63l35r6K03j5l42
2968a83M9Q3J70m05L59J11k44j38K75q5j97K09K74l05j08J41J30l49R5L23j26
2989G9k36L11M0l45l8M14j67k48J91K56k83j60L32K7k66Q2n2N7k91K53K23k84
3011a05M8K94j90j93J84J17j67k02M29j19j98l0M18k93k49M12k5l73J69R8n8k20
3033b53J85K37j70j73K41Rr2K03n5Kk92K18M2k47R8L52l14j51J83J45k44p2J80
3056C2j4k63K99J40k33n8Q6O9j03J28K05m55M5J32J43k86p2L81r8k84K49r7N8
3079Dj60L58m5k10m9K06n7j52K12k9j19q7J44p3k11L62Q5k53j08L49r5j73P4K2
3103ej9J4O7n9j66Q4J63j65j25J71J55j76P5Q0j56j47K12J37r7j78J90J27k63
$$ y = [53, -197, 99, 192, -155, -92, 93, 111, -198, -118, 328, 26, -278, -37, 187, -215, -61, 402, 67, -29, 174, 159, -183, -134, -51, 119, -286, 73, 184, -60, -198, 77, -8, -205, 4, 278, -27, -135, 6, 136, -213, -118, 205, 79, -157, 154, 194, -151, -189, 225, 58, -190, 1, 257, -26, -186, 146, 173, -93, -11, -63, -6, -297, -44, 179, -105, -57, 237, 47, -146, 38, 155, -12, -214, 215, 96, -102, -132, 286, -7, -256, 156, 131, -242, -73, 25, -33, -253, -68, 169, -1, -174, 67, 76, -16, 187, 132, 134, -158, 60, 102, -145, -47, 305, -9, -160, 23, 168, -76, -148, 32, 18, -245, 54, 194, -39, -97, -11, 58, -45, 83, 288, -167, -122, 10, 153, -133, -205, 176, 78, -206, 43, -54, 4, -156, 202, 157, -53, -102, 104, 47, -105, 107, 78, -41, -128, 16, -57, -268, 94, 179, -74, -182, 167, 72, -101, -27, -5, -24, -10, 57, -2, -168, -84, 79, -86, -211, -40, 115, -61, 14, 94, -62, -209, 3, 140, 43, -135, 55, 182, -81]
3126h1J87Rk87J29M7J35m42J42K17j64O4M5J1m2L0J47n0k13j42M17j75r2L06k66
3150f8k8P9J77k78JJ30J13qj55J68r1j69K2K70j72j56J18Q9j76m4L07q4k41J02
3174i4L32k78j00lL07k41O0l9K4k7K3J53j22KJ06q8n9J73j7k99N6J98q1q7P5K37
3200B11l91J4J80p6n6N5L01k22j23J18J50k44J21j89J46k8K1J39k56K39j68j6
3222g4O1J2P9j77J69K0J29l97J09R6kj78K94j39p6P1J53O6k49q0M9Qp9K04J05
3247A74k08J66j72O3l8K3K26k27KM1L7j68J93o3k44O1J71q6M0J1J27k42Q0J07
3271G4J58k69M7L5k23KJ64J43j96l5J66l7k19L37j83N4L1K0q4l8N0J38j41k8k2
3296e6J02k39K35k3r8L4o7M0R0p8J12j23m4J52J01j58l1J47Q2k43j27L24j82m8
$$ y = [-81, 106, 115, -172, -43, 4, 139, -303, -161, 56, -108, -44, 1, 12, -30, 0, 147, 97, -116, -258, 159, -16, -108, 198, -68, -96, -17, 160, -118, -117, 13, 126, 118, -37, 131, 40, -129, -107, 163, -9, -165, -47, 42, -134, -178, 129, 45, -196, -94, 238, -40, -140, -143, 164, -77, -17, -56, -32, -59, -36, 117, -5, -3, 103, 15, -44, 129, 112, -187, -131, 67, -14, -101, -26, 211, -180, -166, 14, -62, -118, -63, 238, 16, -107, 11, 161, -83, 38, -151, -5, -33, -12, 127, -129, 110, -58, -74, -13, -1, 78, -99, 70, 90, 219, -178, -69, 27, 25, -153, 141, 2, -74, -3, 150, 216, -33, -113, -64, -56, -135, 69, 174, -34, 132, -40, 23, -15, 8, 234, 7, 9, 50, 87, -81, 112, 49, -195, -134, 37, -49, -9, 2, 129, -113, -33, 74, 232, -37, 10, 45, -178, -176, -12, 131, -65, -100, 66, 29, -190, 147, -36, 18, 49, 69, -15, -53, -3, 135, -6, -34, -56, 46, -193, 42, 19, -79, -45, -112, -72, 18, -60, 52, -71, -115, 37, 138, -20, -51, 96, 178, -65, -192, 132, -50, -98]
3320i8jK02k13r1K15O2r4j52K31q8K5J04q6n6J24l3n4j54O6J42j28O1j0L6q6O4
3346a2Q9j73l8J13J49k69J0K84j29r4QJ84j62n1L7K10k42J09m0M0k03J49Q1j68
3370a18J77n6m9J02j6K2j60j9K11k6k05J09K07r4j83L9J71k25K14L4k93m9K93
3393H6nj15j71K32o2j18K03J4p5p7J88j02j41N5K01j64%p8K05j93K7j7R7m3j02
3418a55K22k7k2J2Q4r7L5r5m0J2K5R7k04J37M7j29J09N5j72p7l2K19j44J89k16
3443a67K27j0j62J15J37j34P6j23L8k4l2N1J09j67J63n9r4M7M8P8k85J83p9R9
3467C5j74J85k08J15m9J36j35O4L8K1j14J64j30R1m7J89k14K0o0K56k00q4K20
3490A19n0r8lP2rj54N4J37r0j21P4J60j27O9q4N2N2l3K5K0j93J13J14j32p8K40
$$ y = [-98, -99, 103, -110, -201, 14, 76, -18, -170, 61, -27, -2, 102, 16, -40, 84, 51, -3, -157, -91, 51, -77, -16, -26, 10, -76, -12, 77, -96, -134, -21, 128, -141, -131, 153, 24, -70, -62, 122, -40, -91, -54, 156, -86, 23, -17, 23, -180, -31, 50, -118, 59, 3, -46, 56, 40, 62, -98, -117, 94, 68, -137, -28, 179, 85, -98, -59, 112, -113, 101, 135, -158, -207, 86, 81, -34, -205, 27, -35, -153, 50, 64, -11, -88, 100, -2, -143, -88, 113, -51, -51, -129, 76, -117, -90, -107, -10, -53, -155, 67, 40, 18, 30, 114, 17, 52, -43, -83, -71, -46, 51, -153, -16, 31, -98, 11, 66, -106, -183, -215, 4, -140, 49, -167, 60, 50, -112, 3, 140, 6, 82, -41, -3, -27, -59, -8, 101, -66, 97, 38, -56, -9, 39, 117, -168, 15, -64, 35, -139, 46, -162, -47, -96, 40, -95, -31, 7, 28, -86, 78, -52, 39, -8, 181, -33, -13, -73, 183, -17, -101, 119, 69, -29, -32, 40, 31, -123, -69, 68, -22, -143, -69, 91, -36, 33, -51, 1, 53, 20, 45, 65, -128, -15, 99, -33, -111, 129]
3516A29j9k00K1n9j9J59J35k40qJ39j6Nk9J08j55L8L6RQ4k33J31J79j41j8L1j02
3542c5L1J9j5j02m7P6J35q0N8J64l81N7J18k0l5M0J25j95L6P8j4k34J28J25j79
3567a47J11P2P0n6R8O0p3j70P6n2R3l12J54m2J69j37J32N6j71R2p8K0MP3m1N2
3593E3o0J7j5J3P3k61K43p4Q5r0j69L96l17N0J00j31j13L14p9M7J8j20J31l6K6
3618A01m3p1q1J04Kj20lM0o6J69P8j45N9j31P8J27j00l9q0J81L4j79J75j9j41
3643g0J1O7J34k78L38l30J32k2J33lj23j02K58k18O3J9KM7p7L3Q6l9r4k28K37
3668b4J02j60M3j9l4L1o1Q7k7J81l0n2O4j14P2k36P5K33k27J72j19J0r2k3K76
3693A28j37R0l7q1j16Q9p6K13j68M7K82k57jN1rp1M0J3j21K02k07K22j67Q8M7
$$ y = [129, 110, -90, -69, -128, -147, 12, 147, -93, -101, 38, 22, 27, -2, 106, -49, -11, 25, 34, 118, -115, 16, 195, 54, 36, 67, -35, -4, 15, 0, -102, -149, -73, 62, -18, 40, 204, -177, -120, -2, -22, -57, -17, 108, -87, -51, 27, 13, -221, -93, 32, -147, -36, 36, 106, 50, 148, 208, 135, -35, 41, -11, 82, -230, -76, -118, 51, -86, 46, 102, -69, 23, -55, -35, -31, 42, 1, 53, -7, 10, -5, 8, 81, -180, 63, -11, 74, -16, -185, 211, -106, -56, 44, -87, -200, 114, 35, 82, 100, -20, 111, 75, 101, 58, -13, -94, 10, 12, -108, -111, -71, -137, 32, 110, -35, 24, -107, -29, 98, -2, -41, -121, 60, 94, -85, 90, 71, -70, -59, 8, 142, -136, 202, -128, 4, -18, 115, 112, -11, -113, 145, -73, -10, 9, 11, 58, -19, 14, 100, 61, -33, -261, -24, 78, -82, -39, -58, -92, -61, -122, -35, -62, 119, 89, 37, 101, -13, 59, -177, -102, 131, -96, 76, -43, -33, -125, -148, 128, -9, 81, 44, -37, -153, -64, -140, 73, -95, -48, 234, -23, -24, 27, 18, -53, -13, 0, -121, 81, -126, 96, -71, 17, 64]
3718F4j18P0n0P9J1n5L1p0jJ75p7M5nq6Kp5P4o4P3j79J53K5l5P0n6l9k6J2j95
3747b47K55o7j6j2j8Q7l4kN3J9j6p1L8q3J72q5K42j16k39J97j53J06j44K59k84
3772a59K07m6jp5J97j54lj87K28J63j56oK8q9J12j7rj21N3k7J94k68J44l8J03
3797G3n0j16NQ7n0P9L8j75O3k2J12O4r4l1K59k95J33j33J39j5m8j63R7P7j18O3
3823b1N8o0m5J12O4o0j15K40Jj93j73L48Qk23j9N0O2j25m3K78j09O8j45L5J08
3848A01j09Q4m3r2O6k1r2J24K9L1j04l4K48n5j97J5J00jj88J15O7n3J0J25k99
3873a73K22K2j04p0K31r2o9J76j46P0j30k9K39j83q2J40N2o2lJ5j01J16Q5n4p
3898F3j89Q4J41j73R9m3n5N2q9M4R3o8l0J20m9l4Jm8QJ65r3k4J06j96J05k59L03
$$ y = [64, -54, 16, -34, 45, 56, 1, 32, -38, -39, 136, 59, 104, 99, 13, 15, -60, 14, -50, 23, -156, -3, 22, -13, 57, 1, -38, -64, -52, -247, 8, -59, -75, -87, -105, -18, -52, -54, -1, 18, 2, -69, -31, -114, 58, -27, 215, 99, -140, 57, -96, 10, -134, 125, -159, 48, 2, 1, -74, 123, -31, -34, -221, 7, 170, 14, 8, 36, -53, 59, 42, 33, -88, -35, -62, 132, -136, 8, -30, 73, 23, -93, -88, -1, -51, 28, 66, -109, -46, -68, 44, 108, 14, -17, 242, -53, 80, -53, 86, 71, 23, -140, -43, 34, -84, -21, 37, -23, -68, 44, 108, 48, -67, 173, 174, -19, -192, 156, 164, -59, -78, -28, 34, -91, -134, 144, 35, 103, -42, -7, 101, -8, 76, 33, -59, 7, -14, -106, 18, 47, 78, -26, -60, 188, 133, -64, -49, 51, 50, -138, -23, 44, -9, 1, 126, -173, 49, 71, -33, -103, 128, 36, -33, 143, -3, 67, -63, -92, 147, -36, -118, 22, 74, 12, 9, 24, -77, 39, 124, 70, 63, -126, -42, 99, -74, 25, -18, -73, -21, -110, -66, 27, -41, -71, 49, 0, -34, -33, -81, -73, 92, -1, -25, 81, -115, -10, -269, 34]
3925C4o0j9J8k7m3J80q8J23j18o3R3l9j20Q0Q6j86Q1qN7J13j85M3K55k48J79k00
3951f2J11J06j16p7j25K05l7j71L17Qj43k11K37p6J4P5p7%m0M4MK15j96J6J57
3976A78k10k4K26j00j22L5M4j28pJ1J38r8n7J58J11o1j05R2qk66J94J04k79K53
4000G9J30l23N7q4J39%qj55j5J47K32j78L8j85QJ72J8L2RM6q3qR2k80K87p6j04
4027a3P8q6J33j45j42K58j46m5j4J09L6L5k3j16J3N6k0l1J26N4j25NK1J25r7r6
4053e0R8M2j26j54J61N5k01J88K1j11J21m2J31q7on2j07O3o2N7M1P3Q2r5p4l4
4079f8R7jj26K52k51Q4j43J71J17Mj60l8J54j64J09J08j86j08l5K10k0J25k68
4102a37LJ34p7O3j39J16j2J8K6N6l1k2L6J3j51L4r1J97J83k33K8mj70J96k2r0
$$ y = [34, -26, -45, -27, -54, -97, 83, -5, 118, 0, -63, 30, -9, -129, -49, 37, -149, -68, -76, -19, 94, -91, -48, 207, -41, 138, -62, 49, 155, 39, -38, -163, 42, 5, -166, 151, 159, 16, -195, 42, -34, -20, 55, -22, -22, -62, -18, -14, 201, 5, 21, 178, -32, -56, 170, 70, -52, -17, 27, -101, -108, -97, 41, -57, -114, 44, 155, 94, -11, 81, 73, -193, 1, 105, -174, 79, 209, -114, -57, -141, -2, -2, -10, -165, -180, -33, 199, 21, 59, -126, -118, 54, 72, 104, 113, 159, 76, 68, 160, -120, 167, 91, -13, 65, -21, 112, -33, -175, 83, -63, -108, -122, -13, 23, 58, 35, -81, -68, -12, -32, -63, 63, 117, -8, -3, 18, 143, 46, -50, 48, 90, -36, -190, -29, 26, -175, 13, 34, -77, 44, 2, 133, 46, 40, -12, -119, -56, -118, -61, -20, 53, 135, 40, -34, -68, 29, 28, -98, 154, -97, -13, -156, 15, 132, 136, -24, -62, 92, -72, 37, 145, -41, -149, -184, 26, 6, 131, -137, -134, 0, -77, -14, -153, -37, -49, -31, -5, 51, 20, -2, 34, 47, -104, -70, -161, 36, 219, -14, 14, 10, -160, 36, 14, -76]
4128g6K8J19K3k04K86k41O7l3K49j97j05RJ53o2n0j23K19m6Q3L6k25j6J84k03
4152a25K28k5L5r1m9j39K01L1j1j8L1j73J37R6k09N3j3J19q9j0J08k1J10l60K45
4177F1q0l7J9o4O6J8J50J0p2Jk6n8j53K35J0m4NM3j8p6n3K5MJ0J07p9p7k2J77
4206H2j79J15klJ25j31K4L1k65J76k0P6q2n5O9j53J04L4J69k71K37j36O8M3m1
4231A5q7J7O4m1N0j0j2o6M1N6Pj13J95r2M5k47L16j92J15k4P0Pk14J33l2M2j45
4258a02J22K4j25R0K2N9j59K10j48l7j0J9J13j35QL9m3k2J09Mn3o9J35j44P0J23
4284A00J32k71j25J75Q4J2j37P4o4O0J11k49J50M6j63pK28j05Nn8k5JO2j39l9
4309a42L33k29m0R7nl04J50P9j8J59R8k78P9k61J65P7P2p0j6p0J70k32L12o0L
$$ y = [-76, -48, 71, 94, -110, 176, -65, 2, -31, 218, 21, -84, -75, 78, 16, -34, -157, 62, 16, 99, 135, -90, -106, 78, -125, 103, 78, 113, 22, -27, -166, 35, 66, 55, 37, 68, -105, 32, 128, -81, -28, -41, 78, -11, -21, 87, 66, 176, -184, 61, -19, -56, -37, -101, -35, -17, 133, 143, 71, 72, 46, -12, -165, 70, 80, 36, 41, 84, 66, -10, -63, -38, -34, -24, 83, 4, -73, -95, 82, -97, 18, 16, 13, 138, 7, 31, 62, -203, -27, -47, 29, -53, -108, -39, -192, -88, -54, 115, -156, 81, -55, 13, 56, 15, -72, -55, 9, -32, 18, 8, -4, -70, -29, 27, 34, -79, 116, 24, 69, -178, 138, -54, 61, 37, 107, 114, -100, 33, 1, 43, -102, 20, 44, -81, 9, 31, 90, -69, 141, -7, -44, -54, -35, 78, -57, -49, -10, -53, -75, 34, 38, -15, -84, 51, -93, -23, 100, 232, -39, -164, 11, 95, 107, -30, 44, -20, 40, 151, -98, 52, 98, -65, -72, 156, 51, 56, -2, -27, -26, 36, -103, -142, 191, -38, -78, 19, 14, -290, -140, -61, -79, 80, 178, -100, -21, -282, -117, -40, 32, -38, -54, -124, 46, -186, 126, 66, 69]
4334F9J5j33J12q8M7j49O6O7q7M2J14r3j4N7m8j05J29J41K2q8L5l30K44m9%K07
4360A83k00Q3Kp1n6L2O9P0j54m6J89m7j20j6Q0J06n2j18M2q5L20k67J1m0Q2n8
4386f1J51r0l3j03oK02nQ2k39Q0K5r4J09J7j06j3J49J5L8j2J45l97J33R4r4j00
4412a13m3J59k5Q0p9K16j65rK26j43r7j00K67j45M2k57K07p2o2K24r0k3L0L9m6
4437B1J28k04k4n3L00k8k78L43k29Q9j21J35N8j31J30j5j38j8J04q5M3j30K39
4460A36q7j76M6k3Q1j14J34J70k07J23J03m1k89Q9J24j99J25r3R2k0J21K6k45
4483a24O2J50m5j02O3J00j93J09j62Q1N1J26M8l4r0jo8j24J97n7P2j1mm3J17j10
4509HP2j40K18K4j2k2k00J14q5p5N0N3k3o5R2Q8j12J61J4o6j64nJ94r6L3J1m6
$$ y = [69, 84, -49, 63, -25, 22, -127, -61, 6, -81, -39, 75, -18, -32, 25, -23, -128, 1, 142, 164, 76, 111, -219, 25, -24, -24, 183, -17, 66, 68, -3, -59, -27, 42, 112, -42, -88, 101, 54, -66, -82, -2, 104, 52, -66, -24, -109, 211, -56, -45, -85, -3, -61, 90, 0, -33, -136, -142, 60, 55, 137, -102, -22, 3, -91, 18, 35, -71, -84, 65, 80, 118, 106, 251, -146, -13, 81, -13, -113, -156, 3, -22, 58, -21, 195, 30, 21, 247, 104, 7, -93, 174, 29, 71, -186, 21, -51, -113, 111, 21, -2, 28, 67, 21, 149, -55, -79, -132, 168, 140, -138, 205, -24, 65, -56, 79, 137, 6, 136, 121, -17, -35, 69, -16, 27, -103, 136, 49, -127, -81, -104, -23, -137, -3, 167, -40, 83, 186, 145, -144, -55, 69, -130, -5, -98, -6, -26, 95, 121, -124, -62, 88, 43, -59, 4, 104, -89, 20, -142, -61, -10, 116, 164, 130, 40, 39, -29, -153, 44, -13, 59, 48, 44, 1, 118, 8, 80, -60, 158, 182, 170, 148, -52, 62, -23, -98, -48, 5, -18, -83, 9, 97, -15, 146, 160, 94, -70, -75, 119, 23, 56, 67, 21]
4536B1k07Q7J42m7J03j71J05j56K3J97m3lj05m3J69p9q8J86j45J10J8j91J47M5
4560G5k9l7j01P9M4j53JJ57J7j84K8Q5j6R4j85K52j39j31J15Q8j09K8n8Q8o7P4
4586A6j33J08J0R1j48Q2N5j92n2J98J32j83n9J57j29J30j29K05k40k8O9J11m0
4609C1k1LP0j03J68j98q8J49r8L6l1N6J53j65K48k87J58p9J8n6L3j3L6mN0j21
4635e5J95j04q6J23P0j05J2J8r5Q6KJ04M9l2l21J67j96J8J00P2q0P6l6J4lR9j24
4662c2Q1L2j23j78P3M26j81k12K6K33j42n2K2qM2Rpn1M2O0r4JM5q3M5j82J79J24
4690I5m9l7n7J23k06m4J87K3j09jQ3L0nj2j96P2L8J16j01O6l3j92J78M9j1j00
4716i3K38q9j76p2K37n0j6m7j40K75Qo2r6O7O1j04J59j61J19l8o9O4M0m1r5oJ62
$$ y = [21, -186, -99, 43, -4, 99, -72, 33, -123, -100, 97, 54, 51, -54, -97, 72, -7, -95, 91, -54, 56, 74, -117, 30, 75, 46, 9, -92, -13, 31, -122, -121, 36, 53, -131, -103, -18, -34, 60, -125, 127, -12, -143, -28, 60, -49, -21, -79, 9, -58, 16, -117, -9, 1, 92, -56, 26, 81, -111, -163, 35, 167, -16, -75, 82, -47, 83, -46, 159, -81, -109, -40, 71, 31, 10, 13, 83, -20, 148, -50, -138, 11, -87, -51, -82, -26, 127, -38, 210, -77, 81, 2, 20, -36, -3, -16, 20, 16, 66, -55, 140, 36, -50, 73, 143, 38, 50, 68, -27, 59, 61, 165, 214, 182, -139, 28, -168, -150, -50, 22, -58, 18, -18, -4, -7, 92, -32, 49, 81, -42, -220, -147, 279, 98, -114, -88, 145, 3, -49, -27, -35, 7, 16, 9, -42, 0, 60, -34, -33, 12, -71, -26, -208, -29, 95, 46, 9, -48, 75, -131, -175, 12, 35, -74, -75, 8, 38, 33, 21, -175, -103, -65, 51, -50, 16, -17, -209, -31, 18, 7, -93, 145, 56, -120, -192, 45, -5, -21, -68, -208, 67, 75, 13, -83, -16, 45, -59, 100, -61, 58, 20, -49, 15, 55, 14, -81, -87, 75]
4743G5N8k06j45K49p9q7Q2J40j82KP8o3J15n1J37l10K96j21J70j61p7N4L5o5L0
4768b6N8j40R7Q7J59j45p6Pl4n3K29j4j44J1qj87J55J03o0j08jJ22mj02J34m8
4794A2m6M0R2j52o4L9L5pO7O8J0l43J63pL3L7P4n1O9Qr9P2N8j51J15k09K47j55
4822d5Q4O7J0k19J79K9j30l2L2LQm7r0K47p0J34q7Mjj78K04j64l3k0K44j18k0
4849iJ70pk46n0J40MO1j19M5p5K0J2j7J44o6ln1%J93j1j08j29J09J13j49j28J92
4876C5J8k64K68j9q7J1J07q7o1O4P0o5m2K11j22p8MJ67r0K2j83R7J55k48J31P6
4902I0l1k02J07k1J21O5m9r1j49J92K7r7j4L1QJ21j10l7J47j60J03j06J61j33
4926b7J31j82L4m7J12l6o9J34p8P8k19J83k18K45L6n8j9o8K2O5N8j43J15k36K24
$$ y = [75, 133, -73, -218, 31, -48, -135, -53, 87, -95, -93, -15, -78, 37, -14, 123, -187, 109, -12, 158, -3, -80, -26, 9, -56, -26, 32, -108, -11, 76, 235, 90, 14, 21, -13, -66, 163, 149, 5, 16, 8, -179, -24, 79, 19, -89, -90, 32, 28, -74, 60, 12, -34, 6, 98, -54, -118, -79, -44, -51, 16, 84, 94, -249, -86, -93, -60, -23, 51, 0, 69, 77, -22, 50, 108, -43, 72, -137, 110, -45, 39, 106, 116, -103, 76, 105, -25, -57, -25, -22, -14, -61, -151, 96, 26, 160, 73, 77, 76, -102, 102, -62, -95, -115, 129, 11, -9, 161, 154, -92, -142, -2, 2, 63, -56, -11, -86, -66, -54, -71, 73, 7, 4, -47, -47, 146, 135, 27, -102, 7, 120, -29, -157, 35, 53, -211, 57, 38, -49, -38, 69, -18, -79, -15, 55, -10, -52, 159, 37, -41, -37, 130, 40, 62, -121, -24, 131, -117, 14, 90, 59, -143, -36, -57, 64, 129, 80, -11, -160, 32, 59, -38, -52, -21, -13, 108, -2, -39, 108, -52, 51, -55, 106, -27, 104, -78, -44, -91, 21, -15, -84, 50, -28, 50, -169, 14, -204, 41, 77, 19, 0, -68, -46, 19, 77, -66, 49, -187, 37]
4951C7j53O0J62l8p8k0Q8j17R1N0j30j7R6j60ON4M2J69k32J28J90k57K4l7Q3J26
4977A67j12j43K04q2J26m3k17J29j12Q5q0p4l7J62k4L3J00r9j4o3P1L5q1J02o4
5002c1M1p4j56J66K6P3j51M6r3J99lm4R2P0q8j38J1K2M1l2m0R4r9Q1m8j4OJ17
5030G4o0q3K37k99J09J6k8l9K2o5K17k4n0j48J57p7k8Q6M2j1p7N3M9Mj5o8L6j51
5058a21K5J12l1J8j23oJ55Q6j42J62r2j7l7j22M48l37Lk08K09J04j17L4m6O3N4
5083G4n8r2K20k59J80k1j22q4O3j01M6R5J33j17R8K1n3j54J47O7kr0j0oL7j04
5109i2%K6J03o2Rj28J0N4m4M7J96j44p5MM7K1j09N0L6q9M7J12J15o8j44J72j53
5136e9K8k1p3J49o6K21j64l4M5j30R0M5r2L7L0L1j43j14K34rM3p5k2L4l7m2P6
$$ y = [37, -116, -56, 106, 68, -10, -30, 58, -59, 32, 82, -48, -65, 31, -129, -123, -69, -27, 142, -90, 38, 228, -29, -5, -42, 41, 167, 55, -88, 116, 34, 160, 117, -100, 29, -83, 2, -78, -152, -189, -27, -51, -18, 82, -17, -31, -94, -23, 12, -69, 33, -31, 10, -64, -220, -54, -28, 45, -106, -60, -153, 46, 43, -1, 91, 161, 73, -65, -54, -32, 9, -23, -63, 31, -68, 13, -35, -49, -43, 74, 14, -69, 168, -131, -22, -6, -34, -73, -51, -116, 101, 77, 27, -121, 36, -41, -69, 17, 59, 48, -29, 24, 73, 77, 62, -6, 30, -121, -96, 16, -15, 3, -120, -126, 29, 115, -27, 135, 43, 26, -11, -133, 315, -22, -19, -227, -18, 86, -31, 3, -43, 20, 74, 16, -76, 144, -115, 65, 44, -78, -162, -99, -200, -154, -59, 74, -43, 55, 76, 23, -131, 16, 83, 81, -9, -19, -25, 12, -92, -92, -66, 37, -25, -16, -144, -134, -80, -124, -77, 119, -25, -100, -96, -49, -28, -137, -87, -51, -140, -93, 19, 134, 66, -78, 94, -59, -31, -52, -125, 24, -42, 179, 15, -19, 26, -104, -14, 31, -61, -24, 6, 37, -106, -220, 14, 5, 48, -27, -49, -15, -52, -94, -18]
5163a8M6n8L4q4J04Kp5J8Q5n9r9k6J70j08M8J41k59J0K20n5n3N3j02m1J33k7m9
5190d9nJ85k39O2K6j17R6k1K09j00j83J10M8j0rL9n8j15l2K27q8J47o1L0j07P7
5216F2k2j09Q0J29o3N4j57lL1L3O2j08l2O7P8k4m0o8Kj3P1l5%k3O7q6L9o0J02
5245C4q8K7j7J17j0J11j85J33j62p8Q1O9l6q1Q6j4J18j27k8m4K59k26K06k45K41
5270A41j89P6j1m6R2j75J80l3p2M1n9j5l7J90j33qj33J12Q4p4P2NJ04k13J21n6
5296c6j82J63l9K56j82LJ01j22J47j37j9J87o6j28K06j59M7j4K9o7P7k68L12p6
5320C3j77K08j45K42j96O3j7p3J38L6j47nJ35j42m5J13n6m5Q5Mq2M4l6K24m1k05
5346h7J01p7m0P9P2k2Po2oR3o1p0M2mN7rq5J48L0p5n8l1k5K12P0j08j38J13j0
$$ y = [-18, 28, -30, 4, -80, 24, 26, -49, -31, 54, -5, -104, -130, 40, -68, -20, 121, -138, -128, 92, 37, -16, 37, -65, -106, 27, 0, -49, -54, 131, -108, -46, -20, -137, -41, -62, 147, 47, -136, -26, 22, 12, 3, 42, -16, -131, -163, 64, -24, 123, 62, 92, -15, 62, 40, -69, 11, 140, 77, 131, -26, -29, 2, 35, 97, -11, -43, 24, 102, 78, 38, -30, -28, -41, 30, -5, -5, -28, 39, -47, -8, -68, 34, -54, -27, -44, 73, 63, 174, -11, 122, -40, -118, -37, 32, -4, -85, 1, -13, 105, -22, -50, -94, 165, -61, 145, -100, 141, -48, 28, 17, -29, 63, -112, 68, 35, -37, 4, -55, -70, -107, 83, -50, -58, -191, -79, 5, -69, 3, 8, 112, -101, 20, -36, -218, -55, -94, 162, -20, -17, 84, -38, 109, -28, -47, 140, 74, -54, 152, -7, 40, 26, 55, -12, 65, -203, 109, 33, -144, 64, -81, 161, -35, 28, 11, -62, 76, 112, -35, -40, 95, -47, -92, 21, -35, -80, 5, 9, -73, -29, -65, 159, 118, -87, 14, -63, -103, -24, 48, 26, 33, -29, -35, 58, -3, -73, -31, -35, 22, 13, -72, 76, 106, 31, -27, -58, -83, 129, 199, 91, -47, 66, 56]
5375E6r1q6K82o2j40J90k49J94j18O1n6QR4o8P4r1n7J61k31J67k5K3j7p4K38j23
5401F0j16J4j6J34j77Q4r3J25r4J10j51J4J41J18j41j00J39Pj56O3R6j26m0K1
5425h4J56L5j88M6K52k48q6J37l0k22K60j39J87q9l4Q1n9L6M5k05L94k34k01J72
5449a8K7r7O4pn9J65p3P7l17J98J50k8j20O9O2j46J39j01J18j57O5n1J59j50J13
5474H2k0K3k6O8j73N8j26J33L1m2o7j33K15J7K8N6j32J61j39Q1oj73J57j38NL9
5500b1Q4l0j65L0K15r7J2K3m9J7J52m1j65q7J25K9j1j04J8J47Lk20J37J48j71
5525b1J04L5l17J76o4j4L4j21J38O9m3o0R0O7j25M6j26Q7O8pJ21k01M6P1j05J88
5551A36j59J71r4n1Oq9P2l3K7n1j17K31L2m6r8J26K4j99J10q5J39k23K71k04j6
$$ y = [56, -35, -121, 161, 99, -41, 149, -100, 94, -24, 37, -19, -11, 83, 15, 89, -2, -59, 102, -129, 38, 13, 36, 19, -55, 183, 60, -56, -42, -58, 76, -101, -17, -110, 15, -79, 31, -120, -106, 35, 153, 12, -88, 51, 58, -98, -35, 61, -65, -105, -84, 72, 107, -81, -35, 217, -31, -117, 20, -10, -232, 28, -111, 76, -13, -47, 34, -25, 11, 56, -149, 245, 11, -190, -18, 9, -88, -24, -31, -90, 75, 2, 79, -238, -40, 110, 82, -38, 31, 93, -53, 86, -15, 103, -54, 11, -40, 119, -31, 82, 62, 85, 59, 127, -46, 12, -114, 19, 50, 8, -59, -192, 23, 40, 68, 124, -8, 153, 14, 95, 89, -84, 73, -65, -60, -21, 63, 33, -132, -102, 113, 16, 28, 51, 2, 19, 171, 130, -35, -122, 3, 32, 21, -83, -65, 82, 85, -135, 2, 150, -21, 83, 118, -199, -23, -87, -101, -67, -188, -50, 19, -24, -84, 6, 73, -52, -6, -132, -45, 23, 16, 137, -64, -18, 53, -52, 136, -23, 148, 54, 3, 9, -80, -8, -41, -14, -65, -182, 49, 81, 35, -63, 63, 87, -112, -2, -87, 52, -171, 100, -104, -120]
5576a20J3J22j50J33q7K00k18JN7K83l49J59L5j52R7R3r2M1L8k57J82M1j77N4
5600e3j3J72k29P2R7j2l3LN6k37K47J17k14L5J4q6m2J30M8q1P2K7m8m0K12k44
5626c0K82k99oN7n1k9N5K03k13M7Jr3K58l13J1O2jJ93j42P1M1M2j70N4k64P3L31
5653A70j20p1N1l3j13J40L2l0Q0J1k3k05O9k3L5P3j12j8J31l0J61j21J38j74l4
5678a6q6P8J49M5r8j37O4J3O8l5j78J33j1N6j2J29n7j22M8pj57K16j88K24j56
5703c7M4p1J01r8L2K10Kl8j65J45j69N7j40J01j6k05K89m8Q7l0L7j69J46j03j01
5728a39O7jJ30o8O8k65J12R2m7J5J23k5nJ26r0j32K12k51O2L9P3j65P5Q5j60J84
5754A15j5k27N7j03J77j67J60l5n0K21m9O1j54o6O4k7k3Q5p0%O9J0j37J38j25
$$ y = [-120, -107, 15, -135, -2, -89, 111, -107, -106, -49, 234, -115, 44, 79, -73, 24, 117, 25, 66, 104, -153, 29, 70, -107, -53, -66, 106, -123, -51, 46, 34, 1, 4, 60, -177, 70, 187, -27, 8, 22, -64, -106, 24, 72, -9, 63, 90, 42, 2, 214, -30, 252, -47, -53, 4, -47, -76, -21, 182, -31, 16, 17, -76, 182, -131, -120, -58, -59, 134, -8, 63, 104, 146, -24, 30, -234, -161, 170, 50, -21, 30, -3, -116, 24, 56, 26, 106, 117, 94, -111, -42, -65, -30, 43, -69, -87, 44, 14, 175, 54, 192, 18, -16, -102, -24, 125, 170, 72, -65, -1, 12, 80, 45, -133, 0, -11, 45, 33, 162, 105, -17, 31, 24, -133, 83, -105, 119, -37, 7, -64, 37, -61, -29, 181, 183, 145, -20, 125, -44, 13, -127, -26, -42, -247, 42, -6, 81, 51, 88, -81, 65, -38, -139, -72, -73, 57, -11, 57, -208, -96, -4, -51, -36, 87, 62, 57, 183, 93, -39, 173, -78, -16, 23, 96, -69, 6, 91, -69, 115, 100, -127, -70, -173, 4, -163, -3, -38, -88, 133, 84, 145, -9, -75, -11, -38, -61, 24, -46, -46, 23, 33, -104, 34, -91]
5779i1N4o0K46p4j96K28j13K58j80j20O7r0Q5l1M5n6L3p5J01MR3j97QN7k5j9O
5806d2L6k8O1k2Q6j28J4J80j66R9j49J34r4Rn5j6J10mj04J11P9j28q9R2J6M8j63
5833a13J31Q9j61JoL18j43m1j63R1j4k8N7j9O8Jr8J17m4j35j3l5L1J71o4N0K2
5860G0k9j4n8jJ13j62K08j2j99J17lj09Q3k3n5R0O1o3j94K62p7K19j80j37K46
5885A53k64J28j38J54QL4j18K01r9n9n4K5O9r6K2J22j28P6J49k63O8q1J3J60j35
5910e3j1J33r8J80j68k1j27J46Ro6M9j40J61N9q5n4J61q0j25J42Kj14J25K0J8
5935F3q6RN7p1mm4P8N3q4M9p0L3L5O4n0m6O8j26M5N7n6j5J9m5r0K58k05M9R4j09
5965g0K39j99R5r1M1q7j12J53L2Q9p4j00J67j14mJ5K7o3J7M6L8n4p1J43j22j0
$$ y = [-91, -37, -97, 149, 75, -121, 107, -6, 252, 72, -48, 19, -71, 14, -17, 28, -28, 5, -70, 31, 35, 128, -69, -61, -4, -29, -48, -42, -6, -34, 27, 5, 91, -37, -23, 157, -9, 90, -59, 75, -19, -10, -65, -81, 29, 25, -79, 32, 111, -17, -106, -14, 2, 50, -113, 18, 107, -54, -53, -59, 259, 116, 75, -88, 3, -11, -39, 18, -1, 67, 68, -30, 87, 43, -92, -105, -140, -109, 62, -2, 48, 70, 41, 27, -31, -32, 81, -81, 127, 115, -84, 33, 30, -79, 4, -19, -74, 16, 77, 14, -180, 82, 5, 224, 44, -93, 153, -111, 17, -121, 33, 41, 75, -43, 158, 59, 0, -54, -29, 40, -56, -34, 88, -40, 36, 185, -78, -10, -91, -78, 82, -53, -64, 69, -29, 151, -17, -38, -165, -19, -10, -76, -27, -167, -6, 53, -32, -86, 75, -5, -130, 12, 14, -100, 25, 45, 63, -23, -14, 43, -28, -32, -76, 2, 55, -29, 20, -50, -17, 18, 82, 32, -14, 54, -72, -27, 30, -26, -41, -22, -67, -157, 101, -104, -55, 39, -70, 169, -30, 65, -26, 15, -72, -184, -31, 1, 90, 16, -84, 83, -31, -35, -20, 7, -56, -39, 7, 45, -9, -80, 63, -59, -69]
5991f9j7J41j18q4J52KO9j05M9k7j38K97j16n9P9j68J46J2j85J76N3p7Q7j49O2
6016A3J9Po6Ql1R8J27j16m6P1Q0k09JQ8o5k4R4j25L5k8N3j7O8l5j89l5J90M4P3
6045H3o2o2J42Qp9Mj23N4P7nq4oRQ3n1q7J66k22L5L4O8p2K8m0J97k25M9J25j7
6074B7j19J79j36O2N2j76o2K14K4j89J79l9O9rj75J39q5K90k26j03O0j1MJ36j22
6099a7j61K26j01P2K8Q5k86M7K5J17j23k7J83m0k5J31j00r4o5J41Rq0m9O9J05
6124G0j06K1j03p4L79j31l4J09j39nM2J1j68J97q5N2l4M7j66P4OJ0j42J73m5K34
6150A93l00P8L4n6R5r7J36j55J68qp9q2K33j83R9m7o7J00j42K7j78L01l0n2k5
6175c7PQ1k25K74k10J45L5j90j5J20n5k1K4K5J34k8m2k6l0J4J01j32n3J99j22
$$ y = [-69, -86, 55, -63, -147, 5, 7, 76, -29, 20, -7, -145, 152, 36, -23, 56, -112, 34, 46, -139, 37, 90, 13, 100, -49, 13, 32, 39, -27, -19, -50, 48, 175, 59, 13, 84, 164, -45, -44, 44, -21, -45, 49, -76, -41, -69, -16, -33, 35, 0, -189, -224, -34, 10, 83, 21, -41, 101, 109, 30, 34, -89, -35, 42, 37, -47, -53, -44, 39, -12, -99, 67, -155, -120, -86, -18, -90, -62, -102, 95, -130, -81, 44, 27, -92, 87, -49, 13, 65, -111, -173, 41, 65, -124, 55, 16, 85, 76, -99, 40, -45, 245, 19, -84, -24, -35, -31, 105, -17, -178, 48, -53, 19, 47, 132, -154, -107, -82, 35, -88, -115, 68, 28, 3, 134, 34, -60, -125, 16, 25, -55, -104, -35, 70, -36, -15, -118, -192, 187, 56, 22, 131, -8, -13, 29, 40, -128, 69, -16, 36, 2, 49, -117, -43, -37, -27, -169, 4, -41, 193, -107, -29, 5, -51, 44, -53, 83, -72, 96, 88, 9, -73, 160, -23, 76, 29, -38, 62, -80, -53, -231, 70, 40, -12, -37, -30, 51, -174, 100, -110, 35, 70, -120, -135, -15, -70, -91, -67, -42, 92, 64, 22, -4, -34, -20, 81, -51, -104, 95, -27]
6200b7lp3J25j23K57r8q6NP2j32K4k21L68j13j4L8N5r8Q8J7Q2j3j35j9KM8J29
6227A55j62l7J13k8j45J65k31K90o7k3K7j17R9J7j01n2J76m3M5o5J56k82M3p5
6251a42N5j0Q1m3R7Qm1m3K6mO2qn4R9k5o8j07J18Mj34J30N8M8r2M1j93m1L4J73
6280B9l7N8Jq5PL0o7QR9j08j0J10n4l7pJ96j30P2j02P8n7J48j15J5p0J07j12K
6308c1L8j15l5J94K4J8j7k03J69j03q0J20Q2k06J76j63J85p1MJ00j07r6P8O4j48
6333a23N2M7O2O6j50R5k8j20k6p4J51J07k01k0K68p4p2j29J73P9j82O9j22P4J28
6358E0j02M5RP7j67Q6P9l14P4R9n7j18K03O2nO1r0n0J17j57K2l8J58J1j23K5J29
6385H6J1n3j08R5n7k2m0Q3j15O7J27o4L1p3o1J22q8j1M8j6J08j86J43Ol6j63J6
$$ y = [-27, -30, -103, 22, -101, 156, 58, -28, -23, 49, -83, -59, -280, 88, -25, -39, -1, 54, -44, 44, 61, 143, 130, -5, -24, -22, 26, 155, -7, -44, 69, 41, -104, 61, -170, 120, 53, 30, 57, -60, 39, 56, -45, -97, 79, 36, 81, 16, 172, -110, -67, -142, -87, -97, -16, -59, 38, 46, 5, -38, -12, -16, 46, 38, -16, 83, 58, -10, -117, 1, 5, -129, 1, 59, 107, 15, 56, -137, -178, -144, 29, -8, 50, 51, -34, -27, 3, -64, -56, 43, -65, -75, 35, -19, -56, -63, 133, 3, 75, -27, 51, -6, 142, 27, 42, -28, 79, -33, -31, 7, -108, -143, 51, 75, 93, 76, -127, 42, -61, -141, -21, 61, -145, 31, -132, 53, -18, -14, 86, -21, -117, -39, 25, -123, -71, -24, 38, 104, -46, 49, 21, -99, -125, -199, -48, 59, -142, -162, 106, 32, -40, -169, 4, 83, -99, -30, -152, -78, 50, -52, -7, 2, 79, -88, -2, 77, -237, -163, -64, -121, -239, -36, 26, 21, 82, -8, -58, 59, -98, -76, -114, 44, 55, -68, -43, 86, 97, 44, -64, 31, -26, -48, -88, -5, -120, -53, 74, 10, 41, -32, -93, 29, -59, -70, -22, -38, 70, -116, 27, 33, -3, -166, -150]
6412a50N4J02P1j70Q3J9j15R0m2p7M1J39m6jn4J2J3J02k14J46J6n0j34p4J19k3
6438a43P5P4j5M5P5k5r7l4K7n7J83j62J00Q9o3j66M5J3q2J03j95K22j4N0r4mR
6465d1Qm6j13R4J59n0j09J79k9k9r9oK10j6j15R7p5Q1p8j63K63p7o4LJ74q9l6
6492C3q7p1Q7R5O4j45N4o2kJ74k25OP2M6Nl9N8q2O8Qpk2j10J33j17j03J16K0J13
6521H0j22p4J27J4j75J18L5R0k01L6j09K30Q2m5np6j14J16o2L9K3Q0o0j9j3P5
6547G0k53J45j7J01j32O5J32j58o9R5q9R5j10O9K0j5k9%N1JJ83j65L6j06qj3J24
6574B3j15L7j1K27k38R0j88J88o6J62j02j11j2N1J36j76L5n7J59p4J71j87j5J83
6598A10m1oJ00j39l1O2R6q4k39K7J23m5KR8n2q4J87j7jj42J1j0J15L2q5J79k13
$$ y = [-150, -96, 6, 77, -93, -10, 9, -106, -16, -58, -135, -94, 45, -1, -2, -56, -44, -31, 71, -143, 3, 19, -31, -165, -239, -120, -143, -68, 6, -9, 36, 111, 86, -11, -45, -18, -75, 108, -54, 46, 135, 72, -94, -49, -36, -118, -15, -210, 12, -2, 48, -46, -50, -41, -33, -79, -192, -98, 61, 11, -98, 81, 52, 23, -76, -82, 128, 112, -3, 94, 19, 100, 22, -141, 122, 45, -19, -16, 158, 69, 33, -54, -125, -38, 57, 121, -24, 30, -32, -34, 140, -85, -79, -7, 39, 44, 5, 63, -19, 49, 57, 50, 28, -82, 51, -66, -169, -53, -33, 80, -42, -116, 11, 25, -150, -32, 3, 93, -108, -72, -181, 49, 131, 86, 81, 5, -109, 7, -55, -16, 7, 87, 27, 8, -5, 70, -183, -38, -55, 46, -86, -21, 111, -47, -116, -21, -110, -15, -125, -56, -36, -51, -80, -80, -29, -28, 155, -10, 26, -80, -88, -101, 23, -92, -55, -66, 161, -77, 13, -175, 13, -53, 109, 7, -104, -116, -65, 71, -105, -70, -127, 32, -42, 129, -58, -73, 110, 69, 63, 163, 24, -7, 55, 151, 67, -172, -145, -22, -67, -65, 33, -19, -103, 84, 67, 66, -76, -65, -75, 40, 72, -13, 166, -47]
6625d7L2j31L03j93J55q5k5k9J0k7O3j46K7O6J10j18M8Q1L0j36%J29o9K4j51L13
6651B34l74L0r5K16j6N2o0K2p8J36J7Oj91J28j10k1K46rj54m1J60j26J22K0N8
6676A72N5k33j0pP9j9n7j29J70oK1j31Rj4J25R8P7k06l6lj37J45L4J44j54pJ14
6703I4q3M5ro1k9K8n0k5P7oq1MJ5J48j10N4J95l65K11j8Oo9Q8lq0k6o3R0l6J84
6733A25j27J7n3l1J2K1l9J73k17J63j25P8m4J27j94n9R8j57J98l9K14j42j61K07
6757D5p2p8J48l7J9J15l21R0J07R7j66Q3qL3O2j12l1P2j47j3jR2J60k44J63j50
6783i4M9J76j65P1P9o2K4m2J3R1j97P8k4j5J47k04J26j23N7m3L9J86k56J00j81
6808a70K39M3k56K02n1O9P8j75O5m3K5l7Q0q1o2j44J93J35j36m9J83j7j0j64R3
$$ y = [-47, -15, -146, 157, -36, 119, 34, 9, -20, -10, -37, 26, -120, -93, -27, 83, -35, 13, 94, 124, -12, -12, 117, 48, 72, -79, 234, -140, -110, -205, 11, -5, 47, -13, 9, -69, 67, 84, 90, -101, 27, -83, -104, 142, 133, -21, -62, 98, -28, 94, 114, 172, 227, -6, -16, -23, 56, 37, -20, -149, 21, 15, 36, -95, -86, -100, 25, 123, 200, -6, -42, -45, -182, -37, -3, 141, -13, -20, 94, 11, 56, 47, -14, -43, -15, -65, -90, -13, -19, -100, -96, -81, 67, -43, 11, 206, -159, 52, 34, 40, -29, 59, 56, -24, -50, -113, -23, -59, 125, -2, 15, -38, -69, -57, -36, -75, 98, -119, 44, -81, -3, -47, 80, -114, -173, -75, -232, -34, -73, 141, -1, -162, 45, -27, -105, 43, 6, 25, 140, -181, -91, 16, 113, -53, 30, 22, 55, 117, 5, -26, 46, -101, -114, -115, -23, 137, -107, 56, -94, -45, 131, -34, 37, 116, 54, 78, 36, 49, 140, -57, 21, -3, -18, 129, -75, 51, -72, -15, -58, -19, 167, -89, 11, -170, 69, 112, -144, 58, 7, 76, 154, -21, 44, 1, 26, -11, 69, -12, -74, -218, -25, 110, -26, -75, 108, 91, 81, -83, 10]
6833A0r6J27j54L08k42Q6N3j75O4pj7J6j06N8R6O6j49K8qJ36l2j67o1K12j33J10
6859B3k1j90J47j40J48O1P5l3j83K16j96j47J83Q0j77L02j64k53L57J49k33q7
6881h3J00R6qmj6oj77P0P5r7l5N0L7j04J26j37OJ60j62R2J98l28K08k3j5L2k5
6908C0j19J37R6j49l1J56k7j03J0Q1k36M0O8J0n0J46j08K1o6J19J33k24m1K07
6932A00j83P0N8p2K18k99J07p7PJ73j15k5Q9j21N8o3J17Q7k01J65m4n7K09k28
6956b7r1K8J54Q2j64m2J44j38O8J02j70J0L5m4J62j38R3j91J67r7j0K3O2m0j78
6981b00K62j09K44j36m7r0J29j71J5r8Q2l8J09O4K2k1r2J09k6K7l3MRj54J48l5
7007b6M3j34k6J22O9j85R1J62j94J37q4J7N0n4jk0J11k8N8M1l7k59P6L0J99k46
$$ y = [10, -86, 41, -113, 195, -47, 39, 92, -83, -19, -26, -43, -27, -133, -75, 21, 87, -62, -34, -42, 94, 62, -105, -166, 46, -87, 23, 2, -188, -41, -181, -33, 28, 103, 70, -113, 103, -93, -240, -57, 23, -154, 148, -16, -269, 88, 237, 4, -83, 17, 113, 105, 101, 85, 79, -98, -28, 47, -50, -85, -35, 2, -102, 24, -113, -107, 53, -109, -17, 181, -147, 61, 38, 23, 55, 30, -89, 48, 144, -5, -36, 120, 93, -10, 0, 81, -155, -115, -47, -37, -87, 59, -49, -28, -94, 25, 158, -66, -107, 100, -83, -13, 45, -27, 191, -108, -1, -78, -71, 102, -13, -38, 51, -70, -12, -75, 42, 129, -72, 93, 49, -8, 201, -27, -118, -90, 64, 146, -18, -60, 84, -54, 14, 116, -54, -44, -9, -53, 109, -29, 64, -127, 40, -57, -67, -44, 18, -22, -200, 62, -47, 197, 61, 14, -76, 53, -118, -103, -201, -119, -157, -48, 16, 38, 17, -75, 34, 8, 35, 2, 6, 15, -139, 9, -26, 17, -117, -143, -21, 48, -137, -46, 116, -78, 59, -25, -8, 42, -12, -13, -33, 78, 50, 108, 149, 112, -147, -71, -41, 158, -88]
7033h8O4k1P1J9p9L4m4K3k1l5L1q0j7P0J51j08Pk5J4R3j53j50K13P6k21J95j43
7060a24M4l9Q3R8L5k38J48Q5p5J32l31J00J55nm2j5J74k32K0n5K03j42j3M9J2
7085B7j25K11j16L7j5O9l0j5q0p6K29Rj73O6k6M5j21J91k3Ono4o2L1L3K6J14j11
7113E2Q8k75K63l7k9m1K8o7O9j19O6K3j08Q4j2O2P5j88p3Q2R8n5M7l8J29j15J29
7140A38N7n1j54k6r6oK35q2j13M6J56Q1k08QJ21k95J43M3J1K%P8L8p3n7M1j20
7167h3K41k34o1J26J09J3j85qP6l0J77p3k19J89p0J6K6m8lK3J69p8j30J75k73
7192a55L04j50j17J01j71R7R3K2nK1j17Q6M8p0q5J85q5l3Qjm5o3K50k28m0K46
7218I6j36Q4q0Q2r5J21k33R1J11qMk5P4q6m0K32j71j10N0M7m2J8n2LM7m5K06l14
$$ y = [-88, -24, -45, 26, 45, -34, 0, -44, -21, -42, -77, -46, -126, -143, -73, 78, -30, -23, -48, -34, 59, -94, -244, -31, 45, -176, 19, -124, -80, -119, -36, 62, 97, -141, 7, 92, 17, 149, -182, -82, 73, 68, 26, 11, 185, -47, -27, -82, 121, -21, -34, 15, 27, -98, 113, -3, 34, 19, 88, 58, 43, -37, -113, 116, 125, -48, 18, -8, 37, -84, 107, 84, 90, 85, 21, -41, -10, 23, 49, 163, 52, 140, -135, 128, 91, 62, 21, 49, -18, 51, -68, -2, 21, -87, -3, -15, 47, 122, -66, -139, -57, 41, -14, 33, -5, 124, 9, 138, 195, 144, -10, -36, -132, -138, 97, 15, -98, -52, 104, 185, -23, -15, 106, -189, -46, -3, 8, 10, 10, 88, 126, 53, -4, 37, -83, 158, -76, -137, -11, 98, 111, -74, -82, -6, -36, 141, 68, -151, 38, -32, -16, 10, -38, -41, -18, 151, 73, -57, 118, -155, 149, -1, -118, -17, -188, -91, 2, 24, 19, 40, -77, 9, 57, -13, -98, 87, 2, -31, -23, -24, -69, -132, 118, -110, -150, 96, -40, 44, -36, 46, -49, 72, -161, -70, 41, 33, 37, 12, 86, 0, -40, 192, 21, -89, -39, 8, -34, -16, -68, -65, -18, -63, 143, -171]
7246a71J8R8J27j02J7l2K6L6M5o2m5o9J63M5K2k08n1K63j78J68j02P3N5j62m1
7271f7J48k2r7M5n3Q4O2r8k0J41p7j10k4J77k1k48J12O4j4R5j54K5KP1k1m5J4
7298c1j0Q9m7Q1j28O4rm1k0n6M4P1Pr0pJ12j96J83r0m4LJ88m2j50pK32j45J8j7
7327c8l9R5J4j37M2J1m6J06r9J9m4J65M0m0mp1j57J23K6k1l8L3J05j83O6N4J07
7354H9q1p2k6Q5j8J04rk57K19j19J08J5K5k26K39j16p9R8k6O3p6K6N9O2l0m0p7
7381f0K7N7Rn0k45R4J88j20J16j8O9j27L3M2j02P4J40p9N5r8j46K60k42J15j49
7406a57K71o0L7j63J53j26p8J35N9j56J21J4j76J18j18l9J09J55J8o9j67J05n4
7429f8J25L6k48m2K30o3j32J46l7J47j00K2K3l5r2J16q1nn3R5j08J16J2%m5Q5
$$ y = [-171, -153, -55, 72, -30, -13, -45, -19, 17, 62, 0, -45, -114, 49, 94, 116, -92, -143, 120, -58, 110, 8, 81, 136, -26, -67, 81, 59, -38, 7, -46, 38, 100, 2, -18, 123, 46, -64, -88, 89, 68, -180, -68, -4, -18, 77, -77, -52, -50, 21, 0, -45, -31, -41, 48, 1, 82, -46, 18, 9, -32, -52, -108, -64, 7, 14, -76, -83, 29, -167, 16, -74, -118, -115, 73, 31, -119, -126, 106, -39, -21, -38, -77, 18, 32, -105, -63, -52, -98, 8, -91, -72, -116, 49, 89, 49, 45, -26, -183, -60, -34, -55, -93, -60, 45, -138, -72, -18, 89, 8, -64, -90, -5, -23, 81, 72, -185, 34, -85, 23, 38, 63, -163, 76, -40, -119, -21, -47, 16, -60, -34, 25, 87, 57, 17, -60, -33, 24, 33, -17, -262, -168, 20, -100, 16, -2, 67, -60, -27, 15, -87, -13, 127, 48, 103, 5, -141, 119, -123, -8, -157, 114, 54, 91, -72, 81, -45, -123, 12, 71, -85, 36, 50, -126, -8, -126, -165, -56, 99, 117, 48, -119, -14, -68, 57, 93, -155, -197, 33, -30, -162, -16, -53, 94, -6, 16, 39, 4, -88, 28, -53, -58, -111, -16, -124, -8, 4, 4, -41, 44]
7455D4P9k22J57n7P1j02R4j71J59j21M5J14j09q4O3O1j9n9J19JO1m7j74J27J93
7480B23j44k00K26q8k3Km9R6j36K67k10j91K50o9L4o3J4Q7r0m6J37j19J26j01
7504f7Q8P9q0O1n7p3L1K0l0n1J76j73j7J86p1k9k25K69j8P9j12j3j30K40mOk31
7531a46P8J17r8M7n8O9J73j31n4n8j6Prm3N8M8L1J91k07p0p7K18q3K9j26J03P
7558@O9j52J20pp3o7J45p5o0Q6j63K47r2o7N4k3j0J42j82K11K0j49jn3Q8j9P0
7585E9j11Q0j19K1j6J17Km8o5J52M3j81J97m9j25J18q7O6k52J64P0j21J70j74
7609h9L7L1O0qp2J08j28Q0j25p0J31n5LJ32l9J3o9j11K12O2j05r2J48K16j40j90
7635f0m9J29M5r2o5M1K6kM3MQ3o7j77P6M8j4K4p2J98m2k51J63J11l4l6Q3j1j07
$$ y = [44, 123, -99, 58, 1, 72, -30, 64, -107, 52, -69, -24, 90, -19, -103, -40, 21, 2, -57, 62, 63, 124, 77, -97, 30, 223, 79, -121, 105, 17, -6, -4, -53, 43, -93, 174, -36, -227, 23, -46, -12, -75, -61, 26, -64, -110, 27, -92, 34, -67, 21, 100, 20, 81, 24, -49, -18, 2, -28, -79, 97, -76, -93, 93, 22, -7, -232, 37, 19, 98, -14, -27, -157, 83, 79, 85, -146, -68, 49, -49, -2, -60, 9, 182, 51, -3, -61, -77, -70, -79, -122, -64, -16, 15, 206, -1, -71, -148, 70, -13, 16, -110, -7, 0, 69, -83, 37, 30, -43, -110, 35, -40, -100, -14, -177, 70, -22, -89, -35, -58, -68, 74, -108, 103, 123, -26, -27, -80, 8, -11, 59, -52, 28, -91, -70, -86, 31, 33, -15, -80, 72, 115, -66, 131, 82, -43, 75, -12, 54, -198, -34, 36, -85, 85, -89, -52, -21, 39, 31, -41, 67, -61, 19, -106, -176, -45, -100, -97, 35, -4, 9, -60, -171, 41, 103, -2, -94, 54, 270, 130, -60, -109, 20, 65, -27, -92, -51, -25, -27, 16, 20, 103, 36, -141, -65, -17, -31, -7, -79, 119, 77, -174, -11, 100, 66, 30, 113, 102, -5]
7663ep0L0J38j37J20L3rqj04R0J10j80J30q3o1J19j28nM3j37J49mL9K3J2o8j10
7690g3K5QK2Pq4P5%M5j00n6R4J11J3j6P5k61J71n6Q8j04Jm8J23k80J45J03P4j07
7718eQJ13n9o9%M4m0J04k2j25M8r4K94k63k7J08J2j9r1Q5Q5p0J3m9n6J39j57J97
7746A04k74L05k07J29J46j50m6mk0n5R2OK7j13Qm0P0o6J03J18j66J25q7Op5J33
7772F9k10L05k43o0J61l0k6k1jlp7L06j53o6K21j95J8o3N7q5P0jr2J21L0m9o2
7799g9m3K28j33J15Q1k50K42k36J05k3m8n6P3O4R2j36K5O5n6j22K14j96L8k4K03
7824A43j54m3k0QK4o2J60O7j15l8J48q6M4j76r8J83J08j23J4J4j63M11j64n5n
7849B2M1o5J24p6j54NJ81j02j56Q5J45m7o3J54j98J65o8J1j54K03M0o7Q3p3j14
$$ y = [-5, -75, -45, 93, -44, 76, 109, 100, 92, -12, 78, 188, 8, 138, 55, -6, 113, -15, -20, 23, -114, 35, 31, 70, 93, 105, 37, -73, -48, -40, -18, -11, -95, -20, -20, 25, -75, -131, -37, 74, 87, 71, 146, -115, 56, 0, 88, -16, -15, -63, 60, -220, -75, 28, 102, -5, 3, 116, 57, -12, -12, 32, -8, 96, 74, -51, -3, -97, 197, -66, -93, 15, 27, 8, -83, 2, 87, 17, 30, -19, -75, 64, -93, 104, -170, 135, -72, 57, 203, 53, 7, 3, -17, -72, 20, 26, 53, -60, -52, -92, -22, -88, 15, 133, -33, 92, 5, 11, -64, 69, -141, 164, -79, -139, 22, -8, -34, -55, -56, -59, -136, 170, 17, -49, 172, -23, -5, -68, -11, -96, -26, -27, -119, 2, 32, -17, -79, -122, 106, -27, 88, 169, -81, 161, -75, 30, 7, -41, -97, -24, 40, 132, -4, 21, 86, 30, -92, 122, -74, -36, -60, 143, -11, -54, -74, -66, -42, -104, 56, 123, 8, -30, 118, 32, 76, -100, -198, -15, 93, -30, -16, -2, -165, 246, 82, 27, 22, 63, -2, 122, 46, -108, -103, 78, -24, -180, -95, 50, 3, -60, 94, -104, 61, -7, 4, -150, 53, 93, 26, 109, 36, -78]
7874g8J02J42j63J0j04J68%M4k00N2m1P3q9PJ82j82O7P4j4o0q3J52l9P3j53O3
7900CL1J0o3P4k3J54j10k2j8r6n7Q5l0J12J5j33K17p7l2Jq0K2j9J34j43L8pn2
7928f6J10k47O7K16m5n5l3R0q4O5J40k22N8J9p2J05J5j55J22K1J10k53J20j18
7952i2L7O0Mj02p9K58k62K85j54Kn2J73j82j73K09Q8K8j10J38j36J4LlP0r1j41
7978b08K11N6k8q5k9K51j17kpj47J79j43m7J57n8J26k54J62j05M8j6Q0k8N4J6
8003F6j13P6j07j0J8J08l8j01P0R9j19L0J6J38j01QN3r8lRL7l7O4n4j73L34l31
8030a59J72m9K6K7%O4j51K57j49j85K00m9m6K0k8P2j31r3J24Q5k2L3o6R6oK5j
8057F6p6P1j32J07J4NJ20l39J09J64j64J79k52j9P5K02j08K2Mj10K27j44J0J36
$$ y = [-78, 24, 166, 3, 13, -91, 77, 77, 121, -79, -27, -68, 5, -84, -77, 105, -77, -10, 64, 50, -10, -93, 59, 20, 93, -60, 3, 34, 44, -19, 55, 32, 186, 76, 54, 36, -60, -117, -32, -62, 50, 65, -68, 149, 72, 40, 41, -39, -17, -36, 98, -45, -7, -14, -66, 44, -203, -136, 80, 35, -20, -53, 37, -47, 18, 158, -64, -6, 13, -59, 46, 61, -94, 28, 49, 159, -94, 26, -92, -55, 5, 9, -93, -172, 86, -176, 109, -45, -43, -95, 78, -104, -277, -68, 20, 48, -62, 76, -60, -46, -43, -46, 24, -67, -208, 3, 59, 31, -54, -83, 168, 51, 49, 42, -105, 74, -69, -116, 41, -17, 109, -145, 17, -88, -40, -56, 24, -4, 50, 66, -47, 29, -78, -88, -70, 38, 0, -101, -31, 68, -51, -21, -5, 133, 32, 40, 93, -5, -8, 1, 38, 1, 65, 11, -162, 172, -159, 13, -36, -10, 17, 17, 81, -70, 187, 38, -147, 53, 4, -42, -22, -50, 22, -109, -202, -78, 7, -15, 18, -48, 48, 42, 67, 66, -10, 61, -71, 36, 50, 55, 175, -164, -55, 109, -55, 124, -128, -147, -72, 130, 22, 44, 48, -62, 165, 21, 31, 167]
8081A67j29l2Kj2j7j10J9J12r9N1j03J23j43J32N6r7K35l09J66m7j90L12m5K6
8105F8n1k19K11N5Q6j82LP1o5j43R5P7o1j2O6Q5r7j98K60n2o4O5O7n5j44J98o1
8132Cn0R0j37N5N4n5j03J68j85K53r5J1j08L1J34j36j02J89n9R3k8R0j95J2N0
8157b0K8j35K03p1o9Q7q3O5j3k7pj25N8nJ07L9r1n2R2P7k85L96k96J70j14k8J85
8184H6k28J90n2n0J5k4M1
$$ y = [167, 38, 6, 8, -4, -21, -131, -112, 0, -99, -48, -151, -28, -171, -39, 17, -80, 155, -154, 12, -35, -225, 87, 42, 68, 17, -202, 9, 64, 150, -32, -29, 42, -23, -166, -71, 6, -55, -67, -1, 84, -13, -211, 49, -3, -67, -2, 65, 10, -134, 64, 3, -47, 43, -94, -39, 15, -40, -143, 25, -160, 93, -2, 9, -99, -68, 66, -70, -172, 17, -42, 51, 23, 113, -82, -70, -20, 8, -127, 76, 5, -64, 23, -60, 5, -8, -35, -42, -167, -109, -114, -7, 32, -59, -111, -19, 58, -227, 169, -127, 43, -71, -99, 86, -142, 48, -4, -54, -39, -63, -22]
8191b2
$$ Imaginary data points
##PAGE= N=2
##DATA TABLE= (X++(I..I)), XYDATA
0@%%%%%%%%%%Qj6J6k4L2l2M0n6P2q5J01j20J43j67J92k32K72l12L60m15M79n44
32b88O16p01P94q96J008j130J265j414J575j749J943k158K390k638K910l211L543
49A859l905M300m736N220n756O352p024P785q654R654j0822J2212j3895J5979
63H569j8637K2167k7112L4575m7256P4329k30999K75013K56734o69917J41819
74a80715N92937k60070n17806M63829K97372n80868j54572O09032j11135n56981
84c98977L02182M70745m43361k64364N46384R6813n74508J06818N11875l03748
94D9859m24184M41140K45371n21047n5290N42318j27092m78195K96872L77006
104C46758m28456k22195N02718L8949n11962J47362M50177l04373l37943M13280
$$ y = [0, 0, 0, 0, 0, 0, 0, 0, 0, 0, 0, 8, -8, 8, -16, 16, -16, 24, -32, 40, -45, 56, -64, 79, -88, 104, -128, 144, -168, 192, -223, 256, -288, 328, -373, 421, -475, 533, -597, 668, -746, 829, -920, 1023, -1135, 1255, -1383, 1527, -1684, 1859, -2046, 2254, -2482, 2738, -3018, 3334, -3690, 4095, -4559, 5095, -5727, 6485, -7410, 8569, -10068, 12099, -15013, 19562, -27694, 46635, -184364, 90649, 347383, -322534, -180715, 412222, 152152, -365654, 98175, 395547, -185321, -339893, 269139, 158004, -398977, -96795, 373950, -69411, -333775, 212609, 309422, -265086, -158268, 353607, 49859, -374325, 66815, 312186, -208861, -264151, 278167, 151075, -327120, -30248, 346758, -81698, -303893, 198825, 237774, -274188, -126826, 323351, 18978, -318965, 94315]
114I4315J82141m80468j8296M81084j55113m16282L14253L09105m09042j47292
124b45595M58982j6916m53214J64221L78542l10457k75656M03409J28798m37609
134b05495M2413M26863j81518l46612L01129K32934l86714j05498M09491n1868
144A35125l91350J93381L18970k96171j95948L69193O9016l83812O5715L52448
154B36567j98553k87270K94370J72095l56322l9084L68601q8486l25957K06381
164a7658K53214k93520j49532L44121K2365l53133J05091L10654k15244k26894
174b20536K93549J20795l31676l841L29568j15057k88024K18155K05442k90653
184h2278r4990L21361k1061l06674J29197K57058k19675j77822K81645P4425l06932
$$ y = [94315, 276456, -204012, -222308, 258776, 103663, -312619, 1634, 310739, -98303, -245595, 213387, 196471, -256743, -92522, 286020, -24437, -300093, 103316, 232114, -205495, -163082, 263781, 82263, -264349, 36780, 269714, -117000, -222498, 186993, 135125, -256225, -62844, 256126, -40045, -235993, 133200, 202216, -181596, -115881, 236567, 38014, -249256, 45114, 217209, -139113, -178197, 190404, 101918, -224039, -17658, 235556, -57964, -207496, 136625, 158990, -194143, -89052, 221602, 6358, -220536, 73013, 193808, -137868, -141709, 187859, 72802, -215222, 2933, 208375, -82278, -177268, 144093, 123032, -183642, -54445, 202613, -17062, -194884, 86761, 161186, -145746]
195a45746L9344K89593j42643k31850K22326J49385k72282n3841K87175n0014
205I1447k69028J46310K13479k21197j28554K65335L3256k70616O3178K45396
215A69006j49441j91913K16806J11517k57740j6875K61491p9130k28654J60074
225d859J69196k18035r1244K49916J497k51165R0247K17248j68957j53063K22727
236F3508P1486k44122J5655K36586r8908k00708J70204J37977k20253n6653K37530
247A12302l1142k22216J09718J79392j71143j16772K11739M0884k25459M2388
257g0309K08670j18208j62326J75245R6561k06777k2554K12434n2875j93553J21680
268a2012J48927j76139q3405K04637P828k04293O5323J78524j27153j32054J73784
$$ y = [-145746, -106402, 183191, 40548, -191302, 31024, 180409, -91873, -145714, 141461, 91447, -177581, -31271, 182208, -38989, -167543, 97792, 131048, -139568, -76390, 169006, 19565, -172348, 44458, 155975, -101765, -118640, 142851, 63721, -164933, -4859, 164337, -53698, -144942, 104974, 106471, -144694, -54447, 162801, -6156, -159219, 63508, 134994, -109128, -93473, 143113, 44205, -156503, 13701, 151678, -68575, -125228, 112302, 81160, -141056, -31338, 148054, -23089, -139861, 71878, 112762, -112697, -70309, 138361, 20153, -142173, 33072, 129633, -77144, -99698, 112736, 59861, -133692, -12012, 136915, -39224, -122629, 82008, 89836, -114457, -49134, 129390, 2237, -129817, 43967]
279D3967P0397j98905K754J97488p5483j67825J35759J15956j75521n2930J92674
290H8331j6341j86933Q3331J56935j41168j04282J78487L8069j89113L0237J76211
301A13764r1366j42397J41463R2050j74265k8590J83606l8993j67019R8293J28081
312A14627j42386p6328J67057J6725j72164M4908J55612j01522j16721J43750
322C3558O2910j64047k749J62974n4183j42770J04334J05768j43236n3885J62763
333G1437o850j58949O3933J33546j10574r3395J42582M2985j57937J4027J53372
344I4177o9862j26836J16507Q2881j44572k9971J53819k5110j43845P5903J16231
355I9322j18327p3282J44868J9120j51123L6553J35265q4078j03772J20073O1108
$$ y = [43967, 114364, -84541, -81787, 115701, 40218, -127607, 8152, 124108, -51413, -104343, 88331, 71990, -114943, -31612, 125323, -15845, -120127, 58360, 96429, -92684, -62447, 113764, 22398, -119999, 21464, 113514, -60751, -89341, 94265, 55272, -111747, -13454, 114627, -27759, -104087, 62970, 79695, -92469, -47561, 108051, 6529, -110192, 33558, 96468, -67579, -70328, 92646, 38463, -104307, 27, 105795, -37441, -91326, 71437, 64587, -94362, -30429, 103117, -7457, -100852, 41730, 84715, -73222, -59195, 94177, 24315, -102521, 13986, 96867, -47705, -77676, 76143, 51033, -92812, -16909, 99322, -19005, -92287, 52581, 71701, -79422, -42869, 92396, 8318, -95454, 24619, 85727]
366H5727j41178j0252J45347m2858j28334Q9630R4099j22270m8909J37498j80
377E8320j36466M7743J19095r1131q5804J22260L9965j35688R754J30531n6422
388B2157j08535R4510P5546j21249l1956J33679j7144j27131O3744J02835j00619
399a4163o6083J22734K2047j30120K3580J22105o7829r7838J03671N9569j24377
410d6704j3389J27627l2017j14501P2243Q8758j03188n1797J21998O946j24359
421f8383L8335J08703p7547p9552J04201M2097j18545RJ18424m2085j03390Q0236
433B503P3641j06143l4127J17177p917j12669M7193R5798q1015o7048J05325K8497
445F1215j15998J3953J09477n3762q8872Q4369N8631j04744k1137J12997j9306
$$ y = [85727, -55451, -65703, 79644, 36786, -91548, -1918, 92181, -30089, -78998, 58500, 58320, -78146, -30403, 88692, -2439, -88243, 34017, 73982, -61706, -51952, 78579, 22157, -86378, 8132, 83678, -37571, -69527, 64152, 47008, -80123, -16379, 86456, -14163, -80246, 42488, 64535, -65585, -42005, 80100, 12271, -85567, 18104, 77673, -46704, -60093, 67534, 35517, -78984, -6741, 82017, -21171, -72968, 49030, 55976, -68383, -30048, 78655, 1108, -78444, 25757, 67854, -50691, -50682, 67742, 25657, -77733, 2503, 76144, -29999, -64126, 53051, 45134, -67535, -20342, 75456, -5559, -72607, 32718, 61215, -54783, -40830, 68647, 14885, -73987, 10382, 69013, -35731, -56868, 56129, 36823]
456C6823j06208N8712Q4639q9647n1284J07128J2331j10488K6592J00837o2139
467G296p9101R0923M5823j07957o325J08620l3118r5316O6277P1295r0158l8873
479f0614J04336K019j04927L6505R0811o9729o4605R1366L0862j00983M862R8834
491E8737l9485q4950P0226N9488r2160k5661J00434j1507r4844M4905P8733p1414
503g498n3077R0944K1015r8923J5041R2897m9434p4487P5101M6406r0877j3983
515d6875R5548j9251q8999N2123O9928p7922m1224R2116P191r3574K6434Q3814
527E9309n5219o3681P8287L6171r1724k978R1834l1535p9822N9034N7453p8648
539b1519k9013Q8597j606q7340L3352P5603o1232n2711P9352K2903q6364P923
$$ y = [36823, -69385, -10673, 73966, -15681, -66965, 40163, 52494, -57994, -31402, 69435, 7296, -71805, 19118, 64941, -43016, -49341, 59279, 26161, -69155, -2878, 68417, -21741, -60614, 43722, 45741, -59186, -22681, 68130, -1599, -66204, 25162, 56024, -44959, -40097, 58737, 19252, -65698, 4528, 64016, -28144, -53805, 46629, 35122, -59722, -14817, 63916, -7498, -60575, 30369, 51384, -47539, -32498, 60399, 10965, -63522, 11579, 57985, -32892, -46875, 48673, 29422, -59577, -7454, 62474, -15448, -56672, 35444, 42635, -50939, -24505, 59309, 4090, -59591, 18696, 54867, -36857, -39835, 51999, 20464, -59358, -324, 57129, -21519, -50532, 38065, 36459, -50881, -17529, 58074, -3158, -55869, 23483, 46386, -39978, -32055]
551c2055Q2985l6793o9085O1757M7317p9251j8803Q5450j3610q0331M2024O4136
563E3741o4230m0661P9058J3374q3651J7201P8075m6157o1199O8013L5359p9911
575c0988o737Q1726k1893p3560M8324N6583o9354l1106P9858J139q0082K7745
587a8345O8826n1302m9579O8888K6041p7992K325P7538l1243o5868N4432M4831
599D8552o9860j9778P6079o734p3307L2802O1699n4962m1996P0006J5697p5161
611c6963J1620P0028l5672n6516N5702L7470o8911j2583P3839j5128o8338L9243
623f209N3024n8218l1991O9263P693p1580J7819O5882m1980n0772O0553K8127
635D1611p0061k653P0192k1981o1749M3631M6731o0275k5042O9420p46o8923K5252
$$ y = [-32055, 50930, 14137, -54948, 6809, 54126, -25125, -43928, 41522, 27912, -52419, -10395, 53741, -10489, -51150, 27908, 41282, -42369, -25168, 52907, 6750, -54449, 13564, 48923, -30988, -37725, 44001, 22108, -51452, -3128, 53455, -15899, -47005, 32853, 33992, -46090, -18345, 50481, -821, -50400, 18488, 44529, -33463, -31138, 46400, 15157, -50711, 3721, 48552, -21308, -41086, 34993, 28259, -45048, -12246, 49453, -5509, -47505, 22501, 38198, -36963, -25343, 44685, 9013, -47503, 8199, 45669, -23242, -35825, 38014, 22886, -45452, -6209, 46815, -11403, -43394, 25869, 33562, -38018, -20199, 45683, 3703, -47069, 13484, 41611, -28450, -31103, 39089, 17108, -44641, -1010, 45721, -14554, -39596, 29824, 29078, -39845, -14593]
648a4593N8584m6040m1537N9862K0306o6469L558O5623k7083n5677M7572L7849
660D1955o0855j5387O5248p617o2013K9301N1916m7942l4962O0608J2178o4766
672c2336J1213N9899l2513m7558M8984L0389n9396q951O3150j3829n8244L5404
684c788M4608n1284k5601N9620M123o0765J7051N4732l6795m1841N2271K2464
696C4795o0233j81N9603k0970n1475L8782L7824n1754j9350N8857j642n8134K3043
709a0835M8897m0752l3606N1753J4976n6540M520N4824k4179m6027M1171L0776
721C4978n2096j1320N5423q445n1688K6519M2265m1336k7445N1429Q820n5029
733b7925J1304N0573k9919l9008M2962K3440n1083n290N2926j3485m8442L1501
$$ y = [-14593, 43991, -2049, -43586, 16276, 36582, -29887, -26329, 39294, 12211, -43466, 4106, 41955, -18900, -34287, 30961, 23344, -38669, -9368, 42548, -5394, -40356, 20252, 32430, -32336, -21123, 38776, 6263, -41295, 7689, 38078, -21318, -30269, 32881, 19052, -39192, -3788, 40820, -10464, -36065, 23555, 27678, -33087, -16036, 38696, 1901, -39940, 12331, 34795, -25438, -25619, 33984, 13014, -38461, 321, 38145, -13609, -32959, 25898, 24256, -33878, -10835, 38062, -2690, -36296, 15457, 30433, -26107, -21587, 33237, 9058, -36969, 4202, 34978, -17118, -28438, 26985, 18540, -33148, -6629, 35636, -5700, -33145, 18284, 27104, -27925, -16621, 33952, 4033, -34975, 7987, 31427, -19656, -24946, 27980, 14495, -33947, -2446]
745b446L6907m4783j9894N1446J471n1302J6774M4987l2793l3341M4668J7294
757B8988n1270J724M9969k0016m2253L4704K9527m4719j3641M9489l767m8337
769b9602K1746M0184l6126k6303M4992R932m7896O846M5223k3024l7032L6064
781E004K4122m4870p728M7316r771m3173K4976L4003l6600k0868M4114N403m6188
794b4260J1551M2164k7235l1638L8254J7666m4299k032M4568j3827l9868K8144
806h12K9928l9246j5510M4734j184m3430J6561L7205k9146k6771L8767J3036m3566
819a9434L004M2424j8891l4927L0911K3268l8684r636M1574m961m0253J9678L3342
832B7415l1740k1411L9365O831m1036P859L7758k0779l0495L1881J9013l9206
$$ y = [-2446, 34461, -10322, -30216, 21230, 22701, -28601, -11827, 33160, 367, -32974, 11694, 28988, -22282, -20558, 29411, 9395, -32858, 1846, 31373, -13346, -26987, 22502, 18735, -29602, -7856, 32328, -3798, -30101, 14891, 24823, -23073, -16227, 28996, 5972, -31060, 5004, 29126, -15744, -23472, 23844, 14073, -29100, -4124, 29879, -6721, -27589, 16525, 21928, -24260, -12709, 29455, 2220, -29418, 8836, 26502, -17797, -19829, 24739, 10912, -28956, -812, 29116, -10130, -25640, 19094, 17910, -25520, -8959, 28246, -900, -27671, 11096, 24132, -19434, -16430, 25994, 7103, -27824, 3087, 26355, -12329, -21965, 19609, 14648, -25605, -5927, 27415, -4325, -25736, 13629, 20460, -20576, -12717, 25041, 4262, -26233, 5648, 24661, -14545]
844a4545m661M0773j0507l6403K3369K7428l2950j5583L8120K241l8897J1732
856i883L5078k4834k5529L4327J2502l8071R30L7596j4222l2550K5556K3617l4265
869i748j1119L8143l121l6802J6351L0401k6791k0568L3737Q838l6675M226L5525
882B2397j7343k8948K7848J8297l3611o072L5231o410l3039J7929K6704k7663
894d680j7044L4048M034l5002Q718L1504j9541k4412K8164J4608l3347k597L4396
907A8849r792l0734K1145K2598k9090j1948L2731J93l2676J1262K8885k1933k1179
920b1689K9886R917l3255K423L1841j3369k6477K2634J8601k9293q268L2397l509
933A1839l1209J4938K5252k4017j6284K9274N984l1238M683K9538j5373k3810
$$ y = [-14545, -19206, 21567, 11060, -25343, -1974, 25454, -7496, -23079, 15041, 17282, -21615, -9883, 25195, 361, -25168, 9159, 21661, -16410, -15480, 22116, 7894, -24656, 900, 24517, -9748, -20867, 17276, 14155, -22647, -6296, 24105, -2686, -23254, 10483, 19321, -17354, -13128, 22397, 5054, -23894, 3954, 22251, -11360, -17432, 17799, 11389, -21650, -3721, 22983, -4680, -21724, 12324, 16358, -18644, -9926, 21578, 2037, -22375, 5789, 20397, -12950, -15547, 18849, 9057, -21677, -532, 22066, -7024, -18972, 13759, 13952, -18724, -7462, 21423, -510, -21689, 8197, 18114, -15141, -12718, 19123, 5754, -20723, 1911, 20512, -8781, -17049, 15348, 11839, -19370, -4432, 20820, -3197, -19481, 9793, 15777, -15461, -10778, 18760, 3387, -20423]
945b0423K4365J4645k9314l725L0426p062k7450J6611K1350k4091j2945K8748
957A1135K422k9844Q793K6240j8288j9405K4770J0754k8626n09K8970r846k5259
970a8693J9171J8107k5619q680K8538j464k7624J1018K3799j9658j6837K5758
982G816P292k8615L290K6790j2666k2020K0170J4670k4989n733K7216l901k5853
995a6533J3572K0808k0808j3330K5427L686k6253N210K4466j3824j9563K0989
1007C847J1804k5413k394K5874o694k3195J4964J7531k0763j0346K4746J424k5303
1020a3918Q002K2185j6234j6099K1683Q124k4330M65K3988q710k1200J6636J5251
1033A5843k2395o717K4485k117k3242J0441J9290j7070j3282K1876N563k4085
$$ y = [-20423, 3942, 18587, -10727, -14452, 15974, 8912, -18538, -1927, 19423, -4668, -17613, 11135, 13557, -16287, -7494, 18746, 458, -18947, 5823, 16577, -12049, -12558, 16412, 6566, -18693, 478, 18585, -7034, -15714, 12824, 11360, -16264, -5246, 18553, -1105, -17942, 7816, 15108, -13507, -10217, 16573, 3907, -18113, 2057, 16727, -8262, -13995, 13221, 9320, -16533, -2961, 17847, -2961, -16291, 9136, 12822, -13431, -8221, 16245, 2421, -17142, 3847, 15651, -9762, -12156, 13718, 7024, -16171, -1207, 16324, -4439, -14785, 9961, 11385, -13918, -5916, 16269, 35, -16064, 5619, 13743, -10587, -10122, 13866, 5156, -16044, 592, 15843, -6552, -13269, 11216, 9099, -14143, -3702, 15588, -1482, -14764, 7112, 12675, -11410]
1045a1410L351K2620j1795j8032J8124J1160k1632l692K2699m208k1420J2020
1057b215J7286j8389j0110K1838K144k2263N766J9946j2727j5638J8392R144k1915
1070h741j132K2102p094j8955J3554J4038j8518p508K1157P2k1159P596J8475
1083A3887j4372j3020J9271N635k0872J579K0138q487j7131J4602J1789j9035
1095f016m978K0760k666j9625R958J5762j5374j0189J8646M035k0436L616J9046
1108A2539j0453j5021J5740Q905j8700k385J9621m710j7828J1194J3739j5980
1120c339q164J9014Q62j9067O108J6670j1623j2471J5886O976j8510j77J8790
1133A0955o966j5973J2741J1027j6525n272J8137j109j7976P683J5252j3189j0300
$$ y = [-11410, -8059, 14561, 2766, -15266, 2858, 14018, -7614, -11306, 11393, 7185, -14235, -2215, 15071, -3318, -13428, 8410, 10554, -11709, -5943, 14003, 1276, -14362, 4030, 13174, -8741, -9873, 12229, 5135, -13820, -266, 13772, -4746, -12254, 8903, 8975, -12184, -4588, 13887, -485, -13505, 5766, 11401, -9471, -7892, 12246, 3759, -13372, 1230, 13019, -6016, -10994, 9766, 7100, -12525, -2567, 13195, -2179, -12368, 6278, 10313, -10123, -6507, 12539, 2086, -12935, 2805, 11710, -6990, -9375, 10246, 5536, -12292, -1098, 12641, -3339, -11503, 7511, 8373, -10694, -4586, 12084, 461, -12010, 3876, 10852, -7658, -7835, 10955, 3989, -11984, 757, 11784, -4741, -10013, 8124, 7015, -10961, -3278, 11974, -1215, -11515]
1146a1515J7027L878j8132K627J6971q390j4009J3288R508j6992l164J7998l450
1159E645j6849R570J3107j3988q028J6507K270j7342L970J5911r624j2403J4325
1172C071P026j6490j105J6908m997j4977J0048J1466j4171o680J6836K55j6789
1185i599N835J4486j1118j0137J4322N011j5832M93J6158o683j3627J1607R575
1198A0491j5028l844J5973j724j5415P123J2800j1683q706J5031L058j6198L031
1211e091J4658p942j1873J2120P765j4883k407J5770l294j4512Q713J1071j2604
1224b509o342J4426J312j4905M021J3508q824j0699J2717O003j4832n4J4492m850
1238C464j2793R282R571j2619n068J4617m04j4341N603J2046j0106q392J2943
$$ y = [-11515, 5512, 9390, -8742, -6115, 10856, 2466, -11543, 1745, 11253, -5739, -8903, 9095, 5645, -11204, -1634, 11473, -2515, -10543, 5964, 8234, -9108, -5138, 10773, 1149, -11254, 3071, 10097, -6393, -7498, 9410, 4413, -10564, -516, 10950, -3221, -9901, 6935, 7190, -9599, -3764, 10722, -396, -10533, 3789, 8800, -7032, -6539, 9619, 2936, -10691, 916, 10491, -4537, -8381, 7592, 5868, -9547, -2424, 10376, -1307, -10013, 5018, 8076, -8122, -5091, 9567, 1625, -10248, 1872, 9637, -5246, -7653, 8117, 4823, -9689, -976, 10095, -2509, -8851, 5575, 6887, -8018, -3997, 9511, 687, -10012, 2705, 8708, -6124, -6178, 8314, 3464, -9329, -47, 9524, -3095, -8163, 6454, 6050, -8291, -2688, 9358, -748, -9140, 3803]
1251C803L788j4136J041J3979o081j1813J0371P965j3294k900J4236k186j3110
1264h337O777J0661j0511p084J3419K115j4147K857J2815p567r844J0919N913
1277G986j2691j648J3208l010j2397P986R481j1417n129J3160L49j2827L769J1398
1291H218q001q550J1222M510j2932J52J2547m411j0934Q341P958j1189l816J2567
1305E682o06j2445N103J0706r050p153J1457K787j2245J495J1492n500r779R125
1319A069O431j1479k149J2090k237j1072O315Q667r098n758J1441J561j1764K559
1333c424J0912o737q282R535M781j1121q97J1280l158j0136O600P997r457m538
1347f645J1315K4j0867L726R516o897p174R655L510j0576j87J1079m473r009P534
$$ y = [3803, 7591, -6545, -5504, 8475, 2394, -9419, 952, 8917, -4377, -7277, 6959, 4773, -8337, -1560, 9101, -1410, -8494, 4925, 7040, -7107, -4250, 8565, 998, -8846, 2073, 7986, -4705, -6353, 6855, 3845, -8552, -566, 8915, -2502, -7631, 5529, 5878, -6949, -3180, 8218, 217, -8333, 2889, 7399, -5533, -5381, 7166, 2755, -8179, 162, 8120, -3069, -6885, 5682, 5076, -7369, -2266, 8440, -610, -7763, 3694, 6481, -5764, -4269, 7223, 1723, -8056, 1069, 7500, -3979, -6128, 5962, 3725, -7347, -1032, 7635, -1463, -7221, 4220, 5781, -5983, -3424, 7488, 751, -7531, 2004, 6785, -4336, -5233, 6047, 2889, -7247, -647, 7350, -2107, -6645, 4670, 4694, -6173, -2447, 7069, 172, -7002, 2653, 6163, -4413, -4600, 6479, 2006, -7003, 531]
1362E31O280r582l037J0729r97j0190M342Q795p779n620R757K242j0580J890R416
1377F197m727q130P802M996r656j583J0390k306r418N648P167p898m579R487J224
1392D614r952K649R122n992o701Q209L762r468l30R465k855q618N911O338q240
1407b086l374R483j16r446L649P841o378n551Q409K689r123N02R025l930p677
1422f083O794M958q358j967Q780j103q489M148P151o839m730Q584J715r109J792
1437b756Q263m763o354O917M053q244j161Q720k183p879M901O068p203l392Q156
1452C143O79q555K437P720n188n753P233K981q021k36Q206k787o969N033N380
1467E303p208k612Q222l47q178L332O753n771m527O957K282p815O77P533l398
$$ y = [531, 6811, -2771, -5808, 4921, 3924, -6266, -1924, 6871, -908, -6528, 3229, 5471, -5109, -3219, 6197, 1470, -6660, 1142, 6138, -3518, -5101, 5289, 2983, -6435, -787, 6380, -1518, -6097, 3390, 4614, -5338, -2689, 6433, 441, -6260, 1949, 5711, -3757, -4087, 5378, 2523, -6095, -184, 6154, -2086, -5460, 4023, 3907, -5539, -1890, 5951, -427, -5978, 2431, 5120, -4003, -3501, 5524, 1594, -6083, 711, 5669, -2689, -4656, 4124, 3021, -5468, -1320, 5831, -1008, -5738, 2846, 4561, -4548, -2756, 5507, 744, -5610, 1307, 5360, -2884, -4045, 4675, 2492, -5387, -486, 5582, -1621, -5013, 3143, 3822, -4733, -2296, 5424, 236, -5517, 1716, 4697, -3324, -3560, 4646, 1859, -5110, -77, 5303, -1905, -4517, 3705, 3358, -4820, -1488, 5265, -506, -5033, 1924, 4206, -3609, -2932, 4601, 1203]
1482A203o425N845M278p448j176P672j353p198L603N973n739l904P183J173p763
1497d076J789O971m069n515O041L117p098n77P259j737o889M506N214o411k663
1512d138P044K09p109K192O598m708m909O376K602p124j0O997k738n852M715M315
1528D460o162k018O937l50o885K756N731m914l904O381J350o670Q05O489k975
1543A031n360N001L285o088j074O491j206o035L290N050n078l135O029J077o606
1558c328J530N914l659m582N153K534o015n83O312j576n700L608M525n334k363
1573c564O165r3n938K168N116l692m060N226K012n923R5N931k430m938M012L617
1589C704n288j602N887l86n682K371M969m533l117N503J109n679P77N496k934
$$ y = [1203, -5222, 623, 4901, -2547, -3723, 3949, 2596, -4602, -999, 4974, -765, -4669, 2514, 3687, -4076, -2287, 4684, 615, -4900, 1141, 4258, -2840, -3417, 3842, 2105, -4784, -278, 4936, -1475, -4138, 2906, 3115, -3994, -1802, 4796, 88, -4821, 1555, 4157, -2967, -2977, 4020, 1282, -4570, 145, 4460, -1702, -3720, 3217, 2867, -4018, -1262, 4469, -445, -4349, 2032, 3382, -3288, -2483, 4006, 1031, -4329, 672, 3957, -2131, -3205, 3286, 2080, -3955, -665, 4385, -693, -3828, 2201, 3278, -3328, -1798, 4116, 457, -4125, 1028, 3562, -2453, -3036, 3276, 1700, -4000, -392, 4133, -1201, -3564, 2601, 2508, -3430, -1262, 3854, 162, -3898, 1328, 3340, -2583, -2488, 3443, 1013, -3925, 87, 3704, -1584, -3186, 2701, 2315, -3367, -996, 3973, -560, -3677, 1826, 2935, -2744, -1967, 3529, 595]
1604E95m279M207K961n377r37N803j338n124L088L961m335k678N444O49n564J454
1620a470M801l082l683M383K165n202j41N107j593m553L192L674m640j894M905
1635A969Q3m885J896M152l184l225M499J525m969J05N036k185m140L666K686m283
1651a254j356N010o20m807K282L950l700k548M705P14m781J187M183k567l526
1666c128L874K322m634p44M697j099m224K683L187l841j863M431N00m743J432
1681a150M218k785l172L858J615m297j86M331j547l813L083K636l910j293M366
1696A954k40m198J766L443l034k566M054J109m240M73L988j884l433L307J839
1711B338l833m88L947p36l697J949L156l193j807L622O16m005J024L700k420k768
$$ y = [595, -3684, 523, 3484, -1893, -2830, 2973, 1635, -3489, -401, 3560, -775, -3453, 1991, 2640, -2924, -1470, 3331, 249, -3434, 949, 3114, -2088, -2229, 2878, 1285, -3268, -76, 3598, -1042, -2936, 1969, 2052, -2833, -937, 3215, 31, -3194, 1305, 2830, -2139, -2034, 3002, 817, -3323, 343, 3029, -1254, -2610, 2400, 1780, -3027, -745, 3205, -495, -3043, 1662, 2376, -2405, -1218, 2965, 398, -3128, 746, 3068, -1566, -2310, 2387, 1288, -2936, -253, 2934, -907, -2770, 1661, 2161, -2582, -1150, 3068, 283, -2889, 969, 2584, -1713, -1899, 2432, 885, -2928, 155, 2791, -1119, -2412, 1954, 1714, -2484, -718, 2725, -309, -2875, 1179, 2288, -1952, -1479, 2509, 625, -2808, 499, 2338, -1495, -1983, 1964, 1228, -2469, -520, 2636, -557, -2364, 1258, 1874, -2131, -1107, 2593, 173, -2595]
1727b595L223J736l908k42L999j213l566K562K610l380j449L940k36l714J323
1742i10L228k333k390L085J333l767J65L746j472k986K355K358l265j017L588
1757A718m14l498J764K946k841j807L083P64l543O39L300j631k777K741J788l612
1773a380k07L460q35l127J945K328k588j581L324K25l434R25L110k012k271K755
1789F37J216l222j78L407j099k926K218K123k785j191L165o1l154J088K813k139
1805h8j979K960P80l253L87L056j429k489K155J892l072m98L037l29k947J500
1821c17K407k452j586K982L33k866N19K982j687k286K433J318k955k95K982o30
1837H82k696J605K119k447r61K627J38k646P79K369j666j982K456J116k843j1
$$ y = [-2595, 628, 2364, -1544, -1786, 2213, 1000, -2566, -4, 2606, -774, -2223, 1717, 1481, -2233, -910, 2318, -15, -2405, 680, 2013, -1754, -1589, 2157, 685, -2301, 54, 2412, -853, -1870, 1718, 1304, -2194, -430, 2516, -325, -2132, 951, 1715, -1828, -1189, 2111, 480, -2297, 444, 2232, -1380, -1587, 1873, 1038, -2089, -144, 2184, -404, -1985, 1339, 1564, -1870, -945, 2165, 153, -2118, 637, 1853, -1369, -1547, 1860, 761, -2165, 53, 2176, -609, -1800, 1365, 1304, -1850, -762, 2051, -88, -2067, 893, 1673, -1580, -1193, 1863, 434, -2055, 100, 1992, -1080, -1578, 1459, 1130, -1817, -317, 2090, -362, -1948, 1034, 1367, -1499, -980, 2002, 315, -1971, 462, 1780, -1175, -1470, 1512, 882, -1814, -209, 1910, -537, -1498, 1129, 1267, -1379, -600, 1769, 103, -1879, 577, 1693, -1150, -1161]
1853a161K665r62k454K025J703k555p58K727k03k514J099K167j744j567K512L31
1869A311k480J90K559j190k128K001J345k328n16K457m41k381J385J895j970j266
1885a557K557J33k432O70K043j414j697K068J005k473lK425p94k156J513J596
1901A484k006j084K485K48k508Q57J933j656j241K010O55k099o3K327q04k025
1917a487J545J377k144n09K199q4k330J180J661j526j203J887N26k299L94K128
1933A315r42j780J635J118k133l24K366n58j955J023J601j761q95K084kj872N80
1950e00J844j356j142J514P80k030MJ977o00j960J290J600j912n86J895l2j984
1967a198P32J832j577j213K028M55j808K02J567p21j521J181J245j663n63K002
$$ y = [-1161, 1504, 542, -1912, 113, 1816, -739, -1497, 1230, 1027, -1487, -388, 1779, 35, -1532, 980, 1311, -1169, -979, 1580, 390, -1738, 263, 1608, -720, -1236, 1221, 780, -1601, -216, 1679, -291, -1557, 1000, 1133, -1299, -629, 1414, 0, -1697, 371, 1376, -1097, -1100, 1325, 531, -1625, -112, 1484, -522, -1606, 879, 1127, -1381, -524, 1409, -247, -1488, 522, 1177, -922, -985, 1342, 538, -1487, 58, 1435, -709, -1218, 981, 897, -1433, -253, 1408, -118, -1321, 566, 1092, -1207, -813, 1315, 373, -1407, 228, 1346, -787, -1111, 1255, 697, -1258, -235, 1366, -395, -1290, 794, 792, -1080, -500, 1344, -12, -1154, 360, 1140, -890, -886, 1091, 491, -1469, -179, 1421, -491, -1077, 818, 786, -1198, -466, 1366, -211, -1424, 604, 1059, -749, -547, 1020, 299, -1222, -41, 1204, -459, -1022, 980]
1983I80l43j809R82J311j361r43J745P44k183L29J737j035j267J617N32j801q5
2000h50J879o11j505R86J096j328n08J574J72k013O39J613j111j270J547P24j747
2017g13N7J541n62j411J051J170j454n88J629j52j410O03J299j229r43J649M35
2034I72j736L11J507p85j306J168P21j548j91J772l71j512R96R18j205p28J479
2051D62J56j269K76J364r63j003J126O61j543J38J591o44j323Q73R71j201m88
2068h16J433O6j464M17J430j242q04J477J60j114p0J412o87j167J079O19j102
2085c73l28J402j90j380P91R40j048n19J241J25j399L68J273r61p95J133M22j203
2103e01j22J211k30j140P03R95j333j51J010J49j168N65P48r00p89J352L17j255
$$ y = [980, 637, -1172, -190, 1121, -240, -1183, 562, 1306, -877, -548, 1189, 154, -1113, 504, 1036, -765, -850, 1029, 418, -1087, -101, 995, -333, -841, 733, 905, -1108, -469, 1144, 33, -1237, 310, 1034, -713, -656, 885, 323, -1088, -37, 1133, -321, -909, 720, 568, -842, -239, 1060, -169, -1112, 537, 972, -764, -453, 1054, 269, -1037, 131, 852, -696, -887, 885, 514, -998, -2, 916, -289, -1017, 462, 618, -651, -375, 989, 26, -977, 149, 810, -733, -595, 996, 352, -971, -98, 873, -328, -816, 617, 683, -781, -364, 1066, -176, -980, 497, 657, -457, -527, 885, 198, -969, 110, 729, -373, -701, 701, 511, -869, -78, 862, -186, -705, 536, 661, -738, -370, 903, -58, -853, 280, 702, -501, -623, 588, 358, -782, -79, 916, -417, -568, 442, 591, -577, -12, 736, -164, -953, 399, 716, -539]
2121e39o9J219m41j037Q04P86j080l34J209j86j080N77R37q74n52J022L36j331
2139f33K40J005m89r08Q93N81j190q9J395m49r94N26J000j011q88J616k23r71
2157e89L36R78m30j092J093L98j168mJ000l44r03O15R12j022l46J038j20r52M12
2176a88P93p79m88Q29L22r30nJ206o28q46R41N12j008j78J040m93p82M96Q74q40
2196a52n51J138q3q86L00Q26n98n90P09N44j019j72J038m11o87N59O71q19l95
2215e78R83Kj078M41R43p49n30Q81K04r12K01P46n56n64O00N06q62j93J034k42
2235B77p81N07O27p95m09P96Q7o54k6Q79m92m60O71K45o18j94R82m77o46M45M65
2256D29n64l15Q78j18p36K89Q07n64n65O90K66q00q7P95k63o93N25N97o71m52
$$ y = [-539, -608, 611, 170, -867, -63, 723, -357, -691, 518, 332, -748, -171, 766, -108, -660, 362, 698, -633, -393, 612, 123, -785, 108, 689, -501, -590, 805, 356, -638, -112, 888, -123, -1011, 605, 382, -589, -253, 725, 295, -797, 296, 694, -474, -478, 522, 178, -725, -110, 802, -220, -566, 472, 352, -600, -188, 605, -174, -662, 167, 489, -441, -446, 760, 132, -714, 227, 739, -269, -447, 593, 100, -682, -186, 688, -152, -703, 435, 352, -534, -234, 592, -6, -596, 113, 657, -362, -534, 504, 93, -594, -35, 636, -183, -578, 405, 407, -671, -230, 713, -36, -566, 315, 519, -393, -192, 554, -2, -566, 34, 540, -322, -515, 519, 277, -504, 3, 630, -165, -574, 222, 309, -345, -371, 508, 16, -444, 227, 472, -146, -340, 642, 165, -481, -36, 429, -135, -450, 428, 310, -426, -137, 670, 106, -459, 231, 497, -303, -390, 405, 142, -551, -26, 571, -100, -552]
2276e52R14j57n81L02O93n54m56P05J83r00L46P13n39o64O39M43p93Q5M09j51
2296H5m88L67L98m89l04P59K62j022L39N43m42l72N42L21q45J57N38k10n92N42
2316H9M41p81j28P32j32o61K74N64n78l78O63J60o25J33P40m10l54M93L17q41
2336b82l9P67j94o48L08N69o89j37O10J59p60K33L70k54k38K72K89n04j32P88
2356D88l29o01N44M51o89k89P70r2o30OP70n39j93M67J91q12J73P23l35l25K99
2377D8L84o65o8O03j04o00M48M32n71k55N67mo34J90N99k86m82N00M43q37L9O33
2399C80k63m16L23M14n94o6M84j8o03K00M41m50j19N44J71n49k15O67m21l58P88
2420C40O5o20j60P46k35m74J39M01l58j23N01l4n01K29M62m55l18N36N9o11J57
$$ y = [-552, 362, 205, -376, -74, 619, 65, -391, 314, 497, -403, -57, 656, 117, -547, 92, 535, -258, -173, 236, 85, -403, -36, 362, -127, -431, 328, 590, -432, -93, 450, 8, -364, 178, 499, -346, -189, 349, 139, -453, 89, 530, -251, -379, 353, 221, -440, -166, 398, -180, -558, 105, 265, -360, -227, 513, 103, -251, 242, 559, -282, -321, 446, 252, -396, -88, 481, -208, -345, 265, 424, -336, -103, 267, 13, -225, 47, 336, -168, -300, 488, 159, -442, 102, 553, -136, -425, 345, 253, -377, -371, 399, -140, -333, 134, 325, -487, -314, 409, 74, -251, 48, 432, -233, -301, 302, 198, -402, 46, 478, -93, -348, 219, 215, -419, -229, 370, 84, -398, 102, 545, -292, -253, 380, 117, -299, 24, 438, -156, -222, 262, 244, -359, -159, 282, -168, -287, 257, 428, -121, -336, 331, -90, -448, 340, 405, -215, -375, 371, 136, -338, -199, 202, -156, -279, 222, 188, -313, -84, 378, -77, -395, 141, 200, -411, -254]
2441b54O01k23m08J29L79k64k96O32r9n19K20M13k23l46M75N8n18J26L90j03n88
2462d18N19J07l18k25N98N4o53K56O12o28l31P30j55l30m0N93l66k75M60Q5l95
2483a20k32O87j29o36O31K35m67j26L42j04l41P9L35l19k21M73k7l58K32L95k43
2504H6m66L80K28k49m15N90L7n59K67L66k26k45L17K05n36J17L08K4l33J96J32
2525B24k76m9L53k02n09N69J05l44k6L81L3n88K50K28j16k30L09R5l11R3L96l83
2547Bk17K17K57o31M9N99l2o04K91K95m39k02N97L2n36J33N12l52m03M80K65p06
2569c93L08L74o3m47L56L1l15l17M38K79m06J4L96j98l22L06K44m49J68J69j53
2590B0k84L22J83l59N7K75j97j71K33j4k29j13L53L8l33P7M97l04k62J72L66m57
$$ y = [-254, 347, 124, -284, -155, 224, -40, -336, 296, 197, -322, -102, 311, 88, -258, 217, 275, -243, -117, 273, 170, -418, 101, 208, -110, -335, 263, 317, -336, -80, 532, -96, -427, 303, 148, -182, -222, 371, 5, -270, 190, 275, -120, -352, 335, 206, -430, 201, 436, -31, -157, 185, 81, -260, -181, 154, -165, -386, 87, 60, -298, -66, 329, 86, -380, 0, 228, -21, -436, 154, 191, -368, -101, 265, 39, -206, 111, 316, -220, -103, 205, 229, -104, 92, 224, -52, -101, 252, 50, -459, 110, 215, -129, -155, 226, 259, -329, -79, 149, 33, -197, 112, 207, -104, -11, 385, 2, -215, 2, 259, -372, -323, 276, 244, -360, -69, 226, -213, -415, 182, 214, -322, -189, 323, -29, -432, 48, 313, -393, -85, 289, 226, -221, 135, 166, -149, -466, -28, 251, -155, -141, 255, 57, -265, 41, 285, -164, 4, 173, 20, -264, 58, 241, -118, -61, 214, 17, -154, 79, 65, -164, -277, 76, 114, -219, -142, 355, 51, -211, -39, 327, -130]
2612a30q3M40j50n21M37K36k99j11K48J58l92J11L11k40j99K61J49m10l7N22k29
2633G2k62L74P7l68o6K01R8l93J92K10j59l67M61O7l98J98L30k49k00K84O9k09
2655c8j70N40l49j76J92J70j58k78L22m7j51O5K15j10l42M20J61m87J28K28o3
2676G2m20M39J81l84lM08o3l19N8K81k72k00M32j29k17R1L43l49l3R6K66n01J99
2699b4J63L6l02O1L75l72j27M28l6l60J47K84l16j80L76Ol52J71K35j33k67J45
2721d2K02l63j47O55j11m84L74J84l38j73L83j60k17J87K66q0m27L20J65k99j69
2742b74M59j45k46J40L51k95j60M64j66k30K67k1k20j35L60K30n19rL60j49l08
2763b46L59K21m61Q9J28j08k11K43K68k85q0J27J38l68o9N80j09m73K05J78k18
$$ y = [-130, -213, 227, 77, -444, -7, 229, -70, -181, 67, 225, -167, -56, 255, 15, -184, 77, 226, -184, -221, 301, 72, -190, 184, 261, -107, -173, 28, 126, -267, -75, 135, -24, -391, 70, 137, -261, -63, 267, 18, -182, 102, 171, -38, -208, 332, -17, -193, -1, 169, 11, -267, 55, 8, -143, -78, 137, 27, -315, 105, 266, -221, -93, 135, 72, -348, 91, 272, -112, -115, 293, 230, -89, -31, 250, -22, -222, 210, 81, -136, -45, 298, -51, -84, 12, 278, -223, -24, 139, 175, -127, -66, 309, -63, -190, 238, 202, -158, -11, 273, -43, -223, 153, 159, -193, -22, 213, 80, -187, -42, 160, -203, -350, 305, 194, -290, 84, 268, -70, -243, 140, -20, -237, -50, 216, 136, -291, 29, 194, -105, -274, 185, 40, -206, -66, 285, -10, -170, 294, 128, -102, 165, 144, -76, -211, 149, 379, -140, -149, 211, 62, -246, 113, 334, -127, -38, 90, -18, -229, 14, 282, -3, -83, 44, 182, -186, -255, 325, 216, -257, -52, 126, -92]
2784i2j05L98j87l21L62K49l94j65L90k2k41j3M68m16l11L24L35l83N5L02k19
2805A4j24p6M44l47O3K08j82l51L23J95k75k8L68j49l47J13L65j70k53J50R6j68
2827a31j7K65J30n49J78L35k96k6K92N5l11j50M80k12l61L92J11l35J12K60j35
2848H7n25M03M60m53j41L54j42j95p8M48l08j03K83K26m29J9K70j48j03M9J80
2869A54k80K6L38nm32QM40k21k23L64o3k00m5L87j56j77J77K33l81j05M52k70
2891B1r2J16L57m88j59L78Q0l96J77L62k61m53M07O9l22R0L45k02j87K09J61l12
2913a00q5K27K71m80J82K25k29j30l4K62l45O2M67j69l28J93J20r5j35L38j54
2934F3j68J19J53j54j75K79K7l88kN26k20k63K48K33m75J40J02J1l28O1L22l40
$$ y = [-92, -197, 201, 14, -307, 55, 304, -90, -255, 135, 113, -128, -141, 327, -89, -400, -76, 259, -124, -69, 233, 14, -110, -186, 258, -89, -26, 182, 0, -351, -28, 167, -108, -136, 232, 83, -264, -151, 214, 44, -209, -59, 37, -131, -148, 117, 247, -302, -124, 211, -85, -111, 181, 236, -75, -225, 255, 43, -318, 74, 185, -150, -38, 222, 87, -438, -35, 425, -28, -169, 185, 43, -152, -230, 218, -90, -193, 90, 316, -113, -94, 176, 28, -75, -26, 154, -126, -100, 238, 233, -199, -191, 249, 28, -195, 169, 106, -94, -139, 248, 92, -85, 92, 325, -56, -161, 291, 21, -71, 45, 402, -86, -245, 133, 213, -183, -6, 356, 95, -358, 49, 118, -204, -114, 231, 29, -158, 51, 212, -100, -185, 42, 313, -167, 15, 240, 11, -119, -153, 109, -236, -174, 293, 124, -204, -11, 109, 14, -121, 217, 63, -105, 14, 167, 13, -162, 117, 144, -244, -246, 280, 60, -203, 45, 278, -197, -57, 45, 56, -272, -211, 111, -229]
2956b29M6J97J60k01o3L16r7l94L78k4k73N8L71m6l61J35L01l70k17L40O6j67
2978g4m9L49r0k52L6J50j75j59N56k29l97L62J61k53j40K45K3k15J8K07j67r8
3000a91M29j99j17l0J82N2j34J14J06j57k31K16L0k02M2J70j10J6M3J17j50j45
3022a49L19n6k02J41K54l74O9J65K3k98O9K78k56j30L73k1m30O5M04k66k19K76
3044C5K24l90J31K36j59l12J28K57k89j90N51n1k30J1K16l49J13J72k6k43R9K41
3066A75Jj86J53j18k2j22R7Ok7RO6m6k05L68J9j48J9l2j13r8K59J27k71Q4O6M3
3092A04o0r2K41j91j04J73J10l92L42r8M4j86J29L8j17p5L87k53j68J81J85k04
3114fk31K67R8l71J67K52j31j61J85J11k12m4P5Q6j27R2j8M1j63K03j35j79J70
$$ y = [-229, -183, 14, 174, -27, -90, 226, 129, -265, 113, 89, -184, -126, 245, 199, -162, -27, 274, -96, -313, 27, 93, -74, -123, 226, 136, -116, -80, 70, -105, -264, 292, 63, -334, 28, 189, -64, -204, 41, 64, -151, -133, 74, -93, -191, 238, 39, -78, -108, 74, 126, -8, 106, 212, 55, -176, 40, 70, -132, -90, 80, -30, -14, 29, 146, -4, -149, 170, 114, -88, 53, 307, -67, 2, 167, 190, -108, -39, 239, -17, -147, 226, 205, -225, -160, 244, -22, -241, 35, 259, -131, 0, 236, 77, -235, -107, 150, -139, -329, 222, 171, -59, -48, 168, -181, -68, 104, 78, -165, -66, 175, 176, -10, 143, 25, 3, -119, -22, -16, -43, -34, 32, -14, -219, 149, 168, 20, 39, 7, -106, -204, 55, 182, -89, -5, 61, 104, 44, -48, 193, 2, -102, 71, 181, -211, 131, 33, 77, -109, 20, 58, -59, -134, 253, 0, -168, 13, 198, -6, -237, 30, 128, -243, -76, 176, 45, -116, 69, 180, -32, -76, -1, 85, -42, 50, 32, 73, -90, 113, -22, -201, -31]
3137c1J92k31p6L43q9j29pK20k0k35J14lj57K90j75J11k09J05J98j56mJ35j02
3160H4K8j93K08k52R8N4j18p5J23j1O1p4n2J94n9j07K31o3k43P7J07r6J06L0N3
3185A11r1j1l9m8q5J58J60k19n6J44M4k88J05K21K8j54Q3m7o6q6K93q8r3J09J6
3210A01j49Q6J21j21j78J57p9O4j69J66J68j46k7N9J1k20J10J24n9j00K73j74
3232A8n3j10J66kp9J22jp3J30o5k06J8K72j70l7J94j25O9Lr4J50j88J10o8J04
3257H5j5m4l8J4k00K99k08j9J01K10k15k11K67k2j94J2K07j4j9M7J2n8RM9Pk2
3283D0j88K52j24o7K63j41M3j85J85r4l6J3N6j13J10Q1N9k57J86J6j27J6R7m4
3307D1j21M7OJ30j18r9J15p8n8K11M5j14l8J65j56k38M01r7j97N8J42j4k13J70
$$ y = [-31, 161, -70, -146, 197, 108, -21, -28, 192, 172, -63, 51, 48, -109, 181, 6, 117, -92, 13, 211, 55, 51, 186, 84, 112, -81, 127, -125, -27, 27, -91, -166, -43, -54, 7, -67, -119, 75, 16, -91, 140, 77, -166, -89, 18, -78, 28, 58, 111, 20, 9, -30, -78, -163, -5, 155, -64, -120, 24, 68, -220, -115, 106, 134, -20, 63, 16, -50, -136, 157, 69, -24, 85, 101, -48, 38, 159, 38, -140, 17, -62, 2, -167, -1, 167, 21, -6, 53, 64, -156, -46, 78, 19, -81, 192, 18, -35, -145, 21, 19, -60, 62, 61, -12, 118, 53, -153, -135, 137, -33, -70, 124, -1, 68, 71, -23, 127, -61, 49, -19, 85, 70, 26, -12, 2, -198, 101, -107, -126, -25, 185, -30, -241, 26, 4, -190, -178, 29, 15, -4, 43, 55, -3, 6, 55, 62, 40, -148, 104, -20, -87, 176, 35, 78, -107, 78, -16, -52, -39, 17, -96, 14, 95, 154, -103, 83, 99, -28, -12, 85, 41, -80, -33, -27, 103, -15, -114, 1, -77, -135, 76, 121, 7, -31, 134, -22, -260, 141, 44, -153, -95, 47, 33, -180, -10]
3331a0J18Lj44K3Q3j11L0L4oPp6L12m17R6J95j29LJ08p3r8n1K44j73qP2j15j3
3358i6K5Q3J91k44M5k0l0o4K1Q0J8RN1k45K73j35N5k0M1nlko4J80j93Q9j8j69
3386a47K0J22n3K08k41J7M0K5O1qq4k6q4L81m01LL21m2j61J28k19P9j05J52J57
3411A43j44J33n5j27j35Q9K69rkj60l2r6J42m1J89k25N3j8j39L0Q8J6r7M3j9n
3437a09J07j8J91q0k5k0J05l7q2J64k23J52n6n7k9lN1K9j94O1J5Q2J03rL4l13
3463a61M24l62J4J7O2L8QJ7J17j99Q5n5N4K2k33J92j47K23r6K4j14R7k7J4J2J27
3489A53j7P9k82P9J5K1j3R8j06k44K38o2Q5P1m6Q0k34L4j4J24k43J39M9J15j34
3514a5L8q4J94k10J15N4k8J39l45R8R1k4r4m4P2N9Q3j88J2K19k14M6P7J1k33J34
$$ y = [-10, 108, 111, -33, -10, 73, -38, -8, 26, 20, 27, -49, 263, -154, -58, 137, 8, 11, 119, 46, -52, -103, 141, -32, -40, 32, -83, -96, -71, 12, 203, -41, 4, -16, -46, -110, -89, -9, 9, 18, 69, -176, 97, -38, 17, -3, 38, 33, 30, 28, -36, 144, -49, 40, 22, -147, -127, -5, -58, 150, -91, -74, -34, -9, 52, 44, -40, -66, -150, 231, -170, -167, 154, 112, -49, 79, -140, -61, -166, -14, 143, -1, 132, 77, -50, -185, -96, 173, 164, 162, 2, -30, -126, 16, -25, 164, -61, -8, -26, -165, -135, -47, -31, -128, -85, -104, -109, -2, -20, 171, 91, 66, 46, 151, 114, 32, 196, -27, 125, 69, 12, -17, -20, 31, 60, -134, -73, -58, 24, 127, 118, 152, -161, 263, -99, -85, -68, -6, 32, 40, 57, 174, -25, 60, 5, 59, 81, -152, 40, -107, 116, 20, 44, -70, 27, 0, 14, 26, 153, 136, 215, -67, 12, 27, 48, 35, 133, 27, -217, 21, -41, 44, 115, 69, 149, -85, -51, -65, 59, -184, -45, 4, 119, -15, 23, -61, 133, -77, 38, 92, 64, 203, -142, -44, 47, 23, -71, -115, -43, 16, 99, -89, -77, 142, -72, -26, 51, 62, -171, -37]
3540c7P1j7j03P1j2q9J46j02j16K18j19k0m4K19O9j29Kr1N8J26k91K30k18K61
3564H3o2r1j9p5OJ15K72j27j42K5J15m0k58K67k60K86r1L0Rm7P6j89K00k09J46
3589B0L1m5q1J63r9j24Q7j53K87j48J20K1m1j66J87p4J07j49M2O0J8j34J37m0
3613B6p1R3j04l4J17o4m5P7m4J22k01J44J68j74p4J30P3p9K3M8m3k31J20lPm8
3639f7K17j72J07n2j68J39M9L9k8L7j30o4j24J02J6K3J7J03K3o6K6P1j87Q8k08
3664b09Q8J35p5j4RlJ62K5k57K16j89J46J62m4j17Q1j87l1J82L3j41O9P9k08J71
3689H3p9J70l13m6R8l9N7J12J12j24P3j25J62q3%j62M3K9N6m6m9J35k4j27P7N4
3715D4o3J46k24K6l4J32j8K9m3m3K4N1k4J38N1m1j45K3rJ7l3J45j74j34Q2P2K6
$$ y = [-37, 34, 17, -86, -15, -27, -116, 30, -72, -188, 30, -89, -109, -153, 66, 135, 6, 8, -83, -25, 101, -190, 40, -178, 83, 21, -70, -89, -164, -158, -43, 229, 102, -40, -15, 100, 60, -198, 69, -191, 95, 4, 34, 43, -4, 72, -117, 83, -126, 20, 51, 6, -75, 88, -11, -135, -48, -201, 86, -62, 58, 79, 38, -128, 59, -15, 92, -57, -15, 45, 63, -71, 66, 26, -45, 48, -56, -90, 27, -37, -82, -5, -49, 73, -128, 16, 184, 10, -64, 66, 139, 60, 83, 131, 88, -143, -23, -26, -19, -67, 150, -22, 85, 33, -135, 4, 53, 92, 64, 101, -29, -93, -217, -115, -99, -76, -59, 44, 67, 1, 27, 98, -89, -1, -209, -121, 14, -61, -75, -66, -69, 93, 118, -139, 77, -112, 34, 196, 152, 35, 116, -71, -102, 80, 113, -28, 41, 120, -88, 83, 4, 174, -139, -185, -87, -126, -69, 43, 155, 31, 104, -21, 141, 58, 58, -104, -61, -32, 24, -22, -71, 64, 40, -87, -10, 44, -19, 127, -97, -71, -105, 27, 9, 38, -5, -48, -24, 27, 3, 141, 192, 151, 6, 29, 20, 37, 4, 149, -25, -159, -77, -5, 21]
3742B1j3j30L12k43j6J43l1o2j65K8P8Nj3J39j2j57N6J60o9m0N3J5r3j4N5j89
3768a82J07K11j60j25K38j31RM2J64q8n4m2NlQ7j56Q3mk0m0J42j0o2LJ7j76J91
3795D6Mo7L9K9j20J15N2o6k03Q5J12nl8qJ12j68J22j06O9q6P2J33k2j5j12J03
3821G7l00K56k21K55j39J71Qj02j1O8J38k42RR5j25Q0Kj01J38o0L4j2K1n8K08
3846A89j98j1J37r0j40K43j09n5J66k58J66j52K09k59L18l22K98j88M1L5j10R
3868h1M8L3j03p3J75l4P3L2j27J48o5j41J02O9r7J07J44j70j20J02j7L2r5k6J43
3893E9J28k14ll6J11n3K52l09OpJ33j62m2J05J67l80K63P9k80J69j40K64j67J61
3917A04j64L1L7p2K36j14k42J29Q0n5l6R6N1j13j27J46j19K21n8k2q6J04j56M4
$$ y = [21, 8, -122, 190, -53, -69, 74, 43, -19, -184, -156, -78, -73, -86, 53, 41, -116, -60, 100, 31, -9, 44, 59, -34, -48, 7, -182, -75, 136, -24, -149, 89, -42, -33, 9, 173, 85, 31, -11, -6, -9, 78, -78, 5, 1, -19, -59, 83, 73, 11, 14, 31, -145, 46, 50, -17, 22, 51, -69, 46, 98, 32, -171, -86, 26, 21, -17, -25, 87, -81, 41, -65, 4, -82, -10, 123, 101, 86, -26, 77, -223, 33, -188, 67, -72, 99, 107, 5, -6, 62, 200, -42, -33, 62, -63, 17, 19, -82, 56, -4, 30, 18, 39, -19, 189, -9, -20, 117, 27, -113, 130, 21, -34, 132, -126, 40, -112, 97, -162, 156, -166, 132, -56, -15, 20, -90, -81, -33, 0, -103, -176, -1, -35, 38, 70, -57, 91, 26, -115, -13, 56, -41, 66, 210, 40, -80, 22, 5, 37, -58, -84, 59, 187, -27, -30, -66, 45, -8, 244, -65, -59, -66, 67, -95, -137, -32, 135, -245, 18, 97, -183, -14, -154, 110, -57, 104, -60, -29, 8, -64, 172, 58, -184, -55, 25, -30, -66, 30, 81, -32, -159, -13, -132, 89, 31, 9, -77, 27, -129, -85]
3941h5Q4K25k21J31K1k67R2J07j03k7rO4N5N1j73J27qk17J39J5k4L4J53j19r2
3966d7J96o5p1N5J5L5L7j87J02oj50J0P6K02r4k17K30o9l8L4j69J48j05J37j55
3991i6M7J26n1j02J6k5n9Q1J98j68RM0P1j22m6k8O7PJ07j7j72K03o4r2j11Q3R8
4018@q0J29l2l9J43j37J23J5j32p8J31m1J09j85K42j35Q0j09J3j13R1O4j17J2
4042d6J66n5j10j8J03Q4j61J00m7n5O3J32l18J54J72j67n6KJ75j21P6j10J9K4
4066FpQ7q9R6j91K09k72N2M6J87j01n4K14k02q4PJ28mp5P6q5p4K08k27J27j38
4092a60L22p1j33j04K28j13J81j92O4j37O6Q0j34j6K28j86R9m5q8J98j84K2J58
4115H3j32o2jJ16p2m6K12k22Q4LJ51j36j41K49J7k29J90O6q9j90J60M4l6J65l62
$$ y = [-85, -1, 224, 3, 134, 155, -112, -20, 87, -16, -43, -52, 12, 67, 118, -55, 72, 64, -153, -14, 1, -23, 11, 164, 45, -47, 149, 84, 13, 68, 83, 118, 155, -32, 70, 64, -86, -76, 0, 202, 108, -109, 121, 52, 14, 48, -121, 27, -78, 59, -96, -49, 77, 26, -76, -60, -85, -144, -63, 135, -33, -24, 16, 87, -35, -81, -109, -42, -35, 72, 55, -117, 86, 22, -70, -181, -98, 0, -80, 49, 17, -22, 121, -16, 107, 122, -10, -88, 43, 2, 111, -74, 168, 33, 113, 4, 17, -96, -5, 59, -58, -46, 120, 65, -45, -63, 40, 124, -37, 63, 16, -39, 24, 156, -162, -8, 164, -3, -59, -57, 118, -3, 73, -37, -18, 6, -1, 86, -3, 93, -98, 111, -161, -109, -63, 124, 23, -31, 183, -19, -103, -96, 32, 28, -47, 29, -56, -130, 78, -149, -22, -160, 162, 91, -42, -146, 82, -31, 150, -42, 22, -115, -49, 31, -103, -119, 109, -77, 22, -23, -111, 87, -97, -75, 83, -49, -111, -112, 4, -68, -114, 98, -124, -40, -37, 114, -22, -163, 86, 103, -126, 64, 130, 41, -149, 11, 55, 19, 184, -178]
4140a78K09j63K00j77J21l8m8J72m8qk9j71R5J07l9k15K42m8p0N9RR5j74J27k0
4165A0k3m9Q6j19R8j91J17M7K3l9J21j83m7L53j19j44Q4J24j93L8qM7r4M0J0K01
4191A90k12m5R6%r6O1p8J8Q6MP7j02O9K2j30j07N8J18j93J82N8q9J0J5j16o0K45
4218H1K4n7j19J18Pj30J42q2L2p6K15k18P3qlk3n9kN9L3j06K48j28j9j17K22j70
4245f3kQ3M5k08J72j09J43K1l5R8l01K66l0j71q5J2J33m7K6J33M8j45Prj13M9
4271h2P9j48J20O1q3J23k2j20R6Q9o7q9J13j97L8J69j83K8O9M1J97l40P8Mj36
4296a62P2J59L0q0L0Qj62k3K04n5j22J56O9j32Q2%q7M0j08N6J40l1l8j07J4J1
4322c6M3K00l41K14n7L2Q2q3K1k49M5jJ49k28K68K5j06J44p1j06O5m8M5k1p0K6
$$ y = [-178, 31, -132, 68, -109, 12, -26, -74, 98, 50, 42, 13, -158, -63, 44, 5, -210, 32, -16, -86, -27, -18, 77, -97, 30, 10, -13, -62, 24, -95, 3, -188, -71, -24, -1, -40, 81, -102, -149, 204, 85, -59, 25, 149, -44, -6, -14, 33, -61, -21, -11, 190, -22, -67, 29, 29, -67, -6, -84, -66, 20, 24, 101, -1, 68, 90, -40, -147, -89, 29, -164, 18, 76, -13, -3, 12, -104, -164, 81, 105, 48, -71, 47, 54, -76, 66, -16, 16, -60, 155, -63, 10, 2, -1, -24, -83, -85, -26, 7, -99, 149, 21, 2, -115, 107, -63, -65, 18, 63, -145, 27, -82, 61, 82, 47, 145, -156, 110, 80, -91, -176, -164, -31, -78, -52, 81, 129, -16, -9, -18, -131, -82, -3, -151, -31, 30, -53, 70, 48, -72, 24, 113, 46, -43, 70, -127, -89, 80, -103, -75, -6, 35, 232, -108, -30, -26, -162, -90, 69, 99, 19, 49, 57, -105, -128, 76, 21, -101, 55, 124, -8, 74, 74, -13, 27, -81, -25, 115, 84, 46, -61, -47, -36, 7, 207, -134, 80, 23, 55, 137, 54, 75, -174, -129, -130, 19, -209, 59, 84, -22, 122, 51, -55, 10, -38, 7, -14, -84, -58]
4348e8Jr9J95k9L3q6O5m4j02J21J14j68O0MJ34k17pP8r8k0k0K09n0L6l6O8j00
4375a6rJ06o4j34J32j8j39O5J69Kj47ql7J66r7M6n3J92j51m6Q1q5K38j98N6R6
4401A47j04j25m1R4k8M4R8J1r2j0n2P5j20J60j63J68k18K36J39k99q2J35J04k01
4425a24J72j75J85j66K37kp2m1J23j26m1K9mp5J4J62k19K4O7J50j50j08R0J35
4449H5Q2m25K31O0M8k07K60j52J31j47Q4r7J08J09j92N6J52k47N1j82L09j54J34
4472I7j10q5j62R5K19mm0pm4L5o7J32j27K02k01J03j71oJ26J4Q7l4M0j83P8J4
4498AP0j9q2J58qj75J75k9p3k7j00K29k10J04l8q8K9k6J11K4j84J48L6o3j49K28
4524D2k23J76Q1m6J37k01o1J31K9J38k95J6J09M2M2Jj25k3j33j8K54L0k86P7J63
$$ y = [-58, -57, -156, 39, 10, 43, -43, 22, -22, -124, -3, 111, -57, 3, 7, 141, -76, -83, -5, -103, -123, -143, 66, 16, 52, 16, 84, -16, -25, 81, 17, -117, 15, -3, -142, -77, 92, 94, -53, -61, -98, 68, -29, 17, -36, 156, 5, -41, 40, -45, 193, -5, 51, 147, 43, -82, -123, -29, -57, -13, 85, 96, 4, -6, -58, 17, -103, 57, -106, 62, -156, 80, 219, -80, -162, -27, 77, -124, 48, -127, 58, -108, 129, 127, 55, 14, 137, 11, -30, -1, -5, -80, -66, 96, -123, -99, -32, 118, -32, -140, -50, 85, 167, -258, -27, 33, 81, -126, 134, -18, 113, -34, 50, -47, 61, 170, -22, 34, 186, -61, -10, -192, 117, -37, 97, -13, -98, -260, -165, 54, 50, 10, 3, -41, -6, -73, 59, -68, 134, -67, 36, -135, -141, -15, -1, 86, 52, 92, -91, -13, 1, 71, 52, -30, 128, 120, -55, 120, 91, 18, -9, -109, 120, -90, 14, -24, -112, -83, -109, 2, 26, -158, -10, 26, -37, -186, 42, -181, -5, 76, 30, 167, -34, -95, 36, 65, 203, -92, -76, 33, 75, 117, 118, -7, -30, -163, -181, 73, 103, -183, -106, 57]
4549E7j00M8k8k5k7j0o3J29k3N1l4J08j69M5N6J50o3q3n7k16L83m5j40j5n8K87
4575A58j85l8J3o5L3L6m3o9R0J49j18m6j3Q6R1j15O4j0m6J5J48j91J71O8k40j5
4601g2l4K03r8j30R1m3L8K10r1pK8j15J07j5k29K61k11J27R8k58J96k35K36j62
4625a05ML0J91j49j92J54K8Q2j85o7L78j95n0jj18J56J03j37q2J98k8qj53N9L7
4650e0N9m9J01m0k0p4Q7Po8J33r2j3l3K18k50J49P7j23j81j6M7P1Q2o5j3J29q5
4677a2N1k8k18J47N2j3qj43M07k89o6P2J25j54J60jp5q1L5J4n6J34M8O0k23J18
4703E6l3k1k1L7j78L19k60l2J78n6R4k13K30n0l0o2j9J95j84J26j2m8n7lJ08J
4729F5p5J49j01l1j29J26k8j55K89j20J63j61r3J96n3K6p9Q6j82j3J54j12J01
$$ y = [57, -43, 5, -23, -48, -75, -85, -148, -19, -42, 9, -25, 83, -86, -41, 15, 165, 102, 19, -38, -254, 129, 84, -56, -71, -129, 158, -27, -65, -52, -117, -84, -48, -91, -160, -70, 79, -39, -85, -98, -12, 79, -36, 28, 18, -28, -13, 135, -56, 115, 183, -57, -72, -106, 97, -1, -131, -40, -83, -45, 165, 74, 67, 95, -20, 87, 72, -157, 104, -107, 20, 118, -140, 56, -179, 57, -105, -101, -71, 120, -29, -221, -67, -39, 43, -142, -209, 169, -26, -76, -77, -195, -39, 64, -73, -155, 43, 15, 7, -146, -87, -50, 9, -40, 61, 21, 1, -73, 14, 21, -47, 86, -6, -19, -52, 166, -84, 65, 142, 19, -162, -178, -131, -60, 22, -43, -56, 73, -12, 39, 11, -207, -60, -8, -21, -29, -172, 235, -54, -120, -48, 77, -77, 83, 82, 7, -74, -39, -25, -81, 53, 101, 161, -62, 56, 23, 2, -19, 18, -160, 159, -101, -133, 45, -11, 83, -130, 100, 50, 20, -42, -61, 134, -50, 76, 64, 16, -41, -44, 64, 65, -10, 139, 38, 7, -122, 4, -24, -179, 110, -10, 153, -8, -101, 95, 42, 68, -11, 75, -107, -120, 34, -78, 23]
4752B3J03j87K20k88J63K7j07J26N2k26R5J29j37M0j38PO2j13L01k86J01J33l7
4775F3K5l6j69J8J71j93J07Q5k56L16j90K09o5K0K2q5O1n4J04j42J71j1j36l2
4799CqJ45j48p7J32k34R0KLj8K88k24J5J0K0j97J70QL9kj22P5k7k1J48m7L6k2
4827C7N9q3o4P2Q6j65J35l0p5J59l17J27Oj9J00o4J6J2r7K25j9j3n7j5l9qo1J26
4855C4o2J6R0r2M5K1J0k4M0J08k45p4P9Q6j2l3J59k07L3L2j1j8Nj6P4pj1L9l5
4884B4j57K38j57r3L03k98K50J1j30J70j56n8J06O5P9j33k1q0o5P8J02j03J78
4907A53k48J99j22M4N6k44J76L3j13L8J18l8p8Q6J79l28l6J58q5m9pJ99j41j7
4931f7J84o7j7j86K44o1j13J17p3J18q6j2N0O1j08o0R3k1J43j92L8M5j47PJ12
$$ y = [23, 126, -61, 159, -129, 34, 61, -46, 80, 132, -94, 1, 130, -7, 33, -105, -98, -36, -149, 152, -134, -33, 100, 63, 88, 52, -117, -99, 72, -121, -14, 71, -185, 131, -59, 150, 85, 105, 127, 42, 103, 49, 153, 11, 182, 171, 35, 3, -5, 140, -8, -85, 47, -187, -97, -95, -92, -110, 178, -46, -31, -21, -1, -198, -28, -20, 19, 17, -105, -30, -57, -78, 70, 23, 59, 37, 96, 13, -51, 21, 107, -58, 77, 47, -28, 131, -186, -59, -53, -72, 28, -36, -20, -8, -105, 120, 101, 88, 31, 16, -23, -31, -92, 34, -28, -12, 78, -14, 31, 52, 62, 38, 78, 186, -59, -133, -54, 32, 20, -13, 146, -61, -28, 4, -7, -25, -20, -36, 38, 31, 20, 59, 24, -133, 105, -52, -145, 158, -140, 110, 121, -9, 161, 5, -53, 53, 118, 197, 64, 43, -37, -102, -24, 78, -25, 153, -95, 104, -18, 26, 82, -162, 14, 47, -66, -28, 90, 52, -26, 60, 239, -89, -125, 33, -52, -101, -108, 91, -50, -67, 117, 50, 33, -153, 91, 30, -83, 34, -39, 79, -7, -19, 31, 92, -16, -76, 17, -4, 139, -53, -15, 30, -117, -110, 2]
4956BK30l03O5pj36J47p1Q8j2l6p5J17o7J0l9M6J04JJ6n7J98j56o2J7m4J15j30
4983c9L2L6mj2j44R1o3K3J79j20n3K39J06j54j10K0R5j03J47k71q1K92j00J00
5007A06j43j37K81%p0Qo7P0j00L7J63j44O8J2j01n9M3N3p8M7J28q6q4K04Lk02
5033d8J31j46Q4R5qm24K15K55j57nk6N9k65L77k27J38p8P0P9j63m7J09N7o8J8
5058B5j90J42J28r7j63J15J13J9j29Q0n6K7q9J08L6k17O3nN1Q4m0%R9k15J20r9
5084i0r3K68K2j37J8JL2m0o1J40Q1j17K6p6j2O0l2J04r6K6r0n4J17j6K6j1k29
5111b33M33k76J20k7j66J92o2Q8q9M3j60K36p8L4J02p6n5o5OJ3J8l5M0j5j59J06
5137f5M9J22K4m2j03r2K8O1N4j08J26n2o0k2O6L4n6Ok20J29J08j16K15pn3J1j80
$$ y = [2, 232, -71, -6, -13, -149, -2, -73, 15, 3, -33, -108, 9, -58, -48, -87, -41, 63, 64, 80, 23, 221, 65, 3, 20, -24, 91, -39, -7, 29, 25, 13, -131, -40, -103, -80, 99, -21, -74, 165, 271, 117, 7, 27, 122, 19, 166, -105, -186, 106, 6, 106, -37, -174, 107, 107, 37, 45, -22, 48, -52, -15, 148, 4, 72, 84, -17, -76, -33, 20, -58, -11, 117, 31, -53, 151, 154, -48, 83, -63, 21, 116, 108, -316, -101, 154, -3, -8, -34, 25, -240, 137, -90, 48, -30, 40, 119, -44, -91, 18, 75, 7, 25, -165, -23, 105, 8, -155, -40, 73, 92, -37, 43, -13, 14, -75, 33, 69, -148, -85, -90, -39, 45, 5, 5, 104, -111, 9, -90, -183, 85, 107, -30, -12, -11, 21, -19, -80, 60, 141, 24, 50, -26, -38, 22, -10, 94, -2, 24, -66, -120, -3, -19, 7, -4, -233, 200, -76, 44, 17, -149, 43, -19, 69, -20, 23, -137, 99, 21, 55, 157, 81, 26, -39, -33, -20, -2, -37, 3, -12, -171, -65, -16, 106, 130, 88, -15, -107, -79, -18, 36, -72, 54, 2, -58, -80, -14, 20, -36, -30, -250, -121, -13, -129, 86, 79, 26, 37, -143]
5164a43J86p6J15j10K1m9N8oJ04j10j23J50M7j56L3P3J0Kl6j1O1q4n5J54j13J8
5190d0J37j61J32q3J67j47P1r6M0j74J47M4k3J15k61P5J13o0N3L9j11n6J47J32
5214B00j72Q6j42N4O5p0nO1n5J02r2N9o3j77K13m4o8J40j68P9P9JPj26m4PJ63
5241I0j05O2j67O7QOL2%J00r8N3j45M5qJ41j44P4L0j2j79K23j3o1J02o3m3jLn5
$$ y = [-143, 43, -33, 82, -28, -7, -56, 2, -4, 100, -10, -133, 17, 64, -92, -59, 14, 24, 26, -10, -21, 40, -44, -99, 55, -58, -40, 97, -64, 68, -15, 152, 5, 76, -20, 20, -154, -7, 37, 14, 129, -132, -57, 56, -4, 49, 88, -23, -79, 68, 200, 28, 114, -28, 26, 91, 21, 16, 77, 22, 124, 32, 91, 28, -149, 64, 20, -48, 92, -76, 3, 82, 83, 90, -36, -80, -73, 90, -15, 47, -120, -53, -45, -39, -7, -7, 93, -5, 48, -97, -52, -60, 81, -63, 11, 41, 29, -150, 73, 60, -1, 101, 38, -5, -6, -3, -58]
$$ [...]
8191i7
##END NTUPLES=NMR FID
##END=
