##TITLE=1H_AA-1502
 CDCl3
 8sc, 
 16.2.2024
##JCAMPDX= 6.0         $$ Bruker NMR JCAMP-DX V2.0
##DATA TYPE= NMR FID
##DATA CLASS= NTUPLES
##ORIGIN= UXNMR, Bruker Analytische Messtechnik GmbH
##OWNER= root
$$ XWIN-NMR		Version 3.5
$$ Fri Feb 16 14:03:20 2024 Russian Standard Time (UT+4h)  she@DPX200
##.OBSERVE FREQUENCY= 200.1313
##.OBSERVE NUCLEUS= ^1H
##.DELAY= (6, 6)
##.ACQUISITION MODE= SIMULTANEOUS
##.ACQUISITION SCHEME= undefined
##.AVERAGES= 11
##.DIGITISER RES= 18
##SPECTROMETER/DATA SYSTEM= spect
##.PULSE SEQUENCE= zg30
##.SOLVENT NAME= DMSO
##.SHIFT REFERENCE= (INTERNAL, DMSO, 0, 15.7039)
##AUDIT TRAIL= $$ (NUMBER, WHEN, WHO, WHERE, WHAT)
$$ ##TITLE= Audit trail, XWIN-NMR		Version 3.5
$$ ##JCAMPDX= 5.01
$$ ##ORIGIN= Bruker BioSpin GmbH
$$ ##OWNER= she
$$ F:/spectra/data/she/nmr/H-F/1/audita.txt
$$ ##AUDIT TRAIL=  $$ (NUMBER, WHEN, WHO, WHERE, WHAT)
(   1,<2024-02-16 14:01:56.20 +0400>,<she>,<DPX200>,
      <created by zg, POWCHK disabled, PULCHK disabled
       terminated by command 'halt'
       configuration hash MD5:
       00 E9 B6 7A A2 85 ED C7 34 08 36 98 17 FE 4E 26
       data hash MD5: 16K
       04 61 BC 35 BF BF E3 04 A0 E6 EA 69 F1 BC 7C 87>)
$$ ##END=
$$ 
$$ hash MD5
$$ 67 7F 1D A5 D3 36 10 AD 10 5E 1A 6D B1 6F 18 84
##$RELAX= 
##$RELAX= 
##$RELAX= 
##$RELAX= 
##$RELAX= 
##$RELAX= 
$$ Bruker specific parameters
$$ --------------------------
##$DU= <F:/spectra>
##$EXPNO= 1
##$NAME= <H-F>
##$PROCNO= 1
##$TYPE= <nmr>
##$USER= <she>
##$AMP= (0..31)
100 100 100 100 100 100 100 100 100 100 100 100 100 100 100 100 100 100 
100 100 100 100 100 100 100 100 100 100 100 100 100 100 
##$AQSEQ= 0
##$AQ_mod= 1
##$AUNM= <au_zg>
##$AUTOPOS= <>
##$BF1= 200.13
##$BF2= 200.13
##$BF3= 200.13
##$BF4= 200.13
##$BF5= 200.13
##$BF6= 200.13
##$BF7= 200.13
##$BF8= 200.13
##$BYTORDA= 1
##$CFDGTYP= 0
##$CFRGTYP= 5
##$CHEMSTR= <none>
##$CNST= (0..31)
1 1 145 1 1 1 1 1 1 1 1 1 1 1 1 1 1 1 1 1 1 1 1 1 1 1 1 1 1 1 1 1 
##$CPDPRG= <>
##$CPDPRG1= <>
##$CPDPRG2= <>
##$CPDPRG3= <>
##$CPDPRG4= <mlev>
##$CPDPRG5= <mlev>
##$CPDPRG6= <mlev>
##$CPDPRG7= <mlev>
##$CPDPRG8= <mlev>
##$CPDPRGB= <>
##$CPDPRGT= <>
##$D= (0..31)
0 1.2 0 0 0 0 0 0 0 0.06 0 0.03 0 0 0 0 0.0002 0 0 0 0 0 0 0 0 0 0 0 0 
0 0 0 
##$DATE= 1708077715
##$DBL= (0..7)
120 120 120 120 120 120 120 120 
##$DBP= (0..7)
150 150 150 150 150 150 150 150 
##$DBP07= 0
##$DBPNAM0= <>
##$DBPNAM1= <>
##$DBPNAM2= <>
##$DBPNAM3= <>
##$DBPNAM4= <>
##$DBPNAM5= <>
##$DBPNAM6= <>
##$DBPNAM7= <>
##$DBPOAL= (0..7)
0.5 0.5 0.5 0.5 0.5 0.5 0.5 0.5 
##$DBPOFFS= (0..7)
0 0 0 0 0 0 0 0 
##$DE= 6
##$DECBNUC= <off>
##$DECIM= 32
##$DECNUC= <off>
##$DECSTAT= 4
##$DIGMOD= 1
##$DIGTYP= 9
##$DL= (0..7)
0 120 120 120 120 120 120 120 
##$DP= (0..7)
150 150 150 150 150 150 150 150 
##$DP07= 0
##$DPNAME0= <>
##$DPNAME1= <>
##$DPNAME2= <>
##$DPNAME3= <>
##$DPNAME4= <>
##$DPNAME5= <>
##$DPNAME6= <>
##$DPNAME7= <>
##$DPOAL= (0..7)
0.5 0.5 0.5 0.5 0.5 0.5 0.5 0.5 
##$DPOFFS= (0..7)
0 0 0 0 0 0 0 0 
##$DQDMODE= 0
##$DR= 18
##$DS= 0
$$ [...]
##$SUBNAM2= <"">
##$SUBNAM3= <"">
##$SUBNAM4= <"">
##$SUBNAM5= <"">
##$SUBNAM6= <"">
##$SUBNAM7= <"">
##$SUBNAM8= <"">
##$SUBNAM9= <"">
##$SW= 18.0517328524113
##$SWIBOX= (0..15)
0 0 2 0 0 0 0 0 0 0 0 0 0 0 0 0 
##$SW_h= 3612.71676300578
##$TD= 16384
##$TD0= 1
##$TE= 0
##$TE2= 300
##$TE3= 300
##$TEG= 300
##$TL= (0..7)
0 120 120 120 120 120 120 120 
##$TP= (0..7)
150 150 150 150 150 150 150 150 
##$TP07= 0
##$TPNAME0= <>
##$TPNAME1= <>
##$TPNAME2= <>
##$TPNAME3= <>
##$TPNAME4= <>
##$TPNAME5= <>
##$TPNAME6= <>
##$TPNAME7= <>
##$TPOAL= (0..7)
0.5 0.5 0.5 0.5 0.5 0.5 0.5 0.5 
##$TPOFFS= (0..7)
0 0 0 0 0 0 0 0 
##$TUNHIN= 0
##$TUNHOUT= 0
##$TUNXOUT= 0
##$USERA1= <user>
##$USERA2= <user>
##$USERA3= <user>
##$USERA4= <user>
##$USERA5= <user>
##$V9= 5
##$VALIST= <valist>
##$VCLIST= <CCCCCCCCCCCCCCC>
##$VD= 0
##$VDLIST= <DDDDDDDDDDDDDDD>
##$VPLIST= <PPPPPPPPPPPPPPP>
##$VTLIST= <TTTTTTTTTTTTTTT>
##$WBST= 1024
##$WBSW= 4
##$XGAIN= (0..3)
0 0 0 0 
##$XL= 0
##$YL= 0
##$YMAX_a= 48229
##$YMIN_a= -45178
##$ZGOPTNS= <>
##$ZL1= 120
##$ZL2= 120
##$ZL3= 120
##$ZL4= 120
##$ABSF1= 10
##$ABSF2= 0
##$ABSG= 5
##$ABSL= 3
##$ALPHA= 0
##$AQORDER= 0
##$ASSFAC= 0
##$ASSFACI= 0
##$ASSFACX= 0
##$ASSWID= 0
##$AUNMP= <proc_1d>
##$AZFE= 0.1
##$AZFW= 0.1
##$BCFW= 1
##$BC_mod= 2
##$BYTORDP= 1
##$COROFFS= 0
##$CY= 11.3945322036743
##$DATMOD= 1
##$DC= 2
##$DFILT= <>
##$DTYPP= 0
##$F1P= 15.7292609196834
##$F2P= 12.9074282941183
##$FCOR= 0.5
##$FTSIZE= 0
##$FT_mod= 4
##$GAMMA= 1
##$GB= 0.15
##$INTBC= 1
##$INTSCL= 1
##$ISEN= 128
##$LB= 0.24
##$LEV0= 0
##$LPBIN= 0
##$MAXI= 10000
##$MC2= 0
##$MEAN= 0
##$ME_mod= 0
##$MI= 1.114404
##$NCOEF= 0
##$NC_proc= 0
##$NLEV= 6
##$NOISF1= 3.799351
##$NOISF2= 2.8
##$NSP= 1
##$NTH_PI= 0
##$NZP= 0
##$OFFSET= 15.70392
##$PC= 1
##$PHC0= -25038.62
##$PHC1= 11.25264
##$PH_mod= 1
##$PKNL= yes
##$PPARMOD= 0
##$PSCAL= 0
##$PSIGN= 0
##$REVERSE= no
##$SF= 200.130013532006
##$SI= 16384
##$SIGF1= 3
##$SIGF2= 2
##$SINO= 400
##$SIOLD= 16384
##$SREGLST= <1H.CDCl3>
##$SSB= 0
##$STSI= 0
##$STSR= 0
##$SW_p= 3612.71676300578
##$SYMM= 0
##$S_DEV= 0
##$TDeff= 0
##$TDoff= 0
##$TI= <>
##$TILT= no
##$TM1= 0
##$TM2= 0
##$TOPLEV= 0
##$USERP1= <user>
##$USERP2= <user>
##$USERP3= <user>
##$USERP4= <user>
##$USERP5= <user>
##$WDW= 1
##$XDIM= 8192
##$YMAX_p= 0
##$YMIN_p= 0
$$ End of Bruker specific parameters
$$ ---------------------------------
##NTUPLES= NMR FID
##VAR_NAME=  TIME,          FID/REAL,        FID/IMAG
##SYMBOL=    X,             R,               I
##VAR_TYPE=  INDEPENDENT,   DEPENDENT,       DEPENDENT
##VAR_FORM=  AFFN,          ASDF,            ASDF
##VAR_DIM=   8192,          8192,            8192
##UNITS=     SECONDS,       ARBITRARY UNITS, ARBITRARY UNITS
##FACTOR=    0.0002768,     1,               1
##FIRST=     0,             0,               0
##LAST=      2.2672688,     0,               0
##MIN=       0,             -45178,          0
##MAX=       2.2672688,     48229,           0
$$ Real data points
##PAGE= N=1
##DATA TABLE= (X++(R..R)), XYDATA
0@%%%%%%%%%%%%%%%%%%%kJ3k2K2k2K2k2L3m4M4m6N7o6P6q7R8j10J22j38J51j68
40h9J89k11K34k60K90l20L53l91M31m74N20n74O33o98P72q54R46j050J173j317
60f97J487j695J951k279K716l333M272n893R445l0602J9833M1744o4144J0991
74a6204O0739k3275m9328M4333J5282n9300j717N0624k8863l0933N2591J8564
86C2513n4367J4419N3149l7020m6189M5768J6062n7512N336N6262k2828l5171
98b9578M4408K0438m7841J465L7258k9994l1279M1011J0489m5250J5757M8541
110C5425k7936k9756M3150Q753n3895M043M2320k6637l1764L9710J7699l6011
122a4899J0719L6849k6336k5459L3414J697m3417J1300L5025k7472j9362M4481
$$ y = [0, 0, 0, 0, 0, 0, 0, 0, 0, 0, 0, 0, 0, 0, 0, 0, 0, 0, 0, 0, -2, 11, -11, 11, -11, 11, -11, 22, -22, 22, -24, 33, -33, 43, -44, 54, -56, 66, -72, 79, -89, 100, -111, 123, -137, 153, -167, 186, -205, 226, -248, 272, -302, 331, -367, 405, -449, 497, -553, 620, -697, 790, -905, 1046, -1233, 1483, -1850, 2422, -3471, 5974, -24628, -4795, 36949, -27195, -16204, 44535, 21260, -28068, 16265, 31547, -27753, -29470, 21154, -7709, -38642, 13949, 32513, -21854, -7435, 45714, 8694, -37495, 8273, 24335, -33177, -27841, 28421, 5593, -29578, 14830, 35268, -12573, -11108, 26150, -3844, -35123, 5888, 16377, -28873, -13116, 35425, 7489, -22267, 20883, 29636, -24259, -20216, 22104, -4533, -36297, 3413, 21112, -14899, -4180, 32669, 6333, -19126, 14288, 15985, -27432, -16132, 18893, -8579, -27941, 16540]
134A6540R683m1971J0083L5918k7282k8008L0186O109l5017J0931L2645k0085
146b68j5509L2992K056l4484J2132K4659l0988j8444L6441M909l4474J3894L3273
159B6189k2191j9470K9538K534l4654O831K4255k0331j2394K9645J960k6091J6417
172B238K3637k7785j5841K9871j890l3643J3012K7649k1563j4269L1311N862k8427
185i838O809K0255k0330j3369K2736j368k3419J4598K1257j9868q537K6914k552
198A3288k8694J0939K0874k2322j4549K5659N227k1967Q389J9676j4872j1057
210i409J8337j071k1023Q225J4412j6577n365K3264j337k1214J1506J7918j8829
223a163j2607J9777J229k0951P250J7548j2127q361J7152J243j5836O734J0211
$$ y = [16540, 26223, -15748, -5665, 30253, 2971, -25037, 5149, 11258, -23759, -12828, 19817, -268, -15777, 17215, 19271, -15213, -3081, 21578, -9410, -27854, 8587, 13496, -20978, -7084, 26189, 3998, -15472, 14066, 16600, -18054, -11223, 13032, -7299, -19693, 9952, 11912, -14179, 2238, 25875, -1910, -17751, 12120, 10230, -23413, -10401, 17248, -4315, -18584, 12727, 18589, -9838, -3029, 17226, -3104, -16473, 6263, 4895, -18524, -3926, 17331, -2537, -11074, 15840, 13288, -15406, -4467, 16407, -5915, -20464, 5195, 10422, -11545, -3156, 16520, 1648, -9409, 8928, 7857, -13166, -4941, 9471, -7106, -12471, 10793, 9456, -11758, -252, 17666, -1163, -13770, 6007, 7236, -13715, -6465, 11083, -1044, -9405, 7747, 8990, -6846, -112, 10099]
236A0099j5646n627J8183k503j7387J1207J5135j5016p277J8186o61j9029N714
249d622J3665j1756p618J4380R35j1920P937R397j2755m202J3968l664j4612Q999
263a868J0727j3693m518J7266k28j5312O064J1197j0706o516J1370q12j1234O813
277a450Q629r976k246J2550l564j1769Q828Q060j3682m473J4805p02j3308O368
291a930J0524r549n101J1032n55j0436M696O582q355j673J0286l310r417Q457
305A251P092j1641l286J2207j780j1394N798Q907q418m813R722P75q466L199N140
320D293o601j391P662k780o955O535N115q645j408R849k498r528N380P112p573
335a433m192P859Q94o554K657M592m794j469N564j998m887M687K545o781J70P593
$$ y = [10099, -5547, -11174, 7009, 4506, -12881, -1674, 13461, -1555, -8832, 9354, 8693, -10336, -4622, 9043, -2713, -10331, 4049, 4984, -6936, 1001, 10398, -2357, -6559, 7409, 3745, -10867, -1868, 8859, -4834, -9352, 7914, 7686, -7626, -1562, 9635, -1071, -7587, 3783, 2971, -8263, -1450, 7179, -2797, -5043, 7507, 3943, -7826, 1002, 9062, -4620, -9093, 5712, 5010, -8298, -1930, 8594, -955, -6056, 4976, 4421, -6015, -1319, 5263, -3092, -4765, 5521, 2211, -7206, 1251, 8343, -3298, -6584, 5623, 3843, -7551, -1753, 7154, -1264, -6077, 3645, 4420, -4046, -847, 4293, -2308, -3699, 3963, 1183, -5772, 763, 5878, -2767, -4175, 5674, 3176, -6352, -972, 6140, -1433, -5625, 2234, 3128, -3426, -769, 3823, -971, -2440, 3124, 1126, -3761, 926, 3471, -3310, -3140, 4453]
351D453k671o975M908N366o120k796O297m1n373K126L525l302j325L370j079k586
367b223L314J161m693P43N139k386m402L660L000m456j521M428n5l945J157K713
383A634j634q86J635o38j013J870J89k551N89K581j662k297K454J656k847q62
399a782K814M96k207k35J505J05q89j35J64J80J90n24k68R09L25r48k87J012O34
418A059r26j050P22J259p39j622O65J867r53j951J613J898j997j383K178P85j968
435e43k36J321n49n80J116n76j200J891P82k796L27L387j558l535K736L012l841
452h42k089M299N71m029J138L087k292j425K916l34k748K165J695l822p8M644
468B856k052m586L970L484n240j637N817m03n352K513M050m054j916M510p83l991
$$ y = [4453, 1782, -5193, -285, 5081, -1039, -3835, 2462, 2421, -2952, -826, 2699, -603, -1928, 1442, 363, -2223, 1091, 2252, -2441, -1698, 3441, 1055, -3347, 313, 3313, -1143, -2664, 1764, 1709, -2236, -1079, 1634, 0, -886, 749, 111, -902, 968, 1157, -1394, -805, 1776, 114, -2183, 271, 1927, -920, -1782, 1032, 1528, -679, -914, 591, 696, -193, -328, -164, 16, 206, -318, -586, 323, 648, -300, -587, 425, 1059, 133, -917, -195, 1064, 325, -1297, -632, 1235, 282, -1669, -56, 1842, -155, -1538, 640, 1425, -543, -779, 542, -7, -587, 529, -47, -1247, 644, 1426, -1370, -1043, 2344, 786, -2749, -13, 2999, -842, -2931, 1368, 1939, -2090, -952, 2135, -157, -1582, 1334, 1000, -1748, 417, 2112, -1710, -1788, 2856, 804, -3782, 188, 3672, -1568, -3205, 2612, 2209, -3143, -630, 3420, -634, -2550, 1960, 1177, -2814]
484b814L041K294m696L0N507k351m867M820L321o496r55O785k030o135M191M115
500C760n592j162O169j585n015M507K792o457L5O551l555n558O226L301p712L5
516c260Q211l179o899N933L999p842n82P775l146o020O369L340p906M64Q039m567
532G29o732P487L468r336M90R558l965p403P334M272r212n43Q768m129p174P386
548I98L831q865J065R395m850p332Q156L534j0756O7J0217m759q128Q691N114
563F378r748K6R939m492q196P417L614j0163O85J0050m999p090R502M000j0900
578c977O95J0310n919q965Q694M585j0620N31J0961m314p631Q346L701j0391K99
593c695R161n685p322R177L745j0156J936J0541n939q022Q753L164j1299N86J0254
$$ y = [-2814, 227, 2521, -2175, -2145, 3362, 1011, -3856, 964, 4285, -2211, -3166, 3619, 1589, -4546, -355, 3760, -1832, -2994, 3175, 1590, -3425, 1082, 3874, -2583, -2548, 4003, 448, -5110, 1116, 4417, -3295, -3260, 4951, 1772, -5127, 806, 4805, -3037, -3619, 4156, 1010, -5010, 1359, 4699, -3207, -2743, 5296, 729, -6003, 1484, 4952, -4384, -3894, 5664, 1699, -5704, 1630, 5902, -3310, -3853, 4915, 786, -6388, 998, 4829, -4036, -2971, 6424, 1574, -5758, 2398, 5932, -4824, -4757, 5460, 701, -7427, 1264, 6378, -3370, -3344, 6595, 2103, -6093, 1324, 4938, -5225, -4540, 5510, 511, -6579, 2923, 6923, -3977, -3282, 7028, 1109, -7856, 838, 5423, -5197, -4666, 6295, 1981, -5650, 2696, 6397, -3994, -3695, 5466, -219, -7541, 1636, 5381, -4775, -2839, 7702, 1763, -6259, 2494, 5658, -5641, -5055, 5199]
608E199n049p115R444M110r972J392R248o576p603Q561K289j0715K505J0645n884
623D79o408J0565K847j1694J588R409p668p781R831K978j0559L365J0998o482
637A468o624J0173J485j2356K185R440p968o591J1372K969j0845L814J0684q022
651A184p556J0011J099j2454L013J0577p152n927J1882K742j1723K978R801q989
665e14q008J0377J804j1659M047J1598o838o215J1376J778j2895K241R497r098
679b509p405J1596K816j1114M561J1834p642p495J0555J174j3567K165J0303p872
693b600o455J2194L416j0974L723J0462q591q143R852J105j2518L345J1230o753
707g07n739J1838K672j1844K323R137q846p874J0129K098j0787M413J1238o591
$$ y = [5199, 150, -6965, 2479, 6589, -3383, -1991, 7257, 681, -6922, 1639, 3928, -6787, -4282, 6363, 479, -5929, 4636, 7483, -4211, -2623, 6786, -882, -8663, 1168, 4146, -6413, -3048, 7950, 1468, -5156, 5017, 6502, -5854, -3669, 5771, -2197, -8788, 2584, 5553, -5292, -1478, 9206, 1184, -6372, 3639, 4738, -7716, -4703, 5874, -1278, -7205, 4677, 7419, -4304, -1326, 8475, -514, -8522, 1855, 3659, -8000, -3953, 7645, 807, -5408, 5968, 7746, -5149, -2908, 6589, -2509, -9914, 1682, 4498, -6616, -2055, 9779, 2137, -5358, 5197, 6371, -7196, -5031, 5272, -2600, -9055, 3139, 6555, -4419, -696, 9766, 1175, -6968, 2884, 3989, -8529, -5184, 6046, -707, -6446, 5392, 8064, -3780, -1457, 7680, -1166, -9040, 1089, 3187, -7600, -3187, 8051, 1460]
721A460n918J0525J056j2516J974Q723q454o314J1296K610r914M912J0250p988
735A702o479R675l54j2550L351R477q026m669J2458J942j0672M548Q888r539o779
750g027R825k59j1317N154R970p620l739J1892j07j1646M297P651j0466n602J1440
765B446L22j0507O467J0340q425m838J0763j136j2247L865P752r202l927J2064
779C737N13r619O675Q636j0173n097J0458k164j2291N548R325q764l495J2797
793F086M31j0945N172P663j0390n259J0263j339j0317O825R078q712k937J1894
807G513j772j1932N234P342j0596m349J1779nr709O561Q841q768m139R743k330
822C413j0973N033O897q859k191J1728n49r179O463P137j0100m445R527k191j0193
$$ y = [1460, -4458, 6067, 7123, -5393, -3419, 5304, -3150, -9464, 1832, 4442, -5472, -560, 9690, 1702, -4777, 4898, 4544, -8006, -4655, 4822, -3204, -7873, 4585, 6527, -4145, 403, 9291, -248, -7027, 2798, 2539, -8778, -3624, 6346, -1274, -5013, 6879, 6772, -4874, -577, 7074, -3392, -8994, 2446, 2768, -7739, -1272, 9068, 643, -4195, 6568, 5432, -6815, -2950, 4802, -4400, -8327, 3737, 4250, -5369, 1306, 9942, -231, -5328, 5130, 2966, -9325, -3777, 5548, -3216, -6711, 6086, 6517, -4428, 744, 8407, -1983, -7242, 3021, 1682, -8635, -1810, 7268, -1444, -4381, 7513, 5741, -6191, -957, 6385, -4211, -8560, 3219, 3214, -6495, 66, 8907, 139, -4000, 5743, 3413, -7560, -2527, 4370, -4489, -6680, 5048, 4499, -4680, 1783, 8920, -1180, -5625, 3902, 1711, -8482]
837h482N745P755p542j865J0617j123r070N230N256r840k947R519k407q508P259
852d03P184q363j920J0030k472r688N102N381q912j962R650j683p170O804N327
867F905q665j529Q667l920q742O454N407q611o57J0205j982p837N915M801q740
882b329k244P809k941o938O443M809p372L64Q814l532p491O126L580r374j132
897e408R025k773p053O777N338p405r13P678l187o981N205L154p668L27Q091l358
913H49n661P209L351q579k50Q002l925p161O084M310p314j51P862k535n783N191
929A499K592p075Q2O288l729m793O613K835p225R15P328l882o065N528K821p203
945c471k33O824k270m706N140K664n757N54N242l872m339N301J522o370J401O474
$$ y = [-8482, -2737, 5018, -2524, -4389, 6228, 5105, -3965, 1265, 6521, -3319, -6266, 3253, 846, -7662, -403, 6781, -1582, -3502, 6528, 4056, -5632, -530, 4851, -4061, -6023, 3627, 1944, -5226, 1578, 6905, -1760, -3289, 5378, 1458, -7284, -830, 4577, -4034, -4691, 5514, 3532, -4305, 1610, 6411, -2329, -4573, 3236, 295, -6643, -200, 4609, -2763, -2399, 6415, 2883, -4608, 1518, 5098, -4276, -5408, 3617, 844, -6209, 568, 5906, -1499, -2412, 5266, 2079, -4902, 303, 3457, -4211, -3884, 4207, 849, -4812, 2397, 5748, -2831, -3081, 4921, 996, -6165, -81, 4229, -3085, -3236, 4626, 2091, -3692, 1499, 4091, -2984, -2902, 3386, -343, -5136, 1477, 4312, -2913, -1998, 5330, 1448, -4617, 911, 3732, -3471, -3704, 3120, 850, -3856, 1284, 3948, -1809, -1255, 3987, 115, -4224, 1077, 2599, -3771, -2370, 4104]
961D104l511m459N828K310o655O9N590k969m225M508J896m973J142M905l258l183
977b881M894O16n815J604N056l850l609N379J846n506O28M905k755l512L891J160
993B051m358R87L764k716k042M227K43m708J730M067l643k973M509J118m589R16
1009a417M173k213k797L173J038l435O39K520k395j239L415k17l447J942L032
1024B772l103j949L798L52m118R21L451j948k265K502R64k240N24J678j641p89
1040a091K193n19k258J709J675k630p21L154j50l098R19K610j505j752J781O55
1056I72j640K86J128q79l59J057n35r60J415O36k051j06K394m79k210R67J658
1073A294j370j091J424N11j303m2R15j90j63L64n41k70J103K6j434J98J397n51
$$ y = [4104, 593, -3866, 1962, 4272, -2383, -2314, 3276, 307, -3918, 590, 2486, -2487, -1345, 3560, 302, -2881, 2013, 2629, -3186, -1582, 3474, -376, -3985, 1394, 3240, -2266, -1638, 3267, 512, -3000, 891, 2051, -2307, -1320, 2444, -272, -2314, 1913, 2156, -2552, -822, 3245, -398, -3371, 1138, 2256, -2333, -1417, 2756, 543, -2254, 919, 1957, -1478, -839, 1681, -714, -1953, 1462, 1245, -2202, -260, 2772, -331, -2280, 1518, 1870, -2248, -1327, 2124, 176, -2089, 413, 1377, -863, -339, 1339, -302, -1091, 1102, 583, -1675, 34, 1709, -921, -1642, 1512, 1362, -1736, -817, 1793, 288, -1464, 317, 972, -668, -382, 746, -133, -492, 565, 30, -930, 485, 1121, -930, -1036, 1358, 879, -1331, -364, 1294, -76, -1167, 257, 768, -535, -577, 338, 148, -15, 349, -192, -462, 641, 667, -767, -569, 828, 277]
1091B77j306R43J092j139q03J187O14q73m85M33L50j13k48k26J41M28j91m81M17
1110A7N30n45n83O37O93n85q72L87R04k82q78J47Q53j58p85L53Q22m55p56M49
1130a07O40l07m67l2J41L44J86o43l58J003L19j291K2J523n06j683Q65J664j116
1149A97j463J224R70j103k62Q46l74m10P54j52q15P61N58j493j25K110m37k439
1167a653J024K319j447j760J790J000j875k15J761n00j349R04M55j012O15Q27
1183H84j561l06K302k30k547R39K299j839j807K411R39k700p1K530m80j682J071
1200A52O45j347M64J176j637p79K211j81k306J342K178k240j571K945Q18l164
1216a294K4K637r95j681J688N49j828O06J568j547q20K116m61k430J794K283k765
$$ y = [277, -1029, -86, 1006, -133, -936, 251, 865, -8, -493, -60, 290, 177, -71, -297, -156, 272, 81, -400, 17, 547, 2, -581, 56, 749, 164, -708, -321, 583, 301, -577, -430, 423, 265, -520, -167, 655, 200, -556, -107, 533, 226, -241, -273, -132, 212, 398, -245, -603, 400, 719, -572, -550, 973, 467, -1216, -351, 1313, 197, -1266, -42, 928, -175, -437, 409, 35, -375, 379, 227, -588, 173, 731, -762, -887, 1223, 786, -1653, -629, 1690, 243, -1517, 273, 1273, -602, -817, 944, 444, -905, -1, 454, -558, 57, 884, -677, -983, 1319, 1089, -1458, -519, 1780, -59, -1866, 545, 1484, -1216, -1287, 1243, 763, -919, 152, 797, -550, -86, 1090, -547, -1326, 885, 704, -1602, -260, 1918, -322, -1893, 1052, 1870, -1294, -1270, 1367, 372, -1309, 379, 928, -900, -294, 1274, -273, -1093, 1023, 562, -1868, -74, 2209, -556]
1233e56j485L403M94l332O06K605j887j789K518N58k479R14J996j878n84K713
1249A817j017l103K158K440l392j467M012J16l733J723L297k827k121L188L77
1264A468l214J051K191k496o27L657p66l529K481K679l931j478M400m95m610K174
1280a045M147l108k380L924N42l798J256K545l179j362L864m27l527K727K962
1295C141m101j231N047q79n444K218M132l719k305M678N98m181J848L374l418
1310b42j850L636q72l766K897K767m303o84N620q22n151K725L569m730k245M978
1326A527j56m620K320L820l027j205L931j134l949K778K170m815o81N178j227
1341I10m193L861L466m874j515N144r60n076K297L013l750n48M592j176l495L475
$$ y = [-556, -2041, 1362, 1856, -1476, -870, 1735, -152, -1941, 577, 1135, -1344, -430, 1566, -312, -896, 1817, 800, -2303, -145, 2295, -1097, -2564, 1448, 1564, -2169, -446, 2851, 24, -2097, 1091, 1468, -1746, -695, 1496, -1000, -1627, 2030, 1264, -2265, 216, 2895, -1036, -2514, 1886, 1391, -3219, -1045, 3102, -6, -2386, 1538, 2080, -1718, -462, 2083, -1096, -2458, 1406, 979, -2548, 179, 3141, -960, -2191, 2856, 1977, -3467, -1249, 2883, -836, -3141, 1537, 2135, -2046, -198, 3176, -242, -2092, 1544, 672, -3094, -197, 2570, -1733, -2417, 3203, 2381, -2770, -45, 3524, -1206, -3451, 1527, 1371, -3249, -929, 2891, -136, -1341, 2590, 1456, -2493, 285, 2455, -2360, -3041, 2137, 910, -3283, 578, 4044, -830, -2345, 2799, 1839, -3237, -940, 2073, -1677, -2225, 2367, 1191, -2304, 1171]
1357A171K075m891l40M648k627m332M569L069n173m10N741j442m675L079K260
1372B722m960o24M697j724l298M216K096m629P93M887l423m685M348K177n794
1387c201oN889j736l941M406K673n027n86M227k492l777L786J444m772J459N491
1403C837k865l764M822J627o110J5N241k858m378M598K908m553K74M645k439l440
1419b440L695P14n221J037M738k995k797N421J513n695R62N108l520m603M040
1434d3J937m708O68M870j972k700M103R38m739P42L352l709k691M866J000m906
1450b992J820N290k917l501M062R91n268K83M017k425k564M009J295l521J650
1465B29L324l592k475M124j54n021J753M370l029k253M909J067m819P96L620l098
$$ y = [1171, 3246, -1645, -1985, 2663, 36, -4296, 273, 3342, -1831, -2241, 3500, 2058, -2617, 462, 2722, -2238, -2862, 1835, 111, -3187, 1029, 3125, -1504, -711, 4176, 753, -3932, 416, 2593, -3201, -3207, 2682, 946, -2995, 1411, 4084, -943, -1529, 2698, 206, -3571, 215, 1659, -3113, -1654, 3837, 972, -2792, 2030, 3657, -2453, -2438, 2803, -55, -4433, 165, 3073, -1480, -1206, 3439, 1000, -2440, 1255, 1969, -3252, -2215, 2523, -472, -3269, 2152, 3665, -2030, -1068, 4040, 520, -4083, -43, 1894, -2814, -2146, 2724, 752, -1948, 2155, 3093, -1646, -904, 2448, -1261, -3952, 914, 1914, -2992, -1172, 4118, 1201, -2300, 1762, 2753, -2515, -2232, 1785, -640, -3204, 805, 2100, -1421, 229, 3553, -39, -2514, 1610, 1456, -3565, -1812, 2558, -471, -2724, 2185, 3252, -1567, -771, 2849, -249]
1481b49k773L419L59l522K104L581k933j530M249l89m775J657L218l965k239M810
1497A022R29m051J658L851k709k286L233k64m112J359K872k871j053M335nl696
1513a788K268L135l906k465L873Q5m233J550L631k395j532L768K66l535J156K165
1529B043l193j328L602n22l395K623L265l204j542L885l29m266J262K945k847
1544a001j713L586N63k740J617K233k763j112K914r59l399K019K536k952q03M074
1560B100j26l595J568K680k907j962K792Q2k727J511K356k088o40K896o67k855
1576a582J686J627l188q28L578l36l100K001K766k586j391K811l16l030J111J936
1592A159k094o27K770l36k159J989J546k983p44K918q69k986J837K319k414q56
$$ y = [-249, -3022, 397, 756, -2766, -662, 2919, -14, -1544, 2705, 2316, -2459, -802, 2416, -1549, -3788, 1022, 1951, -2100, -442, 3409, 700, -1586, 1647, 1383, -2729, -1370, 1502, -1369, -2422, 1913, 1908, -1788, 480, 3615, -291, -2756, 1117, 1202, -3031, -1481, 2150, -245, -1777, 1991, 2257, -1278, -122, 2043, -1150, -2478, 1124, 602, -2793, -170, 3095, -109, -1651, 2234, 1905, -2361, -1099, 1846, -1001, -2714, 872, 1435, -1305, 312, 2545, -218, -1330, 1584, 625, -2774, -755, 1781, -1171, -1974, 2100, 1974, -1621, -53, 2627, -280, -2242, 550, 632, -2095, -584, 1772, -316, -956, 1940, 1273, -1582, 104, 1731, -1457, -2285, 1293, 957, -2143, -142, 2624, 38, -1353, 1458, 1142, -1888, -777, 1159, -935, -1562, 1208, 872, -1287, 702, 2248, -735, -1479, 1439, 570, -2416, -579, 1740, -674, -1530]
1608a530L121m3k712J094J685k194q79K203n00k012J804J669k265m08K711p89
1624I55k680J585J729k503r10K771K0k256J228J733j867p51J995o04k046J426
1640a75J256k005j24K535o76k164J682J524k460q42K332l75k092J280J544j629
1656c89l80J973m80j679J246Q04k064o8K106q83j781J784J363k080l99K195n39
1673G29k019J144J206j646m02J722m10j248J270O83j722P6J752r74j583J658R62
1690A198j995r2K125o16j752J189J072j611l80J523m82j135J200O05j445K22J474
1707A100r80j203J469N70j905O9J886o95j447J272R47j442k52J368m54j128Q74
1724D9N38j172J21J219p13q57J237M40j454O8J404o20j178R85P40j194j94J158
$$ y = [-1530, 1591, 1548, -1164, -70, 1615, -579, -1458, 745, 245, -1767, 37, 1706, -559, -967, 1744, 955, -1725, -140, 1589, -914, -1824, 947, 967, -1289, -61, 1672, -195, -946, 1049, 445, -1601, -175, 1081, -924, -1048, 1487, 811, -1353, 329, 1853, -607, -1449, 883, 508, -1584, -304, 1240, -389, -769, 1204, 724, -955, 291, 1095, -969, -1037, 1069, 186, -1595, 189, 1552, -528, -927, 1268, 729, -1290, -146, 1060, -586, -988, 734, 324, -924, 346, 1029, -693, -617, 1135, 161, -1422, 236, 1198, -797, -889, 1236, 620, -1132, 57, 1129, -482, -862, 661, 179, -956, 244, 849, -596, -374, 1100, 120, -1083, 386, 956, -949, -880, 1006, 311, -1136, 136, 1083, -359, -611, 757, 303, -825, 49, 587, -585, -464, 755, 42, -815, 422, 862, -592, -524, 880, 260, -918, 67, 807, -387, -581, 577]
1742E77k81q63O47M30q36M4P98m79o28Q47K73j006J32R51m99p45P28M59q17j13
1762c81P70j82n36L98K28n26R2M14l79k59N50N4n70K14N68l82m03M91J95n07l9
1783a90L42j30j91J82M0j44J40J21k56J8L30j98l20K79K05l42j39L03P8k43J2
1804a03K16m6o0L7m0M0P7j39j09J72N8k20n6K37N2j94K7J69Jj02l4N4R6r0j72
1829a29P1J77j22j76J66J82j82r8K14Lj61P6L6j26P1P6j90l4L01m7l77K36L74
1852C41l72k47M90P4n21J05M40k93l37M30J19m97J59M69m08k49N91Qo55K62N73
1873D82n57m12P40J00q20K62P46n48m73P65J43q56J91P56n72n31Q59J75r40L02
1893a88Q59o49o08Q96J91j024K06R30o39o28R63K32j024K59R43p04o65R52K29
$$ y = [577, 296, -567, 80, 510, -326, -282, 516, 37, -591, 256, 529, -477, -345, 606, 107, -638, 90, 549, -268, -381, 389, 207, -329, 69, 297, -229, -137, 277, -102, -361, 189, 243, -327, -113, 455, 73, -330, 161, 356, -151, -190, 152, 22, -169, 13, 53, -91, 49, 170, -86, -68, 262, 64, -256, 23, 228, -114, -253, 50, 128, -115, -103, 113, 67, 7, 44, 4, 44, 121, -18, -127, 45, 103, -117, -173, 64, 116, -78, -51, 118, 119, 17, -17, 37, 133, 43, -129, -58, 119, -3, -179, -13, 169, -13, -111, 103, 106, -55, 21, 57, -69, 2, 78, -112, -146, 155, 108, -269, -33, 341, -31, -278, 212, 286, -235, -130, 310, 17, -320, 110, 229, -268, -109, 360, -48, -297, 294, 302, -353, -91, 482, -75, -487, 253, 353, -467, -205, 541, -7, -480, 285, 428, -428, -237, 519, -53, -584, 275, 450, -490, -188, 671, 22, -586, 310, 501, -523, -317, 613, -26, -654, 309, 541, -483, -224, 719, 15, -650, 302, 531]
1912E31j101K46J018o58p19J018K64j124K04R74o87o77R81K55j063L01R84p42
1930Eo51J030J20j177L25R99p65o25J120K45j121L34J002q20p06J012P5j135L92
1949c41R73p47n19J162J24j151M21R18r71o35J110L8j166N21J041q62n30J219
1967F05J5j282M77R44j048n70J278N2j223O35J066j031n95J278j17j367O32J018
1985G67j110m48J483o3j335P35J064j321o53J424j35j503P92J244j137n18J538
2002H24k9j493O23J040j380o12J509j31j428R72J261j322n59J657j78j771O88
2019c29J282j404p13J731R6j487Q03J249j294o99J455k28j629Q61J220j394m29
2036i09J873j32j671Q86J213j597q11J678r4j652R25J381j240m85J654k55j615
$$ y = [531, -570, -324, 694, 36, -683, 335, 599, -525, -321, 653, -34, -711, 270, 525, -538, -237, 747, 5, -646, 384, 504, -673, -348, 651, -114, -739, 381, 626, -495, -161, 841, 21, -685, 327, 402, -733, -341, 632, -115, -634, 528, 652, -499, -78, 840, -131, -766, 344, 382, -784, -263, 778, -84, -614, 605, 620, -662, -185, 759, -289, -859, 419, 471, -752, -117, 949, -82, -677, 601, 484, -883, -251, 767, -343, -791, 692, 629, -706, 29, 1093, -228, -881, 543, 408, -1095, -303, 941, -196, -714, 824, 795, -698, -75, 965, -415, -1027, 482, 351, -1077, -105, 1156, -166, -725, 932, 754, -1017, -329, 953, -451, -1164, 567, 663, -824, -21, 1228, -66, -765, 690, 462, -1167, -306, 914, -480, -909, 964, 832, -839, 47, 1260, -337, -1148, 530, 436, -1216, -291, 1090, -150, -635, 1019, 764, -851]
2053h51Q01R53j585m96J802k24j532J195J359j562n92J724l66j809Q18J165j406
2070f06m25J817j33j421J083J017j660m79J602n74j669J195J247j516k92J986
2086A172k98j684R89R67j733n11J636m27j397J345J107j530j07J839p78j740J195
2103D5Q78j917k32K010m14j472J395J152j679l38J610p70j591J241Q28j669J25
2120g98J994o52j485J517Q54k091l20J838p39j672J433J178j537p1J844o38j528
2137h73J170N81j893j3J776q10j271J783R74j887j3J918r62j829J276Q53j832
2154a052l3J921m99j173J450O89j729M1J488j200j388J618O49j846L78K057q71
2171E00j449J525P10k030j56J652p93j273J485P23j486L43J587j086j242J425
$$ y = [-851, -50, 903, -682, -1178, 624, 400, -1132, 63, 1422, -140, -732, 992, 626, -1183, -365, 800, -606, -1031, 786, 653, -768, 315, 1332, -328, -807, 795, 221, -1448, -253, 994, -522, -814, 1172, 874, -810, 179, 1146, -587, -1098, 538, 111, -1286, 59, 1166, -364, -471, 1368, 590, -1150, 45, 923, -994, -1226, 784, 370, -1102, 293, 1445, -234, -572, 1038, 268, -1323, -82, 746, -923, -798, 1196, 544, -941, 576, 1430, -661, -981, 857, 118, -1554, -121, 1057, -480, -551, 1293, 655, -873, 297, 878, -1015, -1028, 748, -62, -1333, 450, 1424, -463, -476, 1442, 480, -1349, -73, 780, -1052, -1085, 836, 337, -836, 614, 1303, -426, -385, 1103, -97, -1485, 133, 782, -1064, -686, 1371, 500, -949, 576, 1286, -744, -900, 752, -41, -1314, 171, 894, -592, -249, 1338, 252, -990, 435]
2187D35L40j979L33J864r80j214J796P66j828L2J580j019j373J303M85j578M51
2204e86J659q99q90J640K04j921L46J505j325j262J721O08j679M55J750r42j140
2221g56J340K64j695K29J286j057p51J713K59j614O68J523j326j146J509K52j786
2238a088L73J611q51q99J443L52j426L35J055j178p57J421N9j477P93J444j172
2255C8q04J608R5j816L49J303j025q44J346L17j159N95J064j053n57J225l12j431
2273a061P90J028j304m27J736N3j524O34J198j152q00J195mj230N74R55q54k69
2291d62J217k92j147Q32P52j411l93J480j66j333P96J136j074n88J236j8j250
2308f85M13P84q66k28J112k58r00Q68O69j216k84J241l70j282Q43R51j087l92
$$ y = [435, 775, -1204, -871, 993, 13, -1201, 595, 1361, -467, -435, 1145, 126, -1247, 56, 541, -1037, -586, 1073, 174, -716, 924, 1128, -793, -447, 1058, -267, -1529, 192, 800, -879, -424, 1326, 384, -756, 584, 848, -847, -618, 668, -389, -1140, 573, 832, -782, -114, 1409, 83, -1063, 446, 698, -1088, -715, 896, 45, -854, 589, 941, -485, -150, 905, -273, -1030, 391, 450, -1027, -234, 1210, 38, -766, 842, 937, -879, -530, 773, -252, -1096, 250, 567, -592, 3, 1067, 14, -543, 682, 370, -1061, -271, 757, -547, -974, 762, 815, -709, -75, 1123, -29, -829, 366, 362, -868, -294, 661, -193, -462, 755, 463, -684, 148, 900, -511, -904, 576, 410, -923, -127, 1009, -65, -653, 583, 565, -685, -272, 512, -354, -582, 530, 272, -628, 240, 909, -307, -591, 650, 280, -1002, -159, 792, -295, -687]
2326f87J260L0j033M26O51q83k75Q90k82q06P67N66r38k0J131m10j110P07P44
2345G28j026m22J038Kq47M88O32o50k46P02k24o55N29L19q14M7R87l51q27O69
2365G9O06q31l17Q20j02p68L68N50m75j67N20j63l64M60J15p18J15P16l84n95
2385e35O76M01p65j02P73j70o93K81L98l69j16L73j48k26M43N1n30J88M54m61
2405g7l76O26K15p44nP79j32n90K84L51l72j13L01j24k08K40O1l24K26L39m58
2426a01k71O41J16o93J2O32j72n04L30L37l92j86L76J8k47R9K8j88K00K25l65
2447a05j65M63R2n27O9M91k32m41L31L72l49k49K96J49j79m5O3j09O0J40j68r7
2469a40K56Rk98J05L45j65l91J80L51j81k84J41J87r9r6Q9M5m0n5j5Q9R2j31j79
$$ y = [-687, 573, 603, -430, -4, 647, -236, -511, 379, 97, -709, 58, 624, -314, -334, 797, 387, -723, -16, 728, -298, -720, 318, 320, -527, -39, 593, -57, -303, 399, 175, -480, 49, 368, -446, -399, 588, 237, -590, 79, 685, -146, -463, 357, 255, -513, -145, 405, -70, -237, 283, 120, -244, 216, 331, -387, -272, 444, 60, -535, 141, 542, -223, -325, 448, 278, -415, -134, 264, -105, -221, 152, 4, -222, 221, 272, -258, -70, 384, -77, -453, 173, 388, -356, -361, 418, 286, -304, -20, 331, -41, -154, 147, 23, -185, 55, 116, -208, 18, 357, -101, -372, 269, 385, -308, -296, 336, 164, -340, -10, 327, -65, -251, 125, 143, -104, -5, 23, -165, 35, 260, -105, -270, 193, 285, -242, -173, 318, 86, -355, -24, 348, -1, -250, 46, 195, 16, -29, 34, -75, -15, 125, -43, -140, 116, 125, -173, -68, 277, 112, -279, -99, 252, 71, -213, -72, 115, 16, -80, 9, 54, 14, -41, -56, 33, 125, -6, -185]
2493a85J33K20r0k38Q7K17l9j84N5J87j01j97P9K27p5k69J6K61K8j92n1J36P9
2516A04q1n6M0N5n4j33O7K17r5k90P3L46l6l31N2K87p4k25J19J49j30j24R5R8
2540G3Jo5j31N3K74n2l21N5L42j12l23J97K32k67j94K60J60k06j13J30O1M1qj77
2564i0%K42p0k97J52K72k74k56L94K44m11j63M10N9l02M1J26j29J0J53j38q9K57
2587A41l3l35K52L71m45l34N15K25n54o3M83q7l82K66K14l47k3K80j78j25L44
2608A85o9m59K88N02m70m03N81J87o59M2O17k59m73M22L37m36n6L52k35k25M33
2629B02k6n65K55N60m36l63O54J65p78P6P26l39o32M47L67m77l4M77k49k66M60
2650B24N3n95K04M90n50l07P68J11q36J75Q06l66o10M97K90o26J0N62k76l25M93
$$ y = [-185, -52, 168, 78, -160, -73, 144, 105, -79, -24, 163, 62, -135, -56, 171, 96, -173, -157, 104, 132, -60, -111, 25, 104, 23, -33, 7, 62, 8, -125, -58, 159, 64, -226, -153, 193, 157, -174, -122, 165, 91, -134, -15, 134, 4, -120, -25, 73, 74, 9, -122, -69, 205, 153, -168, -113, 229, 117, -206, -9, 223, -44, -238, 22, 182, -24, -137, -7, 54, 95, 87, -90, -90, 152, 82, -215, -63, 209, -65, -321, 73, 317, -94, -257, 153, 212, -90, -49, 77, -52, -42, 111, -27, -116, 141, 108, -227, 25, 396, -49, -383, 132, 357, -197, -260, 223, 136, -246, 20, 234, -113, -136, 144, -34, -159, 185, 116, -343, -55, 447, -23, -426, 155, 342, -317, -275, 342, 83, -390, 32, 369, -67, -123, 229, -6, -231, 202, 176, -389, -134, 426, -10, -373, 281, 446, -332, -256, 470, 131, -501, -54, 313, -164, -198, 279, 30, -236, 224, 277, -318, -114, 376, -174, -481, 287, 398, -438, -263, 543, 177, -433, 64, 354, -272, -262, 300, 24, -301, 192]
2671A92N5n01K97M02o28k82Q05Oq60L00P54m87m98P02K01p64L6O11l53l77M98
2692A09L6m95M18M72o53k53P65j05q57L76O92o78m48Q99K36q24J65O55m43m07
2712c40N61o5o37L71N11o01j39Q46j69q08N20O23q62m58Q87R4q33L09O98n35l04
2733c31P16n2p32L44M14p02j02Q48k09p66O20O84q29l89Q90r1r06L57O79n98l16
2754d71Q08L8o40L84M02p67j57Q02l13q13O46O47p69k10J008j14r43L86O19p30
2774a87l76P21n2n73N08M47o65m7P90l70p75O13M26r12j11J051j70q49N70O46
2794F85p47l11P02j68p05M71M29o33K3P68k97o13O77L13j000j25R62l06q26O62
2814c9O49p11j99Q31j59p74L76L51o97m9P21l19m93P68L77q64j9Q58m31q40O04
$$ y = [192, 247, -254, 43, 445, -183, -465, 340, 346, -514, -214, 540, 53, -445, 257, 458, -306, -270, 341, -12, -389, 109, 145, -350, 68, 540, -113, -366, 399, 294, -563, -187, 505, -173, -621, 278, 514, -310, -145, 510, 67, -340, 221, 156, -481, -110, 401, -200, -339, 507, 338, -470, 50, 673, -189, -647, 240, 334, -499, -190, 508, -27, -331, 385, 333, -399, -55, 359, -343, -445, 403, 194, -572, 48, 732, -97, -486, 404, 313, -593, -236, 443, -155, -471, 337, 375, -265, 119, 521, -246, -403, 399, 86, -727, -81, 566, -203, -413, 595, 481, -462, -76, 543, -187, -563, 158, 106, -467, 41, 488, -177, -224, 566, 196, -579, 34, 460, -452, -563, 488, 318, -531, 39, 685, -62, -373, 329, 161, -544, -73, 356, -277, -254, 514, 217, -396, 281, 594, -406, -531, 431, 125, -701, -39, 610, -101, -300, 531, 372, -402, -26, 325, -372, -421, 300, -19, -512, 256, 633, -231, -250, 608, 177, -663, -59]
2835e9N15q50j04R19j21o29N00L54o94q0O09m00n50O56L05p31J56Q51m17o93O42
2856A79L64r07j43P87k15n80N56M20o10K5O34l78n60N23J65p60J43P95l66n56
2876d84P41L74q09q0O97l59o40N05L33n97P6O75k71m25O00R5p85J07O54m96n36
2897f25P21L46p28R4P87l68o22M90K41o99KN95l03l50O69J93o84J70O46n37n71
2918e33O50K22q27J06Q31k81n48N89L36o94l7N43l71m77N51J84n95J87O91m29
2938I8m87O98J67q62L6P47l84n74O25L69o33J8O33l10n05M66J28o22J35O10m10
2959e7l47O99J79p18P9O57m41n90N62K73o42P4O47k21m14M83J68n96M0M96m22
2980i1l81N98J46o14K16O31l97m57N33J76o58J4N63l11l66N30J66n27J59M63m15
$$ y = [-59, 456, -394, -498, 421, 300, -329, 171, 525, -169, -249, 360, -40, -590, 66, 371, -360, -204, 647, 230, -463, 179, 543, -364, -507, 280, 65, -515, 41, 461, -149, -124, 510, 132, -428, 95, 260, -500, -357, 438, 72, -484, 257, 631, -178, -258, 439, 80, -560, -55, 278, -319, -243, 432, 161, -264, 336, 431, -354, -247, 407, -89, -625, 96, 442, -286, -192, 595, 227, -395, 95, 336, -363, -361, 234, -69, -419, 250, 443, -241, -71, 575, 38, -533, 117, 339, -488, -382, 449, 168, -380, 209, 545, -149, -186, 357, -14, -491, 60, 244, -351, -164, 527, 98, -389, 309, 476, -386, -350, 397, 13, -561, 64, 433, -200, -182, 451, 141, -364, 102, 230, -392, -257, 353, -57, -404, 295, 474, -244, -165, 492, 51, -539, 23, 296, -346, -272, 375, 154, -260, 223, 391, -205, -165, 331, -91, -472, 126, 272, -342, -126, 505, 108, -349, 184, 360, -298, -284, 279, -32, -398, 132, 298, -229, -70, 393, -22]
3001b2l19N27M4o19K06N88m26l27N98J19o09J11M80l83l43N03Q1n09K32M58m07
3022a7k39N70m7o31K32M84m73l10O13R6n79K19N04m01l01M79On38J96M13m15j79
3044c18N79j3n48K68M66m88k86N55K4n74K02M85l50k74M86M0m89J93L52m04j88
3065b82M90l8m75K79L94m31k19N08j1n25J90M09l48k30M40O6m12J55L29l47j72
3086b30L95o7l76K33K82l21j28M35k6m04J85L08l29j90L59Ol32J61K58k47r1L08
3108A89n7k98J94J67l08n4L15q6k74K10K05k77p0L00o7k60J83J40k47j7K46q1
3130E3k04J86J19k57lK62j12k00K02J07k29qK44j07j74J64Q0k09J0K09j16j39
3152a22J79Q3k13K0J83j11j42J31Q9j95NJ90r2j05J34P3j69L1J31r5j03J34N1
$$ y = [-22, -341, 186, 230, -389, -183, 405, -21, -348, 250, 369, -240, -129, 351, -32, -375, 128, 209, -300, -68, 390, -17, -256, 314, 267, -364, -132, 352, -121, -431, 182, 278, -301, -82, 422, 21, -280, 199, 205, -333, -137, 276, -139, -318, 261, 248, -300, -32, 434, -54, -340, 215, 239, -335, -133, 352, 2, -272, 214, 254, -235, -42, 310, -94, -282, 208, 170, -305, -26, 368, -63, -282, 226, 215, -310, -120, 289, -59, -289, 151, 217, -195, -40, 289, -58, -230, 165, 98, -278, -45, 237, -84, -212, 223, 197, -207, -22, 286, -43, -233, 126, 132, -200, -39, 219, -28, -119, 189, 132, -166, 28, 195, -113, -167, 148, 62, -212, -2, 203, -74, -144, 156, 89, -171, 12, 152, -95, -112, 134, 53, -151, 35, 154, -103, -106, 156, 44, -156, 46, 153, -76, -84, 160, 53, -121, 43, 123, -86, -76, 133, 17, -122, 57, 140, -73, -53, 130, 19, -123, 8, 97, -98, -93, 97, 5, -100, 34, 107, -62, -31, 100, 5, -98, 36, 87]
3175H7j67K4J50p7r7J16N5j16RR7l5r3P5K2p6j0Q5n5l0M9K9n6nO8k6m8K1J5k5
3204a4LQJnQJ7Lj9%J3Rk7k0M3J6p2L7N0o9%N2K6q5K5P3o5m4P3Rp7K6Q0j11nR2
3239E1oj14O7R2j04p4J57qj67N2J47j05q6J26L7j20M0J07q6o0J37j6j60Q6R2j28
3265d3n8J94j7j80J00J66j53j17J80K9j89N8J25j14n0J48k1j44J11J01j84m5K23
3288A20o8k09J47J63k13q7K57k1k13J05J47j73n3J98n1j84J74J01k05j5K45j12
3310E3k29J93J66k68n5L10o8k34J54J70k42p2K33o4k27J98J31k60K2K89j29k62
3332a91K42J69l57m6L41r2k90K05K13k62l8K89r2k57K20J09l00ML36j42k78L02
3354H5J85l78l5L64j13l37K13K17l01m1L12p4k45K32J23l39JL24j82k94L34K11
$$ y = [87, -80, -56, 94, 17, -80, 36, 91, -25, -16, 81, 46, -47, 28, 50, -26, -36, 49, -6, -36, 13, 42, -14, -19, 49, 23, -25, -4, 11, -14, -11, -3, -2, -7, 1, 18, 21, 2, 2, 15, 24, -3, -23, 20, 36, -36, 1, 51, -18, -18, 34, 60, -25, 0, 73, 8, -36, 37, 46, -31, -5, 75, -36, -41, 51, 45, -69, -2, 90, -14, -88, 69, 61, -106, -54, 93, -12, -98, 28, 65, -55, -15, 92, 6, -54, 83, 67, -93, -7, 85, -43, -101, 93, 76, -104, -4, 162, 9, -108, 72, 101, -88, -30, 95, -19, -69, 79, 58, -86, 25, 126, -58, -103, 120, 52, -157, -10, 153, -60, -147, 110, 89, -124, -19, 128, -45, -98, 100, 49, -135, 39, 140, -65, -80, 165, 53, -176, 17, 183, -85, -140, 170, 102, -132, 22, 192, -50, -122, 111, 47, -180, 18, 149, -111, -89, 200, 71, -191, 51, 220, -137, -183, 158, 66, -224, -19, 194, -68, -106, 183, 91, -166, 54, 163, -137, -133, 203, 61, -217, 85, 270, -108, -143, 221, 108, -229, -16, 201, -100, -141, 171, 97, -148, 84, 207, -132, -131, 193, 11, -283, 51, 262]
3376B62l96l5M46j35l89K55K16l42j00L47o2k70K68J57l18M4L39k26l32L40J58
3397B27m54J4M70j34l81L39K71m21j02L73j23l46K59J71l23K8L93k08k81L87J19
3418B78n02M0M65k55m01L96K91m38o1M67j30m03K99J86m15PL97k11k67M25J47
3439C15n06N3N11l01m56M36K34n03k0N51j76l66L38J99m59j0L91k67l15M38J34
3460B21m92J47N15k92m08M46J93n96j5N33k19l81L96K35m10N9M16l07l23M15P8
3481B11n47J47N28l59l32N53K06o04K1N23k82m20L89J80m60R1M76k90k53M42L1
3502B51n55J86M72m63l52O16J77o11J38N68l33m03M41J22n44R2M25k95j92N24
3522B64%n16K83M38n41l18N94L4o50K03O03l74l39N52J53n67Q4L92l77k45M73
$$ y = [262, -134, -169, 277, 142, -247, 8, 224, -118, -218, 129, 67, -203, 65, 222, -96, -52, 287, 61, -271, 69, 227, -227, -213, 257, 123, -258, 81, 352, -69, -171, 202, 79, -267, -8, 163, -160, -132, 261, 53, -228, 159, 278, -224, -184, 281, 26, -375, 21, 312, -126, -187, 280, 150, -253, 46, 232, -183, -176, 221, 10, -257, 168, 315, -191, -138, 373, 72, -384, 52, 286, -217, -237, 314, 138, -228, 110, 309, -150, -160, 231, -36, -351, 87, 221, -271, -124, 391, 99, -309, 137, 330, -266, -281, 252, 33, -348, 48, 283, -127, -68, 348, 41, -282, 133, 211, -336, -189, 339, -20, -352, 201, 407, -197, -176, 347, 65, -355, 34, 214, -246, -155, 321, 31, -222, 220, 251, -304, -118, 354, -109, -461, 155, 332, -279, -141, 427, 94, -309, 132, 254, -290, -198, 227, -68, -260, 264, 264, -252, 31, 469, -72, -390, 204, 238, -412, -209, 394, 20, -319, 233, 386, -181, -97, 295, -82, -327, 146]
3543A46j1m95L10M66m72k35O30n5o80K39N49m60l65N71J59n20J57M39l68k51M52
3564B06o2m76K58L74m52j29O27m8o09K72M79m95l28N12M7n07K20M31l17j78M30
3585B55n4m28K63K32n01j12N69q3n00L34M46m38k44N18j8n27J48L62l20j46M22
3606A78o3l11K98K32m65q5M95j84m74L76L31m68j27N41j7m66J51L06l39j21L52
3627A40j19k94L23K05m05M0M41k51m29M00K54n34r9N46m8m06K58L02l52j24L36
3648A84j13l02K33J35l36Q6M25k28l68M10K47n06j22M79j08m48K80L34l33j39
3668a90L75l3k75J77Q3l31M2L55k07k83L52K25m28k8M43j28m35K22L21l06j72
3689b21L18K7k33J76J17k50k4K74j70k29K86J17l77L8M13j05l68J95K64k75j64
$$ y = [146, 135, -360, -50, 416, -56, -291, 339, 284, -396, -157, 392, -68, -433, 138, 297, -223, -66, 373, 5, -246, 206, 144, -332, -74, 300, -152, -281, 346, 298, -311, -39, 440, -55, -383, 129, 176, -331, -111, 320, 3, -175, 255, 201, -227, 36, 268, -233, -345, 224, 141, -359, -25, 421, -17, -261, 257, 239, -288, -140, 222, -98, -244, 178, 115, -196, 102, 334, -131, -216, 279, 95, -379, -3, 328, -140, -267, 274, 257, -209, -58, 248, -91, -212, 140, 21, -273, 50, 255, -150, -110, 331, 80, -349, 51, 305, -229, -328, 218, 170, -236, 22, 324, -28, -152, 184, 71, -231, 2, 137, -199, -113, 312, 84, -284, 126, 373, -133, -255, 224, 116, -332, -52, 282, -51, -190, 185, 152, -123, 54, 137, -194, -152, 203, -4, -287, 65, 290, -138, -166, 277, 149, -286, -64, 257, -49, -221, 97, 124, -109, 67, 184, -66, -90, 184, 14, -215, 71, 188, -189, -151, 262, 157, -211, -16, 248, -27, -191]
3710a91K56j6k04J22J72j84nK11j52j66K51N9l62L3L60r9l01K14K35k66j06K79
3732A40k8k32P5J21j28K7J36j21r9K58N3l42L7K93j52k46K20J77k70p7K84J1k04
3755f7M0R9j24K9J05j28q5K08M3k53R1K43j85k40K54J96l08j01K78K7k00N7J49
3778A28j43k9J28p3j00J52Jk07J33K23j86k25K64J65k83j05K53j1k36J04J58j03
3800Hq3J06Pm4Q9n1j58R3J86j55j81K28J23k47l4K57j5k47O1J90q5j07O4K4j0
3825A9L2j1r5N0J15j08r3J70L7k09lK32k0k14J9J61l2r7J7M4m5K5J6l2O0J8j08
3852e2rJ52j3j81QJ70Jj43M9J02m7o4M2N6m1m6k3M4O1j6j26K4J50k6j25K1J15
3879H3l1j16O4Q2o0j02L9R7j0q1m0P1P6m9p3L8Q2n1p5O3P8p5j04P9J19n3j08J7
$$ y = [-191, 65, 49, -155, -33, 139, -45, -50, 161, 9, -157, 94, 153, -209, -176, 184, 85, -216, -2, 233, -33, -139, 140, 112, -120, -45, 76, -52, -25, 111, -10, -109, 149, 202, -140, -103, 190, 38, -208, 12, 189, -81, -158, 126, 137, -67, -27, 72, -52, -23, 82, -46, -131, 77, 120, -133, -42, 201, 16, -224, 30, 226, -82, -183, 95, 122, -78, -21, 128, -15, -44, 84, 11, -89, 63, 64, -143, -10, 213, 27, -198, 66, 231, -52, -157, 96, 85, -151, -47, 111, 8, -75, 31, 38, -6, 83, 32, -126, -33, 153, -2, -183, 45, 168, -79, -113, 144, 129, -118, -57, 133, 48, -59, 5, 29, 19, 51, 40, -55, -5, 110, 2, -91, 79, 116, -93, -96, 136, 116, -98, -79, 82, 50, -47, -30, 14, -31, -6, 10, -22, 38, 56, -52, -61, 91, 78, -103, -95, 75, 76, -67, -18, 84, 37, -27, 15, 71, 30, -16, -39, 5, 66, 50, -76, -52, 98, 72, -53, -32, 83, 52, -64, 0, 82, 22, -80, -41, 56, 46, -35, -75, -4, 72, 23, -50, -12, 70, 19, -56, 7, 85, 10, -94, -15, 104, 51, -57, -40]
3907d0J22Kj12KQ0lp5j2Q9jr4k4R5M9o6p6K7J09j6j11KJ14j7j25L5J36o5j38Q3
3936c0J24m1j02J8Q1j2k2k9j5N3K1q9KJ40l4j54P0J72q7j75J00J26j03r4R9K2
3962D1p3K4K4j1J1J4q2j1J52m1j89P7K07r9j75J37J22j59n8J47J3j47M4P6n2K9
3988B1M2r2m1J69qk01O6J94j23j63K01J04k10n5K16k0j80O8N7q3J7J12j22n6J84
4013I7%k04R6J71j89j62K33J34k65l7K50l4j72J16P7j54LJ21j08o5J74k2j89J36
4037GK07k12j75K84P2l01kK56q9k00J73J16j83j1J64j13o9J62l3k20J32K24k21
4060c2j42K89O1l26M9K82j38k31J98J38k01jJ79q4j06J74qk46J18J75k19j01L16
4083A44J4l02J00K87j88k23K13Q5k39J2K17j33r4J91K0k16J27J69k53r7K83Jl34
$$ y = [-40, 82, 84, -28, -26, 54, 51, -24, -36, 53, 52, -42, -66, 29, 78, 12, -64, -37, 72, 56, -55, -53, 61, 44, -81, -46, 90, 25, -113, -30, 94, 53, -49, -31, 50, 38, 16, -13, -28, 25, 46, -43, -41, 99, 65, -89, -19, 153, 66, -109, -9, 117, 14, -80, 19, 41, -32, -8, 16, 5, 16, 30, -52, -63, 89, 48, -141, -64, 143, 44, -131, 6, 128, -31, -89, 58, 71, -76, -32, 44, -8, 21, 63, -29, -70, 99, 91, -110, -44, 150, 27, -136, 65, 169, -41, -96, 120, 100, -80, -12, 45, -38, -21, 91, -31, -87, 97, 97, -107, -11, 160, -29, -191, 42, 176, -89, -126, 124, 90, -82, 34, 111, -43, -40, 81, -27, -92, 82, 60, -129, 7, 214, 2, -173, 111, 183, -118, -120, 136, 47, -153, 20, 136, -47, -58, 106, -7, -76, 86, 53, -167, -35, 189, -32, -174, 115, 176, -150, -101, 181, 43, -188, 10, 148, -53, -54, 125, 41, -65, 109, 101, -145, -27, 148, -71, -172, 144, 158, -144, -44, 243, 55, -168, 45, 130, -109, -97, 120, -13, -107, 84, 104, -112, 15, 184, -69, -166, 117, 118, -216]
4106b16J40K87j93j92K67Q2k79K4K32j54j55K35kj92J42J70k31j12L02j3l40J30
4128f8K86k36j83L17P3l03N5K57j87j52K10j3k34J40J94k30q3L47l5l26J49K58
4150B36k87j96L29P8l50R2K81j53j39K28J1k57R3K03k49r7L18k9l12J88L10l02
4172dj87L39L3l66O6K82j71j83K79O2k52Q0J91k28r3K77n2l14J84K84k68j46L46
4195A59K9l52R3K66k14j82K54O3k41J04K23k05r8K67o6l08J96J93k89r7L57Ll18
4218a63J42K70k28j95K77%k88J11K10k19p1L17l9k75J79K01l17j09L41m5l39J71
4240f9K81k28j33L18pl12J38K00k69q9L10p5k65K37K06l08r5L57o5l76K03K58
4262B17l00j18L44jk86J43K17k75j03K98r1k93K22K24l00o9L92o6l59J96K55l23
$$ y = [-216, -76, 211, 18, -174, 93, 175, -104, -80, 152, -2, -157, 78, 76, -116, 26, 196, -35, -147, 155, 142, -198, -68, 218, -18, -201, 116, 189, -114, -59, 198, 11, -141, 69, 56, -178, -38, 156, -74, -157, 190, 155, -171, -22, 236, -51, -247, 82, 160, -190, -98, 183, 30, -109, 119, 130, -127, -34, 169, -80, -177, 141, 112, -200, -12, 298, -4, -191, 148, 181, -185, -119, 163, -8, -191, 88, 150, -102, -22, 169, -59, -152, 125, 73, -241, -57, 227, -41, -187, 159, 188, -164, -71, 195, -19, -201, 53, 116, -125, -21, 202, -3, -101, 166, 100, -208, -12, 181, -108, -205, 152, 155, -163, -21, 249, 21, -174, 103, 103, -185, -74, 136, -83, -154, 163, 124, -151, 28, 229, -88, -197, 144, 99, -240, -69, 212, -16, -149, 169, 162, -150, -12, 188, -81, -170, 140, 65, -200, 37, 243, -65, -160, 197, 132, -244, -41, 217, -83, -201, 143, 142, -144, -1, 216, -59, -162, 136, 45, -248, -26, 198, -102, -171, 221, 155, -204, -8, 247, -76]
4284g6j48L53j3l25J88K42k52p6L11p9l05J99J83l29o3L69p4l27K44K43k99j28
4306a62L31l0l44J50K25k59o1K94n0k53K02J77l18n3L13j00k94K42K08l01o0L36
4328A93o8k81J60J84k68q1K94n6k42K17J53k71k5K95j32k67K14J49l09l1L40q0
4350H8k72K21J83k92m6K68j05k58K21J26k56LL02j11k30K44J07k99jK76j31k43
4372b05K36J40k60nK93j36k18K12J01k72J5K78j42k08K51J05k99K1K81j61k13
4393a86K19J15k75K1K75j30k00K28J07k92RK62j59j86K27J21k67K3K69j20k01
4414a40K12R1k63qK44j30j66K26P2k25K3K26j15j83J99P1k40K6K09j13j49J94
4436F1P4k09K2J86j20j64J96M6j95N4J70j20j12J78M3j92L1J78j30j05J64M0j78
$$ y = [-76, -224, 129, 116, -209, -21, 221, -31, -107, 204, 125, -180, 19, 202, -127, -190, 179, 105, -222, 22, 265, -34, -162, 169, 139, -205, -55, 170, -89, -150, 144, 94, -159, 43, 220, -98, -151, 162, 62, -232, 10, 218, -83, -143, 193, 125, -156, 4, 188, -80, -161, 133, 77, -165, 52, 205, -66, -91, 204, 72, -195, 19, 168, -141, -172, 168, 88, -184, 37, 220, -72, -118, 150, 45, -213, 8, 134, -122, -119, 183, 72, -158, 86, 193, -106, -107, 169, 38, -205, 31, 171, -89, -94, 199, 63, -155, 57, 158, -114, -99, 179, 37, -171, 80, 185, -114, -93, 188, 27, -186, 33, 148, -127, -106, 169, 39, -161, 67, 174, -118, -109, 153, -6, -192, 35, 156, -111, -88, 181, 61, -140, 72, 163, -100, -108, 136, 6, -160, 66, 138, -87, -64, 162, 47, -136, 63, 134, -106, -80, 129, 16, -133, 61, 135, -74, -52, 134, 14, -150, 46, 92, -103, -49, 121, 1, -111, 67, 110, -82, -51, 127, -3, -108, 56, 96, -82]
4459h2M4J86j19j22J59K6j74M8J49j12j02J71J2j45M9J04j08o5J47qj61O9J33
4482I9j22n6J57lj50N6J11r6q2J25K1j43M9J16q8n5J17%r9M2R2j11m2J40j0j40
4508g2P3J01q9p1J12J7j17K8Q6n3n1P9pq2M6M3q2JR0k5r3O6O3q9k6R3jq3K6M3
4538B6m1qL5Jk5K0J8k9MM6k2o1M8L0m2k7M6K2m1LM1j4l8J3mkKJk0J0J2j5j9L9
4572IK5k7j7K0NoqlL2j3l0J2K0Ll7K0K6k0j8K9mqoj8K2J6Jl5J3L6j1n7K4N6l4
4607A7o4N0L5n6j3K9J5l5J4QPR%m1J3N2j4p2M7O8o4o3P9M4q3j2Q1on6K0J9j2j0
4640FJ8n1J2O8m1p1P2P6r7o2J08L7j34nJ05j0q8N2L7n9J6L4l6MN6k7p6O1Q2j16
4670b9m8J37K9j41J2J19m1q4N6N8p3j8O6m4k8O9k3q7Q1P1j13o1J39L5j38J4J36
$$ y = [-82, -38, 148, 29, -93, 66, 92, -82, -34, 115, 3, -99, 72, 84, -61, -12, 92, -16, -81, 66, 58, -103, -34, 99, -23, -79, 78, 75, -75, -19, 92, -4, -86, 39, 60, -83, -34, 82, -6, -61, 56, 56, -43, -1, 91, -20, -62, 78, 68, -72, 1, 102, 13, -58, 54, 71, -46, -18, 68, 15, -36, 43, 36, -46, 0, 43, -39, -38, 52, 27, -66, 0, 63, -26, -52, 41, 40, -43, -17, 26, -15, -23, 12, 13, -12, 8, 26, -3, 1, 47, 25, -36, 12, 42, 0, -27, 19, 41, 0, 3, 44, 30, -8, 5, 1, -1, 1, 2, -18, -8, 4, -11, -30, 9, 34, 7, -10, 10, 15, 9, 1, -2, 30, 17, -13, -1, 19, 22, -15, 5, 31, 11, -7, 22, 18, 10, 4, -14, 8, 24, 25, -10, 3, 39, 28, -29, -5, 51, 17, -47, 3, 38, -18, -31, -2, 13, -22, -8, 0, 7, 16, 16, -25, -12, 40, 26, -46, 1, 69, 5, -58, 21, 65, -18, -30, 51, 45, -11, 9, 28, 16, 6, 24, -27, -15, 53, 12, -59, 13, 89, -8, -70, 38, 75, -59, -64, 41, 31, -57, -5, 32, -27, -11, 23, -13, -9, 47, 20, -56, 5, 87, -29, -77, 60, 89, -52, -40, 79, 38, -46, 10, 68, -5, -23, 43, -1, -29, 40, 17, -70, 11, 82, -31, -92, 47, 82, -56, -42, 94]
4697I4o4j08Q1N4r4j0O6k2l0P8mq7O3Q3j20n5J46mj55L6J71q0j08J06O2r3k2P4
4725E8n6m3R2k7r3O9R9j34l2J69j1j96M7J79j10j45J53R5j56j6J52o7r3J01J6
4750E1j28Q1J04j55m6K19j0k36O3K31j44j76J97Q3k01lJ86n4j27J16K7j36N1J04
4774I7j51o4K07Pk30R7K11j65j62K31P9k66l0K29n8j48J28O5j34O1J31j48p7J87
4798I7k0k33J36K09k12j49K87O9k73K3K15r9j72J55M8j58M0J34j14n2J93o7k17
4821a60J45J85k30j27K68N3k64P5K24j56j46J91L5j77M1J31j47j5K31q0k23J82
4843C6J76k67r6K86k4k87J06K61j84j45K29L3k00Q3J13k01k3K28r3k09K03J58
4865A83k82n2L46q3l22J61K51k29j51K48J5k00J17J37j84l7K01r7j81K21J15k99
$$ y = [94, 30, -78, 3, 57, -37, -47, 19, -3, -33, 45, 41, -46, 17, 100, -20, -75, 71, 67, -88, -52, 119, 39, -69, 37, 99, 6, -16, 58, 2, -41, 51, 24, -69, 0, 99, -35, -67, 102, 91, -105, -58, 121, 11, -134, 19, 114, -42, -58, 94, 27, -66, 35, 51, -77, 4, 108, -47, -93, 126, 116, -120, -57, 174, 30, -146, 51, 134, -67, -70, 116, 62, -65, 51, 78, -58, -7, 97, -54, -118, 89, 96, -134, -37, 174, 9, -153, 78, 157, -109, -139, 90, 32, -116, 12, 77, -57, 4, 135, -13, -90, 97, 77, -156, -20, 189, -23, -172, 115, 184, -89, -66, 149, 50, -122, 33, 81, -77, -37, 97, -17, -69, 124, 57, -160, -15, 170, -60, -187, 81, 134, -130, -55, 169, 13, -133, 58, 93, -84, -43, 88, -59, -74, 157, 77, -146, 36, 212, -55, -151, 135, 111, -176, -70, 191, 7, -138, 91, 124, -76, 7, 120, -81, -104, 124, 31, -178, 25, 183, -99, -151, 195, 112, -210, -49, 202, -27, -178, 70, 85, -115, 2, 139, -45, -82, 119, 22, -159, 62, 177, -122]
4887a22j4L59p2l36J75K32k48j40K60Mk44J03J71j45l1J82r2j67J96Q6l20KL11
4910A50p1k87K17K18k66j18K87J1k65P1J49j45l3J68o2j45K03Q9k64J5K58j45
4932C5k38K28J72k58q7K75nk11P8J25j47l7J60p4j35J64O1k18P2K22j72k11K32
4955C1J54k91n7K66j8j94J23J24j71k3J40n8j25J41K8k09R3K41j64k02K51J12
4977A92k69l5K47p8k18J30J66j66l6J55o9p2J35j5k08P0K13j54j52K35Q1k66Q
5000a06K79o5k64J13J68j38o5J41m1r5J41L4j63M4J47j42j27K18O6k74PL06o5
5023A19k49J03J66j67p3J63k6j22Q0P4j07L4J23j55j01K17N4k65KK56p3k10J52
5046eJ61j79q7J82J3j30K0M1n9M2R6j14p8J84N4k07NJ99j10j83J63J41j90q5J84
$$ y = [-122, -136, 223, 151, -185, -10, 222, -26, -166, 94, 98, -146, -43, 128, -17, -48, 134, 42, -125, 71, 157, -163, -161, 150, 79, -208, 9, 227, -39, -157, 130, 141, -124, -53, 96, -49, -82, 86, 24, -121, 82, 171, -93, -78, 180, 35, -203, 25, 197, -61, -148, 127, 122, -89, -11, 114, -33, -70, 90, 16, -119, 45, 106, -112, -40, 182, 10, -201, 31, 185, -106, -163, 103, 85, -109, 14, 138, -33, -56, 84, 26, -99, 42, 70, -139, -46, 195, 31, -171, 80, 192, -77, -112, 135, 57, -161, -31, 135, -31, -67, 88, 19, -53, 82, 67, -141, -71, 142, -12, -164, 71, 152, -114, -106, 173, 108, -156, -43, 125, -13, -78, 63, 22, -73, 68, 102, -61, -17, 130, -12, -139, 79, 145, -129, -122, 184, 119, -130, -27, 139, -28, -101, 62, 36, -86, -6, 68, -39, -5, 118, -37, -138, 79, 133, -132, -130, 126, 53, -157, -5, 156, -23, -110, 72, 85, -45, -25, 16, -43, -1, 95, -19, -97, 87, 141, -66, -61, 138, 28, -155, 8, 149, -41, -126, 58]
5071E8L9j44M9L2q5K8R5r4o7J39J8j77O7J97j26j99J83J34j87p6J61Rj12O7O6
5096G5q9j5R0p4m7J39k5j82J02J94j26j71J64J17j91n0J69l5j43O1R3o5k1O7o4
5121b7pJ27l0j84O8J70j33j32J78P9j85k0K04j7j86M6J20p0k5N2m8k0J09k1j26
5146g8P4J15j34j01J96N5k24mK22m2j58M4R1o7k6N1k0l9O6j2o4Q4O4j59m7J89
5172G6L1k04NJ74l8j24Q5P9q6k4O1qk6K0k3n3P7O8j40l9J72Lj73N3J35o0j44J07
5200DQ8r7o7O6L5k7J1l1l2P3K8q7j4J15l3j16P7J09r0j14Q9Q5o6l2L2J7qMj5j2
5230hL9k0n6M9Q3o7r1N7J11p1r7P0O3n2m2L7Lk5j3J0L1M3n3n9O1P3n9q9O2P6p2
5261fm7N0M9p3k1P0K6l5l7PO1L2q7k7O2K5o5j8O5J3n9j8M9M7o8m1M3N6k7o9NO6
$$ y = [58, 97, -47, 2, 34, -51, -23, 72, -22, -89, 50, 68, -109, -42, 155, 29, -170, 13, 147, -40, -116, 45, 54, -58, 9, 75, -14, -29, 61, -13, -60, 79, 54, -128, -26, 168, 42, -129, 35, 152, -39, -89, 80, 45, -98, -37, 56, -9, -30, 37, -27, -34, 93, 63, -121, -53, 117, -16, -148, 30, 109, -76, -96, 108, 91, -95, -49, 71, 1, -24, 28, -20, -40, 69, 48, -78, -4, 111, -23, -124, 72, 127, -97, -101, 121, 79, -79, -35, 56, -11, -37, 14, -6, -45, 21, 9, -55, 29, 93, -66, -113, 76, 107, -97, -92, 82, 44, -80, 5, 84, -2, -26, 35, 27, 1, 21, -2, -55, 22, 90, -50, -89, 83, 86, -87, -34, 101, 41, -103, 4, 92, -5, -72, -6, 29, 2, 13, -18, -50, 23, 51, -36, -50, 65, 32, -84, -7, 102, 12, -102, -13, 72, 6, -26, 6, 23, 15, 19, 4, -8, 31, 11, -45, 4, 87, 20, -71, -14, 97, 26, -71, -1, 62, 10, -32, 5, 8, -17, -30, -20, 11, 54, 1, -58, 3, 76, 17, -72, -10, 66, -6, -53, -3, 46, -27, -48, 22, 48, 13, -24, -17, 44, 76, -11, -38, 24, 49, -16, -34, 31, 44, -15, -33, 16, 63, -5, -46, -3, 53, 26, -43, -38, 28]
5293B8j3n2PO2%p6J9Q2k1p1jO1J4l8m0M5M4l7m7M0M4m4n6O4N9o7n3M1N4k4m9j
5325b6L7jj0k2K2L3k9o2N7N2p4n6P0O1q0j7O0K8m8PJ5oPj5k4K1M8n3n2P4P5j05
5357a3m9J00L8j01j2Q6j6p0L1L2rj8J4m3QP0m4q2P4Q4j10m7J20K1j28RJ20m1q3
5386e9M2M1k2jK8m2oO8l2p6O4P2j09l0J33Mj31J1J46o0q6M8N5p0k2N3k0k3O2j7
5416B1p2Q7M5j14l8J33Jj36K0J26n3p8N0O9p9j2O7k5k9M6k6l5N3N9j14j9J26j8
5444E5j26L7J45r7r4J20L7j03KP2m5l1N7j5p4P2O4j23kJ32n0j19P7J06j24o9J24
5471B8K7j26L2J13o0l7P9Jj09N8P8j23l6J61m0j47R6J37j35q2J56Qj42K1J35j12
5497a9n4J15Kj18O2Q8j16m7J53k1j60Q2J43j33q3J71K1j70L7J43r6p9J07J5j10
$$ y = [28, 15, -37, -30, 32, 32, -44, -25, 57, 36, -35, -36, 25, 39, 1, -39, 6, 50, 13, -34, 6, 50, 6, -50, 14, 73, 6, -47, -6, 48, 24, -25, -26, 11, 10, 0, -22, 0, 33, 4, -58, -1, 51, -23, -79, -9, 52, -28, -45, 15, 43, -5, 2, 17, 11, 18, 3, -21, 0, 48, -5, -57, 17, 92, -13, -62, 38, 76, -25, -37, 49, 33, -37, -6, 26, 17, -1, 13, -30, -22, 48, 4, -78, -4, 80, -30, -77, 43, 64, -64, -55, 65, 24, -59, -17, 24, 2, 1, 29, -13, -19, 49, 17, -59, 5, 77, -32, -62, 71, 75, -56, -45, 101, 41, -45, 3, 58, -12, -34, 19, -1, -24, 38, 21, -51, 36, 81, -33, -71, 62, 63, -73, -53, 73, 20, -58, -8, 61, -18, -30, 37, 12, -17, 29, 3, -32, 21, 80, -34, -53, 73, 55, -71, -34, 111, 14, -80, 40, 77, -26, -24, 48, 3, -28, 29, 14, -60, 12, 76, -47, -49, 83, 33, -86, -9, 97, -27, -96, 28, 55, -71, -39, 74, 14, -23, 56, 57, -52, 6, 84, -39, -75, 86, 46, -101, -5, 132, -3, -85, 71, 79, -63, -42, 93, -19, -73, 42, 44, -74, -12, 76, -40, -87, 66, 45, -115, -33, 110, -23, -106, 65, 86, -84, -47, 96, 0, -79, 28, 43, -67]
5522f7O7J00j18k9J33l5j58R9J22j41p6J88J2j81N8J38j01q4J20mj38P9Q6j23
5546e3k6J59m1j37J11J10j73m6J73j9j70Q3J39j28o4J45Qj45Q5P4j28j9J53m9
5570D2j25J10J01j81l0J94n0j71J11J15j71l2J72j6j62J20P0j41l5J63p6j19J13
5593BJ14j69m5K13p9j49J27J18j98k6J70l1j75J45Q6j63J7J67p5j40J27Q4j89
5616f9j5J95p6j62J42R9j63j5J67n7j57J19R3j80JJ76p3j29J36O6j75kJ85q0j43
5641a17J38Q9j87K2J61p9j32J45N7j64KJ71q3j19J40P1j73J0J60q1j40J41O2j70
5665g6QJ65o8j23J29O6j52%J37r3j05J18N7j58M7J58r9j00J57K2j64L5J25r2r5
5690a01J36N4j67L0J48r6r5J50K1j47M4J19r1q7J30K9j60N7J26j11q3J36K6j59
$$ y = [-67, 0, 100, -18, -47, 86, 51, -107, -8, 114, -27, -103, 85, 97, -84, -26, 112, 11, -73, 47, 43, -95, -16, 70, -53, -79, 80, 39, -98, 13, 123, -50, -96, 77, 58, -112, -29, 110, -18, -82, 63, 71, -74, 11, 85, -43, -62, 91, 42, -83, 27, 128, -53, -83, 111, 61, -110, 1, 116, -55, -87, 85, 69, -93, 27, 97, -44, -79, 84, 8, -111, 2, 116, -53, -98, 115, 36, -113, 14, 132, -66, -92, 78, 47, -128, 17, 103, -60, -43, 124, 49, -91, 36, 120, -69, -84, 111, 35, -127, 15, 114, -49, -64, 103, 46, -111, 8, 101, -79, -78, 98, 25, -104, 32, 98, -77, -79, 106, 26, -117, 21, 110, -77, -55, 106, 27, -105, 40, 97, -67, -65, 106, 23, -96, 44, 115, -58, -48, 112, 31, -109, 32, 94, -76, -68, 97, 29, -94, 35, 101, -51, -51, 86, -7, -112, 6, 63, -95, -48, 110, 11, -89, 68, 90, -74, -39, 86, -6, -101, 35, 89, -78, -48, 100, 4, -91, 59, 80, -67, -23, 96, 5, -82, 48, 77, -83, -26, 100, -11, -94, 42, 68, -91]
5714i1N4J41j06q9J34M3j56L6J16r8p4J19J9j22N3J29r9q5J45Mj58N4J30j20o9
5739i0J45K6j57O3J17r1p4J12Nj35N5R3r6m3J29mj29O6Q9r8o8J40Qj40N5R4q9
5766a7n3J17Oj14M6Q4p8m7J17j1j03O9Q3j24l2J30j3j22O0R4j00l9R4Mq8L2O0
5793E5p1m0Q9rr2N6P9j02qJ10k8j08O2P4q4l5Q1Kq3O0N1o9k3P6k3n6O9L0j00k
5823c9R9k3q8N5P3p5l3O9J6p7K0M4l4l6O7l8n5O3K6r2L1P0l3n3L7O5n9l4O0Mn0
5854b0jL4qqK2j6l2N6J3o5J5P3n3m9L8N4o5j7N6K2n9jM0okj8%jJ5j2k8K1M9n4
5888gl8O3L1o1k0N6ol0j1M3j5j2OPQRk4j4L0K4l0l1N4kl3j9M7Pm9oN7qj4nOJ2
5924B5j2k0JPOl3jL9J6m2j1N2Pm2j5L9Mk8j7L7K3l1%mK5nj7oK8J0n4NL6J3l5l1
$$ y = [-91, -37, 104, -2, -91, 43, 86, -70, -34, 82, -16, -90, 29, 48, -74, -21, 108, 9, -76, 69, 73, -85, -31, 99, -21, -90, 55, 81, -76, -13, 104, 13, -61, 51, 56, -79, -24, 69, -27, -70, 59, 55, -74, -8, 81, -17, -85, 55, 63, -77, -22, 72, -17, -70, 47, 53, -61, -15, 69, -9, -56, 61, 50, -53, 16, 99, -25, -57, 73, 60, -62, -2, 92, -8, -47, 47, 51, -37, -5, 55, -16, -56, 33, 24, -68, -12, 67, -35, -43, 67, 39, -69, -7, 67, -17, -52, 29, 31, -52, 8, 59, -10, -33, 43, 20, -36, 33, 63, -37, -39, 60, 37, -51, 4, 77, 2, -31, 38, 54, -23, -3, 41, 7, -29, 38, 0, -55, 8, 34, -58, -27, 43, 10, -43, -6, 59, 0, -34, 26, 30, -20, -21, 13, 5, -3, 19, 3, -29, 27, 40, -25, -10, 63, 10, -39, -1, 53, -12, -29, 27, 49, -10, -11, 29, 23, 21, 3, 3, 2, 17, 5, -23, -2, 47, -7, -45, 18, 49, -12, -32, 24, 18, -12, -23, 20, 5, -7, -1, 6, 14, 23, -1, -15, 15, 39, 9, -22, 32, 30, -3, -22, 25, 32, -17, -23, 34, 26, 12, 7, 13, 25, 13, -7, -6, 1, 7, -26, -27, 12, 28, -14, -25, 27, 34, -8, -23, 16, 20, -8, -25, 12, 35, 4, 4, 0, 25, 20, 3, -3, 25, 35, -19, -14, 22, 35, 0, -31]
5960c1N1J8m8pL8Nl7j1M6J3l8k0J5J5Ol1j3L7J4k8j8M4J0m8j4N9J5o1l2Q0Qm1
5992dj0L3J1j9oK4Pj4l1kM6Mn5pL5L3p1lO1pn0kM8%o0K0K3J1j7k6K5L8nm8QL7
6028B7Nn9K1N0k3n9PO9mn9J9L4opqOJ0j8l4K6L9j1n6J7P3l3p5L3N2k4l7K0J4j8
6062ij3J5J8j1%l2K9N7j9o0NP7k1q0M1O1n5m7P3J7m0k0L6oKok4qO9rq2L0O1k7
6096B2q4O6P3q1o0R0L3q1k0M1j2j0K3nk1N4qm3K3O8n9q1Q4Q4r9o3J07K8p5nN3
6127D2k5k7L3Jk9J9j1l2M1N1o8o7R2O4j08l5J03Rr8J8Q1l3n8K2L7k6L1k5l9M1
6157DO8o9n2Q3L9j00j2J08j0j21M9P6l1n2L3Qj8J9kn2L3M0o8l5J02J2j32K9J30
6186G9m3j00M8P4n7l0M1nj8J7J9m7K6K5n9k2J20rj26J9J22m3j04Q8O4j03j7Q8
$$ y = [-31, 20, 38, -10, -17, 21, 26, -11, -22, 24, 37, -1, -21, -6, 9, 15, -16, -29, 8, 22, -6, -24, 20, 30, -18, -32, 27, 42, -19, -51, 29, 37, -4, -14, 19, 30, 11, 5, 29, 36, 22, -9, -11, 35, 39, -16, -23, 12, 45, -26, -29, 32, 25, -25, -27, 21, 21, -39, -19, 4, 15, -2, -28, -3, 35, 30, -18, -10, 27, 32, -27, -6, 44, 21, -38, -31, 38, 34, -25, -6, 28, 22, 15, 7, 13, 23, 5, -29, -3, 36, 25, -31, -14, 59, 26, -49, -16, 36, 12, -25, -5, 9, -9, -22, -7, 11, 0, 0, -32, -3, 54, 35, -25, -20, 57, 36, -44, -3, 58, 3, -44, 29, 46, 6, -14, 22, 16, 18, 12, -12, -20, 49, 40, -42, -12, 49, 22, -62, 4, 77, -4, -64, 26, 59, -22, -42, -1, -13, -23, 0, -5, -26, 28, 20, -23, 0, 68, 9, -72, 12, 96, -3, -66, 41, 69, -6, -11, 42, 17, -10, 23, 24, -5, 14, 3, -29, 12, 63, -5, -72, 20, 84, -24, -59, 44, 53, -45, -27, 54, 21, -37, -15, 22, -4, 27, 2, -37, 4, 72, 3, -49, 34, 73, -27, -39, 69, 59, -62, -13, 63, 32, -20, 13, 21, 3, 22, 20, -32, 1, 41, -27, -62, 40, 52, -80, -51, 79, 36, -64, -16, 58, 1, -29, 12, 7, -11, 6, 25, -22, 4, 29, -30, -52, 68, 59, -67, -48, 74, 31, -73, 15, 79, -24, -41, 47]
6214D7j5n3J4K1l4L8M3q7l2J17rj22K7J22p3q6J00O9j01m3R2On3J4Nm6L5O1p1
6243a4k7J05j9r6M5J01r1r3J15P0j11l7Q0Nn3K6M0m8lL2m6j2J00o1r5R0Q6r9p9
6272h9J14M1j15KQ6k2o3L9L3k7kMl3K2P2n7p9P3R0q5m6R5J7j07J4R8m5q7M6M8
6302C7k9jQl9J7M6l5n8N2M9q9j9J10mj25L8J04l2q1L9M2m2j0L6l5LN4m3k9O3K7
6333E4j01nJ20nj13J1J09m0o3N3J0n9J0L0Pl8L1k3k5O4K7r7k4J04J0j10K2P9m9
6362a1n0O2M6o3j5L6J9k7J8k9j5O3Ko4j3R4j5p7M9P3p1p3P8N3p8k6M9pk0L0j3
6393Ek9M3On6J2P9n5q5P3P6q0n9Q5L6o3j1N1j5k8K8LqRqm6K6P8n6p3P1N9p5l2
6426c9P5J8q0PN8k0m7J1L0j2J4Om6J4N8m5n9O7L3p4k3Q0J0q1J2P2j6m2L0Mk0K0
$$ y = [47, 32, -21, -7, 14, -20, 18, 61, -26, -58, 59, 50, -72, -45, 77, 4, -82, 18, 87, -14, -57, 35, 41, -12, 2, 7, -39, -4, 57, -14, -41, 64, 45, -51, -6, 95, 4, -89, 26, 96, -15, -52, 28, 33, -20, 6, 46, -2, -5, 27, -19, -31, 69, 8, -87, 3, 89, -10, -89, 25, 66, -49, -47, 39, 17, -46, -7, 26, -1, -3, 1, -32, -10, 62, 5, -74, -1, 89, 4, -42, 53, 70, -37, -23, 75, 30, -57, -11, 37, 8, 7, 15, -24, -7, 39, 4, -54, -2, 47, -42, -61, 49, 45, -80, -42, 62, 30, -51, -12, 30, -12, -22, 14, -21, -18, 36, -7, -36, 27, 54, -47, -52, 68, 63, -50, -39, 70, 30, -33, 20, 30, -29, -19, 11, 18, -20, 11, -12, -37, 27, 54, -43, -67, 37, 47, -63, -41, 38, -11, -61, 1, 47, -16, -31, 5, 24, -3, 15, -14, -29, 34, 36, -28, -41, 53, 38, -39, 10, 83, 12, -61, 17, 70, -8, -34, 15, 8, -12, 18, 5, -24, 19, 25, -31, -19, 60, 5, -80, -7, 69, -11, -70, 15, 51, -12, -23, 28, 13, -15, 13, 16, 8, 17, 9, -37, -11, 67, 11, -62, 9, 68, -7, -39, 36, 54, -26, -19, 39, 19, -28, -17, 13, 1, 15, 21, -25, -11, 47, 2, -57, 10, 43, -31, -54, 26, 36, -45, -33, 39, 23, -19, 11, 15, -5, 15]
6458A5Jl0OL9j7m7N1L7q9oQ0Np8J5O6k7l6J1J6k5OJ5k4J2L6m6k2O4J4p7qP7k0
6491A4o0L6M2m3k7N0J3k6RlqK8Om9j5O2Oo4J4O0k0o2M4M7m5m0M2J6l1qLmK4Ml6
6526b1nN0Mn3J8M6l4n7N2N0o8j5K4K7k8LK1jrJj9QL5j8m6M0L2m1k8M8L2m9j1L6
6560B4ol6lL5k0mqoJ6J8j6k1K9L6m8rL5Ok5j3L1Pk8qK6j0J0j0MJ2J0j5l8L8J4
6595B7m6RK8J1l0pK4J3k9nNRj5Oj5J4J0l2NK8jk4j0L3Jl7J3K7J1m5K4J6j4j0L
6630cLL6k6j8PK0j0k1PK2Ml1JK5qj0mK6nj0k5J2J2ok2J3K4j8j7J8K3k3j9J9K7
6665B3j9j5KK6kj5j0K3Pj8nJ4J7k9jJ0K1k8oRK1j3k4OJ4jk1JJ6J1k2lK0Jl2K2
6701@J6j3mNj4J4qrJ9Noj4%L6l2j4J9J6Jk3QK6j8mJ1pqPrpK2j0j1kJ9%m2K5J9
$$ y = [15, 16, -14, -8, 31, 14, -33, 18, 55, -34, -40, 40, 45, -33, -18, 48, 21, -15, -4, 12, -13, -7, 8, -16, -4, 32, -14, -36, 28, 42, -35, -43, 34, 14, -46, -10, 32, -11, -38, 12, 25, -1, 8, 5, -3, 25, 31, -18, -33, 29, 35, -29, -15, 45, 25, -37, 7, 54, 9, -31, 11, 27, -4, -12, -9, -13, 11, 15, -21, -26, 24, 28, -25, -7, 39, 5, -52, 0, 50, -18, -33, -9, 18, -10, -7, 14, 13, 4, 5, -14, -6, 29, 11, -35, 5, 37, -4, -32, 16, 48, -1, -12, 24, 18, -18, -21, 14, -6, -10, -18, -24, -8, 10, -6, -27, 2, 38, -10, -19, 16, 22, -3, -16, 15, 22, -6, -14, 12, 2, 12, 2, 6, 18, 28, 13, -25, 13, 27, -19, -10, 18, 29, -1, -8, 16, 29, 0, -5, 0, 9, -6, 0, -15, -1, 9, -23, -18, 10, 9, -15, -25, 8, 9, -28, -15, 12, 23, -22, 2, 18, 4, -6, -3, 0, 36, 10, -8, -1, 19, 9, -12, -5, 17, 21, -10, -9, 16, 8, -2, -6, 20, 15, 5, -20, -8, 4, -2, -24, -11, 13, -5, -22, -4, 19, -4, -23, -4, 23, 4, -11, -9, 17, 15, 0, -10, 13, 20, 2, -3, 11, 28, -1, -2, 8, 29, 1, -5, 4, 25, 12, -12, -6, 8, 7, -14, -13, 3, 14, -8, -11, 9, 10, -22, 0, 16, 3, -1, 4, -10, 4, -4, -13, 6, 11, 5, -9, -9, 27, -5, -19, 0, 16, 17, -6, 2, 28, 10, 6, 17, 10, 2, 9, 0, -7, 15, 5, -6, -8, 11, 11, -31, -6, 13]
6740A3pk0KK4j6rJ8pPllqK2qpj2J5J3l6K1J3Kk6K3J7k0jJ1j1MqJ0j5jJ9k7J7k
6778DlrMJ5j0k2J7Nj8lK4krJ0JnJ1KmK%Lk3L4ok0jQJ6j2PMql2L3Jp%J3k4kK1j5
6821@j7K6qk4MK4jl0QK3%j8J3Pk2RJ9plJ5kk1J5K1k4nJ4lj6RK2k2j4J9Jj4JJ9
6859A8k4j1K2jj3J3J2l1OJ4J9m0J5K2l0j6L4j0j8K1Mok2M5j4j6K3J4l6QK2k2j3
6892a1K0%j3kK5lk3K8lk8rL2j0k7J5K4m1K1ORj1mK0j3rJ6jj4J1Qk1jJ6mjNJ6k1
6930B%J6k0j4L4j0qj1K6j9nK0kj8JK5j8j6J9JjmPKj4RJ4k6KK7k3JJ3nk8J9J4K
6968A2j4J7J1k8QK2j3j5J7jk0J0J1j3kMJ6k6OJ8j2k5K9Ol3kJ6Lk1J5J8l1J2Nk
7003brK0pj6K5J1k2rK4Lk5J4J2k1MKKkMMj8MRj0j2K1J7k6MQkj7K0Mj9nK1k6jJ2
$$ y = [13, 6, -14, -12, 12, -4, -13, 5, -2, 5, 2, -1, -9, 13, 5, -2, -14, 1, 14, -22, -1, 12, 14, -12, 11, 28, 8, 7, 18, 7, 11, 3, 13, -2, -3, 16, -11, 6, 4, 1, -8, -4, 11, 1, -21, -4, 1, -17, -20, 4, 2, -7, 3, 4, -1, 10, 12, 8, 10, 10, 13, -10, 24, 18, -2, -3, 5, 21, 9, 16, 20, 12, -20, 13, 14, 7, 7, 20, -4, -6, 15, 0, -17, 9, 1, -23, -19, 5, 4, -26, -18, 5, 5, -13, 0, 7, -15, -6, 13, 6, 3, 18, 16, -5, 10, 31, 7, 2, 16, 13, -3, 6, 28, 6, -8, 11, 12, -2, -1, 18, -6, -17, 5, 4, -9, 4, 16, -15, -9, 5, 24, -16, -1, 21, -9, -25, 9, -1, -19, 2, 6, 0, -22, 23, 9, -7, 16, 30, -6, 2, 24, 2, -11, 9, 9, -4, -6, 19, 16, -7, 21, 18, -10, -19, 13, 3, -24, -9, 15, -26, -5, 1, 10, -1, -5, 15, 2, -7, 9, 8, -6, 5, 13, -8, -9, 7, 3, 2, 7, 23, 2, 2, 18, -2, -16, 18, 8, 0, -11, 15, -4, -9, 11, 9, -9, -8, 17, -1, -17, 2, 3, 2, -2, 5, 7, -7, 2, 16, -10, -8, 19, -4, -3, 10, 5, -23, -4, 10, 12, -2, 15, 26, -2, 6, 28, 15, 0, 17, 16, -4, 6, 17, 4, 2, 6, 22, -4, 2, 20, 8, -17, 12, 18, -15, -17, -1, 2, -19, -4, 14, -17, -5, 0, -2, -11, 9, 2, -14, 11, 22, 0, -9, 15, 18, -7, 7, 19, -2, 2, 4, 6, 4, 8, 12, -6, -2, 7, -3, -15, 6, 23, -3, 1, 9, 7, -10, 10, 14, -5, -10, 11, -15, -16, -4]
7043dlK%J5j6j1J3J7l0J4RmJRkj0OQMj6%Kj8J6Kj5J1Ojj3%NJ0rJ2Jj7qRnKKmo
7087a6J3J8l1nK7lj6RJ8j7k0K1QKoK3j3lPomProQK2j9l2K5J0j4j6J1Kj5LJ9kj1
7126a1lPPkjj4QL4j2l2K5Jk1mL2kj6JJ3JLjRJmMj1lNj3lOJ4j5j0K4k0j3jK3mj4
7168a2J5Mk5J6j1jK3jj0kJ9%k3QK0qrmJ4qJqQj0J0jqJ8mj6LJ4j3MqJ6qmLOj1k
7210eLqPonnL3j7lMJ0Kj7J5J0oj3J7Jj2nKJ5j5kKJ6%oj8K2prj1MJ5j6jKJ0j0J0
7252C%jLpjPnj3J8%jloJ8j2LkoK5j5j5K6jj1qJ1PqKNOj7jOJj0rJ0J4pk0%K5j0
7296A%j1J4OnJ0qJ9k6Rj2QlnPPJ0j9J0j0J1oqJ5%jkNJj1j3J3J0j6oMQoQj1jmm
7339a2J7MKqlK0j6Pj0jJOMNkj1NLRj5pRJ6ok4K4noRmlMjJkjoj8L0j4lkKJ2lk0
$$ y = [-4, -7, -5, -5, 10, -6, -17, -4, 13, -17, -3, 6, 2, 3, 12, 10, 0, 6, 14, 18, 2, 2, 4, -14, 2, 4, -11, 0, 6, 5, -8, -8, -3, 7, -2, 10, 11, -6, -14, -5, -10, -8, -6, -10, -16, -3, 15, -16, -21, 6, 3, -13, -4, 14, -3, -23, -2, 6, 8, 2, 25, 12, 9, 16, 10, 6, 13, 4, -2, 6, 28, 9, -23, 2, 12, -2, -18, -7, -5, -20, -17, 2, 0, -11, -14, -7, 0, -2, -3, -17, -9, 25, 13, -19, 6, 7, -14, -18, 14, 12, -4, -3, 10, 11, 14, 13, 22, 23, 19, 23, 12, 9, 14, 1, -2, 4, 18, 3, -7, 17, -3, -16, -17, 6, 2, -12, 3, 7, -18, -2, -13, -14, 9, 8, -2, -4, 15, 15, -8, 0, 20, 12, 3, -1, 13, 5, 6, -2, 6, -4, 6, 5, -3, 15, 11, -5, -2, 12, -1, 3, -5, 11, 3, -1, 2, 8, -3, -5, -2, -10, -3, -9, -14, -19, 14, -3, -6, -2, 8, 10, -7, 8, 18, 12, -1, 16, 17, 5, 0, 2, 17, 2, 0, 2, 18, 18, 12, -6, 16, 9, 0, -11, -7, 8, -8, -9, -7, 3, -7, 3, 3, 2, 5, -2, -3, 4, -1, -14, 4, 4, 3, 0, -6, 12, 0, 3, 1, -5, 20, 5, -10, 16, 15, 4, -4, 7, 14, 6, 8, 13, 19, 2, 1, 7, 8, -2, -11, -1, 13, 6, -14, -14, 11, 1, 1, -10, 4, 10, 5, 15, 7, 26, 0, 9, -3, 5, 2, -3, 4, 11, 21, 2, 12, 2, 13, 7, -1, 14, 14, 13, 11, 16, 17, 6, -7, 6, 16, 0, -6, -2, 6, 0, 8, -3, -4, -8, -12, 5, 9, 11, 3, 0, 20, 4, 11, 1, 0, 1, 7, 11, 16, 14, 3, 8, 11, 20, 5, -2, 7, 23, 17, -7, 17, 12, 6, 15, 11, 8, 12, 11, 12, 10, 9, 3, -15, 15, 1, -2, -4, -2, 10, 7, -13]
7385a3J6Lj1MJ3NqrOMljKjKlMJQj5nK4j1j9lJ7J5k5mJ5OplopmJ2pPJ%j6J0K0j8
7430dnNOOmPKKqnKLj7J6NlJ2j9J6rJj7J2Rk8OQJ3rqKJ1j5J1lrrJ1rJ4Mj3oK3j
7475Fk0J4Q%j0lLjj1K8kmj6K2mLMj3lJ0Rj7JOj1j3J9Nj8mJ5lKmmoJ2J9k9lJ8J1
7517A6j2RJ5k4j6K3jj2qK9nj5J2kn%J0nkJ4j1prL0k3j2J7J9l8RJ4mk0QK4k5lJ5
7555Ej3jJ6Mj2OJ0jj9J4J0j7kL2k0j2%J6j1pK0k5lK2Pj9pJ5j0j4L0qk3RK1j8n
7592a0%L0j3j3Oj2MJ6pj9K6lj2pL0Rl9J0L5j7k0J4Nj4OOOj1J0llLRl7J1K3j6l5
7630c2K2K0l1MJ4N%j4K5omQk5oOK4j1nK0pk3L1K0k8j2K1J2l1LK6j8pJ9lq%Rj8
7668@j4M0k4k0J8K3l1jJ5kk4K6K1j7j5RNk1J9mj5J3J0Ok7J7J3k7JK5j2k5J6J8
$$ y = [-13, 3, 6, -5, -1, 12, 17, 9, 0, 6, 10, 7, 6, 8, 7, 9, 6, 10, 11, 19, 4, -1, 23, 12, -7, -10, 7, 22, -3, -7, 8, 14, 7, 4, -2, -9, -13, -1, -8, -1, 0, 0, -16, -6, 14, -4, -9, -4, 2, 8, 4, 11, 13, 15, 7, 2, 4, 7, -10, 6, 11, 8, 20, 1, 17, 8, 9, -8, 4, 13, -15, -9, -1, 12, 3, -5, -3, 8, -7, 4, 1, -8, -17, -6, -15, -1, 3, -10, -16, 7, 6, -14, 0, 8, 8, -2, -5, -2, -3, -14, 14, 12, 8, -8, 14, 10, 13, 17, 4, 1, 11, 20, 3, 4, 10, -1, -14, 5, 10, -8, -12, 3, 0, 2, -2, -6, -12, 0, 19, -10, -13, 5, 16, 4, 13, 28, 4, -12, 11, 10, -2, -10, 19, 14, -1, 11, 9, 4, 4, 14, 9, 7, 21, 10, 3, -6, 24, 1, -11, 6, 25, -13, -4, 10, 6, -14, -6, 18, -7, -10, 5, -8, -9, 7, 11, -1, 5, 15, 14, -5, 9, 19, 2, 0, 32, 12, 0, 0, 16, 5, -2, 18, -7, -10, 12, 19, 0, -7, 8, -2, -16, 14, 6, -17, -8, 13, -5, -10, -10, 20, 7, -6, 0, -12, -8, 8, 1, -18, 8, 5, -7, -14, 16, 25, -14, -4, 31, 14, -6, 8, 13, -1, 5, 11, 17, 6, 16, 13, 10, 13, 22, -15, -4, 19, 3, -32, -10, 10, -21, -17, -3, 2, 2, -12, 13, 7, 3, 11, -14, -20, -14, 10, -1, -6, 14, 7, -16, 15, 35, 7, -5, 16, 28, -3, 0, 26, 8, 1, 20, 17, 9, 9, 18, 0, -14, 26, 2, -18, 0, 23, -8, -9, 6, 4, -20, 6, 27, 10, -5, 4, 9, -12, 7, 3, -12, 1, 11, 17, -10, 7, 20, -7, -6, 19, 7, -18, -2, 16]
7702A6mqOKmQJk3J3K4j4j7N%l6K3L1j4j9J1J5rk3K0J2l3L0j2j1PK2j1j1K4Jk9
7738g%K6Jk2J9Lj1k0K5Jk4QJ9j7NOj8lK9pk6LL3j5k7J3L5m3j0K8kj3OK8k9J6%
7775A0rj0K8rk4J0K1j7k5L3K9m6JL0mj8j0K6j9LJ4k0kJ7qk2J9L3m5j1L9Lk4j6
7809b3L6rj6MJ5j3j1J8LlJ0j0pJL1k5j4M6nk9J1K1k7rJ1J7k0j1J1ojJ3pk1K4J
7845Fqk6M0j0k0J4K6j3k7K0Plj1K2Lk5J6Qj7QJ0j3k0L8Mm0J6K7k3j2J4J4l3NK0
7880A7r%%Mk3K2Ok8KJ2kj5OL7k3j9J6J5k2oJ4PJnJoJ3Rj9NJ1oj9kL2j9j0J7Oj8
7920Bj4J2K0k2kPj%J0j9J1J4k0nJ0J3l9K3KJj4mK2Pj2Kk%J2qj3J7kmj1K5Kj4r
7959cJ0J1j2lK%%lJ4j2m%j3K2Rk1%K0rj8NJ1kj7J4NqL%LpOJKL%j9J1J9j1pJ4j2
$$ y = [16, 12, 4, 10, 12, 8, 16, 17, -6, 7, 31, 17, 0, 5, 5, -31, -8, 23, 9, -10, 1, 16, 7, -16, 4, 16, -17, 13, 1, -10, -3, 19, 8, -3, 21, 22, -7, -7, 19, 20, -2, 17, 20, 9, -11, 14, 15, -9, -1, 18, 1, 6, 12, -6, -9, 20, 13, -13, -10, 23, 8, -19, -6, 29, -14, -24, 4, 2, -11, -5, 23, -6, 10, 10, 1, -9, 19, 10, -14, -4, 17, 0, -25, 8, 37, -9, -8, 22, 18, 0, -10, 16, -3, 0, 14, -6, -8, 9, 1, -21, -2, 31, -14, -25, 14, 17, -7, -23, 13, 4, -12, -8, 7, -6, -17, 1, 4, 1, 11, 1, -6, -5, 26, 1, -13, 33, 28, -1, 10, 31, 4, -5, 6, 23, 3, -8, 3, -3, -4, 9, 2, -19, 5, 6, -2, -28, 12, 2, -18, -4, 22, 9, -18, 2, 9, 6, -5, 17, 20, -5, 11, 19, 2, 10, 20, 7, -13, 25, 29, -11, 5, 32, 9, -3, 11, 25, -8, -3, 17, 8, 8, 8, 12, -11, 11, 17, -11, -9, 3, 1, -14, -8, 29, 6, -13, 3, 18, -4, -10, 4, 11, 12, 7, 8, 2, 15, 24, 5, 10, 21, 15, -4, -6, 26, 7, -3, 14, 20, 2, -12, 0, 20, -2, -4, 3, 2, 2, 12, -7, 4, 18, -2, -7, 3, 16, -23, 0, 2, 3, -11, -15, 7, 14, 2, 4, 2, 2, 14, 6, -7, 10, 8, 4, -7, 18, 20, 6, -3, 7, 18, 6, 3, 5, 5, 5, 2, 16, 4, 0, 0, -13, 9, 18, -3, -3, 17, 8, -10, -5, 6, 4, -13, 1, 6, -2, 1, 1, 4, -3, 3, 4, 6, 9, 9, -10, 1, 20, 9, 2, 16, 4]
8002DJ3j8RpN%j0J2pJ1j6nJ9j5KJJ9k3jJ6jJj2K2j6lkNLJ1j3kK6j3j0Lj0J4j0
8041BJJ4j1PjpJ6k5KNLJ2j7j0K7j6j2J0J8nk7J3J0rLoQJ1j5%KMPj4oL1jj8jJ3
8081A8krOJ2j4rJ9%Oj8OjmPj5%J8J0l7MPj1nJJ4joJ4k2J3JNMMNk0OJ0jk2RK3k0
8124EKJ9rj5J1Pk4MJ4kk3K2nlmJ3%k6K1jk4J4L%kPJj1lPJ0k5L1mqKPkj3RJ5%k4
8167dL2mj8LRqj4K5j3j2J0Pj4oJ9mj8J3K2k6lK0j7p
$$ y = [4, 17, -1, 8, 1, 6, 6, -4, 8, 1, 12, -4, -9, 10, -5, -3, -2, 17, -6, -7, 9, 8, 9, -3, 19, 3, 0, -2, 3, 6, 17, 4, 2, 28, 15, 5, 8, -2, 12, 2, 3, 17, 6, 13, 12, 5, 21, -4, -2, 3, 6, 18, 1, -9, 18, 2, -10, 0, 18, 13, -14, -1, 9, 0, 3, -3, 5, 16, 1, 1, 3, 7, 14, 0, -6, 25, 24, 6, 5, 18, 16, 7, 13, 25, 11, 2, 21, 21, 27, 9, 15, 14, 10, 17, 2, 2, 20, 30, -7, -3, 4, -7, -12, -11, 3, 2, -4, 10, -12, 1, 2, 7, 11, 15, 20, 0, 6, 16, 15, -7, 2, 25, 5, 7, 26, 17, 2, 13, 20, -4, 0, 14, 12, -11, 11, 6, 3, -1, 12, 12, -14, 7, 6, -18, -4, -1, -1, -3, 4, 5, -6, -9, -2, 8, -17, 14, 10, 2, 4, 11, 9, -4, 5, 20, 20, -4, 28, 24, 6, 9, 18, 10, -4, 21, 8, -4, 6, 13, -1, -7, 12, 8, -10, 3, 25, -1, -4, 16, -1, -8]
8191h
$$ Imaginary data points
##PAGE= N=2
##DATA TABLE= (X++(I..I)), XYDATA
0@%%%%%%%%%%%%%%%%%%%%%%%%%%%%%JpJ4j9K2k2K2k2K2k2K4l0L6m0M3m6N1n6O2
48C3o9P5q1R1j01J11j24J37j52J71j94K20k54K98l55M30n40P12j002J593l186
69b187J4577L5839n7510j0442O3430j9709o2165L1038L1455n1557p256N7340j3736
82I117l9432M5590K8294n5728n535N1206k7994n0696M2797L0945n3461l910O1996
95C3189j1364m6091L2414K5406m9038r510M3460j7639l6578L7338K4783m0507
107a4137M341M7093k4683m1440L6163J8808n1962m635M8921j3329l4052L6698
119G786K5496l9866l771L7723j9837l4515K7513J2110l8476P727M2618j9093k7795
132b2380L7610J6163m3979j443L6629k1869l2944L1150J8796l3049K724L5753
$$ y = [0, 0, 0, 0, 0, 0, 0, 0, 0, 0, 0, 0, 0, 0, 0, 0, 0, 0, 0, 0, 0, 0, 0, 0, 0, 0, 0, 0, 0, 0, 1, -6, 8, -11, 11, -11, 11, -11, 11, -11, 13, -17, 19, -21, 22, -24, 27, -29, 33, -36, 39, -42, 49, -52, 59, -65, 72, -80, 91, -103, 117, -137, 161, -194, 236, -304, 408, -594, 999, -2187, 12390, 48229, -9281, -19723, 43707, 23998, -38167, -7129, 24326, -27231, -34487, 22853, 9117, -30315, 15275, 43569, -12159, -17694, 33512, 5518, -45178, -2381, 28564, -24897, -28807, 33189, 21825, -24266, 8148, 33554, -15484, -24994, 18466, 827, -35751, 1587, 26370, -14137, -9796, 37297, 12614, -28826, 7337, 26145, -25817, -30452, 18469, 5140, -28912, 7786, 33282, -6584, -10355, 27368, 7531, -26984, 529, 12639, -25837, -18110, 24508, 5415, -22380, 15230, 31393, -12586, -14029, 22600, 731, -32213, -1063, 17733, -15316, -12592, 23161]
144B3161j4087k3343K6587O399l7302M377L1125k1276k2062L4387J2804l4134
156a3364O643L4773k0537k9359K5432J1302l2754J897K9633j3509j6633K8189
168A1713Q306k9689N612K4452k2808k0442K8584N859l2672R374L3790j6282k1532
181a5735K6053R546l0615M69K3790j5844j8175K3132Q142k2112Q542K2446j7838
194A801j4780K4181K101l0414N492K5511j5670j6681K5035R752k4256K613K1976
207A6661j2605j7429J5438M696j9442N809J8496j2993r889K1540L145k2790N315
220d048J8417j6203j5205K0387O979k1312L257K0792q743j2744J4313L540j7686
233h256L077J3787j1734q859J7193K477j6842P823J6298j4463j2006J7171L598
$$ y = [23161, 9074, -14269, 12318, 18717, -18585, -14208, 16917, -4359, -26421, 7966, 20770, -13364, -6721, 28052, 7515, -21844, 3588, 14890, -17864, -15967, 13666, 157, -16476, 11713, 20019, -9670, -4058, 20394, -2414, -22856, 5728, 11587, -21085, -11711, 22079, 5797, -15735, 10318, 19864, -10751, -10282, 13508, -2336, -20511, 2621, 10763, -11349, -2807, 19639, 1801, -12979, 11202, 13303, -17111, -11619, 13892, -1778, -18459, 6576, 16328, -7928, -5315, 16661, 4056, -13373, 2065, 6761, -12681, -6872, 11624, -1369, -11258, 10282, 13427, -9363, -4048, 14369, -1834, -17039, 3348, 10327, -10985, -7728, 13064, 4321, -8423, 5890, 9430, -8256, -5179, 8608, -3126, -11985, 5208, 7685, -9157, -1334, 14964, 501, -11505, 5666, 9264]
246I264j9394K438J6208q493r640J4415M268j4254L273J1188j0350p292J2790
259D421m90j4474P473J3911j1512q249J5639K524j6199L143J2624r609r194J2058
273B066L624j1502L569J0062q183m936J1730j362j3426O045J0596j0939o376J4169
287E137J680j3972M434J2515q690q732J0249K548j0585K770Q238p062l967J0286
301D849l94j0416N384Q163j0028m831J2260K92j2456M066J0985o850p167Q749
315B606K436r152J747P058n515l800P430j35p007M738N737q065l231R853m49j0321
331f070L562Q418o223n224P952K174p617J108O120l702l463M856m55n116L849
346A69L861o217j480P494j002p154L674N891n835l909O725J393o328Q31M558k488
$$ y = [9264, -10130, -7692, 8516, 23, -9617, 4798, 9066, -5188, -1915, 9273, -1077, -8369, 4421, 3931, -10543, -3070, 10841, -671, -8920, 6719, 9243, -6956, -3813, 8811, -798, -9992, 2066, 5690, -5812, -2243, 7819, -364, -5300, 6430, 5068, -8358, -2313, 8283, -2656, -9032, 5137, 6817, -7155, -2721, 9794, 1104, -7628, 2621, 5169, -5416, -2646, 5592, -1470, -5437, 4849, 4455, -5961, -577, 7586, -2442, -7273, 4987, 5279, -7177, -3111, 7874, 1024, -6143, 2606, 5042, -4110, -2363, 4695, -820, -4620, 2810, 2675, -4332, 406, 6143, -1922, -5153, 4700, 4251, -6070, -2508, 5910, -313, -5537, 2415, 4589, -3028, -1920, 4200, 498, -2965, 1891, 1436, -3680, 169, 4030, -2187, -3667, 3827, 2825, -4329, -655, 5236, -599, -4508, 2217, 3610, -2718, -1887, 2671, 183]
362A83k154L335k59l249K474K341l978n09M724j629m582L345L663m483k484M652
378A390J083m115M56L117j503j534J963L5j701J051O82j995L34K458j397k531
394b207K338K314k673j475K683O92k281k06J714j52j339O1P55J60j30n19k11R89
412E13M98j007n37Q47N50p59q07O37R56p58j209Q78J738r56k052J354K172j754
430C04j844J890J035j981l68J667l25j110R68K72j103J181R22k464j65L289r59
447A209l713K002L353l151k533M091J252m298M18L803j738k436K540N74k833J351
463a09K261l180j039M421q16m696K989M040m696k508N725N93n838J398M844l307
479H2l058M355M71m398K100L397l935j237N192j120n258L642M103n914k307O837
$$ y = [183, -1971, 1364, 1105, -2144, 330, 2671, -1307, -1816, 2908, 1279, -3303, 42, 3705, -778, -3262, 1390, 2473, -1642, -1186, 1931, 428, -1106, 857, 892, -809, 242, 924, -1071, -737, 1721, 324, -2207, 131, 2445, -228, -1703, 980, 1672, -609, -815, 899, 747, -592, -531, 224, 384, 254, -265, -476, 513, 1011, 4, -533, 314, 864, 105, -702, -65, 891, 133, -1076, -198, 1540, 584, -1468, -114, 2058, 304, -1540, 350, 1385, -596, -964, 703, 378, -732, 236, 508, -595, 586, 1508, -956, -1121, 2168, 1209, -2504, -502, 2851, -300, -2833, 1258, 2510, -1788, -1370, 2433, 695, -1741, 799, 1373, -1460, -109, 2152, -1028, -2067, 2354, 1538, -3158, -169, 3871, -825, -3333, 2392, 2985, -2853, -1455, 3389, 82, -2976, 1379, 1850, -2548, -448, 2949, -986, -2223, 2969, 1849, -3409, 233, 4336, -1578, -3885, 2952]
495B952m77o618L195N242m928k581O118k45n870L006M018n607j507O656j849o161
511d656N139M664p112j734Q095j657p774M596N525p140k301Q095j213p048M883
526C62M778p326j521Q146k636p648O197N359q500j444R703k318q709N744N857
541F044q619k607R207j766q065O073N778q251j366R350l135q736O420N434r726
556c965j730J0880k311r228P083O888r466k725R862k573r482O017O087q934j338
571d935J0638k664q667P453N595j0666j943J0654l524r909P578P148r664j836
585d742J1210k495r642O326N554r857j876J0010k970q233P889N910r784r34J0501
600F867m262r778P293N575j0267j180J1316k601q644P577N731j0149j682R525
$$ y = [2952, 2475, -4143, -948, 4294, -634, -3215, 2903, 2658, -3212, -206, 3812, -1795, -3302, 3354, 1505, -4656, 483, 5147, -1965, -3699, 4396, 2739, -5035, -439, 5086, -2054, -4355, 3740, 2527, -4521, 362, 5140, -2186, -3707, 4439, 1803, -5845, 352, 5711, -2789, -4233, 5470, 3152, -5557, 187, 6044, -2575, -5182, 4025, 2259, -5806, 267, 6045, -2206, -3572, 5778, 2643, -6093, 327, 5761, -3965, -5695, 5185, 2874, -6354, 729, 7617, -1849, -4574, 5288, 2715, -6767, -750, 5337, -3597, -4935, 5703, 3039, -5628, 1825, 7420, -3246, -5189, 5465, 1941, -7968, -390, 6758, -2906, -4742, 6468, 3973, -5669, 657, 6211, -3646, -5522, 4488, 1518, -6715, 1174, 7084, -2700, -3634, 6867, 2605, -7173, 120, 5695, -4572, -5752, 5564, 2963, -5681, 1896, 7627, -2522, -4204, 5321]
614E321m391q831P798N276r551N16J1329m075q779Q268M410j1857j057J0584m837
629A24q654R323N938j0009N03J1152n166r393Q115L705j1898K46J1304m902p786
644g398J0363N242j1277L49J0742o519r807Q942M305j1423J316J2236m765q145
658e839R890M291j2461l28J0568o481r231J0125N420j0786J679J2275n471r302
672e651Q922L555j3036j76J1351n682q272J1194N827j1187J104J1665o642j0482
686g510Q736L946j2635N86J2609m600p963J0802N281j1934j67J0437o913j0052
700i377R228M799j1152J699J2782m715q452R514L948j2685p72J0273n975q678
714i563J0108N665j0101J717J1553n702r167Q181K901j2343J56J0951n024p140
$$ y = [5321, 930, -7901, -103, 5173, -4378, -3862, 7467, 3392, -5387, 2881, 7291, -4566, -5623, 4961, 124, -8530, 793, 6731, -3278, -2775, 8377, 3211, -6182, 1933, 5638, -6260, -6014, 5290, 388, -7398, 2965, 8207, -3070, -2721, 8021, 1502, -8305, 637, 4942, -6481, -5165, 7071, 2306, -5839, 4051, 8342, -4119, -4447, 6121, -360, -9591, 534, 5954, -4832, -3153, 9122, 3651, -5651, 3271, 6826, -6210, -6386, 4965, -717, -8989, 2205, 8032, -3155, -2051, 9614, 2972, -7510, 1226, 5172, -7463, -6877, 5732, 1132, -6831, 3971, 9252, -2682, -2849, 7588, 675, -9377, -149, 4650, -6502, -4803, 7979, 3264, -5188, 4326, 8274, -4411, -5183, 5090, -885, -9563, 545, 6210, -3891, -2174, 9379, 3677, -5490, 2691, 5592, -6751, -6595, 4356, -668, -7808]
728g808J0808N174j0559J214J0064p215r232Q463K775j1491K162J1840n179o641
742e625J0889L458j2119Q48R393p810q404R875L590j0370L380J1488o189p003
756d599R838J352j2671J713R557p671o546J1713L637j0689L513J0753p904q277
770f281R242J275j2174K494J0514o213n321J1501K706j1059K956Q923r301p669
784h407J0162J360j1504M436J1680o751o153J1248J845j2604J879Q965q415o749
798i008J0752K399j0016M725J0335p818o320J0193L7j2749L240R783p978n589
812h014J1964K728j0656L512R344q304p185R000N59j0782L984R559o588m052J0947
827F016R80j0911L205P809r044o377R893J237r778M688R743o375m749R286M9j0551
$$ y = [-7808, 3000, 8174, -2385, -1171, 8893, 1678, -7554, 909, 3684, -7807, -5645, 6195, 1016, -5625, 5264, 8722, -3397, -2549, 6844, -966, -9370, 505, 4095, -6275, -2895, 8593, 2404, -4599, 5239, 6591, -6080, -4367, 5190, -2481, -9027, 2686, 6323, -4366, -853, 9900, 1996, -6281, 2961, 4236, -7938, -5444, 5070, -1143, -6464, 5037, 7743, -3316, -360, 8563, -738, -8407, 1755, 3115, -8389, -3953, 7727, 976, -5177, 6071, 7916, -4688, -2809, 6156, -2259, -9008, 1744, 4143, -5873, -1148, 9187, 1369, -4951, 5242, 5279, -7470, -4230, 5553, -2425, -8014, 3950, 6678, -3978, -466, 8878, 574, -6611, 2389, 2948, -7834, -3850, 5709, -879, -4931, 6016, 6996, -3915, -710, 7099, -1945, -8322, 1571, 2808, -6970, -2282, 7461, 1086, -3663, 5623, 5672, -4879]
843d879K749O933q032m197J0232P28q775N339Q241p977m889R073p51j0510L671
858c044P817p030l405R886M21q439M394O226q275l922Q591j329q889N548P546
873F096p404k776R837p40r484L669O063p804l711Q564j74p311N261O370o855k307
889b706Q062k375q675M639N513q049k285R691m17p901N118O334p425l437P521
904C608j476p762M199N263o358j110Q344j751p032N393M487q290k116Q292j975
919A716p634N380O060o738k214P811j255p091L740M033o431j220P020j745n598
934d166N412M008o975j042P270k759p074M750M614o404j464P287q74n697L918
949H04L685n862j328N549k294m919M688L043n837J90O782k463n728M598L369o437
$$ y = [-4879, -2130, 4803, -3229, -7426, 2806, 3534, -5241, 98, 8339, 362, -4527, 4546, 3795, -6715, -3044, 4773, -2257, -5662, 4224, 4645, -3794, 600, 6826, -1449, -5371, 3220, 1891, -6998, -1450, 6096, -1308, -4084, 5753, 5013, -4471, -802, 5261, -2543, -6254, 2310, 2136, -5175, 86, 6456, -399, -2706, 5356, 2981, -5694, -1055, 4458, -3591, -5876, 3815, 3398, -4503, 615, 6949, -476, -3913, 3608, 2132, -5630, -1431, 3832, -2526, -3636, 4708, 2957, -4075, 1318, 5805, -2485, -4601, 3691, 1716, -5918, -538, 5522, -1216, -3430, 4381, 3126, -3965, -225, 3808, -2623, -3843, 3177, 1432, -4166, 1246, 5254, -1721, -2763, 4507, 1748, -5326, -576, 4038, -2366, -3830, 3457, 2583, -3114, 804, 4489, -1373, -2701, 2848, 554, -4365, 323, 3366, -2471, -2281, 4501, 2038, -3690, 908, 4277, -2160]
965b160j189O148j679m986M063L352m781m21M973k286m154M173J819n649M58N711
981C392k580m336M661K688n555n44N352j870m503L352K479m079K7M130j977k974
997b337L662J255m665N58M373k689l436M307K022m738n9M600j511l630K570J792
1013B074l396o9L182j619k057L013P15l363J105L146k751k568L645J243m132J57
1029a675L834j362k690K353J477k587k16K154j041j344J781N6k164J337K099k339
1045c27j391K967M66l044M94K709j378k137J888J279j905l60J407m61n92R86k62
1062C39j183J067J057j653n19K074k65k205R25J952j386j578J490J018j235l62
1078d64R23j58m08N08j76n49O33J70j064K38J368n92j458R17J453r75j142R61
$$ y = [-2160, -3349, 2799, 1120, -3866, 197, 3549, -1232, -1653, 3320, 1034, -3120, 1053, 2872, -2777, -2319, 3392, 812, -3524, 1137, 3825, -1730, -2274, 3078, 1208, -3295, 57, 2536, -1543, -1516, 2614, 637, -2337, 1325, 2580, -2085, -1527, 2846, 157, -3279, 1028, 3050, -1688, -1747, 2853, 1342, -2288, 282, 2074, -1322, -1391, 1791, 172, -1885, 1128, 1843, -1520, -415, 2731, -20, -2588, 1057, 2300, -1832, -1675, 2159, 797, -1893, 460, 1937, -650, -866, 1288, 247, -1097, 684, 740, -1424, -87, 2012, -327, -1718, 1249, 1715, -1329, -835, 1874, 496, -1641, 247, 1526, -379, -739, 668, 207, -385, 601, 339, -844, 223, 1280, -373, -892, 1182, 917, -1288, -363, 1589, 203, -1375, 115, 1133, -102, -464, 459, 301, -107, 401, 225, -324, 309, 479, -585, -347, 1021, 429, -1029, -112, 1341, 366, -776, 185]
1096A85O84q62l58N88J42m26j65J89K77J84l60m98N15P41n29p83M08O89l53o68
1116d00L25O55m28o89M81Q66l59j012K73J080k40r46J94N95k20k77J79R1m0O7
1136A95k13r7P27J11j313k4J680j99j834M27J679p42j358J113R77j348m91J291
1154E81J5q29L33P7n83P05O87j383n84J895J82k156N57K139j351j848J900J425
1172A762k125q81J921J38j418O06O60j097K75J283j055q24J683O3k228P37K355
1189A855j700k262K338J740k493o89K415k53j872J023J093j571l27J433p70q69
1205i09J803O3k329J022K564j837k230K394J296k842k54K794q01k287J629J442
1221A518j798k50J525j077r57K075Q8k617J016K643k022j891K891O96l464L08
$$ y = [185, 869, 7, -351, 237, 379, -47, -212, -23, 254, 438, 78, -420, 95, 836, 307, -476, -68, 621, 268, -400, -75, 580, 152, -537, -56, 810, 451, -561, -288, 792, 552, -394, -200, 395, 175, -102, 77, 168, 128, 195, -18, -115, 612, 723, -590, -614, 1066, 867, -967, -540, 1139, 397, -961, 152, 1129, -219, -710, 581, 596, -233, 100, 177, -406, 299, 986, -397, -981, 914, 1096, -1060, -503, 1636, 285, -1563, 337, 1762, -363, -1244, 677, 815, -603, 3, 663, -434, -159, 1124, 69, -755, 928, 991, -1237, -500, 1855, 155, -2107, 231, 1971, -522, -1211, 1204, 951, -921, 102, 1195, -376, -703, 730, -40, -909, 894, 957, -1372, -350, 2214, 377, -1853, 541, 1837, -1005, -1259, 1535, 734, -1553, 76, 1518, -280, -530, 995, -82, -1039, 1036, 1124, -1493, -477, 2166, 144, -1747, 1144, 1840, -1624, -1316]
1237a316L219j341k537K153J411k217L29K091j759j401K561j7l084J294K664k643
1253e93j632L970O90m237P56L803k155k840K728J022l169O88L008j893j721L111
1269A536J66l450J584K857l596k107M553P63m652J134M401k488l050L603J147
1284B401m330L19L506k025k033L408M55l557J923L436l772k555M538L56n161J550
1300a541M668l116l040M701J658m759K94L709k593k552L586K59l968K140L811
1315C257l399j893M767k42n447J928M358m153l194N097J496m538J284M109k867
1330E63k496L711l9m461J636L161l552j109N207l65m865K783M162m510k947M709
1346A588J44n035J960M235l232j865M527lm090K094K437m487j147N125j101m728
$$ y = [-1316, 1903, 562, -1975, 178, 1589, -628, -299, 1792, 33, -1368, 1193, 1176, -1908, -614, 2050, -593, -2225, 1745, 2435, -1802, -1046, 2757, 602, -2238, 490, 1512, -1657, -969, 2039, 146, -1575, 1536, 1702, -1748, -164, 2693, -903, -3010, 1543, 2306, -2346, -1212, 3189, 701, -2349, 1254, 2401, -1929, -1610, 1896, -129, -2162, 1246, 1701, -1856, 67, 3503, -269, -2824, 1714, 2070, -3091, -1541, 3127, 11, -3029, 1672, 3330, -1429, -1135, 2574, -19, -2571, 1015, 1274, -2694, -554, 3257, -142, -2035, 2732, 2490, -2957, -1029, 3329, -824, -4018, 1079, 2575, -1963, -679, 3430, 563, -1933, 1778, 1739, -2722, -1086, 2075, -1477, -2586, 2621, 2256, -2609, 174, 4336, -174, -3121, 1588, 1732, -3303, -1343, 2892, -340, -2205, 2322, 2319, -1771, 323, 2760, -1727, -2874, 2251, 1150, -3578]
1362c578L621M032m634j627N377r71n603K339L717m118j613M929l15l692L360
1377A224K701m902r92M796k090m959L727L367n031o16O398p78n236K927L355m815
1393i24j817M375j294m093L593L133m221o1N189k126m640L843K392o020r55O022
1409B396j101m742L798L692m573j131M727j723m616K933K271m306L46N116k026
1424A061l709M572K319n945p44N201k323m780M005L325m462l94N283j136l999
1439a726K732J506m681p3M160k401l141M597K350m637N00M979k710m662L544K210
1455B547n031n41M818j020k945L508J897m047J02L545k794l283L666J146m444
1470b876J362N066k421l466M084J759n051m24L950k197l156L665J863l523R26
$$ y = [-3578, 43, 4075, -559, -2186, 3191, 2220, -3383, -1044, 2673, -1445, -3058, 1871, 1556, -2136, 1224, 3925, -977, -1969, 2827, 737, -4222, -495, 2872, -2159, -2775, 3623, 2845, -2391, 536, 3891, -924, -2741, 1634, 340, -3753, -160, 2973, -1248, -1309, 3880, 1754, -2886, 957, 3349, -2671, -3626, 2396, 1295, -3447, 351, 4043, -530, -1661, 3066, 1343, -3273, -340, 1931, -2375, -2029, 3087, 1061, -2648, 1924, 4243, -1702, -2446, 2755, 432, -4348, -343, 2982, -1480, -1874, 3409, 2273, -1726, 1006, 2512, -2169, -2242, 1918, -483, -3624, 973, 3323, -1314, -814, 4165, 1455, -3207, 337, 2547, -2484, -3025, 1793, 773, -2172, 1336, 3233, -814, -712, 2833, 39, -3244, 422, 1568, -2876, -1514, 3552, 1131, -2335, 1749, 3508, -1543, -1967, 1983, -214, -3370, 295, 2158, -1365, -439]
1485d39L755k444k606L441J69m910J024M279k685k714M558J782m267N37L909k600
1501G89l504K895J095l722Q29L631j995j680L968N63m321Q46L339l178k918L872
1517E09J217m061J092M341j878k727K955P83l790L83K769k421j820L694P67l395
1533a582J609L313l034k473L555M36m420P11L816j848k148L363J143l241O07K525
1549B332k444k005K710J17l069J721L152k498j649L724M17m057O19K940k373k265
1565b628L037J109k820Q37K780j706j580K382k39l093J210K340k489j269L530
1580A401M54l233J257K899k536k249K732N30l044O71K553j470j107K639J36k653
1596a020J068J882k584j274K883p7k930J580K877k117j673K810L96l012M86K104
$$ y = [-439, 3316, 872, -1734, 1707, 1876, -3034, -2010, 2269, -416, -3130, 1428, 3210, -1057, -520, 3389, 789, -2715, 180, 1275, -2447, -1618, 2013, 18, -1662, 2306, 2869, -1452, -606, 2733, -445, -3363, 509, 1726, -2335, -1243, 3098, 1220, -1507, 1448, 2231, -1559, -1176, 1593, -828, -2648, 1046, 1813, -1582, 27, 3340, 306, -2167, 1388, 1824, -2596, -1885, 1931, 83, -2065, 1298, 2441, -800, -193, 2332, -112, -2117, 593, 710, -2359, -638, 2514, 16, -1633, 2091, 2508, -1549, -930, 2010, -363, -2628, 409, 1518, -1302, -465, 2315, 609, -971, 1411, 1172, -1921, -711, 1629, -860, -2129, 1401, 1855, -1378, -121, 2778, 242, -2007, 725, 1255, -1789, -1118, 1435, -35, -1142, 1497, 1633, -1020, 48, 1930, -654, -1928, 955, 878, -2052, -472, 2405, 288, -1385, 1425, 1821, -1191, -705, 1399]
1612A399j798j321K400L23k095J170J894k046j040K499l36k870J153K336j989
1627c21j301K700M87k510O98K014j705j412J917J15j996J083J689j726o26K418
1643A524k68k483J076J790k112j186K459K30k252R32J987j418j031J744j20j909
1659a037Q67J257j754m85K212l14j901J382J561k008r14K198r3k234P94J668j358
1676a59p43J756m3j541Q80J017j553l82J747n40j666J404J317j882n33K109k76
1693I12j958Q73J393j457o97J653m2j369Q71R11j348j88J441o72j413J243R38
1710A091j689k56J926l42j659J021J222j452o30J421j13j266O67Q39j037j57J251
1727H37m13j083R68O61j372j95J443l72j317Q54J012j111m93J202m1j026M80O36
$$ y = [1399, -399, -1720, 680, 1003, -1092, 78, 1972, -74, -1114, 1385, 1049, -1821, -668, 1668, -321, -1622, 1078, 1565, -945, -247, 1767, 62, -1350, 567, 682, -1314, -231, 1458, -268, -894, 1524, 1256, -1227, -151, 1639, -473, -1659, 800, 1030, -1222, -290, 1697, 279, -752, 992, 872, -1037, -170, 1087, -667, -1152, 1060, 746, -1155, 227, 1788, -220, -1134, 1064, 971, -1263, -469, 1199, -159, -902, 854, 811, -730, 150, 1167, -386, -768, 979, 439, -1227, 177, 1494, -388, -921, 1188, 912, -1046, -173, 1220, -237, -934, 719, 677, -692, 179, 1090, -258, -446, 995, 323, -1090, 153, 1091, -598, -854, 1072, 730, -929, 92, 1314, -138, -768, 653, 540, -726, -59, 780, -257, -414, 837, 424, -659, 309, 970, -402, -597, 846, 474, -843, 11, 1023, -88, -581, 621, 580, -446, 34, 670]
1745F70p73k12Q49k61p37O66M50r51n9J017l47q61O28O37p63k90Q03o0o69L19
1765E6L78m79q3M73k15l39M83J49n55P5N77k86n02M03K99n15j04M52m1k88J65
1786A03J47j58M6J42k24o7K90j04l39K02K54k92j49L16J12k49l0K39k4j19RLr
1809I9P4j04j01J51J00j78o2K38P0k22j1J91j7j51k9M5P4o5j43Q8J70p1j65J41
1833A22J87j63j62J92M5k02K1J07j01J6J08j30q0K63L4l43J35L82k99l26M40J69
1855D15n28MN03k09m01L73K38m71K8M96k82l70M99J31o58J28O26m23n09O87K79
1876E56p96Q1P96m02o39O59L18q53K3Q27l95o59P58L68q96N2R15m92p49P84L95
1897F51r87K2R91l99p90Q18M44j018qR95m75q39Q39M51j035MJ119m80q78Q51M92
$$ y = [670, -103, -315, 534, 273, -464, 202, 652, -299, -358, 659, 312, -549, 79, 716, -47, -337, 466, 406, -263, 56, 434, -45, -128, 345, 130, -209, 274, 423, -132, -57, 520, 234, -268, 135, 434, -81, -185, 267, 226, -62, 103, 250, 92, 138, 280, 56, -11, 279, 175, -164, 38, 292, 0, -149, 167, 279, 30, 0, 239, 215, 96, 105, 108, 99, 173, 69, -32, 119, 219, 41, -21, 217, 287, 65, 54, 245, 228, 77, 48, 93, 167, 102, -41, 47, 217, 146, -19, 122, 309, 146, -16, 176, 221, 19, 40, 147, 46, 62, 170, 40, -40, 223, 257, -86, 49, 431, 132, -194, 246, 415, -113, -109, 394, 185, -216, 157, 395, -76, -48, 448, 166, -204, 295, 426, -232, -104, 522, 99, -410, 277, 556, -240, -159, 637, 235, -404, 255, 573, -280, -257, 570, 175, -484, 274, 642, -254, -202, 713, 221, -528, 256, 651, -336, -314, 677, 278, -512, 306, 750, -268, -276, 719, 244, -595, 244, 695, -340, -336, 783, 303, -575, 276, 768]
1918G68j104m2J079m57q39Q53N00j047K7J042n53q59Q94L98j132J38J106n24q10
1937e62R69M58j150J6J063o27q77R27M05j071J96J097n47p52R61L13j212J16J029
1956G52p31q14J085L75j123K61J159o82q31J021K66j312K26J120p66p65J220L45
1974H06j265L02J168q70q66J143K48j368L83J267q57p13J349J99j459L53J200
1991A020j086r18J427K78j471M99J470r72r00J362K13j611K96J247j020q36J514
2008E12L05j462O03J382j176r67J451J56j793M32J566j021r62J652M46j632L50
2025a58J367j116j045J374K36j574O02J519j107q02J669J29j866M67J432j315
2041a88j065J700M16j628N75J589j078r95J428N9j746M95J310j196p11J814K05
$$ y = [768, -336, -378, 701, 244, -595, 258, 758, -289, -262, 780, 227, -632, 262, 660, -472, -334, 772, 248, -562, 407, 865, -285, -269, 794, 167, -710, 217, 622, -449, -253, 844, 297, -455, 506, 819, -393, -277, 752, 21, -793, 292, 667, -456, -195, 964, 282, -549, 472, 738, -574, -348, 772, 6, -759, 461, 806, -459, -157, 1011, 141, -725, 418, 666, -702, -319, 948, 91, -622, 727, 926, -533, -180, 1020, -66, -984, 443, 721, -750, -251, 1219, 247, -653, 709, 922, -689, -393, 854, -166, -1002, 512, 817, -645, -42, 1340, 164, -803, 648, 804, -989, -557, 1009, -12, -974, 678, 1124, -508, -158, 1209, 93, -952, 422, 658, -916, -314, 1205, 98, -704, 965, 1094, -772, -305, 1127, -188, -1253, 447, 863, -765, -190, 1399, 321, -674, 754, 813, -933, -438, 872, -324, -1035, 779, 984]
2058I84j649P39J463j475j044J581P9j823O10J575j046p47J698J76j661N76J164
2075A200j464q31J641k6j623R73J557j318p72J796p7j963N79J295j419p32J762
2092E78J22j475R71J336j485o80J659m34j896R81J331j556m95K096jj724Q90J325
2110A543j684q29J643k72j660J067J318j387k90J904m03j814J037J109j902o37
2126a257K000j80j713J208J506j481o67J687l35j825Q22J070j572k81J984l14
2142F52j481J371J161j911n80J822n81j968J161J431j530l71K013j87j550R74
2158D26Q91j756m31J607o17j480J498J125j674q0K035o77j855J129J035j868m57
2175a149J887k82j428J257J085j515k52J518p75j500J237P89j726N9K075o00j538
$$ y = [984, -665, 74, 1537, 62, -982, 599, 678, -1145, -535, 1040, -6, -753, 945, 1121, -540, 36, 1200, -264, -1095, 546, 520, -1103, -130, 1427, 109, -663, 1133, 1056, -907, -328, 967, -452, -1184, 578, 700, -775, 196, 1532, 47, -633, 1026, 592, -1304, -323, 1008, -548, -1043, 1053, 1052, -672, 218, 1543, -141, -970, 673, 401, -1259, -192, 1126, -261, -551, 1353, 950, -864, 173, 1282, -620, -1257, 743, 563, -1150, 58, 1564, 83, -584, 1103, 768, -1057, -235, 835, -737, -1018, 966, 652, -829, 542, 1703, -208, -788, 1034, 453, -1515, -354, 1077, -453, -824, 1189, 1002, -548, 426, 1317, -439, -870, 737, 120, -1360, 138, 1263, -411, -491, 1544, 867, -988, 141, 1176, -692, -1149, 738, 456, -972, 285, 1370, -145, -397, 1121, 346, -1154, 83, 872, -854, -795, 1280, 680, -858]
2192h58J409R76j925m01J657n93j555J227J040j371M8J685o83j322J260M86j919
2209h39j2J710q00j334J621J020j689n8J781p52j566J062O38j588N3J566o32j001
2227h20J481N92j680J41J529j101j400J460P30j675R1J797n50j252J175N81j562
2244d63m1J262p74r60J350M71j383M21J527j058j221J365M40j788P9J578o70j005
2262h70J311O37j286J00J119q81q67J107O2j389O20J358r67p47J534K67j639K60
2280b71J318r98j066J224M75j201K98J131o94n85J085m6j295M88R60j098n45J477
2298F57J00j413N66J293r96r53J126K65j243K47J023o76m82J099L2j027M93P53
2316H64j082m75J280q3j318O38J205q86o67J150J60j205K25Q63p07n44R07N4p80
$$ y = [-858, 551, 1527, -398, -799, 858, 265, -1290, -63, 977, -394, -346, 1339, 656, -666, 594, 1080, -839, -851, 859, 59, -1275, 346, 1366, -323, -381, 1400, 648, -918, 144, 782, -806, -753, 813, 181, -820, 661, 1253, -427, -286, 1243, 142, -1258, 202, 932, -743, -652, 1145, 595, -657, 518, 1099, -463, -504, 758, -16, -976, 374, 845, -538, -117, 1410, 352, -869, 496, 936, -852, -773, 805, 135, -870, 441, 1078, -208, -108, 1011, 130, -737, 370, 432, -957, -337, 1021, 54, -693, 841, 1108, -531, -271, 1047, 49, -1017, 207, 682, -519, -221, 910, 216, -369, 716, 670, -625, -137, 823, -275, -820, 657, 757, -656, -90, 1203, 207, -746, 380, 645, -598, -351, 672, -4, -486, 613, 645, -382, 111, 864, -218, -693, 587, 504, -814, -176, 1029, 143, -524, 626, 786, -419, -194, 669, -38, -582, 325, 379, -401]
2335d01N80O74r11l19J094j97j148M72Q89q62n06J114K07j008K51P93n56m85O23
2354C04m2o87M37N50o97j88R30j38q63N13O45q44m45Q91J66q40J82O64l78l07
2374a47N32n8n51L18K96n57j0O70k68o17O05N16p76l24P61J2p08K17M88l69k03
2395a73M50K3l50K41J09m42J08M96m02m91O06L81o43j28P10r3o46K76M77m17l13
2416b21L68P3k40J85Q1l20J22M06l35l87N02J99o18MO44j63o15K99N11l52l19
2437a76L07R4k43J28J06k34M2K55j88j84L50Q3n24N3N69j36n45K42M29k62k78
2458a12K90J18k67m2J99n5n0N1q8m0K59J6l52LL67m7l62J10K94j83k24K24K13
2481C22j96j92J46J45m0j25n5N0J17k2j39M5J53q1j40J23J76j25k41J10K64o9
$$ y = [-401, 179, 853, -58, -377, 717, 520, -628, -156, 733, -129, -635, 479, 686, -322, -71, 722, 166, -319, 304, 262, -425, 12, 562, -135, -323, 607, 469, -394, 119, 764, -80, -525, 366, 532, -308, -126, 538, 160, -147, 385, 327, -224, 94, 390, -167, -177, 493, 225, -392, 213, 729, -47, -371, 390, 402, -306, -89, 399, 30, -173, 277, 300, -50, 191, 300, -142, -34, 462, 60, -431, 175, 556, -87, -215, 495, 402, -244, 32, 509, 92, -221, 147, 220, -20, 165, 246, -74, 48, 454, 119, -268, 234, 433, -185, -181, 463, 300, -315, -16, 495, 143, -176, 131, 225, -18, 110, 216, -18, 24, 279, 91, -93, 257, 340, -184, -131, 438, 302, -243, -1, 428, 166, -112, 178, 296, 29, -13, 186, 131, 81, 132, 44, 4, 263, 279, -73, -70, 297, 250, -112, -2, 292, 109, -115, 109, 322, 126, -66, 80, 225, 185, 60, 5, 55, 172, 150, 11, 56, 209, 128, -12, 111, 287, 162, -79, 31, 295, 226]
2503B26k69J6K37Ok02QJ86l6j54L9J63j3j81o2J45J03q4j78J9K25K9k31LK60n5
2528B00k72J18K70j30l12J38K71r7j86K7J04M2j1r4J7J21k7j98Q7K70j63l45J96
2551B6L49k26k87J99K07j61j01J54Qq3J2j5j4J35r2k58J73L65k39l52L01L17l35
2574H3j99L72K1l71P6K75j20j31J06l2l1K25j3l85J27M34k85l89M13K31n05p6
2596a74N79o7n13J63L62k63j33K71j39j99L45J01m41R2M48l38l99N51K42o87n7
2617b56P17q6n70K53L77l97j40M29j46l78L23J88m42J34N11l91m40O31K94p90
2637a79j25P36j54o31L98M57n27j49N59p9m37K72J54n04J23N61m28m55O98L04
2657E94p71RP53l20o85N24M38o21j84O16q4l94L84J19n29J31N24m70l98O73J75
$$ y = [226, -43, -27, 210, 216, 14, 22, 208, 172, 18, 57, 220, 207, 26, -36, 109, 212, 128, -50, -31, 194, 223, -8, -5, 255, 200, -72, 46, 316, 186, -126, 12, 283, 186, 0, 27, 131, 173, 162, 68, 85, 206, 179, -19, 68, 338, 175, -170, 26, 375, 149, -138, 61, 268, 107, 6, 160, 168, 85, 97, 82, 68, 203, 111, -147, 26, 391, 152, -200, 101, 418, 83, -116, 256, 277, -94, -18, 257, 137, 6, 112, 80, 49, 274, 261, -124, 3, 437, 152, -237, 176, 407, -98, -174, 405, 338, -175, -12, 350, 87, -46, 225, 86, -113, 232, 333, -108, -16, 432, 94, -305, 246, 488, -199, -256, 461, 375, -195, 58, 435, 38, -102, 327, 181, -197, 126, 314, -128, 6, 517, 126, -314, 317, 611, -179, -304, 432, 278, -353, 45, 502, -25, -174, 385, 306, -131, 141, 295, -209, -86, 475, 47, -408, 290, 594, -177, -168, 585, 265, -420, 104, 542, -79, -263, 353, 269, -125, 259, 378, -151, -20, 504, 34, -364, 309, 484]
2678D84p97K05Q36m64p08O36L93p37j32O24k03m20M91K38n57J25N26m86l68O71
2698C57J0q51K90Q53m88n99P62L52q08oO90l90n77N39K10n78J89N91m81k88P89
2719E66l8r23K83P45o66n17Q60K32q66J93Q36m35n94N81J39p00K08N49n51k75
2739c73Q57K2q14L72O99p71n17Q83J33r70K52Q61m19m78O85J45p70K05N35o21
2759h4l72P69j1p31N21P27p35m44R36M1j039J90P53n63m54P86J79o85K97N83n74
2780I0l00O71k11q20N46O55p83k85J025Nr08L59P02p18n02P57J00p39L28N87n22
2801C7j54P25k02p93M85M86q49k48R70p0q41N48P76p23m68P54j4q32K80N30n62
2822a65j54P85p0o37N24M45q28k10Q43k81q91N51P32o88k75Q97op73L11M69o76
$$ y = [484, -313, -108, 728, 264, -444, 192, 585, -152, -284, 340, 137, -283, 208, 446, -111, 14, 540, 54, -314, 357, 367, -484, -194, 659, 171, -428, 334, 686, -122, -128, 562, 172, -405, 134, 344, -234, -45, 546, 65, -223, 566, 528, -395, -112, 633, -33, -550, 310, 542, -324, -131, 705, 270, -324, 257, 396, -304, -96, 453, -98, -373, 484, 506, -308, 64, 763, -8, -525, 358, 491, -479, -227, 634, 215, -263, 422, 567, -203, 2, 537, -84, -456, 313, 302, -429, 92, 819, 84, -360, 576, 617, -422, -232, 521, -42, -496, 290, 469, -216, 81, 664, 90, -210, 461, 250, -570, -24, 631, -152, -437, 588, 593, -315, 44, 746, 28, -474, 283, 383, -356, -28, 559, 37, -117, 608, 406, -387, 98, 584, -265, -513, 457, 387, -454, 94, 870, 147, -321, 433, 419, -413, -133, 397, -165, -319, 466, 396, -241, 283, 728, -100, -310, 533, 252, -639, -88, 644, -44, -319, 578, 572, -201, 110, 579, -97]
2843i7k63O54j26n61N65M59p01p1Q35l06q54N01N12p81k28Q67j4o82M39N35o01
2864H2k53N79k30o08M64L81o57OQ45k01o71N36M28q15k64P67j57o93M37N48n03
2885B1j10O68k08n91M25K53p35l2P16k61n66O76M53p49j38P61k58p31L92L95n77
2906a96r3P05j30m78M90L01o83n1O40m07o34O26M25o99o1Q61j58p06M39M23o96
2927h2k25O30j53n25M92L52n56K2O66l30o38N47L21p92q0Q20j98o42N29M93o36
2948A5k08O25j79n89L83L26n60J0O79k50m85N37K74p34p4O88k82o33N28M62n75
2969d2j11O87j46n65L50K74n83r0N60k31m29N36K97o01J1O50l02o02M56L05o18
2990a94o5O50j73m48M29K89n23j8M75k92m26M77J98n67R6O25l01m76N16K01o23
$$ y = [-97, -360, 294, 168, -393, 172, 631, -70, -141, 694, 388, -466, 35, 547, -234, -462, 405, 391, -291, 148, 683, 82, -171, 408, 178, -430, 34, 415, -242, -236, 609, 408, -263, 273, 701, -114, -378, 389, 232, -461, -24, 524, 21, -89, 579, 371, -220, 205, 458, -277, -309, 407, 146, -420, 256, 709, -40, -178, 583, 325, -406, -14, 381, -196, -289, 416, 286, -192, 298, 599, -84, -135, 505, 98, -536, 90, 515, -184, -245, 616, 458, -248, 191, 614, -82, -307, 323, 170, -355, 137, 489, -67, -45, 621, 291, -347, 200, 521, -271, -351, 469, 271, -371, 158, 651, 15, -193, 432, 253, -336, 47, 373, -187, -177, 502, 252, -233, 304, 578, -156, -230, 458, 176, -457, 71, 533, -42, -153, 534, 388, -177, 173, 447, -136, -226, 334, 103, -326, 210, 507, -94, -83, 567, 265, -337, 119, 424, -194, -259, 391, 218, -230, 199, 488, -35, -53, 422, 130, -296, 181, 379, -188, -92, 533, 232, -244, 272, 473, -150]
3011a50qN40k41m14M70K21n03R2N06l60l66M77Q9o09J18N66l45l73N70K17n92
3032i5L1N36l14m30M36J49n05J14M89k94l03N15J01n86J36N00m11l82N36J75n70
3053a72R4N56k73l94M47J37n14P9M19l07k61M50P9m89J79M30l69l23M77J01n33
3074a87J03M90k78l19M12J39m25L9L74k57k48L60O2l70J37L51k79k07L92M9m30
3095i2Q2L71k75k55L56J06l39P7L11k08j90L00Nl25J13K45k56j15L10J0l04J39
3117F6K56k42j42K64K0k88J18K09k10r0K59l0k22J41J65k31n4K53m6k24J33J85
3139B90k36m6K26o4k08J54J08j87l3K19n6j92J77R6k10l5K09p1j73J10J36j79
3161C5l9J97l9j47J16R3j59k9J69p8j22J22R3j52j2J54m1j23Q4O9r2l5R0lj07
$$ y = [-150, -158, 382, 141, -273, 197, 418, -85, 7, 513, 153, -213, 264, 353, -256, -138, 428, 83, -290, 280, 497, -95, -64, 472, 158, -272, 164, 313, -192, -78, 411, 117, -186, 329, 430, -156, -20, 480, 69, -313, 223, 398, -172, -78, 478, 205, -189, 258, 395, -119, -40, 379, 72, -189, 261, 340, -149, 30, 460, 91, -232, 245, 346, -187, -84, 406, 128, -191, 221, 360, -65, -26, 348, 91, -157, 203, 265, -105, 32, 383, 104, -103, 289, 338, -92, -10, 361, 86, -169, 187, 293, -46, 31, 342, 134, -56, 244, 249, -76, 37, 282, 26, -89, 221, 231, -73, 66, 322, 80, -62, 202, 222, -66, 52, 261, 51, -39, 220, 190, -32, 109, 274, 43, -11, 242, 196, -28, 105, 290, 54, 8, 234, 170, -38, 116, 224, 37, 4, 223, 167, -25, 152, 248, 38, 3, 212, 141, -32, 78, 214, 35, -4, 193, 154, 7, 123, 216, 57, 28, 197, 119, -3, 119, 212, 60, 48, 202, 161, 38, 122, 191, 99, 64, 154, 151, 44]
3186D4N4P1q9mP7l5m0M2K4n0k1O4j8n4M0K4m3k2L5J7k0RJ2Kj3rJ0J3k9NL0kl5
3219H9K1N1l9l7O0Oo3J0M6l0m9N1L5p6J2Q4n4o5Q7J3j08L4R0p1q6J27L2j53J1
3248B8J57p1j14J26Q2j40j5J33n9j09J16L0j35N5J22j17p0J74L7j99M3J79j28
3271A25j52J71O0j98L5J58p9r4J37J1j42M8J37j52p6K06nk22J04J89j81j11K26
3294A95L2k38M3K08j48r6J80K8j80Q3J48k02n8K18l0k43J61J96k25j03K87j5k64
3317b3Q7K03k02j13K35J0k42J23K10k30p0K92q5l02K00K00k93j14L44Pl18J61
3339H0K47k38j29K71k8k71J50J84k56n1L32n7l23K39K32l51j30L66m5l41J66K86
3361C33k55j42L16rl01J51J94l00o5L46j03l10K75K57l54j25M26o9m19J72L18
$$ y = [44, 98, 169, 80, 76, 153, 118, 78, 120, 144, 94, 73, 137, 119, 65, 105, 129, 86, 64, 99, 116, 96, 105, 117, 119, 106, 97, 107, 120, 91, 96, 126, 124, 89, 110, 161, 122, 85, 145, 151, 88, 98, 144, 114, 65, 116, 151, 75, 87, 171, 117, 52, 139, 152, 44, 78, 168, 97, 11, 138, 170, 17, 28, 185, 114, 0, 126, 208, 68, 53, 186, 127, 18, 134, 164, 29, 84, 206, 89, 19, 193, 230, 31, 74, 253, 125, -27, 144, 204, 6, 41, 199, 120, 26, 163, 174, 32, 80, 217, 65, -11, 195, 190, -32, 72, 261, 80, -31, 195, 227, -11, 32, 240, 92, -4, 176, 204, 24, 107, 255, 53, -5, 213, 183, -60, 101, 297, 72, -31, 256, 241, -23, 64, 267, 65, -48, 187, 197, -45, 78, 288, 58, -12, 280, 195, -107, 93, 293, 0, -114, 230, 237, -81, 80, 327, 89, -40, 231, 203, -68, 82, 266, 10, -41, 291, 234, -89, 150, 382, 31, -99, 267, 222, -119, 47, 333, 78, -64, 252, 243, -58, 93, 287, -13, -78, 268, 165, -145, 130, 387, 33, -92, 334, 265, -154, 18, 336]
3382C36l06j50L62J6k97J75K39l11j07L46j41l53K95K49l97p2N03q2m29K52L00
3403D28l86k01L98k8l70K14K55k86n6L72j42l35K87J98m52n6M86j07m40L32L54
3424D65m27j63M50m1m47K02K83l42o6M20j05l44L22K23m65q0M99j90m93L86L58
3445D45m59j29N37n4m66K23K73m20j12M22j17l58L77K55m52mN14k44m97L74K96
3466D04n28j28N85p0m33L27L20m33r1M04j82l83L28K12m86P2N56k33m48M54K59
3487E06n70j06N43j72m90L55L48m32l8M53j95l62L79J27n48O7N33k86m06N50K58
3508E14o20J7N96k61n40L73K90m84KM89j78l25M54J12n42J02M69m31l74N68J82
3529D13o27J06O60k65m90M43K23n61m1M70k55l52M54J72m68J62M98m45l53N64
$$ y = [336, 30, -120, 242, 258, -39, 136, 375, 64, -43, 303, 162, -191, 104, 353, -44, -116, 387, 305, -124, 128, 428, 42, -159, 239, 211, -159, 55, 310, 24, -32, 340, 198, -137, 150, 348, -104, -160, 326, 219, -221, 111, 465, 38, -125, 325, 284, -163, 39, 322, -20, -86, 334, 229, -115, 207, 430, -35, -115, 384, 194, -299, 87, 445, -14, -143, 394, 340, -126, 97, 370, -50, -162, 260, 143, -215, 162, 417, -35, -39, 475, 231, -266, 108, 404, -124, -252, 333, 263, -170, 157, 477, 44, -47, 357, 175, -208, 120, 332, -154, -82, 474, 241, -207, 247, 506, -64, -170, 373, 201, -289, 66, 414, -18, -56, 397, 202, -160, 219, 346, -202, -135, 398, 112, -294, 256, 514, -106, -89, 507, 246, -294, 79, 369, -115, -113, 376, 198, -127, 327, 439, -103, -1, 468, 37, -337, 231, 413, -214, -108, 552, 287, -203, 240, 463, -98, -139, 331, 76, -276, 178, 350, -118, 44, 542, 97, -256, 308]
3549C08J13p03J21O22l10m37N40K61n74JM88k60l76L76J05m62J99M56l59k81N54
3570C82N6o23J30N19m08m05N56K16n30N2N03k38l13L68J4m67J35L82l74j83N49
3591C21L6n09K38M82m42l83M87J23n37R4M26k42k03M07M7l93J52K91l83j59M50
3612C03p8m99L19M67m14k67M90N1n01J06L64l01k21L79M8l12K01K29l67o3M33
3633C67j56m84K99L74m15j77N47J8m79J64L87l32k51L12J8l01J94K32l05m6M32
3654C98j33m05K80K69m70j66N19mm99J93M51k64k49L21K4l39J14K14k74p7L55
3675B58q3k91K96K53m48j21M57l4m55J52L46k30j99L38Q7l20P6K01j90q3K05j05
3697A10k23K57K11l47q1L91l9l75J35K90k83k01L05J19k52K8J92j26l9J62j00
$$ y = [308, 421, -282, -161, 461, 151, -286, 254, 515, -59, -58, 430, 170, -206, 170, 275, -187, 12, 468, 109, -172, 382, 438, -185, -55, 464, 56, -349, 207, 423, -107, -55, 448, 210, -103, 265, 279, -188, -53, 329, -45, -228, 321, 357, -152, 86, 568, 126, -257, 230, 353, -184, -90, 336, 94, -109, 298, 345, -48, 104, 395, 12, -147, 303, 225, -274, 45, 512, 98, -169, 321, 372, -129, -23, 341, 40, -181, 198, 246, -66, 135, 364, -3, -66, 367, 211, -273, 26, 400, -15, -192, 355, 373, -106, 58, 445, 113, -138, 174, 192, -109, 85, 317, 12, -34, 398, 265, -140, 140, 409, -61, -227, 292, 288, -211, -18, 433, 169, -80, 241, 265, -74, 40, 254, -20, -97, 258, 175, -116, 180, 433, -15, -136, 321, 287, -168, -16, 330, 100, -99, 239, 326, 6, 82, 283, 93, 10, 215, 110, -113, 144, 355, 8, -73, 318, 279, -96, 39, 329, 46, -155, 150, 269, 17, 45, 237, 111, 72, 234, 134]
3718A34k28J90J57k55m5L29o6k97J90K71k65k16K61O0k13L8J42j14j7J79o7j50
3740A8J54P0k62J0L04j46k99K21K52k29j37K34L5k22N1J48j31p6J43k2q8J68K3
3763B19k50M9K88j33k91J96K35k51j32L01K2k66O0K05j03j15R3j4p8J43L1k21
3785a2M5K56j16k35J91J58k86r1L00M6k83K1K18l9j19P8Kr3P8L2j19L1J43j09
3809I7j23K09J17k70p6K61L8k46J0J94o3r8Q2M7p7nL4l3K5Q5j33j00J97Q0j98
3834E4q1K16rj73M6J44o6j24P5Q7l0n1Kj3P4K4j07m6J16M0j22j1J46l0j34P4J38
$$ y = [134, -94, 96, 253, -2, -47, 282, 216, -81, 109, 380, 115, -101, 160, 220, 7, 45, 187, 73, 56, 235, 168, 18, 172, 242, -20, -10, 294, 148, -151, 70, 322, 93, -44, 190, 225, 3, 54, 202, 71, -5, 138, 116, 28, 196, 219, -31, 18, 306, 173, -118, 78, 313, 62, -70, 231, 253, -13, 47, 252, 149, 34, 127, 113, 35, 178, 209, -12, 33, 289, 173, -62, 129, 287, 1, -90, 210, 256, -27, -6, 212, 173, 54, 132, 134, 41, 119, 151, 32, 63, 206, 97, -26, 183, 300, 30, -46, 215, 253, 7, 17, 211, 148, 50, 132, 179, 102, 97, 131, 98, 123, 208, 75, -25, 172, 252, 54, -27, 189, 180, 7, 53, 197, 131, 7, 82, 169, 139, 88, 90, 77, 151, 175, 68, 22, 138, 178, 56, 45, 191, 161, 27, 101, 239]
$$ [...]
8191A16
##END NTUPLES=NMR FID
##END=
