##TITLE=1H_A135
 aceton-d6
 8 sc, 
 17.12.2021
##JCAMPDX= 6.0         $$ Bruker NMR JCAMP-DX V2.0
##DATA TYPE= NMR FID
##DATA CLASS= NTUPLES
##ORIGIN= UXNMR, Bruker Analytische Messtechnik GmbH
##OWNER= root
$$ XWIN-NMR		Version 3.5
$$ Fri Dec 17 10:50:11 2021 Russian Standard Time (UT+4h)  she@DPX200
##.OBSERVE FREQUENCY= 200.131346
##.OBSERVE NUCLEUS= ^1H
##.DELAY= (6, 6)
##.ACQUISITION MODE= SIMULTANEOUS
##.ACQUISITION SCHEME= undefined
##.AVERAGES= 8
##.DIGITISER RES= 18
##SPECTROMETER/DATA SYSTEM= spect
##.PULSE SEQUENCE= zg30
##.SOLVENT NAME= Acetone
##.SHIFT REFERENCE= (INTERNAL, Acetone, 0, 15.7039)
##AUDIT TRAIL= $$ (NUMBER, WHEN, WHO, WHERE, WHAT)
$$ ##TITLE= Audit trail, XWIN-NMR		Version 3.5
$$ ##JCAMPDX= 5.01
$$ ##ORIGIN= Bruker BioSpin GmbH
$$ ##OWNER= she
$$ F:/spectra/data/she/nmr/H-F/1/audita.txt
$$ ##AUDIT TRAIL=  $$ (NUMBER, WHEN, WHO, WHERE, WHAT)
(   1,<2021-12-17 10:48:52.14 +0400>,<she>,<DPX200>,
      <created by zg, POWCHK disabled, PULCHK disabled
       configuration hash MD5:
       00 E9 B6 7A A2 85 ED C7 34 08 36 98 17 FE 4E 26
       data hash MD5: 16K
       8F E0 9C F3 A7 B8 CE DD EC 3E 43 50 62 96 88 CC>)
$$ ##END=
$$ 
$$ hash MD5
$$ 9E 86 0B 81 39 5C 4B 97 F0 26 7A 6F 99 9D A3 24
##$RELAX= 
##$RELAX= 
##$RELAX= 
##$RELAX= 
##$RELAX= 
##$RELAX= 
$$ Bruker specific parameters
$$ --------------------------
##$DU= <F:/spectra>
##$EXPNO= 1
##$NAME= <H-F>
##$PROCNO= 1
##$TYPE= <nmr>
##$USER= <she>
##$AMP= (0..31)
100 100 100 100 100 100 100 100 100 100 100 100 100 100 100 100 100 100 
100 100 100 100 100 100 100 100 100 100 100 100 100 100 
##$AQSEQ= 0
##$AQ_mod= 1
##$AUNM= <au_zg>
##$AUTOPOS= <>
##$BF1= 200.13
##$BF2= 200.13
##$BF3= 200.13
##$BF4= 200.13
##$BF5= 200.13
##$BF6= 200.13
##$BF7= 200.13
##$BF8= 200.13
##$BYTORDA= 1
##$CFDGTYP= 0
##$CFRGTYP= 5
##$CHEMSTR= <none>
##$CNST= (0..31)
1 1 145 1 1 1 1 1 1 1 1 1 1 1 1 1 1 1 1 1 1 1 1 1 1 1 1 1 1 1 1 1 
##$CPDPRG= <>
##$CPDPRG1= <>
##$CPDPRG2= <>
##$CPDPRG3= <>
##$CPDPRG4= <mlev>
##$CPDPRG5= <mlev>
##$CPDPRG6= <mlev>
##$CPDPRG7= <mlev>
##$CPDPRG8= <mlev>
##$CPDPRGB= <>
##$CPDPRGT= <>
##$D= (0..31)
0 1.2 0 0 0 0 0 0 0 0.06 0 0.03 0 0 0 0 0.0002 0 0 0 0 0 0 0 0 0 0 0 0 
0 0 0 
##$DATE= 1639723731
##$DBL= (0..7)
120 120 120 120 120 120 120 120 
##$DBP= (0..7)
150 150 150 150 150 150 150 150 
##$DBP07= 0
##$DBPNAM0= <>
##$DBPNAM1= <>
##$DBPNAM2= <>
##$DBPNAM3= <>
##$DBPNAM4= <>
##$DBPNAM5= <>
##$DBPNAM6= <>
##$DBPNAM7= <>
##$DBPOAL= (0..7)
0.5 0.5 0.5 0.5 0.5 0.5 0.5 0.5 
##$DBPOFFS= (0..7)
0 0 0 0 0 0 0 0 
##$DE= 6
##$DECBNUC= <off>
##$DECIM= 32
##$DECNUC= <off>
##$DECSTAT= 4
##$DIGMOD= 1
##$DIGTYP= 9
##$DL= (0..7)
0 120 120 120 120 120 120 120 
##$DP= (0..7)
150 150 150 150 150 150 150 150 
##$DP07= 0
##$DPNAME0= <>
##$DPNAME1= <>
##$DPNAME2= <>
##$DPNAME3= <>
##$DPNAME4= <>
##$DPNAME5= <>
##$DPNAME6= <>
##$DPNAME7= <>
##$DPOAL= (0..7)
0.5 0.5 0.5 0.5 0.5 0.5 0.5 0.5 
##$DPOFFS= (0..7)
0 0 0 0 0 0 0 0 
##$DQDMODE= 0
##$DR= 18
##$DS= 0
##$DSLIST= <SSSSSSSSSSSSSSS>
$$ [...]
##$SUBNAM2= <"">
##$SUBNAM3= <"">
##$SUBNAM4= <"">
##$SUBNAM5= <"">
##$SUBNAM6= <"">
##$SUBNAM7= <"">
##$SUBNAM8= <"">
##$SUBNAM9= <"">
##$SW= 18.0517287032376
##$SWIBOX= (0..15)
0 0 2 0 0 0 0 0 0 0 0 0 0 0 0 0 
##$SW_h= 3612.71676300578
##$TD= 16384
##$TD0= 1
##$TE= 0
##$TE2= 300
##$TE3= 300
##$TEG= 300
##$TL= (0..7)
0 120 120 120 120 120 120 120 
##$TP= (0..7)
150 150 150 150 150 150 150 150 
##$TP07= 0
##$TPNAME0= <>
##$TPNAME1= <>
##$TPNAME2= <>
##$TPNAME3= <>
##$TPNAME4= <>
##$TPNAME5= <>
##$TPNAME6= <>
##$TPNAME7= <>
##$TPOAL= (0..7)
0.5 0.5 0.5 0.5 0.5 0.5 0.5 0.5 
##$TPOFFS= (0..7)
0 0 0 0 0 0 0 0 
##$TUNHIN= 0
##$TUNHOUT= 0
##$TUNXOUT= 0
##$USERA1= <user>
##$USERA2= <user>
##$USERA3= <user>
##$USERA4= <user>
##$USERA5= <user>
##$V9= 5
##$VALIST= <valist>
##$VCLIST= <CCCCCCCCCCCCCCC>
##$VD= 0
##$VDLIST= <DDDDDDDDDDDDDDD>
##$VPLIST= <PPPPPPPPPPPPPPP>
##$VTLIST= <TTTTTTTTTTTTTTT>
##$WBST= 1024
##$WBSW= 4
##$XGAIN= (0..3)
0 0 0 0 
##$XL= 0
##$YL= 0
##$YMAX_a= 172742
##$YMIN_a= -165798
##$ZGOPTNS= <>
##$ZL1= 120
##$ZL2= 120
##$ZL3= 120
##$ZL4= 120
##$ABSF1= 10
##$ABSF2= 0
##$ABSG= 5
##$ABSL= 3
##$ALPHA= 0
##$AQORDER= 0
##$ASSFAC= 0
##$ASSFACI= 0
##$ASSFACX= 0
##$ASSWID= 0
##$AUNMP= <proc_1d>
##$AZFE= 0.1
##$AZFW= 0.1
##$BCFW= 1
##$BC_mod= 2
##$BYTORDP= 1
##$COROFFS= 0
##$CY= 11.3945322036743
##$DATMOD= 1
##$DC= 2
##$DFILT= <>
##$DTYPP= 0
##$F1P= 2.36226072786647
##$F2P= -0.459571619588291
##$FCOR= 0.5
##$FTSIZE= 0
##$FT_mod= 4
##$GAMMA= 1
##$GB= 0.15
##$INTBC= 1
##$INTSCL= 1
##$ISEN= 128
##$LB= 0.24
##$LEV0= 0
##$LPBIN= 0
##$MAXI= 10000
##$MC2= 0
##$MEAN= 0
##$ME_mod= 0
##$MI= 1.114404
##$NCOEF= 0
##$NC_proc= 0
##$NLEV= 6
##$NOISF1= 3.799351
##$NOISF2= 2.8
##$NSP= 1
##$NTH_PI= 0
##$NZP= 0
##$OFFSET= 15.70392
##$PC= 1
##$PHC0= -15957.12
##$PHC1= 19.40079
##$PH_mod= 1
##$PKNL= yes
##$PPARMOD= 0
##$PSCAL= 0
##$PSIGN= 0
##$REVERSE= no
##$SF= 200.130013532006
##$SI= 16384
##$SIGF1= 3
##$SIGF2= 2
##$SINO= 400
##$SIOLD= 16384
##$SREGLST= <1H.CDCl3>
##$SSB= 0
##$STSI= 0
##$STSR= 0
##$SW_p= 3612.71676300578
##$SYMM= 0
##$S_DEV= 0
##$TDeff= 0
##$TDoff= 0
##$TI= <>
##$TILT= no
##$TM1= 0
##$TM2= 0
##$TOPLEV= 0
##$USERP1= <user>
##$USERP2= <user>
##$USERP3= <user>
##$USERP4= <user>
##$USERP5= <user>
##$WDW= 1
##$XDIM= 8192
##$YMAX_p= 0
##$YMIN_p= 0
$$ End of Bruker specific parameters
$$ ---------------------------------
##NTUPLES= NMR FID
##VAR_NAME=  TIME,          FID/REAL,        FID/IMAG
##SYMBOL=    X,             R,               I
##VAR_TYPE=  INDEPENDENT,   DEPENDENT,       DEPENDENT
##VAR_FORM=  AFFN,          ASDF,            ASDF
##VAR_DIM=   8192,          8192,            8192
##UNITS=     SECONDS,       ARBITRARY UNITS, ARBITRARY UNITS
##FACTOR=    0.0002768,     1,               1
##FIRST=     0,             0,               0
##LAST=      2.2672688,     0,               0
##MIN=       0,             -165798,         0
##MAX=       2.2672688,     172742,          0
$$ Real data points
##PAGE= N=1
##DATA TABLE= (X++(R..R)), XYDATA
0 0 0 0 0 0 0 0 0 0 0 0 0 0 0 0 0 0 0 0 0 -8 8 -8 8 -8 8 -8 10 -16 16 -16 20 -24 24 -29 32 -36 40 -45 49 -56 61
41 61 -68 76 -84 92 -100 110 -122 134 -146 161 -178 197 -218 242 -270 302 -340 384 -438 507 -592
62 -592 709 -868 1106 -1480 2150 -3571 7749 -43407 -165798 59956 153558 -90805 -133173
75 -133173 117080 107072 -138836 -76742 154826 42101 -160577 -8252 159035 -24555
85 -24555 -151733 55778 138990 -85071 -118577 108444 93185 -125267 -65754 136641 37363
96 37363 -143342 -6827 143033 -23773 -135259 51439 122216 -75177 -105873 96152 85325
107 85325 -113389 -60293 124531 33268 -129067 -6952 128832 -18777 -124324 44428
117 44428 114025 -68082 -98040 86980 78777 -101224 -57935 112022 34791 -118580 -9485
128 -9485 118857 -15474 -113280 37819 103991 -58031 -91513 76602 74619 -91554 -53898
139 -53898 100947 32222 -105544 -10839 106837 -11163 -103939 33346 95405 -53045 -82494
150 -82494 68805 67542 -81720 -50623 92173 30761 -98113 -9250 98447 -11215 -94768
161 -94768 30029 88301 -48236 -78084 64905 63336 -77621 -46019 85739 28219 -90748
172 -90748 -9681 92655 -10140 -89806 29405 82019 -45806 -71304 59398 58820 -71115
183 -71115 -43648 79924 25877 -83993 -7746 83680 -9054 -80673 25133 75014 -40768
194 -40768 -65502 54202 52665 -63845 -38670 70342 24332 -74781 -8788 76221 -7678 -73420
206 -73420 22932 67210 -35898 -59366 47465 49673 -57893 -37126 65470 22612 -69128
217 -69128 -8218 69920 -5651 -68815 19901 64763 -33897 -56869 45564 46538 -54263 -35386
229 -35386 61172 23052 -66269 -8786 67880 -5990 -65511 19285 60758 -31127 -54433 42410
241 42410 45437 -52183 -33563 58525 20635 -61633 -8155 62830 -4629 -61953 18023 57578
253 57578 -30344 -50047 40054 41209 -47804 -31546 54375 20036 -58687 -6995 59387 -5653
265 -5653 -57254 17001 53629 -27911 -48058 38436 39562 -46819 -28938 52140 18002 -55311
277 -55311 -6943 56937 -5054 -55962 17279 51577 -27930 -45025 36449 37501 -43892 -28607
289 -28607 49997 17679 -53336 -6023 53443 -4773 -51660 14770 48562 -24749 -43142 33844
301 33844 35146 -40490 -26052 44735 17011 -47742 -7378 49273 -3285 -48015 13505 44113
313 44113 -22005 -39103 29321 33319 -36242 -25719 41700 16388 -44472 -6999 45141 -1796
325 -1796 -44798 10805 42890 -20178 -38382 28304 31806 -34349 -24735 39050 17083 -42957 -8074
338 -8074 44808 -1778 -43862 10804 41071 -18673 -37407 26202 32249 -33192 -24926 38184 16481
351 16481 -40753 -8250 41936 66 -42069 8756 40108 -17412 -35703 24451 30042 -29901
363 -29901 -24036 34633 16963 -38345 -8514 39736 -170 -38872 7887 36879 -15110 -33989
375 -33989 22396 29182 -28826 -22492 33121 15262 -35701 -8198 37417 549 -37856 7788
387 7788 35917 -15499 -32013 21648 27424 -26923 -22154 31745 15397 -35076 -7506 36028 -52
400 -52 -35332 6868 33881 -13729 -31114 20492 26290 -25837 -20230 29227 14137 -31645 -7899
413 -7899 33333 738 -33347 6577 31174 -12842 -27929 17954 24333 -22841 -19724 27166 13601
426 13601 -29747 -7030 30490 1015 -30493 4921 29826 -11332 -27483 17393 23355 -21941
438 -21941 -18631 25348 13791 -28373 -8058 30461 1280 -30551 5337 28945 -10986 -26699
450 -26699 16245 23695 -21512 -19133 25723 13230 -28075 -7309 29088 1639 -29527 4422
462 4422 28735 -10814 -26034 16242 22018 -20250 -17784 23597 13099 -26505 -7320 27980 999
475 999 -27536 4646 26031 -9578 -24137 14575 21157 -19322 -16608 22657 11414 -24452 -6486
488 -6486 25612 1417 -26222 4335 25271 -10009 -22633 14461 19354 -18046 -15915 21435 11518
501 11518 -24175 -6032 25167 503 -24725 4278 23748 -8941 -22168 13808 19100 -17931
513 -17931 -14809 20515 10441 -22127 -6186 23434 1378 -23797 3934 22490 -8599 -20121
525 -20121 12238 17575 -15593 -14592 18794 10450 -20966 -5684 21572 1304 -21460 2728 21086
538 21086 -7135 -19760 11609 16935 -15086 -13486 17457 10096 -19553 -6326 21248 1613 -21668
551 -21668 3231 20574 -7343 -18951 10966 17018 -14695 -14043 18005 9862 -19940 -5451 20667
564 20667 1434 -20971 2755 20680 -7385 -18959 11547 16017 -14510 -12854 16783 9594 -18859
577 -18859 -5603 20118 957 -19883 3273 18632 -6765 -17221 10142 15240 -13580 -12127
589 -12127 16085 8251 -17327 -4661 17928 1214 -18345 2685 17848 -6777 -16039 10087
601 10087 13581 -12493 -11161 14764 8315 -16800 -4544 17724 530 -17402 2905 16618 -6041
614 -6041 -15630 9433 13700 -12610 -10693 14608 7419 -15723 -4452 16603 1177 -17108 2607
627 2607 16354 -6182 -14596 8839 12634 -11112 -10608 13401 7757 -15162 -4234 15686 912
640 912 -15468 1915 15136 -4904 -14340 8135 12425 -10792 -9822 12472 7309 -13786 -4734 15035
654 15035 1505 -15551 2095 14835 -5194 -13537 7699 12173 -10286 -10272 12787 7327 -14398
667 -14398 -4038 14887 1064 -15036 1810 14933 -5127 -13926 8350 11795 -10664 -9366 12216
680 12216 7045 -13680 -4320 14790 946 -14755 2326 13768 -4872 -12595 7191 11298 -9663
693 -9663 -9191 11686 6344 -12636 -3629 12943 1247 -13237 1379 13090 -4353 -11930 6873
706 6873 10101 -8608 -8386 10108 6543 -11702 -4041 12647 1069 -12597 1480 12048 -3646
719 -3646 -11512 5994 10460 -8464 -8486 10228 6107 -11128 -3968 11857 1790 -12470 924 12333
733 12333 -3714 -11203 5844 9826 -7504 -8543 9232 6755 -10834 -4279 11523 1723 -11462
746 -11462 333 11311 -2417 -11062 4831 10000 -7067 -8212 8481 6373 -9492 -4716 10550
759 10550 2580 -11321 41 11128 -2504 -10302 4382 9445 -6235 -8415 8270 6588 -9833
772 -9833 -4218 10475 2032 -10703 -61 10897 -2246 -10609 4782 9356 -6776 -7658 8052
785 8052 6066 -9228 -4341 10316 1979 -10757 532 10223 -2559 -9460 4188 8698 -6033
798 -6033 -7500 7726 5540 -8713 -3519 8989 1830 -9258 -121 9421 -2003 -8913 3992 7693
812 7693 -5320 -6478 6344 5389 -7536 -3878 8508 1841 -8698 63 8383 -1536 -8136 3076
826 3076 7740 -4911 -6652 6413 5023 -7246 -3569 7776 2217 -8435 -477 8696 -1618 -8177
840 -8177 3308 7235 -4547 -6436 5761 5451 -7117 -3840 7937 1941 -8014 -403 7902 -950
854 -950 -7878 2621 7430 -4371 -6247 5554 4886 -6235 -3792 6979 2509 -7714 -721 7812
868 7812 -1119 -7266 2448 6658 -3628 -6135 5029 5095 -6349 -3482 6950 1888 -7111 -609 7304
883 7304 -858 -7375 2642 6709 -4219 -5531 5144 4434 -5928 -3420 6794 1957 -7342 -130
897 -130 7147 -1365 -6581 2474 6144 -3641 -5531 4962 4329 -5831 -2856 6075 1689 -6209 -661
912 -661 6459 -720 -6364 2215 5576 -3259 -4719 3876 4080 -4664 -3293 5493 1977 -5850 -589 5667
928 5667 -408 -5516 1304 5454 -2558 -5001 3802 3966 -4519 -2941 4892 2159 -5420 -1167 5904
943 5904 -278 -5790 1632 5216 -2496 -4709 3310 4273 -4366 -3347 5222 2018 -5466 -878 5414
958 5414 -12 -5516 1056 5460 -2412 -4814 3424 3823 -3947 -3084 4430 2354 -5102 -1223 5412 -142
974 -142 -5132 1148 4694 -1887 -4439 2815 3972 -3863 -2955 4445 1811 -4566 -964 4715 136 -4969
990 -4969 1059 4767 -2287 -4033 3038 3289 -3515 -2744 4154 1928 -4764 -728 4806 -437 -4453 1163
1006 1163 4189 -1895 -4015 2835 3356 -3660 -2369 3938 1520 -4011 -943 4239 127 -4390 953
1021 953 4024 -1795 -3424 2225 3034 -2680 -2684 3367 1916 -3839 -934 3788 218 -3671 273 3764
1037 3764 -1061 -3684 2026 3087 -2672 -2381 2924 1918 -3318 -1417 3830 459 -4003 554 3672
1052 3672 -1238 -3361 1735 3183 -2517 -2768 3295 1866 -3648 -983 3639 411 -3747 249 3902
1067 3902 -1210 -3620 2109 2964 -2539 -2403 2846 2010 -3357 -1352 3765 355 -3696 448 3348 -959
1083 -959 -3223 1509 3049 -2327 -2492 2898 1644 -3057 -1050 3114 564 -3359 155 3431 -1122
1098 -1122 -3044 1757 2470 -2079 -2149 2502 1774 -3072 -995 3328 111 -3128 487 2944 -891 -2918
1114 -2918 1577 2674 -2312 -1975 2658 1316 -2683 -916 2858 457 -3140 307 3016 -1058 -2584
1129 -2584 1396 2231 -1658 -2114 2144 1685 -2627 -967 2669 361 -2552 -69 2615 -376 -2709 1102
1145 1102 2421 -1672 -1885 1875 1526 -2083 -1282 2506 744 -2795 64 2658 -631 -2384 956 2321
1161 2321 -1436 -2169 2101 1614 -2509 -907 2507 445 -2541 -87 2725 -569 -2698 1316 2223 -1752
1177 -1752 -1753 1905 1482 -2221 -1139 2604 452 -2683 230 2392 -593 -2203 894 2175 -1416 -1886
1193 -1886 1964 1275 -2092 -761 2058 509 -2196 -113 2383 -533 -2178 1071 1747 -1282 -1493 1474
1209 1474 1348 -1884 -920 2189 255 -2123 185 1922 -434 -1966 805 1912 -1392 -1521 1718 993
1225 993 -1759 -720 1806 497 -2073 -4 2138 -589 -1849 913 1576 -1018 -1503 1332 1341 -1749
1241 -1749 -843 1881 359 -1763 -119 1757 -86 -1913 551 1813 -1071 -1438 1262 1127 -1347 -1031
1257 -1031 1610 741 -1945 -191 1918 -313 -1696 531 1618 -802 -1625 1288 1325 -1700 -798 1761
1273 1761 398 -1742 -175 1902 -202 -1987 821 1711 -1216 -1287 1339 1086 -1514 -902 1847 448
1289 448 -2001 127 1801 -459 -1618 609 1599 -959 -1485 1385 1045 -1572 -623 1501 409 -1574
1305 -1574 -233 1749 -230 -1713 687 1386 -870 -1154 963 1097 -1254 -899 1563 417 -1585 -17
1321 -17 1442 -160 -1439 376 1514 -818 -1327 1198 928 -1287 -664 1307 541 -1524 -249 1690
1337 1690 -263 -1551 593 1297 -703 -1237 896 1184 -1276 -881 1497 429 -1460 -198 1422 80
1353 80 -1544 240 1598 -718 -1322 969 1034 -1016 -948 1211 802 -1526 -395 1627 -70 -1473 297
1370 297 1384 -457 -1422 840 1279 -1271 -887 1410 511 -1401 -335 1510 67 -1674 415 1553
1386 1553 -863 -1249 1012 1014 -1146 -916 1422 592 -1676 -125 1584 -255 -1435 402 1397 -654 -1398
1403 -1398 1066 1094 -1326 -687 1329 475 -1325 -340 1511 5 -1566 437 1351 -689 -1126 763 1045
1420 1045 -994 -948 1292 589 -1444 -213 1325 -18 -1325 161 1390 -534 -1333 928 1013 -1113
1436 -1113 -731 1141 608 -1322 -388 1536 -50 -1519 441 1310 -629 -1204 794 1151 -1119 -939 1422
1453 1422 529 -1451 -209 1404 57 -1490 214 1553 -661 -1376 964 1047 -1084 -891 1188 738
1469 738 -1486 -423 1614 -52 -1533 331 1370 -524 -1361 808 1283 -1202 -932 1419 537 -1425
1485 -1425 -292 1475 40 -1613 359 1553 -835 -1274 1072 995 -1185 -854 1407 592 -1662 -147
1501 -147 1658 -285 -1485 511 1368 -736 -1351 1070 1108 -1398 -728 1456 403 -1463 -239 1526
1517 1526 -47 -1616 455 1446 -792 -1196 905 1040 -1063 -932 1341 642 -1528 -241 1480 -40
1533 -40 -1401 215 1441 -500 -1415 922 1154 -1182 -829 1254 631 -1373 -430 1575 33 -1638 402
1550 402 1451 -680 -1288 853 1206 -1153 -1025 1475 631 -1604 -234 1543 -7 -1572 251 1632
1566 1632 -671 -1506 1063 1191 -1237 -922 1346 765 -1528 -472 1727 30 -1694 371 1541 -581
1582 -581 -1431 845 1359 -1213 -1090 1480 679 -1560 -364 1571 118 -1679 225 1688 -703 -1475
1598 -1475 1029 1176 -1204 -993 1392 763 -1661 -366 1764 -108 -1665 429 1518 -655 -1468 999
1614 999 1304 -1343 -936 1548 566 -1553 -312 1610 61 -1715 346 1656 -745 -1398 951 1185
1630 1185 -1106 -1063 1358 815 -1601 -417 1621 43 -1554 167 1544 -442 -1558 828 1355 -1172
1646 -1172 -1036 1306 783 -1410 -583 1612 239 -1745 235 1648 -601 -1455 822 1337 -1102 -1191 1444
1663 1444 834 -1665 -410 1670 91 -1673 188 1704 -584 -1654 1011 1367 -1300 -1058 1415 819
1679 819 -1592 -568 1790 126 -1844 293 1671 -599 -1538 838 1440 -1169 -1223 1505 830 -1635
1695 -1635 -442 1663 191 -1722 139 1773 -585 -1635 986 1349 -1208 -1097 1372 884 -1628 -535
1711 -535 1804 61 -1768 328 1626 -605 -1561 909 1441 -1288 -1139 1560 715 -1645 -419 1680
1727 1680 140 -1774 235 1766 -682 -1583 984 1317 -1160 -1150 1380 936 -1641 -568 1751 162
1743 162 -1711 129 1669 -393 -1668 771 1540 -1159 -1252 1375 942 -1506 -705 1666 387 -1845
1759 -1845 50 1822 -499 -1668 770 1506 -1064 -1372 1399 1079 -1721 -641 1822 230 -1826 63
1775 63 1848 -450 -1848 905 1606 -1301 -1282 1502 978 -1671 -691 1896 295 -2001 200 1914 -585
1792 -585 -1733 885 1609 -1208 -1408 1564 1035 -1789 -592 1828 244 -1878 66 1905 -518 -1841
1808 -1841 958 1555 -1268 -1259 1459 1000 -1696 -682 1908 217 -1941 241 1816 -585 -1701 906
1824 906 1575 -1281 -1305 1615 889 -1773 -495 1827 178 -1885 200 1909 -667 -1742 1042 1466
1840 1466 -1299 -1214 1510 965 -1770 -607 1928 133 -1894 239 1812 -540 -1755 876 1617 -1285
1856 -1285 -1318 1558 942 -1695 -634 1806 318 -1951 126 1971 -587 -1775 952 1558 -1217 -1345
1872 -1345 1536 1063 -1838 -628 1976 138 -1956 231 1910 -614 -1858 1059 1646 -1476 -1273 1719
1888 1719 881 -1857 -553 2009 131 -2113 356 1995 -812 -1772 1118 1539 -1418 -1320 1727 945
1904 945 -1961 -470 1998 60 -1967 292 1948 -669 -1838 1118 1586 -1439 -1202 1638 912 -1792
1920 -1792 -583 1967 144 -2030 340 1885 -730 -1701 1028 1525 -1363 -1273 1710 844 -1878 -417
1936 -417 1909 49 -1920 315 1908 -773 -1770 1200 1459 -1460 -1138 1648 859 -1852 -496 2020
1952 2020 13 -2002 426 1863 -726 -1730 1062 1578 -1418 -1282 1723 877 -1859 -493 1912 163
1968 163 -1984 240 1984 -719 -1823 1099 1532 -1390 -1291 1618 978 -1904 -576 2051 61 -2026
1984 -2026 355 1918 -724 -1809 1136 1615 -1560 -1229 1825 788 -1946 -402 2041 6 -2103
1999 -2103 490 1998 -979 -1730 1318 1435 -1578 -1161 1836 773 -2061 -302 2080 -177 -2006 529
2015 529 1883 -891 -1757 1283 1464 -1634 -1088 1778 682 -1897 -363 1997 -38 -2021 509 1872
2031 1872 -924 -1621 1209 1402 -1476 -1143 1763 757 -1962 -277 1963 -120 -1908 482 1845 -889
2047 -889 -1710 1302 1386 -1603 -1017 1759 690 -1907 -333 2027 -122 -2039 585 1848 -966 -1651
2063 -1651 1233 1435 -1562 -1159 1838 718 -1994 -302 1979 -69 -1986 440 1961 -883 -1763 1294
2079 1294 1456 -1562 -1114 1772 821 -1972 -417 2114 -85 -2069 545 1899 -901 -1751 1271 1504
2095 1504 -1665 -1143 1930 666 -2047 -244 2064 -175 -2087 623 1970 -1122 -1704 1484 1328 -1729
2111 -1729 -1002 1921 625 -2100 -144 2150 -345 -2023 747 1843 -1084 -1652 1448 1379 -1767 -956
2127 -956 1947 541 -1980 -166 2018 -215 -2017 666 1864 -1085 -1590 1370 1306 -1604 -1028 1843
2143 1843 633 -2022 -181 2025 -269 -1931 616 1810 -1004 -1665 1395 1355 -1713 -942 1884 554
2159 554 -1968 -182 2072 -261 -2040 746 1865 -1137 -1591 1438 1330 -1702 -1007 1979 576 -2110
2175 -2110 -99 2080 -306 -2002 687 1898 -1093 -1711 1487 1344 -1761 -963 1903 592 -2045 -194
2191 -194 2133 -296 -2075 772 1871 -1134 -1614 1450 1364 -1756 -980 2021 515 -2088 -17 2080
2207 2080 -376 -1999 805 1881 -1245 -1575 1612 1198 -1831 -799 1977 418 -2090 39 2114
2222 2114 -538 -1969 942 1723 -1272 -1493 1556 1178 -1845 -782 2001 327 -2016 72 1967 -438
2238 -438 -1921 824 1761 -1222 -1454 1510 1129 -1701 -801 1853 465 -1981 -18 1995 -417 -1847
2254 -1847 787 1684 -1099 -1482 1452 1198 -1733 -796 1891 368 -1936 6 1946 -405 -1922 854
2270 854 1732 -1254 -1416 1520 1105 -1744 -785 1935 372 -2054 98 2008 -530 -1866 877 1707
2286 1707 -1225 -1498 1577 1142 -1812 -723 1941 344 -1979 37 2008 -449 -1928 897 1705 -1249
2302 -1249 -1416 1502 1128 -1743 -796 1935 346 -2014 115 1935 -516 -1824 863 1673 -1256 -1415
2318 -1415 1580 1016 -1808 -620 1887 245 -1946 165 1940 -603 -1804 1014 1546 -1306 -1271 1539
2334 1539 982 -1763 -603 1914 161 -1896 246 1818 -563 -1710 909 1550 -1252 -1273 1507 917
2350 917 -1666 -605 1759 269 -1853 97 1823 -507 -1697 844 1486 -1127 -1292 1378 1019 -1643
2366 -1643 -678 1784 264 -1811 108 1776 -443 -1719 836 1554 -1213 -1263 1482 930 -1647 -597
2382 -597 1796 240 -1885 188 1840 -614 -1667 936 1467 -1235 -1251 1513 938 -1749 -535 1825
2398 1825 133 -1842 201 1784 -574 -1712 938 1499 -1273 -1186 1477 878 -1645 -579 1794 184
2414 184 -1842 238 1770 -590 -1597 911 1440 -1199 -1196 1492 855 -1656 -466 1727 120 -1732
2430 -1732 239 1722 -625 -1596 996 1349 -1261 -1062 1451 762 -1622 -447 1732 62 -1742 317
2446 317 1632 -650 -1494 927 1345 -1206 -1094 1453 773 -1580 -449 1642 152 -1677 185 1673
2462 1673 -538 -1535 875 1350 -1114 -1119 1330 884 -1542 -561 1661 183 -1683 174 1631 -494 -1555
2479 -1555 811 1391 -1158 -1143 1410 811 -1564 -494 1655 157 -1715 221 1691 -621 -1529 954
2495 954 1311 -1201 -1078 1457 796 -1640 -397 1739 19 -1708 327 1637 -638 -1529 983 1322
2511 1322 -1273 -1020 1464 714 -1589 -412 1660 70 -1708 315 1614 -678 -1448 939 1249 -1183
2527 -1183 -1033 1421 707 -1588 -352 1629 -2 -1597 319 1534 -643 -1412 989 1190 -1237 -889
2543 -889 1412 601 -1517 -292 1617 -62 -1595 435 1484 -729 -1310 987 1116 -1213 -886 1423
2559 1423 566 -1534 -244 1553 -67 -1538 346 1483 -669 -1360 956 1132 -1196 -892 1341 629
2575 629 -1487 -348 1569 -2 -1567 341 1483 -630 -1348 909 1194 -1173 -931 1399 611 -1506
2591 -1506 -276 1560 -43 -1563 387 1496 -740 -1338 1032 1084 -1261 -829 1419 523 -1563 -194
2607 -194 1601 -192 -1557 511 1418 -804 -1264 1067 1042 -1323 -760 1463 421 -1528 -131 1538
2623 1538 -184 -1512 502 1417 -817 -1216 1046 985 -1234 -734 1390 479 -1488 -126 1514 -204
2639 -204 -1444 481 1335 -750 -1212 992 983 -1248 -703 1349 393 -1439 -115 1451 -188 -1450 507
2656 507 1315 -806 -1131 1024 912 -1206 -691 1371 387 -1474 -57 1446 -244 -1404 499 1305 -770
2673 -770 -1162 1037 946 -1230 -674 1341 417 -1442 -141 1475 -167 -1451 478 1328 -765 -1188 969
2690 969 984 -1188 -755 1359 439 -1479 -130 1467 -180 -1438 471 1345 -796 -1183 1060 928 -1252
2707 -1252 -640 1380 360 -1461 -39 1503 -283 -1424 620 1260 -879 -1084 1084 862 -1279 -595
2723 -595 1416 265 -1461 38 1418 -330 -1368 584 1256 -877 -1064 1070 810 -1241 -581 1319
2739 1319 313 -1403 -27 1403 -300 -1333 539 1189 -770 -1048 987 848 -1178 -586 1296 308
2755 308 -1332 -23 1336 -233 -1298 510 1191 -787 -1003 992 775 -1145 -574 1264 293 -1357
2771 -1357 -5 1350 -291 -1279 532 1148 -779 -1010 997 813 -1182 -558 1282 287 -1330 -41
2787 -41 1349 -236 -1318 525 1203 -768 -1039 963 846 -1133 -630 1280 363 -1367 -58 1361 -229
2804 -229 -1288 484 1214 -747 -1071 997 835 -1177 -570 1271 300 -1337 -38 1339 -287 -1307
2820 -1307 568 1148 -830 -969 998 758 -1168 -523 1291 228 -1347 63 1292 -330 -1230 568
2836 568 1118 -822 -952 1021 730 -1143 -481 1225 263 -1268 6 1294 -282 -1227 530 1093 -741
2853 -741 -941 916 783 -1080 -560 1193 289 -1259 -28 1233 -222 -1229 440 1121 -711 -971 915
2870 915 757 -1066 -542 1169 310 -1256 -43 1267 -260 -1207 509 1093 -729 -953 931 770 -1109
2887 -1109 -535 1215 257 -1261 -22 1249 -241 -1240 495 1127 -751 -972 940 765 -1078 -569 1195
2904 1195 316 -1300 -62 1286 -233 -1243 462 1127 -704 -1004 926 800 -1100 -550 1212 293
2920 293 -1246 -32 1274 -228 -1223 523 1114 -756 -911 946 716 -1077 -494 1208 235 -1258 52
2937 52 1217 -315 -1146 531 1016 -754 -888 940 669 -1084 -433 1143 206 -1184 17 1188 -261
2954 -261 -1154 507 1022 -710 -873 848 707 -1003 -521 1117 282 -1179 -29 1170 -192 -1111 426
2971 426 1048 -650 -920 865 708 -1001 -499 1081 285 -1163 -46 1188 -219 -1134 470 1005 -679
2988 -679 -864 854 696 -1014 -484 1138 219 -1180 26 1152 -256 -1109 480 1020 -711 -861 899
3005 899 670 -1017 -458 1105 250 -1168 13 1177 -254 -1097 498 990 -666 -856 856 701 -1010
3022 -1010 -476 1099 209 -1138 -1 1112 -226 -1086 460 977 -693 -809 844 616 -952 -426 1044
3039 1044 208 -1105 41 1083 -290 -983 503 894 -642 -763 826 603 -957 -361 1014 157 -1032
3056 -1032 38 1025 -240 -992 456 896 -640 -741 757 591 -876 -446 969 237 -1031 -24 1015
3073 1015 -192 -968 364 915 -551 -811 724 656 -866 -467 940 276 -968 -75 1013 -132 -999
3090 -999 388 900 -565 -756 714 613 -840 -441 962 228 -1000 11 967 -202 -925 384 862
3107 862 -587 -741 765 557 -863 -369 918 195 -978 -12 971 -222 -932 420 811 -579 -703
3124 -703 692 581 -841 -399 928 187 -943 4 926 -174 -892 358 838 -553 -695 692 525
3141 525 -770 -357 843 198 -900 2 901 -213 -823 381 723 -515 -624 640 499 -770 -332
3158 -332 808 131 -838 21 812 -179 -798 336 732 -516 -607 628 473 -693 -348 773 205 -831
3176 -831 -26 834 -151 -775 288 735 -425 -671 587 562 -699 -395 775 229 -809 -82 833 -107
3194 -107 -838 274 749 -456 -644 567 519 -676 -400 782 207 -849 -14 820 -159 -765 303 714
3212 714 -449 -627 623 489 -711 -286 777 170 -786 0 814 -161 -782 349 691 -475 -578 579
3230 579 476 -676 -344 752 170 -795 -15 765 -136 -741 271 702 -442 -625 573 460 -654 -338
3248 -338 688 205 -749 -51 774 -127 -719 293 642 -399 -545 512 484 -621 -328 705 168 -704
3266 -704 3 699 -120 -682 259 650 -417 -552 520 412 -589 -310 645 192 -718 -46 730 -127 -682
3285 -682 256 635 -354 -578 478 490 -623 -358 676 201 -700 -70 722 -49 -723 234 695 -380 -569
3304 -569 500 471 -570 -366 665 237 -723 -51 730 -123 -677 238 628 -373 -573 497 449 -609 -305
3323 -305 643 149 -687 -39 683 -120 -683 267 592 -412 -502 488 406 -554 -318 636 162 -676 -15 667
3343 667 -109 -620 214 607 -328 -535 475 440 -544 -313 587 195 -616 -91 656 -56 -646 207 572 -318
3363 -318 -506 383 435 -509 -356 577 190 -615 -75 597 -34 -588 151 576 -293 -511 410 401 -485 -300 526
3384 526 229 -574 -101 631 -46 -598 184 551 -262 -504 366 456 -474 -348 563 212 -588 -102 589 -5
3404 -5 -629 131 602 -286 -534 384 438 -463 -363 523 259 -610 -116 633 -38 -600 158 558 -258 -512 373
3425 373 441 -487 -315 550 181 -556 -60 582 -20 -570 171 540 -306 -446 381 359 -436 -307 508 191 -566
3446 -566 -61 555 -61 -534 132 498 -237 -489 352 395 -445 -300 462 196 -512 -136 545 10 -569 131
3466 131 520 -228 -460 303 419 -379 -343 481 253 -519 -99 535 26 -508 82 528 -194 -484 321 399 -411
3487 -411 -306 433 223 -486 -149 552 15 -555 112 486 -225 -459 287 421 -393 -345 487 226 -535 -113
3507 -113 523 43 -552 77 560 -217 -501 325 415 -383 -340 448 274 -524 -157 566 17 -572 100 523 -182
3528 -182 -499 287 439 -411 -353 473 224 -506 -135 497 35 -554 82 527 -213 -476 287 382 -361 -324 423
3549 423 250 -494 -126 514 5 -507 86 477 -156 -465 264 419 -370 -328 426 240 -455 -173 492 80
3569 80 -547 47 528 -167 -474 241 429 -318 -391 410 297 -507 -185 515 69 -505 1 516 -119 -517 252
3590 252 449 -351 -360 404 291 -445 -197 518 89 -546 42 518 -132 -456 222 441 -320 -391 422 289 -483
3611 -483 -168 507 78 -528 -6 529 -142 -524 250 431 -350 -380 396 305 -480 -231 537 83 -564 35 513
3632 513 -128 -510 210 484 -330 -404 436 296 -467 -186 484 108 -505 -9 536 -135 -482 240 416 -304
3652 -304 -362 360 312 -454 -209 492 61 -504 22 482 -108 -472 192 453 -312 -381 375 276 -410 -207 459
3673 459 142 -523 -36 534 -92 -481 190 450 -252 -418 363 358 -449 -246 506 149 -504 -50 524 -29 -531
3694 -531 163 495 -293 -418 358 339 -417 -276 484 177 -551 -36 533 -99 -507 146 465 -252 -437 362
3714 362 350 -452 -248 483 143 -498 -57 542 -44 -542 192 505 -283 -408 367 367 -417 -289 507 164 -548
3735 -548 -38 543 -52 -522 154 515 -259 -474 381 354 -455 -263 468 177 -525 -89 552 -53 -547 180
3755 180 469 -271 -416 323 369 -413 -294 491 176 -502 -53 500 -28 -498 126 496 -244 -436 341 346 -393
3776 -393 -274 426 200 -499 -114 540 -27 -528 130 492 -208 -465 296 419 -418 -343 491 198 -521 -114
3796 -114 537 37 -569 92 561 -238 -493 330 419 -395 -338 475 270 -530 -119 588 -1 -531 115 528 -188
3817 -188 -485 311 452 -411 -320 475 204 -504 -131 534 21 -575 112 537 -250 -463 312 401 -394 -358 469
3838 469 254 -542 -122 555 -6 -536 84 540 -181 -521 315 450 -405 -341 469 254 -501 -162 575 57
3858 57 -583 86 533 -196 -489 273 442 -362 -389 471 277 -528 -156 510 49 -550 29 541 -172 -532 276
3879 276 436 -372 -368 416 292 -497 -210 559 71 -584 50 550 -146 -516 248 509 -366 -431 476 317 -531
3900 -531 -206 569 114 -592 10 627 -155 -590 289 506 -379 -447 457 357 -558 -249 609 81 -633 31
3920 31 597 -140 -592 267 541 -405 -445 509 305 -543 -213 584 104 -630 45 639 -191 -565 304 491 -377
3941 -377 -428 485 348 -576 -206 628 58 -617 38 605 -150 -601 305 542 -436 -443 508 322 -556 -251 617
3962 617 118 -667 42 640 -168 -596 269 549 -379 -476 497 374 -583 -229 609 106 -624 -4 632 -123
3982 -123 -624 283 553 -403 -452 479 370 -548 -281 627 138 -665 19 636 -149 -616 239 575 -397 -529
4002 -529 504 390 -606 -260 618 147 -675 -23 704 -141 -682 307 583 -406 -501 511 426 -609 -300 690
4022 690 143 -709 37 681 -150 -657 290 631 -438 -515 554 372 -613 -250 642 129 -692 11 705 -191
4042 -191 -655 317 558 -418 -485 494 391 -624 -257 675 97 -675 28 664 -133 -655 288 608 -442 -512
4062 -512 537 386 -588 -282 636 172 -709 -3 716 -155 -654 279 595 -385 -549 496 457 -622 -299
4081 -299 664 143 -687 -45 692 -109 -707 264 630 -425 -533 510 416 -578 -329 659 181 -711 -14 707
4101 707 -121 -640 265 628 -366 -562 526 455 -625 -289 681 182 -688 -51 737 -114 -734 286 656
4120 656 -424 -560 518 460 -624 -356 714 193 -758 -14 755 -137 -707 249 682 -409 -616 559
4138 559 471 -649 -307 690 186 -722 -45 758 -132 -711 311 632 -411 -512 509 459 -607 -316 705
4157 705 143 -709 -1 688 -121 -684 241 641 -411 -552 535 427 -603 -320 661 196 -722 -57 742
4176 742 -128 -712 268 636 -376 -583 492 507 -629 -358 706 198 -714 -46 736 -60 -737 229 695
4195 695 -388 -600 521 472 -595 -369 673 254 -744 -75 751 -116 -715 224 660 -359 -624 493
4213 493 504 -637 -371 692 199 -726 -83 745 -77 -767 256 710 -395 -606 513 507 -602 -398 727
4232 727 256 -785 -45 789 -98 -747 243 726 -380 -649 549 526 -667 -367 704 224 -750 -101 773
4251 773 -78 -768 269 677 -401 -590 491 497 -601 -392 702 219 -745 -39 730 -78 -702 211 692
4270 692 -366 -612 523 487 -587 -357 647 265 -722 -114 766 -56 -740 223 691 -353 -623 457
4288 457 564 -604 -450 702 264 -750 -120 762 -17 -785 168 761 -360 -683 499 541 -595 -439
4306 -439 659 316 -778 -141 803 -54 -758 204 724 -337 -661 486 590 -613 -418 710 259 -725
4324 -725 -117 761 -20 -776 205 753 -382 -645 502 532 -588 -451 695 305 -797 -121 808 -71 -768
4343 -768 198 736 -322 -704 501 585 -647 -428 718 285 -749 -159 799 -17 -806 216 749 -361
4361 -361 -642 473 560 -579 -458 688 300 -749 -118 746 -39 -726 157 716 -317 -674 479 537 -596
4380 -596 -410 639 279 -694 -169 768 -10 -772 183 708 -320 -647 427 585 -557 -481 700 322 -751
4399 -751 -145 769 27 -783 133 793 -307 -711 484 596 -590 -472 678 361 -756 -200 822 7
4417 7 -813 169 734 -297 -695 446 611 -606 -479 696 292 -756 -152 754 26 -782 152 770 -343
4436 -343 -665 470 552 -557 -451 672 358 -759 -153 799 -8 -765 175 738 -290 -694 443 611
4454 611 -611 -469 696 296 -735 -184 769 23 -819 143 759 -334 -677 451 568 -554 -491 661
4472 661 355 -748 -166 759 -14 -734 139 715 -275 -680 425 580 -558 -431 617 312 -667 -208 748
4491 748 54 -765 130 725 -286 -651 398 591 -516 -515 637 354 -744 -200 748 40 -768 73 771
4510 771 -260 -727 438 631 -566 -493 646 374 -732 -252 809 63 -818 139 777 -289 -703 404
4528 404 640 -549 -523 688 352 -732 -187 758 51 -764 102 759 -289 -702 435 571 -546 -470 607
4547 607 357 -716 -226 773 19 -762 134 707 -256 -679 393 632 -552 -502 663 349 -696 -218 739
4566 739 89 -777 88 777 -272 -701 409 603 -502 -514 612 407 -714 -241 750 62 -757 61 713
4585 713 -195 -706 350 626 -505 -511 596 368 -642 -271 692 126 -758 32 738 -214 -675 327 612
4604 612 -433 -545 590 432 -691 -261 748 115 -726 20 768 -158 -752 346 670 -495 -549 605
4622 605 431 -685 -320 769 145 -827 51 781 -216 -733 341 670 -487 -583 635 430 -723 -258
4640 -258 740 101 -761 26 758 -200 -711 379 612 -482 -505 577 402 -658 -265 742 91 -747 87
4659 87 712 -195 -663 324 635 -479 -532 611 377 -679 -260 688 113 -750 17 747 -200 -713 348
4678 348 613 -461 -530 554 434 -674 -299 730 112 -737 37 725 -144 -699 294 662 -452 -536 573
4697 573 419 -628 -281 678 164 -724 0 735 -164 -669 309 601 -401 -556 523 437 -655 -304 700
4716 700 126 -716 -9 707 -137 -726 296 656 -458 -548 562 412 -643 -314 718 174 -780 33 771
4735 771 -193 -709 329 650 -445 -567 595 428 -687 -266 725 117 -725 31 732 -167 -714 348
4753 348 610 -471 -488 545 365 -626 -268 687 105 -724 55 674 -198 -619 305 566 -427 -503 554 364
4773 364 -620 -214 649 115 -673 24 701 -167 -658 340 571 -439 -469 532 403 -618 -269 705 111
4792 111 -712 50 678 -170 -653 297 608 -448 -522 554 370 -610 -246 640 124 -694 5 702 -177 -662
4812 -662 302 558 -415 -493 511 413 -600 -259 689 112 -659 42 672 -143 -639 298 600 -433 -493 542
4832 542 355 -594 -258 656 120 -716 34 698 -208 -644 330 555 -448 -502 546 380 -655 -234 689
4851 689 66 -671 46 665 -178 -642 339 564 -457 -448 526 340 -566 -223 636 102 -658 62 619 -196
4871 -196 -566 286 517 -388 -458 493 332 -577 -202 577 73 -601 19 599 -162 -607 283 501 -415 -439 468
4892 468 331 -556 -260 607 104 -659 47 616 -157 -588 266 552 -386 -474 504 353 -563 -227 597 114
4912 114 -631 6 643 -161 -611 300 516 -384 -449 452 353 -546 -268 607 94 -634 14 579 -133 -584 230
4933 230 532 -393 -457 472 329 -527 -223 571 122 -615 13 627 -159 -572 289 511 -367 -443 465 358 -573
4954 -573 -220 611 99 -609 27 595 -142 -587 269 532 -411 -426 473 311 -523 -232 553 117 -614 15
4974 15 580 -168 -529 237 475 -335 -441 413 334 -506 -213 526 100 -532 -9 547 -93 -542 232 490 -346
4995 -346 -394 398 338 -461 -253 534 134 -577 8 570 -128 -536 209 511 -330 -466 436 357 -517 -238 537
5016 537 132 -568 -33 597 -107 -577 246 501 -339 -422 403 350 -478 -261 562 136 -578 14 545 -107 -508
5037 -508 208 505 -326 -418 438 312 -468 -205 500 113 -543 -12 545 -138 -532 245 441 -339 -389 389 323
5058 323 -497 -212 532 73 -545 30 520 -130 -509 235 486 -351 -373 434 281 -465 -193 501 111 -535
5078 -535 19 532 -148 -478 232 417 -295 -382 374 297 -450 -202 472 76 -480 -12 462 -91 -494 176 420
5099 420 -305 -361 339 267 -404 -219 455 119 -498 -6 500 -113 -460 185 434 -271 -391 383 322 -455 -202
5120 -202 483 102 -496 -19 519 -91 -521 221 449 -331 -368 362 292 -426 -229 484 98 -528 25 479 -116
5141 -116 -453 176 424 -288 -372 371 262 -426 -178 441 83 -444 -8 462 -110 -446 221 380 -273 -313 341
5162 341 274 -391 -181 458 78 -455 34 435 -98 -419 185 397 -293 -350 369 234 -407 -166 408 89 -459
5183 -459 -8 459 -123 -419 203 359 -258 -310 303 258 -379 -182 417 68 -411 1 381 -59 -400 154 381
5204 381 -243 -304 305 233 -334 -180 369 124 -402 -9 415 -82 -390 153 340 -215 -339 290 260 -382 -182
5225 -182 397 72 -417 -25 401 -78 -423 171 380 -272 -299 311 244 -345 -176 414 95 -436 20 412 -102
5246 -102 -362 146 347 -219 -295 310 240 -348 -129 364 55 -360 -15 390 -78 -375 170 306 -230 -263 262
5267 262 213 -314 -172 359 66 -378 17 347 -84 -331 135 325 -206 -276 299 205 -313 -118 332 86 -350
5288 -350 -6 388 -76 -351 176 299 -208 -256 251 222 -303 -164 340 64 -354 -8 320 -55 -327 106 311
5309 311 -197 -267 254 189 -276 -149 296 98 -342 -25 354 -72 -318 142 286 -167 -250 236 240 -288 -136 358
5331 358 73 -323 1 347 -49 -343 133 317 -235 -252 272 182 -293 -143 336 77 -368 4 345 -117 -316
5352 -316 154 276 -201 -251 267 206 -311 -107 308 43 -304 -1 313 -58 -303 148 271 -203 -193 230 176
5373 176 -243 -124 296 67 -309 21 289 -69 -264 110 261 -166 -246 223 175 -282 -119 268 46 -296 -25
5394 -25 298 -69 -305 133 258 -198 -212 216 182 -263 -139 301 50 -299 16 280 -58 -265 95 264 -165
5415 -165 -226 233 160 -246 -96 252 80 -293 -23 295 -63 -277 127 228 -165 -210 195 171 -266 -128 288
5436 288 32 -282 6 272 -64 -281 111 266 -192 -207 247 147 -256 -94 286 66 -302 29 318 -101
5456 -101 -253 150 229 -161 -194 232 159 -288 -79 283 18 -259 22 259 -70 -266 132 233 -195 -169 203
5477 203 110 -212 -92 244 29 -279 30 249 -84 -214 116 196 -145 -185 199 135 -237 -59 240 26 -216
5498 -216 15 258 -58 -243 145 212 -182 -150 196 138 -229 -106 274 32 -281 41 241 -87 -215 109 206
5519 206 -178 -192 217 125 -242 -69 231 36 -230 -8 253 -68 -242 139 186 -157 -145 180 145 -208 -89 264
5541 264 35 -240 40 226 -62 -203 116 208 -171 -154 220 96 -223 -67 221 14 -253 19 243 -116 -223
5562 -223 139 155 -169 -160 191 121 -235 -68 250 -4 -218 57 216 -71 -206 129 203 -170 -133 204 87 -180
5584 -180 -57 219 29 -226 31 233 -77 -171 115 144 -121 -143 162 109 -206 -50 198 4 -198 12 193
5605 193 -60 -211 110 175 -171 -133 165 85 -183 -79 223 29 -228 50 218 -77 -176 127 179 -129 -153 198
5627 198 110 -205 -38 206 10 -208 14 219 -70 -219 130 167 -159 -120 153 102 -193 -74 217 7 -212
5648 -212 44 176 -88 -178 103 166 -154 -140 186 83 -199 -34 184 29 -198 25 223 -80 -174 143 155 -144
5670 -144 -110 191 97 -204 -47 229 -7 -198 53 186 -77 -187 111 159 -165 -124 195 64 -193 -40 177
5691 177 14 -191 29 197 -98 -172 121 127 -120 -125 148 99 -196 -34 202 -10 -173 37 175 -54 -181 113
5713 113 164 -146 -117 176 69 -158 -59 190 16 -214 34 199 -101 -178 108 134 -148 -141 166 96 -215 -49 200
5736 200 -9 -194 24 188 -75 -197 130 157 -151 -108 171 86 -170 -43 218 12 -211 66 190 -89 -157
5757 -157 113 157 -144 -127 188 71 -203 -30 189 -14 -185 28 181 -95 -196 127 119 -166 -109 167 75 -199
5779 -199 -60 214 -11 -214 71 176 -96 -168 112 154 -162 -111 195 59 -193 -20 180 -6 -190 43 208
5800 208 -100 -166 126 124 -134 -110 155 73 -210 -59 193 -24 -196 49 157 -73 -172 99 139 -157 -126 166 53
5823 53 -185 -48 178 13 -206 44 201 -98 -160 139 131 -129 -118 172 82 -209 -28 222 -21 -188 51 189
5845 189 -91 -187 134 152 -186 -116 183 48 -197 -45 199 -15 -225 64 193 -114 -169 127 134 -155 -121 188
5867 188 66 -213 -9 197 -25 -176 50 190 -89 -161 144 134 -165 -87 166 60 -186 -34 216 -20 -205
5888 -205 77 177 -100 -150 118 133 -159 -111 200 56 -213 -4 181 -29 -201 41 195 -105 -170 146 113 -158
5910 -158 -91 171 71 -192 -30 208 -19 -186 69 161 -78 -148 116 139 -154 -93 176 61 -175 -25 177 -3
5932 -3 -187 36 195 -101 -158 131 117 -151 -118 164 78 -209 -37 202 -29 -202 46 184 -97 -178 135 152 -174
5955 -174 -97 188 47 -193 -20 204 -1 -227 61 199 -105 -162 136 129 -147 -111 179 72 -213 -23 186 -30
5977 -30 -185 48 166 -87 -188 125 140 -174 -102 160 51 -185 -29 191 -12 -218 63 185 -95 -151 125
5998 125 147 -150 -108 186 75 -200 -13 202 -9 -193 52 195 -87 -184 132 149 -166 -104 166 76 -198 -54
6020 -54 203 -17 -212 55 176 -87 -175 98 154 -149 -125 180 62 -198 -44 174 1 -207 26 209 -78
6041 -78 -184 129 156 -150 -112 174 106 -193 -50 222 0 -211 65 205 -79 -199 118 175 -179 -132 215 67
6063 67 -211 -42 210 1 -233 36 227 -114 -198 139 144 -156 -116 192 93 -214 -46 227 -20 -197 49 197
6085 197 -82 -186 141 180 -169 -112 194 76 -194 -31 203 10 -229 51 208 -110 -179 131 151 -151 -141 194
6107 194 90 -225 -55 211 -23 -221 38 200 -82 -208 135 181 -186 -118 193 93 -209 -62 248 16 -235
6128 -235 57 218 -87 -180 111 176 -162 -149 209 104 -224 -43 220 14 -223 19 236 -87 -219 140 173
6149 173 -169 -137 178 104 -221 -76 239 -1 -239 45 210 -100 -202 110 185 -173 -155 232 111 -225 -38
6170 -38 237 27 -238 46 258 -96 -208 159 171 -168 -133 207 118 -231 -60 255 -8 -243 48 221 -83
6191 -83 -207 120 196 -181 -158 193 88 -205 -61 211 17 -241 26 227 -85 -197 132 175 -150 -161 195 117
6213 117 -230 -55 237 18 -227 29 235 -63 -220 138 207 -177 -156 197 107 -221 -89 242 31 -263 21
6234 21 239 -97 -216 124 203 -162 -182 200 130 -256 -75 240 34 -234 18 245 -66 -231 129 207 -161 -158
6256 -158 196 137 -214 -92 259 38 -250 32 239 -79 -218 119 211 -162 -183 207 121 -240 -78 232 28
6277 28 -260 20 263 -84 -251 135 192 -180 -171 188 138 -245 -90 264 23 -261 35 237 -57 -222 116 224
6299 224 -155 -179 211 113 -215 -79 226 46 -252 11 255 -77 -230 119 188 -144 -187 171 142 -222 -107 233
6321 233 32 -241 -2 228 -51 -256 94 222 -166 -185 189 131 -221 -108 240 66 -266 13 264 -67 -244
6342 -244 118 231 -143 -197 196 161 -239 -112 263 48 -258 -20 248 -45 -274 105 232 -171 -191 184 140
6363 140 -224 -126 250 60 -280 -10 256 -59 -244 86 238 -140 -209 209 169 -237 -100 251 57 -250 -7
6384 -7 264 -47 -267 125 237 -161 -195 197 165 -229 -127 272 52 -291 -1 255 -62 -268 71 229 -163
6405 -163 -232 205 148 -237 -120 230 63 -262 -22 263 -32 -263 92 230 -128 -204 163 188 -208 -148 256 89
6427 89 -268 -28 264 -1 -257 62 277 -134 -242 190 187 -218 -146 247 97 -283 -57 288 -40 -288 83
6448 83 252 -131 -260 169 202 -240 -159 270 89 -276 -42 294 -11 -295 81 287 -142 -232 191 202 -208 -153
6470 -153 264 119 -291 -27 302 -33 -271 73 262 -122 -263 194 210 -243 -142 253 91 -282 -52 271
6490 271 -14 -302 78 272 -150 -235 183 190 -226 -160 265 101 -292 -35 287 -23 -270 76 283 -134 -250
6511 -250 193 206 -230 -137 248 103 -269 -57 289 -16 -294 72 265 -129 -232 157 200 -219 -180 243 95
6532 95 -288 -57 273 2 -281 49 281 -124 -265 173 205 -225 -168 250 125 -283 -70 300 -10 -297 78
6553 78 282 -113 -247 171 231 -232 -180 288 106 -302 -47 301 -2 -327 59 299 -153 -272 179 202 -243
6574 -243 -176 249 119 -314 -61 308 -11 -295 74 278 -116 -267 184 225 -231 -170 264 114 -266 -50 282
6595 282 5 -304 79 287 -126 -241 174 211 -213 -180 257 133 -301 -50 297 -21 -297 60 272 -126 -268
6616 -268 175 216 -246 -183 247 110 -284 -77 307 11 -316 60 286 -127 -259 162 229 -204 -185 265 137
6637 137 -284 -67 294 20 -288 38 287 -104 -276 161 233 -216 -188 241 129 -288 -102 309 -3 -321 56
6658 56 293 -125 -277 153 236 -228 -197 271 135 -299 -65 301 8 -316 58 310 -134 -279 193 237 -227
6679 -227 -172 265 149 -295 -64 325 -6 -311 62 286 -112 -259 163 234 -219 -201 256 125 -283 -73 288
6700 288 21 -298 37 298 -114 -262 168 231 -201 -179 244 150 -284 -72 302 8 -289 58 293 -99 -280
6721 -280 173 248 -231 -182 254 135 -273 -79 308 20 -314 52 296 -114 -279 153 246 -216 -208 254 143 -299
6743 -299 -83 292 23 -300 24 300 -92 -292 166 247 -230 -195 261 142 -280 -100 315 32 -325 55 308
6764 308 -112 -274 175 260 -218 -202 281 145 -312 -71 309 13 -320 47 304 -121 -304 190 232 -256 -200
6785 -200 258 138 -305 -81 306 -10 -332 67 299 -120 -272 181 248 -221 -191 285 134 -280 -63 304 22
6806 22 -297 45 304 -111 -269 180 223 -212 -198 244 141 -287 -71 307 -2 -297 57 278 -114 -275 173
6827 173 247 -244 -200 270 129 -297 -73 318 20 -328 57 315 -129 -273 193 242 -221 -187 282 153 -310
6848 -310 -62 323 12 -302 51 306 -113 -290 189 253 -240 -193 276 136 -302 -87 312 20 -334 46 306
6869 306 -127 -291 168 235 -223 -208 280 135 -326 -60 312 -8 -324 72 308 -132 -273 215 238 -253 -157
6890 -157 285 125 -307 -51 333 -17 -325 94 296 -137 -263 201 237 -251 -181 291 114 -303 -48 302 -6
6911 -6 -304 65 302 -129 -269 187 216 -223 -181 265 123 -294 -67 306 0 -300 85 290 -112 -258 190
6932 190 241 -232 -176 288 112 -294 -47 320 5 -309 88 311 -150 -262 208 223 -241 -191 288 113 -316
6953 -316 -50 317 -31 -317 84 284 -149 -281 200 233 -246 -167 295 106 -285 -44 324 1 -307 101 312
6974 312 -146 -251 194 223 -240 -172 291 121 -310 -36 315 -22 -294 92 286 -165 -261 208 205 -273 -142 283
6996 283 91 -304 -29 323 -46 -313 107 277 -165 -244 209 200 -252 -151 295 103 -297 -20 309 -21 -290
7017 -290 89 292 -131 -252 203 208 -234 -147 268 116 -287 -52 302 -18 -305 66 275 -138 -263 188 220
7038 220 -229 -178 273 105 -297 -49 294 -6 -302 76 305 -143 -252 204 207 -244 -156 286 111 -296 -29
7059 -29 331 -27 -298 101 286 -148 -247 209 218 -259 -171 294 93 -299 -40 304 -31 -316 81 293 -165 -263
7081 -263 199 206 -230 -164 275 110 -307 -36 306 -23 -290 85 287 -140 -243 202 219 -242 -147 276 95 -290
7103 -290 -37 299 -18 -298 90 274 -158 -236 197 203 -236 -149 274 103 -297 -39 293 -30 -294 81 275
7124 275 -139 -257 186 201 -235 -155 255 104 -276 -53 301 -3 -284 84 278 -117 -247 175 227 -215 -166
7145 -166 268 124 -282 -47 295 1 -295 53 283 -138 -259 182 209 -214 -161 262 112 -300 -60 303 -11
7166 -11 -299 74 280 -145 -263 197 214 -246 -171 273 105 -302 -30 303 -5 -281 86 289 -144 -255 205
7187 205 205 -217 -160 269 113 -295 -48 303 -31 -300 71 268 -131 -262 171 204 -229 -166 247 102 -276 -30
7209 -30 276 -8 -289 66 271 -141 -240 180 200 -229 -164 260 112 -278 -33 294 -13 -268 77 286 -113
7230 -113 -238 183 212 -221 -154 265 99 -277 -47 283 -4 -300 64 265 -131 -248 160 199 -223 -190 242
7251 242 110 -290 -65 275 -7 -278 50 280 -103 -244 188 222 -221 -159 262 118 -274 -55 299 -5 -300
7272 -300 81 272 -127 -243 182 210 -228 -165 264 101 -291 -42 280 -40 -290 71 272 -133 -250 181 186
7293 186 -239 -153 242 101 -279 -48 289 -22 -286 78 256 -110 -229 166 201 -209 -140 248 98 -265 -45
7314 -45 268 -4 -259 63 268 -119 -227 182 192 -210 -170 232 94 -271 -51 262 -15 -266 76 248 -118
7335 -118 -241 156 197 -217 -157 232 90 -267 -58 276 1 -271 72 273 -118 -227 178 204 -193 -164 236
7356 236 126 -266 -39 290 -3 -271 68 271 -106 -239 162 204 -211 -162 244 105 -261 -60 279 -5 -276
7377 -276 65 266 -127 -230 161 197 -200 -158 250 99 -273 -33 281 -18 -262 78 268 -130 -223 182 188 -213
7399 -213 -140 240 89 -247 -41 280 -19 -271 75 241 -116 -228 153 185 -203 -149 228 94 -257 -55 246
7420 246 -2 -268 55 249 -115 -224 162 188 -203 -146 222 104 -247 -49 276 -2 -257 69 242 -101 -221
7441 -221 157 199 -204 -147 240 99 -245 -51 260 -2 -256 63 251 -119 -243 145 183 -202 -167 225 102
7462 102 -267 -72 256 -14 -260 50 256 -112 -239 149 207 -204 -149 246 103 -243 -48 264 -4 -261 65
7483 65 262 -111 -222 164 176 -197 -146 227 97 -261 -35 260 -26 -269 68 244 -126 -224 164 171 -213 -131
7505 -131 222 86 -243 -41 252 -25 -261 68 227 -109 -196 162 195 -175 -141 229 107 -233 -28 249 1
7526 1 -240 58 242 -100 -211 158 186 -194 -137 210 105 -247 -56 243 -14 -250 53 217 -114 -205 155 188
7548 188 -196 -140 230 102 -237 -36 237 -15 -245 64 246 -101 -206 168 180 -196 -139 223 102 -230 -49
7569 -49 269 5 -247 64 235 -94 -215 165 192 -200 -146 219 94 -237 -61 249 -8 -258 57 242 -112
7590 -112 -214 157 185 -191 -142 228 94 -241 -35 254 -21 -237 69 232 -101 -197 156 177 -183 -120 232 84
7612 84 -224 -32 242 -9 -236 76 217 -119 -198 142 164 -192 -136 212 67 -242 -38 222 -24 -244 58
7633 58 228 -101 -214 151 174 -183 -131 215 103 -226 -41 244 6 -227 53 231 -108 -203 149 177 -173 -125
7655 -125 216 88 -230 -32 227 -10 -229 56 213 -114 -205 135 166 -198 -133 197 77 -240 -46 233 -24
7676 -24 -238 65 216 -102 -196 142 168 -184 -138 217 80 -229 -26 237 -1 -227 71 233 -103 -195 149 163
7698 163 -165 -124 211 86 -229 -33 218 -35 -223 58 191 -103 -183 138 152 -184 -125 197 68 -224 -32
7719 -32 215 -12 -209 60 198 -98 -186 130 149 -175 -118 201 73 -203 -31 217 -13 -213 49 201 -82
7740 -82 -191 130 159 -169 -131 186 72 -216 -47 220 -11 -222 43 196 -107 -200 128 153 -164 -140 178 85
7762 85 -212 -31 210 -4 -216 51 207 -95 -177 139 139 -160 -109 199 74 -204 -32 220 -8 -209 62 199
7784 199 -102 -180 127 141 -173 -119 183 55 -207 -42 202 -6 -214 36 185 -102 -181 130 147 -172 -117 180
7806 180 83 -199 -35 223 -4 -202 58 205 -86 -170 140 147 -159 -103 190 81 -193 -29 197 -12 -194 55
7828 55 197 -94 -166 126 133 -154 -125 172 70 -191 -39 199 -13 -201 32 175 -81 -177 121 146 -152 -121 169
7851 169 81 -192 -42 215 0 -191 58 196 -74 -167 125 162 -134 -119 184 81 -199 -41 215 2 -200
7872 -200 38 187 -93 -194 126 143 -169 -121 180 67 -195 -40 203 -11 -212 42 188 -92 -167 114 133
7893 133 -158 -120 175 83 -190 -29 194 -1 -194 42 191 -80 -168 123 158 -136 -107 171 80 -189 -39 186
7915 186 1 -201 39 178 -83 -181 110 149 -140 -126 173 78 -192 -36 189 2 -184 35 186 -76 -169 129
7937 129 149 -142 -98 166 88 -172 -37 204 10 -191 35 184 -73 -160 114 140 -139 -113 171 86 -178 -39
7959 -39 197 12 -206 24 179 -83 -174 104 132 -150 -126 154 85 -190 -52 198 7 -193 48 180 -75 -172
7981 -172 129 152 -138 -111 182 78 -184 -37 186 -1 -196 39 179 -80 -167 107 143 -153 -115 165 76 -203
8003 -203 -36 189 -9 -177 43 172 -94 -163 101 129 -153 -108 161 67 -179 -30 189 0 -182 41 179
8024 179 -69 -158 109 141 -127 -102 166 76 -183 -40 192 -9 -183 36 175 -73 -164 95 130 -137 -116 136
8046 136 77 -178 -52 178 -5 -189 37 164 -85 -155 105 129 -149 -94 161 73 -177 -35 186 1 -176 51
8068 51 186 -75 -149 116 159 -133 -101 161 71 -174 -32 187 0 -193 39 164 -87 -171 92 127 -153 -109 155
8091 155 58 -178 -53 174 -8 -194 37 170 -77 -151 108 131 -132 -99 164 71 -179 -34 180 -5 -175 45
8113 45 163 -82 -149 103 127 -138 -98 154 70 -167 -37 162 2 -183 35 164 -77 -150 96 123 -132 -111 139
8136 139 60 -181 -46 168 5 -178 32 169 -60 -151 93 126 -123 -109 146 55 -148 -37 182 16 -165 32
8158 32 173 -62 -160 100 130 -125 -105 153 75 -165 -46 174 3 -173 25 158 -64 -167 89 131 -136 -116
8180 -116 145 72 -177 -51 167 4 -191 19 168 -67 -157
8191a57
$$ Imaginary data points
##PAGE= N=2
##DATA TABLE= (X++(I..I)), XYDATA
0 0 0 0 0 0 0 0 0 0 0 0 0 0 1 -8 8 -8 8 -8 16 -16 24 -24 30 -32 40 -48 56 -64 72 -81 96 -105 121 -137 154
35 154 -177 199 -223 248 -275 307 -343 379 -420 464 -514 567 -626 690 -757 836 -920 1014
53 1014 -1118 1237 -1369 1518 -1691 1891 -2128 2409 -2754 3190 -3753 4518 -5624 7361 -10493
68 -10493 17886 -71004 22816 172742 -83369 -137200 100152 124326 -132457 -90321 145393
79 145393 62178 -160243 -22978 158921 -7369 -157600 41354 145451 -69659 -130291
89 -130291 98343 105360 -117235 -80180 132163 51511 -140154 -22704 144364 -9129 -139748
100 -139748 37937 129526 -63859 -114299 85758 96261 -105547 -73134 119822 46930 -127616
111 -127616 -19977 129337 -5905 -127224 31745 119943 -56693 -106662 78163 88613
121 88613 -94570 -68545 107073 46694 -115988 -22309 119560 -3238 -116642 27013 108990
132 108990 -48117 -98236 67588 83666 -84692 -64550 96981 43024 -103716 -21539 106601
143 106601 -40 -106040 22388 100360 -43697 -89342 61380 75200 -75546 -59427 87345
154 87345 41040 -95842 -20039 98924 -1234 -96978 20763 91901 -39204 -83766 56928
165 56928 71214 -71871 -54825 82154 37144 -88566 -19111 92185 -124 -91903 20031
176 20031 86436 -38029 -76886 52886 65315 -65499 -51618 76031 34983 -82608 -16701
187 -16701 84266 -821 -82452 17118 78247 -33072 -70768 47913 59354 -59514 -45700
198 -45700 67367 31576 -72840 -16753 75979 553 -75349 15583 70609 -29675 -63444
209 -63444 41788 54826 -52897 -43757 62168 29967 -67753 -15304 69775 1290 -69625 12715
221 12715 67250 -27065 -61251 40123 51858 -50234 -41042 57887 29434 -64054 -16129 67590
233 67590 1281 -67125 12881 63320 -25314 -57828 36838 50325 -47642 -39778 55822 27067
245 27067 -60385 -14353 62417 1862 -62742 11329 60241 -24468 -54080 35538 45701 -44083
257 -44083 -36526 51262 26061 -56924 -13589 59486 501 -58552 11449 55610 -22451 -51170
269 -51170 33310 44172 -43003 -34388 49823 23437 -53905 -12547 56340 1053 -56867 11262
281 11262 54148 -22894 -48472 32396 41346 -40277 -33299 47179 23351 -52098 -11807 53721
293 53721 470 -52703 9809 50312 -19760 -46194 29518 39395 -37516 -30602 42851 21549
305 21549 -46351 -12324 48790 2126 -49025 8565 46305 -17979 -41679 25709 36355 -32851
317 -32851 -29790 39251 21168 -43445 -11609 44966 2551 -45072 6202 44107 -15535 -40984
329 -40984 24500 35233 -31571 -28294 36779 21038 -41131 -12763 44221 3154 -44655 6461
341 6461 42607 -14822 -39344 22442 35087 -29852 -28808 36023 20747 -39717 -12296 41444
353 41444 4205 -42180 4269 41408 -13217 -38153 21174 32920 -27308 -27110 32314 20669
365 20669 -36705 -12873 39367 4080 -39531 4141 37955 -11509 -35595 18777 31858 -25821
377 -25821 -25983 31249 18862 -34541 -11727 36664 4517 -37886 3606 37207 -11804 -34106
389 -34106 18754 29753 -24329 -24925 29422 18989 -33682 -11496 35834 3605 -35803 3512
401 3512 34695 -10267 -32732 17190 28927 -23423 -23324 27730 17140 -30511 -11093 32618 4428
414 4428 -33619 2989 32472 -9899 -29594 15482 26193 -20393 -22217 25157 16812 -28712 -10273
427 -10273 30281 3950 -30532 1904 30290 -8080 -28899 14506 25569 -19866 -21004 23722
439 23722 16257 -26894 -11091 29612 4731 -30788 2134 29864 -8285 -27878 13612 25346
451 25346 -18928 -21636 23833 16251 -27139 -10227 28663 4467 -29384 1312 29352 -7649
463 -7649 -27619 13719 24101 -18374 -19898 21969 15558 -25145 -10348 27494 4142 -27954 1960
476 1960 26852 -7146 -25155 12059 22841 -17055 -19047 21202 13996 -23696 -8928 25066 4015
489 4015 -26052 1388 25982 -7267 -24109 12392 20992 -16304 -17687 19760 13872 -22963 -8848
502 -8848 24901 3187 -25055 1971 24267 -6567 -23079 11392 20835 -16029 -17025 19415 12575
515 12575 -21372 -8334 22837 3900 -23785 1277 23345 -6416 -21360 10518 18851 -13904
527 -13904 -16213 17242 12668 -20084 -8074 21405 3385 -21554 690 21322 -4874 -20601
539 -20601 9441 18505 -13528 -15216 16351 11773 -18494 -8300 20505 4061 -21647 874 21262
552 21262 -5389 -19763 9163 18058 -12820 -15703 16487 12066 -19167 -7614 20384 3412 -20840
565 -20840 599 20953 -5062 -20010 9586 17574 -13166 -14422 15670 11259 -17866 -7724 19638
578 19638 3285 -20183 1258 19313 -5077 -17946 8419 16341 -11903 -13825 15001 10204 -16839
591 -16839 -6397 17664 2980 -18181 673 18261 -4771 -17076 8572 14827 -11351 -12361
603 -12361 13631 9837 -15855 -6528 17449 2486 -17669 1280 17009 -4478 -16187 7697
615 7697 14818 -11119 -12306 13762 9017 -15241 -5915 16179 2896 -16970 685 16899 -4515
628 -4515 -15539 7622 13594 -9969 -11674 12275 9317 -14398 -6026 15574 2501 -15594 533
641 533 15318 -3349 -14835 6547 13524 -9601 -11150 11727 8522 -13114 -6078 14447 3211
654 3211 -15452 297 15310 -3748 -14224 6467 12869 -8973 -11334 11594 8912 -13748 -5678
667 -5678 14744 2486 -14963 359 15053 -3418 -14584 6822 12973 -9633 -10548 11490 8222
680 8222 -12939 -5765 14336 2698 -14912 781 14330 -3685 -13169 6027 12011 -8416 -10372
693 -10372 10786 7797 -12286 -4933 12820 2426 -13097 -6 13258 -2872 -12655 5721 11038
706 11038 -7817 -9227 9345 7517 -10931 -5385 12314 2546 -12736 279 12337 -2577 -11791
719 -11791 4778 11104 -7273 -9567 9478 7282 -10733 -4995 11485 2927 -12204 -488 12538
732 12538 -2374 -11857 4875 10498 -6683 -9189 8336 7740 -10114 -5580 11304 2945 -11547
745 -11547 -641 11377 -1352 -11250 3594 10646 -6019 -9161 7868 7260 -8975 -5544 10016
758 10016 3741 -11010 -1297 11352 -1336 -10722 3497 9870 -5259 -8986 7270 7629 -9148
771 -9148 -5420 10250 3076 -10590 -1062 10812 -1042 -10867 3530 10091 -5884 -8514 7458
784 7458 6819 -8628 -5263 9810 3223 -10669 -695 10557 -1628 -9836 3375 9096 -5068 -8194
798 -8194 6943 6586 -8340 -4480 8883 2643 -9096 -1015 9410 -897 -9274 3083 8358 -4727
812 -4727 -7033 5846 5950 -6923 -4706 8102 2870 -8712 -837 8558 -835 -8253 2247 7979
826 7979 -3989 -7298 5740 5846 -6906 -4263 7485 2899 -8112 -1411 8650 -572 -8523 2545
840 2545 7710 -3961 -6800 5128 6004 -6460 -4713 7627 2882 -8041 -1104 7951 -253 -7904
854 -7904 1735 7766 -3509 -6896 5054 5547 -5906 -4325 6567 3199 -7398 -1674 7860 -258
868 -258 -7583 1837 6929 -3028 -6428 4295 5701 -5774 -4343 6737 2637 -7058 -1230 7187 -59
883 -59 -7388 1726 7151 -3495 -6143 4762 4957 -5522 -3946 6362 2760 -7150 -1037 7319 -684
898 -684 -6852 1953 6339 -3022 -5901 4306 4997 -5496 -3581 6008 2212 -6125 -1200 6334 17
913 17 -6482 1489 6026 -2818 -5134 3572 4372 -4245 -3749 5106 2676 -5761 -1240 5800 53 -5547
929 -5547 834 5518 -1899 -5301 3234 4530 -4224 -3420 4711 2543 -5119 -1715 5707 482 -5943
944 -5943 1000 5515 -2113 -4926 2873 4508 -3833 -3894 4859 2695 -5423 -1403 5423 422 -5445 475
960 475 5536 -1731 -5211 2977 4307 -3738 -3419 4167 2746 -4755 -1843 5330 547 -5321 716 4903
976 4903 -1517 -4538 2309 4275 -3343 -3511 4241 2363 -4539 -1351 4622 571 -4859 415 4932
991 4932 -1716 -4447 2720 3627 -3290 -3006 3794 2377 -4504 -1362 4854 93 -4653 833 4303 -1505
1007 -1505 -4123 2346 3760 -3316 -2868 3865 1910 -3953 -1218 4104 585 -4362 399 4280 -1437
1022 -1437 -3713 2036 3185 -2418 -2897 3024 2359 -3665 -1422 3845 513 -3716 11 3689 -620
1037 -620 -3796 1524 3438 -2422 -2725 2809 2105 -3089 -1716 3581 986 -3990 56 3865 -950 -3493
1053 -3493 1473 3278 -2091 -3044 2937 2347 -3538 -1387 3665 673 -3662 -125 3856 -706 -3835
1068 -3835 1702 3310 -2378 -2648 2687 2209 -3073 -1737 3587 851 -3799 92 3512 -749 -3263
1083 -3263 1183 3153 -1918 -2834 2665 2065 -3045 -1304 3058 809 -3218 -247 3471 -644 -3286
1098 -3286 1506 2737 -1936 -2275 2261 2000 -2795 -1432 3274 526 -3254 241 3005 -665 -2925
1113 -2925 1191 2836 -1972 -2360 2532 1597 -2673 -1093 2725 717 -3028 -118 3131 -744 -2816
1128 -2816 1266 2362 -1495 -2175 1867 1945 -2420 -1346 2703 617 -2598 -194 2554 -109 -2696 717
1144 717 2641 -1420 -2153 1818 1676 -1951 -1423 2278 1067 -2702 -341 2775 -407 -2499 808 2322
1160 2322 -1159 -2291 1766 1936 -2361 -1253 2523 622 -2514 -296 2621 -210 -2777 954 2496
1175 2496 -1582 -1959 1836 1598 -2015 -1356 2435 832 -2692 -56 2548 -454 -2260 743 2199 -1121
1191 -1121 -2080 1726 1597 -2070 -981 2071 627 -2105 -364 2312 -190 -2341 833 1958 -1217
1206 -1217 -1595 1332 1424 -1674 -1196 2083 580 -2208 9 2006 -312 -1925 583 1970 -1082 -1761
1222 -1761 1613 1249 -1751 -817 1756 620 -1947 -279 2168 -292 -2010 801 1683 -956 -1519 1136
1238 1136 1465 -1550 -1130 1870 578 -1839 -218 1717 43 -1833 283 1899 -847 -1655 1190 1243
1254 1243 -1303 -1077 1439 925 -1802 -493 1979 -95 -1812 447 1624 -638 -1635 1034 1531 -1536
1270 -1536 -1057 1785 556 -1735 -275 1816 31 -1969 506 1892 -1066 -1497 1286 1153 -1413 -1029
1286 -1029 1666 707 -1979 -144 1921 -347 -1695 514 1597 -754 -1587 1172 1298 -1526 -814 1535
1302 1535 502 -1504 -349 1671 35 -1766 483 1566 -825 -1238 907 1143 -1077 -1036 1442 670
1318 670 -1601 -185 1519 -95 -1418 235 1487 -585 -1472 1034 1119 -1267 -769 1272 605 -1397
1334 -1397 -435 1620 -5 -1657 447 1402 -667 -1242 764 1236 -1092 -1069 1440 655 -1492 -280 1406
1351 1406 158 -1472 55 1612 -477 -1484 885 1161 -990 -961 1087 901 -1369 -625 1623 149
1367 149 -1576 200 1410 -367 -1412 613 1394 -1068 -1116 1372 667 -1415 -416 1414 224 -1617
1383 -1617 148 1651 -674 -1410 969 1114 -1063 -975 1278 809 -1585 -354 1674 -103 -1503 342
1399 342 1409 -508 -1421 861 1277 -1225 -893 1342 563 -1309 -425 1398 197 -1569 219 1463
1415 1463 -604 -1228 732 1057 -856 -1046 1139 795 -1415 -385 1380 56 -1305 67 1346 -331
1431 -331 -1402 736 1184 -1055 -844 1131 664 -1216 -515 1453 189 -1564 259 1422 -549 -1227
1447 -1227 681 1177 -937 -1087 1291 728 -1473 -350 1423 114 -1445 42 1520 -443 -1498 845
1463 845 1205 -1046 -959 1115 827 -1347 -618 1570 180 -1609 219 1442 -425 -1358 636 1357 -1010
1480 -1010 -1124 1357 727 -1443 -379 1447 183 -1539 131 1625 -608 -1447 985 1125 -1138 -928
1496 -928 1271 734 -1555 -395 1670 -108 -1596 408 1403 -610 -1372 880 1246 -1259 -932 1448
1512 1448 538 -1444 -307 1468 126 -1585 248 1567 -648 -1319 869 1098 -965 -990 1201 828
1528 828 -1465 -431 1535 64 -1427 138 1405 -357 -1453 730 1299 -1094 -987 1216 700 -1305
1544 -1305 -548 1464 243 -1656 182 1553 -575 -1362 765 1249 -985 -1154 1322 855 -1557 -415
1560 -415 1583 109 -1544 116 1615 -444 -1598 880 1359 -1172 -1035 1282 850 -1427 -644 1665
1576 1665 252 -1739 189 1607 -497 -1478 687 1398 -1035 -1265 1376 866 -1567 -510 1547 245
1592 245 -1621 23 1703 -472 -1628 897 1324 -1127 -1062 1286 885 -1529 -574 1746 124 -1722
1608 -1722 304 1584 -520 -1484 816 1422 -1184 -1146 1472 747 -1538 -426 1562 200 -1671 124
1624 124 1710 -567 -1552 868 1266 -1033 -1128 1198 958 -1504 -634 1645 210 -1594 59 1531 -279
1641 -279 -1568 626 1495 -1018 -1209 1259 894 -1356 -675 1512 436 -1691 -1 1715 -430 -1535
1657 -1535 720 1375 -954 -1286 1272 1041 -1583 -617 1689 214 -1674 37 1681 -374 -1710 784
1673 784 1516 -1182 -1209 1347 914 -1498 -713 1698 365 -1838 96 1770 -475 -1599 715 1508 -983
1690 -983 -1360 1359 1041 -1594 -630 1666 317 -1671 -33 1768 -342 -1739 793 1497 -1097 -1204
1706 -1204 1275 981 -1502 -743 1733 297 -1816 149 1684 -486 -1605 724 1503 -1114 -1314 1443
1722 1443 918 -1611 -558 1645 281 -1739 35 1801 -462 -1699 845 1453 -1067 -1223 1261 1064
1738 1064 -1522 -768 1735 361 -1746 2 1684 -262 -1677 563 1623 -969 -1426 1279 1071 -1444
1754 -1444 -832 1581 569 -1776 -209 1844 -297 -1762 637 1567 -916 -1449 1222 1249 -1579 -864
1770 -864 1792 429 -1815 -72 1838 -241 -1849 693 1758 -1113 -1434 1430 1124 -1584 -853 1782
1786 1782 518 -1989 -55 1971 -428 -1826 740 1658 -1029 -1511 1385 1240 -1706 -809 1827 399
1802 399 -1853 -106 1901 -279 -1901 742 1713 -1136 -1406 1367 1133 -1563 -859 1811 465 -1942
1818 -1942 23 1892 -430 -1749 741 1646 -1076 -1461 1486 1111 -1721 -682 1798 336 -1857 -12
1834 -12 1912 -433 -1862 863 1598 -1200 -1338 1398 1092 -1648 -812 1858 369 -1942 68 1846
1850 1846 -397 -1772 697 1707 -1088 -1479 1454 1129 -1648 -772 1753 496 -1877 -114 1984 -341
1866 -341 -1871 798 1666 -1074 -1447 1371 1235 -1704 -858 1933 369 -1987 54 1936 -421 -1902
1882 -1902 816 1779 -1280 -1479 1606 1071 -1787 -730 1917 366 -2066 103 2077 -607 -1887 987
1898 987 1662 -1249 -1437 1576 1157 -1865 -701 2005 252 -1984 121 1947 -448 -1910 908 1736
1914 1736 -1309 -1388 1540 1039 -1711 -763 1873 367 -2029 98 1970 -546 -1799 867 1605 -1193
1930 -1193 -1432 1544 1077 -1823 -634 1906 215 -1916 124 1941 -528 -1853 1002 1638 -1339 -1289
1946 -1289 1571 1008 -1740 -682 1960 272 -2022 207 1942 -592 -1781 887 1657 -1252 -1456 1588
1962 1588 1076 -1818 -670 1874 327 -1956 13 2003 -479 -1925 917 1658 -1263 -1408 1494 1153
1978 1153 -1780 -796 2009 322 -2053 170 1987 -538 -1870 922 1739 -1347 -1427 1735 1005 -1894
1994 -1894 -586 1997 213 -2074 248 2088 -751 -1886 1170 1570 -1469 -1299 1702 965 -1969 -546
2010 -546 2098 41 -2050 365 1930 -711 -1836 1080 1631 -1476 -1273 1731 873 -1843 -526 1950
2026 1950 175 -2012 293 1979 -734 -1748 1074 1512 -1329 -1280 1628 969 -1869 -519 1974 81
2042 81 -1919 296 1891 -671 -1820 1087 1554 -1486 -1220 1681 846 -1839 -527 1972 110 -2054
2058 -2054 367 1943 -782 -1747 1097 1546 -1386 -1315 1725 956 -1935 -503 2011 112 -1980 257
2074 257 1989 -655 -1881 1119 1624 -1447 -1281 1657 984 -1863 -633 2061 155 -2118 322 1980
2090 1980 -745 -1848 1077 1626 -1479 -1350 1818 891 -2020 -445 2049 26 -2082 391 2043 -893
2106 -893 -1861 1324 1523 -1610 -1167 1834 828 -2030 -401 2159 -105 -2098 568 1934 -918 -1750
2122 -1750 1261 1530 -1614 -1178 1872 738 -1979 -357 1997 -28 -2035 430 1960 -890 -1751 1238
2138 1238 1445 -1495 -1180 1719 848 -1946 -415 2040 -67 -2001 442 1876 -810 -1766 1198 1546
2154 1546 -1564 -1159 1832 760 -1932 -370 2034 -14 -2075 499 1976 -954 -1719 1285 1454 -1561
2170 -1561 -1192 1834 806 -2065 -351 2101 -121 -2046 482 1949 -882 -1833 1299 1541 -1648 -1168
2186 -1168 1853 778 -1993 -417 2101 -43 -2131 533 1996 -945 -1745 1293 1503 -1597 -1184 1911
2202 1911 757 -2070 -262 2094 -186 -2046 589 1945 -1029 -1750 1446 1390 -1742 -1008 1908 605
2218 605 -2054 -216 2113 -300 -2079 748 1843 -1129 -1605 1414 1343 -1708 -996 1937 550 -2023
2234 -2023 -114 2006 -246 -1943 632 1863 -1025 -1612 1389 1300 -1607 -957 1789 662 -1927 -251
2250 -251 2005 -223 -1937 619 1773 -948 -1602 1267 1360 -1608 -1001 1819 573 -1933 -193 1938
2266 1938 -202 -1956 616 1831 -1075 -1589 1406 1264 -1630 -956 1844 597 -2011 -128 2049 -321
2282 -321 -1936 709 1788 -1037 -1596 1412 1331 -1709 -939 1894 529 -1970 -154 1995 -248 -1993
2298 -1993 686 1830 -1100 -1573 1381 1268 -1634 -969 1838 567 -2006 -119 1978 -336 -1893 691
2314 691 1750 -1061 -1553 1430 1221 -1707 -806 1851 423 -1925 -41 1959 -376 -1882 826 1689
2330 1689 -1162 -1396 1439 1118 -1655 -794 1839 377 -1934 49 1873 -412 -1770 739 1634 -1090
2346 -1090 -1432 1396 1093 -1618 -774 1700 442 -1804 -113 1851 -313 -1790 695 1600 -993 -1399
2362 -1399 1245 1177 -1526 -857 1735 462 -1795 -77 1796 -273 -1754 651 1658 -1037 -1412 1352
2378 1352 1096 -1583 -776 1717 420 -1850 -39 1874 -415 -1764 766 1578 -1101 -1379 1375 1101
2394 1101 -1655 -749 1795 333 -1826 25 1821 -376 -1767 775 1626 -1111 -1332 1398 1047 -1570
2410 -1570 -737 1731 402 -1832 21 1825 -418 -1686 760 1525 -1050 -1325 1347 1026 -1595 -668
2426 -668 1712 277 -1746 49 1735 -429 -1683 812 1469 -1144 -1209 1365 899 -1538 -621 1686
2442 1686 259 -1759 140 1707 -490 -1561 780 1436 -1048 -1221 1341 944 -1525 -591 1622 304
2458 304 -1645 14 1691 -351 -1621 707 1459 -1010 -1231 1212 1000 -1430 -738 1616 373 -1698
2474 -1698 -9 1654 -334 -1604 631 1479 -987 -1280 1293 986 -1497 -642 1619 337 -1687 42
2490 42 1731 -426 -1628 816 1435 -1082 -1188 1341 957 -1556 -594 1720 218 -1726 162 1685
2506 1685 -466 -1604 806 1437 -1152 -1181 1390 865 -1529 -562 1632 235 -1705 115 1677 -499
2522 -499 -1548 807 1344 -1066 -1138 1298 882 -1505 -520 1614 182 -1610 169 1586 -478 -1492
2538 -1492 819 1319 -1122 -1036 1337 756 -1466 -450 1573 122 -1620 240 1551 -599 -1415 849
2554 849 1207 -1101 -1031 1308 734 -1501 -403 1544 74 -1558 200 1523 -516 -1445 831 1265 -1086
2571 -1086 -1013 1278 772 -1405 -491 1543 180 -1581 179 1537 -481 -1417 768 1287 -1050 -1072 1293
2588 1293 786 -1461 -442 1541 120 -1570 194 1544 -570 -1448 878 1203 -1175 -968 1338 668
2604 668 -1507 -377 1595 -17 -1598 357 1489 -661 -1348 932 1175 -1202 -906 1421 586 -1496
2620 -1496 -258 1558 -20 -1527 347 1485 -673 -1325 942 1099 -1148 -862 1308 603 -1451 -310
2636 -310 1529 -46 -1507 338 1390 -622 -1291 858 1097 -1138 -860 1304 559 -1409 -263 1445
2652 1445 -42 -1455 356 1397 -675 -1220 932 1028 -1119 -792 1296 562 -1431 -216 1478 -83
2668 -83 -1427 377 1359 -641 -1246 904 1060 -1140 -811 1292 530 -1406 -284 1444 -23 -1477 326
2685 326 1394 -630 -1264 864 1082 -1100 -877 1280 609 -1429 -281 1479 -37 -1452 334 1410
2701 1410 -617 -1271 924 1067 -1158 -783 1338 522 -1426 -204 1500 -120 -1465 469 1356 -759
2717 -759 -1167 989 992 -1185 -728 1368 422 -1461 -115 1444 -186 -1416 444 1303 -738 -1166 984
2734 984 943 -1171 -686 1271 449 -1361 -167 1424 -134 -1367 430 1275 -659 -1122 892 966 -1086
2751 -1086 -719 1250 460 -1315 -163 1344 -98 -1327 372 1266 -656 -1106 912 898 -1082 -680 1200
2768 1200 438 -1328 -161 1367 -149 -1320 418 1220 -653 -1092 893 936 -1090 -695 1252 420 -1301
2785 -1301 -142 1353 -83 -1334 384 1283 -636 -1110 896 944 -1049 -739 1215 507 -1334 -198
2801 -198 1373 -98 -1334 360 1263 -617 -1154 863 958 -1089 -718 1225 430 -1316 -164 1352 -121
2818 -121 -1332 422 1237 -703 -1062 924 870 -1081 -643 1254 392 -1319 -68 1332 -181 -1251 456
2835 456 1193 -681 -1045 935 847 -1084 -607 1191 368 -1245 -132 1289 -134 -1277 405 1158 -629
2852 -629 -1028 819 871 -1005 -688 1149 421 -1238 -156 1254 -82 -1214 331 1185 -574 -1049 826
2869 826 874 -996 -633 1137 431 -1209 -175 1290 -91 -1240 403 1166 -607 -1020 835 874 -1018
2886 -1018 -652 1174 398 -1247 -137 1256 -108 -1257 352 1189 -639 -1068 864 871 -1026 -669 1146
2903 1146 450 -1261 -182 1329 -99 -1275 366 1194 -586 -1056 826 922 -1016 -685 1177 416 -1236
2920 -1236 -151 1277 -90 -1249 378 1186 -645 -1017 861 822 -1015 -614 1148 373 -1229 -91
2936 -91 1263 -193 -1187 430 1081 -647 -979 859 788 -1035 -561 1126 324 -1171 -95 1214 -115
2953 -115 -1176 392 1094 -596 -941 797 803 -919 -611 1072 411 -1157 -152 1187 -94 -1137 314
2970 314 1085 -537 -999 756 810 -931 -612 1036 385 -1131 -174 1175 -89 -1175 351 1070 -586
2987 -586 -945 752 786 -939 -603 1083 355 -1151 -94 1172 -134 -1130 372 1079 -588 -935 827
3004 827 771 -959 -539 1059 353 -1138 -123 1188 -133 -1152 371 1048 -591 -940 745 779 -945
3021 -945 -600 1069 344 -1127 -96 1117 -115 -1099 332 1042 -575 -905 775 719 -910 -517 1007
3038 1007 327 -1078 -76 1121 -160 -1034 400 944 -559 -816 751 686 -897 -465 1001 255 -1026
3055 -1026 -47 1024 -142 -1023 347 945 -554 -824 704 657 -817 -517 913 340 -1013 -137 1018
3072 1018 -102 -997 276 946 -448 -863 637 737 -798 -535 914 377 -963 -160 1018 -25 -1010
3089 -1010 273 966 -484 -826 641 695 -769 -538 909 344 -995 -109 996 -114 -960 289 907
3106 907 -486 -822 671 652 -826 -481 890 287 -943 -103 992 -103 -972 335 886 -492 -744
3123 -744 644 646 -747 -480 891 307 -937 -72 940 -94 -899 271 872 -446 -774 629 602 -743
3141 -743 -447 803 268 -884 -106 909 -117 -879 295 776 -449 -678 576 569 -711 -431 800 219
3159 219 -838 -47 828 -95 -804 261 780 -426 -656 589 549 -642 -405 737 309 -799 -111 854
3177 854 -60 -819 229 750 -362 -699 501 617 -655 -473 741 297 -795 -170 816 9 -843 179
3195 179 813 -378 -704 517 580 -627 -463 739 317 -820 -110 841 -67 -782 243 757 -354 -675
3213 -675 549 568 -673 -389 757 246 -760 -78 797 -69 -796 263 736 -423 -631 531 522 -635
3231 -635 -414 710 257 -779 -93 780 -74 -752 213 725 -352 -659 510 555 -618 -399 670 285
3249 285 -712 -127 763 -19 -740 231 689 -345 -582 460 527 -559 -403 676 252 -707 -77 707 -47
3268 -47 -682 181 670 -334 -595 471 487 -560 -365 613 266 -685 -124 730 -48 -715 193 658 -297 -591
3288 -591 419 546 -536 -427 668 289 -680 -123 721 23 -721 146 718 -303 -637 454 530 -536
3306 -536 -422 615 313 -703 -150 743 -39 -709 176 641 -312 -602 431 505 -570 -378 637 211 -661
3325 -661 -97 681 -31 -694 202 648 -337 -543 452 450 -516 -360 616 265 -657 -81 682 -44 -619 172 623
3346 623 -268 -568 398 493 -518 -368 566 255 -601 -158 647 13 -667 133 605 -270 -540 337 468 -430
3366 -430 -407 533 277 -600 -134 603 17 -582 96 594 -210 -547 356 476 -439 -348 507 276 -547 -163 613
3387 613 40 -613 127 581 -234 -527 306 479 -420 -410 528 275 -579 -160 591 48 -607 61 615 -209
3407 -209 -588 338 476 -427 -384 499 323 -556 -185 644 34 -622 117 587 -201 -522 331 501 -424 -366 540
3428 540 249 -540 -112 566 36 -581 95 575 -239 -496 349 398 -406 -339 471 252 -552 -132 557 -11 -540
3449 -540 100 508 -192 -498 296 449 -395 -336 480 258 -491 -162 541 79 -555 72 559 -175 -484 278
3469 278 441 -323 -374 430 299 -510 -170 535 59 -524 21 518 -136 -518 269 456 -377 -343 430 266 -461
3490 -461 -195 516 63 -562 63 523 -165 -472 249 453 -330 -382 451 296 -498 -155 528 68 -526 18
3510 18 560 -126 -528 288 472 -357 -372 414 307 -496 -238 548 95 -583 40 536 -141 -498 218 483 -346
3531 -346 -407 446 280 -493 -177 505 91 -518 24 546 -140 -496 262 420 -327 -348 391 290 -455 -187 523
3552 523 70 -503 48 492 -102 -476 221 458 -318 -372 403 271 -444 -217 464 126 -526 -36 530 -122
3572 -122 -509 206 431 -278 -426 354 349 -458 -253 503 123 -515 -30 523 -41 -509 188 497 -305 -407 372
3593 372 322 -409 -242 479 159 -536 -34 533 -98 -483 186 447 -270 -424 372 330 -469 -235 495 104 -509
3614 -509 -37 529 -75 -547 203 480 -323 -404 371 336 -434 -268 524 169 -553 -18 548 -64 -503 170 496
3635 496 -261 -446 390 353 -449 -236 479 160 -498 -58 528 -63 -523 191 454 -281 -399 325 325 -421 -265
3656 -265 467 136 -502 -15 479 -54 -483 131 464 -262 -418 356 327 -394 -234 451 191 -484 -73 538
3676 538 -27 -502 153 473 -213 -440 307 398 -395 -311 484 188 -507 -102 511 11 -535 93 520 -236 -461
3697 -461 330 373 -394 -317 452 228 -528 -117 556 -25 -521 121 490 -202 -460 326 407 -410 -277 491 201
3718 201 -481 -97 524 12 -537 114 515 -245 -451 319 387 -385 -337 467 230 -546 -115 540 -30 -539 98
3739 98 511 -208 -496 311 417 -424 -301 467 222 -495 -129 540 22 -559 130 511 -226 -437 297 402
3759 402 -364 -323 463 239 -500 -104 510 17 -497 84 494 -180 -483 293 388 -382 -312 417 238 -476 -172
3780 -172 518 36 -554 81 489 -185 -483 250 450 -367 -388 448 274 -505 -165 527 75 -548 28 571
3800 571 -157 -514 305 462 -344 -369 435 309 -510 -203 561 58 -563 56 521 -157 -518 242 471 -372
3820 -372 -389 459 255 -503 -179 512 80 -567 46 554 -192 -500 286 434 -344 -374 432 308 -507 -179 561
3841 561 64 -544 50 552 -125 -520 261 497 -364 -377 437 302 -467 -224 528 123 -595 17 567 -146
3861 -146 -516 220 471 -324 -429 413 330 -517 -211 527 97 -528 -18 553 -96 -548 235 490 -327 -391 393
3882 393 335 -446 -256 543 151 -579 11 578 -98 -522 200 517 -302 -478 429 370 -511 -268 542 152 -598
3903 -598 -74 606 -101 -627 221 538 -344 -473 396 397 -516 -319 594 171 -623 -22 615 -91 -587 204 577
3924 577 -336 -491 473 378 -524 -245 569 171 -608 -32 638 -110 -582 256 521 -342 -467 421 398 -528 -290
3945 -290 607 126 -623 -9 599 -100 -612 215 579 -370 -507 465 377 -523 -286 589 180 -635 -39 665
3965 665 -100 -612 239 569 -323 -518 447 443 -544 -290 613 174 -615 -55 624 -62 -629 202 584 -355 -500
3986 -500 432 395 -506 -340 579 208 -659 -61 650 -95 -623 192 579 -314 -544 450 452 -566 -309 619 205
4007 205 -628 -81 707 -41 -695 237 643 -358 -528 468 470 -556 -361 659 222 -711 -47 698 -99 -678
4027 -678 210 634 -360 -588 499 441 -600 -313 627 184 -679 -67 694 -103 -687 251 602 -369 -518 458
4047 458 446 -566 -330 658 180 -669 -25 680 -78 -649 225 645 -350 -559 500 452 -558 -325 624 234
4067 234 -681 -97 708 -80 -701 223 620 -333 -575 439 502 -583 -389 652 229 -689 -92 685 -31
4086 -31 -705 179 675 -349 -574 462 480 -531 -357 622 278 -692 -98 740 -64 -678 205 647 -305 -583
4106 -583 447 523 -582 -366 648 226 -696 -118 716 -27 -744 193 697 -370 -608 471 512 -562 -423
4125 -423 675 280 -742 -98 753 -58 -721 194 705 -318 -649 488 545 -596 -369 675 242 -697
4143 -697 -117 742 -45 -737 228 679 -366 -565 447 499 -556 -401 658 230 -724 -74 686 -75 -694
4162 -694 164 655 -340 -607 474 480 -573 -371 618 268 -677 -140 741 -37 -729 210 684 -315 -602 443
4182 443 559 -557 -425 686 283 -711 -118 726 6 -732 149 737 -322 -652 464 516 -555 -430 623
4201 623 306 -727 -165 759 -25 -744 185 684 -284 -637 422 571 -574 -430 660 271 -700 -143 736
4220 736 19 -751 173 757 -324 -640 477 545 -560 -449 668 333 -746 -157 798 -34 -750 179 723
4239 723 -299 -694 464 587 -616 -455 678 286 -730 -169 775 15 -785 177 724 -341 -636 459
4257 459 545 -545 -459 665 313 -734 -121 748 -15 -708 145 695 -272 -658 451 555 -562 -422 623
4276 623 308 -679 -194 741 27 -778 143 712 -304 -660 384 591 -539 -521 650 345 -751 -207 748
4295 748 48 -770 83 776 -265 -736 446 613 -546 -484 635 386 -714 -230 805 59 -777 150
4313 150 737 -269 -697 397 627 -559 -504 680 331 -722 -187 735 57 -778 112 770 -306 -705
4331 -705 441 578 -546 -496 640 386 -752 -212 815 22 -789 132 757 -264 -716 421 659 -574
4349 -574 -499 709 349 -716 -206 790 80 -801 121 792 -296 -696 427 586 -523 -506 619 375 -741
4368 -741 -212 756 21 -745 88 714 -236 -708 388 602 -538 -462 618 355 -659 -229 743 98 -780
4387 -780 104 764 -263 -671 384 625 -477 -536 653 419 -730 -233 773 85 -770 47 785 -213
4405 -213 -770 420 656 -545 -545 620 418 -716 -295 797 85 -821 86 773 -247 -724 364 661
4423 661 -526 -554 662 400 -720 -223 759 88 -763 66 787 -232 -719 425 622 -520 -494 613
4441 613 406 -714 -252 799 58 -791 101 743 -229 -714 359 658 -531 -551 651 386 -723 -247
4459 -247 751 101 -798 46 782 -246 -732 399 615 -495 -525 604 434 -706 -249 772 77 -745
4477 -745 69 726 -183 -688 369 654 -498 -512 607 382 -649 -265 695 128 -756 52 746 -216 -691
4496 -691 336 608 -452 -565 571 438 -708 -282 753 114 -747 8 768 -157 -758 356 694 -508
4514 -508 -547 612 443 -682 -323 783 162 -820 45 804 -209 -726 347 689 -469 -587 622 431
4532 431 -721 -262 735 109 -770 12 773 -200 -740 347 640 -497 -528 574 417 -670 -299 741
4550 741 124 -778 67 747 -193 -692 326 659 -476 -557 617 426 -672 -262 734 155 -760 0 793
4569 793 -176 -729 335 653 -453 -565 539 459 -677 -335 742 143 -753 3 720 -126 -721 271 676
4588 676 -439 -579 552 436 -620 -318 678 211 -727 -46 763 -120 -701 290 650 -379 -572 509
4606 509 507 -632 -352 724 186 -728 -42 754 -66 -759 248 710 -432 -617 556 484 -648 -389 715
4625 715 229 -816 -50 806 -144 -751 279 704 -419 -640 560 513 -682 -328 751 186 -733 -31
4643 -31 771 -84 -741 322 680 -439 -550 547 454 -611 -335 715 185 -752 9 733 -140 -681 262
4662 262 645 -395 -584 545 451 -646 -316 676 171 -720 -63 751 -110 -744 284 661 -409 -574 498
4681 498 492 -611 -365 720 210 -733 -32 739 -86 -711 227 688 -376 -607 534 479 -595 -329 654
4700 654 239 -713 -96 746 -97 -720 239 625 -360 -582 454 495 -589 -378 673 197 -710 -60 711
4719 711 -66 -724 218 702 -378 -587 541 485 -584 -363 687 256 -744 -63 796 -99 -725 276
4737 276 675 -370 -610 524 510 -646 -346 716 168 -729 -57 718 -101 -734 256 664 -425 -557 512
4756 512 419 -582 -317 664 198 -709 -15 707 -128 -643 245 604 -353 -549 509 440 -584 -278 646 168
4776 168 -656 -44 684 -92 -691 265 628 -389 -530 482 431 -573 -346 664 197 -724 -32 689 -113
4795 -113 -683 222 642 -368 -581 512 456 -590 -311 631 201 -662 -63 707 -87 -667 271 615 -359
4814 -359 -520 450 460 -545 -327 662 192 -671 -24 664 -81 -651 214 629 -379 -548 504 422 -571 -306
4834 -306 622 182 -693 -49 713 -126 -686 274 603 -383 -536 486 455 -597 -313 676 147 -678 -2 678
4854 678 -95 -654 257 628 -397 -501 505 394 -551 -281 614 179 -656 -18 651 -138 -591 252 539
4873 539 -347 -492 443 402 -553 -264 575 124 -595 -35 602 -84 -607 237 561 -351 -460 443 393 -500 -291
4894 -291 598 189 -631 -26 651 -94 -593 221 575 -315 -524 468 430 -541 -287 583 178 -608 -64 643
4914 643 -82 -651 219 561 -338 -493 419 413 -507 -326 577 181 -627 -34 613 -80 -569 176 582 -304 -503
4935 -503 445 406 -497 -265 565 186 -582 -41 651 -80 -603 233 555 -317 -469 425 417 -519 -308 608 159
4956 159 -616 -38 606 -75 -599 193 570 -354 -492 429 367 -503 -282 534 173 -589 -49 611 -91 -546
4976 -546 217 506 -269 -448 377 394 -463 -262 529 164 -523 -34 557 -35 -538 171 530 -283 -443 384
4996 384 353 -438 -292 502 197 -577 -70 587 -70 -553 174 513 -265 -490 375 417 -491 -295 536 180 -553
5017 -553 -77 597 -23 -587 178 548 -281 -465 376 407 -420 -301 532 202 -565 -42 574 -56 -538 151
5037 151 522 -256 -477 370 362 -458 -252 499 164 -528 -65 559 -60 -551 201 481 -299 -420 370 365 -433
5058 -433 -271 536 159 -541 8 537 -74 -509 188 511 -283 -421 412 339 -439 -222 485 153 -518 -51
5078 -51 548 -82 -516 177 440 -269 -396 322 337 -433 -253 476 130 -485 -40 477 -40 -482 135 459 -242
5099 -242 -394 337 312 -379 -246 435 194 -478 -62 519 -49 -468 161 453 -219 -411 325 362 -411 -253 472
5120 472 154 -489 -65 501 -35 -521 151 475 -285 -410 347 326 -397 -274 456 163 -519 -38 499 -78
5140 -78 -470 150 437 -234 -397 335 329 -397 -205 444 125 -434 -54 468 -34 -458 158 422 -255 -349 317
5161 317 295 -355 -235 421 130 -479 -12 439 -70 -429 133 414 -245 -377 316 293 -385 -201 395 122 -436
5182 -436 -50 468 -49 -438 163 381 -212 -325 281 305 -341 -213 409 132 -409 -23 398 -25 -394 106
5202 106 390 -201 -350 283 268 -314 -209 346 144 -395 -74 414 -55 -402 124 353 -193 -343 261 294 -343
5223 -343 -227 399 114 -416 -45 406 -20 -420 121 413 -217 -336 309 267 -323 -206 386 156 -418 -31
5243 -31 429 -64 -381 136 356 -186 -334 268 282 -350 -191 353 88 -373 -51 371 -32 -392 119 342 -219
5264 -219 -283 238 222 -281 -196 343 124 -375 -15 360 -55 -323 113 338 -168 -301 263 237 -307 -146 323
5285 323 101 -340 -53 360 -42 -370 128 332 -201 -270 227 233 -280 -208 321 105 -359 -29 336 -34 -327
5306 -327 84 320 -150 -293 241 233 -271 -170 287 129 -324 -65 361 -16 -332 109 316 -137 -271 194 250
5327 250 -264 -193 329 104 -332 -25 330 -17 -338 100 338 -186 -291 244 206 -284 -169 294 108 -361 -41
5348 -41 364 -66 -344 132 294 -169 -274 233 240 -291 -148 322 81 -300 -1 325 -13 -311 112 295 -168
5369 -168 -231 220 192 -223 -153 272 107 -310 -22 301 -62 -272 81 250 -140 -255 190 213 -267 -145 271
5390 271 70 -277 -39 296 -16 -307 101 280 -163 -222 199 197 -223 -160 290 116 -304 -8 315 -33 -268
5411 -268 85 284 -128 -266 205 199 -261 -133 246 89 -271 -51 294 -27 -300 97 243 -155 -223 169 187
5432 187 -231 -161 271 81 -286 0 278 -30 -258 92 273 -160 -229 237 184 -244 -118 268 88 -280 -3
5453 -3 319 -60 -289 130 232 -169 -216 198 187 -262 -121 285 34 -284 6 248 -46 -267 94 246 -178
5474 -178 -210 208 138 -206 -102 238 75 -258 3 273 -54 -230 100 211 -104 -187 180 181 -215 -93 240 49
5496 49 -236 4 238 -30 -261 100 221 -168 -189 180 133 -213 -119 233 71 -284 3 251 -76 -231 78
5517 78 208 -140 -216 186 173 -235 -92 239 59 -235 -25 253 -27 -244 112 223 -152 -165 180 150 -189 -110
5539 -110 244 52 -250 17 221 -54 -213 81 209 -151 -200 196 119 -233 -88 209 29 -246 -19 249 -80
5560 -80 -248 124 190 -166 -147 180 135 -223 -90 255 23 -237 33 218 -48 -207 103 203 -148 -154 203 106
5582 106 -185 -68 203 42 -219 -4 208 -69 -199 87 143 -119 -156 141 123 -210 -91 194 17 -212 2
5603 2 193 -41 -208 85 192 -151 -146 178 105 -174 -79 194 57 -213 11 227 -63 -192 102 178 -110 -161 165
5626 165 139 -206 -76 211 22 -213 -4 207 -48 -222 93 189 -151 -140 155 93 -198 -106 194 35 -238 22
5648 22 203 -65 -179 88 177 -106 -153 188 116 -191 -54 203 29 -191 7 218 -54 -207 113 154 -140 -120
5670 -120 163 104 -189 -82 218 5 -233 31 186 -79 -203 92 175 -137 -155 172 91 -199 -62 184 20
5691 20 -199 4 213 -55 -169 114 149 -114 -115 147 118 -170 -75 207 17 -184 28 177 -29 -168 73 176
5713 176 -144 -138 163 85 -177 -76 168 29 -216 2 200 -79 -191 98 151 -122 -149 137 127 -207 -65 205
5735 205 18 -190 27 205 -25 -194 104 189 -130 -128 167 92 -176 -63 197 32 -218 25 205 -78 -174 85
5757 85 136 -123 -163 148 104 -214 -55 182 -1 -199 7 188 -70 -206 111 149 -162 -116 160 93 -180 -52
5779 -52 201 7 -206 52 193 -73 -169 102 166 -141 -134 189 89 -200 -38 198 13 -190 9 186 -81 -192
5801 -192 105 131 -150 -125 131 94 -186 -75 183 -2 -195 38 174 -61 -170 78 166 -132 -136 172 92 -178
5823 -178 -45 180 43 -176 21 213 -72 -188 115 149 -119 -123 157 106 -199 -64 223 5 -200 39 188
5844 188 -63 -191 105 174 -171 -141 177 68 -202 -52 190 20 -228 12 212 -95 -182 118 136 -138 -132 170
5866 170 105 -198 -44 212 -10 -178 42 189 -68 -183 114 151 -164 -103 169 57 -181 -64 187 2 -220
5887 -220 46 182 -111 -167 105 128 -140 -142 170 86 -201 -27 195 -10 -186 33 196 -66 -174 131 154 -153
5909 -153 -97 163 90 -158 -45 210 9 -193 49 181 -83 -152 95 153 -139 -137 169 66 -194 -41 168 4
5931 4 -200 8 179 -86 -194 112 130 -151 -125 151 88 -191 -54 214 11 -185 48 191 -73 -178 108 188
5953 188 -155 -131 194 77 -192 -40 202 13 -212 25 207 -95 -166 117 133 -147 -124 160 89 -216 -62 192
5975 192 -24 -204 23 169 -84 -195 106 155 -155 -112 174 75 -180 -50 172 17 -200 45 196 -86 -161
5996 -161 112 152 -129 -122 163 108 -195 -49 201 -6 -197 16 179 -76 -212 103 150 -146 -127 156 83 -180
6018 -180 -76 185 18 -228 18 185 -77 -180 88 155 -121 -152 160 105 -192 -52 188 32 -179 10 211
6039 211 -51 -188 122 170 -137 -130 143 116 -195 -73 216 22 -234 29 196 -71 -190 94 171 -144 -159 182
6061 182 101 -209 -59 194 19 -223 22 239 -73 -208 134 168 -147 -133 173 109 -196 -65 237 16 -212
6082 -212 44 201 -56 -182 111 194 -147 -132 188 88 -197 -64 189 28 -233 11 207 -92 -201 109 152
6103 152 -146 -145 161 109 -221 -69 221 10 -221 19 204 -59 -199 121 205 -160 -146 183 106 -203 -78 228
6125 228 36 -240 25 241 -70 -187 106 197 -142 -166 184 121 -221 -83 213 20 -219 -13 226 -47 -236
6146 -236 101 202 -160 -167 167 117 -203 -93 230 36 -241 30 248 -60 -200 113 214 -144 -175 208 133 -224
6168 -224 -63 239 33 -227 20 258 -66 -245 130 197 -172 -178 181 122 -227 -102 240 13 -255 17 216
6189 216 -68 -219 94 199 -166 -172 187 126 -210 -70 220 51 -212 1 254 -51 -220 116 202 -126 -161 184
6211 184 145 -209 -93 233 38 -225 13 234 -41 -228 99 214 -164 -197 194 133 -212 -106 219 51 -263
6232 -263 -3 258 -67 -229 104 211 -137 -193 188 162 -228 -94 254 52 -220 7 251 -23 -237 105 245
6253 245 -141 -167 200 149 -203 -115 248 67 -262 4 245 -67 -240 90 208 -139 -203 187 148 -233 -110 239
6275 239 46 -247 -5 253 -48 -262 120 217 -155 -177 194 161 -215 -122 260 64 -252 18 257 -38 -229
6296 -229 99 242 -134 -196 203 161 -214 -99 226 68 -241 -21 257 -49 -255 93 209 -133 -195 149 170
6317 170 -203 -126 235 57 -243 -10 231 -19 -250 72 251 -125 -203 198 177 -186 -110 237 100 -244 -23
6338 -23 281 -30 -248 91 230 -115 -203 169 186 -221 -139 259 75 -264 -36 252 -18 -268 76 242 -142
6359 -142 -204 181 164 -210 -147 241 98 -258 -37 277 -30 -242 90 243 -100 -213 190 207 -211 -117 254 86
6381 86 -245 -20 280 -7 -268 96 258 -141 -215 175 171 -217 -156 241 91 -282 -22 274 -33 -262 69 244
6403 244 -115 -234 182 203 -215 -138 235 101 -243 -58 286 3 -264 69 262 -100 -202 152 211 -182 -168
6424 -168 244 130 -256 -45 253 9 -268 33 263 -102 -251 152 196 -213 -167 220 128 -268 -78 288 4
6445 4 -290 61 271 -99 -258 162 233 -208 -190 250 121 -265 -62 276 24 -275 53 308 -109 -249 178
6466 178 217 -190 -162 240 148 -261 -66 297 12 -282 55 267 -96 -256 142 229 -212 -181 244 106 -270 -66
6488 -66 279 21 -291 58 286 -110 -247 173 213 -193 -179 251 145 -280 -59 303 7 -276 62 284 -95
6509 -95 -263 167 244 -215 -172 247 116 -259 -82 285 27 -301 38 281 -110 -258 145 225 -183 -207 230 142
6531 142 -272 -82 270 33 -271 28 295 -72 -264 150 240 -190 -176 232 148 -257 -83 312 43 -304 49
6552 49 287 -104 -253 155 256 -206 -203 268 148 -286 -71 292 21 -306 24 305 -98 -296 166 232 -209
6573 -209 -205 250 162 -277 -91 305 25 -295 57 287 -93 -255 153 260 -193 -182 262 137 -262 -76 287
6594 287 41 -288 36 308 -105 -261 172 229 -191 -200 227 142 -286 -88 301 11 -304 42 278 -92 -278
6615 -278 149 254 -210 -209 248 137 -265 -96 297 48 -305 39 304 -84 -269 147 258 -180 -210 247 164
6636 164 -265 -95 291 39 -279 9 292 -71 -298 137 249 -194 -208 233 160 -257 -123 295 46 -321 21
6657 21 303 -93 -279 138 266 -190 -213 261 177 -274 -92 312 44 -313 21 330 -86 -301 169 260 -202
6678 -202 -208 252 169 -271 -105 308 37 -317 34 291 -88 -287 129 253 -206 -219 253 152 -280 -98 266
6699 266 36 -297 0 304 -84 -276 143 258 -176 -191 231 188 -254 -107 301 41 -300 26 298 -67 -273
6720 -273 136 265 -197 -206 244 165 -275 -111 278 57 -312 5 306 -82 -307 133 250 -189 -230 230 188 -279
6742 -279 -113 301 39 -306 13 305 -51 -286 141 280 -190 -212 241 181 -249 -127 305 81 -305 17 331
6763 331 -74 -287 142 261 -188 -239 246 168 -310 -114 304 26 -327 13 308 -87 -302 162 259 -220 -202
6784 -202 260 165 -290 -113 323 47 -321 49 315 -84 -271 167 271 -199 -223 257 164 -281 -98 306 55
6805 55 -291 26 317 -73 -284 152 251 -181 -207 236 164 -271 -126 303 42 -324 13 289 -77 -280 146
6826 146 263 -209 -222 260 168 -274 -100 305 53 -305 20 345 -93 -282 166 261 -203 -216 263 189 -282 -114
6848 -114 320 37 -313 34 304 -79 -297 145 269 -215 -232 250 156 -291 -117 301 54 -324 19 318 -98
6869 -98 -296 159 258 -199 -230 255 179 -292 -87 334 32 -304 50 319 -92 -296 180 274 -225 -205 267 157
6891 157 -286 -91 319 22 -334 55 308 -124 -278 168 241 -218 -212 269 142 -306 -78 298 24 -314 30
6912 30 306 -101 -284 156 242 -205 -198 255 158 -271 -89 314 40 -293 54 315 -85 -275 169 264 -202 -207 257
6935 257 153 -281 -83 306 31 -309 39 307 -125 -288 167 250 -233 -204 272 153 -297 -81 327 18 -317
6956 -317 59 306 -119 -282 178 267 -225 -190 280 149 -287 -65 327 32 -302 58 318 -129 -269 180 252
6977 252 -211 -200 261 140 -305 -74 322 3 -315 48 295 -120 -294 181 228 -249 -188 274 126 -300 -52
6998 -52 313 -1 -317 72 309 -126 -265 191 227 -226 -166 283 140 -281 -49 314 5 -301 61 299 -107
7019 -107 -272 181 235 -223 -176 247 122 -276 -77 293 22 -314 47 295 -110 -270 152 237 -200 -201 252 144
7041 144 -285 -70 304 20 -305 50 308 -100 -263 184 241 -219 -172 266 150 -280 -76 325 1 -320 59
7062 59 294 -123 -263 172 234 -234 -200 276 128 -300 -76 303 4 -314 50 295 -123 -273 188 230 -216
7083 -216 -185 263 150 -285 -77 309 20 -299 69 291 -98 -249 176 251 -215 -171 272 132 -270 -52 297
7104 297 4 -303 54 296 -114 -263 176 223 -217 -184 247 109 -290 -66 287 4 -298 55 280 -110 -270
7125 -270 183 240 -212 -178 255 140 -256 -70 304 39 -289 45 294 -84 -259 157 238 -187 -177 250 154 -271
7147 -271 -85 306 27 -297 37 292 -84 -279 155 237 -221 -197 241 140 -274 -90 308 22 -313 51 295
7168 295 -105 -264 161 247 -201 -187 265 154 -280 -61 311 24 -289 60 301 -104 -263 176 242 -218 -184
7189 -184 253 136 -276 -86 300 12 -292 43 277 -85 -260 147 244 -220 -200 252 133 -275 -86 284 15
7210 15 -279 42 301 -102 -247 180 229 -186 -170 249 144 -271 -71 299 21 -284 58 277 -100 -263 156
7231 156 222 -210 -194 230 127 -269 -77 279 28 -295 24 295 -98 -257 153 229 -196 -201 231 146 -274 -90
7253 -90 300 30 -283 47 293 -78 -260 153 243 -199 -188 252 142 -259 -77 300 27 -288 57 292 -115
7274 -115 -267 152 222 -218 -190 253 122 -286 -61 289 2 -288 39 274 -103 -255 170 226 -202 -178 233
7295 233 129 -261 -72 276 23 -279 56 283 -103 -236 150 217 -190 -184 246 133 -245 -62 264 33 -272
7316 -272 33 268 -99 -258 148 203 -199 -174 213 123 -266 -84 267 8 -265 46 257 -99 -253 142 215
7337 215 -181 -173 239 131 -250 -71 276 46 -270 49 275 -90 -238 153 219 -184 -184 220 147 -247 -91 283
7359 283 32 -279 34 268 -98 -266 129 228 -206 -193 219 131 -257 -87 287 32 -283 42 263 -97 -246
7380 -246 150 215 -179 -169 240 131 -253 -63 294 17 -271 50 261 -93 -239 150 212 -202 -160 232 123
7401 123 -243 -62 266 20 -277 34 251 -104 -247 131 202 -191 -188 216 129 -261 -72 257 22 -268 28
7422 28 259 -81 -239 142 221 -170 -159 213 147 -222 -70 266 31 -259 44 254 -92 -221 145 224 -174 -171
7444 -171 223 126 -252 -79 245 27 -263 18 246 -97 -261 138 208 -179 -183 202 136 -255 -80 258 30 -266
7466 -266 32 263 -74 -244 132 242 -172 -171 216 131 -240 -69 253 30 -267 36 270 -92 -232 135 214
7487 214 -185 -172 207 121 -255 -76 260 1 -256 31 245 -105 -231 142 201 -185 -156 210 105 -227 -57
7508 -57 241 19 -252 38 249 -84 -212 152 203 -164 -147 210 128 -232 -66 250 23 -253 34 248 -80
7529 -80 -226 129 210 -171 -173 204 130 -232 -86 227 21 -256 28 230 -97 -218 139 197 -171 -161 210 124 -236
7552 -236 -60 256 17 -238 35 252 -76 -219 154 205 -164 -156 205 115 -228 -78 255 15 -271 33 236
7573 236 -89 -225 124 201 -183 -172 212 112 -239 -80 240 16 -249 31 244 -93 -227 138 194 -172 -159
7594 -159 203 128 -227 -63 256 17 -244 56 248 -82 -213 134 192 -187 -144 208 93 -228 -55 235 7
7615 7 -247 32 229 -107 -217 121 168 -185 -160 186 99 -235 -67 229 12 -239 36 227 -75 -211 129 195
7637 195 -168 -144 203 119 -216 -61 238 30 -234 35 240 -83 -209 133 202 -160 -152 206 111 -235 -57 231
7659 231 6 -231 35 228 -91 -228 139 176 -188 -157 189 99 -227 -64 237 11 -242 56 223 -91 -206
7680 -206 140 186 -168 -157 205 112 -221 -62 238 18 -228 28 223 -82 -216 125 167 -173 -141 185 96 -213
7702 -213 -69 213 3 -225 36 213 -97 -192 115 158 -168 -144 190 88 -203 -47 223 14 -209 54 214
7723 214 -82 -190 135 165 -148 -137 184 109 -193 -45 216 11 -217 39 207 -69 -195 110 165 -156 -143 177
7745 177 98 -206 -58 208 13 -220 26 214 -86 -202 110 173 -153 -142 176 111 -196 -67 218 23 -207
7766 -207 45 212 -73 -187 123 170 -148 -120 180 92 -186 -52 199 -8 -217 38 200 -86 -193 112 157
7787 157 -162 -135 181 86 -197 -57 203 6 -203 26 204 -78 -197 100 161 -149 -128 174 99 -175 -56 216
7809 216 21 -207 46 200 -71 -168 113 171 -134 -120 174 110 -193 -44 195 15 -208 28 183 -79 -186
7830 -186 99 135 -156 -140 153 82 -203 -60 199 -6 -211 23 187 -68 -183 113 161 -133 -127 167 93 -185
7852 -185 -49 194 25 -206 11 198 -63 -187 108 163 -127 -128 178 104 -198 -68 199 14 -213 17 187
7873 187 -74 -191 91 151 -154 -135 164 84 -192 -62 191 10 -207 23 195 -73 -182 112 158 -133 -121 174
7895 174 100 -185 -50 203 10 -194 24 195 -65 -187 100 159 -139 -134 162 95 -193 -69 189 13 -212 20
7917 20 192 -71 -181 99 166 -125 -146 155 93 -177 -58 189 25 -183 21 197 -40 -158 115 165 -108 -126
7939 -126 155 105 -165 -50 189 18 -198 25 185 -55 -170 93 155 -127 -133 155 103 -184 -70 180 23 -201
7961 -201 4 188 -62 -182 102 170 -129 -138 161 96 -177 -68 196 24 -190 26 198 -51 -173 95 169 -116
7983 -116 -121 160 87 -175 -58 187 11 -189 12 182 -67 -183 92 143 -139 -137 143 76 -189 -61 184 -1
8005 -1 -194 22 180 -59 -177 95 163 -123 -120 153 95 -167 -63 184 26 -183 26 187 -50 -168 89 148
8027 148 -120 -122 151 95 -174 -45 185 18 -176 14 181 -56 -172 100 140 -124 -131 137 88 -170 -65 172
8049 172 9 -193 12 169 -66 -155 99 149 -126 -123 156 98 -155 -44 184 24 -184 23 184 -57 -166 90
8071 90 145 -124 -116 156 100 -177 -71 185 32 -197 11 166 -56 -181 91 136 -141 -129 133 88 -170 -50 176
8094 176 19 -179 20 186 -55 -159 102 140 -120 -126 155 93 -157 -50 186 20 -168 42 173 -51 -158
8115 -158 97 150 -122 -119 148 84 -164 -55 170 28 -171 16 156 -59 -169 74 148 -120 -127 128 88 -153 -63
8138 -63 173 24 -179 22 168 -53 -157 79 147 -113 -112 133 100 -156 -48 182 40 -168 11 180 -50 -168
8160 -168 86 146 -110 -116 134 78 -161 -63 152 24 -189 -3 157 -58 -174 70 142 -117 -126 136 97 -168 -64
8183 -64 172 29 -181 13 183 -47 -169 96
8191I6
##END NTUPLES=NMR FID
##END=
