##TITLE=1H_A130
 aceton-d6
 8 sc, 
 17.12.2021
##JCAMPDX= 6.0         $$ Bruker NMR JCAMP-DX V2.0
##DATA TYPE= NMR FID
##DATA CLASS= NTUPLES
##ORIGIN= UXNMR, Bruker Analytische Messtechnik GmbH
##OWNER= root
$$ XWIN-NMR		Version 3.5
$$ Fri Dec 17 11:49:27 2021 Russian Standard Time (UT+4h)  she@DPX200
##.OBSERVE FREQUENCY= 200.131346
##.OBSERVE NUCLEUS= ^1H
##.DELAY= (6, 6)
##.ACQUISITION MODE= SIMULTANEOUS
##.ACQUISITION SCHEME= undefined
##.AVERAGES= 8
##.DIGITISER RES= 18
##SPECTROMETER/DATA SYSTEM= spect
##.PULSE SEQUENCE= zg30
##.SOLVENT NAME= Acetone
##.SHIFT REFERENCE= (INTERNAL, Acetone, 0, 15.7039)
##AUDIT TRAIL= $$ (NUMBER, WHEN, WHO, WHERE, WHAT)
$$ ##TITLE= Audit trail, XWIN-NMR		Version 3.5
$$ ##JCAMPDX= 5.01
$$ ##ORIGIN= Bruker BioSpin GmbH
$$ ##OWNER= she
$$ F:/spectra/data/she/nmr/H-F/1/audita.txt
$$ ##AUDIT TRAIL=  $$ (NUMBER, WHEN, WHO, WHERE, WHAT)
(   1,<2021-12-17 11:48:05.17 +0400>,<she>,<DPX200>,
      <created by zg, POWCHK disabled, PULCHK disabled
       configuration hash MD5:
       00 E9 B6 7A A2 85 ED C7 34 08 36 98 17 FE 4E 26
       data hash MD5: 16K
       4E 59 56 84 E7 E2 7A A2 D1 1A 29 EF AC AD 63 42>)
$$ ##END=
$$ 
$$ hash MD5
$$ AF 30 73 DC CE 85 AE 1E CA 77 9D 28 DD C7 DB 36
##$RELAX= 
##$RELAX= 
##$RELAX= 
##$RELAX= 
##$RELAX= 
##$RELAX= 
$$ Bruker specific parameters
$$ --------------------------
##$DU= <F:/spectra>
##$EXPNO= 1
##$NAME= <H-F>
##$PROCNO= 1
##$TYPE= <nmr>
##$USER= <she>
##$AMP= (0..31)
100 100 100 100 100 100 100 100 100 100 100 100 100 100 100 100 100 100 
100 100 100 100 100 100 100 100 100 100 100 100 100 100 
##$AQSEQ= 0
##$AQ_mod= 1
##$AUNM= <au_zg>
##$AUTOPOS= <>
##$BF1= 200.13
##$BF2= 200.13
##$BF3= 200.13
##$BF4= 200.13
##$BF5= 200.13
##$BF6= 200.13
##$BF7= 200.13
##$BF8= 200.13
##$BYTORDA= 1
##$CFDGTYP= 0
##$CFRGTYP= 5
##$CHEMSTR= <none>
##$CNST= (0..31)
1 1 145 1 1 1 1 1 1 1 1 1 1 1 1 1 1 1 1 1 1 1 1 1 1 1 1 1 1 1 1 1 
##$CPDPRG= <>
##$CPDPRG1= <>
##$CPDPRG2= <>
##$CPDPRG3= <>
##$CPDPRG4= <mlev>
##$CPDPRG5= <mlev>
##$CPDPRG6= <mlev>
##$CPDPRG7= <mlev>
##$CPDPRG8= <mlev>
##$CPDPRGB= <>
##$CPDPRGT= <>
##$D= (0..31)
0 1.2 0 0 0 0 0 0 0 0.06 0 0.03 0 0 0 0 0.0002 0 0 0 0 0 0 0 0 0 0 0 0 
0 0 0 
##$DATE= 1639727284
##$DBL= (0..7)
120 120 120 120 120 120 120 120 
##$DBP= (0..7)
150 150 150 150 150 150 150 150 
##$DBP07= 0
##$DBPNAM0= <>
##$DBPNAM1= <>
##$DBPNAM2= <>
##$DBPNAM3= <>
##$DBPNAM4= <>
##$DBPNAM5= <>
##$DBPNAM6= <>
##$DBPNAM7= <>
##$DBPOAL= (0..7)
0.5 0.5 0.5 0.5 0.5 0.5 0.5 0.5 
##$DBPOFFS= (0..7)
0 0 0 0 0 0 0 0 
##$DE= 6
##$DECBNUC= <off>
##$DECIM= 32
##$DECNUC= <off>
##$DECSTAT= 4
##$DIGMOD= 1
##$DIGTYP= 9
##$DL= (0..7)
0 120 120 120 120 120 120 120 
##$DP= (0..7)
150 150 150 150 150 150 150 150 
##$DP07= 0
##$DPNAME0= <>
##$DPNAME1= <>
##$DPNAME2= <>
##$DPNAME3= <>
##$DPNAME4= <>
##$DPNAME5= <>
##$DPNAME6= <>
##$DPNAME7= <>
##$DPOAL= (0..7)
0.5 0.5 0.5 0.5 0.5 0.5 0.5 0.5 
##$DPOFFS= (0..7)
0 0 0 0 0 0 0 0 
##$DQDMODE= 0
##$DR= 18
##$DS= 0
##$DSLIST= <SSSSSSSSSSSSSSS>
$$ [...]
##$SUBNAM2= <"">
##$SUBNAM3= <"">
##$SUBNAM4= <"">
##$SUBNAM5= <"">
##$SUBNAM6= <"">
##$SUBNAM7= <"">
##$SUBNAM8= <"">
##$SUBNAM9= <"">
##$SW= 18.0517287032376
##$SWIBOX= (0..15)
0 0 2 0 0 0 0 0 0 0 0 0 0 0 0 0 
##$SW_h= 3612.71676300578
##$TD= 16384
##$TD0= 1
##$TE= 0
##$TE2= 300
##$TE3= 300
##$TEG= 300
##$TL= (0..7)
0 120 120 120 120 120 120 120 
##$TP= (0..7)
150 150 150 150 150 150 150 150 
##$TP07= 0
##$TPNAME0= <>
##$TPNAME1= <>
##$TPNAME2= <>
##$TPNAME3= <>
##$TPNAME4= <>
##$TPNAME5= <>
##$TPNAME6= <>
##$TPNAME7= <>
##$TPOAL= (0..7)
0.5 0.5 0.5 0.5 0.5 0.5 0.5 0.5 
##$TPOFFS= (0..7)
0 0 0 0 0 0 0 0 
##$TUNHIN= 0
##$TUNHOUT= 0
##$TUNXOUT= 0
##$USERA1= <user>
##$USERA2= <user>
##$USERA3= <user>
##$USERA4= <user>
##$USERA5= <user>
##$V9= 5
##$VALIST= <valist>
##$VCLIST= <CCCCCCCCCCCCCCC>
##$VD= 0
##$VDLIST= <DDDDDDDDDDDDDDD>
##$VPLIST= <PPPPPPPPPPPPPPP>
##$VTLIST= <TTTTTTTTTTTTTTT>
##$WBST= 1024
##$WBSW= 4
##$XGAIN= (0..3)
0 0 0 0 
##$XL= 0
##$YL= 0
##$YMAX_a= 118506
##$YMIN_a= -108838
##$ZGOPTNS= <>
##$ZL1= 120
##$ZL2= 120
##$ZL3= 120
##$ZL4= 120
##$ABSF1= 10
##$ABSF2= 0
##$ABSG= 5
##$ABSL= 3
##$ALPHA= 0
##$AQORDER= 0
##$ASSFAC= 0
##$ASSFACI= 0
##$ASSFACX= 0
##$ASSWID= 0
##$AUNMP= <proc_1d>
##$AZFE= 0.1
##$AZFW= 0.1
##$BCFW= 1
##$BC_mod= 2
##$BYTORDP= 1
##$COROFFS= 0
##$CY= 11.3945322036743
##$DATMOD= 1
##$DC= 2
##$DFILT= <>
##$DTYPP= 0
##$F1P= 2.36226072786647
##$F2P= -0.459571619588291
##$FCOR= 0.5
##$FTSIZE= 0
##$FT_mod= 4
##$GAMMA= 1
##$GB= 0.15
##$INTBC= 1
##$INTSCL= 1
##$ISEN= 128
##$LB= 0.24
##$LEV0= 0
##$LPBIN= 0
##$MAXI= 10000
##$MC2= 0
##$MEAN= 0
##$ME_mod= 0
##$MI= 1.114404
##$NCOEF= 0
##$NC_proc= 0
##$NLEV= 6
##$NOISF1= 3.799351
##$NOISF2= 2.8
##$NSP= 1
##$NTH_PI= 0
##$NZP= 0
##$OFFSET= 15.70392
##$PC= 1
##$PHC0= -15949.21
##$PHC1= 10.20079
##$PH_mod= 1
##$PKNL= yes
##$PPARMOD= 0
##$PSCAL= 0
##$PSIGN= 0
##$REVERSE= no
##$SF= 200.130013532006
##$SI= 16384
##$SIGF1= 3
##$SIGF2= 2
##$SINO= 400
##$SIOLD= 16384
##$SREGLST= <1H.CDCl3>
##$SSB= 0
##$STSI= 0
##$STSR= 0
##$SW_p= 3612.71676300578
##$SYMM= 0
##$S_DEV= 0
##$TDeff= 0
##$TDoff= 0
##$TI= <>
##$TILT= no
##$TM1= 0
##$TM2= 0
##$TOPLEV= 0
##$USERP1= <user>
##$USERP2= <user>
##$USERP3= <user>
##$USERP4= <user>
##$USERP5= <user>
##$WDW= 1
##$XDIM= 8192
##$YMAX_p= 0
##$YMIN_p= 0
$$ End of Bruker specific parameters
$$ ---------------------------------
##NTUPLES= NMR FID
##VAR_NAME=  TIME,          FID/REAL,        FID/IMAG
##SYMBOL=    X,             R,               I
##VAR_TYPE=  INDEPENDENT,   DEPENDENT,       DEPENDENT
##VAR_FORM=  AFFN,          ASDF,            ASDF
##VAR_DIM=   8192,          8192,            8192
##UNITS=     SECONDS,       ARBITRARY UNITS, ARBITRARY UNITS
##FACTOR=    0.0002768,     1,               1
##FIRST=     0,             0,               0
##LAST=      2.2672688,     0,               0
##MIN=       0,             -108838,         0
##MAX=       2.2672688,     118506,          0
$$ Real data points
##PAGE= N=1
##DATA TABLE= (X++(R..R)), XYDATA
0 0 0 0 0 0 0 0 0 0 0 0 0 0 0 0 0 0 0 0 0 0 0 0 6 -8 8 -8 8 -8 8 -8 14 -16 16 -16 21 -24 24 -29 32 -36 40 -44 48 -53
44 -53 60 -65 69 -77 85 -93 105 -114 128 -140 156 -174 194 -218 248 -283 326 -383 459 -563 718
65 718 -963 1402 -2336 5089 -28482 -108838 42468 100821 -66172 -86876 85041 68833 -98357
78 -98357 -47378 106136 22573 -106619 2222 102023 -26127 -93266 48067 81209 -67494
89 -67494 -65258 81768 47127 -90268 -28325 93489 9460 -92408 10018 86493 -28817
100 -28817 -76178 45367 63223 -58850 -49185 69741 34099 -77220 -17948 80090 1972
111 1972 -78227 12649 73023 -26167 -65191 38975 54449 -50240 -41393 58614 27680 -64184
123 -64184 -14407 67485 1231 -67934 11853 64560 -23718 -57881 33683 49274 -42334 -39120
135 -39120 50114 27144 -55944 -14015 58978 1351 -59546 10299 58124 -21452 -54100 31877
147 31877 46765 -40514 -37015 46949 26051 -51929 -14118 55490 1069 -56543 12066 54476
159 54476 -23805 -49977 33855 43488 -42632 -34471 49625 22833 -53762 -9890 54997 -3060
171 -3060 -54166 15785 51272 -28110 -45522 38709 37013 -46365 -26957 51183 15960 -53693
183 -53693 -3785 53498 -9113 -50049 21175 44004 -31321 -36518 39652 27820 -46051 -17509
195 -17509 49486 6275 -49433 4572 46660 -14607 -42041 24094 35416 -32520 -26782 38653
207 38653 17186 -42097 -7790 43463 -1400 -42800 10630 39577 -19120 -33816 25928 26723
219 26723 -31055 -19058 35051 10715 -37493 -1793 37585 -6614 -35470 13663 32038 -19682
231 -19682 -27448 24971 21281 -28910 -13912 30916 6572 -31475 295 31220 -6993 -29769
243 -29769 13392 26611 -18562 -22184 22184 17400 -24871 -12136 26934 6029 -27747 454
255 454 27040 -6302 -25429 11412 23396 -16269 -20384 20614 16016 -23639 -10894 25250 5701
268 5701 -26076 -180 26257 -5903 -25049 11890 22362 -16879 -18894 20904 14952 -24342 -10051
281 -10051 26773 4091 -27466 2091 26521 -7893 -24662 13492 21877 -18949 -17642 23401
293 23401 12226 -26123 -6495 27373 768 -27537 5299 26275 -11496 -23114 16867 18655
305 18655 -20930 -13731 24092 8366 -26314 -2252 26901 -4050 -25564 9613 22943 -14369
317 -14369 -19500 18699 14974 -22269 -9262 24278 3236 -24683 2359 24074 -7635 -22490
329 -22490 12757 19432 -17099 -15015 19999 10093 -21670 -5115 22599 -162 -22501 5640 20903
342 20903 -10403 -18107 14027 14874 -16820 -11205 19014 6810 -20079 -1971 19732 -2459 -18490
355 -18490 6287 16863 -9877 -14634 13104 11473 -15293 -7901 16303 4522 -16719 -1199 16731
368 16731 -2445 -15859 5998 14013 -8834 -11828 11035 9643 -13048 -7071 14671 3898 -15286
381 -15286 -622 15008 -2232 -14345 5058 13385 -8069 -11594 10803 9032 -12692 -6304 13959
394 13959 3648 -14954 -621 15327 -2809 -14584 5989 12978 -8602 -11090 10964 8822 -13200
407 -13200 -5821 14741 2341 -15179 942 14875 -3950 -14151 7017 12678 -10002 -10155 12259
420 12259 7060 -13609 -3944 14490 749 -14917 2809 14381 -6296 -12744 9068 10546 -11164
433 -11164 -8086 12979 5090 -14229 -1439 14449 -2175 -13642 5281 12402 -8032 -10720 10629
446 10629 8232 -12561 -5056 13373 1844 -13368 1126 12951 -4129 -11914 7139 9971 -9476
459 -9476 -7425 10892 4911 -11702 -2387 12152 -412 -11793 3253 10498 -5516 -8751 7189
472 7189 6980 -8652 -4976 9812 2508 -10197 -57 9780 -1931 -9061 3650 8198 -5396 -6821
486 -6821 6915 4877 -7748 -2956 8062 1314 -8334 431 8358 -2351 -7742 4025 6608 -5142
500 -5142 -5442 6072 4284 -7001 -2691 7631 810 -7612 885 7280 -2238 -6911 3684 6322
514 6322 -5162 -5114 6261 3593 -6791 -2178 7131 759 -7437 962 7303 -2804 -6524 4260
528 4260 5495 -5340 -4481 6374 3200 -7284 -1410 7590 -462 -7267 2051 6754 -3519 -6119
542 -6119 5107 4971 -6484 -3248 7214 1496 -7450 105 7522 -1816 -7250 3749 6292 -5346
556 -5346 -4788 6374 3277 -7052 -1715 7607 -145 -7674 2179 6968 -3883 -5855 5104 4661 -6180
571 -6180 -3262 7084 1391 -7369 582 6965 -2185 -6266 3543 5461 -4876 -4260 6005 2589 -6499
586 -6499 -872 6469 -545 -6266 1940 5865 -3435 -4929 4671 3580 -5325 -2220 5657 1012 -5917
601 -5917 384 5905 -1923 -5300 3195 4371 -4005 -3481 4676 2525 -5347 -1225 5604 -242 -5331
616 -5331 1435 4851 -2394 -4428 3404 3754 -4368 -2664 4927 1471 -5036 -464 5081 -518 -5060
631 -5060 1750 4657 -2911 -3828 3717 2964 -4252 -2198 4856 1224 -5300 77 5269 -1296 -4852 2242
647 2242 4399 -3167 -3860 4209 2895 -5047 -1595 5419 393 -5504 720 5565 -1981 -5336 3380
662 3380 4542 -4501 -3407 5195 2278 -5781 -1053 6280 -519 -6329 2200 5783 -3551 -4980 4619
677 4619 4092 -5651 -2860 6514 1218 -6809 523 6563 -2009 -6105 3398 5481 -4850 -4364 6035
692 6035 2807 -6644 -1218 6807 -233 -6811 1782 6488 -3462 -5571 4856 4266 -5748 -2939 6392
707 6392 1587 -6895 50 6957 -1792 -6411 3256 5508 -4360 -4563 5406 3388 -6307 -1801 6727
722 6727 128 -6584 1316 6258 -2577 -5751 3943 4901 -5121 -3572 5804 2185 -6105 -934 6282
737 6282 -399 -6283 1903 5799 -3241 -4915 4176 4015 -4912 -3093 5625 1889 -6114 -433 6093
752 6093 -888 -5773 1998 5428 -3140 -4897 4347 3940 -5280 -2721 5775 1537 -6106 -359 6392
767 6392 -1047 -6309 2611 5735 -3860 -4883 4867 3959 -5846 -2819 6711 1251 -7126 443 7013
782 7013 -1956 -6672 3385 6141 -4895 -5146 6264 3651 -7115 -2019 7545 422 -7788 1308
796 1308 7693 -3195 -6992 4916 5794 -6197 -4415 7170 2920 -7986 -1086 8379 -987 -8106
810 -8106 2906 7347 -4517 -6390 6018 5110 -7374 -3329 8233 1291 -8439 638 8251 -2459
824 -2459 -7793 4326 6835 -6050 -5304 7280 3507 -7977 -1725 8392 -158 -8458 2189 7931
838 7931 -4100 -6830 5554 5512 -6646 -4044 7583 2341 -8122 -372 8063 -1455 -7548 2989
852 2989 6855 -4408 -5943 5738 4610 -6729 -3006 7179 1465 -7314 4 7335 -1579 -7018
866 -7018 3178 6222 -4490 -5171 5443 4105 -6270 -2884 7004 1375 -7321 269 7170 -1718
880 -1718 -6797 3060 6306 -4463 -5466 5801 4195 -6718 -2743 7278 1328 -7668 214 7817
894 7817 -1982 -7467 3705 6629 -5107 -5564 6308 4362 -7434 -2806 8243 898 -8493 991
908 991 8264 -2728 -7791 4424 6969 -6137 -5587 7518 3816 -8346 -1940 8824 53 -9009
922 -9009 2024 8705 -4162 -7708 5957 6320 -7334 -4732 8454 2887 -9275 -677 9484 -1638
936 -1638 -9057 3699 8217 -5544 -7081 7234 5458 -8617 -3366 9369 1154 -9494 964
949 964 9274 -3026 -8624 5110 7384 -6877 -5672 8056 3817 -8764 -1878 9183 -171 -9109
963 -9109 2319 8409 -4170 -7260 5645 5950 -6843 -4449 7839 2632 -8350 -668 8296 -1095
977 -1095 -7892 2680 7295 -4235 -6367 5642 5007 -6636 -3450 7228 1953 -7583 -405 7741
991 7741 -1298 -7461 2940 6734 -4286 -5800 5394 4776 -6429 -3469 7252 1865 -7608 -227
1005 -227 7599 -1262 -7382 2763 6961 -4310 -6084 5690 4837 -6659 -3458 7380 2015 -7933
1019 -7933 -348 8141 -1510 -7809 3240 7091 -4737 -6173 6116 4994 -7372 -3377 8246 1503
1033 1503 -8560 351 8533 -2173 -8197 4069 7394 -5892 -6033 7328 4353 -8293 -2552 8978
1047 8978 592 -9285 1626 9000 -3781 -8096 5619 6824 -7147 -5285 8452 3370 -9311
1060 -9311 -1107 9557 -1136 -9185 3192 8479 -5086 -7358 6836 5733 -8150 -3731 8865
1073 8865 1681 -9082 323 8972 -2348 -8402 4310 7258 -5899 -5772 7041 4177 -7836 -2463
1087 -2463 8349 534 -8368 1392 7849 -3071 -6994 4482 5972 -5761 -4664 6787 3025 -7363
1101 -7363 -1334 7480 -241 -7321 1753 6952 -3274 -6179 4615 5038 -5573 -3799 6217 2548
1115 2548 -6733 -1140 6992 -397 -6834 1816 6317 -3013 -5714 4095 4929 -5144 -3838 5948 2526
1130 2526 -6375 -1221 6560 -33 -6610 1407 6414 -2818 -5798 4063 4933 -5025 -3935 5889 2776
1145 2776 -6589 -1323 6958 -273 -6872 1776 6507 -3149 -5936 4540 5041 -5810 -3719 6701
1159 6701 2209 -7160 -650 7394 -979 -7290 2733 6703 -4374 -5633 5654 4349 -6629 -2909
1173 -2909 7384 1260 -7727 620 7559 -2370 -6908 3882 6016 -5210 -4840 6380 3306 -7127
1187 -7127 -1547 7366 -168 -7200 1753 6788 -3277 -6011 4690 4790 -5746 -3360 6342 1887
1201 1887 -6658 -382 6722 -1220 -6348 2742 5563 -3946 -4547 4850 3444 -5577 -2156 6036 701
1216 701 -6064 723 5710 -1916 -5186 2999 4499 -3984 -3550 4747 2375 -5114 -1229 5207 189
1231 189 -5181 894 4951 -1957 -4407 2851 3657 -3467 -2905 3972 2129 -4398 -1190 4625 179 -4541
1247 -4541 708 4306 -1466 -4029 2269 3603 -3054 -2928 3641 2118 -4002 -1331 4284 501 -4473
1262 -4473 474 4430 -1475 -4074 2323 3577 -3048 -3006 3745 2247 -4347 -1243 4630 176 -4644
1277 -4644 809 4525 -1789 -4226 2805 3618 -3689 -2754 4277 1775 -4641 -804 4853 -283 -4852
1292 -4852 1478 4495 -2500 -3845 3334 3100 -3996 -2225 4559 1151 -4829 43 4730 -1131 -4367
1307 -4367 2075 3895 -2976 -3206 3778 2227 -4274 -1139 4443 122 -4405 862 4217 -1864 -3737
1322 -3737 2782 2961 -3404 -2080 3797 1211 -4037 -273 4107 -747 -3845 1686 3339 -2367 -2728
1337 -2728 2896 2070 -3346 -1262 3580 341 -3523 458 3275 -1108 -2967 1719 2568 -2287 -1974 2678
1353 2678 1281 -2805 -671 2835 136 -2827 489 2677 -1087 -2315 1548 1902 -1841 -1523 2128
1368 2128 1105 -2392 -557 2478 -25 -2384 474 2256 -869 -2108 1346 1838 -1798 -1376 2074
1383 2074 923 -2197 -498 2350 23 -2432 555 2317 -1099 -2015 1491 1684 -1839 -1351 2191 850
1399 850 -2443 -238 2468 -329 -2370 823 2240 -1315 -2002 1844 1556 -2221 -987 2394 444 -2472
1415 -2472 78 2498 -702 -2380 1330 2007 -1811 -1534 2138 1072 -2397 -532 2581 -152 -2538
1430 -2538 831 2277 -1349 -1926 1763 1542 -2171 -1005 2473 331 -2541 316 2387 -841 -2194
1445 -2194 1330 1906 -1831 -1423 2193 819 -2303 -250 2296 -258 -2234 790 2057 -1319 -1683 1695
1461 1695 1195 -1875 -761 1991 330 -2064 192 1990 -705 -1714 1071 1409 -1317 -1132 1562 791
1477 791 -1759 -335 1780 -104 -1669 436 1532 -738 -1409 1063 1149 -1360 -780 1484 428 -1520
1493 -1520 -152 1578 -170 -1585 571 1430 -887 -1189 1085 954 -1261 -743 1480 401 -1615 -8
1509 -8 1582 -328 -1490 598 1422 -897 -1284 1240 976 -1468 -617 1571 308 -1636 12 1713 -435
1526 -435 -1661 869 1436 -1196 -1163 1415 891 -1679 -560 1869 70 -1894 426 1764 -814 -1582
1542 -1582 1165 1363 -1579 -1011 1892 535 -1991 -25 1972 -385 -1921 846 1780 -1346 -1427 1731
1558 1731 954 -1921 -507 2021 48 -2075 475 2001 -1011 -1696 1415 1314 -1675 -939 1876 506
1574 506 -2052 42 2031 -577 -1819 988 1557 -1319 -1285 1636 903 -1880 -404 1936 -93 -1842
1590 -1842 477 1717 -863 -1547 1280 1231 -1584 -803 1722 407 -1774 -60 1790 -367 -1758 799
1606 799 1526 -1146 -1209 1353 922 -1547 -614 1728 206 -1786 230 1683 -583 -1531 837 1392 -1139
1623 -1139 -1154 1430 806 -1595 -432 1629 127 -1678 187 1708 -606 -1576 981 1340 -1250 -1072
1639 -1072 1444 827 -1658 -485 1826 18 -1847 420 1724 -779 -1601 1149 1420 -1553 -1077 1850
1655 1850 618 -1976 -169 2034 -255 -2035 740 1928 -1287 -1620 1712 1205 -1958 -775 2188
1670 2188 319 -2351 266 2330 -872 -2099 1356 1779 -1750 -1417 2126 947 -2412 -332 2504
1685 2504 -293 -2399 819 2227 -1323 -1990 1814 1566 -2229 -984 2419 414 -2467 115 2482
1700 2482 -694 -2365 1300 2023 -1783 -1565 2102 1097 -2331 -608 2509 22 -2507 613 2319
1715 2319 -1128 -2012 1536 1688 -1920 -1284 2246 731 -2391 -150 2360 -328 -2247 773 2113 -1252
1731 -1252 -1826 1672 1401 -1939 -945 2082 545 -2197 -97 2253 -418 -2151 879 1901 -1238 -1658
1747 -1658 1541 1387 -1873 -994 2120 501 -2203 -30 2203 -381 -2181 844 2069 -1360 -1779 1768
1763 1768 1385 -2044 -972 2284 537 -2489 38 2553 -650 -2404 1190 2154 -1658 -1871 2107 1462
1779 1462 -2531 -876 2764 228 -2818 371 2762 -968 -2634 1608 2303 -2196 -1777 2611 1202
1794 1202 -2863 -608 3053 -70 -3112 826 2925 -1516 -2529 2072 2076 -2533 -1538 2944 833 -3179
1810 -3179 -51 3167 -678 -2988 1311 2717 -1945 -2288 2519 1677 -2913 -960 3069 257 -3105
1825 -3105 424 3038 -1154 -2774 1843 2295 -2340 -1725 2669 1141 -2913 -487 3048 -249 -2941
1840 -2941 942 2633 -1488 -2278 1935 1865 -2359 -1341 2661 693 -2753 -99 2683 -411 -2582 943
1856 943 2410 -1479 -2043 1910 1578 -2177 -1140 2377 690 -2570 -151 2627 -433 -2490 928 2271
1872 2271 -1353 -2022 1770 1705 -2193 -1230 2468 691 -2586 -176 2662 -331 -2645 946 2497 -1508
1888 -1508 -2164 1974 1744 -2327 -1317 2636 782 -2901 -117 2942 -557 -2816 1123 2615 -1671
1903 -1671 -2331 2237 1872 -2696 -1248 2966 603 -3058 38 3114 -716 -3003 1461 2680 -2092
1918 -2092 -2167 2551 1608 -2920 -995 3207 253 -3279 559 3121 -1265 -2769 1885 2389 -2435 -1833
1934 -1833 2911 1117 -3178 -325 3193 -391 -3084 1070 2850 -1748 -2443 2345 1830 -2715 -1173
1949 -1173 2908 530 -3020 129 2992 -853 -2756 1479 2334 -1932 -1868 2281 1397 -2571 -813 2730
1965 2730 147 -2678 439 2498 -919 -2285 1383 2002 -1827 -1562 2142 1057 -2281 -591 2347
1980 2347 146 -2383 368 2301 -899 -2046 1302 1726 -1594 -1431 1894 1059 -2161 -582 2272 86
1996 86 -2235 337 2158 -726 -2053 1192 1834 -1611 -1457 1886 1049 -2079 -688 2274 244 -2374
2012 -2374 287 2329 -795 -2132 1216 1901 -1605 -1622 2002 1187 -2326 -653 2458 105 -2473 382
2028 382 2435 -926 -2304 1496 1950 -1956 -1484 2244 995 -2480 -483 2644 -155 -2633 824 2417
2044 2417 -1386 -2085 1827 1704 -2250 -1219 2557 578 -2680 78 2621 -670 -2422 1200 2196 -1722
2060 -1722 -1773 2182 1209 -2412 -646 2493 118 -2506 424 2413 -1005 -2132 1498 1719 -1801 -1288
2076 -1288 2034 864 -2235 -341 2300 -213 -2169 670 1933 -1044 -1691 1387 1384 -1704 -955 1882
2092 1882 475 -1891 -74 1868 -291 -1807 699 1661 -1074 -1351 1320 1024 -1461 -738 1599 426
2108 426 -1701 -32 1663 -348 -1520 622 1376 -847 -1239 1120 1002 -1362 -697 1448 397 -1471
2124 -1471 -162 1512 -131 -1536 477 1425 -787 -1198 1003 1027 -1189 -839 1415 538 -1562 -168
2140 -168 1569 -165 -1517 444 1460 -757 -1327 1124 1067 -1375 -710 1495 382 -1589 -65 1659
2156 1659 -339 -1606 745 1381 -1060 -1112 1274 859 -1503 -526 1661 97 -1684 336 1556 -650
2172 -650 -1392 947 1211 -1247 -928 1483 513 -1559 -132 1529 -185 -1488 523 1382 -887 -1148 1154
2189 1154 809 -1275 -532 1354 240 -1414 104 1395 -467 -1212 744 972 -917 -769 1073 531
2205 531 -1211 -204 1241 -129 -1142 352 1007 -544 -895 751 722 -939 -439 989 171 -961 11
2222 11 942 -198 -930 427 785 -610 -591 675 434 -718 -325 786 153 -839 70 766 -235 -682
2240 -682 304 624 -417 -575 566 444 -675 -266 667 147 -669 -52 717 -129 -719 319 612 -449
2258 -449 -488 517 419 -627 -312 745 125 -777 83 706 -241 -660 350 619 -540 -524 701 301 -769
2277 -769 -113 759 -32 -791 182 790 -416 -670 601 493 -680 -324 741 191 -823 27 865 -269
2295 -269 -757 460 621 -561 -500 676 364 -808 -131 838 -100 -773 284 675 -418 -610 596 477
2313 477 -749 -248 794 25 -744 125 718 -265 -673 480 540 -628 -318 681 139 -685 -21 699 -159
2332 -159 -694 353 576 -496 -413 537 279 -576 -185 646 3 -639 182 543 -291 -451 348 399 -441 -328
2352 -328 524 166 -547 -5 494 -79 -466 133 467 -255 -420 377 292 -423 -186 415 132 -458 -53 509
2372 509 -92 -480 212 385 -257 -327 319 303 -442 -210 519 63 -507 41 474 -102 -484 204 487 -371 -387
2393 -387 456 243 -485 -174 521 75 -596 66 601 -251 -538 354 438 -424 -389 524 290 -635 -93 670 -90
2414 -90 -611 212 578 -329 -554 502 445 -646 -259 683 63 -684 44 693 -213 -673 436 557 -589
2433 -589 -379 650 234 -697 -93 763 -97 -759 317 644 -475 -509 549 408 -658 -272 742 49
2451 49 -778 153 683 -302 -606 402 547 -550 -418 672 230 -692 -53 645 -75 -645 195 621 -378
2470 -378 -534 510 369 -563 -260 581 164 -634 -20 651 -166 -588 293 478 -371 -428 441 358 -581 -215
2490 -215 621 50 -592 59 568 -138 -572 268 535 -425 -414 506 291 -536 -213 583 111 -671 44 647
2510 647 -215 -576 302 528 -397 -481 525 380 -647 -206 682 46 -692 53 686 -203 -703 400 604
2529 604 -564 -453 651 319 -712 -196 779 -6 -824 221 753 -417 -644 538 550 -677 -432 805
2547 805 216 -869 18 846 -203 -788 360 735 -554 -614 739 422 -833 -187 850 37 -873 150
2565 150 870 -372 -770 565 600 -684 -428 760 281 -840 -94 873 -146 -833 348 718 -463 -614
2583 -614 581 492 -737 -318 797 95 -775 80 751 -208 -727 373 649 -564 -504 654 333 -683
2601 -683 -208 708 78 -745 116 728 -293 -625 401 515 -492 -466 597 335 -697 -173 720 19 -681
2620 -681 98 683 -220 -668 374 586 -526 -450 599 332 -649 -237 736 95 -799 107 756 -285 -688
2639 -688 398 621 -529 -544 672 378 -799 -173 811 -16 -827 170 811 -366 -763 574 611 -730
2657 -730 -441 782 274 -868 -98 928 -153 -904 385 785 -565 -665 681 544 -841 -361 945
2674 945 112 -963 130 902 -317 -841 500 750 -696 -593 842 371 -904 -161 902 -20 -918
2691 -918 225 880 -460 -746 621 557 -733 -413 806 250 -895 -20 893 -212 -804 367 703 -500
2709 -500 -610 636 471 -758 -265 785 63 -766 67 740 -222 -725 378 620 -535 -477 594 332
2727 332 -643 -243 684 110 -711 62 684 -217 -614 320 561 -410 -514 531 394 -628 -247 650 134
2746 134 -673 -36 686 -128 -687 290 616 -421 -515 514 430 -603 -332 712 162 -773 26 747 -167
2765 -167 -714 293 664 -479 -581 643 417 -750 -252 771 83 -821 68 843 -278 -788 471 656
2783 656 -609 -536 707 381 -830 -219 903 -29 -896 243 823 -404 -751 557 639 -736 -470 846
2801 846 235 -885 -38 875 -136 -853 337 804 -555 -634 703 446 -765 -283 831 118 -866 92
2819 92 841 -304 -725 475 605 -570 -485 689 343 -773 -142 791 -39 -739 186 693 -318 -633 452
2838 452 518 -571 -355 620 212 -624 -108 670 -17 -669 186 606 -299 -517 370 452 -446 -377 528 257 -599
2859 -599 -115 581 -4 -575 88 572 -210 -559 346 455 -438 -352 478 270 -544 -193 602 46 -623 95
2879 95 573 -211 -517 308 503 -432 -428 559 284 -614 -149 622 39 -644 78 656 -253 -598 407 492 -501
2900 -501 -389 574 292 -682 -151 722 -46 -711 192 637 -314 -591 437 513 -580 -355 669 171 -702
2919 -702 -24 696 -97 -674 278 624 -440 -504 547 346 -590 -223 635 80 -679 106 647 -263 -551 363
2939 363 443 -438 -364 530 244 -591 -97 588 -60 -534 149 493 -241 -449 355 352 -437 -235 447 142 -452
2960 -452 -74 473 -27 -464 144 405 -217 -326 265 292 -306 -241 364 144 -400 -59 364 -24 -357 48 351
2981 351 -136 -345 209 263 -253 -214 268 165 -309 -124 334 27 -362 47 320 -98 -314 143 323 -211 -280
3002 -280 283 172 -327 -116 324 85 -362 -11 404 -86 -370 192 317 -235 -283 278 249 -355 -157 400 52
3023 52 -405 38 380 -102 -369 168 345 -286 -260 343 170 -349 -97 360 35 -379 62 367 -183 -294 236
3044 236 232 -264 -186 295 134 -336 -14 339 -74 -283 113 256 -146 -231 206 186 -258 -98 256 20 -238 -2
3066 -2 233 -42 -249 96 195 -149 -136 151 100 -155 -99 187 48 -204 12 168 -38 -132 33 144 -64 -148 95
3089 95 108 -115 -64 100 53 -99 -59 119 36 -140 23 108 -21 -101 22 128 -33 -138 86 107 -88 -66 101
3112 101 77 -108 -74 153 35 -153 25 126 -35 -130 31 155 -76 -134 138 93 -146 -61 143 48 -154 -23
3134 -23 185 -42 -165 80 136 -94 -121 94 111 -138 -89 163 18 -157 1 120 -14 -130 26 135 -88 -115
3156 -115 116 75 -98 -63 94 61 -126 -35 131 -15 -100 29 89 -16 -102 34 106 -97 -76 96 41 -94 -43 92
3180 92 51 -118 -20 129 -25 -109 17 98 -24 -105 65 109 -119 -75 128 52 -121 -53 131 35 -165 8 171 -65
3204 -65 -135 82 134 -83 -139 135 126 -189 -54 192 12 -167 2 198 -33 -215 93 180 -155 -132 162 105 -169
3227 -169 -82 225 40 -235 31 221 -80 -192 98 187 -140 -191 188 128 -222 -58 214 27 -214 -3 241
3248 241 -59 -244 130 190 -172 -151 184 133 -198 -100 242 45 -245 40 219 -75 -208 86 215 -167 -179 215
3270 215 111 -232 -75 214 50 -237 -15 262 -76 -238 130 195 -166 -156 186 142 -243 -89 273 10 -266
3291 -266 40 234 -79 -241 132 236 -205 -175 239 115 -246 -62 271 33 -297 58 301 -130 -258 177
3311 177 201 -209 -180 254 141 -317 -49 303 -33 -285 81 276 -134 -285 196 240 -263 -150 293 89 -277
3332 -277 -55 316 -8 -328 108 296 -167 -227 198 208 -218 -168 288 107 -313 -22 310 -39 -280 63 271
3353 271 -134 -249 206 201 -259 -143 259 95 -275 -61 305 -25 -311 99 265 -136 -219 169 199 -224 -164 282
3375 282 99 -290 -31 277 -22 -281 60 304 -135 -266 221 191 -239 -154 259 111 -298 -55 337 -41 -330
3396 -330 118 284 -151 -258 205 249 -277 -167 326 84 -336 -12 315 -42 -349 128 332 -215 -265 280 201
3417 201 -299 -142 343 90 -381 1 377 -108 -328 181 299 -210 -268 287 218 -351 -107 366 11 -363 29
3438 29 350 -95 -337 173 291 -260 -210 300 149 -299 -100 328 27 -367 69 331 -133 -277 178 234 -206
3459 -206 -207 271 140 -312 -63 301 -4 -294 36 274 -96 -271 181 232 -209 -149 223 125 -242 -93 276 13
3481 13 -281 55 249 -95 -225 122 218 -170 -195 231 138 -256 -71 242 42 -257 0 280 -71 -261 149
3502 149 231 -189 -185 204 180 -258 -132 298 35 -304 29 281 -65 -294 104 290 -206 -236 266 172 -287 -129
3524 -129 300 72 -345 3 358 -115 -323 185 265 -219 -234 268 184 -336 -93 351 -13 -341 59 328 -116
3545 -116 -311 192 276 -273 -193 308 113 -311 -68 324 3 -346 96 313 -174 -254 212 203 -244 -174 291 107
3567 107 -327 -18 308 -60 -272 83 252 -143 -242 214 187 -256 -120 248 59 -258 -30 265 -33 -263 105
3588 105 228 -153 -166 155 149 -190 -132 225 57 -248 5 215 -20 -207 49 220 -102 -202 159 150 -175 -108
3610 -108 172 94 -225 -74 250 1 -249 51 215 -79 -210 102 204 -178 -177 225 121 -237 -55 245 32
3631 32 -269 9 286 -101 -254 158 218 -177 -185 213 158 -269 -100 297 16 -291 59 271 -105 -259 156 242
3653 242 -238 -185 263 102 -277 -67 287 3 -303 70 284 -154 -238 193 187 -227 -165 273 98 -315 -19 303
3675 303 -53 -277 97 251 -148 -232 197 187 -255 -111 268 50 -267 -11 277 -51 -273 119 225 -177 -183
3696 -183 179 136 -206 -114 227 57 -267 28 235 -69 -205 78 205 -124 -183 175 143 -196 -76 186 48
3717 48 -199 -27 227 -26 -224 84 189 -113 -171 120 148 -166 -141 200 72 -228 -43 211 18 -221 29
3738 29 239 -105 -231 142 174 -185 -162 197 127 -246 -76 276 13 -278 51 249 -91 -250 133 227 -216 -188
3760 -188 255 112 -273 -64 276 20 -307 47 304 -134 -262 175 202 -224 -176 267 124 -314 -46 335 -35
3781 -35 -312 84 293 -141 -281 212 233 -286 -157 307 74 -323 -20 336 -42 -340 135 302 -209 -245 243
3802 243 195 -278 -149 311 79 -337 29 324 -91 -281 130 266 -189 -240 254 165 -285 -108 294 44 -296
3823 -296 -7 303 -77 -289 147 232 -202 -192 221 163 -253 -119 297 55 -316 23 304 -51 -278 95 272
3844 272 -183 -243 237 176 -276 -126 279 76 -311 -33 335 -61 -324 115 291 -170 -265 222 226 -291 -168 337
3866 337 84 -354 -19 347 -46 -347 116 334 -219 -299 277 214 -318 -159 342 101 -389 -10 398 -86 -382
3887 -382 170 342 -239 -314 314 252 -387 -160 427 48 -433 29 421 -117 -428 227 373 -331 -282 381 198
3908 198 -422 -126 444 34 -481 98 445 -214 -393 271 330 -351 -280 418 168 -459 -56 459 -48 -441 122
3929 122 414 -220 -381 312 289 -374 -193 401 116 -413 -43 444 -73 -428 167 379 -254 -326 295 270 -362
3950 -362 -202 409 98 -439 -4 404 -77 -398 138 386 -234 -340 320 266 -350 -197 370 128 -421 -46
3970 -46 431 -63 -418 146 370 -210 -340 280 301 -353 -215 408 127 -413 -42 424 -34 -437 118 414 -219
3991 -219 -376 303 290 -352 -245 397 151 -459 -56 485 -62 -465 152 431 -237 -392 333 338 -426 -236 486
4012 486 119 -514 -40 514 -78 -526 199 476 -337 -399 390 299 -457 -224 522 105 -554 30 534 -166 -500
4033 -500 249 442 -350 -375 446 278 -520 -148 543 30 -536 78 534 -197 -481 318 417 -401 -306 452 210
4054 210 -498 -123 539 -8 -540 144 487 -231 -425 311 379 -398 -297 462 175 -498 -57 488 -28 -496
4074 -496 112 471 -231 -414 315 322 -381 -252 408 171 -467 -85 471 -36 -469 131 414 -204 -381 264 329
4095 329 -366 -255 407 162 -434 -76 433 3 -465 91 441 -205 -394 269 326 -328 -286 392 199 -468 -111
4116 -111 484 -17 -479 96 458 -181 -438 281 387 -392 -298 450 201 -475 -104 508 1 -548 122 513
4136 513 -238 -441 338 368 -403 -300 474 197 -541 -67 538 -61 -525 164 490 -278 -449 379 343 -473 -239
4157 -239 485 117 -538 -38 532 -104 -544 228 454 -332 -373 394 302 -458 -207 524 79 -537 52 506 -149
4178 -149 -485 232 421 -342 -353 425 225 -466 -133 470 34 -481 44 469 -171 -424 270 344 -325 -282 358
4199 358 200 -419 -118 447 5 -430 71 381 -138 -365 212 328 -289 -249 343 157 -359 -105 366 35
4219 35 -383 35 382 -139 -349 200 303 -246 -267 303 193 -365 -132 377 42 -382 23 364 -98 -373 182
4240 182 337 -268 -262 307 196 -350 -154 370 70 -418 22 402 -130 -370 191 325 -258 -289 311 201 -378
4261 -378 -114 390 26 -378 41 390 -129 -368 219 305 -297 -241 328 165 -367 -102 387 -12 -399 102 368
4282 368 -192 -316 232 269 -319 -219 357 107 -373 -19 370 -52 -343 118 332 -200 -289 279 213 -312 -133
4303 -133 315 64 -334 -10 345 -75 -297 151 246 -192 -202 219 161 -269 -107 292 24 -265 34 246 -76
4324 -76 -237 122 216 -174 -163 196 106 -219 -75 214 32 -242 11 230 -76 -198 113 172 -131 -166 152 117
4346 117 -197 -75 200 27 -200 5 192 -41 -199 89 179 -135 -140 157 97 -168 -94 182 44 -211 13 185
4368 185 -63 -177 66 145 -105 -142 157 100 -180 -59 177 21 -164 4 183 -46 -178 105 138 -126 -108 152
4390 152 81 -157 -49 190 5 -185 44 163 -84 -141 90 121 -126 -100 153 43 -158 -7 150 -25 -135
4411 -135 48 137 -79 -107 106 70 -123 -35 119 13 -121 2 121 -44 -102 73 72 -68 -66 74 49 -92 -20 98
4435 98 -21 -75 26 62 -18 -67 38 51 -70 -26 60 1 -63 -7 41 0 -55 10 56 -39 -32 24 24 -23 -22 34 18 -47 5 33
4465 33 -9 -17 10 24 4 -27 10 37 -21 3 1 7 4 -18 14 15 -29 -4 15 -7 -2 -19 -3 8 -34 4 19 -21 -7 -16 1 13 -19 4
4499 4 18 -15 -6 0 2 13 -15 -8 5 -15 0 16 -2 -2 -19 13 24 -14 -10 24 0 -13 -28 22 15 -41 10 43 -30 -31 12 35 -17 -42 38
4534 38 26 -55 -7 41 -3 -55 1 51 -28 -68 36 54 -70 -30 61 25 -68 -29 74 -16 -95 34 77 -47 -56 63 55 -69
4562 -69 -38 95 8 -114 12 85 -32 -94 41 95 -73 -77 89 42 -104 -26 101 3 -114 12 115 -56 -103 78
4586 78 75 -86 -70 100 45 -118 -37 126 -23 -116 40 111 -52 -109 81 100 -108 -71 135 29 -130 -18 131 -5
4610 -5 -142 36 134 -89 -125 106 96 -124 -88 137 52 -176 -26 168 -43 -155 61 152 -87 -149 123 105 -159
4633 -159 -73 182 38 -187 -14 187 -42 -196 82 179 -134 -147 154 107 -180 -82 201 23 -230 31 219 -74
4655 -74 -189 101 177 -163 -149 188 106 -226 -57 232 -10 -240 49 237 -105 -216 173 181 -201 -126 231 95
4677 95 -235 -38 264 -26 -257 97 228 -134 -200 186 168 -228 -123 251 61 -262 6 250 -52 -250 95
4698 95 233 -162 -190 208 147 -229 -101 240 45 -278 4 262 -80 -256 124 206 -162 -190 202 151 -244 -89
4720 -89 263 30 -268 20 273 -61 -256 127 236 -194 -196 222 152 -261 -114 268 39 -304 15 296 -91
4741 -91 -267 144 242 -208 -230 259 174 -308 -107 325 29 -329 36 327 -113 -318 188 265 -258 -222 297 156
4763 156 -336 -87 370 8 -379 99 359 -163 -312 245 276 -290 -217 356 129 -405 -32 399 -59 -400 133
4784 133 374 -224 -324 328 254 -352 -158 397 83 -409 14 423 -106 -395 211 345 -280 -271 337 208 -391
4805 -391 -125 420 30 -412 70 384 -156 -365 240 315 -305 -241 364 153 -374 -80 401 -10 -393 90 367
4826 367 -174 -325 243 272 -303 -214 346 139 -385 -45 399 -23 -374 110 367 -169 -331 255 291 -307 -205
4847 -205 359 141 -380 -75 401 -12 -408 97 383 -189 -334 256 300 -310 -227 389 164 -404 -62 436 -20
4868 -20 -416 107 409 -196 -366 289 324 -364 -245 409 159 -444 -72 477 -40 -484 156 437 -256 -398 344
4889 344 325 -420 -230 504 126 -524 4 532 -110 -501 223 467 -347 -384 439 279 -511 -167 538 48 -552
4910 -552 71 542 -212 -497 310 419 -402 -324 476 212 -530 -103 565 -33 -525 156 485 -259 -426 358
4930 358 351 -424 -235 495 136 -506 -23 503 -88 -487 198 448 -298 -366 375 283 -434 -211 473 91 -501
4951 -501 3 484 -124 -451 206 395 -291 -355 357 265 -425 -178 444 89 -456 7 450 -98 -441 203 402
4972 402 -267 -327 341 266 -389 -195 439 103 -450 -5 457 -90 -444 170 412 -267 -363 342 290 -414 -203
4993 -203 457 122 -479 -8 501 -101 -494 215 445 -303 -371 396 313 -465 -209 527 87 -555 46 542 -149
5014 -149 -516 274 471 -369 -380 468 279 -525 -152 561 28 -563 96 561 -224 -498 327 419 -423 -318 494
5035 494 211 -544 -87 575 -49 -553 176 496 -280 -435 379 355 -455 -236 512 114 -532 -16 522 -97
5055 -97 -494 225 444 -318 -367 397 282 -444 -173 487 66 -495 29 481 -149 -439 228 381 -301 -325 379
5076 379 233 -423 -139 435 45 -429 40 416 -125 -394 197 345 -280 -273 326 227 -358 -150 389 76 -406
5097 -406 14 392 -109 -375 178 348 -251 -300 316 247 -368 -156 404 71 -413 10 429 -105 -406 197 356
5118 356 -287 -316 355 241 -398 -154 458 39 -473 57 453 -156 -424 235 372 -323 -299 406 212 -439 -107
5139 -107 465 4 -464 104 451 -198 -394 301 318 -363 -243 413 140 -446 -40 458 -73 -439 167 391
5159 391 -262 -342 328 272 -399 -177 425 60 -444 38 417 -141 -406 219 339 -302 -266 353 185 -383 -99
5180 -99 395 10 -396 85 366 -171 -313 220 256 -268 -205 319 129 -330 -53 338 -24 -313 87 303 -135
5201 -135 -257 194 213 -233 -160 255 114 -266 -51 281 -4 -275 62 263 -126 -225 149 203 -202 -158 241 107
5223 107 -248 -54 270 11 -269 52 273 -109 -252 151 204 -211 -167 232 129 -265 -63 275 -6 -288 64
5244 64 263 -121 -241 159 211 -228 -155 266 95 -272 -34 272 -23 -279 91 266 -148 -224 214 181 -230 -108
5266 -108 265 55 -282 10 280 -80 -263 138 215 -188 -172 225 124 -262 -60 262 -19 -277 64 240 -122
5287 -122 -213 163 170 -215 -108 232 61 -238 -6 230 -37 -213 101 178 -136 -148 168 104 -180 -53 197 21
5309 21 -192 35 175 -68 -146 92 121 -125 -98 137 58 -159 -34 135 4 -136 31 145 -58 -120 70 98
5331 98 -96 -73 111 43 -108 -30 123 -10 -114 32 117 -44 -94 68 93 -76 -73 108 58 -100 -11 120 -1 -114
5355 -114 10 112 -45 -94 66 83 -78 -76 94 53 -109 -32 113 -10 -109 21 106 -59 -108 77 81 -97 -71 115
5379 115 14 -116 -7 113 -34 -114 62 95 -99 -77 109 47 -121 -16 116 -13 -114 52 115 -72 -75 86
5401 86 70 -121 -34 120 3 -132 32 108 -72 -101 75 77 -102 -53 107 13 -109 12 105 -54 -94 68 77 -82
5425 -82 -56 99 26 -103 5 99 -30 -87 49 77 -71 -54 84 42 -96 -7 92 -11 -95 25 70 -61 -79 63
5449 63 43 -80 -28 74 18 -86 11 86 -29 -75 40 52 -53 -50 63 25 -77 -20 75 -1 -79 22 75 -32 -65 45
5475 45 46 -71 -45 72 23 -72 -8 75 -3 -75 15 71 -41 -60 62 59 -75 -46 82 20 -85 -8 82 -20 -87 32 81
5502 81 -51 -88 75 66 -104 -43 98 14 -112 7 128 -33 -114 64 88 -97 -74 118 42 -127 -25 136 -13
5525 -13 -144 34 127 -83 -105 83 85 -126 -63 141 17 -142 -1 139 -43 -133 88 113 -112 -97 138 52 -151
5548 -151 -36 149 -11 -159 46 142 -90 -122 113 86 -127 -62 144 34 -168 3 155 -50 -140 77 143 -106
5570 -106 -100 115 70 -156 -45 142 -5 -152 15 147 -53 -122 79 105 -116 -79 123 52 -127 -40 141 -9 -140
5593 -140 33 128 -63 -116 78 98 -114 -81 116 53 -145 -25 143 -1 -152 24 139 -74 -129 86 103 -122
5615 -122 -97 136 51 -161 -31 175 -22 -176 57 154 -81 -156 121 118 -154 -95 179 47 -201 -8 192 -45
5637 -45 -191 85 184 -123 -138 159 102 -196 -61 202 20 -217 23 209 -91 -203 129 169 -159 -128 201 85
5659 85 -226 -34 224 -24 -232 77 203 -127 -185 166 130 -222 -91 218 32 -235 9 234 -76 -222 124
5680 124 186 -177 -142 197 94 -215 -40 223 -9 -236 52 204 -118 -181 123 155 -179 -128 194 58 -214 -30
5702 -30 204 -25 -208 55 191 -109 -181 129 129 -180 -106 183 65 -206 -41 199 -26 -206 65 188 -104 -169
5724 -169 127 140 -171 -113 193 58 -214 -26 216 -24 -233 50 218 -113 -198 151 158 -187 -132 198 84 -238
5746 -238 -33 242 -42 -262 74 228 -138 -206 173 158 -231 -122 265 61 -269 -6 282 -65 -273 127 241
5767 241 -196 -208 232 146 -274 -100 301 18 -311 52 300 -130 -276 181 227 -252 -183 282 111 -320 -38
5788 -38 324 -51 -315 100 272 -185 -245 244 189 -281 -123 286 50 -318 16 295 -84 -280 149 256 -207
5809 -207 -198 238 145 -270 -91 279 18 -294 41 273 -111 -254 144 204 -207 -187 223 114 -265 -75 268 -4
5831 -4 -267 55 251 -125 -239 160 198 -196 -174 231 118 -264 -74 260 11 -269 45 269 -99 -249 144
5852 144 214 -205 -189 239 142 -256 -79 276 20 -303 38 295 -113 -274 148 233 -222 -202 258 145 -308 -78
5874 -78 315 13 -337 59 310 -145 -304 204 251 -268 -192 308 115 -339 -46 352 -39 -359 126 326 -221
5895 -221 -291 274 222 -328 -156 358 65 -380 14 364 -104 -352 177 294 -258 -255 305 177 -356 -92 360
5916 360 10 -366 63 347 -154 -317 217 247 -279 -210 312 132 -329 -48 353 -37 -333 114 295 -169 -265
5937 -265 225 207 -279 -143 307 81 -306 -16 317 -63 -307 106 274 -172 -232 212 183 -261 -130 274 67
5958 67 -300 -13 294 -47 -266 105 251 -155 -226 205 201 -231 -135 271 90 -276 -36 295 -23 -291 91 263
5980 263 -147 -239 191 215 -241 -160 279 98 -308 -33 312 -48 -310 106 298 -184 -263 233 212 -287 -143 322
6002 322 77 -346 2 352 -84 -352 161 295 -239 -255 282 185 -331 -110 365 33 -367 44 347 -141 -328
6023 -328 198 270 -273 -212 325 137 -353 -62 353 -30 -351 98 307 -184 -286 234 223 -288 -152 310 76
6044 76 -337 -5 336 -75 -306 140 263 -204 -232 249 167 -281 -98 297 40 -302 36 292 -93 -264 139
6065 139 234 -194 -185 227 125 -244 -81 249 27 -261 16 249 -88 -233 121 198 -156 -176 180 126 -220 -94
6087 -94 232 47 -240 -3 239 -46 -238 101 213 -152 -176 178 143 -214 -110 242 50 -253 -5 254 -47
6108 -47 -247 94 236 -163 -195 212 150 -245 -105 265 53 -287 6 274 -80 -267 139 226 -193 -193 239 142
6130 142 -282 -89 287 11 -299 50 278 -121 -260 170 214 -239 -171 254 103 -286 -35 286 -28 -290 91
6151 91 249 -156 -221 192 171 -248 -112 259 35 -286 10 266 -96 -239 132 203 -184 -176 213 105 -240 -61
6173 -61 243 -7 -236 63 225 -98 -193 138 150 -172 -112 181 70 -199 -25 195 -16 -197 49 169 -86
6194 -86 -155 117 122 -139 -100 142 66 -169 -35 161 -2 -169 27 155 -66 -146 99 108 -114 -103 131 63 -156 -34
6218 -34 153 17 -161 27 158 -59 -145 84 133 -121 -108 142 75 -154 -35 172 7 -180 33 173 -63 -159
6240 -159 100 129 -125 -114 155 73 -177 -35 172 -1 -183 53 167 -86 -158 122 131 -145 -92 175 42 -171
6262 -171 -2 174 -34 -173 75 145 -117 -122 146 81 -162 -50 173 6 -165 42 156 -76 -140 99 103 -132
6284 -132 -89 142 34 -155 0 148 -23 -128 66 121 -100 -98 108 71 -123 -43 119 18 -119 4 116 -33
6306 -33 -100 56 99 -68 -68 81 53 -94 -30 93 14 -88 20 82 -25 -70 40 62 -60 -65 55 31 -76 -22 75
6331 75 2 -82 4 76 -32 -80 40 69 -54 -53 55 40 -77 -31 70 20 -85 1 80 -14 -72 38 73 -48 -62 62
6357 62 45 -80 -26 86 12 -87 12 95 -30 -79 44 66 -66 -59 75 28 -97 -9 93 -19 -88 36 80 -52 -69
6382 -69 76 55 -92 -22 95 0 -92 26 84 -40 -80 68 66 -80 -32 98 10 -77 13 84 -25 -75 51 72 -57
6407 -57 -44 86 27 -71 -16 85 -20 -70 25 55 -45 -48 54 34 -56 -22 66 0 -67 5 60 -25 -45 35 40 -48 -23 60 22
6436 22 -48 1 54 -14 -42 23 37 -41 -37 45 10 -40 -18 35 2 -47 8 39 -9 -34 14 25 -27 -20 31 12 -40 -16 37 10 -35
6467 -35 -4 38 -7 -50 18 33 -18 -22 30 28 -25 -26 41 14 -47 -3 46 -7 -51 21 43 -26 -48 46 25 -49 -17 52 -1 -57 -2 56
6499 56 -31 -53 37 38 -50 -32 52 19 -61 -2 63 -25 -64 37 54 -46 -34 67 31 -72 -21 72 -4 -70 27 64 -36 -55
6527 -55 50 37 -66 -26 67 -1 -69 8 52 -26 -51 37 51 -63 -43 51 10 -60 -6 59 -5 -63 35 64 -38 -27 57 28
6555 28 -51 -14 64 11 -59 9 57 -29 -36 36 43 -45 -34 40 8 -46 -6 50 -4 -50 6 45 -20 -42 26 30 -39 -16 32 7 -41 -8
6587 -8 34 -8 -41 12 31 -17 -23 22 26 -26 -24 43 16 -34 -5 43 -6 -39 15 42 -18 -37 36 30 -36 -30 47 17 -55 -6 56 -16 -59
6620 -59 20 46 -34 -46 43 38 -58 -19 54 4 -61 9 61 -31 -53 45 55 -50 -38 64 12 -72 1 72 -17 -64 40 59 -46
6649 -46 -39 66 32 -58 -18 71 -11 -77 30 72 -35 -67 51 37 -72 -21 81 8 -88 1 72 -28 -80 36 54 -61
6675 -61 -37 78 23 -70 -1 76 -7 -62 30 68 -40 -55 53 43 -55 -22 63 12 -52 6 63 -18 -44 39 47 -36 -43 41 37 -63
6705 -63 -22 63 -2 -56 4 51 -20 -60 23 44 -50 -37 52 38 -59 -10 69 19 -56 10 70 -30 -61 38 63 -43 -33 65 35
6734 35 -68 -21 75 -5 -78 10 78 -25 -77 44 68 -55 -62 72 47 -69 -20 84 0 -111 26 91 -34 -82 57
6759 57 71 -75 -48 100 40 -109 3 113 -11 -100 53 103 -54 -84 96 61 -111 -26 119 19 -112 36 117
6782 117 -52 -106 79 85 -102 -63 101 36 -118 -5 123 -20 -116 57 95 -66 -88 89 69 -105 -40 113 10
6805 10 -109 4 112 -15 -96 51 88 -74 -74 87 36 -92 -33 102 13 -101 18 99 -36 -84 49 73 -68 -79
6829 -79 80 49 -91 -26 96 0 -101 16 86 -19 -96 52 84 -60 -67 69 56 -83 -48 90 23 -108 12 105
6853 105 -12 -90 46 114 -53 -92 82 72 -95 -53 104 39 -125 -2 131 -13 -124 49 109 -90 -99 94 84
6876 84 -126 -65 139 23 -153 16 145 -50 -129 78 115 -117 -88 129 54 -156 -26 154 -6 -159 42 151
6898 151 -84 -129 116 107 -142 -72 144 40 -154 -14 151 -39 -150 75 128 -91 -112 115 80 -138 -46 139 20
6921 20 -146 14 137 -40 -120 84 111 -100 -84 119 56 -135 -22 127 -7 -133 36 123 -59 -97 87 87 -89
6944 -89 -66 109 47 -106 -13 112 -5 -112 26 106 -46 -97 60 78 -88 -73 95 40 -98 -35 96 19 -113 5
6968 5 113 -27 -101 56 104 -67 -89 84 66 -111 -53 107 25 -115 0 123 -27 -110 66 104 -78 -94 96 67
6992 67 -118 -43 127 -2 -141 19 141 -47 -123 77 110 -108 -101 121 52 -142 -29 136 -16 -147 44 143 -68
7015 -68 -123 101 91 -122 -68 148 33 -150 -4 148 -37 -144 67 109 -96 -104 106 77 -128 -41 129 -1 -123
7038 -123 24 124 -51 -114 81 96 -94 -61 105 45 -114 -17 116 -8 -108 43 110 -59 -88 80 72 -72 -44
7061 -44 107 28 -92 -4 95 -10 -79 24 81 -38 -62 54 61 -57 -50 72 36 -82 -21 76 16 -80 11 82 -15 -77 37
7088 37 67 -52 -64 71 42 -79 -28 73 20 -81 4 91 -13 -82 46 74 -55 -61 76 50 -77 -29 104 19 -96
7113 -96 10 92 -42 -87 52 75 -70 -68 75 33 -109 -22 105 -6 -110 30 105 -54 -90 80 69 -82 -54 101
7137 101 37 -108 4 111 -14 -100 50 95 -58 -71 80 52 -97 -29 90 7 -96 21 84 -40 -72 49 56 -79
7161 -79 -38 77 26 -88 -8 82 -29 -82 31 61 -55 -48 52 42 -55 -30 62 13 -70 12 58 -20 -54 17 36 -35 -35 34
7189 34 36 -38 -21 47 8 -41 -8 55 2 -51 20 34 -22 -39 36 42 -32 -32 30 18 -37 -30 45 6 -44 -2 42 -18 -36 23 33 -25
7221 -25 -28 46 23 -47 -22 47 13 -49 14 53 -15 -38 31 42 -35 -29 52 22 -55 -24 61 2 -65 18 57 -38 -51 42 32 -51 -22
7252 -22 44 7 -69 -11 49 -19 -63 21 43 -36 -35 39 22 -63 -11 47 -5 -49 19 44 -35 -37 40 24 -49 -15 51 -1 -36 12 35
7283 35 -20 -40 26 18 -37 -4 32 1 -39 -5 23 -12 -38 13 13 -34 -16 16 7 -15 -7 27 2 -23 4 12 0 -21 -1 13 -11 -11 17
7316 17 -2 -15 -1 15 0 -21 0 7 -8 -10 -1 10 -7 -16 7 4 0 -14 -1 0 -13 -18 10 6 -28 -2 22 -2 -14 16 9 -1 -15 14 8 -17
7352 -17 -7 23 2 -2 15 20 -12 -28 6 23 -26 -19 19 -1 -19 -4 23 -3 -26 1 18 -17 -13 15 4 -26 -9 12 -6 -15 3 22 -18
7385 -18 -12 11 11 -15 1 25 -4 -15 10 15 -16 -10 21 12 -2 -5 19 -1 -17 17 16 -7 -20 20 10 -25 -13 9 1 -15 9 8 -10 -9 17
7420 17 7 -14 -8 17 1 -14 12 9 -8 -4 9 11 -7 -1 20 -10 -7 -3 -5 -1 -4 14 11 -28 5 20 -7 -3 10 1 -10 -8 9 4 -15 -2 0 -12
7458 -12 -3 5 -15 -5 -12 6 -1 -9 -1 -5 -11 -1 -8 3 7 -2 9 4 -8 1 7 -6 -3 -14 10 5 -8 -5 3 4 -14 3 6 -3 -9 9 13 -14 -9 -5 4 -6 -9 6
7502 6 5 -19 -5 14 -2 -17 8 10 -8 -14 23 2 -17 -2 25 5 -21 9 23 -7 -13 28 15 -23 -2 12 6 -24 4 15 -12 -27 7
7535 7 15 -33 -13 14 -2 -41 -11 14 -15 -21 10 8 -32 -19 15 12 -27 -4 22 -8 -27 -2 21 -21 -19 31 13 -28 -1 30 -1 -18 5
7568 5 24 -16 -18 17 16 -18 2 16 4 -21 7 17 -8 -22 4 22 -18 -21 12 14 -20 -7 19 13 -27 4 18 -5 -14 3 21 -11 -19 18
7602 18 12 -21 -7 23 12 -23 -4 29 5 -32 8 17 -4 -19 19 31 -13 -20 30 7 -29 -16 22 -1 -37 -3 29 -13 -34 17 32 -26
7634 -26 -23 38 17 -40 -7 50 -7 -43 21 39 -16 -38 36 34 -52 -2 60 7 -45 12 55 -15 -41 33 55 -33 -40 58 32 -48 -2 54
7666 54 -15 -65 17 70 -30 -47 34 38 -46 -33 60 22 -52 13 51 -12 -47 34 44 -33 -22 46 40 -44 -12 50 14 -47 13 56 -8
7697 -8 -51 28 43 -43 -33 47 24 -41 -25 49 15 -49 0 33 -23 -49 18 38 -31 -31 32 22 -46 -21 45 7 -53 -8 61 -12 -46
7728 -46 21 41 -27 -40 35 43 -30 -19 51 14 -57 -4 52 -13 -54 14 55 -34 -53 41 37 -53 -25 58 17 -72 1 67 -23 -70 25
7759 25 49 -52 -51 63 42 -68 -17 88 16 -77 19 79 -36 -74 51 57 -60 -44 71 29 -74 -17 75 -11 -90 30
7785 30 64 -58 -59 55 37 -72 -38 77 8 -74 7 74 -33 -80 36 54 -49 -51 64 35 -69 -9 80 -1 -70 -1 62
7812 62 -15 -62 39 38 -50 -42 54 11 -51 -9 68 4 -50 18 62 -14 -58 35 41 -39 -33 48 23 -53 -18 51 6 -44 0 62 -14 -54
7844 -54 34 50 -35 -36 52 44 -43 -31 67 26 -54 -7 68 -1 -63 19 68 -32 -56 48 41 -61 -28 67 19 -79 2 76 -22 -69
7874 -69 26 64 -60 -48 60 51 -75 -20 72 -2 -95 6 82 -30 -74 52 65 -73 -41 93 34 -86 -14 91 -2 -71
7900 -71 27 84 -46 -54 68 59 -66 -26 93 20 -77 10 80 -27 -75 34 52 -54 -60 69 38 -90 -12 80 18 -69 12
7927 12 72 -31 -60 41 51 -42 -27 63 25 -56 -8 64 1 -60 30 60 -27 -34 35 54 -36 -31 57 16 -55 -4 43 9 -52 3
7957 3 56 -16 -35 22 51 -42 -43 34 31 -42 -29 57 14 -51 5 54 -9 -55 17 61 -30 -39 58 43 -46 -15 65 26 -52 0 75 -17
7989 -17 -62 24 47 -38 -47 49 39 -59 -17 84 2 -68 13 63 -26 -60 38 72 -54 -33 73 32 -70 -8 77 -12 -61 33 73
8018 73 -37 -44 68 40 -52 -16 83 22 -60 17 66 -20 -45 39 54 -50 -38 57 27 -60 -1 74 1 -61 19 43 -39 -40 48 30
8048 30 -50 -24 50 10 -40 6 51 -10 -33 26 41 -36 -25 22 22 -27 -18 55 2 -39 6 30 -5 -22 15 33 -18 -25 23 24 -28 -18
8080 -18 31 16 -38 -18 33 -8 -41 4 31 -14 -35 11 30 -30 -20 28 27 -23 -12 25 5 -26 9 45 -14 -39 19 34 -29 -23 36
8111 36 30 -37 -11 31 -6 -36 14 39 -13 -38 31 38 -41 -25 43 18 -45 -5 56 -12 -66 20 46 -33 -34 44 24 -47 -20 49 11 -53
8143 -53 23 49 -30 -38 35 41 -31 -16 52 18 -51 11 54 -16 -36 19 36 -23 -32 45 13 -49 -12 39 4 -38 14 40 -30 -23 24 25 -35
8176 -35 -16 21 7 -33 -1 32 -11 -16 19 19 -13 -15 23 28 -13
8191a3
$$ Imaginary data points
##PAGE= N=2
##DATA TABLE= (X++(I..I)), XYDATA
0 0 0 0 0 0 0 0 0 0 0 0 0 0 0 0 1 -8 8 -8 8 -9 16 -16 17 -24 25 -32 40 -41 48 -56 64 -73 85 -96 106 -121 137
37 137 -153 170 -191 211 -235 263 -291 320 -354 392 -432 474 -522 578 -634 699 -771 853 -945
56 -945 1049 -1166 1306 -1469 1663 -1901 2201 -2592 3121 -3885 5089 -7261 12400 -49416 13158
71 13158 118506 -54876 -91952 66681 79381 -89222 -52285 98348 30818 -108506 -3140
82 -3140 106791 -17546 -103943 39589 92698 -56157 -79047 71964 58595 -81072 -38114
93 -38114 87668 16002 -89548 4408 88971 -24853 -82880 41566 73476 -55024 -60795
104 -60795 64569 46426 -71814 -29292 75361 11117 -75283 6652 72143 -22435 -67279
115 -67279 36744 60078 -48885 -50078 57730 37887 -62821 -24891 65236 11182 -65543
126 -65543 3419 63190 -17908 -58030 30604 51178 -41107 -43414 49801 34120 -56319 -22884
138 -22884 59575 10682 -59628 1463 57620 -13609 -53890 25931 47793 -37168 -39477 45981
150 45981 30111 -52348 -20150 56697 9014 -58406 3276 56649 -15508 -51860 26715 45217
162 45217 -37056 -36892 46382 26518 -53276 -14664 56780 2737 -57172 8870 55051 -20463
174 -20463 -49941 31570 41569 -40812 -31052 47543 19744 -52152 -7942 54512 -4424 -53591
186 -53591 16352 49175 -26501 -42287 34739 33716 -41504 -23325 46352 11455 -48303 542
198 542 47459 -11359 -44588 21079 39880 -29689 -32766 36327 23666 -40234 -13815 41857 3938
211 3938 -41912 6084 40078 -15851 -35933 24089 30045 -30119 -23399 34401 16045 -37172 -7636
224 -7636 37787 -1253 -36019 9428 32715 -16497 -28635 22838 23500 -28116 -17129 31373 10278
237 10278 -32472 -3769 32231 -2553 -30911 9128 28039 -15248 -23634 20077 18757 -23683
249 -23683 -13852 26620 8522 -28500 -2589 28599 -3137 -27128 8137 24905 -12880 -21964
261 -21964 17633 17800 -21730 -12643 24449 7383 -26088 -2277 27021 -3162 -26753 8865 24665
274 24665 -14001 -21208 18192 17130 -21878 -12335 25118 6524 -27057 -164 27268 -5751 -26184
287 -26184 11152 24164 -16355 -20705 21037 15607 -24381 -9617 26156 3532 -26960 2649
299 2649 26742 -9102 -24863 15017 21277 -19574 -16797 22819 11801 -25215 -5972 26431 -579
312 -579 -25856 6925 23773 -12344 -20877 17106 17223 -21245 -12362 24030 6631 -24955 -905
325 -905 24507 -4459 -23168 9839 20707 -14933 -16804 18875 12108 -21311 -7360 22727 2527
338 2527 -23221 2671 22248 -7737 -19755 11862 16393 -15086 -12809 17775 8660 -19736 -3957
351 -3957 20290 -648 -19575 4539 18178 -7987 -16245 11277 13384 -13937 -9674 15518 5978
364 5978 -16272 -2532 16707 -978 -16531 4618 15323 -7705 -13287 9974 11118 -11864 -8700
377 -8700 13616 5627 -14767 -2136 14931 -1103 -14555 3955 13968 -6878 -12813 9732 10674
390 10674 -11924 -7994 13261 5264 -14252 -2336 14954 -1100 -14817 4636 13675 -7634 -12025
403 -12025 10089 10145 -12361 -7639 14215 4390 -15049 -915 14930 -2283 -14323 5421 13293
416 13293 -8660 -11331 11460 8549 -13282 -5547 14323 2553 -14946 764 14837 -4386 -13594
429 -13594 7594 11504 -10075 -9135 12132 6477 -13850 -3190 14702 -427 -14346 3697 13241
442 13241 -6499 -11711 9175 9567 -11529 -6557 13009 3241 -13431 -160 13300 -2736 -12704
455 -12704 5735 11254 -8390 -8888 10176 6245 -11175 -3681 11822 944 -11977 2010 11199
468 11199 -4643 -9689 6539 7990 -8006 -6192 9299 3940 -10047 -1345 9925 -975 -9284
481 -9284 2839 8557 -4619 -7521 6365 5902 -7540 -3972 8020 2246 -8229 -606 8381 -1268
495 -1268 -8054 3205 7084 -4662 -5897 5666 4830 -6646 -3538 7504 1806 -7799 -16 7494
509 7494 -1474 -7090 2807 6614 -4384 -5705 5786 4269 -6622 -2788 7038 1466 -7411 38
523 38 7540 -1837 -7040 3500 6030 -4723 -4945 5781 3824 -6850 -2268 7555 375 -7546 1338
538 1338 7118 -2779 -6559 4252 5685 -5781 -4179 6854 2333 -7305 -641 7463 -1009 -7473
552 -7473 2850 6905 -4667 -5645 5932 4090 -6703 -2579 7302 868 -7670 1184 7359 -3138
566 -3138 -6400 4590 5259 -5715 -4037 6739 2429 -7344 -442 7233 -1388 -6590 2846 5838 -4207
581 -4207 -4883 5528 3420 -6406 -1690 6581 152 -6420 1176 6125 -2643 -5482 4065 4240 -5036
596 -5036 -2842 5481 1579 -5816 -311 6006 -1177 -5718 2609 4889 -3599 -3944 4293 3041 -4978
611 -4978 -1890 5509 439 -5503 935 5104 -1957 -4681 2894 4191 -3912 -3291 4688 2061 -4963
626 -4963 -942 5008 -33 -5067 1140 4911 -2409 -4288 3388 3401 -4008 -2628 4541 1784 -5109 -629
642 -629 5319 -709 -5051 1809 4603 -2712 -4151 3727 3455 -4715 -2288 5307 1010 -5479 126 5556
658 5556 -1288 -5494 2683 4980 -4007 -3959 4910 2817 -5530 -1710 6085 325 -6412 1339 6117 -2900
674 -2900 -5386 4071 4523 -5134 -3508 6141 2043 -6770 -300 6757 -1303 -6376 2683 5856 -4109
689 -4109 -5006 5486 3626 -6388 -1983 6748 468 -6830 1008 6736 -2647 -6120 4230 4974 -5353
704 -5353 -3615 6063 2296 -6643 -799 6965 -950 -6734 2597 5978 -3875 -5070 4913 4045 -5910
719 -5910 -2678 6589 979 -6693 606 6399 -1950 -6010 3258 5354 -4610 -4263 5564 2873 -6020
734 -6020 -1567 6230 334 -6328 1126 6098 -2589 -5352 3738 4439 -4549 -3545 5307 2519 -5952
749 -5952 -1163 6186 -247 -5962 1433 5619 -2527 -5210 3739 4452 -4860 -3309 5565 2080 -5964
764 -5964 -955 6301 -312 -6447 1825 6114 -3249 -5317 4370 4439 -5332 -3425 6303 2061 -6980 -375
780 -375 7135 -1225 -6874 2676 6484 -4125 -5732 5619 4476 -6738 -2833 7363 1204 -7663
794 -7663 427 7793 -2276 -7439 4125 6433 -5622 -5131 6693 3726 -7606 -2077 8245 60
808 60 -8305 1982 7753 -3745 -6882 5294 5812 -6740 -4290 7902 2346 -8402 -314 8387
822 8387 -1521 -8060 3386 7378 -5230 -6109 6763 4406 -7698 -2615 8251 816 -8510 1145
836 1145 8300 -3178 -7440 4865 6159 -6121 -4785 7136 3227 -7931 -1360 8191 -591 -7875
850 -7875 2251 7241 -3689 -6455 5075 5354 -6269 -3812 6991 2200 -7256 -716 7355 -780
864 -780 -7249 2405 6702 -3880 -5734 4993 4665 -5837 -3538 6655 2180 -7215 -532 7284 -1039
879 -1039 -7006 2403 6578 -3776 -5963 5171 4881 -6313 -3491 7019 2055 -7475 -591 7771
893 7771 -1088 -7710 2883 7090 -4461 -6123 5742 5020 -6899 -3652 7904 1908 -8437 58
907 58 8414 -1848 -8033 3575 7427 -5313 -6334 6906 4738 -8012 -2886 8638 1036 -8976
921 -8976 945 8928 -3102 -8275 5105 7044 -6691 -5540 7922 3854 -8941 -1821 9499 -488
935 -488 -9364 2706 8681 -4626 -7690 6392 6327 -7977 -4450 9083 2248 -9487 -69 9443
949 9443 -1995 -9012 4099 8105 -6044 -6573 7521 4745 -8442 -2852 9015 866 -9226 1264
963 1264 8849 -3311 -7884 4966 6631 -6276 -5255 7367 3581 -8166 -1657 8377 -261 -8113
977 -8113 1906 7624 -3467 -6898 4986 5743 -6210 -4244 6986 2727 -7415 -1209 7692 -404
991 -404 -7640 2145 7131 -3659 -6260 4869 5305 -5934 -4175 6898 2709 -7505 -1038 7639
1005 7639 -515 -7508 1986 7218 -3537 -6576 5040 5491 -6230 -4155 7054 2769 -7690 -1224
1019 -1224 8099 -578 -8038 2409 7489 -4009 -6664 5425 5633 -6770 -4227 7879 2470 -8474
1033 -8474 -559 8597 -1247 -8409 3114 7867 -5005 -6782 6661 5210 -7855 -3461 8663 1598
1047 1598 -9196 496 9235 -2732 -8634 4738 7495 -6422 -6109 7817 4368 -8942 -2263 9521
1061 9521 -45 -9430 2209 8877 -4145 -7973 6010 6612 -7570 -4758 8596 2707 -9019 -682
1075 -682 9079 -1329 -8744 3370 7890 -5177 -6554 6521 4987 -7468 -3364 8142 1528 -8439
1089 -8439 441 8155 -2278 -7449 3802 6508 -5131 -5356 6334 3869 -7157 -2177 7477 530
1103 530 -7428 995 7184 -2500 -6620 3977 5644 -5129 -4411 5928 3172 -6495 -1847 6918 391
1118 391 -6952 1148 6626 -2418 -6026 3552 5354 -4615 -4418 5581 3191 -6208 -1858 6489 595
1133 595 -6613 705 6565 -2123 -6164 3466 5381 -4563 -4438 5447 3374 -6256 -2087 6823 527
1148 527 -6959 1049 6719 -2456 -6263 3845 5558 -5194 -4428 6315 2982 -6969 -1413 7315 -141
1163 -141 -7388 1849 7073 -3584 -6214 5063 5020 -6174 -3661 7028 2121 -7615 -339 7713 -1519
1178 -1519 -7274 3161 6484 -4571 -5462 5824 4120 -6823 -2433 7313 668 -7312 966 7035
1192 7035 -2506 -6448 4023 5462 -5267 -4085 6095 2627 -6519 -1131 6744 -401 -6598 2014
1206 2014 6011 -3375 -5053 4430 4019 -5223 -2821 5853 1437 -6109 39 5922 -1349 -5467 2458
1221 2458 4867 -3505 -4061 4413 2972 -4970 -1781 5176 702 -5221 338 5102 -1426 -4698 2449
1236 2449 4051 -3184 -3284 3732 2549 -4195 -1675 4561 680 -4603 272 4435 -1092 -4173 1870
1251 1870 3860 -2658 -3293 3389 2521 -3839 -1712 4141 927 -4392 -31 4486 -992 -4272 1931
1266 1931 3840 -2696 -3305 3403 2672 -4080 -1770 4544 694 -4667 336 4595 -1300 -4377 2300
1281 2300 3978 -3275 -3206 4039 2267 -4475 -1307 4780 292 -4897 862 4729 -2025 -4185 2960
1296 2960 3469 -3685 -2686 4298 1712 -4750 -543 4811 -621 -4581 1609 4152 -2527 -3576 3403
1311 3403 2733 -4071 -1688 4388 619 -4429 359 4335 -1357 -4007 2346 3392 -3129 -2523 3625
1326 3625 1659 -3930 -760 4098 -250 -4031 1242 3632 -2057 -3034 2632 2419 -3128 -1684 3493
1341 3493 813 -3586 83 3402 -802 -3116 1406 2779 -2025 -2295 2510 1617 -2764 -967 2813
1356 2813 403 -2834 166 2790 -801 -2512 1346 2120 -1695 -1707 1993 1343 -2272 -842 2470 268
1372 268 -2459 254 2322 -651 -2200 1099 1994 -1584 -1623 1948 1138 -2143 -714 2271 268 -2414
1388 -2414 251 2399 -845 -2177 1313 1850 -1662 -1528 2021 1130 -2338 -557 2501 -61 -2423 588
1404 588 2311 -1052 -2126 1587 1805 -2050 -1257 2332 716 -2433 -182 2509 -373 -2466 1029 2210
1420 2210 -1597 -1765 2000 1296 -2267 -813 2508 205 -2596 485 2427 -1098 -2111 1573 1732 -1988
1436 -1988 -1300 2345 680 -2543 13 2491 -590 -2299 1082 2068 -1584 -1683 2032 1115 -2270 -512
1452 -512 2315 4 -2264 504 2182 -1058 -1895 1528 1432 -1794 -965 1930 553 -2039 -76 2058
1468 2058 -455 -1873 908 1556 -1196 -1264 1436 970 -1676 -570 1802 94 -1732 293 1595 -570
1484 -570 -1465 906 1303 -1225 -960 1452 593 -1501 -286 1548 9 -1602 364 1538 -738 -1311
1500 -1311 999 1064 -1176 -856 1360 596 -1568 -204 1611 -184 -1534 457 1451 -741 -1372 1073
1516 1073 1145 -1378 -797 1529 458 -1602 -146 1684 -189 -1697 663 1573 -1046 -1286 1321 1034
1532 1034 -1541 -738 1793 330 -1917 191 1841 -618 -1663 999 1499 -1366 -1223 1756 779 -1967
1548 -1967 -275 1989 -180 -1954 602 1868 -1104 -1621 1557 1188 -1841 -712 1974 273 -2071
1563 -2071 201 2070 -746 -1870 1229 1513 -1554 -1111 1792 739 -1974 -233 2076 -316 -1935
1578 -1935 811 1698 -1145 -1423 1479 1117 -1772 -658 1940 143 -1893 296 1790 -665 -1645 1066
1594 1066 1412 -1460 -1019 1668 591 -1742 -226 1786 -148 -1814 577 1658 -992 -1365 1262 1064
1610 1064 -1438 -765 1651 427 -1763 26 1753 -415 -1586 717 1464 -985 -1287 1312 1007 -1532
1626 -1532 -611 1627 275 -1650 26 1688 -390 -1664 810 1468 -1125 -1206 1342 956 -1541 -678
1642 -678 1767 251 -1865 219 1789 -605 -1656 947 1532 -1345 -1275 1725 858 -1937 -373 2018
1658 2018 -28 -2030 487 2033 -1011 -1794 1519 1423 -1837 -988 2096 573 -2277 -38 2376 -584
1674 -584 -2232 1122 1935 -1563 -1616 1939 1194 -2282 -643 2492 6 -2474 566 2314 -1061 -2129
1690 -2129 1576 1798 -2040 -1283 2347 697 -2449 -132 2475 -405 -2435 1012 2233 -1563 -1800 1975
1706 1975 1335 -2216 -872 2438 332 -2534 304 2432 -891 -2160 1348 1847 -1726 -1512 2098 1011
1722 1011 -2355 -440 2377 -99 -2311 541 2192 -1010 -1992 1482 1609 -1818 -1157 2007 745 -2120
1738 -2120 -328 2249 -152 -2223 680 2035 -1070 -1764 1387 1534 -1697 -1204 2021 759 -2173 -246
1754 -246 2205 -176 -2185 604 2135 -1108 -1954 1579 1571 -1935 -1186 2149 764 -2393 -276 2543
1770 2543 -338 -2485 948 2282 -1422 -2008 1891 1692 -2341 -1184 2680 547 -2804 91 2809
1785 2809 -647 -2713 1283 2508 -1917 -2058 2445 1499 -2739 -894 2983 276 -3107 441 3046
1800 3046 -1194 -2752 1818 2308 -2311 -1828 2750 1210 -3091 -461 3196 -318 -3099 1000 2865
1815 2865 -1624 -2527 2240 2014 -2743 -1315 3004 599 -3085 91 3097 -787 -2931 1513 2565
1830 2565 -2115 -2007 2525 1442 -2796 -820 2995 126 -3025 606 2799 -1241 -2455 1712 2075
1845 2075 -2152 -1621 2534 1022 -2731 -396 2719 -165 -2643 661 2518 -1206 -2251 1716 1822
1860 1822 -2056 -1355 2275 921 -2469 -433 2606 -137 -2567 701 2390 -1143 -2143 1565 1900
1875 1900 -1994 -1479 2356 955 -2535 -424 2624 -84 -2648 626 2605 -1226 -2351 1766 1939
1890 1939 -2148 -1536 2470 1047 -2788 -452 2952 -217 -2899 841 2722 -1396 -2485 1960 2133
1905 2133 -2478 -1566 2861 923 -3015 -286 3114 -358 -3083 1097 2877 -1803 -2429 2345 1885 -2742
1921 -2742 -1314 3074 634 -3282 157 3228 -929 -2959 1581 2590 -2152 -2134 2696 1485 -3091
1936 -3091 -710 3202 -44 -3148 718 2990 -1407 -2675 2066 2165 -2555 -1496 2835 855 -2970
1951 -2970 -197 3032 -487 -2894 1183 2574 -1717 -2095 2117 1657 -2437 -1128 2678 475 -2733
1966 -2733 158 2597 -682 -2397 1138 2175 -1602 -1803 2003 1309 -2221 -811 2304 376 -2375
1981 -2375 90 2365 -638 -2187 1116 1897 -1445 -1566 1740 1264 -2034 -843 2248 338 -2264 139
1997 139 2196 -525 -2107 962 1977 -1400 -1643 1772 1247 -1986 -878 2162 480 -2337 17 2383
2013 2383 -571 -2247 1011 2022 -1408 -1782 1801 1427 -2186 -935 2410 365 -2459 132 2469
2028 2469 -640 -2383 1214 2165 -1739 -1727 2123 1249 -2354 -747 2577 185 -2658 495 2558 -1115
2044 -1115 -2245 1610 1895 -2028 -1469 2419 904 -2652 -237 2659 -395 -2533 932 2319 -1471
2059 -1471 -2007 1975 1508 -2322 -922 2464 375 -2500 152 2484 -720 -2299 1276 1938 -1660 -1496
2075 -1496 1929 1089 -2130 -599 2301 65 -2247 478 2050 -878 -1818 1208 1564 -1552 -1199 1817
2091 1817 706 -1912 -265 1882 -122 -1846 485 1741 -906 -1520 1213 1171 -1405 -886 1523 584
2107 584 -1648 -228 1704 -166 -1599 506 1450 -735 -1295 994 1155 -1231 -851 1428 543 -1453
2123 -1453 -273 1491 21 -1538 295 1492 -642 -1306 907 1105 -1086 -939 1301 708 -1521 -362
2139 -362 1591 -31 -1559 293 1482 -602 -1414 935 1213 -1276 -880 1451 542 -1540 -229 1642
2155 1642 -122 -1647 553 1521 -914 -1239 1182 996 -1380 -706 1587 320 -1690 136 1622 -502
2171 -502 -1470 801 1301 -1092 -1089 1386 721 -1545 -319 1546 -40 -1514 336 1454 -695 -1290 1027
2188 1027 976 -1242 -665 1320 389 -1389 -78 1428 -293 -1307 615 1086 -815 -861 992 671 -1140
2205 -1140 -370 1249 30 -1193 261 1067 -452 -965 642 822 -846 -571 979 293 -982 -89 940
2222 940 -94 -938 303 866 -536 -700 647 504 -688 -380 745 250 -814 -47 820 -156 -707 285
2240 285 655 -340 -597 491 517 -620 -346 677 216 -651 -96 692 -26 -723 213 681 -393 -544 481
2259 481 453 -562 -380 690 224 -784 -2 740 -166 -694 280 641 -434 -582 629 418 -743 -198
2277 -198 779 51 -771 101 797 -300 -734 532 590 -658 -394 718 262 -771 -88 854 -139 -816 379
2296 379 691 -515 -547 624 440 -745 -269 835 7 -811 213 715 -354 -636 498 547 -677 -372
2314 -372 773 127 -766 57 723 -193 -686 382 622 -562 -410 676 232 -668 -69 701 -46 -699 258
2333 258 654 -434 -475 526 339 -542 -233 615 100 -657 87 603 -259 -500 320 419 -398 -377 471 241
2353 241 -565 -78 518 -38 -465 92 455 -188 -441 325 353 -406 -220 422 171 -427 -93 495 -5 -500
2373 -500 176 431 -239 -347 300 338 -362 -265 487 136 -526 0 495 -70 -486 141 487 -292 -443 422 309
2394 309 -472 -195 495 122 -559 -22 608 -152 -571 303 495 -369 -395 471 354 -567 -193 680 1 -635
2414 -635 157 582 -258 -555 415 516 -585 -340 687 159 -678 -4 683 -124 -694 319 622 -519 -463
2433 -463 628 298 -676 -165 726 12 -776 212 716 -404 -566 520 464 -582 -336 719 170 -763 70
2452 70 743 -235 -636 366 590 -445 -487 616 338 -693 -128 676 -18 -641 136 640 -288 -594 455
2471 455 443 -544 -303 565 208 -600 -98 653 -64 -628 251 530 -335 -443 401 397 -517 -289 612 134 -608
2492 -608 16 578 -86 -564 204 569 -343 -478 479 348 -512 -248 548 163 -621 -28 673 -136 -623 261
2512 261 532 -354 -514 440 442 -594 -306 674 119 -694 -4 681 -121 -701 292 664 -489 -530 612 384
2532 384 -655 -266 748 123 -812 128 807 -319 -691 478 604 -598 -496 753 330 -843 -92 878
2550 878 -118 -802 288 762 -461 -693 657 519 -794 -304 841 112 -847 58 874 -255 -826 475
2568 475 689 -626 -500 722 364 -780 -194 871 -13 -859 268 777 -389 -645 530 569 -642 -411
2586 -411 779 208 -802 1 762 -139 -741 284 697 -461 -577 609 407 -670 -268 682 145 -753
2604 -753 15 751 -215 -678 366 570 -452 -495 543 413 -656 -249 721 90 -697 58 675 -142 -678
2623 -678 300 644 -448 -514 570 393 -616 -282 694 176 -772 16 781 -189 -720 326 637 -452 -592
2642 -592 602 460 -748 -271 806 71 -802 89 822 -257 -800 471 707 -658 -513 764 355 -828
2660 -828 -183 908 -20 -917 281 855 -479 -721 634 618 -747 -455 907 249 -967 20 952 -223
2678 -223 -874 396 790 -592 -681 775 468 -882 -258 910 59 -928 117 921 -336 -825 550 652
2696 652 -674 -477 770 339 -855 -132 900 -96 -862 305 767 -427 -650 562 557 -694 -359 788
2714 788 181 -777 2 754 -141 -730 309 679 -457 -556 577 401 -615 -288 660 170 -714 -29 716
2733 716 -160 -638 275 581 -354 -532 482 468 -574 -320 657 193 -642 -76 679 -22 -684 215 670 -351
2753 -351 -553 474 484 -541 -387 664 262 -757 -74 763 -102 -707 240 682 -372 -632 550 516 -688
2772 -688 -326 764 172 -793 -22 831 -164 -819 391 733 -549 -578 677 471 -765 -306 883 102
2790 102 -898 148 870 -318 -774 499 717 -643 -550 802 356 -876 -134 874 -40 -864 240
2807 240 826 -448 -716 625 549 -731 -365 804 206 -851 -11 880 -209 -786 387 658 -524 -550
2825 -550 619 430 -740 -229 797 40 -757 138 710 -243 -649 395 590 -524 -437 604 294 -618
2843 -618 -161 647 44 -665 96 644 -245 -569 341 474 -403 -418 482 320 -570 -179 602 50 -574 41
2863 41 575 -141 -568 280 511 -391 -393 471 314 -498 -225 577 132 -610 55 605 -158 -548 251 527 -365
2884 -365 -461 498 371 -588 -208 622 81 -631 16 642 -177 -630 341 545 -460 -443 543 348 -628 -223
2904 -223 703 61 -713 128 679 -250 -605 377 559 -505 -428 653 280 -683 -80 693 -38 -681 191 659
2924 659 -357 -560 508 422 -565 -267 607 152 -659 -4 655 -190 -603 316 497 -394 -405 485 314 -576
2944 -576 -177 599 13 -555 115 515 -188 -472 307 419 -390 -277 471 194 -442 -101 460 44 -469 86
2964 86 438 -196 -367 247 316 -266 -259 342 204 -375 -97 381 7 -353 28 353 -91 -351 171 313 -237
2985 -237 -230 263 179 -273 -145 333 90 -356 24 358 -69 -301 113 316 -172 -289 262 246 -302 -138 330
3006 330 111 -336 -61 383 -35 -398 147 331 -217 -290 246 261 -312 -220 383 104 -400 9 379 -70 -361
3027 -361 130 365 -225 -302 323 218 -343 -123 351 77 -358 25 384 -111 -318 224 262 -242 -186 275 159
3048 159 -318 -82 345 -23 -304 95 260 -132 -243 173 214 -238 -130 259 60 -244 -8 225 -19 -246
3068 -246 70 218 -136 -161 159 123 -140 -91 169 86 -186 -2 194 -21 -142 49 133 -35 -147 84 125 -109
3090 -109 -67 111 64 -89 -54 101 54 -145 -19 123 -15 -100 23 108 -18 -133 48 113 -95 -90 86 77 -85 -87
3114 -87 128 65 -151 5 152 -24 -143 45 148 -55 -157 122 133 -139 -70 154 62 -138 -35 179 -6 -169
3136 -169 64 159 -103 -120 97 112 -113 -104 153 51 -166 -7 129 -10 -126 18 141 -64 -134 97 90 -96 -49
3159 -49 105 79 -101 -45 131 10 -114 43 98 -11 -77 38 107 -57 -81 101 66 -91 -34 79 46 -112 -39 139
3183 139 -2 -120 26 96 -35 -109 39 129 -104 -97 118 64 -117 -38 125 58 -137 -16 192 -39 -149 89 132
3206 132 -63 -116 113 147 -157 -79 203 40 -173 6 193 -6 -196 67 208 -138 -162 167 110 -173 -92 200
3228 200 75 -249 3 240 -65 -205 93 186 -108 -180 168 166 -202 -89 221 42 -212 -4 237 -22 -238
3249 -238 112 225 -148 -157 174 138 -174 -117 227 74 -245 11 238 -53 -204 66 204 -109 -205 184 148 -225
3271 -225 -90 214 61 -219 -24 252 -39 -259 113 205 -146 -169 167 153 -206 -131 272 61 -269 39 265
3292 265 -49 -233 102 265 -149 -205 239 149 -238 -68 258 48 -286 7 311 -98 -283 166 224 -203 -193
3313 -193 213 159 -277 -106 304 7 -308 66 282 -100 -281 168 266 -237 -197 288 125 -281 -64 304 29
3334 29 -318 65 315 -146 -253 185 222 -202 -189 268 154 -306 -68 313 -3 -282 44 270 -98 -275 158
3355 158 231 -238 -173 256 107 -257 -75 297 35 -321 68 285 -114 -239 146 222 -175 -190 266 140 -290
3376 -290 -42 292 -1 -282 51 301 -96 -287 191 238 -234 -162 254 135 -285 -83 316 -6 -342 83 293
3397 293 -144 -261 184 248 -249 -208 314 129 -340 -40 335 -7 -329 84 341 -168 -303 257 243 -282 -166
3418 -166 324 131 -362 -44 398 -51 -363 152 310 -202 -267 239 239 -319 -164 356 67 -371 12 338 -61
3439 -61 -357 130 316 -230 -256 274 170 -293 -124 326 76 -347 25 358 -101 -292 160 262 -186 -221 254
3460 254 191 -290 -86 318 35 -275 16 284 -62 -291 132 253 -212 -192 212 148 -231 -119 253 58 -309
3481 -309 12 267 -91 -245 103 219 -148 -220 202 169 -256 -100 249 60 -246 -28 275 -32 -280 113 241
3502 241 -163 -200 197 185 -228 -145 288 91 -310 -8 290 -45 -285 69 287 -167 -277 228 205 -284 -140
3523 -140 274 82 -328 -37 350 -71 -339 148 287 -193 -251 248 222 -301 -143 352 59 -341 36 327 -82
3544 -82 -320 149 297 -224 -235 303 151 -305 -82 305 37 -336 34 324 -150 -292 193 226 -232 -199 252
3565 252 142 -310 -73 311 -22 -297 74 260 -118 -257 175 232 -234 -144 264 90 -242 -30 263 3 -269
3586 -269 66 252 -125 -198 159 170 -175 -156 208 92 -241 -31 228 -22 -213 28 213 -82 -222 128 182
3607 182 -175 -138 166 89 -194 -84 237 35 -255 30 229 -72 -216 92 204 -135 -188 205 149 -233 -82
3628 -82 232 46 -244 -10 292 -48 -266 127 234 -168 -184 192 176 -239 -133 281 39 -304 19 278 -85
3649 -85 -267 117 261 -192 -220 244 141 -277 -87 280 39 -299 27 305 -114 -272 184 216 -207 -172 251
3670 251 147 -294 -61 308 -16 -282 90 259 -122 -244 172 212 -238 -140 269 73 -267 -38 261 -11 -275
3691 -275 71 253 -143 -190 177 142 -191 -125 218 84 -251 -8 248 -38 -218 73 207 -96 -202 165 172 -190
3713 -190 -96 205 69 -192 -53 211 0 -233 64 201 -104 -185 108 158 -147 -167 189 106 -231 -55 222 19
3735 19 -229 3 224 -71 -236 131 207 -172 -159 195 145 -216 -112 274 54 -268 29 266 -53 -230 125
3756 125 235 -171 -206 237 143 -271 -95 267 58 -292 7 306 -94 -291 154 218 -218 -205 233 148 -298 -101
3778 -101 338 13 -325 70 289 -105 -273 178 265 -240 -196 305 121 -304 -43 332 9 -324 79 337 -168
3799 -168 -263 228 211 -249 -172 289 106 -331 -40 330 -60 -306 101 272 -164 -268 211 212 -270 -132 291 57
3821 57 -286 -21 303 -24 -298 117 266 -174 -214 227 192 -221 -147 288 95 -311 2 304 -39 -265 76
3842 76 273 -141 -271 221 202 -262 -148 267 94 -308 -62 316 -8 -341 92 301 -160 -273 187 229 -257
3863 -257 -199 309 116 -340 -47 347 -18 -336 79 353 -149 -330 247 265 -294 -173 324 133 -361 -56 410
3884 410 -38 -405 137 355 -207 -320 269 291 -351 -217 397 103 -431 -17 415 -83 -424 160 391 -284
3904 -284 -349 350 232 -405 -168 436 83 -467 26 460 -151 -423 239 357 -300 -301 372 221 -442 -111 453
3925 453 -5 -444 92 428 -173 -409 256 335 -358 -255 376 151 -424 -82 429 -21 -449 109 402 -222
3945 -222 -357 264 293 -326 -241 386 154 -429 -51 419 -43 -396 111 390 -189 -373 286 297 -331 -223 370
3966 370 168 -386 -83 433 -3 -434 109 395 -176 -343 238 309 -318 -268 378 167 -421 -85 417 9 -432
3987 -432 67 431 -187 -390 277 331 -321 -255 384 195 -444 -105 490 -7 -464 121 457 -193 -416 283 378
4008 378 -370 -287 463 172 -487 -83 507 -24 -531 131 491 -276 -447 356 347 -434 -269 476 157 -547 -40
4029 -40 559 -105 -517 207 466 -303 -419 415 332 -495 -206 538 92 -523 26 531 -128 -501 264 452 -364
4050 -364 -349 440 261 -460 -164 515 55 -549 67 509 -189 -459 262 395 -359 -334 441 233 -490 -118 501
4071 501 6 -480 78 479 -167 -450 278 363 -354 -276 399 211 -429 -131 482 25 -476 93 450 -154 -386
4092 -386 230 372 -310 -295 394 205 -433 -118 427 37 -450 39 449 -156 -430 237 358 -313 -309 354 239
4113 239 -420 -163 473 37 -486 56 467 -132 -444 234 418 -332 -329 425 248 -455 -145 504 72 -527 52
4134 52 523 -182 -480 290 414 -365 -339 446 260 -515 -133 540 0 -529 96 492 -217 -477 321 402 -424
4155 -424 -296 471 185 -508 -88 532 -32 -554 155 508 -282 -422 370 351 -409 -247 500 145 -524 -10
4175 -10 533 -99 -484 200 452 -283 -400 379 300 -448 -180 463 80 -472 -5 475 -124 -456 208 381 -302
4196 -302 -316 332 237 -375 -161 423 68 -441 41 410 -105 -370 175 349 -250 -292 317 210 -348 -124 369
4217 369 81 -374 -2 397 -91 -372 167 315 -221 -286 269 240 -339 -169 363 69 -385 -8 373 -52 -376
4238 -376 134 366 -217 -294 292 230 -318 -172 357 112 -396 -9 409 -73 -380 154 343 -213 -304 290 252
4259 252 -351 -156 394 63 -387 7 375 -86 -384 175 335 -274 -284 309 200 -353 -148 363 38 -405
4279 -405 58 383 -152 -341 212 291 -270 -237 327 181 -372 -67 384 -13 -359 88 346 -152 -288 250 251
4300 251 -292 -158 327 105 -319 -44 336 -38 -328 116 272 -178 -224 194 184 -254 -139 267 45 -294 5
4321 5 252 -58 -251 80 227 -145 -194 190 136 -206 -92 203 62 -228 -12 248 -46 -219 94 182 -123 -168
4343 -168 139 138 -172 -114 203 34 -211 -25 177 -26 -212 56 184 -131 -167 136 117 -169 -107 163 59 -201
4365 -201 -24 194 -42 -192 52 160 -90 -154 124 132 -156 -81 176 42 -172 -2 174 -17 -184 87 170 -114
4387 -114 -118 143 89 -151 -67 154 26 -197 22 168 -78 -145 73 125 -116 -128 137 65 -159 -29 149 -11 -129
4410 -129 34 142 -59 -124 105 89 -125 -40 120 27 -114 -7 132 -17 -106 57 97 -71 -58 74 59 -80 -32
4433 -32 98 -3 -91 16 69 -36 -65 28 54 -64 -53 58 12 -69 -16 41 9 -58 -7 59 -23 -45 35 20 -26 -10 24
4460 24 25 -35 -17 39 -5 -22 7 13 7 -21 -5 31 -17 -9 3 -13 -15 -13 -3 5 -34 -21 10 -23 -5 -16 -2 8 -17 -12 14 -20 -8 7
4494 7 -2 9 -15 -7 16 -13 -7 13 9 -6 4 1 13 -12 -11 12 1 -11 -14 -5 25 -16 -27 17 -1 -22 -16 15 9 -46 -6 44 -21 -32 10 23
4530 23 -30 -41 25 36 -51 -20 64 3 -42 12 59 -16 -66 40 60 -57 -44 66 26 -64 -24 83 8 -87 29 80 -48
4557 -48 -65 54 56 -61 -64 95 28 -114 -6 94 -25 -92 27 86 -62 -79 85 53 -106 -25 100 13 -96 5
4581 5 116 -23 -117 68 94 -86 -67 91 58 -108 -36 136 11 -126 30 124 -59 -110 71 115 -101 -91 122 51
4605 51 -134 -29 128 -14 -148 9 140 -68 -128 91 99 -106 -84 128 81 -149 -37 178 -1 -160 43 155
4627 155 -62 -148 106 144 -132 -84 181 62 -173 -18 187 -13 -192 63 194 -107 -154 141 124 -169 -100 195
4649 195 57 -239 -10 212 -68 -218 84 181 -132 -176 171 130 -227 -72 236 26 -238 20 245 -73 -237
4670 -237 150 199 -176 -148 214 113 -234 -58 258 9 -263 68 246 -123 -220 149 181 -204 -153 237 83 -254
4692 -254 -35 256 -41 -260 77 245 -121 -218 193 170 -223 -112 236 82 -251 -22 270 -44 -253 107 222
4713 222 -130 -194 185 182 -212 -113 265 70 -260 -1 272 -43 -263 100 255 -162 -223 199 175 -239 -136 266
4735 266 72 -290 -24 309 -70 -304 120 265 -174 -243 235 202 -284 -131 315 54 -322 9 331 -61 -327
4756 -327 154 300 -234 -245 287 207 -308 -120 352 51 -375 42 366 -132 -341 208 290 -270 -255 323 179
4777 179 -389 -93 386 -21 -411 87 384 -186 -342 267 285 -339 -208 388 136 -409 -38 428 -57 -412
4797 -412 171 378 -251 -310 307 247 -364 -168 403 70 -422 28 391 -118 -379 180 329 -276 -292 326 188
4818 188 -376 -113 376 23 -397 38 373 -147 -358 215 308 -272 -234 319 181 -369 -96 391 28 -385 68
4839 68 366 -125 -350 211 309 -280 -236 329 173 -363 -101 380 31 -407 54 396 -148 -376 215 314 -286
4860 -286 -273 340 189 -409 -116 414 25 -420 62 416 -155 -404 228 356 -322 -283 396 195 -428 -106 471
4881 471 27 -473 98 462 -206 -409 297 363 -381 -285 454 182 -507 -70 526 -71 -521 171 472 -295 -441
4902 -441 386 331 -479 -237 511 110 -554 3 546 -151 -519 262 456 -354 -355 437 275 -503 -149 553 33
4923 33 -527 100 520 -196 -460 311 393 -393 -294 481 187 -505 -80 500 -33 -499 137 462 -250 -425 336
4944 336 318 -406 -254 445 150 -488 -41 499 -72 -458 167 437 -245 -371 333 307 -391 -214 443 131 -444
4965 -444 -40 459 -48 -443 146 427 -241 -361 306 297 -359 -238 400 150 -464 -61 453 -51 -460 118 416
4986 416 -231 -403 299 319 -388 -260 427 164 -474 -65 484 -32 -509 151 462 -257 -414 356 361 -419 -255
5007 -255 505 155 -528 -14 557 -85 -531 199 488 -320 -422 426 326 -499 -210 542 93 -571 24 563
5027 563 -163 -532 279 454 -393 -364 458 273 -522 -151 551 25 -554 113 527 -215 -472 337 411 -413 -292
5048 -292 494 198 -502 -47 536 -42 -503 170 486 -270 -407 361 326 -425 -226 464 121 -485 -19 495
5068 495 -105 -464 175 396 -267 -355 341 281 -401 -194 422 95 -427 3 429 -64 -399 168 372 -232 -306
5089 -306 309 254 -328 -178 389 122 -399 -14 408 -64 -380 138 358 -217 -329 277 257 -346 -192 372 103
5110 103 -414 -53 415 -70 -414 151 389 -237 -332 303 276 -373 -204 425 105 -443 6 469 -101 -418 202
5131 202 407 -275 -331 375 254 -421 -150 454 63 -467 46 457 -166 -432 246 353 -334 -287 394 189 -443
5152 -443 -115 448 -18 -455 117 408 -220 -369 290 295 -376 -215 414 113 -421 -14 433 -77 -405 177 370
5173 370 -256 -301 331 229 -362 -137 397 52 -393 39 374 -138 -345 192 286 -263 -242 288 147 -324 -100
5194 -100 321 1 -334 33 297 -116 -282 155 235 -212 -185 235 134 -259 -89 269 27 -281 44 281 -86
5215 -86 -238 137 226 -174 -182 220 143 -249 -83 256 34 -267 14 261 -86 -265 121 215 -194 -198 201 141 -248
5238 -248 -106 256 28 -285 20 271 -93 -266 139 227 -198 -184 250 135 -266 -55 287 11 -278 59 279
5259 279 -114 -245 174 192 -222 -143 247 88 -279 -32 284 -49 -285 101 228 -173 -218 193 140 -270 -92
5280 -92 259 11 -272 22 247 -94 -234 147 195 -194 -140 230 87 -225 -26 243 -23 -223 82 205 -120
5301 -120 -159 161 128 -161 -89 191 44 -187 11 180 -56 -161 78 129 -111 -122 125 64 -143 -52 137 8
5323 8 -139 16 130 -48 -130 63 103 -103 -71 103 63 -104 -42 130 15 -122 24 120 -26 -101 61 99 -66
5346 -66 -77 103 65 -110 -34 109 19 -120 8 115 -36 -106 47 81 -77 -80 80 56 -109 -51 111 5 -119 20
5370 20 112 -50 -106 77 94 -88 -64 111 48 -105 -1 125 -12 -107 54 133 -68 -73 109 60 -120 -34 107 9
5394 9 -118 31 117 -72 -108 87 72 -115 -57 125 29 -128 13 112 -57 -108 71 89 -86 -67 116 39 -104 -1
5418 -1 117 -14 -101 58 100 -68 -57 106 44 -95 1 107 -16 -87 39 94 -55 -72 80 46 -90 -24 90 -2
5442 -2 -91 14 77 -51 -86 64 56 -89 -49 76 18 -88 8 87 -16 -80 37 69 -46 -52 64 45 -69 -32 80 21
5468 21 -67 13 81 -13 -64 43 65 -51 -45 66 37 -64 -30 79 0 -88 7 78 -37 -70 52 47 -63 -61 67 33 -87
5495 -87 -17 100 -10 -103 28 96 -34 -87 79 77 -86 -50 99 35 -97 2 129 -7 -117 62 113 -87 -81 102
5519 102 71 -122 -52 125 2 -141 20 131 -72 -144 78 79 -127 -85 125 27 -154 -12 138 -43 -142 67 134
5542 134 -95 -112 129 69 -132 -41 155 9 -143 33 143 -61 -131 101 106 -112 -79 143 46 -164 -11 155 -28
5565 -28 -164 56 119 -98 -114 102 75 -151 -58 139 6 -163 -2 126 -34 -129 70 114 -106 -96 116 62 -136
5588 -136 -43 134 23 -135 23 145 -40 -128 70 104 -94 -84 124 61 -147 -45 126 -1 -154 9 137 -61
5610 -61 -137 76 120 -115 -109 122 59 -165 -54 171 2 -185 34 162 -70 -144 100 137 -122 -99 176 78 -176
5633 -176 -14 193 -7 -194 69 189 -99 -164 151 118 -177 -83 192 30 -218 -1 218 -61 -212 99 166
5654 166 -142 -146 179 86 -220 -69 225 -13 -232 47 210 -108 -198 149 155 -191 -110 223 65 -222 2 243
5676 243 -40 -232 100 212 -146 -157 183 127 -204 -73 228 23 -237 25 217 -87 -205 118 160 -155 -141
5697 -141 172 88 -212 -69 201 -8 -213 33 185 -91 -175 128 153 -148 -113 179 87 -192 -38 211 6 -199
5719 -199 54 200 -89 -172 122 152 -156 -134 180 94 -220 -57 204 0 -225 30 205 -107 -221 118 174 -186
5741 -186 -152 206 96 -230 -49 244 -9 -256 49 238 -115 -221 153 189 -200 -142 254 103 -268 -16 283
5762 283 -22 -269 99 271 -147 -230 225 175 -269 -123 276 62 -313 11 301 -102 -294 166 240 -221 -204
5783 -204 256 138 -310 -75 324 -1 -309 74 299 -135 -271 213 226 -251 -148 303 101 -300 -21 312
5803 312 -42 -282 121 271 -172 -226 221 174 -259 -112 275 52 -293 0 268 -79 -266 129 230 -185 -209
5824 -209 206 132 -262 -97 256 35 -276 29 267 -72 -252 131 229 -173 -184 218 154 -233 -100 274 41
5845 41 -266 21 273 -55 -253 129 237 -167 -206 214 154 -253 -109 277 49 -298 -2 296 -83 -289 121
5866 121 242 -187 -228 231 173 -283 -113 314 46 -325 27 338 -95 -304 168 278 -218 -221 302 155 -329
5887 -329 -81 368 0 -373 75 347 -164 -317 235 251 -306 -202 336 99 -379 -33 365 -79 -371 136
5907 136 326 -217 -289 284 220 -338 -138 355 53 -361 32 358 -111 -322 185 290 -241 -205 297 163 -320
5928 -320 -85 343 8 -349 77 331 -128 -294 200 233 -257 -186 282 111 -313 -58 314 -28 -321 77 277
5949 277 -159 -263 190 194 -249 -169 261 90 -297 -46 308 -18 -282 79 273 -112 -222 179 212 -216 -165 261
5971 261 107 -277 -47 287 9 -292 59 280 -123 -262 175 214 -225 -191 245 113 -312 -70 313 -12 -329
5992 -329 79 301 -141 -292 204 232 -266 -184 296 114 -335 -40 353 -29 -347 126 319 -198 -270 259 221
6013 221 -303 -152 350 70 -377 11 364 -100 -353 174 301 -241 -255 286 163 -342 -113 335 10 -360
6033 -360 60 326 -148 -314 205 250 -267 -197 291 117 -324 -46 334 -34 -315 120 289 -168 -244 233 203
6054 203 -269 -125 303 72 -301 -1 290 -58 -284 130 240 -176 -209 194 141 -257 -121 243 33 -267 -7
6075 -7 246 -54 -248 90 218 -136 -195 170 153 -201 -115 225 66 -230 -21 240 -21 -232 82 219 -113 -197
6097 -197 158 168 -195 -122 228 84 -245 -22 257 -34 -254 74 236 -148 -229 165 170 -232 -134 244 72 -284
6119 -284 -15 284 -43 -273 108 257 -170 -218 210 168 -264 -116 291 51 -289 20 299 -88 -261 140 234
6140 234 -198 -194 257 127 -269 -68 280 -1 -290 58 263 -129 -249 167 174 -240 -158 247 75 -283 -22 270
6162 270 -61 -263 106 232 -167 -178 201 139 -214 -80 244 14 -232 25 231 -77 -205 114 169 -158 -133
6183 -133 177 81 -195 -50 190 2 -203 20 175 -74 -175 96 133 -137 -119 140 80 -167 -59 160 18
6204 18 -162 14 155 -54 -148 79 125 -106 -105 124 94 -135 -56 155 29 -152 16 169 -28 -142 78 144 -106
6227 -106 -116 126 103 -143 -61 165 23 -180 1 161 -51 -183 87 142 -122 -132 133 82 -173 -56 180 6
6249 6 -192 17 171 -62 -160 118 146 -134 -106 169 65 -166 -26 178 -9 -180 59 162 -105 -141 133 107
6271 107 -158 -75 164 26 -172 9 157 -75 -165 84 114 -125 -100 136 55 -155 -30 146 -22 -144 48 130
6293 130 -70 -107 99 89 -111 -64 104 20 -121 -4 124 -18 -109 55 108 -75 -80 83 53 -84 -39 84 14 -90
6317 -90 -4 78 -30 -86 30 67 -63 -66 58 30 -73 -34 69 7 -86 -11 73 -11 -76 22 71 -44 -67 51 58 -61 -34
6344 -34 68 25 -80 -8 79 -9 -71 28 68 -52 -75 57 49 -81 -41 77 16 -94 -11 84 -31 -97 30 66 -61 -71
6370 -71 67 35 -90 -28 88 5 -92 32 95 -40 -78 68 54 -74 -25 97 23 -86 20 97 -29 -84 51 71
6394 71 -79 -53 82 26 -76 -5 91 -25 -97 27 66 -63 -68 58 26 -83 -31 63 -9 -86 22 66 -36 -58 50
6419 50 52 -50 -27 64 17 -63 12 72 -11 -48 38 42 -36 -24 57 25 -52 -5 50 -11 -57 11 47 -45 -48 20 3 -47 -28 37 -2
6450 -2 -62 -11 37 -14 -49 11 30 -23 -32 27 16 -38 -24 28 13 -31 -14 30 1 -27 12 36 -18 -29 25 19 -22 -18 27 20 -43 -7 32
6483 32 -16 -55 -3 28 -32 -46 15 30 -57 -38 42 3 -61 -6 56 -20 -53 28 44 -55 -41 55 20 -56 -18 68 -5 -56 27 55
6513 55 -38 -49 50 29 -76 -22 64 -3 -66 16 57 -37 -68 27 36 -62 -51 50 7 -81 0 51 -26 -75 17 49 -63 -51 51
6542 51 17 -71 -6 61 -7 -69 6 67 -36 -49 46 35 -43 -22 67 18 -67 15 61 -28 -50 24 41 -53 -48 32 19 -56 -22 27
6572 27 -21 -59 -2 31 -20 -52 11 23 -38 -22 29 15 -37 -12 40 1 -34 12 33 -15 -24 22 31 -27 -19 41 37 -39 -12 41 0 -46
6604 -46 5 38 -20 -51 33 27 -52 -34 33 10 -60 -12 46 -15 -73 9 51 -35 -52 44 32 -46 -35 65 15 -75 2 59 -17 -57
6634 -57 42 63 -45 -39 69 32 -65 -10 70 -10 -69 23 67 -50 -66 53 32 -74 -50 62 -11 -82 -6 60 -43 -74 32
6661 32 38 -67 -58 58 13 -85 -16 84 -23 -70 33 61 -48 -50 74 35 -77 -15 72 -5 -67 23 69 -37 -55 48 38
6688 38 -64 -34 53 8 -76 -24 51 -21 -66 18 35 -48 -55 48 19 -66 -32 48 -7 -68 3 53 -12 -59 15 50 -29 -44 62
6717 62 39 -44 -16 63 14 -70 -1 73 -15 -62 35 62 -47 -57 53 37 -70 -51 61 3 -89 -11 60 -27 -89 22 58 -67
6745 -67 -71 65 39 -85 -39 78 24 -101 -2 102 -41 -93 57 87 -66 -58 91 43 -99 -23 107 -8 -121 39
6769 39 105 -57 -99 81 72 -112 -55 105 7 -135 -9 107 -48 -131 55 79 -95 -88 90 47 -126 -34 120 -3
6793 -3 -128 28 111 -59 -93 77 85 -84 -46 114 33 -120 8 112 -23 -109 48 97 -63 -85 81 56 -97 -48
6817 -48 96 2 -112 -15 94 -45 -113 32 71 -76 -80 69 53 -92 -49 92 20 -96 -9 109 -19 -97 43 98
6841 98 -45 -60 76 62 -80 -47 83 46 -98 -16 116 -19 -106 19 92 -50 -113 63 76 -97 -74 100 31 -130
6865 -130 -30 106 -16 -131 27 116 -73 -117 80 88 -114 -82 125 27 -151 -5 137 -27 -138 62 129 -91
6887 -91 -108 129 83 -142 -46 156 16 -161 11 149 -58 -137 88 111 -133 -92 128 47 -170 -32 149 -28 -176
6910 -176 35 136 -95 -130 103 96 -135 -71 144 27 -147 15 141 -30 -133 74 122 -89 -84 114 80 -134 -30
6933 -30 137 11 -122 25 124 -42 -121 57 95 -88 -86 85 55 -120 -37 106 -9 -129 7 93 -31 -112 49
6956 49 98 -66 -73 88 55 -98 -40 100 24 -101 -1 107 -12 -97 39 105 -49 -84 78 83 -92 -48 112 38 -114
6981 -114 -9 106 -20 -127 44 114 -77 -93 84 64 -117 -63 121 26 -148 -4 137 -42 -134 57 126 -79
7003 -79 -96 112 79 -142 -33 144 25 -138 27 149 -55 -123 97 121 -103 -83 137 64 -138 -22 148 -12
7025 -12 -151 36 119 -76 -112 101 86 -120 -65 125 23 -134 7 117 -40 -122 53 108 -86 -72 103 53 -105
7048 -105 -27 104 -1 -105 31 114 -33 -86 71 70 -70 -57 92 37 -95 -22 95 1 -95 26 69 -39 -84 27
7072 27 51 -69 -55 63 26 -85 -45 65 1 -91 -8 73 -20 -74 29 71 -45 -73 70 59 -59 -48 82 19 -73 -12
7098 -12 100 2 -91 39 77 -56 -69 61 46 -82 -52 81 16 -107 -22 84 -33 -106 29 71 -80 -96 76 45
7122 45 -99 -39 107 8 -118 12 105 -34 -95 66 79 -79 -63 102 44 -92 -15 114 0 -106 47 97 -59
7145 -59 -79 68 59 -86 -51 84 -3 -112 10 80 -31 -93 28 50 -88 -72 62 29 -90 -30 72 -11 -84 7 64
7170 64 -47 -48 59 40 -51 -31 57 19 -72 7 68 -12 -49 20 47 -35 -48 37 43 -49 -29 33 6 -52 -30 29 -1 -61 -7 18
7200 18 -37 -53 2 11 -35 -46 22 6 -49 -15 38 1 -37 0 43 -1 -46 23 42 -21 -29 36 39 -42 -29 46 18 -42 -3 49 -15 -62
7232 -62 14 38 -38 -46 41 18 -72 -22 49 -11 -69 0 48 -33 -64 37 27 -53 -40 43 21 -56 -10 52 -10 -57 25 54 -32 -33 41
7263 41 28 -48 -8 60 0 -55 6 47 -29 -43 32 30 -42 -30 39 -11 -51 -11 22 -29 -59 12 22 -48 -30 21 -4 -44 -6 29 1
7294 1 -34 14 25 -19 -14 22 8 -21 1 21 8 -15 15 19 -3 -19 7 8 -5 -3 9 8 -9 -12 -1 -7 -10 -17 -1 -7 -22 -12 -11 -17 -19 -16 -8 -13 -26
7333 -26 2 3 -9 -11 6 -2 -21 -3 22 0 -17 4 24 3 -13 11 22 -6 -13 21 13 -19 -2 15 -6 -22 -6 15 -23 -36 10 7 -35
7366 -35 -22 2 -12 -30 -11 13 -25 -25 2 -1 -32 -12 22 5 -22 -5 21 -11 -24 20 14 -23 8 26 6 -20 3 21 -5 -12 23 2
7398 2 -20 -18 15 -14 -27 2 2 -25 -30 1 1 -29 -18 6 -9 -21 -12 2 -12 -20 3 5 -19 -9 16 -3 -13 14 11 -3 -2 11 10 -12 4 14
7434 14 -7 -17 16 11 -3 -2 1 6 -16 4 8 -14 -20 -10 -12 -15 -25 -4 -14 -18 -4 -3 -7 -17 1 -6 -14 -8 0 2 -9 4 13 -4 1 -6 -2 -2 6 0 12 4
7476 4 -1 0 -2 9 -4 -11 4 -5 -9 -3 -9 -14 -1 -3 -9 -18 -18 -16 -11 -7 -18 -16 -8 -18 8 -3 -24 -2 7 -6 -10 9 17 4 -13 18 21 -16 9 25 3 -15
7518 -15 8 18 -6 -20 12 12 -20 -4 23 -3 -32 -7 12 -19 -30 2 3 -34 -21 15 -1 -34 -10 24 -8 -26 12 19 -25 -11 22 16
7550 16 -15 -4 32 4 -14 13 36 -15 -17 18 22 -28 -10 32 2 -31 4 28 -18 -30 13 3 -44 -25 14 -7 -31 -22 2 -4 -38 -4
7582 -4 11 -27 -20 16 11 -16 -12 19 17 -21 -3 29 1 -13 16 25 -6 -17 24 23 -23 -9 22 7 -20 -16 19 -6 -38 -7 16 -30 -37 -6 8
7617 8 -28 -38 22 4 -39 -18 19 1 -33 -7 28 -8 -45 6 38 -19 -22 46 18 -25 -11 52 6 -49 16 55 -14 -27 37 22 -35
7648 -35 -36 29 16 -54 -12 53 -16 -48 11 41 -57 -61 34 9 -57 -36 37 -7 -59 -2 52 -28 -58 39 35 -40 -30 61 27 -63 7 65
7680 65 -10 -52 26 47 -28 -39 39 43 -50 -32 45 -4 -51 -4 44 -14 -54 13 39 -39 -41 32 24 -42 -33 26 1 -58 -8 45 -15 -44
7712 -44 17 38 -29 -37 38 28 -44 -12 50 9 -37 4 48 -6 -43 27 50 -32 -41 33 29 -47 -41 43 16 -60 -21 51 0 -69 -6 52
7744 52 -30 -62 29 38 -60 -41 54 14 -70 -18 71 -12 -64 18 70 -42 -52 51 49 -62 -23 87 16 -79 16 77 -12 -58 34
7773 34 62 -61 -56 66 24 -91 -21 81 -7 -88 13 74 -50 -70 53 39 -72 -50 79 21 -88 5 80 -6 -69 32
7799 32 66 -41 -48 57 40 -61 -17 67 8 -62 14 64 -12 -58 38 57 -50 -46 51 28 -56 -28 56 -8 -69 -4 52 -25 -55
7828 -55 22 39 -43 -55 33 20 -59 -18 57 7 -46 -2 60 -9 -55 16 41 -32 -48 41 44 -33 -25 61 26 -55 0 64 6 -63 10
7859 10 68 -44 -70 35 35 -66 -49 40 22 -84 -28 67 -28 -77 17 64 -58 -66 59 50 -75 -36 80 30 -86 10 81
7886 81 -18 -70 37 74 -56 -52 77 44 -64 -28 85 -5 -83 13 85 -38 -78 63 54 -75 -50 64 12 -103 -19 74
7912 74 -28 -101 17 64 -52 -78 48 46 -65 -25 72 4 -79 14 82 -10 -59 43 51 -48 -31 58 22 -61 -7 66 3 -71
7940 -71 18 63 -23 -52 21 39 -47 -39 33 9 -52 -23 35 -8 -61 -7 32 -24 -49 9 34 -36 -40 27 29 -30 -26 56 9 -53 5 58
7972 58 4 -44 9 45 -19 -54 42 39 -52 -35 52 23 -71 -9 56 -17 -76 21 51 -52 -59 38 31 -64 -36 50 10 -85 7 57 -27
8003 -27 -81 29 51 -49 -41 69 39 -70 -12 82 8 -75 28 83 -24 -57 58 56 -46 -37 68 23 -68 -1 76 -14 -77
8030 -77 22 61 -43 -56 54 31 -73 -23 52 -9 -73 5 50 -29 -46 31 44 -48 -27 46 16 -49 4 53 7 -38 29 46 -18
8059 -18 -18 47 32 -22 -15 39 9 -44 5 34 -9 -41 0 27 -26 -39 13 8 -36 -33 13 8 -32 -25 19 0 -41 7 34 -19 -32 12 25
8092 25 -9 -25 33 28 -24 1 34 29 -24 10 56 -2 -29 26 41 -23 -29 35 25 -41 -14 48 -1 -38 -2 27 -27 -40 22 32 -35 -40
8124 -40 41 11 -56 -4 56 2 -52 22 39 -27 -37 40 35 -39 -25 54 12 -49 18 60 -21 -36 32 39 -30 -24 50 12 -52 -12 32 -22
8156 -22 -49 7 29 -32 -53 31 13 -52 -10 29 -10 -53 -4 33 -24 -35 36 25 -28 -14 27 7 -28 -12 36 -2 -24 15 43 -15
8186 -15 -16 22 24 -19 -15
8191a5
##END NTUPLES=NMR FID
##END=
