##TITLE=1H_A120
 aceton-d6
 8 sc, 
 17.12.2021
##JCAMPDX= 6.0         $$ Bruker NMR JCAMP-DX V2.0
##DATA TYPE= NMR FID
##DATA CLASS= NTUPLES
##ORIGIN= UXNMR, Bruker Analytische Messtechnik GmbH
##OWNER= root
$$ XWIN-NMR		Version 3.5
$$ Fri Dec 17 11:04:03 2021 Russian Standard Time (UT+4h)  she@DPX200
##.OBSERVE FREQUENCY= 200.131346
##.OBSERVE NUCLEUS= ^1H
##.DELAY= (6, 6)
##.ACQUISITION MODE= SIMULTANEOUS
##.ACQUISITION SCHEME= undefined
##.AVERAGES= 8
##.DIGITISER RES= 18
##SPECTROMETER/DATA SYSTEM= spect
##.PULSE SEQUENCE= zg30
##.SOLVENT NAME= Acetone
##.SHIFT REFERENCE= (INTERNAL, Acetone, 0, 15.7039)
##AUDIT TRAIL= $$ (NUMBER, WHEN, WHO, WHERE, WHAT)
$$ ##TITLE= Audit trail, XWIN-NMR		Version 3.5
$$ ##JCAMPDX= 5.01
$$ ##ORIGIN= Bruker BioSpin GmbH
$$ ##OWNER= she
$$ F:/spectra/data/she/nmr/H-F/1/audita.txt
$$ ##AUDIT TRAIL=  $$ (NUMBER, WHEN, WHO, WHERE, WHAT)
(   1,<2021-12-17 11:02:09.95 +0400>,<she>,<DPX200>,
      <created by zg, POWCHK disabled, PULCHK disabled
       configuration hash MD5:
       00 E9 B6 7A A2 85 ED C7 34 08 36 98 17 FE 4E 26
       data hash MD5: 16K
       F2 04 16 9F 02 F3 3A 80 DC EA A7 83 AC CC 6B 4C>)
$$ ##END=
$$ 
$$ hash MD5
$$ C9 DC 63 64 2E 50 92 AC 24 5B 0E 3C 47 D1 F6 1B
##$RELAX= 
##$RELAX= 
##$RELAX= 
##$RELAX= 
##$RELAX= 
##$RELAX= 
$$ Bruker specific parameters
$$ --------------------------
##$DU= <F:/spectra>
##$EXPNO= 1
##$NAME= <H-F>
##$PROCNO= 1
##$TYPE= <nmr>
##$USER= <she>
##$AMP= (0..31)
100 100 100 100 100 100 100 100 100 100 100 100 100 100 100 100 100 100 
100 100 100 100 100 100 100 100 100 100 100 100 100 100 
##$AQSEQ= 0
##$AQ_mod= 1
##$AUNM= <au_zg>
##$AUTOPOS= <>
##$BF1= 200.13
##$BF2= 200.13
##$BF3= 200.13
##$BF4= 200.13
##$BF5= 200.13
##$BF6= 200.13
##$BF7= 200.13
##$BF8= 200.13
##$BYTORDA= 1
##$CFDGTYP= 0
##$CFRGTYP= 5
##$CHEMSTR= <none>
##$CNST= (0..31)
1 1 145 1 1 1 1 1 1 1 1 1 1 1 1 1 1 1 1 1 1 1 1 1 1 1 1 1 1 1 1 1 
##$CPDPRG= <>
##$CPDPRG1= <>
##$CPDPRG2= <>
##$CPDPRG3= <>
##$CPDPRG4= <mlev>
##$CPDPRG5= <mlev>
##$CPDPRG6= <mlev>
##$CPDPRG7= <mlev>
##$CPDPRG8= <mlev>
##$CPDPRGB= <>
##$CPDPRGT= <>
##$D= (0..31)
0 1.2 0 0 0 0 0 0 0 0.06 0 0.03 0 0 0 0 0.0002 0 0 0 0 0 0 0 0 0 0 0 0 
0 0 0 
##$DATE= 1639724529
##$DBL= (0..7)
120 120 120 120 120 120 120 120 
##$DBP= (0..7)
150 150 150 150 150 150 150 150 
##$DBP07= 0
##$DBPNAM0= <>
##$DBPNAM1= <>
##$DBPNAM2= <>
##$DBPNAM3= <>
##$DBPNAM4= <>
##$DBPNAM5= <>
##$DBPNAM6= <>
##$DBPNAM7= <>
##$DBPOAL= (0..7)
0.5 0.5 0.5 0.5 0.5 0.5 0.5 0.5 
##$DBPOFFS= (0..7)
0 0 0 0 0 0 0 0 
##$DE= 6
##$DECBNUC= <off>
##$DECIM= 32
##$DECNUC= <off>
##$DECSTAT= 4
##$DIGMOD= 1
##$DIGTYP= 9
##$DL= (0..7)
0 120 120 120 120 120 120 120 
##$DP= (0..7)
150 150 150 150 150 150 150 150 
##$DP07= 0
##$DPNAME0= <>
##$DPNAME1= <>
##$DPNAME2= <>
##$DPNAME3= <>
##$DPNAME4= <>
##$DPNAME5= <>
##$DPNAME6= <>
##$DPNAME7= <>
##$DPOAL= (0..7)
0.5 0.5 0.5 0.5 0.5 0.5 0.5 0.5 
##$DPOFFS= (0..7)
0 0 0 0 0 0 0 0 
##$DQDMODE= 0
##$DR= 18
##$DS= 0
##$DSLIST= <SSSSSSSSSSSSSSS>
$$ [...]
##$SUBNAM2= <"">
##$SUBNAM3= <"">
##$SUBNAM4= <"">
##$SUBNAM5= <"">
##$SUBNAM6= <"">
##$SUBNAM7= <"">
##$SUBNAM8= <"">
##$SUBNAM9= <"">
##$SW= 18.0517287032376
##$SWIBOX= (0..15)
0 0 2 0 0 0 0 0 0 0 0 0 0 0 0 0 
##$SW_h= 3612.71676300578
##$TD= 16384
##$TD0= 1
##$TE= 0
##$TE2= 300
##$TE3= 300
##$TEG= 300
##$TL= (0..7)
0 120 120 120 120 120 120 120 
##$TP= (0..7)
150 150 150 150 150 150 150 150 
##$TP07= 0
##$TPNAME0= <>
##$TPNAME1= <>
##$TPNAME2= <>
##$TPNAME3= <>
##$TPNAME4= <>
##$TPNAME5= <>
##$TPNAME6= <>
##$TPNAME7= <>
##$TPOAL= (0..7)
0.5 0.5 0.5 0.5 0.5 0.5 0.5 0.5 
##$TPOFFS= (0..7)
0 0 0 0 0 0 0 0 
##$TUNHIN= 0
##$TUNHOUT= 0
##$TUNXOUT= 0
##$USERA1= <user>
##$USERA2= <user>
##$USERA3= <user>
##$USERA4= <user>
##$USERA5= <user>
##$V9= 5
##$VALIST= <valist>
##$VCLIST= <CCCCCCCCCCCCCCC>
##$VD= 0
##$VDLIST= <DDDDDDDDDDDDDDD>
##$VPLIST= <PPPPPPPPPPPPPPP>
##$VTLIST= <TTTTTTTTTTTTTTT>
##$WBST= 1024
##$WBSW= 4
##$XGAIN= (0..3)
0 0 0 0 
##$XL= 0
##$YL= 0
##$YMAX_a= 155760
##$YMIN_a= -139887
##$ZGOPTNS= <>
##$ZL1= 120
##$ZL2= 120
##$ZL3= 120
##$ZL4= 120
##$ABSF1= 10
##$ABSF2= 0
##$ABSG= 5
##$ABSL= 3
##$ALPHA= 0
##$AQORDER= 0
##$ASSFAC= 0
##$ASSFACI= 0
##$ASSFACX= 0
##$ASSWID= 0
##$AUNMP= <proc_1d>
##$AZFE= 0.1
##$AZFW= 0.1
##$BCFW= 1
##$BC_mod= 2
##$BYTORDP= 1
##$COROFFS= 0
##$CY= 11.3945322036743
##$DATMOD= 1
##$DC= 2
##$DFILT= <>
##$DTYPP= 0
##$F1P= 2.36226072786647
##$F2P= -0.459571619588291
##$FCOR= 0.5
##$FTSIZE= 0
##$FT_mod= 4
##$GAMMA= 1
##$GB= 0.15
##$INTBC= 1
##$INTSCL= 1
##$ISEN= 128
##$LB= 0.24
##$LEV0= 0
##$LPBIN= 0
##$MAXI= 10000
##$MC2= 0
##$MEAN= 0
##$ME_mod= 0
##$MI= 1.114404
##$NCOEF= 0
##$NC_proc= 0
##$NLEV= 6
##$NOISF1= 3.799351
##$NOISF2= 2.8
##$NSP= 1
##$NTH_PI= 0
##$NZP= 0
##$OFFSET= 15.70392
##$PC= 1
##$PHC0= -15948.58
##$PHC1= 9.200789
##$PH_mod= 1
##$PKNL= yes
##$PPARMOD= 0
##$PSCAL= 0
##$PSIGN= 0
##$REVERSE= no
##$SF= 200.130013532006
##$SI= 16384
##$SIGF1= 3
##$SIGF2= 2
##$SINO= 400
##$SIOLD= 16384
##$SREGLST= <1H.CDCl3>
##$SSB= 0
##$STSI= 0
##$STSR= 0
##$SW_p= 3612.71676300578
##$SYMM= 0
##$S_DEV= 0
##$TDeff= 0
##$TDoff= 0
##$TI= <>
##$TILT= no
##$TM1= 0
##$TM2= 0
##$TOPLEV= 0
##$USERP1= <user>
##$USERP2= <user>
##$USERP3= <user>
##$USERP4= <user>
##$USERP5= <user>
##$WDW= 1
##$XDIM= 8192
##$YMAX_p= 0
##$YMIN_p= 0
$$ End of Bruker specific parameters
$$ ---------------------------------
##NTUPLES= NMR FID
##VAR_NAME=  TIME,          FID/REAL,        FID/IMAG
##SYMBOL=    X,             R,               I
##VAR_TYPE=  INDEPENDENT,   DEPENDENT,       DEPENDENT
##VAR_FORM=  AFFN,          ASDF,            ASDF
##VAR_DIM=   8192,          8192,            8192
##UNITS=     SECONDS,       ARBITRARY UNITS, ARBITRARY UNITS
##FACTOR=    0.0002768,     1,               1
##FIRST=     0,             0,               0
##LAST=      2.2672688,     0,               0
##MIN=       0,             -139887,         0
##MAX=       2.2672688,     155760,          0
$$ Real data points
##PAGE= N=1
##DATA TABLE= (X++(R..R)), XYDATA
$$ [...]
2103C28P26j374q02J535P72j811m56J843J82j694j73J777R9k037L38K018q05j744
$$ 328 1054 -320 -1122 413 1185 -626 -1082 761 943 -751 -924 853 952 -1085 -747 1271 466 -1278
2121a278R96J619j195j663J718J429k260q75K463M04k563j00K826l65l092J136
$$ -1278 -282 1337 142 -1521 197 1626 -634 -1509 954 1358 -1205 -1305 1521 1156 -1936 -800
2137h00K964j816k558K189K253k548j986L112J359l517m32L457k90l266Q37L208
$$ -800 2164 348 -2210 -21 2232 -316 -2302 810 2169 -1348 -1780 1677 1387 -1879 -1042 2166
2153B166j571l014K481K360l083j547L301R45l543l57L872n38l874J512L402k119
$$ 2166 595 -2419 62 2422 -661 -2208 1093 2038 -1505 -1862 2010 1472 -2402 -890 2512 393
2169C93k903K507K535l025j979L544J045l626j52L372m37l203J007L096j810k641
$$ 393 -2510 -3 2532 -493 -2472 1072 2117 -1509 -1661 1711 1274 -1929 -922 2174 364 -2277
2185b277K517J863k754j261K851Q59l111k68L267n41k984J120K523j331k283J617
$$ -2277 240 2103 -651 -1912 939 1798 -1313 -1581 1686 1145 -1839 -719 1804 473 -1810 -193
2201a93K060k097j474K317P70k168l51K003R4k050L65J990r55j562J204J174j198
$$ -193 1867 -230 -1704 613 1383 -785 -1136 867 961 -1089 -724 1266 311 -1251 -47 1127 -71
2218g1j059J333R51j647n53J678K04j450j66J386J98j543L2J552l22j288L20J179
$$ -71 -1130 203 1154 -493 -1046 632 836 -614 -780 606 804 -739 -707 845 523 -765 -445 734
2236G34k47j313M43J358q18j091R46Q75r37r21J200Q64j637m58J811L6j775J48
$$ 734 487 -826 -383 975 157 -934 12 887 -50 -971 229 1093 -544 -1002 809 845 -930 -782
2254g82J880l57k123Q79K091j459j710J688J434j840j290K198R29k560k46K557
$$ -782 1098 741 -1382 -503 1588 129 -1581 107 1541 -299 -1589 609 1538 -1022 -1268 1289
2270A289l77k324P50K228j176k157J841J753k400j066K557N70k634k34K911l77
$$ 1289 912 -1412 -662 1566 390 -1767 74 1827 -573 -1639 918 1488 -1146 -1380 1531 1154
2286A154l023J172K694j719k241J971J961k326j603K790Q99k968j02K751m11k562
$$ 1154 -1869 -697 1997 278 -1963 8 1969 -357 -1960 830 1729 -1239 -1341 1410 999 -1563
2302a563Q33K495j465k199K129J537k410r14K426N59k569j19K745n70k574J181
$$ -1563 -730 1765 300 -1899 230 1767 -643 -1557 869 1428 -1141 -1260 1485 915 -1659 -478
2318d78K100j428j746J569J550j930j076K190L90k046Q9J769l14j704O45J636
$$ -478 1622 194 -1552 17 1567 -363 -1439 751 1141 -905 -816 953 639 -1065 -420 1216
2334A216j165j224J424P31j369m98J325M33j503j19J521k90j212L72R75k69r83
$$ 1216 51 -1173 251 982 -387 -885 440 873 -630 -749 772 482 -730 -358 617 348 -635
2351f35L31R96n81o99N76M37l54m82L30N86n56l91O19J62m62k11M61L43p50j63
$$ -635 -304 692 111 -588 -12 425 71 -411 -81 505 -51 -442 177 339 -123 -334 127 470 -280 -443
2371d43R03j34p95J86P69j27j010L43J124p19r27Q59P38q22p84J012P38j345l64
$$ -443 460 326 -469 -283 486 359 -651 -308 816 97 -830 29 767 -55 -839 173 911 -434 -798
2390g98J440o1j277K08J259l63j393Q35J266j290q85J456N74j495m52J734J75
$$ -798 642 581 -696 -488 771 408 -985 -150 1116 -174 -1059 397 971 -524 -976 758 933
2407I33k006L99J908q43j622J006J494j202j426J634J020j917m36J850K9j713
$$ 933 -1073 -674 1234 391 -1231 -225 1269 67 -1359 275 1295 -622 -1058 792 821 -892
2423h92K06J747o09j717J174J332j498q68J536O40j658m15J897n5j924N97J611
$$ -892 -686 1061 452 -1265 -91 1241 -257 -1125 411 1051 -607 -1022 875 820 -1104 -507 1104
2440A104q19j340Q99J264j154j056J465N55j461j29J256k9j207J76J293n79j104
$$ 1104 285 -1055 -156 1108 -46 -1102 363 918 -543 -672 584 555 -652 -476 817 238 -866
2457h66R13P01q97n24Q52N22j018l68J169Mj007J72P57p7p67R2Q60l46o68M45
$$ -866 47 748 -149 -673 179 701 -317 -685 484 488 -519 -347 410 333 -434 -342 518 172 -496 -51
2477e1L93k86l53J94M84l91l67N26J18l81r3K83K43m82j83O78q5n80J36N03k6
$$ -51 342 56 -297 -103 381 -10 -377 149 267 -114 -207 76 319 -163 -346 332 247 -333 -197 306 280
2498B80o75Q8Q76m01p86N86N84n12o46N95P28r23n08J121J46j023pR91o0j164
$$ 280 -395 -307 569 168 -618 -32 552 40 -606 -11 717 -206 -714 407 553 -470 -477 514 454 -710
2518g10L84J205q39r35J054O55j086n70J260M60j569m1J637m13j415N81J292o94
$$ -710 -326 879 40 -895 159 814 -272 -842 418 878 -691 -732 905 492 -923 -342 950 256
2536B56j322J045J121j406o51J450K79j356j03J419j68j510O58J290j022r34J111
$$ 256 -1066 -21 1100 -306 -957 493 772 -584 -687 732 564 -946 -288 1002 -20 -954 157
2553A57P39j201o38J466L25j617J51J459m38j231N09J208p16j145J075P92j217
$$ 157 896 -305 -943 523 848 -769 -618 841 403 -828 -319 889 173 -972 103 895 -322
2570c22l86J085K33j071j02J192k23j136N74Q59o91o42O62O31p97n55J022K16
$$ -322 -708 377 610 -461 -563 629 406 -730 -156 703 12 -630 32 663 -134 -689 333 549
2588E49r80K7P67k2p38M3Q24k71p00M61M10l77k92K67L71l90l02N25N6m03J9K66
$$ 549 -431 -404 363 341 -397 -354 470 199 -501 -40 370 -7 -299 -32 339 -51 -353 172 228 -175 -156 110
2610A10Q2l27j09M99p8m51J72L15n6l89J2N90k09n85L68M27l23m33L00N68n09
$$ 110 192 -135 -244 255 177 -274 -102 213 157 -232 -220 370 161 -424 -56 371 48 -385 -85 483 -26
2631b6n06P32K34o95j07O24J39p67lR20l51p96N69N84n82n57O73N72r46l52J106
$$ -26 -532 200 434 -261 -368 256 395 -372 -375 545 194 -602 -33 551 -31 -588 85 657 -289 -641 465
2652D65J6j000J30R27j61j026L94J015p20p54Q58M77q18l99Q90L02j103M1J100
$$ 465 481 -519 -389 538 377 -649 -255 760 40 -714 144 621 -197 -596 294 596 -507 -466 634
2671F34l99q75M99P66n55p91P99O68j056l40J066P7r33l6R81q2j072L99R38o41
$$ 634 235 -640 -141 625 70 -721 78 746 -310 -650 416 493 -440 -476 505 423 -649 -250 688 47
2691D7o50O40N17o30n02Q09L14r41L0Q00j76o50J65O92k86p16N18N40o26l10N21
$$ 47 -603 37 554 -76 -578 231 545 -396 -366 434 258 -392 -227 465 179 -537 -19 521 -105 -415 106
2712A06K81n05l16O47J64o82N8N20r9m06J2N08j24n24L03L69l37k20K29L04k80
$$ 106 387 -118 -434 213 377 -305 -247 273 174 -232 -220 288 164 -360 -57 312 -25 -245 -16 288 8
2733Hl71M87K06n29n1M30R3m66j32O45k9o98K40N69k66n05K21O18l91o09O16L81
$$ 8 -363 124 330 -199 -250 180 273 -193 -325 320 291 -407 -167 402 136 -369 -148 470 79 -530 86 467
2755D67o39k34N86K30o81j64Q52r8q31L33O68l70o37M35O97o70n90Q98L09q99
$$ 467 -172 -406 180 410 -271 -435 417 319 -512 -179 489 119 -518 -83 614 -56 -646 252 561 -338
2775c38j21Q30J01r38M9J046l74r15N73P11o09o34O97N99r39l55J076K2r99J51
$$ -338 -459 371 472 -466 -417 629 255 -660 -87 624 15 -619 78 677 -262 -617 459 481 -518 -367
2795c67R16k36r55M32R60p52p19Q76M96q75m03R29L22j104k9J104k82r01L81P91
$$ -367 549 313 -642 -210 750 -2 -721 155 651 -224 -627 302 624 -480 -509 595 313 -588 -207 584
2815E84m26q13O33P09q69m13Q92J95q04j39Q56L6r74K31R00m50o89M80O03n11
$$ 584 158 -655 -22 687 -182 -595 297 492 -312 -451 405 441 -533 -302 598 148 -541 -61 542 31
2835C1o30P04M89q53k09P76P3o99n8P60n7q28L23O86m53n26M36M99m77n20O77
$$ 31 -599 105 594 -259 -468 308 381 -318 -376 384 327 -501 -178 508 55 -471 -35 464 -13 -533 144
2856A44L61p80j34P08N3o55o3P71q8q12L18O74m07n33L75N45m57n51O75L53p34
$$ 144 505 -275 -409 299 352 -303 -366 405 317 -495 -177 497 90 -443 -68 477 20 -531 144 497 -237
2877b37j52O51J20o89q0Q07j12q31L66O61m48n56M45O11o13n42Q21L09q60j12
$$ -237 -389 262 382 -307 -387 420 308 -523 -157 504 56 -500 -55 556 -57 -599 222 531 -329 -441
2897d41P80Q0q30RR45k68q87N21O89n72o02O31N96q37m35J001J48r69L5R02j12
$$ -441 339 419 -411 -402 543 275 -612 -91 598 26 -576 55 651 -186 -621 380 528 -441 -406 496 384
2918C84r62K86R88n61q53P58O23p87n14Q27M75j023k27J097p3r97K25R18l19r18
$$ 384 -578 -292 696 135 -718 40 663 -124 -638 189 664 -359 -586 511 438 -559 -334 584 265 -653
2938f53M93Q97p86o52R04M25q99l14R54K15j093N5J103l52r35M72Q08n26q05P17
$$ -653 -160 737 -49 -701 203 628 -271 -585 369 584 -509 -454 649 297 -638 -166 642 116 -689 28
2958B8P06r46m34R86K05r17j19R46nj049K85R67n25p67O05O36o21o33P97M92r60
$$ 28 734 -212 -646 340 545 -372 -491 455 450 -599 -314 653 128 -639 -34 602 -19 -652 145 637 -323
2979c23k15R32N1q71J5R00j38r50M05Q22n81n95N78N33o28n12Q04L27q98p7Q32
$$ -323 -538 394 445 -426 -411 489 351 -599 -194 628 47 -548 30 563 -65 -577 227 554 -344 -421 411
3000D11n2p67R3Q19k42q52M80O96n86n44N84N04o73m51Q33K72r06l4Q10m1p83
$$ 411 359 -408 -315 504 262 -590 -110 586 0 -544 40 544 -129 -580 253 525 -381 -415 395 354 -429
3021d29Q8Q71k88q48N21O78o39m98O27N08p63m17R33J77r54L8Q68j08q78K02R45
$$ -429 -341 530 242 -606 -85 593 -46 -544 83 591 -172 -589 344 521 -433 -395 473 365 -513 -311 634
3042F34m39q79O55O83p27n41P60M77q94l44J059N3j044J70R32k64r36M28R50o97
$$ 634 195 -684 -29 654 -73 -614 146 623 -271 -615 444 497 -547 -377 555 291 -645 -217 733 36
3062C6p93Q96N49r29m10R68L23j102j04J189k12j076L99R52m96r11O75Q33r29
$$ 36 -757 139 688 -241 -651 317 640 -462 -566 623 411 -665 -266 686 190 -721 -46 787 -142
3081a42n94J054L20j035j59J048K4j142K41J118n32r42O83P71p55o98R17N50j077
$$ -142 -736 318 638 -397 -556 492 516 -626 -385 733 201 -741 -58 713 -42 -740 177 727 -350
3100c50k91J105L2j016R8R91k26j023M82R21p03o85P68N34q13m39R27K81j041
$$ -350 -641 464 496 -520 -422 569 343 -680 -198 723 20 -665 103 637 -176 -615 312 593 -448
3119d48pJ002k02q90K91Q56m04q66O25P19p74n00P60L87p80l36R02J55r44R5Q50
$$ -448 -455 547 345 -545 -254 602 198 -668 -43 676 -98 -598 162 549 -231 -567 335 490 -454 -359 491
3140D91k34p56K84P52m04p42O32N67p38l82P20L18p72k41Q73R0r41J55Q38k49
$$ 491 257 -499 -215 537 133 -609 23 590 -148 -530 190 508 -264 -505 368 458 -483 -328 510 261
3160B61p69L04Q00m62p64O63N75p41m06P40L35q20k42R63Rr82K30Q73l51q31M53
$$ 261 -508 -204 596 134 -630 33 608 -133 -539 201 536 -284 -526 437 446 -536 -306 567 216 -615 -162
3181a62Q54o65p60Q73N43r56l54R68K74j066r6J164k07j091M39R45n55q51O78
$$ -162 692 27 -733 140 683 -273 -627 341 615 -451 -547 617 410 -681 -242 703 148 -703 -25
3200b5P95r04o03J069L22j092j03J075l5j130K58J156n77j003P75P96q70o71R77
$$ -25 770 -134 -737 332 654 -438 -541 534 499 -631 -373 783 206 -797 -22 774 -96 -767 210
3219B10N39j142k84J221k2j131K06J055l52j040N78R39q31p01R66M67r74l23J043
$$ 210 749 -393 -677 544 522 -609 -403 652 300 -740 -162 777 -54 -755 211 678 -296 -619 424
3238D24J52j139J25J110l84r62N14Q43o03q00P90O50r51l97R67J84r08p6R22o8
$$ 424 576 -563 -438 672 288 -674 -160 683 80 -720 70 720 -231 -628 339 523 -385 -461 461 393
3258C93r56L05Q57m99o58N36N66o16n19P74L59q60j43Q27Lp59L4Q24j87q15L66
$$ 393 -563 -258 599 100 -558 -22 544 -72 -591 183 542 -318 -461 366 369 -390 -356 468 281 -534 -168
3279a68P14m82n74M96N35n55n02P00L32p53j66P23O1o92j0P81j60p82L56O73m64
$$ -168 546 64 -510 -14 521 -34 -536 164 496 -257 -423 300 361 -331 -341 440 280 -502 -146 527 63
3300F3n93N31N63o44n06Q00L36q91j38Q56M6q63N5R23k63r03M80P52n91o05O56
$$ 63 -530 1 564 -80 -586 214 550 -341 -479 377 423 -440 -385 538 275 -628 -148 604 13 -592 64
3321F4N57q02m20R64J60r84O1R33j86r36L46R44n87q33P89O37q78m86R28L73j059
$$ 64 621 -181 -601 363 523 -461 -400 533 347 -589 -243 701 114 -719 70 707 -171 -657 271 644 -415
3342d15j63J129j29j053L43R25m63q66O37P72q44n67R83L06r90j22R94j9j049
$$ -415 -578 551 422 -631 -288 637 174 -692 -55 717 -127 -694 289 595 -395 -517 477 458 -591
3361e91K67J009n12q68O66P00p28n98Q29M83r71k43R93j0r06J46Q51k52q40M63
$$ -591 -324 685 173 -695 -29 671 -57 -655 174 657 -314 -557 436 426 -480 -334 517 265 -575 -112
3381a12P06o40n13P00L62p12k84P99J39q59O7Q15k38p05K87O63l64o34N09N29
$$ -112 594 -46 -559 141 503 -209 -493 306 445 -414 -347 468 230 -475 -188 475 111 -523 -14 515
3401E15o02l75O06K63n86k25O63R5o82P5O25j88n40K22N26k96n40M50M44n43l14
$$ 515 -87 -462 144 407 -179 -404 259 354 -328 -253 372 184 -356 -134 392 96 -444 6 450 -93 -407
3422d07N49K52n66k30O61J13p18L3O86j45o07J66O40k86o27M52N08n54l61N78
$$ -407 142 394 -172 -402 259 372 -346 -313 373 228 -379 -213 427 141 -486 -34 474 -80 -441 137
3442A37K98o43k20P58L3p96J72P36k72p09L89O99n51o44P45M66q11l15Q41J96
$$ 137 435 -208 -428 330 363 -433 -261 475 203 -506 -117 582 31 -613 132 598 -213 -528 313 509
3462E09r06n3R56j65r21L77P80n00o75O23N91p90m35R34J75r35J7R06j57r12L27
$$ 509 -397 -450 506 341 -580 -203 577 77 -598 25 616 -174 -609 325 500 -435 -418 488 331 -581 -254
3483b54R14n66p70P26N89p84m48Q43L26r37j19R71j34q76K99P67l98p12N41O16
$$ -254 660 94 -676 50 639 -145 -593 250 576 -361 -480 491 357 -519 -220 547 149 -563 -22 594
3503E94p18m14Q06K06q02q4P94k3q38K07Q10m17o61M97N40n15n01O14L93p10k12
$$ 594 -124 -538 268 474 -328 -412 382 359 -479 -272 538 121 -540 -43 497 -18 -519 95 488 -222 -434
3524d34P07N8o38L1O13j17o13K67N45m02l97M23L23m45k92N23K08n85p0N75m1
$$ -434 273 331 -307 -276 337 220 -393 -126 419 17 -380 43 366 -79 -371 152 360 -225 -295 280 239
3545B39n10M3N29j13n38K28M75l08l94L20L62l56l35M39K53n12j24N00L9m87M
$$ 239 -271 -228 301 188 -350 -122 353 45 -349 -29 333 -23 -358 81 334 -178 -302 198 237 -250 -246
3566b46N48j01n86K73N22l85m37M16M38n02l95O26K64o98r9O81No72P1P12k33
$$ -246 302 201 -385 -112 410 25 -412 4 442 -60 -455 171 435 -263 -362 319 324 -348 -277 435 202
3587B02o92M27N37n13m20N61L41o60k24P69K6p80J65P20k71o98L93O63n64n60
$$ 202 -490 -63 474 -39 -459 102 443 -217 -441 328 354 -426 -261 459 188 -510 -117 546 -18 -578
3607e78P15L80p43k48P67J33q03K8Q19k27p42L93O07m89n06N81M24p14k59P87
$$ -578 137 517 -226 -474 293 426 -377 -349 470 243 -499 -106 501 12 -494 87 511 -203 -462 325
3627C25M9p62J03P14j97p14L44O63n13n24N93L77o03k82O26J90o76l8O87j62n75
$$ 325 374 -388 -285 429 232 -482 -138 525 12 -512 81 458 -145 -427 199 389 -287 -325 362 200 -375
3648c75K50M93l10m46M02L69m98k23N30R0m90l9M97j9n30J34M98k44l84K45L41
$$ -375 -125 368 58 -388 14 383 -115 -338 192 282 -208 -247 250 231 -299 -165 333 89 -295 -50 291
3669B91k48l41L08L03l85j79L57J06l20j12L71M2l98N8L65j32l06J38L12j79l32
$$ 291 43 -298 10 313 -72 -251 106 212 -108 -220 151 193 -205 -147 218 86 -220 -82 230 51 -281
3690b81K81K94l60k11L64J75l75j62M41R6m91J6M70r6m11J21M23k00m28L35L35
$$ -281 0 294 -66 -277 87 262 -113 -275 166 262 -229 -213 257 161 -250 -129 294 94 -334 1 336
3711C36m05k16M14J63m71j07N51l3n71J88N18k92m65L42M53m56l82N70K53o19
$$ 336 -69 -285 129 292 -179 -286 265 232 -339 -151 367 75 -390 -48 405 -51 -433 137 390 -229
3731b29j21O01L7n92N5O29k26n86L83M66m61l34M99K52n79j38O50l4o37J88N58
$$ -229 -350 251 288 -304 -249 380 154 -432 -49 417 -44 -378 121 373 -206 -344 306 272 -365 -177 381
3752C81k56n19L37M96m80l84N72K22n64j16N34N5n62O3N54k33m58L32L33l37k81
$$ 381 125 -394 -57 439 -41 -425 147 369 -195 -311 223 278 -284 -221 333 100 -358 -26 307 -30 -311
3773c11L93K19m86q1M99l7m55J10M13j43m19K30L89l28k84L41J89k97j63L32J17
$$ -311 82 301 -185 -266 233 196 -259 -149 264 121 -298 -68 321 -7 -291 50 239 -58 -221 111 228
3794B28l74j4L39p1k78R1K46j02k61J79K20k45j33K33P9k03r7K49P8l03OK80m2
$$ 228 -146 -160 179 108 -170 -79 167 65 -196 -17 203 -42 -175 58 137 -66 -163 86 164 -139 -133 147 105
3817A05k43L7K45n1k71J10K47j62j79J76J40j60j67K40J03k72j9K63m0k39M9K65
$$ 105 -138 -101 144 93 -178 -68 179 17 -162 14 154 -6 -173 67 170 -102 -121 142 102 -137 -88 177
3839A77r9l07K08K64k78j87K75J75l20j62L90P4m21M2L73j01l31J29L41k06l17
$$ 177 78 -229 -21 243 -35 -222 53 228 -92 -254 136 210 -211 -169 204 103 -228 -99 242 36 -281
3860b81L29J97l61p7L43L9l74NM27j23l99K33L29k88k66L12K40l78j72M41L6m21
$$ -281 48 245 -116 -193 150 189 -185 -180 247 124 -275 -42 287 -1 -267 45 285 -93 -265 176 212 -209
3882b09P0L38q0l44J48L26k52k62L40J38l42n7L14L6l61M1M00j86l14K42K34k36
$$ -209 -139 199 119 -225 -77 249 -3 -265 75 213 -129 -186 128 164 -197 -156 244 58 -256 -14 220 -16
3904a6k11K65J89l30r9L51j4k90O7K24m7k60J30K34k27j17K27M3j95l6K02K8k62
$$ -16 -227 38 227 -103 -202 149 135 -155 -88 136 89 -171 -41 193 -34 -151 76 119 -76 -112 90 118 -144
3927a44P5K14j19j54J09J36j17j43J48J37k08l6J37K4j06l9J23K7j48N5J01p8
$$ -144 -69 145 26 -128 -19 117 0 -143 5 142 -66 -102 35 59 -47 -86 37 64 -84 -29 72 -6
3949fm8M3O3m1q8R3P6j48j0J18Rq7o0J47M3j89K2J50l2j29PJ59l6j85J08J42j46
$$ -6 -54 -11 52 11 -77 16 92 -56 -66 52 61 -26 -86 61 104 -85 -63 87 55 -74 -67 92 56 -129 -21 121 -25
3976b5o2R9O0j01q6J79J8k02O9J72j09j29J05J54j45j66K33Q5k46j6K08J9k09
$$ -25 -87 12 72 -29 -115 64 82 -120 -51 121 12 -117 -12 142 -3 -169 64 149 -97 -113 95 114 -95
3999i5qK54p8k40J61J60j71j07J46J20k09p0K73m6k36Q9J97j12j93J37K20k33
$$ -95 -103 151 73 -167 -6 154 -17 -124 22 142 -67 -137 136 90 -146 -57 140 28 -165 -28 192 -41
4021d1j55K90N5k61j7K27J9k58N3K66j48j94J88J10j61j01J84P3k31OK54j07j81
$$ -41 -196 94 149 -112 -129 98 117 -141 -88 178 30 -164 24 134 -27 -128 56 129 -102 -96 158 51 -130
4044a30J13J53j10j84J67J60k21r1K29Rj66l2J83Rk25P4J84j30r2R7P3r0q9J51
$$ -130 -17 136 26 -158 9 169 -52 -143 86 95 -71 -103 80 89 -136 -62 122 -8 -100 -3 70 -20 -109 42
4068D2N9j75J0J49m4j16K9J41m4j70J04J36j30p5J02P3p5j10J26Q4j70j1J13l
$$ 42 101 -74 -64 85 41 -75 -46 95 51 -119 -15 121 -9 -84 18 91 16 -94 32 116 -54 -65 48 45
4092D5p8k6J24j3j57R2R7j01o2Q1P9j08j04J79N8k13L2J56k1j48j1K27o2k35J53
$$ 45 -33 -59 65 52 -105 -13 84 -17 -79 2 81 -27 -131 48 106 -107 -75 81 60 -88 -99 128 66 -169 -16
4117a6J55j50j07J27J26j64j17K47K1k45N9J88o1j98R6K32j92j89K52J00k60o0
$$ -16 139 -11 -118 9 135 -29 -146 101 122 -123 -64 124 63 -135 -39 193 1 -188 64 164 -96 -156
4139a56K42O6k87mL20j02k85J58K22j70j84J74K06k82j09L21pk62L9K58p0k80
$$ -156 86 152 -135 -139 181 79 -206 -48 174 4 -180 -6 200 -82 -191 130 123 -139 -100 158 88 -192
4161a92J46K72k52j78K78J18k55j14K73J05l52J1L44j17k60J30K18j32k41J97
$$ -192 -46 226 -26 -204 74 192 -63 -177 96 201 -151 -140 204 87 -173 -43 175 43 -198 -1
4181aK04k92p5K66J1k19k0K45k9k80J31K44k05j54J78J45j69j57K42J16k92j3
$$ -1 203 -89 -164 102 113 -106 -126 119 90 -190 -59 185 -20 -174 4 149 -20 -177 65 181 -111 -124
4203a24K41j3j96j4K40k9k60J26J91j72j03J28J15j52j21K15P1k69M1J94l5j89
$$ -124 117 104 -92 -106 134 105 -155 -29 162 -10 -113 15 130 -22 -143 72 143 -126 -85 109 74 -115
4225a15K5K42q3k69J74K04j96j45J53J79j99j68K80Q1l05J9K45l2k37M5L05j46
$$ -115 -90 152 69 -200 -26 178 -18 -163 -10 169 -30 -198 82 163 -142 -123 122 90 -147 -102 203 57
4247E7k67K34J84k57j28K50J28l07r0L79k8l60J03L11j36k91J61L17k78k46L33
$$ 57 -210 24 208 -49 -177 73 201 -106 -196 183 155 -205 -102 209 73 -218 -57 260 -18 -264 69
4268F9J42l38p0L18N4l70L2L97j59l31K32K62k53k36K93K22l78j23M17jl74M8
$$ 69 211 -127 -197 121 175 -195 -163 234 75 -256 -24 238 -15 -251 42 264 -114 -237 180 179 -195 -147
4290a47L56o6l84J68L56k70k69L12J65k78j57L14J28m06K0L70j13l15J45K82j63
$$ -147 209 143 -241 -73 283 13 -256 56 221 -57 -214 100 228 -178 -158 212 99 -216 -71 211 48
4311D8k95K45K45l36j27L11Q4k87p4L32J2l50Q3L13j59k26J43K22j47k47K52J78
$$ 48 -247 -2 243 -93 -220 91 175 -112 -186 146 158 -192 -109 204 45 -181 -38 184 37 -210 42 220
4333B20l06o5K58L8k52m3L00ml28R7K84j63k23J47K43j87k51K62J87l07r4K69
$$ 220 -86 -151 107 145 -107 -150 150 146 -182 -85 199 36 -187 -40 203 16 -235 27 214 -93 -187 82
4355H2Q2k86o6L46j9l52J15K95j51k42J51K73k32k50L38J39l55o0L30N0l56j6
$$ 82 164 -122 -188 158 139 -213 -98 197 46 -196 -45 228 -4 -254 84 223 -132 -192 138 188 -168 -184
4377a84M38j16m07K16L33k49k89K61K88l55k29M44J00m46J0L97m9m18J19M41k53
$$ -184 254 138 -269 -53 280 31 -258 3 291 -64 -293 151 251 -195 -185 212 163 -255 -136 305 52
4398E2l84L54K60l64k13L96J89m84r0N40p9m60J59L96j78m05K69L83l87k74M50
$$ 52 -332 22 282 -82 -295 101 290 -194 -284 256 177 -283 -124 272 94 -311 -42 341 -46 -320 130
4419A30J42m14r1M21M7m81Q0M61k15l71K65L05k81k96L59K40m45j20M46ql76J8
$$ 130 272 -142 -233 188 235 -246 -166 295 80 -291 -26 279 -2 -298 61 301 -144 -264 182 174 -202 -184
4441a84L96n6m25J64L93k72k80K92K09k72k16L48J53m09l2L84m2l35N8L37q7l83
$$ -184 212 156 -269 -105 288 16 -264 28 237 -35 -251 97 250 -159 -191 193 151 -184 -126 211 124 -259
4463b59K16L15k91k05K41K18k73k12L60J30l90m1L72m7l11K3L53q4l84K12L07
$$ -259 -43 272 -19 -224 17 235 -38 -250 110 240 -150 -191 181 134 -177 -154 199 115 -269 -57 250
4484B50k65k28K63K16l00k05L99J12m34J1L94m7l96Q1M39j88m18L02L40l54k61
$$ 250 -15 -243 20 236 -64 -269 130 242 -192 -181 213 166 -230 -149 290 102 -316 -14 326 -28 -289
4505b89L50K53m38j81N30K0n23J18M52j57m43K03M63l54l92M64K62m86j66M98
$$ -289 61 314 -124 -305 225 245 -278 -160 292 135 -308 -105 358 4 -388 76 338 -148 -314 184
4525A84J03n49j2O04j52n49K72M54l15l97L64L75m75k80N78R5n40ON02n5n26J66
$$ 184 287 -262 -274 330 178 -371 -99 355 40 -357 7 382 -93 -373 205 300 -240 -234 268 213 -313 -147
4547a47N32l35m14L99L10m13k64M64J91n34o8N52q1m81J38M46j84m62L04L95l97
$$ -147 385 50 -364 35 345 -68 -332 132 323 -211 -279 273 192 -289 -151 295 111 -351 -47 348 -49
4568d9k86M45J52l93j39M32Q3m88N4M61j62l72J87L39k01l42K96K94m03j46L60
$$ -49 -335 110 262 -131 -270 162 245 -243 -189 272 110 -262 -75 264 63 -279 17 311 -92 -238 122
4589A22J04l41j00L86L5m25Q6L71j44l17J44L04j67l41K80K61l37j47L24J18l36
$$ 122 226 -115 -215 171 206 -219 -133 238 94 -223 -79 225 58 -283 -3 258 -79 -226 98 216 -120
4610a20j19M07L4m43Q3L99j38l61J61L89k46l80L65K93m22j82M24J38m38j11N07
$$ -120 -239 168 202 -241 -158 241 103 -258 -97 292 46 -334 31 324 -98 -280 144 282 -156 -267 240
4631B40j1n31J62M65k29m26K81M10l86l54N06K13n36j10N26M3n58M5O01k02n52
$$ 240 229 -302 -140 325 96 -330 -49 361 -25 -379 127 340 -196 -306 220 263 -295 -250 351 149 -403
4652d03L25M50l67l93M33L41n40k34O20P1o05P1N45j10n67K36N58m06m49N07L01
$$ -403 -78 372 5 -388 45 386 -154 -388 232 303 -302 -231 314 204 -363 -127 431 25 -424 83 384
4673C84n15k20N44J56o29k5O52j43n80K57M74k90m58L84M00n05k66N48J23n05
$$ 384 -131 -351 193 349 -280 -305 347 204 -376 -119 355 65 -393 -9 391 -114 -380 168 291 -214
4693b14n8N04on43J43N07k54m13L13L31l25l06L89K52m71j13M62J6m10MM34n9
$$ -214 -272 232 226 -317 -174 333 79 -334 -21 310 -15 -321 68 320 -151 -264 198 214 -196 -192 242 183
4715A83m66J81M02k73k90K56K73k93k63L62J98m23q2M01J1l64j0M14n7m44J84
$$ 183 -283 -102 300 27 -263 -7 266 -27 -290 72 270 -153 -235 166 177 -187 -197 217 160 -284 -100
4736a00L80k50l16K73K97l12k82L89K19m57r9M44L8m36rM89q6n08K35M33l10l45
$$ -100 280 30 -286 -13 284 -28 -310 79 298 -159 -258 186 224 -212 -221 268 182 -326 -91 342 32 -313
4758c13L31L26m13k79N03J65n50l2N22m7n17J05N57k51n14L82M21m67l17M88K76
$$ -313 18 344 -69 -348 155 320 -230 -262 260 213 -304 -199 358 107 -407 -25 396 -71 -388 100 376
4779C76n76j70O55J0o50J49N76k24n39L02N45m62m37N69K80n99j52O01P8o38M9
$$ 376 -200 -370 285 295 -355 -206 370 146 -393 -91 454 -8 -445 124 404 -195 -347 254 332 -306 -257
4800b57O55k21n85L43M64l82m27M61L58n55k44O27N8n78L2N50r5n74K29N35l74
$$ -257 398 177 -408 -65 399 17 -410 51 409 -146 -390 237 295 -283 -251 299 204 -370 -141 394 20
4821B0l97M12L06m33k50M85J70n41l8N39q2m75J52M37k03m33L04L68l76k62L91
$$ 20 -377 35 341 -92 -342 143 313 -228 -266 273 191 -284 -132 305 102 -331 -27 341 -35 -297 94
4842I4J80l91j43M28Q0m63L1M24j15l68J29L66j75l64K64K99l18k22L37J53l28
$$ 94 274 -117 -260 168 248 -215 -184 240 125 -243 -114 252 77 -287 -23 276 -42 -264 73 226 -102
4863a02j49L83Q3m25L4L91o7l71J01L77j65l79K72L20l34k34L41K11l85j65M36
$$ -102 -251 132 215 -210 -176 215 148 -223 -122 255 90 -289 -17 303 -31 -265 76 287 -98 -263 173
4884A73Q8m96N9M67j41m23J49M59k75m29L99L21m45k35M65J91n25j06N92m2n97
$$ 173 261 -235 -176 291 150 -273 -124 335 60 -369 30 351 -94 -329 136 327 -198 -304 288 246 -351
4905c51J89N24k62m65L30M47m51l67N51K32n82r8N63L5n99O8O19k45n49L65M65
$$ -351 -162 362 100 -365 -35 412 -39 -406 145 377 -205 -303 260 295 -304 -236 383 138 -411 -46 419
4926D19m27l77M70L18n60k16O34M2o15P5N67j51n54K53N30l94m24M74K94m95k09
$$ 419 -8 -385 85 403 -157 -373 261 303 -312 -237 330 179 -375 -122 408 14 -410 64 358 -137 -346
4947c46N24J35n78jN78j39n21K29M56k66m33L66L63m55k35M70J30m50o9M60J6
$$ -346 178 313 -265 -266 312 173 -348 -119 337 71 -362 4 367 -88 -323 147 277 -173 -242 218 234
4968B34m92R7M58k12l65K36L16k54l05L25K48l95j46L83P1l60n2L86Jm03Q2L89
$$ 234 -258 -161 297 85 -280 -44 272 18 -287 38 286 -109 -255 128 199 -161 -213 173 174 -229 -147 242
4990B42j59l31J88L12k22l04K99K51l60j63L67J17l60j14M22L9m70R0M33j81l77
$$ 242 83 -248 -60 252 30 -274 25 276 -84 -247 120 237 -123 -237 185 224 -246 -156 277 96 -281
5011b81K15L71k71l73L90K92m62j78M73J10m84o7N44o5n40J81M87k80m24L35L95
$$ -281 -66 305 34 -339 51 343 -119 -297 176 286 -198 -265 279 214 -326 -145 342 62 -362 -27 368
5032C68m14l40N15K24n78q7N84j3n69R4N99k37n54L79M39m36l58M91K97n74j89
$$ 368 -46 -386 129 353 -225 -312 272 259 -310 -216 383 146 -408 -29 410 -26 -384 107 404 -170 -359
5053c59O45J5o26J16N74k05n55L05N12m24m28N29K75n59j66N66Q7o10M9O15j86
$$ -359 286 301 -325 -209 365 160 -395 -90 422 -2 -430 99 374 -185 -351 215 302 -308 -259 356 170
5074A70n64L09M55l41m03M01L51n03k14N36R1n11mN01p4m99J67M78k81l77L30
$$ 170 -394 -85 370 29 -374 27 378 -125 -339 197 288 -223 -227 274 200 -299 -132 346 65 -312 18
5095A8K78l39k52L98J84m48q7M48k7l85N2L87j00l92J83L52k55k82K94K09k92
$$ 18 296 -43 -295 103 287 -161 -248 200 173 -212 -160 227 127 -265 -82 270 15 -267 27 236 -56
5116e6j91L35J56l91n9L83k5l30L5L56p3l81J69L23k25k69K59K29k63k31L37J69
$$ -56 -247 88 244 -147 -206 177 152 -178 -143 213 140 -241 -72 251 26 -243 16 245 -18 -249 88 257
5138B57l95q1L91J5l77L4L93r3m36K09L70k77l13L18K74l73k30M40J47m87l1M75
$$ 257 -138 -219 172 187 -190 -156 237 144 -292 -83 287 10 -303 15 289 -84 -314 126 273 -214 -245 230
5160B30n5m52J23M73k21m50L45L63m17k64M44K13m99j37N67j2n57J34N03k12m65
$$ 230 175 -277 -154 319 98 -352 -7 356 -61 -325 119 332 -167 -304 263 251 -306 -172 331 119 -346
5181c46K76M52m11l36M74K34n32j15N26L4n31M5N47j91m90L11L91l39l39L83K93
$$ -346 -70 382 -29 -365 109 343 -189 -304 222 256 -275 -230 317 126 -364 -53 338 -1 -340 43 336
5202C36m66j71N00N8m97M1M44p8m47J82M15k81l31L33K42l43j98L78J35m23m1
$$ 336 -130 -301 199 257 -240 -199 245 167 -280 -98 317 36 -295 38 280 -63 -261 117 252 -171 -212
5223b12M31p2l87J39L38j56l36K10L01k90k14L07J38k78j28L14P8l41pL29n3k94
$$ -212 219 147 -240 -101 237 81 -255 -45 256 -34 -248 59 197 -81 -209 105 183 -158 -165 164 111 -183
5245a83R3K63r7k83J61K44k11j84K33J54k39j35K69J03l04m4L12j8k90L1L01p1
$$ -183 -90 173 76 -207 -46 198 -13 -197 36 190 -49 -184 85 188 -116 -160 152 134 -156 -125 176 105
5267A05l12J37K96k09k45K42K00k67j80L19J30l81k0L69m7l45Q4L56j54l50K39
$$ 105 -207 -70 226 17 -228 14 214 -53 -233 86 216 -165 -185 184 137 -208 -124 232 78 -272 -33
5288c3L19l27k25L52J66l67j35M36N2m73P5M32j53l91K01L85k95l25L70K38m24
$$ -33 286 -41 -266 86 252 -115 -250 186 238 -235 -160 272 119 -272 -71 314 19 -306 64 302 -122
5309a22j35M24O8m48J3M54j08m48K22L78k79l16L13K93m00k11M52J01m62J1M21
$$ -122 -257 167 235 -213 -200 254 146 -302 -80 298 19 -297 16 309 -91 -302 150 251 -211 -200 221
5330B21n3m30J49M08k34l54L15K61l41j82L53J40m05n7M22n9l80J29L30j47l21
$$ 221 168 -262 -113 295 61 -293 22 283 -58 -240 113 253 -152 -209 213 154 -226 -97 233 86 -235
5351b35K08K81k78k25L24J32l06r0K98O3l24LL24q5k90J24K53j40k31J80K04k22
$$ -235 -27 254 -24 -249 75 207 -99 -189 109 172 -152 -149 175 90 -200 -76 177 37 -194 -14 190 -32
5373c2j48K52Q8k30q4K62N0k75NK92p8k53J06K18j09k40J52K23k09j63K31J13
$$ -32 -180 72 160 -70 -154 108 158 -117 -112 180 102 -151 -45 173 64 -176 -24 199 -10 -173 58 171
5395A71k38j11K69Q3l22J2L04p9k67J06K56j42k62K17K27k75j56K87J24l02q6
$$ 171 -67 -178 91 174 -148 -136 168 89 -178 -72 184 42 -220 -3 224 -51 -207 80 204 -98 -184
5416a84L34L0l65N7L42j32k93J58K88k21k66L00J95l47j03L48M7l51LL70q5l69
$$ -184 150 180 -185 -128 214 82 -211 -53 235 14 -252 48 243 -104 -207 141 188 -163 -160 210 125 -244
5438b44J86L19k54k51K71K14l16j71L68R1m02J5L68o4l44J13L43k09k89K71K32
$$ -244 -58 261 7 -244 27 241 -75 -246 122 213 -189 -174 194 130 -214 -101 242 33 -256 15 247
5459B47l14j49L21J07l43m6L62l6l61J22K98j56k68K01K36k40j99L02J00k95m7
$$ 247 -67 -216 105 212 -131 -177 185 149 -212 -90 208 52 -216 -15 221 -19 -218 84 184 -111 -158
5480a58K68L5k92K5K86j01k45J52J86j60j67J82J48k25q8K51K2k23JK07kk22N0
$$ -158 110 145 -147 -122 164 63 -182 -30 156 -4 -171 11 159 -66 -154 97 119 -104 -103 104 102 -120 -70
5503g0K27j13j82J32J39j16j36J34J30j77r5J95M5j84j7J59K3j96J8K03p5j61
$$ -70 157 44 -138 -6 133 17 -119 15 145 -32 -127 68 113 -71 -88 71 94 -102 -84 119 44 -117
5525a17P9J53r1j60J23J55j83j04J98P5j97o1K09M1k42K2K41q7j93J11J91j30
$$ -117 -38 115 24 -136 -13 142 -41 -145 53 128 -69 -130 79 120 -122 -100 141 54 -139 -28 163 33
5547C3j95J76J64k26r8K25O6k40m0K71l4k69Q6K62j70j98J70J81j92j60K50J06
$$ 33 -162 14 178 -48 -146 79 145 -95 -135 136 102 -167 -81 181 11 -187 -17 164 -28 -188 62 168
5569A68k75m2K61Lk61M7K64r9k59J69K12k15j47K15J15k28q8K67K5k68M3K48q2
$$ 168 -107 -149 112 115 -146 -99 165 66 -193 -24 188 -27 -174 41 156 -72 -160 107 132 -136 -93 155 73
5592G3k22J21K10j61k04K13J29k27n9K06L5k15j6K33l9k23J00J75j19j47J31J37
$$ 73 -149 -28 182 21 -183 30 159 -68 -127 79 114 -101 -117 116 77 -146 -46 129 10 -137 -6 131
5614A31j69j04J94N6j92rJ59J1j82K6J83o5j59J04J17r3j06J04J06j38q1J56N1
$$ 131 -38 -142 52 108 -84 -93 66 77 -105 -79 104 39 -120 -16 101 8 -98 6 112 -26 -107 49 100
5637A00j50k0J32J4j40oJ61m5j47O9J15o9j11R0J17j27q9J34O2j39m2J37M6j69
$$ 100 -50 -70 62 76 -64 -70 91 46 -101 -32 83 14 -97 -7 110 -17 -106 28 90 -49 -91 46 92 -77
5661g7j3J81l6j49N6J45p3j46J04J31j38r8J71N2j63m9J84K4k08K9J95p7j72R5
$$ -77 -90 91 55 -94 -38 107 34 -112 -8 123 -15 -113 58 110 -53 -102 82 106 -102 -73 122 45 -127 -32
5685c2J60j22j49J60J33k10p7K17L2k09pK03j8k21Q5J97j41j43J48J28j64j09
$$ -32 128 6 -143 17 150 -60 -137 80 112 -97 -104 99 81 -140 -55 142 1 -142 6 134 -30 -139
5707a39J94P1k28j0K40m8k08O8J89q0k02J49J64j94q7J77P3j97n8K18Ok26O5J89
$$ -139 55 126 -102 -112 128 80 -128 -60 129 49 -153 -4 160 -34 -121 56 129 -68 -126 92 98 -128 -63 126
5731A26j03j38R6J39j29j24J65Q7j96k1J69Qj64PJ71l2j69Q5J33j02r6R5J00j22
$$ 126 23 -115 -19 120 -9 -133 32 119 -77 -98 71 79 -85 -78 93 61 -108 -23 110 8 -88 7 107 -15
5755a5p6J41L1j36KJ16jj19QJ24m7j12Q0P9o7q4O9Q2r7n8J08L4j09j4J05J1j13
$$ -15 -91 50 81 -55 -53 63 62 -57 -49 75 28 -84 -4 75 8 -76 -7 75 -22 -80 28 62 -47 -61 44 55 -58
5782e8pJ27l1j03M4Q3m5p4M4R4q7o4J01N4j17k3J15K5j26rJ34l7j17N4R9n1j06
$$ -58 -65 62 31 -72 -28 55 10 -64 -20 74 -13 -77 24 78 -39 -62 53 78 -48 -57 77 40 -77 -23 76 25 -81
5809h1P4J14j34q1J50M3j36k7J32K4j58J4J68o9j36Q4J17j07j04J12J03j56m8
$$ -81 -7 107 -27 -108 42 85 -51 -78 54 78 -80 -66 102 33 -103 -19 98 -9 -113 -1 102 -54 -102
5832a02J68Rj63J6J57k6j65P8J60j28j16J34Q0j27p1J55L2j74NJ76n6j33N6J33
$$ -102 66 75 -88 -72 85 59 -106 -28 132 4 -112 22 102 -25 -96 59 91 -83 -78 98 42 -91 -35 98
5856I8p9j38J26R2j36n9J38K8j33j9J38j0j39M3J25p2q8O6R5q6q1J13N5j18k5
$$ 98 19 -119 7 99 -37 -96 42 70 -63 -82 56 46 -93 -50 75 3 -85 -19 76 -10 -91 22 77 -41 -66
5881f6J13Mr4lJ06j3j21O1Q2o3n8N1N9o7n1R2K9r0pN4J4o3l2R8Lr2K1P8l9n8K2
$$ -66 47 51 -43 -46 60 47 -74 -13 69 6 -52 -1 58 -9 -60 32 61 -29 -36 18 32 -31 -63 35 38 -54 -33 45 6 -52 -30
5912c0Q5m8p5N4O1n5n7Q4M4p5n7J11J6r7MR3j5r1J2J14m9j18R6P8q8p3Q8O5j13
$$ -30 55 7 -68 -14 47 -8 -65 19 63 -12 -69 42 58 -39 -35 58 43 -48 -36 78 29 -89 7 85 -3 -76 12 77 -36
5941c6n7J46Nj39K6J15k6j22N2J26j00j04J27Q0j34m7J27M4j49nJ70n1j50P4J32
$$ -36 -93 53 58 -81 -55 60 34 -88 -36 90 -10 -114 13 93 -41 -88 39 83 -66 -71 99 48 -102 -28 104
5966A04p2j33R1J38j53q1J64L4j49j2J53nj63L8J60r8j21J04J04j13r0J22P4j58
$$ 104 32 -101 -10 128 -25 -106 58 92 -57 -69 84 79 -84 -46 114 16 -105 -1 103 -10 -100 22 96 -62
5990f2l8J67j5j33L0J31l8j49Q6J21j08r3J15N9r2n9J24L4j49K4J27m3j02L9J04
$$ -62 -100 67 52 -81 -51 80 42 -107 -21 100 -8 -101 14 73 -19 -78 46 80 -69 -45 82 39 -63 -24 80
6015H0m1j21Q3Q8r5o6R6M6q4n5J06L3j23kJ00j6q1KJ08k5j03N0P9p4n1N8O4o7
$$ 80 39 -82 1 89 -6 -72 24 70 -14 -69 37 70 -53 -55 45 29 -52 -50 58 33 -70 -20 59 -15 -66 -8 56 -11
6043a1o6R1O1j14k1J13Jr3qJ21j7j27O5J03q6q6Q1Q9j04r0J34M8j34rJ17%j33
$$ -11 -77 14 75 -39 -60 53 54 -39 -47 74 57 -70 -5 98 12 -74 7 96 -8 -98 36 84 -50 -59 58 58 -75
6070g5NJ65o7j47J01J21j26r1J20Q4j33p9J82L3j82J5J56k6j62N3J79r2j62J41
$$ -75 -70 95 28 -119 -18 103 -23 -114 6 90 -43 -122 60 93 -89 -74 82 56 -106 -53 126 34 -128 13
6094A3J05j51o0J43P2j96k0J98k7j91P7J51q4j53J10J44j62r3J75N6j82k4J61
$$ 13 118 -33 -93 50 122 -74 -94 104 77 -114 -37 114 30 -123 -13 131 -31 -124 51 107 -75 -99 62
6117F2Qj83L6J92r7j36J11R8j01j12J47R8j76l7J74j2j47K1J30j9j47O1J37j05
$$ 62 70 -113 -77 115 18 -118 -7 91 -10 -122 25 123 -53 -90 84 72 -75 -54 76 57 -90 -29 108 3
6141Cq9R6O5q6o4J14N7j51lJ23k4r8PJ04j5j25M7J00o3p5Q0O5p1p8R5N8j09k7
$$ 3 -86 10 75 -11 -75 39 96 -55 -58 65 41 -57 -50 54 39 -86 -39 61 -2 -77 3 68 -3 -81 14 72 -37 -64
6169f4J13Or4j4J15lj28L2J18n2r6N6J05o8j10J07R0j43l6J14L4j26l5J51Nj80
$$ -64 49 55 -39 -53 62 59 -69 -37 81 29 -67 -11 94 26 -84 23 113 -30 -66 48 82 -44 -79 72 77 -103
6195a03N4J60r4j22Q4J34j22j26J64J00k02m5J84K2j79lK05m5k04J06J63j26j24
$$ -103 -49 111 17 -105 -21 113 -9 -135 29 129 -73 -118 66 88 -91 -94 111 66 -138 -32 131 5 -119
6218a19J32J30j72j12K27L2k10NK02m3k00P1K20j42j91J76J31j73j02J85P4k15
$$ -119 13 143 -29 -141 86 118 -92 -87 115 72 -128 -57 163 21 -170 6 137 -36 -138 47 121 -94
6240i4m1K35k8k07P1J73p8j64J16J57j72j11J91O6j84k9J70K4j89J7J96o9j66
$$ -94 -135 100 72 -135 -64 109 31 -133 -17 140 -32 -143 48 114 -70 -99 71 95 -94 -77 119 50 -116
6263a16R7J23r5j17J24J18j63p8J65M2j67j9J48J1j68K6J55o9j22P8J03p7j08
$$ -116 -19 104 9 -108 16 134 -29 -107 58 100 -67 -86 62 73 -95 -69 86 17 -105 -27 76 -1 -109
6286a09R9J01j26o9J44L5j21l2J36K0j57J7J59o5j13N1J23o2j46J20J18j42r0
$$ -109 -10 91 -35 -104 40 75 -46 -78 58 78 -79 -62 97 32 -81 -30 93 31 -115 5 123 -19 -109
6309a09J50O0j38o1J61L5j92J4J97p2j66P9J58j03j55J51J24j89q0J93N9j87m9
$$ -109 41 101 -37 -98 63 98 -94 -80 117 45 -121 -42 116 13 -142 9 133 -56 -136 57 116 -71 -120
6332a20K14J2k45Q0J90j05j67J17J69j53j59K16J01k38l2K37qk24K0K51p9k62
$$ -120 94 106 -139 -59 131 26 -141 -24 145 -8 -167 49 150 -88 -120 117 109 -115 -95 156 77 -185
6354a85J68J86j90j34J92J18k22q5K52J0k54M7K28p0k11Q4K31j57j86K02J33k24
$$ -185 -17 169 -21 -155 37 155 -67 -152 100 110 -144 -97 131 61 -150 -66 165 8 -178 24 157 -67
6376f7o8K10N1k40kK58o2k27J23J76j24j63J31J67j94j06K17L4j92lJ69oj88L4
$$ -67 -135 75 126 -114 -116 142 80 -147 -24 152 28 -135 -4 163 -31 -137 80 114 -78 -81 88 82 -106 -72
6400g2K10r8j67J12J21j12j04J19J06j61p2J78K1j54kJ42J6j83M2J70q5j20P6
$$ -72 138 40 -127 -15 106 -6 -110 9 115 -46 -118 60 81 -73 -75 67 83 -100 -58 112 27 -93 -17
6423a7J09r6j00J12J07j43o6J54L2j38l4J52J2j81K8J82p6j51R1J32r2j45J27
$$ -17 92 -4 -104 8 115 -28 -94 60 92 -46 -80 72 84 -97 -69 113 37 -114 -23 109 17 -128 -1
6446aJ47j95p2J75L9j61m9K03Nk26N7K08r5j55R4J51j32j57K04J14k25n6K40J5
$$ -1 146 -49 -121 54 93 -68 -117 86 91 -135 -78 130 35 -120 -26 125 -7 -164 40 154 -71 -127 113 128
6470A28k35KK42m7k44J13K19j62j69J62J49j91j41K49P0k69RK46m1k35O8K43j26
$$ 128 -107 -105 137 90 -154 -41 178 16 -153 9 158 -33 -174 75 145 -124 -115 131 90 -145 -77 166 40
6493D0k20J84J54k19j00K06J01k43m9K60k5k36P7K15j10j83J21K02j82j68K41
$$ 40 -180 4 158 -61 -161 45 146 -97 -146 114 89 -147 -70 145 35 -148 -27 175 -7 -175 66
6514F6P8k17m2K07K8k24kK44o9k03J05J60j17j46J33J36j74r9J88N6j75k7J65
$$ 66 144 -73 -115 92 120 -104 -106 138 69 -134 -29 131 14 -132 1 137 -37 -136 52 108 -67 -94 71
6537G1J4j92K0K05r1j51J07J27j11j03J06J25j56p1J60M0j52k5J45L8j82J8J82
$$ 71 85 -107 -87 118 27 -124 -17 110 -1 -104 2 127 -29 -100 60 100 -52 -77 68 106 -76 -58 124
6560A24o6j55P9J33q1j51J09J43j66r9J85M9j68l8J74K3k10J7K19o7j91R9J61
$$ 124 58 -97 -18 115 34 -117 -8 135 -31 -130 55 104 -64 -102 72 95 -115 -98 121 54 -137 -38 123
6583A23j13j65J62J52k11r0K13N0j96m4K40j5k50Q9K28j38j89J58J65j77j59K28
$$ 123 10 -155 7 159 -52 -142 71 121 -75 -119 121 106 -144 -55 173 35 -154 4 169 -8 -167 61
6605F1J13k78k3K58j9k39M0K49r9k40J70J87k23j22K15J12k47p1K67J0k82P4K46
$$ 61 174 -104 -127 131 112 -127 -87 162 63 -177 -7 180 -43 -165 50 162 -85 -156 111 121 -161 -87 159
6628A59r9k16J09K13j64j83K27J24k40o5K22M9k45QK48p5k38J31J98j40j67J52
$$ 159 60 -156 -47 166 2 -181 46 170 -70 -135 87 136 -109 -101 147 72 -166 -35 163 23 -144 8
6650HJ49j90j29K25O7k31j7K00Rk09L4K17r4j77J25J44j41j18J33J28j75q3J95
$$ 8 157 -33 -162 63 130 -101 -118 82 91 -118 -84 133 39 -138 -13 131 -10 -128 5 133 -42 -125 70
6673G0L4j85RJ56mj75L2J95q5j53R8J32j00j33J20J20j63q0J86K5j67k0J68K3
$$ 70 104 -81 -72 84 80 -95 -63 132 47 -106 -8 124 24 -109 11 131 -32 -112 74 99 -68 -88 80 103
6697A03k11K3J93q4j49J20J22j09j58J61J19j87q7K23K3j95j6K13pk27P4K12j16
$$ 103 -108 -85 108 24 -125 -5 117 8 -150 11 130 -57 -144 79 102 -93 -109 104 97 -130 -56 156 40
6720D0j86J48J51j61j40K01J04k47l2K39nk32K3K32o4k39J38J94j73j45J91J09
$$ 40 -146 2 153 -8 -148 53 157 -90 -122 117 112 -120 -97 135 71 -168 -30 164 -9 -154 37 146
6742A46k05r8K49M1k74K6K55p5k13R6K15j33k18K17J39k32q6K23O4k20m5K68m3
$$ 146 -59 -157 92 133 -141 -115 140 65 -148 -52 163 30 -188 29 168 -64 -150 73 137 -83 -128 140 97
6765I7k52J05J98j11j87J39J70j73j48K22P9k12l2J98Lk05K1K23q1k13J36J52
$$ 97 -155 -50 148 37 -150 -11 159 -14 -162 60 139 -73 -105 93 96 -109 -88 135 54 -159 -23 129
6787A29j41j16J30J28j70r6K08L6k04QJ78k0j86M6K02q6j80J44J30j37j10J17
$$ 129 -12 -128 2 130 -40 -136 72 108 -96 -88 90 70 -116 -70 132 46 -134 10 140 3 -107 10
6809A0J21j72p4K01J1j75qJ71%j94M7J92j00j60J21J17j21j20J44J20j94o6K00
$$ 10 131 -41 -115 86 97 -78 -86 85 85 -109 -62 130 30 -130 -9 108 -13 -133 11 131 -63 -129 71
6832G1J6j78LJ84k1k02O5K15j32j63J50J22j40j26J81J07k25m5K29ok19M2K10
$$ 71 87 -91 -88 96 75 -127 -62 153 21 -142 8 130 -10 -136 45 152 -73 -118 111 105 -114 -72 138
6855A38o4k21J13K03j71j59J93J11j94j06K29P5k70QK54o6k26P8K22j22k06J76
$$ 138 74 -147 -34 169 -2 -161 32 143 -51 -157 72 147 -123 -115 139 73 -153 -75 147 25 -181 -5
6877eJ67k06j24K31Q9k44l9K53ok73R3K24j10j99J42J90j89j69K36J08k52m9K37
$$ -5 162 -44 -168 63 152 -92 -131 122 116 -157 -64 160 50 -149 -7 183 -6 -175 61 169 -83 -132 105
6900A05J2k42L7K22o5k33J32J98j71j46J65J31j95j01K24M2k11jK09k8k08N3K15
$$ 105 117 -125 -88 134 69 -164 -32 166 -5 -151 14 145 -50 -151 73 115 -96 -97 112 84 -124 -71 144
6923A44j01j95J56J42j62j15J70J08j99p3K25Pk05K4J85l8j83N4J91j13j66J56
$$ 144 43 -152 4 146 -16 -131 39 147 -52 -125 100 107 -98 -74 111 73 -110 -56 135 22 -144 12
6945A2J18j51j10J58J01j91o4K21ok05L9J78l9j99P3K16j38j59J53J26j63j04
$$ 12 130 -21 -131 27 128 -63 -127 94 88 -117 -78 100 61 -138 -65 151 13 -146 7 133 -30 -134
6967a34J77R8k14m5K28j6k06M0K12o9k14J09J90j48j65J92J15j96r6K09P7k55
$$ -134 43 141 -73 -118 110 94 -112 -72 140 71 -143 -34 156 8 -157 35 150 -46 -142 67 144 -111
6989a11rK57o7k19Q5K13j12k21J67J84k14j24K12R3k25n3K64%k70N8K61j17k07
$$ -111 -120 137 70 -149 -64 149 37 -184 -17 167 -47 -171 41 134 -91 -144 120 120 -150 -92 169 52 -155
7012a55J32J97j74j81K18J45k60p7K70K6k56JK60m6k74J14K38j77j78J69J71k06
$$ -155 -23 174 0 -181 37 182 -78 -155 115 141 -115 -114 146 100 -174 -60 178 1 -177 -8 163 -43
7034d3j40K63P1k75qK50k0k34M9K48j16k27J71J75j74j39J87J16k15p7K44K4k45
$$ -43 -183 80 151 -124 -132 118 98 -136 -87 161 45 -182 -11 164 -10 -149 38 154 -61 -138 106 130 -115
7057a15K9K16n4k06P9K09j28j83J75J30j83j03J79J08k30n0K26qk14M5J91o0j94
$$ -115 -86 130 76 -130 -51 158 30 -153 22 152 -31 -134 45 153 -77 -127 99 91 -123 -78 113 53 -141
7080a41Q9K02j51j57J76J12j67r9J82P8k23k1K22j6k17O9J96q3j93J08J93j64
$$ -141 -52 150 -1 -158 18 130 -37 -136 46 124 -99 -120 102 86 -131 -62 134 51 -142 -34 159 -5
7102ej51J96J03j96q7K14P5k56j2K48m4k33Q8K08j08k04J40J90j99j39K22R0k23
$$ -5 -156 40 143 -53 -140 74 149 -107 -119 129 85 -148 -60 148 40 -164 -24 166 -33 -172 50 140 -83
7125h3p2K48L1k64K3K68r2k32J31K09j48k15K11J78k42j22K74N0k54k8K72j6k94
$$ -83 -155 93 124 -140 -117 151 59 -173 -42 167 19 -196 15 193 -49 -171 103 153 -101 -129 143 127 -167
7148a67R6K58j49k21J80J89k08j77K66J22l05l8K82kk83M8K80j02k72J69K26k09
$$ -167 -71 187 38 -183 -3 186 -22 -199 67 189 -116 -154 128 126 -157 -109 171 69 -203 -34 192 -17
7170a7j65K19J44k45j19K81N5k97K7K61n8k42Q7K50j50k10J95J79k40j12K25Q8
$$ -17 -182 37 181 -64 -183 98 153 -144 -117 144 86 -156 -69 181 31 -179 16 195 -45 -157 68 156
7192A56k51m9K76j6k61O4K31j04k11J14K22j77j72K02J16k18p1K12N9k35qK49
$$ 156 -95 -144 132 116 -145 -81 150 46 -165 -51 171 -6 -178 24 140 -78 -149 63 122 -113 -121 128
7214A28m1k38P3K16j02j89J36J85j87j32J91J11k11o6K14M0k38nK41m7k15Q2K06
$$ 128 87 -151 -78 138 36 -153 -17 168 -19 -151 40 151 -60 -126 88 128 -110 -115 126 79 -136 -54 152
7237A52j14j95J43J76j77j50K14R8k29n5K28K7k50J1K69q2k33J11K11j39k06J94
$$ 152 38 -157 -14 162 -15 -165 49 147 -82 -137 91 118 -132 -121 148 66 -167 -56 155 16 -190 4
7259DJ83k37j31K73O7k47n2K78j0k84P5K73j48k22J64K02k16j66K47J39l05m4
$$ 4 187 -50 -181 92 159 -88 -140 138 128 -156 -81 192 44 -178 -14 188 -28 -194 53 192 -113 -157
7281a57K82Ok84L7K89j02k74J50K49k01k06K41J42k50j15K85N7k99L1K83o6k69
$$ -157 125 131 -153 -116 173 71 -203 -53 196 -5 -211 30 172 -78 -193 92 149 -150 -119 164 98 -171
7303a71J05K60j68k24K15J79k39j27K60P6k57m7K83k0k85Q6K39j20k18J59J92
$$ -171 -66 194 26 -198 17 196 -43 -170 90 166 -91 -138 145 125 -160 -74 165 45 -173 -14 178
7324A78j97j66K30J00k31o2K32K9k48J3K57p3k31J20J93j32j68J67J45k04j09
$$ 178 -19 -185 45 145 -86 -148 84 113 -135 -122 135 62 -169 -49 144 12 -156 11 156 -48 -157
7345a57K16P4k27l4K24Pk15J9K38q2k06J14J69j23j56J36J52j94j08K15M7j99
$$ -157 59 133 -94 -128 96 103 -112 -93 145 63 -143 -29 140 17 -139 -3 149 -45 -153 62 109 -90
7367i0k5K09rk17M5K17q7k08J24J79j46j59J71J42k10r5K36M2k28qK25rk38O9
$$ -90 -115 94 85 -132 -87 130 43 -165 -41 138 -8 -167 4 146 -64 -159 77 119 -109 -117 108 99 -139 -70
7391g0K36j32j98J59J73j78j56K21J23k62o8K76J5k70K0K59o7k70J31K37j75j95
$$ -70 166 34 -164 -5 168 -10 -166 55 178 -84 -152 124 139 -131 -111 148 81 -189 -58 179 4 -191
7413a91K04J53k29j22K74N7k79qK81n0k62J02K46j47k21J90J83k36j18K59Q3k70
$$ -191 13 166 -63 -185 89 146 -133 -141 140 90 -172 -70 176 29 -192 -2 181 -55 -173 86 169 -101
7435a01m9K87qk92P6K58j15k23J38K02j82j65K22J13k55n5K46Rk39L7K35q1k24
$$ -101 -150 137 129 -163 -87 171 56 -167 -29 173 -9 -174 48 161 -94 -149 97 106 -133 -96 139 58 -166
7458a66J26J92j46j72J86J25j98j08K33N0k19j3K10j1k08M9J93p5j78J21J49j39
$$ -166 -40 152 6 -166 20 145 -53 -161 72 122 -97 -110 100 89 -119 -70 123 48 -130 -9 140 1
7480Aj37J62J07j80o7J93K3j88oJ89k1j87N2J83r4j68J27J30j36j20J49J11j78
$$ 1 -136 26 133 -47 -114 79 102 -86 -92 97 76 -111 -59 124 30 -138 -11 119 -17 -137 12 123 -55
7503e5p4J97L9j98kJ89pk04N5J91r9j73J33J56j58j26J79J05k17n6K23J4k20J5
$$ -55 -129 68 107 -91 -93 96 89 -115 -60 131 32 -141 -8 148 -10 -136 43 148 -69 -125 98 112 -108 -93
7527i3K29n4k22R1K13j52j81J84J35j98j15K30P6k51j8K60m9k44Q5K32j21k22
$$ -93 136 82 -140 -49 164 12 -169 15 150 -48 -163 67 143 -108 -126 134 85 -159 -74 158 37 -185
7549a85J76J78k17j24K42P8k51m4K67kk74P8K52j27k19J69J83k01j53K28J14k64
$$ -185 -9 169 -48 -172 70 148 -103 -147 120 118 -156 -78 174 47 -172 -3 180 -21 -174 54 168 -96
7571i6l5K41kk38M4K27r1k33J49J82j60j48J75J31k08r6K29N0k35J1K16m0k04
$$ -96 -131 110 108 -130 -86 141 50 -183 -34 148 -12 -160 15 146 -62 -158 71 121 -114 -103 113 73 -131
7594a31Q0J91j22j62J48J33j63j01J76O2j83k3J85jj94M1J67o0j48Q0J47j21j26
$$ -131 -51 140 18 -144 4 137 -26 -127 49 111 -72 -95 90 89 -105 -64 103 43 -105 -25 122 1 -125
7617a25J41Q5j42p1J49N5j64k9J66Qj71L5J55m7j57P2J51j14j26J31R8j29q2J53
$$ -125 16 101 -41 -112 37 92 -72 -101 65 73 -98 -63 92 45 -112 -40 111 -3 -129 2 100 -29 -111 42
7641D2O6j68l4J85pj78L9J67o7j78J12J62j40j35J55R7j68p5J79M6k12PK09m3
$$ 42 108 -60 -94 91 84 -94 -55 112 45 -133 -21 141 1 -134 21 118 -50 -125 54 100 -112 -105 104 61
7665F1k04Q6J70j00j80J60J38j82j02K10P1k14l6K21mk28O9K15j15j90J55J45
$$ 61 -143 -57 113 13 -167 -7 131 -51 -153 57 128 -86 -122 99 95 -133 -64 151 36 -154 1 146
7687A46j71j25J97Q7k09m1K21qk17M7K08r1j88J24J60j58j28J79Q1j87n3K02J8
$$ 146 -25 -150 47 134 -75 -116 105 97 -120 -73 135 44 -144 -20 140 -18 -146 33 114 -73 -126 76 94
7710I4k16M2J99q5j68R7J61j31j22J49R8j77m3J57K5j59jJ79m2j61Q1J14p7r4
$$ 94 -122 -80 119 34 -134 -37 124 -7 -129 20 118 -59 -102 55 80 -79 -80 99 57 -104 -23 91 14 -80
7734h0Q6J03j24q9J38N1j37j7J22mj21PJ25l5j12N2J09p3r5Q1Q8q9r0J25M4j15
$$ -80 6 109 -15 -104 34 85 -52 -69 53 49 -72 -65 60 25 -87 -35 74 1 -94 -13 75 -14 -104 21 65 -50
7760e0k4J09K7j17lJ20k0j18M4J03m7j10O7J12r7q0J15N9j32m1J17M1j38rJ53
$$ -50 -74 35 62 -55 -58 62 42 -76 -32 71 24 -86 -19 93 -4 -84 31 90 -42 -83 34 75 -63 -72 81
7785H1l4j42N4J30q6j20J08J06j28p4J46N0j74oJ53jj65M3J71q6j58J27J17j26
$$ 81 47 -95 -41 89 3 -117 -9 97 -31 -105 41 91 -83 -89 64 63 -102 -59 112 26 -132 -5 112 -14
7809a4j06J53Q0j78l5J79Pj75L1J63o4j57R2J47j32j05J37P8j55n1J77Lj64KJ82
$$ -14 -120 33 113 -65 -100 79 86 -89 -58 105 41 -116 -24 123 -9 -114 23 101 -54 -105 72 75 -89 -87 95
7834I5o5j50Q4J30r9j22J48Q7j62m6J59J8j50PJ50l1j52O9J23r5r0J01P9j00o9
$$ 95 30 -120 -36 94 -5 -127 21 108 -54 -100 59 77 -73 -66 84 53 -99 -30 93 -2 -92 9 88 -12 -81
7859h1J30L8j33rJ26k2j13K4R8l2j01P2P0p8o0P5N5r3l0R4J2r7NQ8j0q8L0Q5l7
$$ -81 49 87 -46 -55 71 49 -64 -40 58 26 -75 -3 67 -11 -71 4 59 -34 -64 30 42 -55 -50 38 28 -60 -30 55 18
7888A8q1N1P6o0o8N9O3o8m0Q1K1q3j4Q8Pr4LR9l2r7M7R6o8q6P7P6j04n7J27K3
$$ 18 -63 -12 64 4 -64 -5 58 -10 -50 31 52 -31 -45 43 50 -44 -41 58 26 -71 -24 72 4 -82 -5 71 -33 -90 37 60
7918F0j27lJ22j6j27M0J31p1j20J10Q5j03o7J09N4j29k6J48Jj51M2J28o4j16R1
$$ 60 -67 -70 52 36 -91 -51 80 9 -111 -1 84 -19 -86 23 77 -52 -78 70 71 -80 -38 90 26 -90 1
7943AJ04j16p8J30N1j41l4J45kj45L0J39o2j24R2R2j11p3J22O1j47j4J29lj31
$$ 1 105 -11 -89 41 92 -49 -83 62 60 -85 -55 84 22 -102 -10 82 -29 -102 20 81 -66 -80 49 46 -85
7968h5M1J15n2j18Q5R3j02n6J03M3j15j2J12nj24N2R8m8r2P0O2p8m7P1N2r5k4
$$ -85 -44 71 19 -99 -14 79 -23 -79 24 67 -48 -60 52 47 -77 -25 73 25 -67 3 65 -13 -60 11 63 -32 -56
7995e6R8j1p9PQ4l2q6N3N6m9m1N8K9n3k0O4J2o7%N4J3o0J2M8ro2L0N3l2l1K0L8
$$ -56 42 31 -48 -41 43 11 -75 -22 34 -15 -56 2 31 -22 -42 22 34 -33 -33 21 34 -26 -14 34 25 -37 -7 46 14 -17 3 41
8027D1l4l6M1K0m1j1L5J7m9j3O3j0n9MO5j9n7K3N4l8m7M9L0n5k5O5K5o7oP4k2
$$ 41 7 -29 12 32 -9 -20 15 32 -17 -30 33 23 -36 -32 33 14 -43 -20 34 -4 -51 -2 28 -27 -52 13 38 -29 -35 39 17
8058A7p8M8O7m2o0N0N5o9m3P8K6q6qQ3kq7L0P5n7n3N6M3p1k5P2J6p9%P7k1p3L9
$$ 17 -61 -13 54 12 -48 2 57 -12 -55 23 49 -37 -45 38 36 -51 -21 54 -3 -56 0 43 -28 -53 19 35 -44 -44 33 12 -61 -22
8090b2N8m2n3N7M7p7j2P1J2p6KP8k2p1L7N8m3m7O7K4p0j0P2j7n6J2N7k3m9L9L2
$$ -22 36 -6 -59 -2 45 -32 -44 27 39 -37 -35 43 21 -50 -13 45 2 -45 22 46 -24 -34 38 21 -35 -23 34 11 -38 1 33
8121C3l9l9N2K2m7j7M4Km3jM5j3l1J9K5j8j1J4K1k9rL5Pl3MK0%j3jJ6Ml5K8%q
$$ 33 -6 -45 7 29 -18 -35 9 11 -32 -33 12 -1 -32 -13 12 -6 -17 -3 18 -11 -20 15 22 -11 -7 13 13 0 -1 15 19 -16 12 12 4
8156Dj6KL1j5k2J3K0j9qJJ1qj2J5Mj2j2L0j0j7rM2jm2K4J7j8j7J5L5l3k8M9Mm2
$$ 4 -12 -10 21 6 -16 -3 17 -2 -10 -9 2 -6 -18 -3 1 -11 -23 7 -3 -20 -29 13 12 -30 -6 11 -7 -24 -9 26 -7 -35 14 18 -24
8191b4
$$ Imaginary data points
##PAGE= N=2
##DATA TABLE= (X++(I..I)), XYDATA
0@%%%%%%%%%%%%%jRj6J6j6K4l2L2m0M8n6P0p8Q8j04J21j38J59j83K09k38K68l03
$$ 0 0 0 0 0 0 0 0 0 0 0 0 0 0 -1 8 -8 8 -8 16 -16 16 -24 24 -32 38 -40 48 -56 65 -73 86 -97 112 -126 142 -161
36a61L39l79M26m76N30n90O55p24Q00q86R80j079J190j312J443j592J754j932
$$ -161 178 -201 225 -251 279 -311 344 -380 420 -466 514 -565 625 -687 756 -836 918 -1014
54a014K133k358K613k907L247l642M112m681N388o295P503r201J1784j6218K5833
$$ -1014 1119 -1239 1374 -1533 1714 -1928 2184 -2497 2891 -3404 4099 -5102 6682 -9536 16297
69A6297q1370Q0189J40644k20971n8196J97675L9571k14181J4824J97881n1770
$$ 16297 -65073 15116 155760 -65211 -123407 74268 113839 -100342 -85518 112363 60593
80F0593j86088R9617J48670j21116j24605J48360R1563j66894n8620J83803J4586
$$ 60593 -125495 -25878 122792 1676 -122929 25431 116994 -49900 -108520 75283 89869
91H9869j79645J6808J73428m4603j64002O9825J52619r8664j26898J15459R8972
$$ 89869 -89776 -72968 100460 55857 -108145 -38320 114299 15635 -111263 4196 103168
102A03168j22992p4033J27309N1235j33678k0937J31238r576j19349L2493J06037
$$ 103168 -19824 -93857 33452 84687 -48991 -69928 61310 51734 -67615 -35122 70915
113G0915m9443r6782O9387Q3474q8727o3078R9097M3403j01908l0381J06310J7249
$$ 70915 21472 -75310 -5923 77551 -11176 -74254 24843 68246 -33662 -64043 42267 59516
125E9516j11544J199J09308j8535r9848K8428R2067l6416q7112M9081P7021o1685
$$ 59516 -52028 -50829 58479 39944 -59904 -31476 60591 24175 -62937 -13856 63165 1480
137A480o0391O7279M5395o9771l4728P6383K1036q3780j398Q4346j6724q0281
$$ 1480 -58911 8368 53763 -16008 -50736 25647 46683 -37097 -38495 45851 29127 -51154
149e1154K9218P8944m2331p8559O0078P1364p5875n8111Q4230M6460r0264l6503
$$ -51154 -21936 57008 14677 -63882 -3804 67560 -8315 -66426 17804 64264 -26000 -62503
161f2503R8949K0994j04914K57J01946j9285r4217L4018Q7938n0908p9534P1168
$$ -62503 36446 57440 -47474 -47217 54729 35444 -58773 -24755 63183 12275 -67259 3909
173C909O2757q6970m1175R4855K2313j00878m586J07903j8149j09160M3070J00757
$$ 3909 66666 -20304 -61479 33376 55689 -45189 -49775 58128 39979 -69181 -26111 74646
185G4646o2083q8823P5376P8219q9440o3884J03109M1739j08699j7811J05876
$$ 74646 12563 -76260 -884 77335 -12105 -75989 27120 68859 -39840 -57651 48225
196D8225j630j01831K0208R7556m2594q6485O3798O7898p7209m9361Q5723L3614
$$ 48225 46595 -55236 -35028 62528 19934 -66551 -2753 65145 -12064 -61425 24298 57912
208E7912r5074j4906J01987q246j00158K8695R2134m2804q4564N5705P6189p0216
$$ 57912 -37162 -52068 49919 41673 -58485 -29790 62344 19540 -65024 -9319 66870 -3346
220c346o1190Q0465M1570q2457k4576Q1328J0351q1463O825P8421k6081o8113
$$ -3346 -64536 15929 57499 -24958 -49534 31794 42145 -39318 -32493 45928 19847 -48266
232d8266M0431N5409m8989m5768N7695L6007o7328k1598P1702O487o9490L420
$$ -48266 -7835 47574 -1415 -47183 10512 46519 -20809 -42407 29295 35782 -33708 -30288
244c0288O6960j0750o6384K0890O2286l1282n2635L6181M3339l7593l7580M1458
$$ -30288 36672 25922 -40462 -19572 42714 11432 -41203 -5022 38317 724 -36856 4602
256D602L0399m6582j8711M7117P715m4176j127M3838n506m5733J6066M3979k6260
$$ 4602 35001 -11581 -30292 16825 24540 -19636 -20763 23075 17569 -28164 -12098 31881 5621
269E621l8474L1748L4989l6240l3971M4087K9676n1785k0990N4387J3439n4601
$$ 5621 -32853 -1105 33884 -2356 -36327 7760 37436 -14349 -35339 19048 32487 -22114
281b2114q562N7233J027n9547J0847N6257k1621m9342K8625M3991l6334l8745
$$ -22114 -30676 26557 27584 -31963 -21116 35141 13520 -35822 -7197 36794 460 -38285
293c8285M7025K8476n5625j4599N8622K914o0079O838O3165j9611o3541L4539
$$ -38285 8740 37216 -18409 -33008 25614 28528 -31551 -24713 38452 18841 -44700 -10161
305a0161N7493m5705m8828N2417M1774n9607l3181O7480J9249p0486l538O7445
$$ -10161 47332 1627 -47201 5216 46990 -12617 -45798 21682 40931 -29555 -33093 34352
317C4352q932o3450K0200O0042l4283n2466M8301L9284n6992k5676O1675J4395
$$ 34352 25420 -38030 -17830 42212 7929 -44537 3764 43048 -13944 -39620 22055 36450
329C6450o6827j568P0761j4596o8671K9288O1555l9085n4460M7274M7314n6565
$$ 36450 -30377 -31945 38816 24220 -44451 -15163 46392 7307 -47153 121 47435 -9130
341i130l5818O3113K0674o3411p210O0650l565n8600J5694N4745k9358m5668L9627
$$ -9130 -44948 18165 38839 -24572 -31782 28868 25303 -33297 -17603 37142 7784 -37884 1743
354A743L4226m4926k5006M9406J6541n4589n141N6316p149n2719J5560M8069k1035
$$ 1743 35969 -8957 -33963 15443 31984 -22605 -27746 28570 21421 -31298 -15738 32331 11296
367A1296m4956K7795L9949l4911l0745L7855K1239l7144j4733L7393Q262l8725
$$ 11296 -33660 -5865 34084 -827 -31572 6283 27522 -9622 -24355 13038 21300 -17425
379a7425J111L6866j0233l1689J5480K7777j9350k6073K5444K2462l1468j5871
$$ -17425 -16314 20552 10319 -21370 -5890 21887 2537 -23536 1908 24370 -7098 -22969
391b2969L3536J0626l3602q236L5654M755l8153J642L7065p167l3569R631L1820
$$ -22969 10567 21193 -12409 -20645 15009 19764 -18389 -16747 20318 13151 -20418 -10787 21033
404B1033j2605l1060J8514K7093k3954k0350K6037J5132k7762j1446L1998N141
$$ 21033 8428 -22632 -4118 22975 -979 -21329 4708 19840 -7922 -19368 12630 17771
416A7771l5692L875L5462j1260l3712J6129L3770k2371l3263L0724K8528l6898
$$ 17771 -17921 -14046 21416 10156 -23556 -7427 26343 3972 -29291 1433 29961 -6937
428f937k1541L9266J6194m1501j0986M5032K273m5925Q329M2191j6518l7305K2841
$$ -6937 -28478 10788 26982 -14519 -25505 19527 21800 -24125 -15796 26395 9877 -27428 -4587
441d587L3558l0884k7795L9597J7855m4629p142M5986j314m7339R803M8605k0717
$$ -4587 28971 -1913 -29708 9889 27744 -16885 -24027 21959 20645 -26694 -16891 31714 10997
454A0997m5933L1073L9035l7423l1879M1540K5530m6343j6755M9768N018m8474
$$ 10997 -34936 -3863 35172 -2251 -34130 7410 32940 -13403 -30158 19610 24628 -23846
466b3846N689M4131j3622m0235K1626L5835l0860k7886L7936J7661m0738r054
$$ -23846 -18157 25974 12352 -27883 -6257 29578 -1282 -29168 8768 26429 -14309 -23363
478b3363M2068J929m3963O737M3811j6305l9505K3096L3656k6756k9080L0545
$$ -23363 18705 20634 -23329 -16592 27219 10914 -28591 -5495 28161 1405 -27675 2870
490B870K3919l4811j5765L6177O859l4007m22L1722m923l0471J1868K7342j8909
$$ 2870 26789 -8022 -23787 12390 19249 -14758 -15180 16542 11619 -18852 -6984 20358 1449
503A449k1346K2802J5702k4484j2204K7092Q277k9917k323K9889k945k7458N327
$$ 1449 -19897 2905 18607 -5877 -18081 9011 17288 -12629 -14952 14937 11992 -15466 -10139
516a0139K6052p233k5657J0914K3217j4188j8742J4799J5415j4719j3782J6618
$$ -10139 15913 8680 -16977 -6063 17154 2966 -15776 -977 14438 -281 -14063 2555
528B555J0809j8854n780J8759J677j7791M51J8734l468k0370Q658J9654j3159
$$ 2555 13364 -5490 -11270 7489 9166 -8625 -8174 10560 7092 -13278 -4620 15034 1875
541A875j7462J5385J6660j7875j6537K2288J3932k5958r244K6786N554k6955k747
$$ 1875 -15587 -202 16458 -1417 -17954 4334 18266 -7692 -16936 9850 15404 -11551 -14298
554a4298K8416k057k8955Q856K6160j4322k1978J7876J8891k2226j5255K7705
$$ -14298 14118 12061 -16894 -8038 18122 3800 -18178 -302 18589 -3637 -18892 8813
566H813Q724l1177r72L1541n047l1496J0297L1976j7114l0344K4216K5409k8638
$$ 8813 17537 -13640 -14612 16929 11882 -19614 -9317 22659 5545 -24799 -583 24826 -3812
579c812j9775L0802J5166l3340r464L5612J365l4864O712L1293j2603k7737J7916
$$ -3812 -23587 7215 22381 -10959 -20423 15189 16554 -18310 -11598 19695 7092 -20645 -2729
592b729K4401k4329j8841K9889J0973l2198l820L2721j809l3604Q175L3531j5697
$$ -2729 21672 -2657 -21498 8391 19364 -12834 -16654 16067 14258 -19346 -11171 22360 6663
605F663l0233K1629K4968k4730k0384K7231J5850l0162r212L1255J418k9187M682
$$ 6663 -23570 -1941 23027 -1703 -22087 5144 20994 -9168 -18380 12875 14293 -14894 -10212
618a0212K6159r198k3940J4422K0803k0020j5260K3295R330k4083n197K4908J508
$$ -10212 15947 6749 -17191 -2769 18034 -1986 -17246 6049 15379 -8704 -13901 11007 12515
631A2515k6138L558K5425q461k2365J1000J9467j2236j7734J4449J4979j6677
$$ 12515 -13623 -10065 15360 6899 -15466 -4466 15001 2765 -14969 -520 14459 -2218
643b218j0429J6775O360j5529m066J5389J538j5918K507J4876o130j2586P810
$$ -2218 -12647 4128 10488 -5041 -9107 6282 7820 -8098 -5591 9285 3155 -9431 -1621
656a621J1450r301j1423J2257J0122j5033p417J5824N602j6068n007J7633L280
$$ -1621 9829 528 -10895 1362 11484 -3549 -10966 4858 10460 -5608 -10615 7018 10298
669A0298j9193J12J8692k921j7161M380J6667o606j6288J0446J3814j3661j0009
$$ 10298 -8895 -8783 9909 6988 -10173 -5793 10874 4268 -12020 -1574 12240 -1421 -11430
682a1430J5088P121j6586m640J9189N39k0964M772K0418q930j9127J1839J8600
$$ -11430 3658 10779 -5807 -10447 8742 9281 -11683 -6911 13507 4577 -14550 -2711 15889
695A5889j5535j7276J9896J3580k2602q942K3202N261k3714j510K4532l956k3543
$$ 15889 354 -16922 2974 16554 -6048 -14990 8212 13473 -10241 -11751 12781 8825 -14718
708a4718R856K0162j4109j6395J7253J3174k1003q863K4557K667k5766L409K4981
$$ -14718 -4862 15300 1191 -15204 2049 15223 -5780 -14643 9914 12581 -13185 -9776 15205
721A5205p962k4161J2333K3099j7550j9843K1870J4654k3669r798K4235N618k5044
$$ 15205 7243 -16918 -4585 18514 964 -18879 2991 17645 -6024 -15822 8413 14031 -11013
734a1013l84K4886n901k2181J0968J8197j4151j4852J7170J1466k0569o460K2396
$$ -11013 -11397 13489 7588 -14593 -3625 14572 421 -14431 2739 14205 -6364 -12824 9572
747I572Q58k1867L262K0779o281k0181R929J8535j3676j4898J5508J1019j5693
$$ 9572 10430 -11437 -8175 12604 6323 -13858 -3929 14606 930 -13968 1540 12559 -3134
760c134q274J6141N420j6866j252J6032k795j3618N150J1670o894j0577R540Q594
$$ -3134 -11408 4733 10153 -6713 -7965 8067 5272 -8346 -3196 8474 1580 -8997 543 9137
774I137j1983n430J2651K949j2423j813J2994M00j3746K082J2932l892j1238M192
$$ 9137 -2846 -8276 4375 7324 -5099 -6912 6082 6482 -7264 -5182 7750 3858 -7380 -3188
788c188J0452m595j0246O116Q856p348o582P241N161p109m583Q255L015r431l86
$$ -3188 7264 2669 -7577 -1461 7395 47 -6535 706 5867 -1242 -5825 2430 5445 -3986 -4372
803d372R257j498q836K470R509m191j0246P011R476r176p985J0121P264j1342
$$ -4372 4885 3387 -5449 -2979 6530 2339 -7907 -896 8580 -596 -8581 1540 8804 -2538
817b538o604J3374M465j4657j350J4275j036j3579K941J3453n879j2534R463R863
$$ -2538 -9142 4232 8697 -5960 -7310 6965 5929 -7650 -4709 8744 2865 -9669 -206 9657
831I657j1971o658J3254M161j4799j439J6599k612j6965O819J5612r730j4076
$$ 9657 -2314 -8972 4282 8443 -6356 -7795 8804 6192 -10773 -3954 11658 1928 -12148
844a2148J1978J2806j4759j0406J7267O478j7969k588J7359l88j6898L632J6236
$$ -12148 -170 12636 -2123 -12529 4738 11216 -6753 -9341 8018 7630 -9268 -5636 10600
857A0600p737j3953J1296J0381j3208p236J4565M568j6313j020J7324l289j6482
$$ 10600 2863 -11090 206 10587 -2621 -9857 4708 9276 -7037 -8057 9267 5978 -10504
870a0504O664J4760q744j3498J0944J1912j3486q840J4863N113j4541k305J3972
$$ -10504 -3840 10920 2176 -11322 -378 11534 -1952 -10792 4071 9184 -5357 -7662 6310
883F310n1j3817L250J2774o681j0198Q756P549r767n752J1098L803j2582q25J2719
$$ 6310 6259 -7558 -4308 8466 1785 -8413 343 7892 -1875 -7627 3471 7274 -5308 -6133 6586
898F586j930j1601L337J0797m333j0486O051R223p498o971P549N242p088m406
$$ 6586 4656 -6945 -3608 7189 2856 -7630 -1579 7644 146 -6825 724 5966 -1122 -5528
912e528P387L115p839r67P177o58o055J197N894k008o194L726N602n125m471N483
$$ -5528 1859 4974 -2865 -3832 3345 2687 -3368 -2171 3723 1715 -4479 -753 4849 -276 -4747 736
928G36M154n950m394P379L710q607k236Q744J280q655q86R336l31r845K495R062
$$ 736 4890 -1060 -5454 1925 5635 -2972 -5208 3536 4816 -3839 -4725 4611 4280 -5565 -3070 5992
944E992m191p757N148O995o518o176Q633M111j0161j421J0520o61j0771K427J1460
$$ 5992 1801 -5956 -808 6187 -331 -6507 2126 6237 -3924 -5345 5175 4514 -6257 -3830 7630
959G630n020j1440P997J0005j0029q183J1166O772j2501m948J3941J940j4191
$$ 7630 2610 -8830 -833 9172 -857 -9040 2126 8898 -3603 -8551 5390 7330 -6861
972f861J331J3105l730j1941N886J0957q689q989J1354N824j2712k712J3178K74
$$ -6861 -5530 7575 3845 -8096 -2210 8747 58 -8931 2423 8247 -4465 -7177 6001 6275
986F275j3846K495J4244n989j3218R015J1082j0722r155J2054P308j3691m431
$$ 6275 -7571 -5076 9168 3179 -10039 -1024 10058 -664 -9819 2235 9543 -4148 -8579
999h579J4561Q11j3883K219J2496m441j1407O955R879r705p131J1446L964j1880
$$ -8579 5982 6793 -7090 -4871 7625 3184 -8223 -1268 8611 -1094 -8225 3221 7185 -4695
1013d695j528J2103n51j2518L257J2033n950j0280P468Q432q133p142R075N473
$$ -4695 -6223 5880 5329 -7189 -3932 8101 2151 -8129 -661 7771 -362 -7504 1571 7044
1027G044r986k943R778N81q663Q04P906k066p498L957O295n564m453O103L133
$$ 7044 -2942 -5885 3893 4474 -4189 -3385 4521 2455 -5043 -1086 5209 -355 -4808 1295 4428
1042D428o308k484P069J435p758J72P470j281o763J524O715k042o806L186O056
$$ 4428 -1880 -4364 2705 4140 -3618 -3446 4024 2743 -4020 -2496 4219 2177 -4629 -1443 4613
1057D613l975m875L971M287m116m001M991K991n691j431N591M05n494K09O033
$$ 4613 638 -4237 -266 4021 -95 -4096 895 3886 -1805 -3236 2355 2760 -2734 -2525 3508
1072C508j397o486L172O050m491n345N155N177o171m910P663L705q644k019Q676
$$ 3508 2111 -4375 -1203 4847 356 -4989 166 5343 -828 -5738 1925 5630 -3014 -5033 3643
1087C643Q14q664K53R019k097q767M305P443n860n875O855M667q175l106R652
$$ 3643 4457 -4207 -3954 5065 2968 -5799 -1494 5949 89 -5786 1069 5736 -2439 -5545 4107
1102D107O20j0216J974R824l865r411N588R081p792p880R799N693j0696l543J0915
$$ 4107 4727 -5489 -3515 6309 2444 -6967 -1379 7702 -90 -7970 1829 7522 -3174 -6717 4198
1117D198J780j1271L79J1332l167j0221N584Q297p069o617Q374M986r914k596
$$ 4198 5978 -5293 -4914 6418 3251 -6970 -1386 6911 -158 -6775 1599 6585 -3329 -5925
1131e925J0831k40j0577K478R886m092r385N898Q512p829o642Q896M484q990k858
$$ -5925 4906 4666 -5911 -3433 6453 2361 -7024 -1126 7386 -443 -7085 1811 6295 -2695 -5553
1146e553R036J308r214Q21Q677k996p209M352N766n208m730O335L396p424j441
$$ -5553 3483 4791 -4423 -3602 5075 2079 -5130 -778 4988 -220 -4950 1385 4781 -2643 -4084
1161d084P623l00p174J291O960k202o868L495O112m550m780M719L835m675l310
$$ -4084 3539 3239 -3935 -2644 4316 2114 -4754 -1259 4853 303 -4477 242 4077 -598 -3908
1176c908N022K383n263j011M801M7m119L23L975q96m023J962L512k698k807K882
$$ -3908 1114 3497 -1766 -2777 2024 2071 -2048 -1725 2250 1354 -2669 -707 2805 107 -2700 182
1192A82K614l177k736M032K322m738j549M848J130m920j020N504L56n962Q65N661
$$ 182 2796 -381 -3117 915 3237 -1501 -3050 1798 2928 -1992 -3012 2492 2848 -3114 -2249 3412
1208C412j793n130K350M949l308m602M703L456n725j927O090P65o523L68P180
$$ 3412 1619 -3511 -1161 3788 480 -4122 581 4037 -1688 -3615 2475 3240 -3283 -2915 4265
1223D265k081p350M053O649n471n736O434N066p631l960Q813K105r229r5Q869
$$ 4265 2184 -5166 -1113 5536 65 -5671 763 5829 -1802 -5762 3051 5156 -4073 -4168 4701
1238D701j456q463K988Q060m987o904O828M973p837l119Q418J540r118L70R544
$$ 4701 3245 -5218 -2230 5830 843 -6061 767 5740 -2097 -5216 3202 4742 -4376 -4006 5538
1253E538k741r035M767P919o092o903P286N804q632l996R448J740r304J51Q839
$$ 5538 2797 -6238 -1471 6448 356 -6547 739 6543 -2089 -6085 3363 5103 -4201 -4050 4789
1268D789j745q416L568P626n559n990O898M108p529k572Q105J030q656R47Q550
$$ 4789 3044 -5372 -1804 5822 263 -5727 1171 5279 -2250 -4822 3283 4313 -4343 -3396 5154
1283E154k888p678M158O719n021n933N998M788o850l103O946J554o535m93O252
$$ 5154 2266 -5412 -1254 5465 444 -5489 509 5297 -1553 -4656 2290 3844 -2691 -3184 3068
1298C068n64o035J935N316l100m219L676L357m038k825M690K036n231r58N232
$$ 3068 2504 -3531 -1596 3720 620 -3599 77 3434 -604 -3429 1261 3297 -1934 -2892 2340
1313B340J51m991J85N108p01n267J571M938k243m319K471M024k827l832L570L185
$$ 2340 2491 -2500 -2315 2793 2092 -3175 -1604 3334 1091 -3228 -757 3267 440 -3392 178 3363
1329C363m225k180M422J381m585p90N102k00n522J583N346k718m968L510M812
$$ 3363 -862 -3042 1380 2761 -1824 -2614 2488 2288 -3234 -1651 3695 977 -3991 -481 4331
1344D331m490m531N729L636o624k422O971J413p236m11P631j080p575K814O779
$$ 4331 -159 -4690 1039 4675 -1949 -4371 2600 4013 -3223 -3634 3997 2917 -4658 -1844 4935
1359D935m133n791N177M887o379l671P615J814q217J41Q211j757q128L350P929
$$ 4935 802 -4989 188 5075 -1304 -4975 2640 4454 -3763 -3622 4589 2832 -5296 -1946 5983
1374E983n204p113O903N644p961m097Q592K637r181q54R462j349q945L347P866
$$ 5983 779 -6334 569 6213 -1748 -5845 2747 5384 -3797 -4651 4811 3462 -5483 -2136 5730
1389E730m843o766O237N523p689l705Q700J528q916L70Q768j982q565L730P982
$$ 5730 887 -5879 358 5881 -1808 -5513 3187 4715 -4201 -3831 4937 2955 -5610 -1880 6102
1404F102n481o700O684N125p236l762P653K339p982n91P786j191o984K500O062
$$ 6102 621 -6079 605 5730 -1506 -5268 2385 4724 -3258 -3849 3937 2746 -4238 -1738 4324
1419D324l495n252M570M222n564k793O008J447o048m47O092n03o113J645N748
$$ 4324 829 -4423 147 4369 -1195 -3988 2020 3467 -2581 -3028 3064 2561 -3552 -1907 3841
1434C841k646m997L157M332l482l855L975L143m386k126M354J299m125p85M150
$$ 3841 1195 -3802 -645 3687 205 -3650 325 3468 -918 -3044 1310 2609 -1516 -2301 1849
1449A849J69m251P24L999j476l570J889L404k343l402L097L092l795k512M117
$$ 1849 2018 -2233 -1509 2490 1014 -2556 -667 2737 394 -3008 89 3181 -614 -3126 991
1464I91K113m420j841M962J264n464l15N490n14n328J187N289k061n148L266M489
$$ 991 3104 -1316 -3157 1805 3069 -2395 -2710 2780 2266 -3062 -1875 3414 1353 -3795 -529 3960
1480C960m327l477N008K531n628j571O366K02o832J463O693k880o286M050N883
$$ 3960 -367 -3844 1164 3695 -1933 -3504 2862 3064 -3768 -2305 4388 1508 -4778 -728 5155
1495E155n342n174O681L864p538k296P818R00p973N74P992k364p483M134O358
$$ 5155 -187 -5361 1320 5184 -2354 -4650 3168 4068 -3905 -3331 4661 2297 -5186 -1052 5306
1510E306n476n052O465L791p439k255Q213L22q327J515P945k994p414M352O767
$$ 5306 -170 -5222 1243 5034 -2405 -4660 3553 3875 -4452 -2937 5008 2014 -5400 -1048 5719
1525E719n786n597O903M007p400k469P541J088p630M77P416k208o631L654N494
$$ 5719 -67 -5664 1239 5246 -2154 -4623 2918 4006 -3624 -3147 4269 2061 -4570 -916 4578
1540D578m622m462N502L357o354j922O809L58o693Q94O371j877o101K941N569
$$ 4578 -44 -4506 996 4353 -2001 -3923 2886 3244 -3449 -2555 3816 1939 -4162 -1221 4348
1555D348l991m569M575L531m807k662M972J810n163p01N014l75m499J080M052
$$ 4348 357 -4212 363 3894 -913 -3575 1397 3207 -1956 -2657 2357 1982 -2517 -1437 2615
1570B615j595l803K302L387k977k733L313K192l457j926L780J596m218r70M348
$$ 2615 1020 -2783 -481 2906 -71 -2804 509 2701 -756 -2682 1098 2694 -1524 -2494 1854
1585A854L85m272n4M352l62m540J108M423j909l976K475L551k965l260L771K608
$$ 1854 2239 -2033 -2087 2265 1903 -2637 -1529 2894 985 -2991 -516 3035 70 -3190 581 3189
1601C189m559j573M985N48n204L57N487j422n658K778N343l985m684M845M010
$$ 3189 -1370 -2943 2042 2590 -2614 -2257 3230 1808 -3850 -1072 4271 286 -4398 447 4457
1616D457n635l255O508K081p078o15P138q04o854K024O562l432n957M904M811
$$ 4457 -1178 -4433 2075 4156 -2922 -3537 3601 2797 -4057 -2033 4529 1097 -4860 44 4855
1631D855o054l381O758K018p307o01P739j094p728K857P138m292o297N429N381
$$ 4855 -1199 -4580 2178 4196 -3111 -3712 4027 2933 -4795 -1938 5200 908 -5389 40 5421
1646E421o507m153P442K494p829p43P682p83p372K273O889l879n933N321M508
$$ 5421 -1086 -5239 2203 4697 -3132 -3875 3807 3024 -4348 -2075 4814 935 -4998 323 4831
1661D831o225l062O767J756p262k54P466j442p068K868O282l874n492M719M638
$$ 4831 -1394 -4456 2311 4067 -3195 -3449 4017 2575 -4493 -1625 4657 783 -4709 10 4648
1676D648n573l403O076J950o029p32N768k67n550J381N112k522m260L304L323
$$ 4648 -925 -4328 1748 3698 -2331 -3063 2705 2438 -3112 -1731 3381 859 -3401 -97 3226
1691C226l679k630M067J975m500j090M634J71m362L57M165p36m146J340L887j933
$$ 3226 -453 -3083 984 2959 -1541 -2631 2003 2174 -2188 -1831 2334 1598 -2548 -1208 2679 746
1707G46l349K219K857k342k586K666K208l087j539L235R07l232m83L365L7l647
$$ 746 -2603 -384 2473 131 -2455 211 2419 -668 -2207 1028 1935 -1297 -1780 1585 1622 -2025
1723b025P13L680j485l460K009L319k487l296L233K990l972k337M384J703m629
$$ -2025 -1312 2368 883 -2577 -568 2751 264 -3032 201 3191 -781 -3118 1266 2969 -1660
1738a660j162M995M05n291O71N178j732m734K567M294l423l793M436K880n280
$$ -1660 -2822 2173 2578 -2713 -2042 3136 1404 -3330 -763 3531 108 -3685 751 3631 -1649
1753a649j664N709M76n882N87O062j853n971L250N382m414m479N208L563n896
$$ -1649 -3313 2396 2872 -3010 -2423 3639 1786 -4185 -935 4447 33 -4446 762 4325 -1571
1768a571k516O529J114o769M59O477j826n934K986N360m230m462N403L136o139
$$ -1571 -4087 2442 3556 -3213 -2754 3723 1897 -4037 -1051 4309 79 -4383 1020 4156 -1983
1783a983j678O384M28o513P99O541k200o122L514N213m357m265M918L374n484
$$ -1983 -3661 2723 3151 -3362 -2563 3978 1778 -4344 -830 4383 26 -4239 679 4053 -1431
1798a431k269N880Q84n770L90N274j300m852K194M380l202l536L963K479m266
$$ -1431 -3700 2180 3064 -2706 -2316 2958 1658 -3194 -1000 3380 178 -3358 605 3084 -1182
1813a182j592M393R13m617n8M664r06m294J599L755j928l427K337L040k829k364
$$ -1182 -2774 1619 2532 -2085 -2143 2521 1615 -2679 -1080 2675 747 -2680 -343 2697 -132 -2496
1829b496L070J584k950j126K907P65l031j91L030m86k706Q42K463j032k511J444
$$ -2496 574 2158 -792 -1918 989 1754 -1277 -1468 1562 1076 -1630 -788 1675 643 -1868 -424
1845d24K479j994k164K290J888k417j838K747J726l257j251L530O96l550l13L667
$$ -424 2055 61 -2103 187 2075 -342 -2180 567 2293 -964 -2215 1315 2011 -1539 -1852 1815
1861A815j11l883Q80L838j762l415K420K924k956k538L680J903m433q62M773k08
$$ 1815 1704 -2179 -1299 2539 777 -2638 -218 2706 -250 -2788 892 2795 -1638 -2500 2273 2065
1877B065m791J062M823j966m791L118M311m160l430M787K527n190j696N666N47
$$ 2065 -2726 -1664 3159 1193 -3598 -480 3831 -329 -3759 1028 3555 -1635 -3331 2335 2882
1892B882n909Q60N632k129n025L104M414m060l673N092K505n770j129N957n9n953
$$ 2882 -3027 -2167 3465 1336 -3689 -585 3829 -231 -3904 1188 3693 -2077 -3206 2751 2692 -3261
1908c261J136N903k349n549L606M683m464l668M957K733n400j703N762L55n690
$$ -3261 -2125 3778 1429 -4120 -514 4169 -295 -3963 994 3727 -1673 -3376 2386 2741 -2949
1923b949J003N152k020m553K852M010l790l176M607J992m937q71M909N4m936Q09
$$ -2949 -1946 3206 1186 -3367 -515 3495 -295 -3471 1136 3128 -1809 -2680 2229 2283 -2653 -1844
1939a844M886j854m379K688L570l079k899L333K335l691j534L879N61l625J67
$$ -1844 3042 1188 -3191 -503 3067 -12 -2911 422 2757 -934 -2468 1411 1972 -1653 -1486
1954a486L254o05l067J122K857j764k354K154J777k211j489K300J349k639r31
$$ -1486 1768 1163 -1904 -782 2075 311 -2043 111 1888 -323 -1812 488 1837 -802 -1733
1969a733K783M44k630k25K520J51k675J73K751o72k494R69K224j088k191J444
$$ -1733 1050 1494 -1136 -1361 1159 1310 -1365 -1192 1559 887 -1607 -638 1586 498 -1693 -249
1985b49K101k023j649K400J106k544p40K774L90l199L08L382j135l176J674K976
$$ -249 1852 -171 -1820 580 1686 -858 -1598 1176 1566 -1633 -1325 2057 922 -2254 -580 2396
2001B396k109k911K774K607l494j899L846J161l942n77M112j13m301J137M074
$$ 2396 287 -2624 150 2757 -737 -2636 1210 2371 -1571 -2148 1964 1851 -2450 -1313 2761
2016B761k151l470K810K896l365k398M097J573m671m27M778n86m605J350M511
$$ 2761 610 -2860 -50 2846 -519 -2917 1180 2753 -1918 -2345 2433 1847 -2758 -1408 3103
2031C103k213m268L236L561l994k584M298J745m507r56M767j22m753J349M230
$$ 3103 890 -3378 -142 3419 -575 -3159 1139 2884 -1623 -2579 2188 2066 -2687 -1338 2892
2046B892k276l545K892K984l558k307M252J252m532j49M354o20m173J289M034
$$ 2892 616 -2929 -37 2947 -611 -2918 1334 2586 -1946 -2095 2259 1639 -2534 -1245 2789
2061B789k116l583K886K736l186j960L253J381l384p32L506j76l210R18K685j263
$$ 2789 673 -2910 -24 2712 -474 -2434 819 2200 -1184 -1916 1590 1414 -1796 -878 1807 544
2077E44k333J572K089k068j598K416R21k358n08K232L28k325j0K369m73k091P31
$$ 544 -1789 -217 1872 -196 -1794 622 1543 -815 -1323 909 1237 -1088 -1098 1271 798 -1293 -562
2094e62J720o88j627P65J613j084j303J247R06j122q00J128P97j385n57J599J48
$$ -562 1158 470 -1157 -392 1221 137 -1166 81 987 -135 -935 193 990 -395 -952 647 795
2111G95j540M3J529q4j786L67K013q93j890J224J715j351j762J652J785k204j407
$$ 795 -745 -702 827 743 -1043 -676 1337 444 -1446 -222 1493 142 -1620 32 1817 -387 -1794
2128a794K547Q63k579n18K660K02k932M67K957j292k578J832K155k178j898K729
$$ -1794 753 1616 -963 -1481 1179 1381 -1551 -1084 1873 581 -1997 -165 1990 -188 -2086 643
2144F43J455l345o11L571k41l443Q13L382j379l349K195K972k946k195L263J482
$$ 643 2098 -1247 -1858 1713 1472 -1971 -1158 2224 845 -2504 -309 2663 -283 -2478 785 2267
2160B267l395r43L648J82l800Q43L491j702k901K183K466k666k058L319J283l716
$$ 2267 -1128 -2071 1577 1759 -2041 -1198 2293 591 -2310 -127 2339 -327 -2385 934 2217 -1499
2176a499l17L635l82l449Q73L387j513l183K276K527k679j784K718J310k843q34
$$ -1499 -1816 1819 1437 -2012 -1139 2248 735 -2448 -172 2355 -324 -2108 610 1920 -923 -1757
2192a757L076N5k981P42K519j165k124J447J928j892j567K356Q87k425l30K247
$$ -1757 1319 1374 -1607 -865 1654 489 -1635 -188 1740 -152 -1719 637 1524 -901 -1231 1016
2208A016P5k234J80K328p13k062J106J572j132j296J110J219j330r37J507M50
$$ 1016 1091 -1143 -963 1365 652 -1410 -304 1268 136 -1160 -50 1169 -161 -1098 409 859
2224H59j350j83J140J89j226n1J368l14j240N23J043m66j119N15J335q83j242
$$ 859 -491 -674 466 655 -571 -622 746 432 -808 -285 758 292 -827 -312 1023 140 -1102
2241a102J144J018j143j000J222J095j576r04J888M43j860j53J808pj962L82K047
$$ -1102 42 1060 -83 -1083 139 1234 -342 -1246 642 1085 -775 -928 880 873 -1089 -707 1340
2258A340r97j781J448J374j636j162J919R38k389l71K644l26k506P67K368j079
$$ 1340 343 -1438 10 1384 -252 -1414 505 1443 -946 -1317 1327 1001 -1505 -738 1630 551
2274E51k395J628K197k241j628K536J016k559o17K700J56k897O12K754j372k275
$$ 551 -1844 -216 1981 -260 -1888 648 1664 -895 -1512 1188 1344 -1553 -941 1813 441 -1834
2290a834J789J866k080j609K575J087l006k76L001l77k782P57K692j214k602J877
$$ -1834 -45 1821 -259 -1868 707 1794 -1212 -1488 1513 1136 -1646 -889 1803 589 -2013 -136
2306a36K103k322j405K375R07k372n42K545n0k569Q25K153j276j688J466J451
$$ -136 1967 -355 -1760 615 1522 -850 -1392 1153 1103 -1466 -641 1512 236 -1452 14 1465
2322A465j765j171K177N81k286M0K045l37j877N08J889q99j684J301J171j352
$$ 1465 -300 -1471 706 1287 -999 -959 1086 749 -1128 -620 1269 370 -1314 -13 1158 -194
2338a94p59J194O42j260m29J402l2j220L56Q55l36p61L19Q47n62p17P57M17o39
$$ -194 -953 241 883 -377 -806 596 564 -656 -300 555 219 -542 -223 624 62 -655 102 519 -120
2357a20l48M93N17o21n29Q21K99p05k39N62M31p23m37R42J82r14NP46M3q28J9
$$ -120 -468 25 542 -79 -608 213 512 -193 -432 130 561 -162 -599 343 525 -389 -384 362 405 -423 -404
2378d04J028l93r42P12O47p56n66Q28O26j178m02J467l2j448L07J347l81j470
$$ -404 624 231 -711 1 648 -108 -674 154 780 -398 -800 667 635 -813 -506 841 460 -1010
2396a010O62J537j144j252J433Q58j446o63J541N02j829k6J895n60j603Q78J360
$$ -1010 -348 1189 45 -1207 226 1084 -362 -1025 516 1018 -811 -837 1058 498 -1105 -227 1133
2413A133j044j310J425J098j857n91K009O0j872J86J843m38j925R20J723j385
$$ 1133 89 -1221 204 1302 -555 -1146 863 923 -949 -763 1080 642 -1283 -363 1360 -25
2429b5j230J505Q42j479o84J689L12j833K79J636p14j287Q53J140j029j061J414
$$ -25 -1255 250 1092 -387 -1071 618 930 -903 -624 1012 298 -989 -136 1004 -25 -1086 328
2446C28O87j613k04J471l7j329J21J391l71j381P62J038q77o96P55O23p76n72
$$ 328 1015 -598 -802 669 632 -697 -576 815 444 -937 -175 863 -14 -710 45 668 -108 -680
2464f80R97K25r80J14P16j51n94Q6P21l05o89N52M25n13k93L57M09m18m69O22
$$ -680 317 542 -438 -324 392 241 -353 -267 454 149 -540 12 437 -76 -369 -12 397 -21 -490 132
2484A32K79n79j43M09K67m37l67O46J92o92K6M95M7n03j13P40j50p57M25N73n02
$$ 132 411 -168 -311 98 365 -72 -439 207 399 -293 -267 228 275 -228 -341 399 249 -508 -83 490 -12
2505a2m65M92N92p69n39J104J88j150Q2J048j06j160K53J330o50j227R98Q85j048
$$ -12 -477 15 607 -162 -701 403 591 -559 -477 571 465 -695 -442 888 238 -989 9 894 -154
2524a54p05J095O59j370l61J569j43j428M91J211o13j196Q82J141j307p84J537
$$ -154 -859 236 895 -475 -836 733 590 -838 -347 864 251 -945 -63 1078 -229 -1013 524
2541E24L34j482j13J453l0j609M28J563q79j235J066R06j079p89J254N82j480
$$ 524 858 -624 -737 716 686 -923 -495 1068 189 -1046 20 926 -153 -942 312 894 -586
2558e86j24J457l15j216M79J109o17j110R57R08j260m87J240K31j137j67J236
$$ -586 -710 747 432 -784 -305 804 187 -923 34 942 -318 -805 435 666 -471 -638 598
2575E98k9j315M03J116o33q04O01O92o25o61Q41M22r41o5P73p9o27M1O96j99p28
$$ 598 569 -746 -343 773 140 -664 -63 629 4 -657 184 606 -335 -400 373 294 -333 -292 404 205 -523
2596e23M75N05n37k89M05L15l91l74N64K12n77j9L79Q1l04k10M56J11n07O1L60
$$ -523 -48 457 -80 -369 36 351 -40 -414 150 362 -215 -234 145 226 -78 -288 168 279 -228 -167 193
2617A93m7k81q5M55j7n58K71M13l28l17K63M19l90m83O71K87p82o4P00O0p42o2
$$ 193 146 -135 -220 235 218 -340 -69 344 16 -301 -38 381 -9 -492 179 466 -316 -380 320 380 -362 -424
2639d24R37j99r66M99P60n74o19N64O52p56n42R89K17r94P2Q57j32q84K64R73
$$ -424 513 314 -652 -153 607 33 -586 -22 630 -126 -668 321 538 -456 -384 473 341 -543 -279 694
2659F94n97q40Q81N35q95l82Q84L55j067j45J199k26j065M44Q46m58q25N95Q02
$$ 694 97 -743 138 673 -222 -604 280 635 -432 -577 622 396 -669 -225 621 163 -662 -67 735
2678G35q89n37J015J93r12n4Q70j0r90K68J002o20p30P02N41o79m99P71M48r74
$$ 735 -154 -691 324 517 -395 -449 421 411 -579 -311 691 71 -659 43 584 -95 -594 177 625 -349
2698c49j59R56j06p54J44O83j40p68L63O70n57m07N29K49m43k83N27K21o68L4
$$ -349 -508 448 342 -412 -268 415 275 -493 -130 540 -17 -424 105 354 -89 -372 155 376 -292 -258
2718b58N70j69m13J01M35q7n62K76M98m06l05L15K90k49m00M03L52n46j56M69
$$ -258 312 143 -270 -169 266 179 -383 -107 391 -15 -320 -5 285 36 -364 39 391 -155 -311 158
2738A58R8l93j80N20J17o60J31N91k62m55K17N10k85n96N29M64o80k51O39K06
$$ 158 256 -137 -317 203 320 -340 -209 382 120 -335 -118 392 107 -489 40 504 -176 -427 212 418
2758D18o62k15Q14N5r27K36P98l61o69L61P02m93p04P72M59q59k14Q05J28q29
$$ 418 -244 -459 355 410 -517 -281 517 156 -513 -152 550 57 -647 125 584 -275 -489 316 444 -385
2778c85m5R79k24r90N51P70o51o25O69O26q54n06J078J99j085N5R73j54r60K78
$$ -385 -430 549 325 -665 -114 656 5 -620 49 675 -179 -685 393 592 -493 -438 535 381 -579 -301
2798c01J001n62q74Q04N91q41m09Q35L56j001j63J101j70r86L79Q19m20q03N48
$$ -301 700 138 -736 68 659 -182 -591 244 600 -401 -564 537 367 -619 -240 579 159 -644 -96
2817i6Q03q02n86R27L15q61j87Q33J50r45O4R64l58p73M73N89m58n83N55N62p84
$$ -96 707 -95 -681 246 561 -300 -487 346 496 -449 -385 579 221 -552 -79 510 52 -531 24 586 -198
2838a98l31Q44Q2p34l2P23Pq26J96Q08m27o18M51N22m49n46N78M85p44k60P29
$$ -198 -529 315 397 -337 -369 354 361 -465 -269 539 112 -506 -55 467 18 -528 50 535 -209 -469 260
2859B60Q5o29o8O66K6p75K03P33l92n59M07N00m13n53N88M56p48k16P08J02o73
$$ 260 345 -284 -352 314 340 -435 -232 501 109 -450 -43 457 44 -509 79 535 -213 -429 279 381 -292
2880b92j10P70Jq53K40P65m14o11M17N89m88n97P03M43q44j88P94P5p71l7Q84
$$ -292 -402 368 369 -484 -244 521 107 -504 -87 502 14 -583 120 563 -281 -469 325 400 -371 -408 476
2901D76j44r39M27Q07n86o33O01O04p21n57R51L05j004n6R28o0r08J55R77l91
$$ 476 332 -607 -180 627 41 -592 9 613 -108 -665 286 591 -413 -469 459 399 -509 -354 623 232
2921B32r29O59P22p79n25P77M77r16l55J075P1j086J95R60k97r22M12R26o46q09
$$ 232 -697 -38 684 -95 -620 157 634 -282 -637 438 509 -577 -382 578 281 -641 -229 697 51 -758
2941g58Q69N54r04l67Q95L02j010j14J118k04j014M28Q34m91q00O18P69q43n77
$$ -758 111 665 -239 -606 289 591 -419 -533 585 381 -633 -205 629 138 -662 -44 725 -118 -695
2960f95J000K85r53j41R24O7j020J41J039m22q77N54P14o04o45O97N88r05l51
$$ -695 305 590 -363 -504 420 487 -533 -392 647 225 -652 -98 616 12 -633 64 652 -253 -604
2979f04R73R1q66jQ34p2r03K85Q85n16o99N92N64o06n38P36M58q99k00Q73Jp83
$$ -604 369 460 -406 -407 427 355 -548 -263 622 106 -593 -1 563 -43 -581 155 613 -286 -486 387 388 -395
3001c95M8P86j22q58L40P90n53n89N83M79n90m74P38L61q82j24Q51l9p81P6Q26
$$ -395 -347 439 317 -541 -201 589 36 -553 30 509 -81 -555 183 544 -338 -462 389 350 -431 -355 471
3022D71j77r00M31P94o02o08O16N38o62n11Q37L48r64n8Q91o2q51J28R02l00r19
$$ 471 294 -606 -175 619 17 -591 25 563 -99 -610 227 575 -389 -447 444 382 -469 -341 561 261 -658
3043f58N66P57p14n72P44N04q39m18J002K00j091Q6R92k22r42L17R59n22r05P86
$$ -658 -92 665 -49 -621 123 627 -212 -630 372 572 -519 -433 559 337 -605 -288 671 149 -756 30
3063C0O85q93m73Q92L83r95k28J140o9j138L70R60m76q93N92Q82q31p32J053M53
$$ 30 715 -178 -651 241 624 -371 -599 541 472 -666 -296 664 188 -705 -113 769 -62 -794 259 712
3083G12j081k35J041J26j120Q4J165l78j056O10Q31o76p32P89O44r92m21J102
$$ 712 -369 -604 437 563 -557 -473 692 314 -742 -132 699 23 -709 80 724 -268 -689 413
3101D13J19j048O1R94j78j015L74J004o47q19P97O11q12m95Q71M12j027j61J047
$$ 413 532 -516 -455 539 361 -654 -280 724 77 -742 55 666 -146 -641 230 642 -385 -546 501
3120E01q8r43K28Q48l02q49M80P88o97n87P70M06p54l40Q26K34r52PR17j86q37
$$ 501 413 -530 -302 546 244 -605 -125 663 -34 -621 149 555 -199 -539 287 521 -431 -424 493 307 -530
3141e30K94P68l51p90N32O88o93n03P28L74p14l25Q05J96q94M4Q61k07p56K72
$$ -530 -236 532 181 -609 -77 611 -82 -585 143 517 -197 -522 283 479 -415 -371 490 283 -473 -201
3161b01P34l76p55N75O61p35m74P72L53q18k93R48J34j044J25R51k83q64L58Q66
$$ -201 533 157 -598 -23 638 -97 -571 201 554 -264 -557 391 525 -519 -394 557 274 -590 -232 634
3181F34n04q40P41O59q91m28R06L05r68j75J081n3j121L52R98n37q80O49Q32q14
$$ 634 130 -710 31 690 -201 -629 277 582 -386 -561 520 467 -654 -302 696 159 -721 -72 760 -54
3201e4p32J045M78j134k18J094P2j126J13J174l94j094O60Q83p89p03Q61N99j033
$$ -54 -786 259 737 -397 -615 479 551 -575 -462 712 318 -776 -116 767 -22 -725 136 735 -298
3220b98m08J185Q2j160J65J073l15j053M95J013p39q57R56N84r75m21J009L04
$$ -298 -706 479 561 -599 -434 639 324 -729 -234 779 40 -817 139 723 -252 -673 336 640
3238F40j108p4J159k43j023M21Q81n28p95O71O95q60m91R76K31r27j01R25k1r68
$$ 640 -468 -542 617 374 -649 -228 653 125 -670 1 696 -164 -655 321 552 -375 -476 449 428 -540
3258e40K14R55m60p86N48O49n79o01O90M92q18k85Q43Q1p56j5P45o4p95K65P36
$$ -540 -326 629 169 -617 -69 580 1 -600 90 582 -236 -521 322 403 -353 -368 377 313 -482 -217 519
3279E19m44n84M99N01n22m80O45L95p71k12P82P1p38l3P85o9q28K36P80l96o70
$$ 519 75 -509 -10 491 -31 -511 134 529 -242 -454 328 399 -339 -372 413 344 -484 -248 532 136 -534
3300e34M77N89n32n62O80M39q16k20Q11P1q00J0Q60j69r08M24P89n77o61O53N92
$$ -534 -57 532 0 -562 118 557 -259 -479 332 403 -397 -387 473 304 -604 -180 609 32 -629 24 616
3321F16p47n39R35L32j012p8R83q8r43K10R64m20r08O56P37q01n40Q56L97r51
$$ 616 -131 -670 265 597 -415 -493 490 402 -541 -331 633 213 -695 -39 698 -103 -643 213 610 -341
3341c41k44J077j5j094K82R83m54q97N87Q46p72p17R70M73j035k38R96J04j032
$$ -341 -585 492 477 -617 -335 648 194 -703 -116 730 -42 -759 211 684 -351 -589 407 511 -521
3360e21P5J071l50r44N59P46o44o26P45N25r03l11R94O1r54J30Q78k49q54L81
$$ -521 -446 625 275 -669 -110 636 -8 -634 111 636 -267 -578 416 477 -477 -347 531 282 -572 -191
3380a91Q30n90o67P14M72p26l63P33K74q15j00Q28j24p20K31O34k92o08M23N54
$$ -191 639 49 -618 96 568 -158 -521 212 486 -329 -429 399 275 -445 -214 420 128 -480 -57 497
3400D97n67m14O33K54o04j92O27J49p10J0P02j51o31K12N77k28o00L55N44m87
$$ 497 -70 -484 149 403 -201 -393 234 383 -327 -317 385 234 -397 -185 392 164 -436 -81 463 -24
3420b4l99N10K97m98k78N75J89o57k1O54j25n95J81N77k51o08M11N61n72m33O38
$$ -24 -423 87 384 -114 -392 183 372 -285 -306 348 223 -372 -191 386 135 -473 -62 499 -73 -506 132
3441A32L18o51k82P55J71q44L7Q07j82p40K81P17l97o95N95N56p36l64P68K33
$$ 132 450 -201 -483 272 443 -401 -364 443 261 -479 -198 519 122 -573 22 578 -158 -522 246 479
3461D79q35q4R01r5r38L34Q54n17p36O22O51p42n62R11L50r82j16R53m1r25J86
$$ 479 -356 -440 461 366 -572 -238 616 99 -637 -15 636 -106 -668 243 593 -389 -505 448 407 -518 -332
3482c32R09l96q31O11O58p31m52P60L51q80j77R63o6r30K73Q40m00p60N16P06
$$ -332 577 181 -650 -39 619 -112 -564 196 547 -333 -510 453 387 -543 -270 570 170 -590 -74 632
3502F32o72n76Q08L50q11j91P85Q3q11O7Q18k88p15M24N75m90m62N48L98o74k40
$$ 632 -40 -616 192 542 -269 -460 325 408 -403 -336 482 194 -521 -97 478 -12 -474 74 472 -202 -442
3523d42P19O6o76M2O37j06o50K17O27l51n18M28M00m19l56M51L10n29j75N47L7
$$ -442 277 343 -333 -291 346 240 -410 -193 434 83 -435 -7 393 -26 -382 69 379 -150 -325 222 259
3544B59m85K1M65n5n07J84M77l13l81L42L23l71l22M40K89n45j70N68N8n31l8
$$ 259 -226 -205 260 205 -302 -118 359 46 -335 7 330 -41 -363 77 366 -179 -349 219 277 -254 -292
3565b92N65j3o23J65N81k90m89L45M37l99m05N11L21o30j55O52K0o30P1O59k02
$$ -292 273 260 -363 -198 383 93 -396 -51 386 -13 -418 93 414 -216 -371 281 301 -329 -258 401 199
3586A99o74L76O08n24m84N87M04o62l24P64J70q21L5P74j75p05K76O70m26o10
$$ 199 -475 -99 509 -15 -499 88 492 -170 -494 270 440 -381 -346 428 253 -452 -176 494 68 -542
3606e42O01M56p16k67P38J31p59j3Q11j64q07L83O97n05n69N72N00o71m01P83
$$ -542 59 515 -201 -468 270 401 -358 -371 440 276 -531 -148 549 44 -525 47 547 -124 -525 258
3626B58J97p79j9P19r7p02K13O87l77n98N39M08n85k74N90J97o56o8P12j22o52
$$ 258 455 -324 -343 376 279 -423 -210 477 100 -498 41 449 -136 -410 180 377 -279 -347 365 243 -409
3647d09K56N41k97n09L65M68m72l40N18K08n07j06M75O5n06N2M82j69l91K28L06
$$ -409 -153 388 91 -418 -53 415 -57 -397 121 329 -178 -284 191 256 -250 -198 284 115 -276 -48 258
3668B58k34l02K99K82l82j83M04Q6l82o7L80N5m24PM29r4l76J20L61j37l69J95
$$ 258 24 -278 21 303 -79 -262 142 228 -154 -221 159 214 -210 -203 226 132 -244 -124 237 100 -269 -74
3690g4L60k91k72L20K05l21j72L53J38m33j9M42r1m08J57L96k04m28L18L88m20
$$ -74 286 -5 -277 43 248 -73 -245 108 246 -187 -206 236 145 -263 -106 290 86 -342 -24 364 -56
3711e6k88M69K15m84j59N23Q8o04P0N72k05m90K63M44l44m18M73L06n60j51N75
$$ -56 -344 125 340 -144 -303 220 308 -296 -226 346 141 -349 -86 358 14 -404 69 375 -185 -336 239
3732B39K9n64M6O16j91o18L59N33m77l88N00L37n66k56O52R2o71O8O08j85n20
$$ 239 268 -296 -250 366 175 -443 -84 449 -28 -416 84 421 -145 -401 251 343 -328 -260 348 163 -357
3753c57K38N08l76m22N03K78n48j32N34M4n54N2N71j88n33L21M20l65l42L84L01
$$ -357 -119 389 13 -409 94 372 -176 -308 226 270 -284 -232 339 151 -382 -61 359 -6 -348 36 337
3774C37m54k20N12P3m78M0L97o7l92J55L74k55k90L19J91l13j36L19J03l61l9
$$ 337 -117 -337 175 248 -230 -190 207 140 -252 -97 277 22 -268 51 242 -71 -207 112 215 -146 -185
3795a85L92p9l44J24K86j11k91J59K66k17k08K22J56k05j13J87J13k43n5K65k7
$$ -185 207 128 -216 -92 194 83 -208 -49 217 0 -208 14 170 -35 -148 39 152 -91 -146 119 92
3816I2k18N1J77l7k20R5K33j81j64K06J20j82j55K23J55k92p8L24nk83K4K74k6
$$ 92 -126 -75 102 65 -155 -60 173 -8 -172 34 154 -28 -183 40 195 -97 -175 149 144 -139 -115 159 133
3839A33l32J16L15k07k39K35J85k60j54L00J05l76PL82j15l24J46L30j99l38K97
$$ 133 -199 -83 232 25 -214 21 206 -54 -208 92 197 -179 -172 210 95 -229 -83 247 48 -290 7
3860GK83l91j64L86R2l70n8M15k1m29J49L64k35k63K49K33k96j89L86Q5m20N1
$$ 7 290 -101 -265 121 213 -157 -215 200 179 -250 -101 263 28 -235 14 247 -49 -238 148 233 -187 -136
3882a36L77j25l48J52L56k43l24L43K23l74j29L45Q1l54m6L94p9l41J72K57j94
$$ -136 241 116 -232 -80 276 33 -291 52 275 -99 -228 117 198 -156 -202 192 113 -228 -56 201 7
3903Gj98K14J71k73j12L27Kk99P6K55r8k46J24K61k02k09K56J13k26p9K11O7k41
$$ 7 -191 23 194 -79 -191 136 138 -161 -85 170 72 -174 -50 211 9 -200 56 169 -57 -136 75 142 -99
3926i9kK22p1j56R4J11q4j11R1J12j57m3J72k8j28J5J11J3j63L8J73r6j24R1R2
$$ -99 -101 121 50 -106 -12 99 15 -96 -5 107 -50 -93 79 51 -77 -62 49 62 -101 -63 110 14 -110 -19 73
3951G3m6j13O3J33j14p4J15K1n8m2N9P8j37j3J50o3q4K4J00l6j46J01J34j60p1
$$ 73 27 -86 -23 110 -4 -78 37 58 0 -42 17 95 -42 -55 95 32 -52 -28 72 36 -110 -9 125 -35 -106
3976a06J53N0j44o9J86N0k28J0K13o6j61O5J44o2j83J60J30k10l0J87%j77PK11
$$ -106 47 97 -47 -116 70 120 -108 -98 115 49 -112 -47 97 35 -148 12 142 -68 -98 89 89 -88 -81 130
4000A30m5k45J61J81j98j27J98J14k12j21K71M5l01N1K43q1k07R1J94j33j94K37
$$ 130 85 -160 1 182 -16 -143 55 169 -43 -164 107 152 -149 -98 145 64 -143 -52 142 9 -185 52
4022E2P6k37MJ96lk10L3K51j18k34K06J44j99j01J83J09k41o6K74j7k36P8J79
$$ 52 128 -109 -105 91 88 -122 -89 162 44 -190 16 160 -39 -140 43 152 -89 -155 119 102 -134 -56 123
4045A23q1j65R5J83j69j17K10Rj67J7J43Kj95M9K16j48j54J68Q0j21j13J45J22
$$ 123 42 -123 -28 155 -14 -131 79 88 -79 -62 81 83 -112 -63 153 5 -149 19 99 -22 -135 10 132
4068A32k01m5J96j8j34RJ24J2j57M5J55j19p3J09L1o1p4R3P0j57kJ56m0j14J7
$$ 132 -69 -114 82 64 -70 -61 63 75 -82 -37 118 -1 -74 35 66 5 -69 24 94 -63 -65 91 51 -63 -46
4093d6J25mj75O5J61j27j01J05Q8o9j39J25J11j84l3J65rj34qJ57j4k03J13J69
$$ -46 79 75 -100 -35 126 -1 -102 3 91 22 -117 8 119 -65 -98 67 58 -76 -84 73 59 -144 -31 138
4117A38j58j13J65J00j65j20K43O3k74J6K59o7k19O1K37j03k64K14J82k69o7K10
$$ 138 -20 -133 32 132 -33 -153 90 153 -121 -105 154 87 -132 -71 166 63 -201 13 195 -74 -141 69
4139F9O3k20n5K89n4k87J46K36j80j98J95J99k60j79L47N2l25L2K73l7k77O1L12
$$ 69 132 -88 -143 146 92 -195 -49 187 7 -191 4 203 -57 -236 111 163 -162 -130 143 106 -171 -110 202
4162B02j61k73K63J56k50j02K43J03k88l8L33q4k89J50K21j57k10J74K17k66j53
$$ 202 41 -232 31 187 -63 -165 78 181 -107 -145 188 104 -185 -35 186 29 -181 -7 210 -56 -209
4183b09L14M4k65k3K36L2k93M7K94j48k01J71J38j51j45J86J48k54n5K52k7k07
$$ -209 105 149 -116 -139 97 129 -164 -117 177 29 -172 -1 137 -14 -159 27 175 -79 -134 118 91 -116
4205a16L8J96k8k46J06K34j74j62J77J23j65j34J94J28k58l9K39k3j85KK11j8
$$ -116 -78 118 90 -156 -50 184 10 -152 25 148 -17 -151 43 171 -87 -126 113 90 -95 -93 118 100
4227A00k52R5K17j74j41J65J21j66j56K55J01l13PK96m8k61M9K77p4l23K02K50
$$ 100 -152 -57 160 -14 -155 10 131 -35 -191 64 165 -148 -141 155 107 -154 -105 172 98 -225 -23 227
4249B27k49j63K35J58k70j42L38M2l53O7L07j20k71J38K84k15k65L23J71l64p8
$$ 227 -22 -185 50 208 -62 -204 134 176 -177 -110 197 77 -194 -56 228 13 -252 71 242 -122 -200
4270b00L26N5l49k1M04q1m07J96L17k39k49K40K59l25j80L95N6l70J4L45n6l36
$$ -200 126 181 -168 -189 215 134 -273 -77 240 1 -248 -8 251 -74 -254 141 197 -173 -159 186 130 -206
4292b06J08L78k44l06L35J92l26j54L29J29l80n6M11p0l54J19L02j40l00J95K92
$$ -206 -98 280 36 -270 65 257 -69 -223 106 235 -145 -201 210 140 -214 -95 207 67 -233 -38 254
4313B54k95j97L17R3k72p5K83N3l38M4L47j49k68J67K12j44k43K13K23k95j21
$$ 254 -41 -238 79 172 -100 -175 108 161 -177 -133 214 65 -203 -36 176 32 -211 2 225 -70 -191
4334a91K94O1k58n9K66O3l34M7L10j26k41J26K09j20k47K08K04k88j24K94N4k60
$$ -191 103 164 -94 -153 113 176 -158 -111 199 73 -168 -42 167 47 -200 8 212 -76 -200 94 148 -112
4356a12q0L14L3l69Q7L28j48k70J72K70j97k95K89K46l60j33L45P0l19o4L88k7
$$ -112 -192 122 155 -214 -127 201 53 -217 -45 225 28 -267 22 268 -92 -225 120 190 -129 -193 195 168
4378A68m23J67L51k39k73K47K64l02k51M11J58m74k2M33m5m12P4M57j84m57L30
$$ 168 -255 -88 263 24 -249 -2 262 -40 -291 120 278 -196 -218 215 170 -242 -168 289 105 -352 -22
4399b2L37l76k45L78J91m03j57N13Lm99J44M15j74l97K13M08l29l40M38K06m53
$$ -22 315 -61 -306 72 263 -140 -297 216 219 -280 -136 279 105 -292 -79 329 0 -340 98 304 -149
4420a49r9M17P1m62J0N06j60m42K51L43k62l07K81L08l94k01M63M4m07OL62k0
$$ -149 -248 169 240 -222 -212 294 134 -308 -57 286 24 -283 -2 306 -88 -289 174 218 -189 -183 179 159
4442A59l97J08M04k46l16L00K24k81k21L18K13m08r5M19nl58L2L39l1l81J26L66
$$ 159 -238 -130 274 28 -288 12 236 -45 -266 52 265 -143 -238 181 176 -182 -150 189 158 -223 -97 269
4464B69k34k69K50K14k39k19K93J75l71o6L73k7l26K6L39n7l89J68L63k65k75
$$ 269 35 -234 16 230 -9 -228 65 240 -131 -197 176 149 -177 -151 188 131 -258 -90 273 8 -267
4485b67K79K32k79k39L60J81m38m8M17k6l76L6M11j09m40K47L90l42k84L62K22
$$ -267 12 244 -35 -274 86 267 -171 -219 198 172 -204 -168 243 134 -306 -59 331 -11 -295 67 289
4506B89l83k12M88J14n50N1N11j55m45J60M69k74m57M22L36m87k05M82J44n09
$$ 289 -94 -306 182 296 -254 -203 308 153 -292 -132 337 63 -394 28 364 -123 -328 154 298 -211
4526b11q9N77n3n75K14M76k89m03L26L95m32l12N50J56n51l2N13k5n36J13N36
$$ -211 -300 277 224 -351 -137 339 50 -353 -27 368 -64 -376 174 330 -221 -253 260 235 -301 -188 348
4547C48k30m95L73L58l93k91M21K58n04j50N55rn33J26M58j67m29K19M33l63l35
$$ 348 118 -377 -4 354 -39 -330 91 349 -155 -305 250 241 -292 -166 292 125 -304 -85 348 -15 -350
4568c50M28K08m12j56M18J21m78k6N19j31m18J77L57j86l51K48L41l55k17L72
$$ -350 78 286 -126 -282 136 257 -221 -247 272 141 -277 -100 257 71 -280 -32 309 -46 -263 109
4588A09J11l41r9L55O9m02K7M12j33l41J51L10j76l21K43L08l39k13L56J35l35
$$ 109 220 -121 -220 135 204 -198 -171 241 108 -233 -82 228 52 -269 -26 282 -57 -270 86 221 -114
4609a14j27L70R0m35K0M35j20l72J45L53j78l81K96L42l93k20M06J49m00j39M91
$$ -114 -241 129 219 -216 -196 239 119 -253 -108 245 67 -314 -18 324 -69 -289 117 266 -134 -273 218
4630B18M4n42J01N15k26m28K46M16l15m23M59L08n35j76N43O6n23j8N62r7n82
$$ 218 262 -280 -179 336 110 -318 -72 344 29 -394 65 373 -162 -338 205 271 -252 -270 292 195 -387
4651c87K80M87l64l97M01L60m87k89N94J52o43K0N79r1n59J73N67l12n13M56L83
$$ -387 -107 380 16 -381 20 380 -107 -396 198 350 -293 -273 306 215 -344 -171 396 84 -429 27 410
4672D10n08k59N04K02n62j04O32o7o03K09N02k59m66L24M43m68l29N43J77n36
$$ 410 -98 -357 147 349 -213 -317 315 248 -355 -146 356 97 -369 -45 398 -70 -399 144 321 -215
4692b15q6N03M6n31O0N48k06m72K91L67k98l25L42L03m36j97M93N5m34%L98j6
$$ -215 -301 202 248 -283 -223 325 119 -353 -62 305 7 -318 24 327 -109 -306 187 242 -192 -192 206 190
4714A90m44J11M41k36l51K86K61k70k68L29K36m02j47M32L7l96pL85rm40J18M10
$$ 190 -254 -143 298 62 -289 -3 258 -12 -280 49 285 -117 -264 168 205 -191 -198 187 178 -262 -144 266
4736B66k09l45K44L02k58l09L51K59m40j37M44O5m21k9M54l3m98J60M78k88l84
$$ 266 57 -288 -44 258 0 -309 42 301 -139 -276 168 233 -188 -217 237 204 -294 -134 344 56 -328
4757c28L19L44l65l21M61K42n55q7N38j0n14O1N52j83n47L23M69m24l63M69K79
$$ -328 -9 335 -30 -351 110 352 -203 -290 248 238 -276 -215 337 154 -393 -70 399 -25 -388 81 360
4778C60n14k23O07Q6o44O7O09j83n57K61N51l71n12N27L56n87k12O01J22o17l3
$$ 360 -154 -377 230 316 -328 -261 348 165 -392 -131 420 49 -463 64 420 -167 -379 222 344 -273 -306
4799c06O71j31o40K86N29l67m52M26M00n19l12O20J29o05kN63o6n64J59N51k92
$$ -306 365 234 -406 -120 409 42 -410 16 416 -103 -415 205 334 -271 -273 290 224 -340 -181 370 78
4820G8m90M09L62m38k69M49K12m99j15N57n2n00J22M57j70m26K40M20l63l20M17
$$ 78 -412 -3 359 -79 -348 101 313 -186 -301 256 204 -296 -174 283 113 -313 -73 347 -16 -336 81
4841H1K03l91j54M08J08m55j4M61j00l94J34L61j57l70K22L38l21k43L29J85l28
$$ 81 284 -107 -261 147 255 -200 -214 247 147 -247 -113 248 91 -279 -57 281 -40 -283 46 231 -97
4862i7j52L51J27m15k4M12n9l78J08L58j20l96K29L52l02k77L30K17l44j94M06
$$ -97 -249 102 229 -186 -210 202 143 -235 -127 231 111 -285 -56 296 -6 -283 47 264 -80 -274 132
4883A32J45m97qM85q8m39J38M39k02m48L19M00m46k69M71J78m79j48N51M3o18
$$ 132 277 -220 -228 257 169 -270 -132 307 105 -343 -24 376 -70 -339 132 310 -169 -317 234 277 -341
4904c41J24N61k27m98K96M73l80m40N07L27n89j59N85P6o00J7O25j57o03L13N02
$$ -341 -217 344 117 -381 -85 388 8 -432 75 402 -187 -346 239 315 -285 -268 357 200 -403 -90 412
4925D12l91m06M28L53n12k70O10J15o37L8N76j12n65K08N48l29m87M42L65n04
$$ 412 21 -385 43 396 -116 -386 224 339 -298 -260 316 204 -361 -153 395 66 -421 21 386 -118
4945a18k37N01J86n59q3N94o7n57J95M66k35m30K92M14m07l08M79J88m79q2M42
$$ -118 -355 146 332 -227 -310 284 217 -340 -145 321 86 -344 -52 362 -45 -353 126 314 -165 -247 195
4966A95M6m79M0N02j65m39K38L37k29l35K84K95l63k11L98J19l85o1L57M3m05
$$ 195 241 -238 -198 304 139 -300 -62 275 46 -289 -5 290 -73 -284 114 233 -152 -213 144 187 -218
4987b18N7L99j38l52J78L00j88l01K44K92l33k11L66J38l66r5L92O4m48K7M64
$$ -218 -161 238 100 -252 -74 226 38 -263 -19 273 -60 -271 95 233 -133 -228 164 228 -220 -193 271
5008B71j48l97J92L78k30l80L17L46m27k35M57J47m65r7N03J9n60J20N27k46m57
$$ 271 123 -274 -82 296 66 -314 3 349 -78 -313 144 291 -174 -271 232 251 -309 -189 338 92 -365
5029c65L13M07l74l73M86K74n65j32N68L1n56M3N83j43n88L08N04m14l98M54L28
$$ -365 -52 355 -19 -392 94 368 -197 -329 239 270 -286 -243 340 197 -391 -83 421 7 -391 63 391
5050C91n20k49O15J01o49N6O07j69n68K49N48l66m81M86L52n46k16N51J34n94
$$ 391 -129 -378 237 338 -311 -255 352 183 -385 -136 412 46 -435 51 403 -143 -359 192 326 -268
$$ [...]
8191b5
##END NTUPLES=NMR FID
##END=
