##TITLE=1H_A0902-4
 aceton-d6
 8 sc, 
 10.02.2022
##JCAMPDX= 6.0         $$ Bruker NMR JCAMP-DX V2.0
##DATA TYPE= NMR FID
##DATA CLASS= NTUPLES
##ORIGIN= UXNMR, Bruker Analytische Messtechnik GmbH
##OWNER= root
$$ XWIN-NMR		Version 3.5
$$ Thu Feb 10 10:28:13 2022 Russian Standard Time (UT+4h)  she@DPX200
##.OBSERVE FREQUENCY= 200.131346
##.OBSERVE NUCLEUS= ^1H
##.DELAY= (6, 6)
##.ACQUISITION MODE= SIMULTANEOUS
##.ACQUISITION SCHEME= undefined
##.AVERAGES= 8
##.DIGITISER RES= 18
##SPECTROMETER/DATA SYSTEM= spect
##.PULSE SEQUENCE= zg30
##.SOLVENT NAME= D2O
##.SHIFT REFERENCE= (INTERNAL, D2O, 0, 15.7039)
##AUDIT TRAIL= $$ (NUMBER, WHEN, WHO, WHERE, WHAT)
$$ ##TITLE= Audit trail, XWIN-NMR		Version 3.5
$$ ##JCAMPDX= 5.01
$$ ##ORIGIN= Bruker BioSpin GmbH
$$ ##OWNER= she
$$ F:/spectra/data/she/nmr/H-F/1/audita.txt
$$ ##AUDIT TRAIL=  $$ (NUMBER, WHEN, WHO, WHERE, WHAT)
(   1,<2022-02-10 10:26:45.42 +0400>,<she>,<DPX200>,
      <created by zg, POWCHK disabled, PULCHK disabled
       configuration hash MD5:
       00 E9 B6 7A A2 85 ED C7 34 08 36 98 17 FE 4E 26
       data hash MD5: 16K
       81 01 1A D4 DC 4F E4 EA 01 7C 2D 92 EF D9 82 F7>)
$$ ##END=
$$ 
$$ hash MD5
$$ 03 EB 7C 28 57 6C 0D 68 B7 08 BA F0 46 7D AF AD
##$RELAX= 
##$RELAX= 
##$RELAX= 
##$RELAX= 
##$RELAX= 
##$RELAX= 
$$ Bruker specific parameters
$$ --------------------------
##$DU= <F:/spectra>
##$EXPNO= 1
##$NAME= <H-F>
##$PROCNO= 1
##$TYPE= <nmr>
##$USER= <she>
##$AMP= (0..31)
100 100 100 100 100 100 100 100 100 100 100 100 100 100 100 100 100 100 
100 100 100 100 100 100 100 100 100 100 100 100 100 100 
##$AQSEQ= 0
##$AQ_mod= 1
##$AUNM= <au_zg>
##$AUTOPOS= <>
##$BF1= 200.13
##$BF2= 200.13
##$BF3= 200.13
##$BF4= 200.13
##$BF5= 200.13
##$BF6= 200.13
##$BF7= 200.13
##$BF8= 200.13
##$BYTORDA= 1
##$CFDGTYP= 0
##$CFRGTYP= 5
##$CHEMSTR= <none>
##$CNST= (0..31)
1 1 145 1 1 1 1 1 1 1 1 1 1 1 1 1 1 1 1 1 1 1 1 1 1 1 1 1 1 1 1 1 
##$CPDPRG= <>
##$CPDPRG1= <>
##$CPDPRG2= <>
##$CPDPRG3= <>
##$CPDPRG4= <mlev>
##$CPDPRG5= <mlev>
##$CPDPRG6= <mlev>
##$CPDPRG7= <mlev>
##$CPDPRG8= <mlev>
##$CPDPRGB= <>
##$CPDPRGT= <>
##$D= (0..31)
0 1.2 0 0 0 0 0 0 0 0.06 0 0.03 0 0 0 0 0.0002 0 0 0 0 0 0 0 0 0 0 0 0 
0 0 0 
##$DATE= 1644474404
##$DBL= (0..7)
120 120 120 120 120 120 120 120 
##$DBP= (0..7)
150 150 150 150 150 150 150 150 
##$DBP07= 0
##$DBPNAM0= <>
##$DBPNAM1= <>
##$DBPNAM2= <>
##$DBPNAM3= <>
##$DBPNAM4= <>
##$DBPNAM5= <>
##$DBPNAM6= <>
##$DBPNAM7= <>
##$DBPOAL= (0..7)
0.5 0.5 0.5 0.5 0.5 0.5 0.5 0.5 
##$DBPOFFS= (0..7)
0 0 0 0 0 0 0 0 
##$DE= 6
##$DECBNUC= <off>
##$DECIM= 32
##$DECNUC= <off>
##$DECSTAT= 4
##$DIGMOD= 1
##$DIGTYP= 9
##$DL= (0..7)
0 120 120 120 120 120 120 120 
##$DP= (0..7)
150 150 150 150 150 150 150 150 
##$DP07= 0
##$DPNAME0= <>
##$DPNAME1= <>
##$DPNAME2= <>
##$DPNAME3= <>
##$DPNAME4= <>
##$DPNAME5= <>
##$DPNAME6= <>
##$DPNAME7= <>
##$DPOAL= (0..7)
0.5 0.5 0.5 0.5 0.5 0.5 0.5 0.5 
##$DPOFFS= (0..7)
0 0 0 0 0 0 0 0 
##$DQDMODE= 0
##$DR= 18
##$DS= 0
##$DSLIST= <SSSSSSSSSSSSSSS>
$$ [...]
##$SUBNAM2= <"">
##$SUBNAM3= <"">
##$SUBNAM4= <"">
##$SUBNAM5= <"">
##$SUBNAM6= <"">
##$SUBNAM7= <"">
##$SUBNAM8= <"">
##$SUBNAM9= <"">
##$SW= 18.0517287032376
##$SWIBOX= (0..15)
0 0 2 0 0 0 0 0 0 0 0 0 0 0 0 0 
##$SW_h= 3612.71676300578
##$TD= 16384
##$TD0= 1
##$TE= 0
##$TE2= 300
##$TE3= 300
##$TEG= 300
##$TL= (0..7)
0 120 120 120 120 120 120 120 
##$TP= (0..7)
150 150 150 150 150 150 150 150 
##$TP07= 0
##$TPNAME0= <>
##$TPNAME1= <>
##$TPNAME2= <>
##$TPNAME3= <>
##$TPNAME4= <>
##$TPNAME5= <>
##$TPNAME6= <>
##$TPNAME7= <>
##$TPOAL= (0..7)
0.5 0.5 0.5 0.5 0.5 0.5 0.5 0.5 
##$TPOFFS= (0..7)
0 0 0 0 0 0 0 0 
##$TUNHIN= 0
##$TUNHOUT= 0
##$TUNXOUT= 0
##$USERA1= <user>
##$USERA2= <user>
##$USERA3= <user>
##$USERA4= <user>
##$USERA5= <user>
##$V9= 5
##$VALIST= <valist>
##$VCLIST= <CCCCCCCCCCCCCCC>
##$VD= 0
##$VDLIST= <DDDDDDDDDDDDDDD>
##$VPLIST= <PPPPPPPPPPPPPPP>
##$VTLIST= <TTTTTTTTTTTTTTT>
##$WBST= 1024
##$WBSW= 4
##$XGAIN= (0..3)
0 0 0 0 
##$XL= 0
##$YL= 0
##$YMAX_a= 1100250
##$YMIN_a= -1013499
##$ZGOPTNS= <>
##$ZL1= 120
##$ZL2= 120
##$ZL3= 120
##$ZL4= 120
##$ABSF1= 10
##$ABSF2= 0
##$ABSG= 5
##$ABSL= 3
##$ALPHA= 0
##$AQORDER= 0
##$ASSFAC= 0
##$ASSFACI= 0
##$ASSFACX= 0
##$ASSWID= 0
##$AUNMP= <proc_1d>
##$AZFE= 0.1
##$AZFW= 0.1
##$BCFW= 1
##$BC_mod= 2
##$BYTORDP= 1
##$COROFFS= 0
##$CY= 11.3945322036743
##$DATMOD= 1
##$DC= 2
##$DFILT= <>
##$DTYPP= 0
##$F1P= 2.36226072786647
##$F2P= -0.459571619588291
##$FCOR= 0.5
##$FTSIZE= 0
##$FT_mod= 4
##$GAMMA= 1
##$GB= 0.15
##$INTBC= 1
##$INTSCL= 1
##$ISEN= 128
##$LB= 0.24
##$LEV0= 0
##$LPBIN= 0
##$MAXI= 10000
##$MC2= 0
##$MEAN= 0
##$ME_mod= 0
##$MI= 1.114404
##$NCOEF= 0
##$NC_proc= 0
##$NLEV= 6
##$NOISF1= 3.799351
##$NOISF2= 2.8
##$NSP= 1
##$NTH_PI= 0
##$NZP= 0
##$OFFSET= 15.70392
##$PC= 1
##$PHC0= -16018.16
##$PHC1= -4.599219
##$PH_mod= 1
##$PKNL= yes
##$PPARMOD= 0
##$PSCAL= 0
##$PSIGN= 0
##$REVERSE= no
##$SF= 200.130013532006
##$SI= 16384
##$SIGF1= 3
##$SIGF2= 2
##$SINO= 400
##$SIOLD= 16384
##$SREGLST= <1H.CDCl3>
##$SSB= 0
##$STSI= 0
##$STSR= 0
##$SW_p= 3612.71676300578
##$SYMM= 0
##$S_DEV= 0
##$TDeff= 0
##$TDoff= 0
##$TI= <>
##$TILT= no
##$TM1= 0
##$TM2= 0
##$TOPLEV= 0
##$USERP1= <user>
##$USERP2= <user>
##$USERP3= <user>
##$USERP4= <user>
##$USERP5= <user>
##$WDW= 1
##$XDIM= 8192
##$YMAX_p= 0
##$YMIN_p= 0
$$ End of Bruker specific parameters
$$ ---------------------------------
##NTUPLES= NMR FID
##VAR_NAME=  TIME,          FID/REAL,        FID/IMAG
##SYMBOL=    X,             R,               I
##VAR_TYPE=  INDEPENDENT,   DEPENDENT,       DEPENDENT
##VAR_FORM=  AFFN,          ASDF,            ASDF
##VAR_DIM=   8192,          8192,            8192
##UNITS=     SECONDS,       ARBITRARY UNITS, ARBITRARY UNITS
##FACTOR=    0.0002768,     1,               1
##FIRST=     0,             0,               0
##LAST=      2.2672688,     0,               0
##MIN=       0,             -1013499,        0
##MAX=       2.2672688,     1100250,         0
$$ Real data points
##PAGE= N=1
##DATA TABLE= (X++(R..R)), XYDATA
0 0 0 0 0 0 0 0 5 -8 8 -8 16 -19 24 -24 33 -48 57 -70 82 -105 129 -150 175 -209 248 -288 331 -384 447
29 447 -512 580 -661 756 -857 962 -1083 1221 -1368 1528 -1702 1898 -2109 2339 -2587 2862
45 2862 -3166 3493 -3849 4239 -4673 5149 -5668 6248 -6897 7622 -8439 9365 -10433 11676
59 11676 -13138 14892 -17044 19758 -23293 28113 -35097 46172 -66396 115024 -468607 -48067
71 -48067 1100250 -325736 -927479 451216 877857 -673278 -694574 783722 543253 -912489
81 -912489 -317283 945554 134244 -973764 79027 932627 -263535 -875049 456273
90 456273 755988 -596491 -625156 717167 462563 -798386 -296123 857835 107801 -863915
100 -863915 72575 834341 -245916 -770688 398290 685577 -537945 -564517 648991
109 648991 418801 -726766 -261099 767876 103595 -780701 59582 760818 -221809 -704898
119 -704898 367786 616596 -486848 -508060 584158 382756 -659762 -240350 702716
128 702716 87510 -706598 61355 680276 -199476 -631591 327772 556611 -442182 -453052
138 -453052 531347 332356 -590221 -207259 623720 78006 -633653 57341 613850 -188308
148 -188308 -562821 301691 489780 -396908 -402110 478402 298327 -539808 -178818 570808
158 570808 54493 -572565 64317 553715 -177401 -514438 285565 448634 -379644 -359724
168 -359724 449853 260502 -497244 -156234 526341 43559 -532847 73345 510264 -181310
178 -181310 -462875 272930 400234 -352111 -323949 418370 230719 -462121 -126354 478254
188 478254 23232 -473597 74334 453641 -169264 -413375 257594 350373 -328371 -273470
198 -273470 378063 192091 -412054 -105017 431480 10008 -428803 84234 402516 -167267
208 -167267 -360841 239268 309055 -304111 -243444 356302 163165 -387052 -77707 397268
218 397268 -4737 -393776 86136 375547 -167596 -336571 240593 279396 -296783 -214019
228 -214019 337864 143653 -368142 -64857 382368 -19853 -374008 99408 347067 -168871
238 -168871 -309275 231513 260188 -287259 -195990 327319 121496 -347175 -47178 352325
248 352325 -24712 -346170 97731 324001 -168197 -282826 226166 230083 -269168 -172952
258 -172952 302551 109443 -325919 -37360 331710 -35923 -318577 101888 293860 -161095
268 -161095 -260874 216804 214823 -263863 -155128 294295 90321 -308976 -26645 313700
278 313700 -38602 -306638 106083 282181 -167491 -242420 215896 195575 -253732 -143746
288 -143746 284158 82934 -301753 -15882 300916 -48140 -285394 105008 261729 -158468
298 -158468 -228279 207715 181105 -244845 -124954 266270 68573 -276803 -12601 279264
308 279264 -46519 -268358 105217 241536 -154859 -205176 193905 164708 -227138 -117746
318 -117746 253607 61810 -265903 -3338 262770 -50401 -250628 100567 231318 -150171
328 -150171 -199772 194387 155451 -225887 -105756 245232 55817 -257252 -2518 259747
338 259747 -54828 -247055 108748 220574 -153037 -187394 190096 148813 -222371 -101026
348 -101026 244463 45894 -250945 8002 245164 -57355 -232525 105393 210852 -151450
358 -151450 -176182 188225 132740 -212059 -87766 227283 41538 -236115 9294 233411
368 233411 -61287 -216489 106514 190766 -143725 -161013 177162 124360 -205268 -78511
378 -78511 221075 29262 -223642 16861 218532 -61241 -207086 106449 184357 -147701
388 -147701 -149864 178129 110612 -198907 -70318 213983 25971 -221039 22863 214618
398 214618 -69298 -196379 108154 172563 -142234 -143681 173459 105941 -196430 -61257 206389
409 206389 17141 -206747 24051 201644 -65778 -188294 107134 162987 -141289 -129686
419 -129686 165247 94714 -183212 -57471 196464 14607 -199671 30145 190447 -69848
429 -69848 -173655 103940 153029 -136325 -125287 164734 88127 -182866 -47295 189999 8110
440 8110 -191046 30987 186477 -72293 -171258 110879 145246 -140682 -114523 162589 81970
451 81970 -180450 -44432 191316 1585 -189907 39927 178133 -75662 -161416 108323
461 108323 139676 -139023 -109220 162720 72050 -175087 -34795 179275 -759 -178863
471 -178863 37806 170891 -75457 -152093 107227 126150 -130766 -98443 149845 67938 -165347
482 -165347 -31858 172210 -6748 -168128 41499 157558 -72314 -143439 102655 122332
492 122332 -130284 -92554 149463 58982 -159519 -26308 165015 -7118 -165660 43528
502 43528 156758 -78211 -138022 105751 114765 -127694 -89351 146745 58568 -160265 -22170
513 -22170 163331 -13672 -157484 45414 147449 -75407 -132709 104775 109446 -128472 -79767
524 -79767 142662 49164 -150357 -19071 154417 -13557 -151704 47712 139161 -77432
534 -77432 -120121 100889 99155 -121097 -74920 138505 44427 -148173 -10997 148030 -19832
545 -19832 -142204 48219 132956 -77127 -116902 104297 92369 -123877 -64170 135689 36370
556 36370 -143579 -6938 146848 -25791 -141213 57291 126367 -82741 -107591 103520
566 103520 86650 -122363 -60355 136333 28825 -140817 2222 137757 -29587 -131236
576 -131236 56168 120400 -82718 -101600 104256 76718 -117741 -51178 126118 25731 -131900
587 -131900 2787 131804 -32943 -122848 59248 108281 -80207 -92068 99180 72275 -116063
598 -116063 -46437 126113 17754 -127791 8981 124747 -34196 -118911 60536 106746
608 106746 -85645 -86776 104159 63566 -116131 -40377 125037 15031 -129901 13938 126481
619 126481 -42244 -115062 65583 100254 -85543 -83261 104365 60914 -118744 -33557 124724
630 124724 6408 -123943 18190 120279 -42719 -112122 67746 96385 -88582 -75158
640 -75158 102491 53124 -112318 -30630 119744 4706 -121550 22971 115208 -47465 -103642
651 -103642 67577 90258 -86302 -72932 103224 49718 -113891 -23558 117037 -918 -116305
662 -116305 24543 112828 -49500 -103189 73191 86329 -90972 -66306 103182 45988 -112990
673 -112990 -23158 119139 -3444 -117876 29566 109406 -51388 -98182 70676 84641 -89355
684 -89355 -65905 104194 42187 -111440 -18422 113030 -3625 -112248 26327 107393 -50223
695 -50223 -95364 70724 78214 -85472 -60219 97024 41297 -106966 -18511 111757 -6550
706 -6550 -108885 29251 101425 -48851 -92000 68143 78773 -86562 -59253 99625 36673
717 36673 -106030 -15112 109020 -6570 -109536 30395 103936 -53941 -91125 72582 74916
728 74916 -86661 -57833 98974 37484 -108185 -12916 110364 -11793 -105859 33032 98619
739 98619 -52522 -88880 72057 73507 -88159 -52920 97574 31767 -102004 -11653 104473
750 104473 -10097 -103020 33307 94706 -53793 -81418 69248 66946 -82246 -50965 93956
761 93956 30623 -100924 -7605 100792 -13607 -96467 32584 90457 -51860 -80188 70577
772 70577 63947 -84409 -44728 92516 25951 -97795 -6489 100596 -15509 -97562 37424
783 37424 87857 -55202 -75122 69415 61389 -82673 -44444 93212 23388 -97392 -2085
794 -2085 95853 -16602 -92000 34448 85671 -52964 -74016 69008 57492 -79412 -40345
805 -40345 86054 23548 -91309 -4554 93084 -16540 -88512 35495 79347 -50720 -69079
816 -69079 64474 56775 -77521 -39780 86473 19819 -89266 -987 88449 -16591 -86049
827 -86049 35205 79568 -53761 -67122 68156 51522 -77554 -35858 84710 18941 -89858
838 -89858 1154 89628 -21540 -83214 38554 74067 -52731 -63929 66579 50159 -78179
849 -78179 -32188 84044 13651 -84790 2955 83661 -19425 -80261 37108 71685 -52752
860 -52752 -58535 63556 44604 -71396 -30874 78323 14560 -82075 4027 79931 -20987
871 -20987 -73764 34984 66574 -48318 -57250 61478 43444 -71276 -26765 75612 10926
882 10926 -77130 4031 77400 -20633 -73828 37577 64742 -51163 -52764 60790 40741 -69060
894 -69060 -27062 75962 10099 -77993 7616 74761 -22681 -69336 35825 62886 -49337
905 -49337 -52768 61150 38401 -68144 -23266 70964 9320 -72574 5319 72183 -21614 -66871
917 -66871 36490 57416 -47327 -47126 55960 36424 -64220 -22724 69722 6469 -69831 8701
929 8701 66488 -21492 -62235 34361 55845 -47620 -45018 57716 31337 -63164 -18187 66302
941 66302 5296 -68400 9578 66812 -25165 -60014 37785 50631 -47192 -41154 55798 29853
953 29853 -63339 -15321 66427 148 -64785 12794 61322 -24379 -56858 36633 49022 -47692
965 -47692 -37233 54561 24712 -57996 -13461 60635 1173 -61709 12883 58383 -25773 -51289
977 -51289 35319 43607 -43357 -35454 51443 24386 -57274 -10730 58382 -2135 -56773 13120
989 13120 54551 -24652 -50483 36771 42068 -46267 -31070 51642 20527 -55451 -9759 58560
1001 58560 -3103 -58296 16996 53460 -28298 -46498 37000 39504 -45407 -30550 53072 18360
1013 18360 -56782 -5385 56254 -5805 -54315 16158 51610 -27613 -45625 38197 35785 -45094
1025 -45094 -25491 49094 15966 -52764 -5206 54735 -7515 -52586 19205 46884 -28086 -40908
1037 -40908 35916 34067 -43998 -24325 49970 12126 -51724 -807 51069 -8965 -49918 19523
1049 19523 46690 -30714 -39439 39385 29823 -44428 -20662 48326 11316 -51697 287 51988
1061 51988 -12676 -48108 22659 42549 -30463 -37001 38208 29607 -45466 -19151 48987 7953
1073 7953 -49042 1540 48213 -10765 -46731 21173 42218 -30906 -34405 37430 26211 -41619
1085 -41619 -18511 45768 9370 -48506 1880 47509 -12352 -43491 20676 39165 -28402 -34114
1097 -34114 36736 26032 -43186 -15635 45881 5857 -46454 2933 46695 -12860 -44863 23596
1109 23596 39138 -32152 -31156 37756 23547 -42498 -15298 46883 4786 -48371 6657 45865
1121 45865 -15943 -41852 23587 37617 -31546 -31309 38919 21908 -43090 -11815 44107 3107
1133 3107 -44530 5643 44102 -15608 -40707 24977 34154 -31299 -27136 35840 20496 -40363
1145 -40363 -12174 43643 1872 -43324 7818 40352 -15595 -37300 23033 33348 -31145 -26546
1157 -26546 37373 17497 -40271 -9145 41401 1407 -42381 7641 41356 -17561 -36769 25582
1169 25582 30314 -31023 -24280 35999 17563 -40697 -8507 42736 -1348 -41273 9482 38556
1181 38556 -16335 -35802 24019 31077 -31342 -23398 35820 15116 -37752 -8023 39298 456
1193 456 -40279 8525 38368 -17167 -33557 23339 28371 -28249 -23200 33576 16182 -37771 -7028
1206 -7028 38734 -1654 -37524 8835 36047 -16132 -33626 24221 28261 -30728 -20682 34299
1218 34299 13442 -36429 -6549 38542 -1863 -38716 11234 35537 -18973 -30681 24488 26015
1230 26015 -29657 -20484 34757 12571 -37364 -3814 36828 -3527 -35346 9958 33808 -17204
1242 -17204 -30310 24423 24112 -29001 -17356 31503 11578 -33786 -5117 35494 -2915 -34610
1254 -34610 10726 31145 -16514 -27394 21471 23571 -27002 -17934 31554 10350 -33210 -3015
1266 -3015 33100 -3059 -32776 9624 31503 -17097 -27506 23338 21532 -27126 -15902 29904
1278 29904 10310 -32820 -3095 34090 -5105 -32313 11843 29154 -16987 -26181 22194 22159 -27458
1291 -27458 -15719 30704 8417 -31317 -2189 31245 -3629 -31152 10510 29171 -17347 -24593
1303 -24593 22085 19480 -25042 -14845 28072 9350 -30629 -2057 30709 -5044 -28557 10569
1315 10569 26170 -15584 -23541 21223 19081 -25925 -12656 28092 6433 -28691 -1154 29168
1327 29168 -4808 -28778 11821 25665 -17680 -20955 21457 16471 -24536 -12014 27760 5902
1339 5902 -29425 1096 28349 -6883 -26082 11386 23973 -16247 -20890 21359 15728 -24486
1351 -24486 -9753 25530 4793 -26129 -34 26779 -5819 -25734 11793 22266 -15920 -18515
1363 -18515 18750 15211 -22007 -10791 24968 4768 -25773 1214 24619 -5836 -23403 10245
1375 10245 22030 -15499 -18807 20068 13738 -22411 -8783 23564 4427 -24875 834 25330
1387 25330 -7135 -23462 12505 20082 -16160 -16894 19383 13540 -22887 -8402 24942 2427 -24642
1400 -24642 2620 23385 -6760 -22274 11528 20168 -16434 -16032 19715 11227 -21192 -7257 22478
1413 22478 3118 -23608 2233 23116 -7540 -20454 11452 17564 -14477 -15006 17912 11345 -20943
1426 -20943 -6060 22074 969 -21536 3048 20985 -7094 -20175 11935 17460 -16218 -13167
1438 -13167 18444 9055 -19889 -5456 21396 845 -22257 4645 20852 -9258 -18218 12380
1450 12380 15933 -15386 -13328 18708 9021 -20722 -3928 20669 -235 -20175 3815 19895
1462 19895 -8027 -18599 12561 15359 -15615 -11682 17193 8698 -18761 -5273 20472 627
1474 627 -20549 4202 18843 -7785 -17015 10855 15342 -14432 -12537 17752 8120 -19229 -3792
1487 -3792 19344 290 -19606 3487 19354 -8287 -17415 12440 13971 -14968 -10698 16930 7695
1500 7695 -19118 -3646 20320 -1302 -19587 5447 17737 -8484 -16240 11577 14185 -15104
1512 -15104 -10517 17354 6177 -17917 -2605 18038 -561 -18319 4521 17522 -8695 -15124
1524 -15124 11627 12190 -13338 -9742 15214 6899 -17115 -2764 17572 -1529 -16469 4639 15340
1537 15340 -7484 -14406 10873 12207 -13944 -8688 15402 5135 -15831 -2289 16499 -1054
1549 -1054 -16813 5231 15495 -8943 -12962 11208 10742 -13117 -8608 15313 5295 -16777 -1244
1562 -1244 16488 -2203 -15469 4749 14736 -7798 -13530 11100 10793 -13442 -7504 14333 4825
1575 4825 -15097 -2269 16044 -1180 -15939 4933 14252 -7548 -12236 9402 10599 -11665 -8443
1588 -8443 13978 4952 -14908 -1362 14582 -1240 -14202 3787 13925 -7088 -12469 10152
1600 10152 9578 -11742 -6837 12630 4552 -13823 -1608 14616 -2136 -13918 5407 12122 -7483
1613 -7483 -10708 9326 9169 -11615 -6506 13145 3023 -13133 -276 12545 -1883 -12446 4415
1626 4415 11725 -7415 -9692 9448 7223 -10255 -5364 11009 3493 -12118 -713 12258 -2366
1639 -2366 -10990 4509 9626 -6015 -8770 8011 7279 -10125 -4695 11019 1912 -10900 -50
1652 -50 10888 -1920 -10951 4664 9890 -7212 -7707 8586 5722 -9442 -4130 10605 1972 -11589
1666 -11589 1074 11069 -3575 -9763 5134 8858 -6737 -7773 8821 5686 -10166 -2953 10311
1679 10311 863 -10113 839 10316 -2914 -9985 5453 8442 -7158 -6515 7862 5148 -8727
1692 -8727 -3725 9810 1300 -10050 1344 9189 -3057 -8292 4408 7743 -6288 -6571 8065
1705 8065 4276 -8802 -2094 8581 579 -8674 1128 8901 -3481 -7901 5642 6105 -6616 -4581
1719 -4581 7230 3455 -8264 -1659 9011 -774 -8356 2698 7250 -3774 -6497 4968 5791 -6640
1733 -6640 -4021 7712 1917 -7586 -393 7360 -778 -7551 2346 7287 -4263 -5833 5409 4320
1747 4320 -5855 -3326 6510 2215 -7439 -252 7575 -1790 -6700 3005 6053 -3889 -5664 5353
1761 5353 4641 -6808 -2739 7212 891 -6964 240 7089 -1638 -7200 3726 6373 -5436 -4779 6101
1776 6101 3588 -6579 -2661 7497 958 -8010 1216 7303 -2860 -6340 3746 5770 -4931 -5184
1790 -5184 6508 3527 -7336 -1594 7173 310 -7008 670 7190 -2291 -6861 4212 5445 -5186
1804 -5186 -4010 5543 3167 -6324 -2051 7229 142 -7194 1696 6359 -2718 -5669 3563 5305 -5002
1819 -5002 -4275 6294 2358 -6678 -747 6429 -282 -6648 1553 6752 -3435 -5920 4975 4424 -5543
1834 -5543 -3394 5956 2496 -6871 -999 7327 -1093 -6746 2552 5913 -3357 -5582 4524 5050 -5964
1849 -5964 -3528 6721 1806 -6606 -705 6581 -289 -6997 1926 6766 -3754 -5520 4825 4401
1863 4401 -5334 -3747 6220 2719 -7331 -875 7519 -938 -6896 2014 6426 -3114 -6292 4820
1877 4820 5332 -6374 -3512 6973 2019 -7087 -909 7597 -506 -7871 2527 7267 -4216 -5874
1891 -5874 4939 4924 -5775 -4137 7090 2530 -7865 -455 7589 -1002 -6999 1961 7022 -3318
1905 -3318 -6545 5054 5271 -6030 -3605 6268 2640 -6615 -1616 7293 -150 -7340 2015 6567 -3254
1920 -3254 -5770 3952 5366 -5171 -4420 6457 2715 -6861 -1018 6616 -72 -6624 1238 6809 -3048
1935 -3048 -6230 4688 4805 -5440 -3626 5923 2847 -6677 -1531 7362 -345 -7052 1885 6305 -2775
1950 -2775 -5809 3829 5366 -5368 -4197 6420 2455 -6531 -1343 6549 412 -6930 934 6998
1964 6998 -2750 -6089 3880 4895 -4442 -4240 5301 3527 -6468 -1942 6964 188 -6614 964 6300
1979 6300 -1829 -6277 3289 5717 -4805 -4295 5601 2830 -5782 -1964 6296 797 -6856 988 6634
1994 6634 -2644 -5643 3459 4898 -4082 -4431 5268 3324 -6192 -1552 6235 197 -5829 602 5891
2009 5891 -1741 -5885 3312 5050 -4346 -3791 4703 2980 -4990 -2389 5740 1156 -6089 539 5581
2024 5581 -1599 -4929 2191 4795 -3120 -4387 4397 3193 -5047 -1871 4968 1094 -5073 -373 5482
2039 5482 -935 -5263 2471 4280 -3297 -3407 3653 3023 -4428 -2251 5255 781 -5361 442 4809
2054 4809 -1176 -4586 1834 4538 -3083 -3812 4168 2555 -4329 -1541 4368 1143 -4820 -178 5186
2069 5186 -1225 -4717 2229 3868 -2569 -3504 3096 3141 -4063 -2140 4638 804 -4428 30 4183 -426
2085 -426 -4420 1444 4357 -2684 -3505 3310 2492 -3363 -2077 3756 1495 -4431 -243 4514 -1066 -3818
2101 -3818 1693 3381 -2012 -3345 2891 2845 -3806 -1641 3947 633 -3641 -252 3688 -322 -4026
2116 -4026 1528 3570 -2409 -2700 2708 2223 -2829 -2005 3493 1400 -4035 -279 3747 -526 -3313 722
2132 722 3271 -1266 -3384 2385 2662 -3031 -1699 3044 1301 -3103 -992 3677 197 -3882 1040
2147 1040 3314 -1620 -2696 1768 2625 -2369 -2260 3259 1239 -3596 -203 3181 -228 -3134 588
2162 588 3381 -1449 -3105 2439 2215 -2627 -1449 2634 1282 -3026 -825 3521 -288 -3420 1167
2177 1167 2846 -1356 -2609 1613 2723 -2426 -2148 3072 1182 -2971 -523 2804 399 -3150 217
2192 217 3396 -1221 -2958 1955 2202 -2040 -1978 2334 1913 -3018 -1146 3379 96 -2952 434 2690
2208 2690 -570 -2882 1348 2777 -2286 -1993 2688 1212 -2526 -1066 2723 761 -3292 109 3288
2223 3288 -1086 -2636 1399 2163 -1551 -2283 2223 1996 -2969 -1094 3129 398 -2856 -215 3008 -162
2239 -162 -3316 1171 3063 -1986 -2302 2144 1897 -2297 -1874 2965 1259 -3515 -199 3368 -482 -3012
2255 -3012 760 3062 -1220 -3044 2261 2455 -2843 -1523 2822 982 -2891 -782 3419 -66 -3652
2270 -3652 1211 3041 -1705 -2539 1804 2470 -2309 -2222 3158 1282 -3399 -264 3076 -102 -3074 448
2286 448 3405 -1330 -3248 2312 2468 -2614 -1926 2589 1752 -3119 -1364 3719 263 -3652 663 3183
2302 3183 -1049 -3096 1469 3245 -2411 -2754 3238 1763 -3349 -1194 3264 938 -3700 -111 4067
2317 4067 -986 -3578 1836 2943 -2075 -2708 2576 2533 -3477 -1627 3927 572 -3758 -16 3559 -414
2333 -414 -3818 1306 3685 -2400 -2975 2964 2161 -3068 -1845 3535 1439 -4248 -367 4374 -800 -3895
2349 -3895 1341 3622 -1721 -3606 2645 3205 -3618 -2097 3934 1179 -3868 -725 4214 50 -4592
2364 -4592 1106 4359 -2243 -3506 2625 3033 -2995 -2738 3813 1910 -4424 -643 4316 -340 -4047
2379 -4047 798 4053 -1579 -4118 2700 3416 -3498 -2429 3635 1779 -3885 -1350 4425 356 -4646
2394 -4646 927 4219 -1787 -3716 2128 3600 -2955 -3283 4003 2258 -4378 -1099 4279 557 -4437
2409 -4437 74 4770 -1271 -4550 2496 3766 -3085 -3021 3442 2729 -4172 -2022 4910 703 -4968 367
2425 367 4544 -1013 -4396 1739 4368 -2860 -3663 3861 2555 -4149 -1690 4280 1215 -4773 -281
2440 -281 5106 -1093 -4703 2071 3949 -2523 -3573 3149 3231 -4193 -2237 4752 909 -4636 -35 4663
2456 4663 -499 -4862 1573 4733 -2851 -3903 3484 2943 -3772 -2468 4278 1792 -4990 -476 5116
2471 5116 -809 -4628 1554 4343 -2119 -4185 3119 3706 -4186 -2505 4527 1465 -4435 -824 4714
2486 4714 -4 -5046 1324 4680 -2488 -3820 3042 3260 -3487 -2949 4268 2083 -4913 -747 4800
2501 4800 -305 -4429 856 4444 -1772 -4412 3072 3614 -3983 -2590 4145 1862 -4392 -1319 4998
2516 4998 189 -5202 1164 4657 -2013 -4017 2594 3749 -3411 -3247 4420 2201 -4847 -946 4771
2531 4771 202 -4749 551 4957 -1748 -4604 2982 3644 -3550 -2785 3832 2315 -4500 -1469 5099
2546 5099 136 -5087 1030 4524 -1706 -4208 2323 4050 -3378 -3235 4337 2024 -4481 -1031 4440
2561 4440 376 -4780 542 4946 -1875 -4382 2904 3593 -3247 -3114 3768 2568 -4592 -1445 5020
2576 5020 51 -4752 837 4419 -1438 -4423 2450 4081 -3643 -3072 4290 1976 -4316 -1319 4539
2591 4539 582 -5049 766 4840 -2017 -4045 2680 3515 -3194 -3135 4044 2370 -4809 -1023 4937 -95
2607 -95 -4533 727 4519 -1546 -4416 2729 3747 -3738 -2660 4128 1788 -4335 -1220 4878 245
2622 245 -5197 1209 4667 -2145 -4044 2607 3594 -3361 -3188 4359 2066 -4965 -750 4817 -181 -4687
2638 -4687 819 4815 -1940 -4536 3176 3646 -3864 -2579 4106 1960 -4579 -1128 5121 -172 -5050
2653 -5050 1562 4485 -2273 -3920 2866 3623 -3788 -2905 4672 1615 -4903 -469 4713 -291 -4709
2668 -4709 1173 4795 -2467 -4243 3553 3226 -4012 -2464 4367 1878 -4999 -802 5325 -642 -4968
2683 -4968 1678 4386 -2323 -4079 3209 3685 -4335 -2559 4963 1367 -4995 -384 5008 -362 -5193
2698 -5193 1555 5027 -2924 -4118 3676 3099 -4091 -2435 4733 1653 -5465 -228 5491 -1151 -5029
2713 -5029 1909 4548 -2686 -4335 3770 3559 -4804 -2240 5136 1031 -5130 -190 5367 -842 -5506
2728 -5506 2311 4962 -3474 -3891 4034 3224 -4583 -2604 5415 1438 -5842 132 5622 -1298 -5175
2743 -5175 2152 4953 -3189 -4565 4546 3454 -5313 -2121 5445 1172 -5589 -219 5873 -1162 -5751
2758 -5751 2686 4926 -3690 -4017 4293 3349 -5127 -2467 5961 955 -6104 513 5619 -1491 -5406
2773 -5406 2446 5162 -3719 -4370 4962 3062 -5455 -1859 5610 1028 -6034 187 6341 -1721 -5806
2788 -5806 3068 4998 -3815 -4227 4598 3625 -5569 -2326 6296 736 -6254 531 6022 -1539 -5973
2803 -5973 2699 5624 -4235 -4564 5183 3229 -5581 -2223 6009 1217 -6543 344 6571 -1993 -5933
2818 -5933 3129 5207 -3932 -4585 5045 3708 -6071 -2155 6494 703 -6272 373 6217 -1567 -6172
2833 -6172 3162 5507 -4512 -4291 5261 3199 -5744 -2370 6400 1138 -6938 655 6612 -2038 -5927
2848 -5927 3062 5455 -4110 -4804 5401 3635 -6342 -2065 6517 765 -6544 263 6724 -1623 -6572
2863 -6572 3345 5594 -4528 -4391 5113 3554 -5858 -2492 6703 909 -6990 804 6502 -1931 -6025
2878 -6025 2925 5682 -4266 -4917 5584 3466 -6136 -1975 6270 938 -6527 279 6776 -2023 -6365
2893 -6365 3440 5402 -4394 -4536 5055 3745 -6058 -2571 6802 869 -6782 564 6429 -1728 -6255
2908 -6255 2928 5902 -4488 -4870 5602 3516 -6054 -2301 6409 1236 -6945 206 6997 -1996 -6318
2923 -6318 3327 5400 -4142 -4750 5203 3838 -6334 -2344 6854 654 -6651 563 6488 -1677 -6416
2938 -6416 3169 5757 -4630 -4517 5510 3190 -5961 -2225 6538 996 -6951 724 6868 -2270 -6105
2953 -6105 3232 5418 -4223 -4793 5386 3697 -6361 -2049 6591 624 -6554 458 6652 -1759 -6509
2968 -6509 3367 5669 -4700 -4440 5317 3432 -5885 -2450 6646 960 -6951 784 6553 -2238 -5938
2983 -5938 3099 5494 -4332 -4806 5557 3439 -6270 -1856 6362 669 -6457 513 6599 -2054 -6259
2998 -6259 3588 5180 -4636 -4113 5278 3365 -6038 -2277 6749 553 -6769 961 6272 -2060 -5883
3013 -5883 3176 5502 -4539 -4544 5717 3085 -6261 -1828 6375 775 -6763 620 6866 -2294 -6171
3028 -6171 3682 5181 -4478 -4291 5320 3469 -6328 -1968 6897 215 -6707 1173 6233 -2163 -6039
3043 -6039 3472 5450 -4836 -4213 5765 2746 -6052 -1659 6321 538 -6765 1074 6543 -2689 -5790
3058 -5790 3749 4932 -4503 -4283 5527 3179 -6436 -1708 6656 67 -6440 1002 6223 -2151 -6133
3073 -6133 3693 5358 -4976 -4037 5588 2917 -5970 -1912 6574 598 -6914 1174 6410 -2562 -5608
3088 -5608 3540 5036 -4527 -4311 5727 2940 -6433 -1358 6435 44 -6337 1027 6343 -2451 -5925
3103 -5925 3940 4807 -4918 -3585 5442 2634 -6028 -1549 6688 -39 -6708 1670 6096 -2732 -5428
3118 -5428 3682 5011 -4811 -4003 5963 2493 -6407 -1011 6412 -51 -6484 1269 6496 -2880 -5907
3133 -5907 4290 4727 -4977 -3707 5621 2746 -6401 -1392 6852 -342 -6602 1779 6044 -2777 -5676
3148 -5676 3941 5041 -5261 -3733 6101 2264 -6277 -959 6385 -107 -6556 1631 6341 -3198 -5385
3163 -5385 4321 4446 -4967 -3582 5777 2626 -6603 -1095 6786 -511 -6367 1604 5969 -2676 -5683
3178 -5683 4021 4930 -5315 -3601 5959 2283 -6157 -1319 6498 38 -6756 1593 6336 -3026 -5435
3193 -5435 3963 4585 -4757 -3887 5764 2543 -6574 -908 6557 -438 -6192 1484 6064 -2773 -5726
3208 -5726 4193 4666 -5187 -3254 5647 2139 -5981 -1159 6491 -377 -6567 2016 5840 -3179 -5088
3223 -5088 3924 4492 -4927 -3660 5947 2121 -6423 -582 6225 -553 -6176 1535 6066 -3062 -5503
3238 -5503 4492 4347 -5223 -3196 5627 2344 -6216 -1133 6739 -525 -6449 2011 5784 -2994 -5225
3253 -5225 3959 4609 -5137 -3486 6026 1905 -6201 -654 6141 -322 -6211 1592 5993 -3134 -5174
3268 -5174 4235 4041 -4765 -3049 5318 2235 -6092 -836 6363 -745 -5920 1843 5435 -2671 -5086
3283 -5086 3725 4427 -4956 -3158 5555 1810 -5708 -868 5837 -213 -6083 1620 5771 -3028 -4808
3298 -4808 3822 4029 -4509 -3313 5225 2205 -5914 -646 5945 -738 -5517 1702 5204 -2672 -4917
3313 -4917 3953 3995 -4901 -2664 5178 1522 -5358 -692 5607 -547 -5620 2034 4958 -3156 -4090 3764
3329 3764 3448 -4475 -2687 5315 1510 -5631 -36 5415 -963 -5073 1791 4907 -2892 -4462 4172
3344 4172 3350 -4735 -2234 5004 1385 -5324 -464 5655 -853 -5449 2197 4715 -3021 -4037 3675
3359 3675 3519 -4441 -2628 5266 1182 -5363 33 5113 -869 -5009 1778 4880 -3053 -4057 3944
3374 3944 2991 -4357 -2047 4602 1256 -5025 -169 5212 -1255 -4751 2223 4125 -2801 -3670 3560
3389 3560 3149 -4438 -2039 4824 804 -4760 135 4614 -897 -4691 2033 4380 -3175 -3480 3920
3404 3920 2500 -4179 -1925 4615 1069 -5044 240 4893 -1470 -4287 2235 3857 -2860 -3372 3822
3419 3822 2602 -4523 -1404 4708 299 -4541 432 4535 -1326 -4387 2563 3735 -3443 -2741 3838
3434 3838 1969 -4191 -1284 4594 213 -4861 1094 4403 -1933 -3859 2511 3461 -3263 -2940 4068
3449 4068 1944 -4524 -790 4457 -67 -4448 772 4536 -1864 -4224 2984 3453 -3578 -2584 3899
3464 3899 2028 -4336 -1171 4789 -6 -4721 1240 4220 -1967 -3824 2603 3531 -3581 -2735 4289
3479 4289 1599 -4488 -638 4369 -124 -4428 1010 4382 -2205 -3859 3067 2929 -3547 -2263 3876
3494 3876 1619 -4441 -623 4738 -649 -4375 1537 3857 -2116 -3610 2871 3176 -3817 -2195 4358
3509 4358 1115 -4373 -309 4414 -468 -4572 1501 4297 -2645 -3544 3277 2737 -3694 -2144 4166
3524 4166 1303 -4753 -105 4685 -1086 -4346 1865 3968 -2549 -3561 3438 2910 -4197 -1705 4361
3539 4361 779 -4421 3 4500 -954 -4537 2106 3954 -3017 -3120 3458 2470 -3893 -1850 4529
3554 4529 864 -4748 349 4499 -1232 -4193 1938 4008 -2847 -3562 3800 2600 -4308 -1613 4477
3569 4477 817 -4656 -89 4830 -1102 -4696 2276 3948 -3037 -3267 3482 2751 -4166 -1920 4807
3584 4807 772 -4902 364 4580 -1157 -4366 1992 4144 -3060 -3488 3923 2379 -4253 -1493 4452
3599 4452 747 -4772 274 4827 -1491 -4379 2446 3701 -3092 -3167 3682 2590 -4365 -1534 4832
3614 4832 296 -4722 572 4526 -1383 -4466 2339 4087 -3394 -3259 4049 2287 -4335 -1500 4601
3629 4601 690 -4970 546 4929 -1755 -4366 2549 3770 -3145 -3267 3960 2526 -4660 -1365 4834
3644 4834 231 -4706 569 4636 -1408 -4527 2540 3911 -3526 -2945 3987 2157 -4293 -1412 4708
3659 4708 417 -4874 771 4612 -1770 -4073 2450 3767 -3182 -3250 4028 2283 -4606 -1146 4686
3674 4686 298 -4691 500 4765 -1508 -4581 2662 3795 -3467 -3050 3809 2345 -4359 -1482 4840
3689 4840 386 -4943 844 4652 -1680 -4285 2366 3868 -3335 -3152 4170 2131 -4528 -1119 4544
3704 4544 246 -4672 672 4681 -1822 -4209 2855 3496 -3381 -2766 3841 2096 -4439 -1205 4771
3719 4771 42 -4638 962 4259 -1730 -4014 2490 3634 -3476 -2846 4077 1732 -4315 -1078 4517
3734 4517 265 -4748 798 4539 -1933 -4038 2760 3329 -3278 -2786 3866 2049 -4584 -996 4726
3749 4726 -91 -4468 957 4290 -1634 -4056 2640 3503 -3495 -2576 3930 1631 -4121 -914 4439
3764 4439 52 -4583 1095 4259 -2058 -3731 2682 3157 -3257 -2632 3899 1783 -4401 -673 4420
3779 4420 -315 -4258 1024 4187 -1921 -4000 2835 3252 -3552 -2406 3893 1674 -4234 -934 4475
3794 4475 -84 -4579 1246 4182 -2064 -3604 2761 3226 -3460 -2546 4138 1544 -4413 -499 4348
3809 4348 -333 -4280 1142 4125 -2102 -3678 3017 2827 -3561 -2003 3859 1358 -4172 -558 4449
3824 4449 -552 -4274 1489 3768 -2151 -3364 2743 2892 -3513 -2096 4069 1024 -4224 -259 4094
3839 4094 -475 -4189 1367 4023 -2260 -3432 3048 2672 -3429 -1983 3880 1305 -4319 -314 4409
3854 4409 -715 -4174 1533 3719 -2187 -3454 2934 2901 -3665 -1917 4050 1019 -4082 -266 4144
3869 4144 -581 -4169 1494 3790 -2491 -3096 3035 2462 -3485 -1865 3969 1105 -4221 -1 4241
3884 4241 -909 -3864 1589 3609 -2359 -3245 3127 2547 -3772 -1566 3990 844 -4104 -132 4248
3899 4248 -781 -4202 1813 3729 -2608 -3023 3082 2455 -3573 -1767 4133 815 -4386 209 4126
3914 4126 -1033 -3887 1689 3601 -2523 -3122 3301 2244 -3726 -1387 3850 708 -4060 122 4187
3929 4187 -1095 -3909 2064 3287 -2590 -2703 3073 2211 -3583 -1528 4051 482 -4063 379 3851
3944 3851 -1046 -3665 1811 3409 -2725 -2907 3378 2069 -3667 -1367 3865 690 -4120 254 4168
3959 4168 -1200 -3831 2083 3271 -2607 -2891 3240 2362 -3851 -1449 4198 450 -4074 347 4052
3974 4052 -980 -3928 1958 3504 -2788 -2738 3286 1959 -3570 -1331 3933 592 -4194 413 4028
3989 4028 -1371 -3600 1973 3181 -2533 -2776 3243 2082 -3800 -1215 3927 319 -3926 331 3932
4004 3932 -1129 -3830 2026 3382 -2748 -2682 3191 2010 -3530 -1413 3967 612 -4104 451 3951
4019 3951 -1285 -3616 1891 3315 -2553 -2892 3293 2099 -3731 -1184 3758 511 -3833 196 3861
4034 3861 -1163 -3630 1970 3144 -2605 -2494 2945 2039 -3391 -1336 3856 425 -3868 459 3615
4049 3615 -1053 -3389 1644 3201 -2472 -2626 3136 1844 -3475 -1108 3595 536 -3813 254 3849
4064 3849 -1183 -3604 1920 3015 -2413 -2597 2917 2038 -3484 -1355 3785 365 -3792 324 3669
4079 3669 -970 -3539 1750 3251 -2545 -2587 3024 1825 -3262 -1149 3497 555 -3709 379 3605
4094 3605 -1245 -3230 1757 2750 -2173 -2405 2789 1880 -3245 -1021 3426 263 -3371 321 3349 -963
4110 -963 -3228 1753 2901 -2410 -2262 2828 1613 -3037 -1185 3313 492 -3538 349 3289 -1145
4125 -1145 -2978 1642 2725 -2202 -2428 2766 1754 -3181 -1004 3213 338 -3235 187 3282 -900
4140 -900 -3185 1674 2651 -2232 -2047 2516 1652 -2919 -1088 3244 308 -3279 443 3037 -1007 -2778
4156 -2778 1419 2594 -2049 -2120 2606 1528 -2887 -806 2922 292 -3025 259 3083 -1103 -2885
4171 -2885 1661 2356 -2126 -1931 2399 1566 -2912 -925 3165 154 -3141 517 2882 -1032 -2766 1576
4187 1576 2562 -2203 -1950 2657 1252 -2728 -790 2815 253 -2954 387 2872 -1172 -2508 1705
4202 1705 2074 -2007 -1789 2378 1347 -2726 -708 2813 -63 -2672 522 2488 -951 -2463 1548
4217 1548 2131 -2175 -1598 2402 981 -2464 -661 2759 83 -2845 570 2630 -1184 -2271 1606
4232 1606 1925 -1962 -1707 2362 1089 -2757 -465 2691 -138 -2659 520 2608 -1057 -2449 1687
4247 1687 1949 -2122 -1457 2282 943 -2485 -549 2639 -48 -2686 816 2449 -1185 -2074 1537 1877
4263 1877 -1959 -1547 2393 984 -2500 -339 2492 -156 -2430 534 2448 -1182 -2183 1775 1692 -2077
4279 -2077 -1263 2231 891 -2508 -414 2667 -260 -2519 875 2229 -1268 -2053 1620 1828 -2146 -1336
4295 -1336 2457 737 -2556 -182 2456 -205 -2502 708 2422 -1345 -1942 1800 1575 -1947 -1191 2261
4311 2261 806 -2416 -184 2559 -430 -2312 856 2072 -1142 -1922 1590 1638 -2033 -1042 2279 501
4327 501 -2272 -184 2312 -191 -2357 779 2149 -1374 -1857 1637 1448 -1883 -1173 2199 793 -2463
4343 -2463 -116 2425 -513 -2272 812 2131 -1284 -2027 1674 1576 -2125 -1092 2217 569 -2301 -202
4359 -202 2410 -256 -2426 940 2122 -1348 -1760 1585 1453 -1914 -1156 2268 613 -2447 -18 2281
4375 2281 -439 -2078 747 2087 -1239 -1848 1763 1408 -2024 -905 2078 583 -2168 -156 2408
4390 2408 -427 -2284 911 1936 -1279 -1683 1598 1491 -1968 -1074 2291 486 -2307 64 2274 -365
4406 -365 -2207 756 2160 -1300 -1830 1674 1349 -1884 -977 2011 632 -2235 -192 2337 -511 -2147
4422 -2147 900 1889 -1137 -1720 1503 1426 -1855 -998 2112 500 -2086 -106 2062 -198 -2151 748
4438 748 2018 -1215 -1668 1548 1285 -1745 -1065 1977 735 -2226 -115 2200 -423 -2040 767 1894
4454 1894 -1086 -1769 1509 1483 -1904 -994 2033 548 -2076 -241 2172 -187 -2227 783 1960 -1198
4470 -1198 -1627 1409 1308 -1646 -1076 1967 686 -2147 -104 2106 -301 -1914 578 1824 -980 -1705
4486 -1705 1413 1374 -1664 -887 1722 566 -1832 -273 2011 -198 -2005 679 1770 -984 -1530 1182
4502 1182 1368 -1519 -1116 1848 589 -1978 -174 1895 -160 -1895 521 1891 -997 -1690 1394 1242
4518 1242 -1522 -905 1629 759 -1795 -392 1954 -125 -1863 588 1703 -828 -1540 1115 1365 -1484
4534 -1484 -1056 1662 563 -1708 -237 1623 57 -1759 414 1694 -842 -1486 1130 1149 -1287 -958
4550 -958 1491 748 -1718 -322 1782 -158 -1676 430 1596 -679 -1460 1073 1271 -1425 -916 1603
4566 1603 539 -1585 -272 1699 1 -1745 524 1582 -835 -1320 1080 1097 -1228 -928 1471 611
4582 611 -1691 -187 1614 -220 -1507 415 1449 -670 -1334 1044 1102 -1320 -691 1325 475 -1366
4598 -1366 -322 1484 -89 -1546 452 1372 -808 -1147 891 1063 -1118 -846 1391 495 -1470 -114
4614 -114 1346 -91 -1346 397 1361 -715 -1264 1069 925 -1233 -683 1291 461 -1418 -226 1524
4630 1524 -197 -1473 561 1239 -687 -1096 910 973 -1113 -728 1428 310 -1406 -59 1323 -97
4646 -97 -1305 420 1301 -779 -1078 1027 751 -1110 -549 1213 389 -1355 -105 1436 -297 -1227 575
4663 575 1077 -741 -1003 898 831 -1288 -512 1308 144 -1277 34 1261 -295 -1322 597 1187 -986
4680 -986 -914 1128 629 -1152 -497 1292 231 -1443 136 1316 -486 -1151 609 1042 -847 -968 1120
4697 1120 707 -1257 -357 1262 69 -1201 21 1252 -337 -1252 664 1030 -924 -775 945 572
4713 572 -1070 -488 1300 130 -1361 217 1253 -446 -1071 613 1017 -803 -934 1118 615 -1301
4729 -1301 -249 1231 56 -1321 165 1348 -504 -1225 854 962 -968 -728 1111 590 -1311 -354
4745 -354 1358 -71 -1347 359 1227 -495 -1116 728 1049 -1061 -765 1222 422 -1219 -171 1283
4761 1283 1 -1282 283 1322 -650 -1125 888 837 -997 -645 1116 530 -1316 -230 1393 -180
4777 -180 -1233 395 1175 -589 -1111 864 937 -1180 -680 1267 343 -1354 -167 1324 -73 -1444 449
4794 449 1355 -762 -1068 918 875 -1068 -740 1217 466 -1404 -123 1358 -225 -1326 359 1240 -633
4811 -633 -1209 912 892 -1114 -606 1225 371 -1214 -158 1318 -123 -1374 451 1215 -722 -973 857
4828 857 874 -1013 -787 1260 387 -1384 -27 1328 -207 -1246 438 1324 -724 -1135 1068 845 -1158
4845 -1158 -648 1221 389 -1378 -160 1421 -284 -1344 605 1177 -759 -1039 885 875 -1183 -635 1388
4862 1388 235 -1367 53 1292 -208 -1260 492 1180 -753 -988 1026 732 -1111 -507 1207 366
4878 366 -1367 -42 1401 -349 -1221 574 1071 -696 -1005 925 836 -1250 -505 1290 183 -1287 22
4895 22 1297 -258 -1290 597 1209 -847 -920 1072 753 -1121 -523 1275 356 -1349 45 1362 -386
4912 -386 -1210 563 1091 -731 -1068 1009 852 -1235 -498 1242 194 -1247 -31 1214 -271 -1242 680
4929 680 1069 -869 -832 964 658 -1010 -552 1227 260 -1328 132 1189 -387 -1065 520 1067 -773
4946 -773 -863 1104 656 -1193 -271 1191 103 -1221 119 1319 -422 -1227 727 904 -939 -703 999
4963 999 560 -1149 -339 1298 -101 -1252 293 1106 -504 -1028 637 988 -894 -781 1087 427 -1119
4980 -1119 -200 1142 -23 -1202 257 1184 -548 -1025 811 794 -911 -613 989 485 -1146 -145 1273
4997 1273 -140 -1160 319 1031 -535 -998 800 847 -1118 -612 1198 322 -1181 -143 1188 -112
5013 -112 -1330 430 1195 -730 -978 827 718 -960 -610 1195 371 -1322 18 1280 -214 -1148 416
5030 416 1097 -656 -1003 934 772 -1151 -437 1176 192 -1141 -3 1209 -240 -1249 604 1081 -838
5047 -838 -859 950 655 -1052 -503 1275 201 -1342 174 1287 -466 -1150 577 1120 -884 -924 1177
5064 1177 668 -1310 -369 1279 81 -1358 149 1377 -473 -1246 803 1038 -1014 -802 1102 703
5080 703 -1300 -381 1425 27 -1394 244 1269 -482 -1172 753 1155 -1053 -967 1183 576 -1320 -272
5097 -272 1380 95 -1455 171 1475 -605 -1334 851 1012 -953 -875 1196 697 -1484 -341 1566
5113 1566 -14 -1507 348 1440 -530 -1348 883 1237 -1147 -915 1377 578 -1442 -301 1556 16
5129 16 -1655 341 1577 -788 -1368 979 1059 -1175 -991 1378 656 -1556 -258 1543 -61 -1531 324
5146 324 1456 -635 -1383 1014 1167 -1283 -807 1415 634 -1462 -288 1629 -47 -1663 500 1546
5162 1546 -760 -1328 990 1181 -1236 -947 1552 657 -1712 -231 1653 -84 -1629 395 1614 -779
5178 -779 -1514 1134 1154 -1398 -840 1472 572 -1663 -336 1778 -136 -1817 569 1535 -818 -1420 1050
5195 1050 1290 -1377 -1049 1624 554 -1718 -296 1752 -41 -1736 401 1767 -835 -1507 1149 1185
5211 1185 -1395 -978 1509 665 -1776 -300 1831 -144 -1812 471 1680 -773 -1557 1124 1409 -1475
5227 -1475 -1069 1704 587 -1797 -330 1772 -22 -1911 497 1803 -959 -1573 1259 1300 -1455 -1094
5243 -1094 1696 758 -1846 -265 1918 -174 -1769 493 1699 -835 -1566 1198 1325 -1538 -968 1685
5259 1685 614 -1756 -377 1874 -45 -1920 571 1775 -873 -1509 1131 1302 -1386 -1024 1729 689
5275 689 -1891 -274 1883 -142 -1836 482 1826 -817 -1639 1242 1350 -1529 -993 1638 710 -1780
5291 -1780 -365 2034 -108 -1932 615 1735 -919 -1578 1115 1409 -1444 -1132 1791 672 -1856 -287
5307 -287 1873 -65 -1872 438 1839 -894 -1640 1211 1318 -1437 -1036 1648 701 -1838 -425 1963
5323 1963 -110 -1899 549 1732 -766 -1601 1108 1473 -1498 -1123 1758 626 -1826 -268 1903 -47
5339 -47 -1877 444 1827 -943 -1602 1233 1289 -1440 -1061 1665 737 -1877 -301 1922 -217 -1828 471
5356 471 1697 -821 -1630 1139 1399 -1506 -996 1648 605 -1691 -227 1808 -75 -1837 493 1710
5372 1710 -909 -1446 1157 1244 -1372 -1012 1641 637 -1778 -218 1870 -114 -1731 545 1660 -810
5388 -810 -1549 1267 1274 -1530 -875 1692 613 -1747 -251 1903 -151 -1849 641 1716 -975 -1482 1226
5405 1226 1257 -1475 -920 1810 603 -1863 -85 1796 -227 -1732 627 1713 -931 -1446 1289 1122
5421 1122 -1520 -804 1670 541 -1771 -195 1832 -275 -1790 662 1608 -970 -1367 1292 1169 -1470
5437 -1470 -772 1746 432 -1788 11 1744 -334 -1752 659 1667 -1098 -1380 1408 1056 -1555 -734
5453 -734 1637 413 -1849 47 1874 -457 -1720 822 1511 -1055 -1301 1383 1073 -1683 -643 1764
5469 1764 238 -1753 44 1745 -384 -1684 781 1599 -1181 -1244 1426 916 -1542 -689 1733 371
5485 371 -1850 100 1758 -540 -1662 834 1447 -1063 -1328 1449 1002 -1715 -526 1800 144 -1800
5501 -1800 132 1791 -519 -1730 957 1553 -1341 -1193 1511 864 -1720 -536 1899 118 -1961 331
5517 331 1813 -680 -1650 972 1449 -1338 -1245 1613 831 -1770 -454 1856 82 -1905 242 1853
5533 1853 -694 -1649 1105 1388 -1335 -1079 1586 838 -1791 -498 1945 2 -1870 465 1750 -766
5549 -766 -1608 1050 1479 -1470 -1140 1718 709 -1795 -314 1830 -15 -1913 418 1867 -893 -1641
5565 -1641 1287 1312 -1486 -1073 1648 735 -1923 -367 1979 -146 -1858 561 1756 -848 -1600 1191
5581 1191 1386 -1525 -984 1747 532 -1853 -290 1893 -73 -1960 512 1839 -981 -1605 1246 1290
5597 1290 -1520 -1046 1801 611 -1992 -161 1960 -268 -1891 628 1775 -953 -1626 1427 1332 -1694
5613 -1694 -924 1801 503 -1923 -177 2031 -245 -1940 749 1880 -1124 -1516 1342 1212 -1657 -947
5629 -947 1920 505 -2009 -36 1958 -351 -1885 796 1804 -1132 -1620 1506 1192 -1758 -817 1812
5645 1812 438 -1937 -77 1989 -419 -1899 825 1706 -1150 -1420 1404 1151 -1744 -872 1947 382
5661 382 -1927 63 1908 -449 -1893 814 1745 -1226 -1471 1569 1059 -1769 -705 1886 401 -2018
5677 -2018 97 2051 -563 -1889 943 1616 -1266 -1412 1548 1096 -1796 -757 1926 186 -1996 163
5693 163 1927 -506 -1909 895 1646 -1361 -1278 1572 966 -1746 -672 1891 304 -1988 183 1917
5709 1917 -717 -1760 1011 1538 -1294 -1332 1590 994 -1881 -565 1912 154 -1871 244 1891 -596
5725 -596 -1798 1086 1536 -1472 -1164 1673 865 -1804 -517 2004 12 -2030 463 1890 -833 -1656
5741 -1656 1120 1505 -1411 -1208 1706 775 -1913 -346 1875 -34 -1895 379 1875 -791 -1627 1176
5757 1176 1330 -1414 -1036 1634 766 -1853 -354 1879 -123 -1904 541 1718 -875 -1544 1119 1341
5773 1341 -1514 -1036 1788 572 -1872 -196 1826 -150 -1869 567 1806 -994 -1585 1305 1257 -1582
5789 -1582 -885 1732 622 -1896 -159 2004 -256 -1834 706 1676 -1028 -1530 1357 1264 -1658 -897
5805 -897 1862 438 -1858 -65 1916 -303 -1923 706 1728 -1143 -1439 1422 1123 -1602 -798 1815
5821 1815 407 -1949 9 1912 -504 -1756 789 1605 -1126 -1403 1486 1109 -1817 -611 1966 256
5837 256 -1941 85 1973 -482 -1898 978 1687 -1323 -1283 1584 1058 -1744 -649 1964 296 -2032
5853 -2032 262 1965 -668 -1787 967 1631 -1279 -1437 1634 1002 -1788 -552 1963 192 -1972 190
5869 190 1935 -644 -1808 1060 1579 -1377 -1229 1667 999 -1842 -596 2053 137 -2070 244 1995
5885 1995 -683 -1834 1085 1590 -1518 -1347 1804 875 -1927 -481 2061 140 -2111 328 2102 -880
5901 -880 -1968 1246 1604 -1541 -1301 1848 959 -2140 -506 2211 -34 -2143 466 2050 -791 -1897
5917 -1897 1253 1681 -1625 -1241 1890 918 -1977 -455 2070 56 -2187 481 2086 -921 -1809 1317
5933 1317 1563 -1613 -1284 1872 881 -2157 -358 2229 -100 -2147 466 2071 -958 -1953 1352 1613
5949 1613 -1757 -1226 1928 834 -2116 -429 2232 -76 -2216 584 2094 -1063 -1817 1372 1575 -1704
5965 -1704 -1266 1994 846 -2226 -319 2211 -114 -2198 477 2095 -949 -1933 1397 1580 -1775 -1216
5981 -1216 1947 834 -2170 -396 2298 -122 -2310 611 2103 -1013 -1862 1417 1578 -1798 -1274 2061
5997 2061 739 -2234 -265 2265 -138 -2206 644 2156 -1111 -1890 1522 1584 -1827 -1139 2068 798
6013 798 -2256 -314 2306 -272 -2247 726 2024 -1076 -1847 1536 1592 -1856 -1155 2072 687 -2215
6029 -2215 -258 2219 -159 -2232 664 2061 -1125 -1813 1447 1443 -1747 -1111 1977 821 -2172 -244
6045 -244 2257 -292 -2162 689 1963 -996 -1847 1494 1488 -1859 -1029 1999 635 -2150 -224 2236
6061 2236 -309 -2192 737 2046 -1087 -1756 1496 1395 -1785 -1131 2031 640 -2170 -179 2185 -288
6077 -288 -2121 729 1944 -1118 -1810 1548 1419 -1797 -1023 1917 657 -2098 -205 2171 -292 -2107
6093 -2107 782 1966 -1069 -1648 1444 1435 -1744 -1022 2013 664 -2108 -91 2131 -317 -2045 768
6109 768 1876 -1207 -1687 1553 1273 -1832 -929 1974 533 -2165 -61 2148 -394 -2001 906 1747
6125 1747 -1168 -1505 1470 1295 -1810 -828 2039 427 -2034 88 1969 -391 -1945 783 1831 -1206
6141 -1206 -1488 1513 1127 -1723 -800 1873 439 -1990 -28 2033 -543 -1874 825 1664 -1168 -1429
6157 -1429 1495 1123 -1806 -752 1903 244 -1890 108 1905 -447 -1867 925 1656 -1324 -1273 1602
6173 1602 988 -1769 -700 1912 311 -2004 236 1933 -617 -1731 1004 1535 -1240 -1399 1651 947
6189 947 -1845 -596 1864 154 -1883 167 1911 -646 -1793 1020 1494 -1338 -1226 1539 946 -1733
6205 -1733 -558 1908 90 -1953 319 1814 -669 -1625 1012 1481 -1370 -1157 1660 763 -1821 -350
6221 -350 1820 -67 -1913 390 1870 -859 -1653 1202 1309 -1476 -999 1680 771 -1773 -321 1927
6237 1927 -86 -1895 568 1750 -857 -1558 1172 1440 -1543 -1051 1706 660 -1762 -286 1858 -34
6253 -34 -1913 507 1796 -928 -1603 1221 1288 -1452 -991 1672 700 -1948 -265 1966 -214 -1887 530
6270 530 1770 -995 -1579 1374 1326 -1650 -946 1823 466 -1888 -130 1940 -243 -1889 729 1794
6286 1794 -1133 -1484 1389 1194 -1626 -883 1837 585 -2024 18 1923 -321 -1870 722 1687 -1081
6302 -1081 -1531 1454 1244 -1670 -836 1841 464 -1888 -107 1953 -340 -1903 808 1725 -1154 -1479
6318 -1479 1404 1234 -1641 -883 1872 447 -1988 -57 1950 -468 -1842 772 1758 -1155 -1530 1495
6334 1495 1139 -1746 -737 1880 394 -1992 -10 2081 -461 -1902 891 1706 -1133 -1493 1496 1186
6350 1186 -1765 -827 1978 336 -2023 53 1974 -451 -1909 854 1761 -1277 -1436 1520 1124 -1756
6366 -1756 -766 1891 386 -2073 6 2053 -476 -1911 843 1702 -1199 -1461 1571 1135 -1862 -652
6382 -652 2034 275 -1980 117 1983 -566 -1858 941 1695 -1347 -1390 1623 999 -1727 -688 2034
6398 2034 275 -2074 214 1965 -656 -1841 974 1654 -1291 -1378 1585 1022 -1849 -618 1958 258
6414 258 -1936 169 1938 -503 -1878 990 1708 -1297 -1312 1552 1041 -1774 -726 1936 226 -1955
6430 -1955 152 1898 -515 -1748 961 1644 -1279 -1340 1570 1002 -1772 -585 1893 156 -1871 168
6446 168 1910 -634 -1838 1025 1530 -1321 -1247 1559 970 -1761 -559 1903 60 -1952 260 1814
6462 1814 -588 -1699 957 1562 -1232 -1225 1572 862 -1685 -516 1797 213 -1816 237 1864 -624
6478 -624 -1647 1005 1417 -1263 -1209 1448 909 -1718 -446 1806 109 -1758 255 1723 -585 -1640
6494 -1640 1001 1454 -1335 -1073 1549 734 -1641 -426 1711 104 -1804 375 1708 -720 -1542 1051
6510 1051 1268 -1259 -1069 1588 744 -1656 -278 1734 72 -1713 295 1633 -635 -1525 1045 1321
6526 1321 -1245 -950 1484 675 -1585 -381 1695 51 -1669 374 1600 -692 -1436 946 1254 -1263
6542 -1263 -1013 1450 661 -1613 -268 1656 -89 -1625 419 1556 -733 -1379 1025 1145 -1261 -834
6558 -834 1404 581 -1506 -207 1613 -199 -1632 543 1457 -812 -1306 1071 1073 -1306 -896 1446 476
6575 476 -1548 -103 1553 -189 -1529 475 1456 -875 -1296 1101 956 -1289 -730 1403 474 -1538
6591 -1538 -123 1599 -276 -1472 568 1352 -754 -1239 1063 1034 -1300 -623 1517 281 -1518 37
6607 37 1496 -288 -1525 628 1352 -949 -1121 1158 809 -1297 -554 1431 263 -1557 44 1491
6623 1491 -362 -1351 627 1263 -907 -1196 1169 890 -1349 -524 1423 234 -1448 -36 1492 -355
6639 -355 -1414 639 1289 -937 -1020 1092 827 -1282 -604 1485 278 -1534 121 1476 -402 -1360 632
6656 632 1260 -949 -1091 1185 771 -1320 -460 1377 149 -1498 134 1475 -470 -1352 786 1131 -1057
6673 -1057 -879 1220 707 -1356 -484 1573 111 -1527 259 1395 -485 -1322 769 1200 -1007 -975 1295
6690 1295 685 -1308 -385 1428 142 -1496 141 1493 -537 -1321 801 1090 -923 -964 1192 689 -1358
6707 -1358 -417 1417 -3 -1445 248 1381 -463 -1302 787 1122 -1092 -928 1302 587 -1313 -412
6723 -412 1415 37 -1433 261 1410 -574 -1222 860 1048 -1006 -873 1240 611 -1383 -361 1434
6739 1434 -13 -1404 216 1332 -490 -1291 834 1040 -1072 -859 1147 650 -1310 -392 1376 119
6755 119 -1416 280 1329 -529 -1201 795 1097 -967 -871 1175 574 -1379 -214 1360 -10 -1331
6771 -1331 278 1292 -494 -1227 865 967 -1037 -736 1157 518 -1298 -261 1404 -25 -1363 331
6787 331 1241 -623 -1117 783 987 -1036 -757 1200 477 -1223 -224 1270 -38 -1245 286 1258 -554
6804 -554 -1090 816 935 -931 -704 1091 556 -1191 -241 1296 -43 -1180 315 1118 -549 -1050 742
6821 742 917 -971 -739 1108 501 -1173 -241 1147 -39 -1213 282 1142 -553 -997 786 848 -899
6838 -899 -607 1053 428 -1130 -180 1132 -116 -1117 317 1050 -480 -991 696 812 -909 -530 1043
6855 1043 324 -1033 -171 1147 -18 -1106 304 1015 -530 -860 716 674 -894 -562 936 313 -1039
6872 -1039 -69 1029 -204 -1047 329 890 -592 -820 700 626 -916 -405 904 222 -965 -27 1020
6889 1020 -183 -972 412 833 -583 -670 720 603 -913 -373 993 183 -942 56 907 -249 -869
6906 -869 398 838 -632 -681 738 503 -779 -306 877 169 -945 8 923 -281 -892 418 729 -567
6924 -567 -596 641 488 -826 -347 892 44 -936 113 820 -260 -781 496 736 -657 -499 748 336
6942 336 -836 -130 870 14 -844 163 822 -394 -714 453 624 -627 -527 767 378 -869 -112
6959 -112 838 -127 -821 242 792 -357 -729 564 596 -737 -434 793 255 -809 -72 864 -91 -881
6977 -881 296 765 -480 -565 628 550 -742 -385 813 198 -859 35 842 -213 -787 354 733 -499
6995 -499 -671 624 424 -843 -250 856 68 -864 85 867 -303 -844 504 641 -607 -532 685 443
7013 443 -815 -304 915 38 -914 138 879 -328 -829 469 742 -677 -616 868 489 -879 -246 910
7031 910 46 -923 113 937 -347 -854 568 705 -665 -548 781 448 -914 -233 998 -59 -995
7048 -995 253 913 -395 -839 587 746 -731 -551 884 332 -939 -123 983 -44 -966 248 972
7065 972 -465 -805 676 714 -770 -557 991 384 -1026 -117 1095 -99 -1017 249 1029 -507 -919
7082 -919 706 766 -831 -484 995 316 -1024 -165 1059 -79 -1074 355 971 -521 -885 701 745 -842
7100 -842 -563 990 309 -1060 -87 1116 -98 -988 329 1052 -502 -888 796 732 -902 -500 992
7117 992 315 -1074 -126 1130 -125 -1088 355 1022 -541 -873 730 762 -904 -608 1032 284 -1135
7134 -1135 -93 1082 -70 -1118 350 1121 -616 -934 784 733 -865 -585 1021 404 -1133 -82
7150 -82 1206 -132 -1099 408 1042 -554 -918 789 784 -952 -547 1157 242 -1073 -87 1119 -177 -1134
7168 -1134 362 1021 -650 -874 769 677 -962 -547 1050 320 -1083 -31 1097 -214 -1071 347 1007
7185 1007 -556 -915 772 781 -969 -522 1055 283 -1077 -103 1128 -133 -1069 394 957 -595 -890
7202 -890 752 693 -867 -515 1038 270 -1107 -41 1106 -225 -1033 319 939 -543 -864 831 713
7219 713 -913 -479 999 261 -1097 -13 1090 -216 -1086 495 978 -646 -760 777 647 -908 -420
7236 -420 1037 207 -1068 12 1034 -230 -987 440 919 -595 -793 828 591 -951 -353 965 235
7253 235 -1053 -60 1010 -261 -981 497 858 -617 -739 783 589 -965 -346 992 89 -973 140
7270 140 972 -288 -907 468 855 -711 -643 881 449 -888 -354 932 120 -1019 114 964 -260
7287 -260 -850 555 812 -638 -603 796 501 -903 -236 1005 0 -919 147 948 -356 -900 533
7304 533 772 -671 -635 817 427 -864 -259 972 45 -989 203 955 -429 -829 516 723 -605
7321 -605 -560 908 416 -894 -181 950 -30 -957 178 922 -449 -824 606 726 -783 -502 829 307
7339 307 -944 -153 945 -28 -953 234 876 -462 -806 646 694 -769 -490 891 254 -889 -89 912
7357 912 -51 -914 281 926 -439 -818 700 718 -747 -455 910 285 -1004 -79 1053 -143 -941 348
7375 348 882 -426 -758 650 682 -865 -457 892 215 -967 -58 926 -125 -998 371 855 -618 -729
7393 -729 726 528 -795 -391 940 223 -984 -34 1038 -249 -909 373 910 -518 -752 736 591
7410 591 -866 -395 969 223 -970 -41 996 -178 -998 365 955 -622 -709 783 575 -887 -464
7427 -464 971 231 -1066 62 1010 -247 -971 418 856 -634 -750 839 576 -951 -333 1005 190
7444 190 -1015 22 1085 -205 -998 484 839 -654 -658 737 564 -903 -391 1026 224 -1005 80
7461 80 1021 -270 -1025 446 904 -593 -779 816 610 -934 -392 982 181 -1094 -2 1123 -235
7478 -235 -1037 441 900 -595 -786 751 649 -927 -387 1000 165 -996 35 1010 -245 -990 452
7495 452 919 -646 -767 789 565 -884 -413 989 203 -1109 17 1063 -250 -986 384 877 -619
7512 -619 -805 802 672 -900 -440 1002 202 -1064 -26 1067 -144 -1035 386 929 -615 -743 812
7529 812 580 -853 -441 1074 272 -1028 33 986 -199 -960 400 861 -597 -771 775 678 -878
7546 -878 -371 895 140 -989 -12 985 -201 -908 464 846 -592 -729 691 511 -803 -354 978
7563 978 186 -1003 42 946 -168 -865 399 892 -529 -766 730 572 -795 -338 878 283 -918
7580 -918 -56 937 -148 -882 388 788 -507 -702 637 593 -759 -390 858 258 -854 4 905 -173
7598 -173 -814 322 820 -506 -640 641 466 -733 -270 806 205 -837 -13 910 -182 -784 366
7615 366 686 -442 -609 619 510 -685 -325 791 171 -810 65 813 -171 -762 364 734 -487 -583
7633 -583 601 464 -651 -284 724 111 -863 4 827 -236 -683 327 635 -479 -540 608 469 -662
7651 -662 -189 709 37 -727 34 762 -160 -621 370 560 -499 -448 593 326 -608 -151 669 -4 -714 170
7671 170 580 -240 -569 328 497 -470 -408 587 269 -644 -156 642 -13 -651 90 591 -302 -571 408 489 -469
7692 -469 -362 581 269 -660 -99 728 8 -590 168 585 -338 -451 421 497 -494 -351 624 191 -635 -51
7712 -51 608 -69 -681 170 564 -367 -490 478 361 -563 -250 629 166 -655 -10 643 -137 -588 290 553
7732 553 -321 -500 495 391 -592 -217 613 114 -594 0 629 -149 -624 343 595 -433 -468 478 382 -571
7752 -571 -179 639 130 -682 81 675 -209 -543 321 482 -421 -459 560 317 -621 -168 653 -13 -660 73
7772 73 663 -219 -588 376 514 -465 -380 571 292 -626 -198 649 57 -651 102 638 -231 -612 426 484 -490
7793 -490 -460 620 343 -673 -147 751 23 -635 55 695 -286 -680 408 598 -492 -471 580 330 -694
7812 -694 -160 724 -23 -755 134 692 -288 -636 342 550 -536 -449 671 297 -683 -117 743 15 -773 151
7832 151 755 -343 -642 452 565 -559 -352 684 275 -696 -134 755 -58 -734 166 727 -241 -638 382
7851 382 591 -558 -420 649 372 -707 -140 725 76 -808 125 788 -295 -659 422 635 -542 -521
7869 -521 656 333 -741 -156 773 77 -805 149 732 -259 -697 466 619 -537 -457 599 319 -728
7887 -728 -199 752 17 -739 108 676 -270 -694 363 598 -531 -481 666 347 -657 -149 740 77 -701
7906 -701 82 745 -238 -704 430 618 -516 -517 602 397 -705 -225 829 45 -762 88 739 -203 -655
7925 -655 322 589 -500 -542 592 359 -687 -243 729 90 -706 49 696 -189 -671 371 532 -383 -475
7944 -475 529 423 -579 -248 664 68 -690 45 658 -183 -686 357 647 -449 -470 538 367 -600 -235
7963 -235 621 117 -677 7 665 -157 -607 283 584 -424 -510 477 342 -559 -236 609 163 -573 61 605
7983 605 -119 -556 244 611 -323 -481 432 303 -588 -271 567 142 -609 37 580 -94 -532 181 468 -347
8003 -347 -422 452 289 -499 -196 508 97 -555 -7 538 -88 -577 223 493 -296 -431 367 317 -434 -181 565
8024 565 102 -540 -16 421 -97 -487 179 397 -279 -361 378 321 -461 -194 459 98 -449 7 514 -57 -407
8045 -407 242 378 -226 -327 333 191 -362 -131 425 64 -384 31 400 -82 -436 193 372 -309 -262 337
8065 337 213 -378 -112 369 59 -407 -25 379 -98 -373 218 300 -249 -235 309 188 -370 -140 317 -2 -369
8086 -369 82 359 -86 -328 203 291 -274 -185 331 72 -317 -43 319 24 -335 138 341 -187 -270 237 203
8107 203 -191 -215 282 86 -343 -9 309 -50 -304 82 316 -194 -231 277 241 -257 -90 300 113 -268 -39
8128 -39 352 -10 -310 178 296 -182 -203 151 186 -266 -157 346 43 -286 34 282 -42 -319 108 266 -189
8149 -189 -242 248 91 -226 -92 266 70 -289 5 307 -69 -316 180 200 -195 -218 227 203 -222 -93 315
8170 315 13 -321 78 260 -77 -221 157 256 -180 -235 256 154 -257 -76 271 14 -293 11 362 -152 -295
8191b95
$$ Imaginary data points
##PAGE= N=2
##DATA TABLE= (X++(I..I)), XYDATA
0 0 0 0 0 0 0 0 0 0 0 0 -7 0 0 0 -8 8 0 0 -8 8 -6 4 -8 12 -9 6 -12 13 -14 11 -12 18 -19 16 -16 22 -23 21 -20 24 -27
41 -27 26 -24 25 -31 31 -30 32 -36 41 -42 45 -54 67 -77 93 -118 154 -198 258 -352 491 -699 1030 -1588
65 -1588 2606 -4678 9690 -26465 180736 1017608 -161278 -1013499 387811 910722 -564093
76 -564093 -788506 732235 621636 -857008 -432542 934996 227143 -962259 -26043
85 -26043 957487 -173731 -911606 362118 820627 -529238 -691166 661610 544932 -762863
95 -762863 -383267 832310 203611 -865002 -14813 854210 -162261 -807252 322458
104 322458 731356 -469706 -627573 598743 494331 -693558 -341745 750136 182420
113 182420 -776956 -21087 776270 -141577 -738402 296562 663036 -430554 -563385 539265
123 539265 448366 -625356 -314559 684885 163591 -709002 -10925 697564 -131195 -659023
133 -659023 263911 596870 -387954 -507675 491595 394763 -563933 -270468 608912 142612
143 142612 -632209 -10262 628698 -123607 -591545 247168 527535 -351994 -447861 439933
153 439933 353191 -511724 -239918 558959 115636 -575314 5765 565823 -120642 -536547
163 -536547 232533 484518 -335920 -406764 418046 311246 -475319 -208726 514025 100496
173 100496 -533580 14803 525375 -128816 -488449 229340 432990 -314301 -364625 387058
183 387058 279564 -443199 -178642 473644 73909 -478450 25672 465589 -121853 -436003
193 -436003 215352 384540 -295982 -313259 355215 233045 -396385 -149107 424345 58237
203 58237 -433492 37716 417895 -127532 -382783 204693 336634 -272717 -278533 332041
213 332041 204412 -374608 -120131 394551 36304 -397019 45098 386578 -127416 -358722
223 -358722 206147 309892 -270706 -247186 318625 179404 -354647 -105332 378049 22831
233 22831 -380903 60779 362050 -135497 -329429 200905 286706 -260556 -229820 309708
243 309708 158997 -339720 -83902 351172 11360 -350603 61058 337396 -134089 -305636
253 -305636 199204 257332 -249030 -201838 286871 142244 -316095 -74376 331302 286
263 286 -326887 70113 307188 -132113 -278797 189439 239769 -241920 -186077 281375 122720
274 122720 -303342 -58486 312406 -5535 -311956 72541 296741 -138192 -263689 193222
284 193222 219455 -235710 -170367 270112 114535 -295139 -49760 303479 -17020 -294340
294 -294340 77495 274582 -132053 -246602 183945 206230 -228286 -153446 257469 96549
304 96549 -272479 -40852 279088 -16644 -275857 76620 256794 -131422 -224029 175296
314 175296 185303 -211138 -142292 241764 90761 -261795 -32315 265888 -24319 -257520
324 -257520 75635 242154 -125522 -217215 173547 178669 -211879 -130725 236687 80980 -252007
335 -252007 -29756 260108 -26071 -255471 82771 235094 -132024 -204526 172188 168948
345 168948 -207064 -126190 235101 73913 -249570 -18304 249138 -33153 -239707 81296
355 81296 223184 -129075 -195058 171488 154947 -201564 -110122 220390 65084 -232610 -16652
366 -16652 236668 -35716 -226533 85059 204215 -125829 -176352 160809 143817 -192333
376 -192333 -102407 214855 53731 -223609 -5673 221747 -38965 -213907 83802 197443
386 197443 -128132 -168183 164390 130450 -189373 -90718 207043 48834 -218931 -1790
396 -1790 219671 -46852 -206499 89599 184894 -125527 -159020 158384 126062 -186396 -84016
407 -84016 202919 38767 -207398 3640 204952 -44635 -196338 86906 177099 -125549
417 -125549 -146913 154394 112331 -174711 -76612 190679 36652 -199728 8019 196459
427 196459 -50915 -182559 87350 163885 -120250 -140386 151390 107637 -175376 -67682
437 -67682 187543 27387 -191155 11150 189822 -51486 -180379 92483 159313 -127017
447 -127017 -130069 152350 98652 -172033 -64032 187208 23346 -192237 19735 184928
457 184928 -58483 -170117 92200 151398 -124126 -125678 152195 91123 -170282 -53132 177904
468 177904 17056 -179705 18973 176106 -56878 -162779 92428 139615 -119807 -112351
478 -112351 140742 83754 -158318 -50518 170231 12329 -171386 24734 163335 -57153
488 -57153 -151024 87520 134048 -117127 -108481 141139 75834 -155349 -42501 162717 9985
499 9985 -166178 25058 162604 -61459 -148288 92937 126641 -117164 -102565 137605 74791
510 74791 -154619 -40733 163185 3761 -161178 30023 152884 -60445 -141027 90370
520 90370 122203 -117718 -95012 136734 64219 -147082 -34280 152929 3218 -154197 30893
531 30893 146673 -63454 -130098 89757 109807 -111129 -87669 130469 60368 -144634 -27662
542 -27662 149158 -4834 -145562 34089 138068 -62621 -126005 91321 105465 -115185
552 -115185 -78350 130483 50207 -139979 -22052 146030 -9133 -145296 42130 134569
562 134569 -70825 -117158 93477 97520 -113267 -74311 130323 45002 -139778 -12895 139913
573 139913 -16298 -134844 42879 126689 -69708 -111989 94404 89522 -111962 -63824 122320
584 122320 38617 -129453 -11930 132927 -17970 -128336 46858 115861 -70252 -100318
594 -100318 89821 82808 -108118 -60125 122203 32078 -127757 -3967 126516 -21521 -122312
605 -122312 47208 113908 -73560 -97521 95897 75214 -110727 -51926 120851 28184 -128196
616 -128196 -762 129377 -28573 -121467 54568 107883 -75762 -92242 95194 72864 -112492
627 -112492 -47582 122880 19620 -124924 6017 122423 -30206 -117011 55432 105266
637 105266 -79028 -86161 96369 64071 -107666 -42098 116466 18129 -121668 9273 119333
648 119333 -35833 -109770 57873 97197 -76965 -82357 95307 62035 -109571 -36628 116309
659 116309 10995 -116935 12655 115053 -36894 -109033 61868 95520 -82941 -76357 97566
670 97566 56240 -108284 -35132 116762 10121 -119565 16891 114315 -41042 -103940 61146
681 61146 91911 -80211 -76056 97599 54380 -108787 -29995 112787 7323 -112931 14709
692 14709 110618 -38374 -102300 61185 87171 -78688 -69173 91413 51111 -102314 -30420
703 -30420 110265 5933 -111164 18411 105476 -39285 -96950 58393 86142 -77739 -69676
714 -69676 93959 48013 -103432 -25702 107797 4478 -109781 18282 107734 -42575 -98247
725 -98247 63938 83147 -80002 -66533 92951 48283 -104286 -25564 110333 315 -108760
736 -108760 22857 102483 -42800 -94230 62406 82000 -80855 -63585 93743 42237 -100196
747 -100196 -21706 103449 1165 -104433 21727 99717 -44151 -88412 62069 74221 -75883
758 -75883 -59324 88405 41355 -98313 -19205 101701 -3374 -98958 23254 93747 -42105
769 -42105 -86050 61559 72771 -78292 -54465 89085 35265 -95329 -16514 99759 -4225
780 -4225 -99996 26778 93323 -46862 -81541 62550 68539 -76140 -53486 88596 34264
791 34264 -96158 -12488 97143 -7537 -94103 25395 89418 -43735 -80651 61623 66129
802 66129 -74940 -48784 82957 32066 -88865 -14443 92882 -5977 -91617 26542 84339
813 84339 -43592 -74368 57609 63444 -71270 -48887 82808 29942 -88536 -10172 89103
824 89103 -7812 -87521 25742 83608 -44774 -74037 61722 59426 -73295 -43642 81255
835 81255 27735 -87754 -9211 90626 -11688 -87028 30564 78781 -45833 -69268 59676
846 59676 57653 -72902 -41564 81918 22709 -84842 -5124 84406 -10924 -82461 28206
857 28206 76754 -45464 -65486 58794 51539 -67663 -37889 75065 23152 -80884 -5322
868 -5322 81773 -12894 -77174 28251 70279 -41568 -62351 55105 51003 -67047 -35235 74070
880 74070 18703 -76557 -3511 77556 -12058 -76284 29332 69896 -45029 -58924 56331
891 56331 46742 -64945 -34244 72910 18924 -77724 -1073 76950 -15528 -72192 29323 66413
903 66413 -42504 -58402 55706 45955 -65291 -30740 69875 16221 -71881 -2276 72821
914 72821 -13337 -70256 29471 62527 -42373 -52215 51794 41994 -60210 -30084 67574 14729
926 14729 -70487 1418 68404 -15289 -64399 27817 59533 -41143 -50996 53281 38249 -60925
938 -60925 -24570 64888 11932 -67561 1914 68319 -17549 -64032 32011 55406 -42733 -45923
950 -45923 51528 35891 -59878 -22934 65587 7602 -66086 6628 63145 -18546 -59323 30440
962 30440 53526 -42544 -43450 51731 30872 -56550 -19078 59341 7611 -61642 5713 60674
974 60674 -19695 -55065 30952 47449 -39348 -39775 47440 30388 -54821 -17670 58402 3984
986 3984 -57712 7688 55735 -18625 -53015 30812 46910 -42094 -36674 49399 25645 -53609
998 -53609 -15333 57201 3614 -59056 10201 56423 -23099 -50042 32862 43025 -41204 -35449
1010 -35449 49576 24848 -55533 -11716 56851 -467 -55297 10857 53226 -21821 -49100 33253
1022 33253 40964 -42122 -30548 47235 20662 -50956 -10906 54137 -992 -54241 13655 49980
1034 49980 -23870 -43894 31899 37708 -39926 -29683 47541 18325 -51382 -6213 51522 -4176
1046 -4176 -50521 14129 48823 -25266 -43571 35534 34713 -42269 -25149 46351 16185 -50172
1058 -50172 -5840 52417 -6612 -50519 18030 45384 -26719 -39878 34324 33735 -42055 -24651
1070 -24651 47799 13423 -49302 -2934 48636 -5970 -47703 15786 44987 -26382 -38609 34583
1082 34583 30212 -39644 -22365 43735 14323 -47540 -3930 48583 -7402 -45721 16763 41284
1094 41284 -24464 -36936 32626 30535 -40474 -20939 45011 10554 -46212 -1450 46651 -7642
1106 -7642 -46237 18273 42410 -28273 -35187 35232 27256 -40130 -19639 44821 10320 -48113
1118 -48113 1025 47506 -11643 -43922 19825 39814 -27491 -34894 35533 27003 -41482 -16743
1130 -16743 43875 7394 -44259 1087 44554 -10536 -42890 20584 37603 -28508 -30534 33644
1142 33644 23844 -38113 -16649 42368 7098 -43910 3243 42016 -11896 -38801 19232 35580
1154 35580 -27110 -30342 34662 22114 -39260 -13207 40947 5294 -41977 2887 42302 -12632
1166 -12632 -39488 21964 33625 -28522 -27223 33450 21225 -38534 -13334 42200 3502 -42312
1178 -42312 5683 39941 -12945 -37336 20139 33842 -27916 -27507 34055 19140 -37046 -11479
1190 -11479 38561 4392 -40085 3936 39738 -13069 -36163 20529 30903 -25808 -25905 30881
1202 30881 20090 -35932 -11775 38662 2503 -38283 5347 36738 -12319 -35156 20123 31376
1214 31376 -27837 -24592 32845 16960 -35331 -10065 37523 2553 -39067 6564 37509 -15441
1226 -15441 -33197 21911 28388 -27021 -23491 32430 16718 -36499 -8095 37382 -92 -36110
1238 -36110 6657 34600 -13489 -32444 21034 27459 -27131 -20616 30441 14394 -32642 -8567
1250 -8567 34926 1237 -35449 7066 33075 -13866 -29150 18968 25529 -24152 -21095 29499
1262 29499 14205 -32821 -6449 33252 -145 -32882 6197 32404 -13377 -29900 20593 24606
1274 24606 -25508 -18545 28449 13190 -31446 -6937 33855 -1029 -33566 8730 30810 -14485
1286 -14485 -27642 19489 24382 -24950 -19148 29460 11945 -31223 -5121 31279 -669 -31329
1298 -31329 6968 30501 -14077 -27137 20011 21945 -23644 -17144 26528 12305 -29576 -5879
1310 -5879 31043 -1635 -29803 8006 27302 -13024 -24998 18346 21600 -23820 -15959 27375
1322 27375 9419 -28442 -3766 28925 -1636 -29265 8316 27566 -15037 -23386 19798 18610
1334 18610 -22970 -14305 26262 9202 -28952 -2349 29178 -4213 -27153 9203 24997 -13691
1346 -13691 -22689 18900 18562 -23267 -12670 25182 7144 -25815 -2606 26572 -2728 -26590
1358 -26590 8935 24253 -14171 -20344 17351 16835 -20347 -13262 23627 7947 -25626 -1614 25222
1371 25222 -3650 -23979 7927 22889 -12803 -20729 18017 16359 -21518 -11182 23020 6643
1383 6643 -24226 -2005 25361 -3927 -24744 10040 21768 -14451 -18420 17714 15402 -21250
1395 -21250 -11214 24197 5422 -25071 272 24014 -4707 -22896 9012 21513 -14078 -18344
1407 -18344 18416 13553 -20561 -9092 21778 5263 -23132 -638 23651 -4998 -21945 9736
1419 9736 18970 -12923 -16284 16119 13433 -19590 -8824 21792 3447 -21901 1147 21208 -4892
1432 -4892 -20748 9453 19107 -14307 -15416 17469 10991 -19110 -7303 20629 3314 -22058 1848
1445 1848 21771 -7120 -19548 10933 16963 -13814 -14749 17118 11396 -19984 -6447 20889 1706
1458 1706 -20357 2023 20078 -5789 -19456 10381 17145 -14325 -13448 16478 10130 -17923 -7113
1471 -7113 19738 3133 -20813 1898 19835 -6153 -17851 9284 16240 -12576 -14211 16230
1483 16230 10452 -18742 -5837 19383 1948 -19456 1483 19653 -5883 -18753 10620 15722
1495 15722 -13917 -12209 15943 9327 -17952 -5888 19946 1210 -20204 3561 18708 -7021
1507 -7021 -16962 10028 15388 -13365 -12548 16450 8357 -17795 -4266 17955 1033 -18246 2415
1520 2415 18226 -6693 -16554 10319 13547 -12517 -10965 14179 8494 -16271 -4948 17640 535
1533 535 -17108 3241 15861 -6049 -14963 9066 13490 -12543 -10531 14833 6767 -15660 -3709
1546 -3709 16113 768 -16809 3054 16355 -7206 -14187 10187 11780 -12093 -9742 14223 7143
1559 7143 -16272 -3294 16858 -617 -16089 3508 15144 -6170 -14274 9458 12349 -12477
1571 -12477 -9058 13941 6044 -14658 -3635 15593 675 -16163 3146 15213 -6449 -13161
1583 -13161 8527 11390 -10460 -9651 12946 6834 -14681 -3112 14849 -58 -14320 2498 14182
1596 14182 -5388 -13402 8739 11145 -11163 -8064 12207 5665 -13220 -3182 14330 -264 -14522
1609 -14522 3883 13102 -6494 -11315 8317 9977 -10493 -7967 12548 4780 -13306 -1567 12874
1622 12874 -826 -12452 3037 12203 -5935 -10859 8611 8401 -9880 -6159 10551 4490 -11600
1635 -11600 -2228 12314 -832 -11630 3580 10255 -5305 -9177 6986 8220 -9164 -6070 10786
1648 10786 3241 -10953 -942 10779 -834 -10968 3200 10594 -6062 -8858 8057 6564 -8963
1661 -8963 -4940 9968 3116 -11240 -414 11531 -2431 -10458 4486 9232 -5862 -8399 7766
1674 7766 6962 -9649 -4324 10424 1803 -10185 14 10193 -1752 -10324 4232 9384 -6493
1687 -6493 -7466 7593 5750 -8183 -4539 9308 2612 -10128 120 9696 -2366 -8695 3737
1700 3737 7988 -5275 -7297 7253 5499 -8621 -3107 8681 1263 -8613 142 8823 -2239 -8536
1714 -8536 4682 7042 -6274 -5210 6963 4020 -7715 -2682 8761 438 -8839 1902 7854
1727 7854 -3314 -6793 4262 6193 -5806 -5060 7283 2935 -7732 -1010 7398 -140 -7413 1456
1741 1456 7550 -3371 -6706 5013 5059 -5623 -3742 6015 2916 -6979 -1353 7700 -837 -7198 2534
1756 2534 6272 -3452 -5879 4558 5281 -6127 -3761 7153 1713 -7108 -244 6940 -858 -7193
1770 -7193 2632 6980 -4708 -5626 5894 4070 -6294 -3096 6952 1903 -7867 70 7790 -2174
1784 -2174 -6858 3366 5962 -4316 -5561 5725 4465 -7060 -2485 7334 816 -7037 147 7082
1798 7082 -1424 -7092 3305 6251 -4816 -4643 5404 3518 -5861 -2692 6829 1164 -7354 816
1812 816 6776 -2257 -5986 3062 5538 -4230 -4908 5801 3338 -6616 -1431 6489 197 -6443 834
1827 834 6758 -2520 -6470 4398 5178 -5332 -3819 5728 2901 -6428 -1864 7227 -84 -7251 1911
1842 1911 6315 -2992 -5739 3858 5375 -5282 -4344 6488 2658 -6765 -1163 6507 232 -6789 989
1857 989 6950 -2906 -6171 4426 4876 -5089 -4060 5729 3316 -6858 -1863 7562 -72 -7279 1559
1872 1559 6586 -2545 -6430 3894 5908 -5748 -4428 6826 2692 -6949 -1493 7281 414 -7834
1886 -7834 1497 7703 -3485 -6490 4672 5371 -5340 -4557 6387 3447 -7546 -1464 7756 -329
1900 -329 -7263 1473 7005 -2515 -6891 4171 5992 -5653 -4445 6197 3072 -6337 -2152 6988
1914 6988 825 -7493 1117 7049 -2718 -6088 3578 5487 -4515 -5019 5893 3626 -6813 -1789
1928 -1789 6805 409 -6529 566 6739 -2088 -6645 3936 5523 -5126 -4201 5635 3243 -6253 -2366
1943 -2366 7133 608 -7344 1220 6677 -2412 -5925 3266 5668 -4606 -4841 6001 3266 -6594 -1751
1958 -1751 6488 921 -6753 162 7124 -1864 -6623 3403 5408 -4171 -4472 4793 3934 -5907 -2773
1973 -2773 6885 1000 -6851 498 6399 -1365 -6245 2581 6105 -4090 -5039 5333 3499 -5667 -2366
1988 -2366 5959 1496 -6638 18 6895 -1891 -6177 3134 5251 -3776 -4679 4683 3998 -5840 -2481
2003 -2481 6323 756 -6055 251 5767 -1051 -5962 2458 5602 -3968 -4383 4588 3309 -4776 -2691
2018 -2691 5315 1851 -5983 -297 5865 -1135 -5148 1892 4793 -2517 -4669 3795 3898 -4793 -2498
2033 -2498 5078 1402 -4977 -823 5263 -234 -5515 1836 4853 -2947 -3806 3349 3233 -3972 -2731
2048 -2731 4891 1664 -5384 -110 5105 -887 -4607 1351 4568 -2417 -4308 3662 3170 -4342 -1971
2063 -1971 4365 1284 -4577 -748 5106 -505 -5027 1869 4280 -2439 -3554 2742 3390 -3586 -2762
2078 -2762 4475 1458 -4644 -295 4266 -224 -4300 902 4529 -2089 -4016 3141 2951 -3363 -2196
2093 -2196 3535 1827 -4100 -921 4553 -476 -4176 1496 3542 -1812 -3300 2437 3179 -3393 -2303
2108 -2303 3997 1088 -3723 -445 3650 57 -3877 925 3900 -2052 -3116 2638 2368 -2756 -2140
2123 -2140 3142 1793 -3800 -863 3994 -242 -3461 628 3176 -919 -3393 1802 3116 -2832 -2096
2138 -2096 3078 1383 -2996 -1142 3412 668 -3852 452 3654 -1410 -2926 1721 2572 -1972 -2480
2153 -2480 2870 1845 -3480 -706 3416 -102 -3077 375 3260 -887 -3364 1997 2679 -2637 -1774
2168 -1774 2584 1371 -2756 -1147 3333 315 -3582 824 3080 -1326 -2654 1457 2686 -1982 -2500
2183 -2500 2844 1699 -3110 -763 2875 516 -2908 -132 3340 -783 -3203 1757 2517 -2022 -2062 2115
2199 2115 2016 -2675 -1597 3325 571 -3247 299 2682 -563 -2725 854 2880 -1883 -2470 2601 1564
2215 1564 -2641 -1063 2573 964 -3023 -379 3325 -753 -2893 1325 2392 -1460 -2258 1815 2285
2230 2285 -2625 -1635 3172 661 -2938 -214 2839 145 -3239 631 3326 -1652 -2719 2100 2050 -2134
2246 -2134 -1919 2616 1615 -3358 -741 3519 -306 -3192 661 2967 -901 -3154 1719 2895 -2670
2261 -2670 -1943 2915 1187 -2796 -904 3138 381 -3691 681 3444 -1549 -2754 1815 2420 -2009
2276 -2009 -2380 2770 1779 -3368 -756 3246 51 -3021 231 3255 -798 -3449 1840 2924 -2558
2291 -2558 -2153 2571 1783 -2751 -1643 3475 846 -3764 348 3463 -884 -3104 1186 3211 -1921
2306 -1921 -3165 2919 2317 -3335 -1398 3261 1033 -3483 -646 3877 -443 -3884 1576 3238 -1960
2321 -1960 -2728 2253 2677 -3023 -2229 3811 1066 -3846 -132 3595 -179 -3649 802 3850 -1804 -3376
2337 -3376 2831 2463 -3064 -1951 3242 1654 -3858 -930 4412 -294 -4110 1147 3749 -1486 -3566
2352 -3566 2112 3555 -3163 -2672 3862 1597 -3824 -912 3977 469 -4411 506 4566 -1807 -3916
2367 -3916 2487 3179 -2730 -2895 3376 2411 -4166 -1260 4511 45 -4121 573 4047 -1074 -4197 2120
2383 2120 3848 -3223 -2857 3594 2023 -3636 -1657 4069 978 -4631 356 4480 -1437 -3836 1943
2398 1943 3643 -2429 -3559 3455 2852 -4276 -1692 4385 788 -4254 -288 4582 -586 -4770 1934
2413 1934 4143 -2906 -3336 3264 2874 -3825 -2501 4626 1503 -5003 -115 4728 -771 -4403 1304
2428 1304 4391 -2351 -4048 3468 3085 -4124 -2057 4209 1520 -4522 -801 4987 -414 -4950 1718
2443 1718 4292 -2343 -3674 2785 3421 -3710 -2781 4619 1587 -4811 -418 4622 -201 -4694 965
2458 965 4866 -2217 -4427 3211 3377 -3647 -2640 3970 2162 -4661 -1217 5213 -128 -4951 1268
2473 1268 4474 -1752 -4281 2511 4029 -3670 -3114 4395 1909 -4440 -1114 4508 502 -4929 657
2488 657 4910 -2001 -4256 2808 3480 -3198 -3198 3829 2619 -4720 -1418 4954 88 -4606 617 4423
2504 4423 -1324 -4500 2403 4056 -3575 -3110 4083 2133 -4250 -1659 4716 839 -5155 533 4963
2519 4963 -1677 -4258 2263 3847 -2892 -3623 3944 2729 -4748 -1482 4866 481 -4703 108 4850
2534 4850 -1056 -4938 2389 4205 -3381 -3219 3713 2514 -4125 -1974 4864 845 -5173 554 4822
2549 4822 -1420 -4306 1917 4133 -2888 -3730 3996 2599 -4491 -1372 4463 724 -4603 -14 4974
2564 4974 -1257 -4782 2459 3963 -3075 -3215 3473 2840 -4224 -2079 4929 716 -4898 510 4523
2579 4523 -1177 -4394 1974 4360 -3134 -3615 4091 2463 -4341 -1622 4415 994 -4852 -1 5038
2594 5038 -1439 -4512 2415 3736 -2957 -3300 3573 2770 -4486 -1678 4948 420 -4684 447 4452
2609 4452 -1102 -4478 2104 4108 -3363 -3252 4031 2183 -4176 -1521 4586 832 -5060 448 5001
2624 5001 -1701 -4302 2458 3804 -2934 -3460 3879 2702 -4696 -1360 4917 197 -4704 517 4729
2639 4729 -1355 -4851 2598 4127 -3635 -3051 4037 2223 -4254 -1581 4869 550 -5155 999 4778
2654 4778 -2028 -4129 2595 3789 -3368 -3396 4361 2213 -4863 -967 4727 54 -4727 606 4821
2669 4821 -1817 -4515 3143 3733 -3861 -2760 4122 2146 -4653 -1405 5201 78 -5261 1217 4688
2684 4688 -2049 -4238 2711 3977 -3743 -3191 4740 1985 -5051 -801 4950 56 -5105 915 5228
2699 5228 -2238 -4674 3420 3604 -3982 -2790 4387 2172 -5164 -1009 5590 -536 -5294 1556 4754
2714 4754 -2251 -4492 3221 3979 -4417 -2892 5003 1560 -5131 -621 5202 -220 -5437 1600 5367
2729 5367 -2946 -4482 3796 3614 -4236 -2926 4927 2040 -5706 -629 5833 -791 -5345 1776 5064
2744 5064 -2629 -4800 3880 4032 -4986 -2777 5417 1598 -5435 -789 5789 -442 -5977 1988 5354
2759 5354 -3283 -4376 4017 3672 -4675 -3013 5631 1758 -6150 -116 5985 -1060 -5518 1934 5330
2774 5330 -3072 -4894 4399 3763 -5290 -2397 5505 1488 -5842 -475 6265 -967 -6183 2528 5390
2789 5390 -3494 -4568 4149 3943 -5135 -3056 6048 1573 -6385 -77 6046 -1039 -5973 2054 5857
2804 5857 -3504 -5174 4755 3897 -5341 -2713 5736 1816 -6289 -524 6685 -1210 -6280 2624 5497
2819 5497 -3565 -4866 4468 4266 -5607 -2991 6442 1336 -6400 -19 6248 -938 -6295 2331 6002
2834 6002 -3891 -4965 4953 3718 -5537 -2779 6054 1780 -6801 -234 6851 -1374 -6263 2552 5674
2849 5674 -3464 -5178 4730 4320 -5930 -2789 6470 1366 -6484 -296 6671 -905 -6766 2522 6137
2864 6137 -4031 -5025 4838 3921 -5431 -3102 6283 1770 -6917 5 6838 -1443 -6269 2484 5869
2879 5869 -3565 -5387 4978 4207 -5942 -2663 6228 1445 -6398 -364 6682 -1093 -6702 2778 5962
2894 5962 -3972 -4935 4707 4221 -5505 -3268 6514 1709 -6858 -34 6615 -1162 -6280 2237 6187
2909 6187 -3687 -5492 5133 4215 -5823 -2853 6246 1842 -6649 -593 7033 -1112 -6737 2749 5878
2924 5878 -3723 -5062 4662 4400 -5804 -3154 6700 1472 -6805 -45 6573 -1096 -6432 2391 6163
2939 6163 -3973 -5187 5179 3783 -5665 -2700 6145 1694 -6852 -203 7036 -1540 -6426 2843
2953 2843 5661 -3714 -5166 4768 4331 -5971 -2871 6628 1237 -6587 -1 6585 -1024 -6683 2598
2968 2598 6233 -4068 -5058 5038 3865 -5563 -2980 6207 1804 -6890 -88 6784 -1602 -6232 2635
2983 2635 5711 -3716 -5216 4991 4127 -6029 -2579 6382 1213 -6357 -130 6568 -1187 -6543 2917
2998 2917 5734 -4204 -4641 4925 3695 -5581 -2809 6479 1411 -6866 307 6568 -1568 -6108 2507
3013 2507 5741 -3822 -5131 5224 3850 -6068 -2454 6281 1302 -6524 -200 6893 -1438 -6596 3110
3028 3110 5686 -4113 -4673 4884 3976 -5805 -2782 6682 1070 -6868 500 6458 -1644 -6171 2759
3043 2759 5825 -4156 -4899 5460 3413 -5938 -2231 6179 1154 -6634 279 6742 -1962 -6292 3299
3058 3299 5255 -4145 -4566 4979 3841 -6026 -2481 6689 828 -6584 504 6335 -1536 -6231 2894
3073 2894 5847 -4404 -4742 5327 3380 -5776 -2445 6236 1361 -6803 297 6742 -1937 -6029 3089
3088 3089 5263 -3998 -4744 5115 3760 -6163 -2132 6518 687 -6371 419 6323 -1638 -6207 3214
3103 3214 5461 -4543 -4192 5231 3063 -5790 -2089 6456 823 -6762 893 6374 -2246 -5731 3213
3118 3213 5283 -4208 -4584 5516 3282 -6297 -1720 6387 422 -6416 620 6578 -2135 -6329 3683
3133 3683 5314 -4725 -4169 5313 3231 -5952 -2172 6684 540 -6884 1123 6316 -2332 -5817 3367
3148 3367 5350 -4625 -4474 5777 2993 -6231 -1557 6325 456 -6477 829 6576 -2461 -5952 3883
3163 3883 4871 -4663 -4024 5311 3131 -6159 -1855 6821 208 -6623 1151 6161 -2108 -5828 3309
3178 3309 5380 -4714 -4278 5683 2899 -6023 -1793 6321 706 -6772 733 6653 -2361 -5889 3519
3193 3519 4958 -4297 -4259 5256 3301 -6201 -1806 6572 209 -6380 1008 6138 -2034 -5961 3447
3208 3447 5271 -4795 -3948 5477 2699 -5816 -1709 6250 464 -6626 1196 6253 -2656 -5390 3573
3223 3573 4759 -4405 -4155 5500 2948 -6230 -1351 6361 28 -6194 1000 6183 -2280 -5932 3839
3238 3839 4987 -4887 -3778 5394 2785 -5897 -1792 6533 326 -6660 1340 6137 -2543 -5426 3457
3253 3457 4904 -4516 -4130 5672 2722 -6221 -1265 6138 101 -6097 909 6183 -2377 -5696 3729
3268 3729 4558 -4632 -3517 5067 2675 -5783 -1540 6344 23 -6250 1320 5664 -2208 -5313 3193
3283 3193 4794 -4464 -3838 5354 2463 -5583 -1294 5774 374 -5978 857 5998 -2367 -5351 3548
3298 3548 4388 -4124 -3637 4842 2827 -5643 -1460 6006 -76 -5682 1273 5330 -2078 -5143 3277
3313 3277 4503 -4524 -3340 5108 2055 -5248 -1147 5456 131 -5706 1337 5380 -2699 -4571 3520
3328 3520 3746 -4065 -3171 4910 2160 -5546 -774 5622 -443 -5178 1352 5030 -2272 -4778 3538
3343 3538 3867 -4519 -2742 4889 1752 -5111 -903 5489 -151 -5644 1601 5190 -2610 -4409 3303
3358 3303 3746 -4050 -3125 4908 1910 -5376 -557 5242 -480 -5009 1339 4987 -2370 -4558 3569
3373 3569 3550 -4241 -2456 4474 1673 -4815 -822 5153 -497 -5056 1791 4443 -2493 -3909 3138
3388 3138 3435 -4071 -2698 4739 1412 -4887 -323 4700 -477 -4667 1389 4624 -2640 -4008 3586
3403 3586 2969 -3970 -2170 4364 1509 -4815 -449 5030 -913 -4627 1875 4068 -2532 -3598 3295
3418 3295 3009 -4254 -1981 4692 831 -4626 93 4483 -870 -4530 1954 4155 -3044 -3220 3684
3433 3684 2303 -3992 -1632 4371 786 -4811 438 4746 -1572 -4131 2237 3615 -2886 -3266 3719
3448 3719 2464 -4401 -1267 4562 314 -4418 409 4492 -1251 -4403 2434 3862 -3354 -2921 3714
3463 3714 2294 -4081 -1646 4604 575 -4821 682 4459 -1640 -4014 2198 3659 -3109 -3223 3927
3478 3927 2186 -4433 -1060 4380 210 -4412 537 4434 -1606 -4174 2739 3324 -3430 -2488 3738
3493 3738 1942 -4142 -1157 4652 -82 -4650 1156 4090 -1880 -3734 2458 3446 -3420 -2743 4147
3508 4147 1602 -4345 -645 4365 -44 -4485 944 4503 -2145 -3951 3060 3099 -3537 -2458 3937
3523 3937 1760 -4558 -686 4812 -511 -4524 1469 4058 -2150 -3808 2933 3325 -3887 -2339 4353
3538 4353 1225 -4424 -347 4409 -384 -4601 1506 4305 -2635 -3545 3320 2809 -3679 -2229 4240
3553 4240 1423 -4693 -295 4745 -845 -4401 1585 4070 -2357 -3841 3302 3124 -4127 -2120 4411
3568 4411 1202 -4544 -449 4755 -487 -4827 1732 4379 -2676 -3582 3245 2995 -3819 -2381 4536
3583 4536 1377 -4901 -89 4761 -801 -4493 1558 4365 -2481 -3869 3529 2946 -4155 -1895 4337
3598 4337 1114 -4655 -263 4850 -970 -4723 2029 4050 -2806 -3408 3305 2951 -4024 -2126 4665
3613 4665 975 -4789 160 4650 -979 -4550 1786 4343 -2904 -3731 3845 2745 -4167 -1866 4501
3628 4501 1141 -4829 -121 5015 -1154 -4614 2142 4061 -2880 -3543 3564 3008 -4371 -1970 4825
3643 4825 757 -4782 144 4651 -978 -4574 2011 4245 -3060 -3396 3754 2550 -4090 -1789 4491
3658 4491 1010 -4848 133 4855 -1320 -4353 2097 3950 -2763 -3514 3591 2818 -4389 -1751 4676
3673 4676 687 -4690 129 4792 -995 -4685 2132 4192 -3095 -3439 3711 2684 -4087 -2030 4599
3688 4599 1003 -4992 259 4785 -1307 -4420 2051 4054 -2900 -3594 3768 2712 -4379 -1581 4547
3703 4547 631 -4563 159 4723 -1249 -4490 2393 3829 -3117 -3026 3589 2452 -4131 -1734 4672
3718 4672 553 -4765 565 4454 -1367 -4095 2126 3771 -2992 -3303 3886 2258 -4244 -1403 4370
3733 4370 648 -4661 244 4690 -1441 -4350 2356 3641 -3019 -3042 3556 2468 -4221 -1559 4707
3748 4707 422 -4668 534 4414 -1241 -4214 2111 3835 -3202 -3056 3809 2071 -4042 -1305 4279
3763 4279 527 -4519 509 4466 -1639 -4021 2376 3373 -2899 -2958 3583 2279 -4188 -1243 4407 157
3779 157 -4363 605 4193 -1392 -4144 2362 3689 -3257 -2837 3760 1991 -4057 -1300 4446 457
3794 457 -4656 725 4405 -1726 -3916 2454 3443 -3056 -2881 3822 2075 -4353 -1014 4380 59 -4262
3810 -4262 679 4188 -1588 -3928 2606 3264 -3363 -2411 3724 1740 -4035 -1005 4351 33 -4411
3825 -4411 1070 4015 -1787 -3540 2415 3164 -3134 -2549 3833 1636 -4172 -643 4122 -125 -4141
3840 -4141 890 4136 -1823 -3847 2758 3076 -3269 -2322 3623 1706 -4097 -875 4416 -207 -4298
3855 -4298 1164 3914 -1869 -3617 2557 3242 -3352 -2449 3909 1442 -4106 -652 4050 -58 -4189
3870 -4189 1053 4002 -2121 -3466 2824 2813 -3242 -2201 3717 1559 -4149 -630 4293 -423 -4086
3885 -4086 1231 3723 -1937 -3437 2782 2963 -3505 -2103 3878 1214 -4015 -495 4194 -298 -4281
3900 -4281 1295 3994 -2240 -3356 2866 2727 -3304 -2235 3924 1349 -4270 -233 4288 -676 -3944
3915 -3944 1350 3765 -2126 -3451 3032 2745 -3567 -1760 3800 987 -3950 -293 4146 -652 -4111
3930 -4111 1644 3632 -2386 -3032 2799 2536 -3244 -1911 3869 1071 -4082 17 3973 -742 -3764
3945 -3764 1439 3683 -2246 -3189 3067 2501 -3554 -1645 3746 1068 -4040 -301 4242 -724 -4058
3960 -4058 1658 3614 -2320 -3094 2855 2641 -3591 -1906 4083 907 -4178 -21 4036 -644 -3960
3975 -3960 1464 3748 -2329 -3197 3106 2326 -3467 -1656 3767 998 -4078 -103 4168 -936 -3888
3990 -3888 1632 3399 -2228 -3017 2880 2507 -3512 -1615 3856 752 -3929 29 3957 -671 -3901
4005 -3901 1568 3681 -2432 -2999 2982 2314 -3303 -1785 3725 1033 -4065 -20 4110 -859 -3799
4020 -3799 1605 3483 -2160 -3159 2909 2512 -3540 -1597 3775 807 -3752 -113 3827 -661 -3835
4035 -3835 1560 3373 -2333 -2756 2777 2291 -3195 -1728 3670 906 -3910 26 3767 -797 -3518
4050 -3518 1368 3334 -2130 -2943 2853 2281 -3362 -1494 3512 878 -3672 -251 3858 -706 -3784
4065 -3784 1589 3300 -2188 -2792 2636 2393 -3276 -1805 3712 821 -3836 23 3657 -685 -3568
4080 -3568 1299 3424 -2123 -2896 2799 2181 -3158 -1512 3364 879 -3618 -186 3728 -794 -3473
4095 -3473 1571 2999 -1990 -2602 2493 2197 -3053 -1520 3425 671 -3363 74 3325 -648 -3319
4110 -3319 1297 3110 -2106 -2513 2590 1992 -2916 -1433 3195 847 -3475 -20 3525 -786 -3185
4125 -3185 1332 2812 -1804 -2597 2483 2167 -3024 -1368 3218 649 -3255 -82 3246 -523 -3245
4140 -3245 1313 2892 -1992 -2301 2382 1793 -2639 -1365 3098 751 -3306 30 3174 -758 -2846
4155 -2846 1227 2669 -1761 -2400 2331 1753 -2821 -1143 2870 494 -2965 -12 3114 -612 -3018
4170 -3018 1434 2588 -1881 -2114 2256 1758 -2638 -1264 2998 527 -3101 234 3002 -769 -2821
4185 -2821 1223 2659 -1861 -2252 2448 1635 -2705 -1012 2738 527 -2868 80 2980 -790 -2732
4200 -2732 1484 2316 -1836 -1936 2159 1601 -2550 -1037 2832 283 -2745 305 2596 -713 -2511 1228
4216 1228 2394 -1867 -1815 2356 1257 -2447 -794 2536 407 -2742 195 2794 -905 -2526 1390
4231 1390 2128 -1761 -1845 2225 1410 -2623 -811 2708 98 -2666 339 2590 -779 -2530 1329 2233
4247 2233 -1983 -1719 2197 1205 -2378 -812 2622 254 -2747 433 2618 -978 -2243 1345 1994 -1704
4263 -1704 -1747 2170 1289 -2516 -591 2509 -9 -2384 381 2370 -869 -2339 1544 1986 -1960 -1430
4279 -1430 2146 1018 -2336 -689 2580 95 -2685 570 2391 -1054 -2075 1400 1928 -1838 -1639
4294 -1639 2343 1000 -2503 -441 2484 -24 -2458 444 2455 -1028 -2286 1613 1737 -1887 -1309
4309 -1309 2090 996 -2320 -551 2522 -112 -2428 659 2187 -975 -1916 1357 1796 -1844 -1417 2192
4325 2192 777 -2233 -371 2229 -22 -2338 509 2360 -1126 -2106 1556 1665 -1736 -1341 2063 1014
4341 1014 -2382 -417 2449 -176 -2324 656 2224 -960 -2046 1505 1839 -1978 -1349 2261 817
4356 817 -2362 -407 2332 -16 -2458 594 2304 -1203 -1944 1479 1617 -1774 -1365 2080 964 -2399
4372 -2399 -360 2363 -206 -2159 589 2144 -985 -1974 1503 1622 -1861 -1211 2011 692 -2145 -379
4388 -379 2320 -43 -2396 659 2155 -1167 -1795 1354 1569 -1726 -1329 2102 828 -2275 -271 2251
4404 2251 -221 -2252 569 2219 -994 -2033 1504 1598 -1835 -1161 1958 832 -2134 -321 2348 -147
4420 -147 -2254 677 2030 -980 -1765 1326 1626 -1697 -1271 2032 748 -2097 -287 2062 -63 -2087
4436 -2087 476 2097 -996 -1835 1395 1486 -1639 -1164 1807 966 -2115 -444 2281 -127 -2076 588
4452 588 1919 -857 -1824 1299 1639 -1768 -1226 2015 777 -2070 -397 2127 45 -2206 484 2157
4468 2157 -1037 -1788 1331 1492 -1543 -1250 1822 886 -2126 -339 2162 -130 -2004 440 1889 -748
4484 -748 -1818 1198 1515 -1555 -1116 1734 706 -1747 -444 1906 29 -2044 479 1918 -852 -1591
4500 -1591 1083 1423 -1331 -1248 1742 849 -1932 -355 1901 -34 -1828 297 1884 -679 -1831 1190
4516 1190 1487 -1494 -1112 1564 829 -1726 -559 1909 64 -1979 410 1750 -692 -1587 936 1443
4532 1443 -1245 -1219 1615 784 -1713 -402 1660 127 -1719 159 1757 -622 -1659 1027 1371 -1254
4548 -1254 -1038 1340 848 -1604 -514 1758 81 -1742 341 1649 -548 -1514 845 1379 -1258 -1113
4564 -1113 1541 642 -1591 -379 1615 138 -1790 232 1726 -722 -1476 1057 1209 -1131 -966 1340
4580 1340 776 -1600 -358 1704 -33 -1527 277 1448 -551 -1452 927 1246 -1175 -901 1317 624
4596 624 -1297 -326 1450 157 -1488 267 1495 -591 -1132 840 1061 -967 -980 1255 722 -1381 -241
4613 -241 1490 6 -1285 187 1374 -581 -1339 901 1133 -1180 -838 1232 507 -1302 -354 1446
4629 1446 28 -1487 415 1359 -655 -1142 778 1059 -1063 -855 1306 512 -1381 -135 1355 -102
4645 -102 -1331 294 1305 -575 -1252 957 894 -1055 -668 1140 447 -1309 -281 1413 -172 -1359
4661 -1359 487 1150 -628 -1039 782 957 -1078 -730 1336 348 -1299 33 1294 -123 -1270 491
4677 491 1246 -825 -1122 1045 729 -1143 -523 1194 421 -1373 -83 1410 -341 -1242 619 1026 -673
4694 -673 -1022 914 860 -1223 -578 1294 178 -1227 -13 1199 -186 -1260 477 1172 -848 -887 974
4711 974 668 -1016 -590 1192 336 -1364 51 1324 -428 -1179 510 1105 -691 -997 1047 770 -1247
4728 -1247 -401 1280 174 -1246 18 1298 -363 -1306 729 1119 -894 -819 995 725 -1147 -488 1330
4745 1330 127 -1395 206 1289 -412 -1126 661 1088 -851 -940 1193 608 -1338 -325 1225 76
4761 76 -1210 96 1314 -480 -1187 815 986 -929 -775 1069 636 -1243 -380 1371 -21 -1339 340
4778 340 1206 -477 -1150 698 1064 -999 -819 1233 478 -1251 -213 1295 51 -1362 273 1388
4794 1388 -604 -1232 878 938 -986 -812 1154 709 -1409 -306 1456 -53 -1348 307 1225 -426
4810 -426 -1199 716 1049 -986 -795 1177 469 -1194 -264 1351 89 -1340 319 1365 -618 -1071 840
4827 840 938 -948 -843 1146 578 -1347 -200 1352 -109 -1221 249 1279 -591 -1205 909 1021 -1136
4844 -1136 -682 1194 483 -1212 -246 1416 -55 -1448 479 1314 -664 -1011 841 951 -1052 -791 1323
4861 1323 480 -1359 -21 1358 -108 -1240 328 1261 -623 -1132 940 808 -1086 -587 1144 409
4877 409 -1317 -228 1374 -168 -1339 494 1140 -694 -1065 827 931 -1042 -745 1239 348 -1322
4893 -1322 -40 1246 -136 -1264 413 1319 -775 -1093 1038 816 -1074 -613 1161 439 -1325 -149
4909 -149 1425 -205 -1260 444 1121 -601 -1061 812 955 -1103 -598 1272 272 -1203 -62 1214
4925 1214 -70 -1198 364 1164 -705 -951 921 796 -972 -576 1139 449 -1303 -10 1276 -271
4941 -271 -1118 541 1084 -660 -957 933 803 -1173 -470 1198 210 -1199 74 1268 -270 -1236 638
4958 638 1064 -847 -853 943 637 -1070 -515 1238 193 -1351 192 1176 -413 -1076 573 1027 -749
4975 -749 -865 1066 589 -1159 -321 1128 44 -1171 114 1228 -402 -1108 708 933 -907 -703 959
4992 959 624 -1084 -341 1225 3 -1255 278 1064 -440 -1038 621 1004 -957 -733 1111 421 -1155
5009 -1155 -261 1200 52 -1230 214 1233 -594 -1059 873 812 -893 -679 1118 511 -1246 -237
5025 -237 1314 -128 -1205 372 1121 -542 -1064 771 914 -1051 -617 1169 330 -1175 -104 1232
5041 1232 -88 -1323 386 1214 -768 -978 929 734 -985 -602 1178 397 -1339 -8 1300 -334
5057 -334 -1222 508 1216 -662 -1008 1027 854 -1236 -492 1273 209 -1321 -15 1391 -235 -1314
5073 -1314 679 1159 -954 -934 1037 742 -1214 -602 1377 264 -1490 141 1317 -346 -1256 612
5089 612 1216 -854 -1049 1186 735 -1285 -436 1332 204 -1396 -12 1482 -353 -1404 776 1169
5105 1169 -866 -951 1098 880 -1316 -517 1566 163 -1511 172 1422 -384 -1390 731 1359 -1056
5121 -1056 -1090 1300 801 -1431 -418 1465 187 -1614 209 1656 -554 -1483 859 1187 -1035 -1131 1278
5138 1278 893 -1559 -491 1606 103 -1548 202 1477 -465 -1432 859 1312 -1191 -999 1392 667
5154 667 -1453 -462 1590 142 -1662 243 1622 -629 -1398 918 1229 -1129 -1086 1363 800 -1655 -431
5171 -431 1754 -7 -1592 264 1613 -548 -1630 1006 1353 -1267 -1009 1454 706 -1598 -523 1796
5187 1796 109 -1795 415 1694 -672 -1481 939 1381 -1179 -1163 1515 812 -1676 -388 1712 70
5203 70 -1704 188 1757 -600 -1663 979 1384 -1262 -1104 1401 837 -1615 -528 1819 69 -1870
5219 -1870 351 1704 -662 -1616 919 1484 -1349 -1212 1673 794 -1759 -415 1784 183 -1879 256
5235 256 1811 -653 -1659 1133 1417 -1285 -1177 1564 903 -1786 -480 1953 68 -1884 306 1712
5251 1712 -645 -1726 959 1462 -1427 -1117 1615 741 -1690 -477 1799 138 -1906 343 1855 -754
5267 -754 -1694 996 1364 -1199 -1178 1570 894 -1812 -440 1927 1 -1867 277 1814 -620 -1747
5283 -1747 1110 1553 -1423 -1130 1655 841 -1746 -497 1898 125 -1937 346 1918 -770 -1680 1015
5299 1015 1497 -1298 -1224 1632 920 -1793 -474 1845 92 -1834 180 1862 -603 -1723 1110 1506
5315 1506 -1347 -1190 1486 920 -1713 -642 1902 160 -1845 321 1792 -622 -1631 957 1535 -1265
5331 -1265 -1225 1612 865 -1817 -431 1821 127 -1872 275 1956 -717 -1785 1095 1424 -1394 -1146
5347 -1146 1596 848 -1837 -564 1938 35 -1883 423 1735 -686 -1627 976 1493 -1369 -1148 1653
5363 1653 799 -1716 -382 1765 134 -1907 289 1861 -729 -1613 1025 1341 -1273 -1154 1489 834
5379 834 -1699 -463 1830 19 -1776 422 1676 -628 -1680 1058 1466 -1365 -1091 1598 717 -1659
5395 -1659 -391 1843 75 -1885 436 1771 -792 -1555 1130 1346 -1310 -1090 1620 732 -1859 -350
5411 -350 1853 -43 -1761 364 1716 -733 -1607 1161 1304 -1448 -990 1557 646 -1672 -344 1815
5427 1815 -66 -1864 471 1713 -819 -1427 1054 1298 -1336 -995 1702 560 -1769 -214 1803 -124
5443 -124 -1785 503 1746 -882 -1533 1289 1205 -1501 -882 1641 585 -1743 -214 1861 -237 -1752
5459 -1752 675 1580 -968 -1436 1207 1236 -1557 -893 1721 411 -1802 -50 1750 -184 -1724 557
5475 557 1681 -1016 -1413 1354 1066 -1479 -797 1647 520 -1805 -107 1849 -295 -1746 663 1545
5491 1545 -959 -1378 1293 1152 -1613 -764 1760 399 -1800 -27 1829 -355 -1816 729 1638 -1192
5507 -1192 -1349 1377 1030 -1606 -697 1797 413 -1941 78 1903 -521 -1750 833 1542 -1119 -1385
5523 -1385 1487 1103 -1764 -581 1846 246 -1845 56 1839 -507 -1802 956 1547 -1242 -1247 1449
5539 1449 977 -1641 -719 1868 246 -1912 176 1847 -655 -1609 852 1497 -1208 -1334 1632 863
5555 863 -1771 -527 1810 105 -1865 220 1924 -667 -1780 1124 1473 -1361 -1114 1560 924 -1784
5571 -1784 -583 1981 11 -1986 405 1767 -654 -1718 1041 1594 -1415 -1201 1659 812 -1830 -362
5587 -362 1883 79 -1915 334 1899 -772 -1683 1151 1351 -1383 -1157 1611 840 -1885 -402 1985
5603 1985 -83 -1940 425 1837 -770 -1746 1137 1465 -1551 -1148 1806 704 -1902 -327 1974 -67
5619 -67 -2066 524 1926 -975 -1678 1269 1408 -1514 -1137 1853 741 -2019 -317 2013 -206 -1917
5635 -1917 512 1854 -834 -1695 1353 1422 -1660 -978 1795 665 -1818 -278 1966 -119 -1972 540
5651 540 1833 -1040 -1523 1281 1373 -1553 -1066 1796 624 -1966 -90 1952 -224 -1874 587 1832
5667 1832 -1039 -1586 1440 1287 -1678 -867 1860 531 -1923 -188 2027 -318 -2005 823 1704 -1123
5683 -1123 -1541 1327 1349 -1706 -908 1989 474 -1975 -48 1972 -324 -1894 706 1814 -1149 -1536
5699 -1536 1483 1216 -1645 -831 1860 447 -1967 -16 2005 -423 -1897 817 1626 -1056 -1512 1419
5715 1419 1194 -1777 -788 1909 305 -1935 71 1865 -452 -1862 876 1713 -1275 -1394 1585 1007
5731 1007 -1740 -633 1911 231 -2023 226 1983 -647 -1783 912 1570 -1242 -1279 1650 1016 -1827
5747 -1827 -523 1942 69 -1860 238 1907 -543 -1730 1014 1512 -1344 -1157 1507 944 -1703 -561
5763 -561 1913 108 -2016 336 1866 -694 -1617 1056 1502 -1336 -1210 1654 849 -1860 -376 1831
5779 1831 63 -1865 395 1856 -781 -1727 1187 1413 -1466 -1003 1661 764 -1864 -379 1955 -35
5795 -35 -1984 508 1765 -797 -1614 1186 1439 -1542 -1084 1790 607 -1864 -252 1856 -76 -1947
5811 -1947 464 1845 -900 -1552 1300 1270 -1484 -970 1736 658 -1911 -248 1966 -314 -1925 709
5827 709 1719 -1007 -1508 1358 1279 -1667 -924 1871 453 -1886 -91 1932 -264 -1933 750 1766
5843 1766 -1153 -1459 1455 1178 -1632 -868 1866 496 -1985 50 2034 -450 -1853 771 1694 -1134
5859 -1134 -1477 1508 1165 -1748 -794 1891 373 -1965 -60 2028 -348 -1926 845 1752 -1223 -1490
5875 -1490 1569 1176 -1752 -811 2023 390 -2127 142 2021 -558 -1886 921 1764 -1248 -1493 1711
5891 1711 1103 -1909 -688 2034 299 -2073 94 2117 -562 -2069 1078 1779 -1421 -1397 1679 1127
5907 1127 -1947 -691 2137 213 -2155 275 2084 -593 -1954 1007 1826 -1443 -1501 1772 1042 -1940
5923 -1940 -670 2059 281 -2146 231 2138 -703 -1950 1163 1740 -1387 -1446 1732 1095 -1984 -664
5939 -664 2208 187 -2160 313 2060 -685 -2001 1180 1774 -1591 -1421 1935 1036 -2018 -577 2173
5955 2173 169 -2238 371 2191 -805 -1939 1242 1761 -1504 -1435 1845 1088 -2141 -586 2171 91
5971 91 -2232 320 2162 -755 -2004 1194 1783 -1605 -1352 1874 1018 -2080 -630 2225 165 -2315
5987 -2315 358 2210 -858 -1981 1276 1755 -1575 -1465 1969 1040 -2154 -512 2226 65 -2214 399
6003 399 2185 -853 -2052 1367 1706 -1678 -1344 1926 993 -2154 -550 2361 -25 -2266 535 2139
6019 2139 -973 -1967 1295 1758 -1701 -1396 2018 905 -2161 -499 2142 24 -2242 420 2201 -912
6035 -912 -1927 1351 1653 -1607 -1308 1885 1006 -2103 -480 2293 37 -2227 450 2048 -851 -1944
6051 -1944 1284 1656 -1704 -1280 1990 826 -2093 -440 2192 -19 -2254 461 2094 -976 -1902 1328
6067 1328 1545 -1646 -1248 1904 895 -2136 -465 2200 -63 -2160 473 1988 -899 -1896 1338 1612
6083 1612 -1631 -1183 1902 842 -2011 -475 2182 -3 -2167 516 2034 -983 -1771 1282 1568 -1557
6099 -1557 -1259 1931 780 -2087 -315 2132 -119 -2059 559 1988 -997 -1832 1415 1459 -1704 -1093
6115 -1093 1891 687 -1992 -303 2100 -134 -2061 662 1904 -1053 -1650 1411 1451 -1664 -1072 1930
6131 1930 608 -2056 -146 1980 -206 -1965 554 1867 -1029 -1627 1384 1318 -1597 -1015 1767 624
6147 624 -1976 -271 2053 -230 -1938 662 1777 -959 -1566 1330 1343 -1630 -933 1846 436 -1925
6163 -1925 -89 1912 -259 -1937 679 1818 -1138 -1477 1475 1108 -1580 -818 1860 481 -1990 -56
6179 -56 2028 -396 -1780 801 1660 -1171 -1469 1462 1150 -1720 -761 1887 371 -1875 -1 1927
6195 1927 -439 -1804 853 1610 -1247 -1342 1441 1048 -1654 -721 1836 368 -1955 111 1903 -508
6211 -508 -1715 873 1582 -1193 -1358 1510 1026 -1762 -562 1835 220 -1862 177 1882 -547 -1765
6227 -1765 1070 1498 -1362 -1198 1526 907 -1717 -510 1898 103 -1917 309 1838 -645 -1668 994
6243 994 1481 -1324 -1234 1643 834 -1750 -471 1860 112 -1870 268 1860 -741 -1665 1130 1390 -1340
6260 -1340 -1182 1568 886 -1805 -446 1897 13 -1891 399 1776 -738 -1673 1130 1511 -1488 -1120
6276 -1120 1747 781 -1823 -293 1887 14 -1996 430 1883 -909 -1668 1262 1359 -1527 -1077 1700
6292 1700 732 -1947 -276 1977 -156 -1902 522 1779 -877 -1663 1276 1376 -1633 -1037 1778 648
6308 648 -1861 -291 1953 -153 -2000 512 1846 -959 -1659 1295 1323 -1529 -1041 1809 685 -1929
6324 -1929 -223 1975 -201 -1963 543 1850 -962 -1675 1395 1318 -1624 -902 1790 620 -1921 -236
6340 -236 2028 -291 -2048 686 1831 -1075 -1580 1338 1332 -1556 -1008 1903 540 -1986 -143 2035
6356 2035 -235 -1960 612 1830 -998 -1645 1443 1317 -1656 -963 1837 627 -2002 -210 2071 -304
6372 -304 -1943 755 1742 -1052 -1548 1364 1341 -1678 -958 1923 443 -1975 -73 1983 -295 -2005
6388 -2005 762 1817 -1163 -1547 1467 1214 -1739 -882 1933 539 -2040 -63 2019 -426 -1892 836
6404 836 1738 -1071 -1517 1465 1200 -1765 -882 1899 402 -1956 -99 1923 -330 -1930 699 1761
6420 1761 -1128 -1425 1427 1186 -1612 -914 1864 490 -2020 -58 2007 -375 -1828 789 1687 -1112
6436 -1112 -1528 1450 1188 -1729 -728 1877 417 -1911 1 1988 -376 -1896 832 1665 -1206 -1366
6452 -1366 1413 1033 -1678 -813 1929 347 -1930 110 1887 -450 -1775 769 1620 -1076 -1430 1474
6468 1474 1044 -1700 -683 1746 403 -1798 -15 1885 -419 -1802 809 1549 -1103 -1331 1377 1042
6484 1042 -1594 -710 1856 250 -1851 168 1724 -450 -1647 807 1566 -1166 -1241 1459 934 -1602
6500 -1602 -575 1712 299 -1753 153 1787 -513 -1559 909 1452 -1098 -1196 1420 995 -1637 -557
6516 -557 1779 139 -1718 120 1671 -505 -1620 797 1460 -1187 -1146 1371 845 -1520 -534 1632
6532 1632 200 -1685 162 1644 -598 -1505 835 1364 -1120 -1112 1383 822 -1523 -462 1651 39
6548 39 -1616 251 1608 -491 -1462 945 1255 -1189 -955 1394 690 -1459 -431 1637 34 -1666
6564 -1666 379 1518 -688 -1401 904 1166 -1225 -1001 1459 658 -1496 -257 1595 -38 -1570 303
6580 303 1555 -635 -1401 997 1116 -1213 -867 1364 627 -1497 -281 1628 -41 -1572 414 1408
6596 1408 -689 -1267 978 1095 -1186 -871 1426 445 -1526 -122 1519 -128 -1475 478 1433 -781
6612 -781 -1270 1020 893 -1273 -748 1382 423 -1534 -166 1551 -242 -1496 484 1366 -762 -1247 1054
6629 1054 1059 -1285 -737 1444 378 -1484 -112 1508 -189 -1493 570 1432 -817 -1150 993 935 -1194
6646 -1194 -727 1337 441 -1537 -73 1528 -270 -1370 538 1289 -773 -1196 1151 988 -1311 -593
6662 -593 1402 322 -1440 32 1513 -325 -1467 626 1223 -928 -1003 1086 867 -1253 -607 1488
6678 1488 316 -1551 35 1410 -372 -1360 645 1257 -859 -1028 1208 793 -1280 -566 1408 229
6694 229 -1494 22 1544 -325 -1414 650 1234 -942 -1057 1098 844 -1294 -619 1535 258 -1426
6710 -1426 28 1431 -360 -1346 665 1296 -920 -1051 1166 814 -1258 -475 1366 229 -1399 60
6726 60 1449 -450 -1314 688 1170 -908 -980 1134 744 -1358 -493 1460 110 -1412 110 1415 -382
6743 -382 -1386 699 1163 -972 -1006 1060 735 -1225 -492 1363 267 -1458 98 1383 -416 -1295 657
6760 657 1114 -865 -966 1067 742 -1270 -376 1325 139 -1293 146 1282 -427 -1260 688 1122 -993
6777 -993 -851 1108 611 -1250 -304 1315 91 -1363 226 1263 -480 -1211 658 998 -885 -832 1128
6794 1128 582 -1260 -320 1246 109 -1186 126 1232 -361 -1144 728 1020 -899 -828 1046 643 -1135
6811 -1135 -425 1233 152 -1238 191 1207 -400 -1132 614 975 -860 -864 1062 590 -1123 -285 1095
6828 1095 128 -1146 165 1191 -439 -1072 660 820 -836 -726 968 554 -1113 -301 1209 -39
6844 -39 -1164 232 1099 -372 -1041 656 886 -846 -668 986 465 -1041 -198 1072 69 -1123 196
6861 196 1066 -452 -949 570 803 -760 -700 891 453 -1030 -230 1042 -41 -962 237 1002 -410
6878 -410 -946 689 742 -820 -532 920 305 -931 -172 948 -109 -970 342 914 -541 -739 658
6895 658 643 -781 -542 924 249 -931 39 902 -153 -908 308 861 -527 -804 672 584 -857 -437
6913 -437 869 271 -877 -81 964 -165 -906 349 777 -507 -671 659 577 -748 -411 917 179
6930 179 -879 -12 842 -206 -807 322 779 -514 -614 769 402 -759 -241 794 134 -876 60
6947 60 916 -325 -794 500 647 -623 -598 681 433 -823 -232 863 -30 -817 147 741 -323 -769
6965 -769 503 646 -638 -490 773 341 -749 -201 845 46 -876 203 813 -417 -732 544 569 -666
6983 -666 -429 736 274 -903 -75 892 -116 -842 281 776 -432 -684 666 504 -772 -314 817
7000 817 193 -844 -26 888 -176 -844 441 806 -542 -576 678 487 -744 -381 882 239 -850 38
7018 38 891 -255 -841 416 768 -581 -707 730 530 -831 -331 866 174 -885 -3 905 -223 -853
7036 -853 504 795 -605 -609 711 502 -905 -324 969 115 -972 114 878 -316 -892 524 765 -695
7054 -695 -582 817 474 -932 -188 1006 115 -992 122 1008 -398 -942 573 751 -764 -577 837
7071 837 421 -991 -247 1098 31 -1013 181 983 -413 -1004 583 833 -786 -681 934 407 -989
7088 -989 -282 991 34 -1165 219 1070 -489 -903 595 833 -772 -668 936 435 -1015 -178 1092
7105 1092 -99 -1089 266 1019 -377 -991 671 813 -853 -600 928 440 -1038 -224 1102 -33 -1112
7122 -1112 278 1123 -497 -906 667 821 -837 -641 999 477 -1049 -238 1128 -8 -1058 213
7138 213 1096 -419 -962 695 805 -862 -631 974 461 -1045 -268 1125 -25 -1128 265 1001 -552
$$ [...]
8191A67
##END NTUPLES=NMR FID
##END=
