##TITLE=1H_A0902-3
 aceton-d6
 8 sc, 
 10.02.2022
##JCAMPDX= 6.0         $$ Bruker NMR JCAMP-DX V2.0
##DATA TYPE= NMR FID
##DATA CLASS= NTUPLES
##ORIGIN= UXNMR, Bruker Analytische Messtechnik GmbH
##OWNER= root
$$ XWIN-NMR		Version 3.5
$$ Thu Feb 10 10:56:40 2022 Russian Standard Time (UT+4h)  she@DPX200
##.OBSERVE FREQUENCY= 200.131346
##.OBSERVE NUCLEUS= ^1H
##.DELAY= (6, 6)
##.ACQUISITION MODE= SIMULTANEOUS
##.ACQUISITION SCHEME= undefined
##.AVERAGES= 8
##.DIGITISER RES= 18
##SPECTROMETER/DATA SYSTEM= spect
##.PULSE SEQUENCE= zg30
##.SOLVENT NAME= D2O
##.SHIFT REFERENCE= (INTERNAL, D2O, 0, 15.7039)
##AUDIT TRAIL= $$ (NUMBER, WHEN, WHO, WHERE, WHAT)
$$ ##TITLE= Audit trail, XWIN-NMR		Version 3.5
$$ ##JCAMPDX= 5.01
$$ ##ORIGIN= Bruker BioSpin GmbH
$$ ##OWNER= she
$$ F:/spectra/data/she/nmr/H-F/1/audita.txt
$$ ##AUDIT TRAIL=  $$ (NUMBER, WHEN, WHO, WHERE, WHAT)
(   1,<2022-02-10 10:53:14.37 +0400>,<she>,<DPX200>,
      <created by zg, POWCHK disabled, PULCHK disabled
       configuration hash MD5:
       00 E9 B6 7A A2 85 ED C7 34 08 36 98 17 FE 4E 26
       data hash MD5: 16K
       41 99 7C C9 A4 C1 5D A0 18 7E D9 C9 91 E2 95 F0>)
$$ ##END=
$$ 
$$ hash MD5
$$ 66 DF D2 A2 63 34 5D A1 5C 54 EA BE 59 FC A2 32
##$RELAX= 
##$RELAX= 
##$RELAX= 
##$RELAX= 
##$RELAX= 
##$RELAX= 
$$ Bruker specific parameters
$$ --------------------------
##$DU= <F:/spectra>
##$EXPNO= 1
##$NAME= <H-F>
##$PROCNO= 1
##$TYPE= <nmr>
##$USER= <she>
##$AMP= (0..31)
100 100 100 100 100 100 100 100 100 100 100 100 100 100 100 100 100 100 
100 100 100 100 100 100 100 100 100 100 100 100 100 100 
##$AQSEQ= 0
##$AQ_mod= 1
##$AUNM= <au_zg>
##$AUTOPOS= <>
##$BF1= 200.13
##$BF2= 200.13
##$BF3= 200.13
##$BF4= 200.13
##$BF5= 200.13
##$BF6= 200.13
##$BF7= 200.13
##$BF8= 200.13
##$BYTORDA= 1
##$CFDGTYP= 0
##$CFRGTYP= 5
##$CHEMSTR= <none>
##$CNST= (0..31)
1 1 145 1 1 1 1 1 1 1 1 1 1 1 1 1 1 1 1 1 1 1 1 1 1 1 1 1 1 1 1 1 
##$CPDPRG= <>
##$CPDPRG1= <>
##$CPDPRG2= <>
##$CPDPRG3= <>
##$CPDPRG4= <mlev>
##$CPDPRG5= <mlev>
##$CPDPRG6= <mlev>
##$CPDPRG7= <mlev>
##$CPDPRG8= <mlev>
##$CPDPRGB= <>
##$CPDPRGT= <>
##$D= (0..31)
0 1.2 0 0 0 0 0 0 0 0.06 0 0.03 0 0 0 0 0.0002 0 0 0 0 0 0 0 0 0 0 0 0 
0 0 0 
##$DATE= 1644475994
##$DBL= (0..7)
120 120 120 120 120 120 120 120 
##$DBP= (0..7)
150 150 150 150 150 150 150 150 
##$DBP07= 0
##$DBPNAM0= <>
##$DBPNAM1= <>
##$DBPNAM2= <>
##$DBPNAM3= <>
##$DBPNAM4= <>
##$DBPNAM5= <>
##$DBPNAM6= <>
##$DBPNAM7= <>
##$DBPOAL= (0..7)
0.5 0.5 0.5 0.5 0.5 0.5 0.5 0.5 
##$DBPOFFS= (0..7)
0 0 0 0 0 0 0 0 
##$DE= 6
##$DECBNUC= <off>
##$DECIM= 32
##$DECNUC= <off>
##$DECSTAT= 4
##$DIGMOD= 1
##$DIGTYP= 9
##$DL= (0..7)
0 120 120 120 120 120 120 120 
##$DP= (0..7)
150 150 150 150 150 150 150 150 
##$DP07= 0
##$DPNAME0= <>
##$DPNAME1= <>
##$DPNAME2= <>
##$DPNAME3= <>
##$DPNAME4= <>
##$DPNAME5= <>
##$DPNAME6= <>
##$DPNAME7= <>
##$DPOAL= (0..7)
0.5 0.5 0.5 0.5 0.5 0.5 0.5 0.5 
##$DPOFFS= (0..7)
0 0 0 0 0 0 0 0 
##$DQDMODE= 0
##$DR= 18
##$DS= 0
##$DSLIST= <SSSSSSSSSSSSSSS>
$$ [...]
##$SUBNAM2= <"">
##$SUBNAM3= <"">
##$SUBNAM4= <"">
##$SUBNAM5= <"">
##$SUBNAM6= <"">
##$SUBNAM7= <"">
##$SUBNAM8= <"">
##$SUBNAM9= <"">
##$SW= 18.0517287032376
##$SWIBOX= (0..15)
0 0 2 0 0 0 0 0 0 0 0 0 0 0 0 0 
##$SW_h= 3612.71676300578
##$TD= 16384
##$TD0= 1
##$TE= 0
##$TE2= 300
##$TE3= 300
##$TEG= 300
##$TL= (0..7)
0 120 120 120 120 120 120 120 
##$TP= (0..7)
150 150 150 150 150 150 150 150 
##$TP07= 0
##$TPNAME0= <>
##$TPNAME1= <>
##$TPNAME2= <>
##$TPNAME3= <>
##$TPNAME4= <>
##$TPNAME5= <>
##$TPNAME6= <>
##$TPNAME7= <>
##$TPOAL= (0..7)
0.5 0.5 0.5 0.5 0.5 0.5 0.5 0.5 
##$TPOFFS= (0..7)
0 0 0 0 0 0 0 0 
##$TUNHIN= 0
##$TUNHOUT= 0
##$TUNXOUT= 0
##$USERA1= <user>
##$USERA2= <user>
##$USERA3= <user>
##$USERA4= <user>
##$USERA5= <user>
##$V9= 5
##$VALIST= <valist>
##$VCLIST= <CCCCCCCCCCCCCCC>
##$VD= 0
##$VDLIST= <DDDDDDDDDDDDDDD>
##$VPLIST= <PPPPPPPPPPPPPPP>
##$VTLIST= <TTTTTTTTTTTTTTT>
##$WBST= 1024
##$WBSW= 4
##$XGAIN= (0..3)
0 0 0 0 
##$XL= 0
##$YL= 0
##$YMAX_a= 183867
##$YMIN_a= -172730
##$ZGOPTNS= <>
##$ZL1= 120
##$ZL2= 120
##$ZL3= 120
##$ZL4= 120
##$ABSF1= 10
##$ABSF2= 0
##$ABSG= 5
##$ABSL= 3
##$ALPHA= 0
##$AQORDER= 0
##$ASSFAC= 0
##$ASSFACI= 0
##$ASSFACX= 0
##$ASSWID= 0
##$AUNMP= <proc_1d>
##$AZFE= 0.1
##$AZFW= 0.1
##$BCFW= 1
##$BC_mod= 2
##$BYTORDP= 1
##$COROFFS= 0
##$CY= 11.3945322036743
##$DATMOD= 1
##$DC= 2
##$DFILT= <>
##$DTYPP= 0
##$F1P= 2.36226072786647
##$F2P= -0.459571619588291
##$FCOR= 0.5
##$FTSIZE= 0
##$FT_mod= 4
##$GAMMA= 1
##$GB= 0.15
##$INTBC= 1
##$INTSCL= 1
##$ISEN= 128
##$LB= 0.24
##$LEV0= 0
##$LPBIN= 0
##$MAXI= 10000
##$MC2= 0
##$MEAN= 0
##$ME_mod= 0
##$MI= 1.114404
##$NCOEF= 0
##$NC_proc= 0
##$NLEV= 6
##$NOISF1= 3.799351
##$NOISF2= 2.8
##$NSP= 1
##$NTH_PI= 0
##$NZP= 0
##$OFFSET= 15.70392
##$PC= 1
##$PHC0= -16307.27
##$PHC1= 8.00078
##$PH_mod= 1
##$PKNL= yes
##$PPARMOD= 0
##$PSCAL= 0
##$PSIGN= 0
##$REVERSE= no
##$SF= 200.130013532006
##$SI= 16384
##$SIGF1= 3
##$SIGF2= 2
##$SINO= 400
##$SIOLD= 16384
##$SREGLST= <1H.CDCl3>
##$SSB= 0
##$STSI= 0
##$STSR= 0
##$SW_p= 3612.71676300578
##$SYMM= 0
##$S_DEV= 0
##$TDeff= 0
##$TDoff= 0
##$TI= <>
##$TILT= no
##$TM1= 0
##$TM2= 0
##$TOPLEV= 0
##$USERP1= <user>
##$USERP2= <user>
##$USERP3= <user>
##$USERP4= <user>
##$USERP5= <user>
##$WDW= 1
##$XDIM= 8192
##$YMAX_p= 0
##$YMIN_p= 0
$$ End of Bruker specific parameters
$$ ---------------------------------
##NTUPLES= NMR FID
##VAR_NAME=  TIME,          FID/REAL,        FID/IMAG
##SYMBOL=    X,             R,               I
##VAR_TYPE=  INDEPENDENT,   DEPENDENT,       DEPENDENT
##VAR_FORM=  AFFN,          ASDF,            ASDF
##VAR_DIM=   8192,          8192,            8192
##UNITS=     SECONDS,       ARBITRARY UNITS, ARBITRARY UNITS
##FACTOR=    0.0002768,     1,               1
##FIRST=     0,             0,               0
##LAST=      2.2672688,     0,               0
##MIN=       0,             -172730,         0
##MAX=       2.2672688,     183867,          0
$$ Real data points
##PAGE= N=1
##DATA TABLE= (X++(R..R)), XYDATA
$$ [...]
2069B201j795k744K288K382k659j949K946J390l113p38L197O5l228N84L233j225
$$ 2201 406 -2338 -50 2332 -327 -2276 670 2060 -1053 -1791 1406 1471 -1757 -1173 2060 835
2085H35l106J818K790k292k355K739J774l132j084L464L33l686M35L703j148l532
$$ 835 -2271 -453 2337 45 -2310 429 2203 -929 -2013 1451 1784 -1902 -1467 2236 1088 -2444
2101b444J822L163k492k585L125J836l618j059L967K55m110N55M016j390l659
$$ -2444 -622 2541 49 -2536 589 2425 -1193 -2252 1715 1970 -2140 -1585 2431 1041 -2618
2116b618K175L122k892k467L503J746l978r36M189J23m153P14L903j517l506K298
$$ -2618 -443 2679 -213 -2680 823 2569 -1409 -2345 1844 1967 -2186 -1472 2431 914 -2592 -294
2132b94L001l027k351L546J644l829q99L904J04l828P62L559j602l147K325K643
$$ -294 2707 -320 -2671 875 2519 -1310 -2209 1695 1799 -2029 -1267 2292 690 -2457 -132 2511
2148B511k883k101L305J414l533o08L551k24l408J014L189j727k881K357K398
$$ 2511 -372 -2473 832 2246 -1287 -1895 1656 1432 -1976 -962 2227 500 -2381 -24 2374
2163B374k788j820L037J151l140m47L169k45l129R21K935j442k648J821K287k121
$$ 2374 -414 -2234 803 1954 -1186 -1633 1536 1291 -1838 -917 2018 576 -2072 -251 2036 -85
2179h5j843K399J304k618p16K741K14k811K28K810o72k695J123K405j554k047
$$ -85 -1928 471 1775 -843 -1559 1182 1396 -1415 -1187 1623 951 -1744 -621 1784 230 -1817
2195a817J970J657k378j235K717P82k950k51K984k79k899Q78K713j518k419K137
$$ -1817 153 1810 -568 -1803 914 1696 -1254 -1505 1479 1200 -1699 -821 1892 374 -2045 92
2211I2K021k644j535L000R86l190l61L262l89l182J185K907j872k574K451K181
$$ 92 2113 -531 -2066 934 1920 -1270 -1631 1631 1242 -1940 -755 2152 280 -2294 157 2338
2227B338k950j610L263R02l387j38L376o26l281J373L068k056k695K593K146k947
$$ 2338 -612 -2222 1041 1943 -1444 -1582 1794 1168 -2113 -740 2328 272 -2423 170 2316 -631
2243f31j491L166P91l320J1L326p80l188J466K860j968k440K429J849k789j131
$$ -631 -2122 1044 1835 -1485 -1474 1852 1072 -2116 -650 2210 242 -2198 231 2080 -709 -1840
2259a840L032L58l107L47L061r84k878J559K503k052j948K425J310k682p04K860
$$ -1840 1192 1550 -1557 -1210 1851 867 -2011 -452 2051 -1 -1949 476 1786 -896 -1600 1260
2275A260J09k939M79K800r93k478J384K090j748j660K100J183k334p24K455K98
$$ 1260 1369 -1570 -1091 1709 716 -1762 -378 1712 -36 -1696 404 1587 -747 -1471 984 1282
2291A282k421M7K340m30k171Q50J944j263j658J579J420j843j178K073Q40k186
$$ 1282 -1139 -1092 1248 818 -1353 -503 1441 178 -1480 99 1519 -324 -1502 571 1411 -775
2307g75m24K199m4k167M99K141r93k045J438J840j810j493K042J095k258o04K450
$$ -775 -1199 1000 956 -1211 -712 1429 436 -1609 -171 1669 -141 -1634 408 1503 -755 -1359 1091
2324A091Jk518O01K458j117k293J546K041j964j621K330J046k586m32K734j28
$$ 1091 1092 -1426 -825 1633 516 -1777 -231 1810 -154 -1775 555 1601 -985 -1417 1317 1189
2340A189k802O82K755j236k491J739K047k122j559K470J020k754m60K920j38k903
$$ 1189 -1613 -931 1824 588 -1903 -164 1883 -239 -1798 672 1692 -1062 -1522 1398 1260 -1643
2356a643P16K663j206k350J708J932k193j391K538Q10k740k29K745k93k642Q77
$$ -1643 -927 1736 530 -1820 -112 1820 -373 -1764 774 1584 -1156 -1385 1360 1067 -1575 -698
2372f98K384j451j962J931J495k292j019K525N38k632K0K537n94k270J077J980
$$ -698 1686 235 -1727 204 1699 -593 -1612 913 1451 -1181 -1161 1376 782 -1488 -411 1569
2388A569j514j667J893J295k134q80K206M45k167rK050l91j948Q20J770j164j553
$$ 1569 55 -1612 281 1576 -558 -1438 768 1213 -954 -963 1087 696 -1252 -432 1338 174 -1379
2405a379J395J323j533j076J647P45j759l43J809l8j806L48J835o55j773R50J608
$$ -1379 16 1339 -194 -1270 377 1122 -637 -980 829 791 -1015 -667 1168 513 -1260 -310 1298
2422A298j241j299J465R66j679o39J922K50k070J66K057n37j941Q90J744j288
$$ 1298 57 -1242 223 1189 -490 -1129 793 1043 -1027 -861 1196 659 -1282 -392 1352 64
2438F4j458J680J082j996o67K194K59k266J32K269o34k105J116J838j551j524
$$ 64 -1394 286 1368 -628 -1295 899 1158 -1108 -976 1293 659 -1446 -330 1508 -43 -1567
2454a567J918J191k215q03K419L09k426J94K322o90k153J188J923j661j589K013
$$ -1567 351 1542 -673 -1476 943 1252 -1174 -980 1342 652 -1501 -313 1610 -51 -1640 373
2470C73J203k230p38K311K52k323L00K243q98k035J394J740j756j388J998R56
$$ 373 1576 -654 -1392 919 1171 -1152 -852 1391 493 -1542 -148 1592 -164 -1552 446 1402
2486A402k181m08K232j59k169O79K016j105j813J454J538j747j119J900O40j945
$$ 1402 -779 -1187 1045 886 -1283 -604 1412 307 -1506 -52 1486 -261 -1380 520 1160 -785
2502g85j88J972k29j937O24J809r42j577J154J280j295r82J445O75j588l26J656
$$ -785 -973 999 770 -1167 -543 1266 324 -1253 -99 1181 -114 -1096 349 1024 -564 -890 766
2519G66K6j652K02J595m08j504O39J340r08j115J123R10j312p25J492N06j621
$$ 766 792 -860 -658 937 529 -975 -336 1004 96 -1019 104 1014 -298 -1023 469 975 -646
2536f46k05J615r0j561M10J478p69j354J121J178j405r27J585O40j685l21J763
$$ -646 -851 764 674 -887 -477 1001 232 -1122 -1 1177 -228 -1155 430 1070 -615 -936 827
2553H27q9j771N38J698r33j578J259J400j531j124J750P51j902l23J981j32j998
$$ 827 738 -1033 -495 1203 270 -1308 -49 1351 -180 -1304 446 1197 -705 -1028 953 821 -1177
2570a177N41J961r38j830J310J550j597j170J806P37j973k86K108k07k098O51
$$ -1177 -636 1325 387 -1443 -133 1417 -180 -1350 456 1193 -780 -1066 1042 835 -1263 -612
2586f12J951j027j682J350J373j667r35J921M42k058K6K063m50j952Q25J746j197
$$ -612 1339 312 -1370 -20 1353 -314 -1249 672 1114 -944 -918 1145 695 -1257 -432 1314 117
2603A17j406J517R87j716o05J856K33j933J41J864n12j664Q41J378j074j115J296
$$ 117 -1289 228 1215 -501 -1106 750 983 -950 -809 1055 543 -1121 -280 1098 24 -1091 205
2620B05Q57j489n85J598K76j562k1J476k18j389N10J261p83j097R98R41j109p99
$$ 205 1062 -427 -1012 586 862 -700 -721 755 537 -852 -342 919 136 -961 37 978 -131 -930
2638i30J207O14j306l24J317K9j314K58J301n14j265P50J148r58r66J122O95j245
$$ -930 277 891 -415 -739 578 607 -707 -449 852 338 -927 -177 971 13 -953 169 864 -381
2656c81m15J373J03j468K18J485n02j416P44J277r75j091J246P98j453m82J610
$$ -381 -796 577 680 -788 -570 915 413 -1003 -259 1018 43 -1048 198 996 -457 -939 671
2673F71J86j703J12J730m20j677P81J466j080j214J361R32j603o41J798K90j868
$$ 671 857 -846 -734 996 576 -1101 -320 1146 66 -1148 213 1145 -458 -1099 699 989 -879
2690h79R7J794m71j641Q31J461j234j188J559Q27j742m57J812P8j798L34J691
$$ -879 -782 1012 541 -1100 -269 1192 -42 -1230 329 1156 -586 -1043 769 847 -951 -617 1074
2707A074p67j499J171J222j444r26J626O13j733k32J730j80j621N83J446r00j271
$$ 1074 307 -1192 -21 1201 -243 -1169 457 1070 -663 -895 835 655 -966 -383 1063 163 -1108
2724a108J154J071j364p80J459M53j456j37J414j65j369M40J307p01j169Q86R72
$$ -1108 46 1117 -247 -1027 432 885 -571 -708 706 541 -828 -388 919 218 -951 -65 907
2741I07r86p78J056N70j172l00J226N1j228J48J235l28j194N16J079p08q89Q85
$$ 907 -79 -857 199 769 -403 -703 523 574 -654 -506 729 401 -793 -277 802 94 -795 90
2759I0O75j007m93J160K95j281n1J282j86j226M17J106o37r95R10Q34j146o34
$$ 90 765 -242 -735 425 720 -561 -612 670 484 -742 -325 781 144 -851 59 893 -253 -887
2777h87J290M20j362k02J424r3j411L99J342p12j222R76J085j208q99J391O45
$$ -887 403 823 -539 -741 683 590 -821 -422 920 208 -1014 -38 1047 -161 -1060 331 976
2794I76j507l12J548m5j541L88J511p20j409J036J204j282q89J418N72j538j94
$$ 976 -531 -843 705 660 -881 -493 1018 298 -1111 -75 1129 -153 -1042 376 948 -590 -784
2811g84J614k17j610N94J488r14j274J145J024j353o96J500L06j572P8J557m01
$$ -784 830 613 -997 -403 1085 171 -1103 42 1066 -287 -983 517 823 -749 -671 886 485
2828D85j482O81J335r44j069J133P69j265m48J340J78j394Q3J394l52j271N55
$$ 485 -997 -316 1019 75 -994 139 908 -357 -805 535 713 -681 -598 796 444 -827 -272
2845b72J092p21r09Q83P27j049m92J153K85j182j17J150m0j111K40J018m65q97
$$ -272 820 99 -810 73 800 -249 -741 412 697 -485 -602 548 508 -603 -363 655 190 -707
2863g07O64P57p96o50R18N25j037l05J036Q4j003J29R79l51r48N66Q92p61p64
$$ -707 -43 714 -82 -732 186 711 -326 -631 405 489 -514 -385 594 243 -705 -139 753 -8 -772
2882g72R02N96r79m01J045K04j146O5J180l25j142N06J103o86j007Q77Q33j070
$$ -772 130 726 -253 -654 391 595 -551 -486 694 369 -773 -267 836 150 -857 20 853 -217
2900b17n89J205L30j296r1J394j87j391M47J292p08j117R49Q88j166o55J373L68
$$ -217 -806 399 729 -567 -658 736 549 -842 -395 897 189 -928 21 909 -257 -912 461 829
2918H29j499m1J499k72j386N46J256q45j057J143P73j352m48J429J79j444R6J409
$$ 829 -670 -711 788 516 -870 -324 932 87 -970 173 946 -406 -854 575 754 -690 -594 815
2936H15m18j271P36J046r91p99J161N67j269l39J324N4j274K31J157m83j026O82
$$ 815 397 -874 -138 908 -83 -882 279 846 -423 -762 562 616 -658 -427 730 247 -779 -97
2954i7R00q70p46J006N49j067l42J062J37j032O4J028k93r67M80Q71n93p61O81
$$ -97 803 -67 -813 193 742 -325 -667 395 532 -500 -436 592 299 -668 -188 683 90 -671 10
2973A0O51p86m58Q48K47q78n4Q99j02r17K46Q96m23p84N45O34o49n00P63L56q96
$$ 10 661 -125 -583 265 512 -366 -420 479 377 -540 -294 602 179 -605 -60 574 -75 -575 188 544 -352
2994c52j80R76Kr78J69R13k98q71M80Q04p07o54Q53N21r76l66J063K12j131K2
$$ -352 -532 444 446 -532 -363 550 252 -619 -139 665 -42 -696 157 678 -298 -664 399 611 -520 -498
3014d98J118k81j036N05R59p26q61R50O97j123m61J198J81j182O7J174l64j132
$$ -498 620 339 -697 -192 767 41 -820 130 827 -296 -757 441 622 -560 -493 681 317 -815
3032h15O65J007r03q05J047N77j146l17J198J5j208L20J133o04r78P64Q46r10
$$ -815 -150 857 -46 -851 196 773 -373 -690 508 523 -685 -365 768 164 -814 -50 796 -114
3050a14o37J040L54j103m3J076j88j048L97R70n76q53P47O48q30m40Q94K43r31
$$ -114 -751 289 643 -460 -503 573 385 -663 -266 704 128 -725 22 670 -160 -600 294 537 -394
3069c94o9R73j29r50K97Q46m12p35M97O19o13m70P16L15p83j71P86O1p82O7P54
$$ -394 -463 510 381 -569 -272 574 162 -573 -76 543 -70 -540 176 491 -292 -463 323 384 -398 -331 423
3090D23k22o54L66N40m71m52N74L76o58k73P12J32o97MO52j17o53K75O39m26n96
$$ 423 201 -453 -87 453 -18 -470 104 480 -178 -451 261 393 -304 -300 352 235 -418 -143 496 70 -526
3111e26N47M95o00m27O68L36p77j62Q28k9q43K02Q31l45q20N01P57o68n97P99
$$ -526 21 516 -84 -511 157 493 -284 -446 382 353 -490 -288 543 198 -622 -121 636 -32 -629 170
3131A70L88q69k15R64nj002K19J002m32q75O00P13p45n40Q85L22r98q0J038j63
$$ 170 558 -311 -526 438 433 -569 -350 652 220 -655 -55 658 -87 -627 258 580 -418 -498 540 377
3151C77r60L31Q84n15p53O96N44q43l15R14J06r22M4R14k29q34M20O90n72n24
$$ 377 -583 -252 632 117 -636 60 604 -239 -554 360 466 -456 -412 502 273 -561 -141 549 -23 -547
3171e47O81L97p81k59Q47P8q24R2P51k08o72L30O00m69n10N78L92o30k74O41J71
$$ -547 134 531 -250 -509 338 416 -408 -316 435 227 -445 -115 485 16 -494 84 476 -154 -428 213 384
3192C84o24o1O04p6n90K39M97l12m54L69M04m27l21M79J82m86n4M68j3n08J13
$$ 384 -240 -301 303 227 -363 -124 373 61 -393 -24 380 -47 -368 111 293 -193 -247 221 208 -300 -187
3213a87N25k08n01K91M29l33l60L89L01m86k00N68Q7n91j6O14o3o18J66O13l34
$$ -187 338 130 -371 -80 349 16 -344 45 346 -140 -340 228 315 -276 -292 322 259 -359 -193 420 86
3234H6n26M63M24n65l38O51K57p56j03P92r0p37K56O57m00o04N64N08p13l54P86
$$ 86 -440 23 447 -118 -456 195 452 -304 -407 385 295 -442 -186 471 71 -533 31 539 -174 -528 258
3255B58J71p78oP53j72p23L83O28n35m96O41L61o82k24P16L8o97J50O55l49n59
$$ 258 429 -349 -355 398 226 -497 -114 514 -21 -517 124 485 -197 -421 295 333 -364 -214 441 92 -467
3276d67M61M76n31l88N93K54o27r3O09o6n76J81N54k86n23L79M51m50l16M37K33
$$ -467 -6 470 -61 -449 144 398 -229 -322 287 221 -355 -174 380 94 -429 -50 401 -49 -365 72 305
3297C05m60j24M94Rn08Q9M80j64m17K01L71k41k95L03J93l40j09L58N5l63l1L87
$$ 305 -155 -279 215 224 -284 -195 285 121 -296 -95 276 35 -260 43 236 -104 -213 145 200 -163 -194 193
3319A93m0l46R9K78j39k52J92K36k54k19L14J69l32j34L32R4l53l7L91o4l95J69
$$ 193 153 -193 -94 184 45 -207 -15 221 -33 -252 62 231 -101 -235 97 191 -162 -199 192 128 -267 -98
3341i8L87k43l68L07L62l98k87M65J66n01m4N32p1n56J99N60l25m90M35L64m95
$$ -98 289 46 -322 -15 347 -51 -338 127 293 -208 -252 280 209 -347 -148 412 87 -403 32 396 -99
3362i9k51N39J22o09L4O31j96n76L17M61l55m01M52K58n27j06N63n1n30J41N02
$$ -99 -350 189 311 -298 -264 367 171 -405 -88 373 18 -383 69 327 -200 -306 257 206 -324 -183 319
3383C19k10m65L30L55m24k02M59Q9m80oM99n6n05J63M42k47l47K89K91l49k31
$$ 319 109 -356 -26 329 -95 -297 162 251 -229 -235 264 208 -297 -134 308 61 -286 3 294 -55 -286
3404b86M14J54m67m1M08%l87O8L49j33l15K16K56k76j98K84J61k77j36K97O0k86
$$ -286 128 282 -185 -226 182 182 -205 -137 212 79 -236 -20 236 -40 -238 46 207 -70 -206 91 151 -135
3426a35J8K47n9k30J06K32j44k15J63J90j78j48J78J36k15r7K53N3l10J6L12m7
$$ -135 -117 130 71 -159 -53 179 35 -180 -17 173 -5 -153 25 161 -54 -151 102 155 -155 -139 173 126
3448A26l15O9L16j26l07K32K57l31j73L59J50m27q6M61om75J38M12k31l57L26
$$ 126 -189 -120 196 70 -237 -5 252 -79 -252 107 257 -170 -256 205 199 -276 -138 274 43 -314 12
3469A2L14m26k45N13J19n08lM72q9m58K19M03l28l27M21K29m44j31M26N2m35O0
$$ 12 326 -100 -345 168 287 -221 -224 248 159 -299 -80 323 -5 -332 89 318 -126 -257 169 221 -214 -154
3491a54M12j97l44K79K73l24k21L75J36l95m9M01p4l45J41L27k05l10K74K63l27
$$ -154 258 61 -283 -4 269 -55 -276 99 235 -160 -209 192 118 -227 -86 241 36 -274 0 263 -64
3512f4j73L36Q8l06l9L15k9l27J16L11j78k56J83K06j77j67K12R3k29k7K20k2
$$ -64 -237 99 187 -119 -158 157 128 -199 -83 228 50 -206 -23 183 6 -161 51 144 -85 -112 108 86
3534H6j96L6J90m3k02P4J58r9j09J08Q3j16r8J59Q1j80o6J87M9j63n1K07nk24
$$ 86 -110 -74 116 73 -129 -55 103 4 -105 3 86 -30 -128 31 112 -68 -134 53 102 -61 -112 95 90 -134
3558a34R2K15j44j92J62J98k09j92K61J30l00l7L21o0l30J34L44k13l27K90K51
$$ -134 -42 173 29 -163 -1 197 -12 -204 57 187 -113 -150 171 111 -219 -85 259 46 -281 9 260
3579B60l37j62L56Q0m00J4M29j12m19K22L34k60k67K85K04l45r9L95j3l92J09
$$ 260 -77 -239 117 197 -203 -189 240 128 -291 -69 265 5 -262 23 227 -118 -217 178 165 -227 -118
3600a18L45j58k93J85K71k64j84L24N3l13J4L18n6l38J31L10k03k38K40J64k54
$$ -118 227 69 -224 -39 232 -32 -216 108 161 -152 -138 180 124 -214 -83 227 24 -214 26 190 -64
3621f4j19L03N3l34NL33p9k89J16K32j22k09J78J60k40r2K35O2k20m4K21J5k01
$$ -64 -183 120 173 -161 -156 177 98 -191 -75 157 35 -174 4 164 -76 -168 67 129 -91 -135 86 101 -100
3644a00L0J87r2j30J06J16j03j24J17J12j33q2J24N2j13n7J51J4j75J6J82l6j91
$$ -100 -70 117 25 -105 1 117 14 -110 7 119 -14 -96 28 80 -33 -90 61 75 -100 -84 98 62 -129
3667a29M6J98q2j71J30J51j92j00K31N4k58k5K90l3k99J15K57j79j88K13J83k92
$$ -129 -83 115 33 -138 -8 143 -49 -149 82 136 -122 -147 143 110 -189 -74 183 4 -184 29 212 -80
3689h0j29L34O6l65M3L17r9k82J55K53k22k11L00J37l40m8L01Ok81L3K78j41k33
$$ -80 -209 125 191 -174 -131 186 87 -195 -40 213 -9 -220 80 217 -123 -171 130 136 -145 -112 166 25 -208
3712b08K18J53k35j08K56P7k67j4K61o8k25J40J91j84j51K03J27k51o6K61lk21
$$ -208 10 163 -72 -180 76 153 -114 -128 133 65 -160 -20 171 -13 -164 39 166 -85 -151 110 107 -114
3734a14N0J96q4j98J44J74j95j29K01O2j60l3J42lj48M8J50r4j04Q0Q4q3p3Q9
$$ -114 -64 132 48 -150 -6 168 -27 -156 45 107 -53 -86 56 53 -95 -47 103 9 -95 -15 69 -14 -87 2
3758BM8q4k0P7j4n9J4O6K0r7LP8nn4mN7J4q7M1Q6q9o5Q6O5r7o9J21M7j44J1J33
$$ 2 50 -34 -54 23 9 -50 -36 30 50 -47 -44 34 29 -25 -29 28 42 -45 -4 82 -7 -72 14 79 -18 -87 34 81 -63 -52 81
3789H1m7j30Q4J34j33j41J78J05k01n2K05j0j96N5K04r7k07J60J73j95j08J99
$$ 81 34 -96 -12 122 -11 -152 26 131 -70 -122 83 73 -123 -68 136 39 -168 -8 165 -30 -138 61
3811F1N4j95j7K08l7k20J17J73j29j44J53R9j61o3J87rj95Q4J67j13j51J16J45
$$ 61 115 -80 -97 111 74 -146 -29 144 15 -129 24 123 -38 -101 86 77 -118 -34 133 20 -131 -15 130
3834A30j51r8J76K6j87K8J64n0j61Q2J76j39j37J58Q6j48n1J55Kj57L6J63p9j22
$$ 130 -21 -119 57 83 -104 -76 88 38 -123 -41 135 -4 -141 17 103 -45 -96 59 61 -96 -60 103 24 -98
3858i8R1Q3p9o4Q5N0j09kJ16l3q8L5N7k5m8J5L9l2qL7k0pk5J9L4m7j2J4L2Nm2
$$ -98 -7 76 -3 -67 18 68 -41 -43 73 40 -48 -13 44 19 -29 -14 25 -7 -15 22 2 -5 -30 -11 23 -24 -36 -22 10 15 -27
3889b7J3M7n9oQ0k1o7J2P4j1j11P4P0r0m0J23kj28J3J39rj76O9J45j20r6J35N4
$$ -27 -14 33 -26 -32 48 27 -40 -28 46 35 -76 -2 68 -22 -62 61 59 -69 -56 83 74 -102 -33 112 -8 -104 31 85
3917H5j35n4J68K4j97M5J65p9j33Q4J13j16q4J50M6j72K0J51l9j21M9J23r0j05
$$ 85 -50 -104 64 88 -109 -64 101 22 -111 -27 86 -30 -114 36 82 -90 -70 81 42 -79 -30 93 3 -102
3941a02J41N2j53oJ52rj50J2J70p6j45J32P2j32n4J46L0j62kJ82n6j46Q9R1r6
$$ -102 39 91 -62 -68 84 75 -75 -63 107 31 -114 18 90 -42 -96 50 80 -82 -84 98 42 -104 -15 76 -20
3966b0o8J17N3j47j6J43l0j09M6Q1n2o3O6N0p7k1Q3j1n3J2K5J7l1kK9k8lK5j1
$$ -20 -88 29 82 -65 -81 62 32 -77 -31 50 -2 -65 1 51 -26 -47 36 25 -28 -16 9 26 -5 -7 22 -6 -9 16 5
3995EOk9oL6mk5j3L0J1l0jN2n0l3O3K1p5j4P8J8j04J6J12n7p9P7P2r8o9J20O8
$$ 5 11 -18 -24 12 8 -17 -30 0 11 -19 -20 32 -18 -51 12 33 -42 -56 22 40 -64 -48 64 7 -72 5 77 -21 -90 30 98
4026I8j56k6J51qj31M5J14n7j24J07R8j43o2J30K6j09j1J17l6j24P9J06j12p4
$$ 98 -58 -84 67 59 -72 -27 87 30 -94 13 111 -32 -94 36 62 -47 -58 59 23 -101 -22 84 -28 -102
4050a02J04O8j06m5J25oj25N0J19p8r6R6Q8j22o8J41L1j47L4J04k9j20P7J04r8
$$ -102 2 70 -36 -81 44 38 -87 -37 82 4 -92 4 92 -30 -98 43 74 -73 -39 65 36 -84 -7 97 -1
4075aq4J12M3j15NP4Jq8K0R4p0n7O9L4n7k5L8L4n2KM5k9k6K1J8lk8J7NJ0ppmK6
$$ -1 -85 27 70 -45 -40 34 35 -53 -33 61 -9 -66 3 37 -20 -45 -7 27 -25 -23 22 -7 -33 -12 6 3 -25 -8 -3 7 0 -7 -11 15
4109A5j1j1L5j9m2L1L7k9m1L2L5l9k0N9j4p2L5N9k8p9N1Q0q8m7R4Oq0%J01qj32
$$ 15 4 -7 28 9 -33 -2 35 6 -35 -3 32 -7 -27 32 18 -54 -19 40 12 -67 -16 64 -24 -71 23 29 -51 -51 50 42 -90
4140i0L7J33p0r6R8M4p5n0J12J8j43L4J20m0r8N8O4m9p4R0M3j27K1J17m3q9K1
$$ -90 -53 80 10 -86 12 56 -19 -69 43 61 -82 -48 72 32 -66 -8 56 7 -67 23 66 -61 -40 77 34 -55 -34
4167c4J09p5q4J00M6j19lJ19k6j08K6J27p2q7Q8O3j09l4J16Lj12J1J38n8j00P1
$$ -34 75 0 -84 16 62 -57 -60 59 33 -75 -49 78 6 -81 7 70 -39 -73 43 46 -66 -55 83 25 -75 -4
4193dO3p6l7Q6K8r5qJ01l4p8M9M2l7k5K7J7k5k3N5j7l7J3J3K4l1k0L0rj0J1J6
$$ -4 59 -17 -54 32 60 -35 -43 58 24 -54 -5 37 0 -25 2 19 -6 -29 26 9 -28 -15 -2 22 -9 -29 1 -8 -18 -7 9
4224Irk3%N6l8l9M0K2k0k5K6L8o4nQ0k2p7K6P0j1j05M5R2o6o7Q0M6r7j9R7K3j26
$$ 9 0 -23 -23 33 -5 -44 -4 18 -2 -27 -1 37 -27 -32 48 26 -51 -25 45 34 -71 -26 66 0 -67 13 59 -38 -57 40 63 -63
4256f3OJ19m7r2O0P2q0o1J05M5j40pJ43j8j17M4J08o9j03J14Q3j53l3J48J0j35
$$ -63 -57 62 15 -77 -17 55 -25 -86 19 64 -76 -83 60 42 -75 -31 77 8 -95 19 102 -51 -84 64 74 -61
4282f1jJ54m2j54J02J08j28p2J34N1j58k4J71mj73P5J14j00q5R9Q4j28p2J50K8
$$ -61 -62 92 50 -104 -2 106 -22 -94 40 91 -67 -91 80 76 -97 -22 92 -8 -93 6 90 -38 -110 40 68
4307F8j39J0J21l4j08N4J07q2q6J20L6r1l0R3Mo7rQ5k5o9L8N5l6n3K8O5o3l9P4
$$ 68 -71 -61 60 26 -82 -28 79 -3 -89 31 67 -24 -54 39 43 -24 -33 52 27 -42 -4 51 15 -38 -10 55 -8 -47 27
4336B7Rn6j1N2J8q8J2Q8l1r3N2O9m0q2P2P1r7o4J34L5j20j9J06K2j37L1J28o1
$$ 27 36 -20 -31 21 39 -49 -37 51 20 -73 -21 48 8 -74 -2 69 -28 -92 42 77 -43 -62 44 66 -71 -40 88 27
4364B7j20R5R0j07p2J15P8j53k9J45nj38L3J39o9j35J01J19j49q2J66L8j54k6
$$ 27 -93 2 92 -15 -87 28 106 -47 -76 69 64 -74 -41 98 29 -106 -5 114 -35 -117 49 87 -67 -93
4388i3J67j5j91Q0J80j24j40J45J18j65r2K04K8k04K3K05p1j88J11J75j41j62
$$ -93 74 59 -132 -52 128 4 -136 9 127 -38 -130 74 102 -102 -79 126 55 -133 -22 153 12 -150
4410a50J92Q5k01j5J76jk02M3J99r4j67J22J45j45j00J41P2j56m5J75j1j64M6
$$ -150 42 127 -74 -89 87 86 -116 -73 126 32 -135 -13 132 -13 -113 28 100 -56 -101 74 63 -101 -55
4433e5J37o6j19P4J23j04q6J32N5j43k2J36K1j47rJ63l2j50O9J15p6j04R2J19
$$ -55 82 16 -103 -29 94 -10 -96 36 91 -52 -74 62 83 -64 -73 90 58 -92 -23 92 16 -88 4 123
4457A23j52r8J67N4j57k5J51mj52K9J73q3j64J28J21j26j11J36J08j85m5J88j
$$ 123 -29 -127 40 94 -63 -88 63 59 -93 -64 109 26 -138 -10 111 -15 -126 10 118 -67 -112 76 75
4480G5j73K3J82o3j74R7J83j43j41J71Q5j87n8K15K2k23L2K33j00j98J16J83j60
$$ 75 -98 -75 107 44 -130 -33 150 7 -134 37 122 -65 -123 92 114 -109 -77 156 56 -142 -26 157 -3
4503cj55K01J09k46n0K59j6k52O7K38j02k33J65J84k21j15K37P4k51k3K66j4k82
$$ -3 -158 43 152 -94 -144 115 99 -153 -86 152 50 -183 -18 166 -55 -170 67 141 -110 -133 133 119 -163
4526a63R3K38j33j87J68J47k12r7K26N6k30mK24m7j84O1J77j04j57J46J18j88
$$ -163 -70 168 35 -152 16 163 -49 -146 80 136 -94 -98 126 79 -105 -44 133 29 -128 18 136 -52
4548e2p5J76N4j84j4J98m8j80P1J61j05j44J30J44j69j05J88N9j76j7J80oj87
$$ -52 -127 49 103 -81 -95 103 55 -125 -54 107 2 -142 -12 132 -37 -142 46 105 -71 -88 92 86 -101
4571a01M0J90q4j61J03J43j28j38J54J15j81p0K06K0k03KK08m2j95O5J99j16j79
$$ -101 -61 129 45 -116 -13 130 2 -136 18 133 -48 -118 88 108 -95 -93 115 73 -122 -57 142 26 -153
4594a53J72J09j72j03K17N9k30l6K58l6k35Q8K14j25k05J71K06k52j14K63N0k51
$$ -153 19 128 -44 -147 70 129 -101 -137 121 85 -150 -62 152 27 -178 -7 199 -53 -167 96 146 -105
4616a05k0K78m6k73J18K53j96j93K28J55k51j30K79O5l04J9K99r7k65J47K18j85
$$ -105 -125 153 107 -166 -48 205 9 -184 44 199 -52 -182 97 162 -142 -123 176 79 -186 -39 179 -6
4638fk10K47J57k80o8K57K9k66K8K58p6k51J40K12j86j54J96J31k14q3K48J8k52
$$ -6 -216 31 188 -92 -160 97 126 -140 -112 146 70 -181 -41 171 -15 -169 27 158 -56 -139 109 127 -125
4661a25M0K37q5k12J03K02j48j81J99J21k09q6K30L7k29j0K41l9k52J05K11j33
$$ -125 -85 152 67 -145 -42 160 12 -169 30 151 -58 -144 86 123 -106 -116 125 86 -166 -61 150 17
4683A7j65J57J44j90j16K23O5k42j0K13Ok30M8K24r8k03J58J55j83j30K10J14
$$ 17 -148 9 153 -37 -153 70 135 -107 -117 96 102 -128 -80 144 46 -157 1 156 -27 -157 53 167
4705A67k42o8K50Ok48N0K37r3k32J35K28j94j90K31J17k54n9K59K4k87M1K96j24
$$ 167 -75 -143 107 113 -135 -85 152 59 -173 -38 190 -4 -194 37 154 -100 -159 100 124 -163 -122 174 50
4728E0k66J88K30k32j91K82J30l15n1L34k8l22R0L02j40k79K03K35k51j78K90
$$ 50 -216 -28 202 -30 -221 61 191 -124 -175 159 131 -191 -101 201 61 -218 -15 220 -31 -209 81
4749H1J04l11l5L11j5l11Q8K83j56k35J92J89k32j51K78P8k94j1K82m4k61Q5K41
$$ 81 185 -126 -161 150 135 -176 -88 195 39 -196 -4 185 -47 -198 80 158 -136 -147 135 91 -170 -85 156
4772A56j24k26J95J88k39j30K58R4k78m1K80j2k68P4K50j31k22J60K07k08j72
$$ 156 32 -194 1 189 -50 -180 78 172 -106 -147 133 121 -147 -73 177 46 -176 -16 191 -17 -189
4793a89K48J01k56m2K46J1k66N1K61j04k47J47K10j81j71J83J63k31j07K55M8
$$ -189 59 160 -96 -138 108 119 -147 -96 165 61 -186 -39 171 -10 -181 2 165 -66 -173 82 130
4814A30k50JK54m9k62R9K49j31k39J98J76k23j22K45Q5k74l7K99l0k93Q9K77j45
$$ 130 -120 -119 135 86 -176 -77 172 41 -198 0 176 -47 -169 76 161 -113 -150 149 119 -174 -85 192 47
4837D7k62K12K08k71j46L07R9l47rL14m8l17J23L08k03k64K62J98k85j48L20R8
$$ 47 -215 -3 205 -66 -212 95 194 -153 -162 152 104 -213 -90 218 15 -249 13 211 -74 -222 98 196
4859A96l54nL47p4l03J27K74j78k53K42K07k86j42L15N9l01NK94o1k97J33K62
$$ 196 -158 -163 184 110 -193 -66 208 30 -223 19 226 -60 -202 113 172 -129 -124 170 109 -188 -55 207
4881B07j82k36K34J76k58j35K88Q1l10oK99o5k79J07K55j47k42K03K02k46j23
$$ 207 25 -211 23 199 -59 -194 94 175 -135 -141 158 93 -186 -79 176 29 -213 -10 192 -54 -177
4902a77K54Q8k76l4K95k4k94Q1K78j44k12J54J91j86j80K50J30k78p0K73K0k70
$$ -177 77 165 -111 -145 150 126 -168 -87 191 47 -165 -11 180 -6 -186 64 194 -84 -154 119 139 -131
4924a31J2K85q9k63J45K29k01j83K27J55k66j26L05N8l14K3K87p0k86J37K70j96
$$ -131 -119 166 77 -186 -41 188 -13 -196 31 186 -80 -206 99 157 -157 -134 153 83 -203 -66 204 8
4946Hk40K65J79l01j09L20M8l17nL59j04l33J80K90k34k44K75J92l28j18L56M0
$$ 8 -232 33 212 -89 -198 122 170 -147 -152 207 103 -230 -50 240 6 -238 37 229 -99 -217 139 179
4968A79l65L4L45q9l32J51L12k32k46K77J82l21r8L21M2l35K8L46j12l04J62K71
$$ 179 -186 -152 193 104 -228 -77 235 3 -243 34 216 -105 -203 118 160 -175 -147 199 87 -217 -55 216
4990B16k06k26K58J69k96r9L15K9l17K8L16q3l00J49K71k17k15K55J48k80j20
$$ 216 10 -216 42 211 -85 -184 131 160 -157 -129 187 104 -196 -47 224 7 -208 47 195 -85 -205
5011b05L05N5l08J0L10p4k87J39K45j74k20K19J83k64j29K83Q0k73l9K83j5k93
$$ -205 100 155 -153 -143 167 93 -194 -55 190 16 -204 15 198 -66 -195 88 168 -105 -144 139 124 -169
5033a69Q3K84j41k57J89K05k03j72K33J30k56q4K85J0k82L9K92j03k78J59K44
$$ -169 -86 198 57 -200 -11 194 -9 -181 52 182 -74 -158 127 137 -145 -106 186 83 -195 -36 208
5054B08k11k11K55J49k89r5L20K6l45N5L35j12l07J64K86k36k32L02J65l28r3
$$ 208 -3 -214 41 190 -99 -194 126 152 -193 -138 197 85 -222 -58 228 -8 -240 62 227 -101 -194
5075a94L41M5l72L5L57j17l24J85K86k47k24K96J53l16j01L45K7l49M9L24j20
$$ -194 147 192 -180 -145 212 95 -229 -44 242 -5 -229 67 220 -96 -197 148 175 -174 -125 199 79
5096G9l10J88K72k51k05K89J42l16p9L31Ll19M9L39j48k91J99K50k36j93K72J51
$$ 79 -231 -43 229 -22 -227 62 204 -112 -191 140 143 -176 -127 212 64 -227 -28 222 -14 -207 65 216
5118B16l14p8L25j6k92O0K87j11k71J68K34k09j97K52J30k60r0K77M9l00K2K81
$$ 216 -98 -176 149 133 -159 -99 188 77 -194 -26 208 -1 -198 54 184 -76 -166 111 160 -140 -118 163
5140A63q3k57J11K34j39k11J87J75k35j27K66O9k65l5K84j9k82P9K71j48k26J89
$$ 163 80 -177 -66 168 29 -182 5 180 -55 -182 84 153 -112 -147 137 118 -164 -85 186 38 -188 1
5162AK00k30j59K66J18l03m9L07k1l01Q8K87j47k63K08K31k70j76K86J16l19m8
$$ 1 201 -29 -188 78 196 -107 -156 151 130 -171 -83 204 57 -206 2 233 -37 -213 73 189 -130 -178
5184a78L35l7l30J10L05j51k76K12K26k47j95L05J21l24l9L25k7l19R6L04j69
$$ -178 157 120 -210 -100 205 54 -222 -10 216 -31 -226 79 200 -124 -163 162 135 -184 -88 216 47
5205D7k64K15K17k43j74K95J05l27l2L30m5l04R8K97j78k46K13K05k58j46K84
$$ 47 -217 -2 215 -28 -202 93 198 -129 -161 169 124 -180 -82 215 37 -209 4 209 -49 -195 89
5226H9P5k99k0L00l4k93J09K69j72k28K16J81k38j37K63R2k87k5K86l2k67P8K48
$$ 89 164 -135 -155 145 111 -182 -73 196 24 -204 12 193 -45 -182 81 173 -114 -139 147 115 -152 -74 174
5249A74j16k23J64J85k08j50K33J04k50n5K54J3k67N6K37r5k26J45J93j70j81
$$ 174 58 -165 -1 184 -24 -174 59 163 -87 -142 112 125 -142 -86 151 56 -170 -25 168 -2 -183
5270a83K11J45k43r0K55L1k67L7K55p5k61J34K36j78k01K29J52k57j05K93M0l11
$$ -183 28 173 -70 -160 95 126 -141 -104 151 76 -185 -51 185 7 -194 35 187 -70 -175 118 158 -153
5292a53M5K97r8k90J49K51j81k25K44J64k93r9L10L3k99J7L09q9k93J53K53k07
$$ -153 -108 189 91 -199 -50 201 20 -205 39 203 -90 -189 121 154 -145 -128 181 92 -201 -48 205 -2
5314bk10K44J53k80r3L05M0l14L9K92r1k73J58K28k01j97K60J39l07n2K93J4k83
$$ -2 -212 32 185 -95 -188 117 157 -157 -118 174 83 -190 -32 196 -5 -202 58 197 -110 -162 131 145 -138
5337a38L1K96j19k60J70K21k16j78K50J26k74p7K97nk77N0K60j02k35J38K10j80
$$ -138 -107 189 70 -190 -20 201 -15 -193 57 183 -91 -168 129 124 -153 -103 157 55 -180 -42 168 -12
5359a2j73K15J27k22q2K35M2k37KK48o5k25Q9K05j27j77J62J51j92j05K12O6k24
$$ -12 -185 30 157 -65 -147 88 130 -107 -105 143 78 -147 -58 147 20 -157 5 156 -36 -141 71 137 -87
5382h7m0K45j5k46P1K33j29k07J71J75k09j49K51R9k75m1K85l1k72Q1K65j33k41
$$ -87 -127 118 103 -143 -72 161 32 -175 -4 171 -38 -187 64 163 -112 -153 132 101 -171 -90 175 42 -199
5405a99J90K04k40j46K64J04k95l9K97j3k97Q2K76j48k34J87K06k37j57K73J03
$$ -199 -9 195 -45 -191 73 177 -118 -157 140 127 -170 -88 188 40 -194 -7 199 -38 -195 78 181
5426A81l07k5K98l1k98J02K70j57k42K11J87k46j36K69R2l03qK94n4k91J35K59
$$ 181 -126 -151 147 116 -182 -80 190 33 -209 2 189 -57 -193 76 168 -135 -143 151 97 -194 -59 200
5448B00j77k24K06J86k51j19K76O3k80jK74n3k67J07K45j47k24K03J75k24j29
$$ 200 23 -201 5 191 -60 -179 97 160 -120 -121 153 100 -167 -60 185 38 -186 17 192 -32 -161
5469a61K37O5k46k4K53k0k49P2K16j21j86J51J66j77j30K07Q3k30l2K16J4k29
$$ -161 76 141 -105 -129 124 104 -145 -73 143 22 -164 -13 153 -24 -154 53 136 -94 -126 90 104 -125
5491a25M4K22p7k16J29J79j67j43K01J20k30q2K58K4k64L9K43p5k49J36K18j92
$$ -125 -81 141 64 -152 -23 156 -11 -154 47 167 -63 -145 113 137 -127 -88 155 80 -169 -33 185 -7
5513gj83K23J42k47q3K54M5k82J6K88q0k65J51K18j86j91K15J59k57j04K89K6
$$ -7 -190 33 175 -72 -155 99 144 -138 -122 166 86 -179 -28 190 4 -187 28 187 -70 -174 115 141
5535A41k84L2K77q0k65J51K24k04j82K45J34k58p7K75K0k93M8K76j12k46J68K02
$$ 141 -143 -111 166 86 -179 -28 196 -8 -190 55 189 -69 -146 129 149 -144 -96 180 68 -178 -10 192
5557A92k09j76K58J13k90l6K85k6k78P8K65j42k27J91J79k15j33K35R2k61l0K66
$$ 192 -17 -193 65 178 -112 -148 137 111 -167 -89 176 34 -193 -2 177 -38 -171 64 156 -105 -135 131
5579A31j6k56P0K33j18j91J49J65j91j27K13Q8k20m2K20Lk19L0K16q7k03J37J67
$$ 131 115 -141 -71 162 44 -147 2 167 -24 -151 62 150 -70 -112 108 111 -108 -78 138 51 -152 -15 152
5602A52j53j42J68J25k03q8K17L7k14LK20o2k20J07K11j44j83J84J36k02q4K23
$$ 152 -1 -143 25 150 -53 -141 76 113 -101 -98 122 60 -160 -53 158 14 -169 15 151 -51 -135 88
5624H8N6k54KK61o1k38R2K17j31k07J95J48k20j07K48N1k70%K72m9k55R0K38j46
$$ 88 144 -110 -108 153 92 -146 -54 163 32 -175 20 168 -52 -159 89 140 -130 -130 142 93 -162 -72 166 20
5648B0j98J90J53k26j12K58O0k69j0K77n3k72J33K26j66j94K24J52k64p9K69K4
$$ 20 -178 12 165 -61 -173 85 145 -124 -134 143 90 -182 -49 177 11 -183 41 193 -71 -150 119 143
5670A43k72K5K70q6k47J50K11k05j68K28J24k52o5K67Kk70N1K51j08k20J33J94
$$ 143 -129 -104 166 80 -167 -17 194 -11 -179 49 173 -79 -144 123 125 -145 -94 157 49 -171 -38 156
5692A56j55j73K10J11k26n7K18K2k21L1K05o4k09J20J78j45j39J70J00j71p4J97
$$ 156 1 -172 38 149 -77 -134 84 106 -115 -84 121 57 -152 -32 146 1 -138 32 132 -39 -113 84
5714H4M2k25K1K04m7k08Q5J82j14j68J53J33j90j06K21N5k35j4K43m1k28Q1K10
$$ 84 126 -99 -78 126 79 -129 -44 138 24 -144 9 142 -48 -154 67 122 -113 -127 116 75 -153 -72 138
5737A38j16j83J54J66j85j37K34P1k42l1K34lk40O5K35j07k27J77J75k03j38K17
$$ 138 22 -161 -7 159 -26 -163 71 142 -100 -131 103 100 -140 -75 160 53 -174 3 178 -25 -163 54
5759E4J03k31o6K64j5k44O0K37j17k21J70J88k16j51K56Q4k74j3K64l5k79R7K58
$$ 54 157 -74 -140 124 109 -135 -75 162 45 -176 -6 182 -34 -185 71 155 -119 -132 132 97 -182 -85 173
5782A73j56k07J90J75k30j10K42P3k77OK71m7k66J16K31j60j96J92J60k41r1K45
$$ 173 17 -190 0 175 -55 -165 77 150 -127 -121 150 103 -163 -47 184 24 -172 20 180 -61 -152 93
5804I3M4k59PK36l2k41R8J96j24j81J78J22j86r8K16O4k42NK08l9k01P8J91j08
$$ 93 137 -122 -115 121 89 -152 -54 142 18 -163 15 137 -49 -147 69 133 -109 -104 104 65 -136 -58 133 25
5828B5j62J42J50j85j14K13O9k14l2K24j1k20P0J88r6j85J38J56j66j32J90R6
$$ 25 -137 5 155 -30 -144 69 138 -76 -108 116 105 -115 -45 143 47 -138 0 156 -10 -142 48 144
5850A44k30l1K21%k32M7K26r9k09J44J65j71j39K08J04k30n6K49J0k56M0K45q4
$$ 144 -86 -117 104 104 -128 -81 145 46 -163 -19 146 -25 -164 44 148 -82 -138 111 121 -135 -95 150 66
5873F6k37J52K00k00j60K37J05k51m0K61j6k60N6K62j23k23J65J98k21j43K59
$$ 66 -171 -19 181 -19 -179 58 163 -88 -128 133 117 -143 -87 175 52 -171 -6 192 -29 -172 87
5894H7P2k85j6K98m0k92J07K45j50k10J92J75k47j18K72O3k75KK68n3k44R4K30
$$ 87 159 -126 -142 156 116 -176 -69 176 26 -184 8 183 -64 -182 90 153 -122 -120 148 95 -149 -55 175
5917A75j57j77J86J29j96j11K37N4k30j8K45o3k10R5K02j40j73J56J46j91r3K05
$$ 175 18 -159 27 156 -40 -151 86 140 -90 -108 137 74 -136 -41 161 21 -152 4 150 -41 -134 71
5939G1N2k13k1K24k9k27Q6J98j23j81J67J36j79j09K04O5k04l2K35k4k24O5K07
$$ 71 123 -90 -111 113 84 -143 -57 141 18 -163 4 140 -39 -148 56 121 -83 -115 120 96 -128 -63 144
5962A44j03j87J34J68j71j26K15O6k13n4K38Jk32L7K17q4k07J33J85j77j53K25
$$ 144 41 -146 -12 156 -15 -141 74 140 -73 -127 111 112 -120 -83 134 50 -157 -24 161 -16 -169 56
5984E6J00k53n5K56J5k69O0K51j18k25J75J86k21j45K57R5k78k8K82k8k65J02
$$ 56 156 -97 -152 104 119 -150 -90 161 43 -182 -7 179 -42 -187 70 165 -113 -141 141 113 -152 -50
6006e0K39j53k25K02J90k57j30K89M8k78J0K65o5k68J25K38j74k01K14J49k38
$$ -50 189 36 -189 13 203 -54 -184 105 153 -125 -115 150 85 -183 -58 180 6 -195 19 168 -70
6027g0q5K35N2k58J3K45o5k34J21J98j43j72J87J29k11q5K37K8k30J8K19o3k02
$$ -70 -155 80 132 -126 -113 132 67 -167 -46 152 9 -163 24 153 -58 -143 94 122 -108 -90 129 66 -136
6050a36J02J84j39j53J65J12j83q6K10L7k20MK27m1k14Q4J73j09j72J67J17j80
$$ -136 -34 150 11 -142 23 135 -48 -134 76 113 -107 -103 124 83 -131 -47 126 17 -155 12 129 -51
6072e1r3K06N4k06k7K20j4k17O8J93r7j75J44J58j81j29K08Q3k24n1K35Mk23L3
$$ -51 -144 62 116 -90 -117 103 89 -128 -60 133 36 -139 5 163 -18 -147 61 144 -80 -131 104 108 -115 -82
6096h2K25r2k09J42J83j82j46K16J02k46m6K60k6k55O7K63j53k14J84J93k37j30
$$ -82 143 51 -158 -16 167 -15 -161 55 157 -89 -135 125 99 -156 -89 174 21 -193 -9 184 -53 -183
6118a83K67O9k93J4K71n1k70J04K63j61k13K03J61k37j00K51N0k58RK49o0k48
$$ -183 84 153 -140 -126 145 94 -176 -72 191 30 -183 20 181 -56 -156 95 145 -113 -104 145 85 -163
6140a63J22K20j59j79J83J34k16q5K31L0k24QK24n5k15R7J96j42j65J83J28k11
$$ -163 -41 179 20 -159 24 158 -58 -143 88 118 -106 -98 126 71 -144 -47 149 7 -158 25 153 -58
6162e8p8K12M8k39J4K23m9k00Q9J78j16j62J69J12j86q6K05O1k28mK01k1k15P1
$$ -58 -136 76 124 -115 -101 122 73 -127 -38 140 24 -138 31 143 -43 -129 76 137 -91 -95 106 85 -130 -59
6186e9J95j03j78J37J48j55j40J93P7j94l8J94Mk06L8K15p3k06J30J72j47j59
$$ -59 136 33 -145 -8 140 -15 -155 38 115 -79 -117 77 81 -125 -87 128 55 -151 -21 151 4 -155
6208a55K01R9k17n3K37Rk47M3K32q7k21J45J95j84j68K26J16k64m8K77j6k82O6
$$ -155 46 145 -72 -125 112 121 -126 -83 149 62 -159 -14 181 -3 -171 55 171 -93 -141 136 120 -162 -96
6231i6K74j26k47J84J91k28j50K65Q6k79k7K84k9k73R6K43j36k23J83J83k33j15
$$ -96 178 52 -195 -11 180 -48 -198 67 153 -126 -153 131 102 -171 -75 168 32 -191 -8 175 -58 -173
6253a73K49Q0k65j3K53l9k37R0K17j44j87J89J46k18j07K35O5k57mK48m8k22Q9
$$ -173 76 156 -109 -122 131 92 -145 -55 162 18 -169 20 166 -52 -159 76 141 -116 -120 128 80 -142 -53
6276e3K04j38j75J69J41k00j12K16O1k13k2K29k4k16P1K00j15j69J32J59j52j31
$$ -53 151 13 -162 7 148 -52 -164 52 113 -100 -122 107 83 -133 -62 138 23 -146 -14 145 -7 -138
6298a38J71J08j98n4K11J5k15J6K10m9j97Q1J84j43j53J71J26j98r4K17N8k42
$$ -138 33 141 -57 -111 100 115 -100 -84 126 77 -120 -39 145 2 -151 20 146 -52 -146 71 129 -113
6320a13kK43n1k36R2K34j49k02K06J45k39q8K58M9k81J8K72p0k62J43K15j80j94
$$ -113 -115 128 77 -159 -67 167 18 -184 22 167 -72 -160 98 147 -134 -116 156 86 -176 -33 182 2 -192
6343a92K45J35k57q9K69L0k69L0K65r8k46J50K08j88j76K16J38k57p6K71J7k67
$$ -192 53 188 -69 -158 111 141 -128 -98 167 69 -177 -27 181 -7 -183 33 171 -86 -162 109 126 -141
6365a41L4K64r6k41J46J90j74j47K04J19k37o3K51Jk38N2K15p7k21J37J81j66
$$ -141 -107 157 61 -180 -34 156 -18 -165 39 158 -79 -142 109 110 -128 -76 139 62 -159 -22 159 -7
6387gj40J97R7k17m5K18J0k27K2K29p5k02J18J58j31j57J75J20k03p5J98N1k15
$$ -7 -147 50 147 -70 -115 103 113 -114 -92 137 62 -140 -22 136 5 -152 23 143 -60 -135 63 114 -101
6410a01pK02l0j98Q2J82r8j63J24J62j74j23J96R2k14m6K19kk15M5K19j00k03
$$ -101 -108 94 64 -134 -52 130 32 -131 -7 155 -19 -142 54 146 -68 -114 105 103 -112 -67 152 52 -151
6433a51J45J85j99j39K26P1k20n2K53j6k62R1K41j39k14J63J95k16j49K52R0k75
$$ -151 -6 179 -20 -159 67 138 -82 -134 119 103 -159 -68 173 34 -180 -17 178 -38 -187 65 155 -120
6455a20k7K79l1k62P3K69j49k19J94J74k22j31K61P6k83oK75n5k54J03K18j39
$$ -120 -147 132 101 -161 -88 181 32 -187 7 181 -41 -172 89 165 -118 -124 151 96 -158 -55 163 24
6477B4j93J92J53k40r9K51M3k59J3K53n7k44J11K13j54j79K03J28k19q3K25M2
$$ 24 -169 23 176 -64 -163 88 131 -128 -115 138 81 -163 -52 161 7 -172 31 159 -60 -143 82 124
6499A24k41J3K40o6k29J32J85j53j59J81J29k02r8K27L9k22jK08k1k03P3J87j19
$$ 124 -117 -104 136 70 -159 -27 158 5 -154 27 156 -46 -144 83 122 -100 -101 107 86 -117 -44 143 24
6522B4j63J30J35j42j30J88P2j73n7K01Pk07L0K03o6j90J11J71j56j33J81J09
$$ 24 -139 -9 126 -16 -146 42 114 -59 -116 85 92 -115 -85 118 52 -138 -27 144 -12 -145 36 145
6544A45k14o1K23J9k29K8K37p7k22J13K01j64j57K15J13k40p8K73Pk69M6K51r2
$$ 145 -69 -130 93 112 -117 -89 148 71 -151 -38 163 -1 -158 57 170 -70 -148 125 132 -137 -91 160 68
6567F8k39J46K03k05j50K32J16k65o3K81j7k67O1K59j16k24J69J91k10j54K66
$$ 68 -171 -25 178 -27 -177 55 171 -94 -157 124 107 -160 -99 160 44 -180 -11 180 -30 -184 82
6588H2Q2k59l5K66l5k44Q0K37j38j97J73J62k24j00K32O2k47j5K54n8k38J17K12
$$ 82 164 -95 -130 136 101 -143 -63 174 36 -161 12 174 -50 -150 82 144 -103 -118 136 78 -160 -43 169
6611A69j54j77J79J39k08r0K24L5k33J5K20m6k11Q3J93j29j62J47J41j62r5J56
$$ 169 15 -162 17 156 -52 -142 82 117 -116 -101 119 73 -138 -55 138 9 -153 -6 135 -27 -122 34
6633C4R7j95l7K03rj87L0J83n8j90J14J50j40j16J61Q9j91o8K09K7k12J0K22p6
$$ 34 131 -64 -101 102 93 -94 -64 119 61 -129 -15 135 -5 -121 40 129 -62 -130 79 106 -106 -96 126 50
6657E0j94J02J80j33j67J89J26k26o9K34K2k38K4K52p4k42J28K10j89j62K10J37
$$ 50 -144 -42 138 5 -162 27 153 -73 -142 92 114 -124 -100 152 78 -164 -36 174 -15 -177 33 170
6679A70k35q4K57J2k56M1K56q9k48J52K07j90j83K31J26k58o9K69Ok59M5K47q9
$$ 170 -65 -149 108 120 -136 -95 161 72 -176 -24 183 -7 -190 41 167 -91 -160 109 115 -144 -99 148 59
6702E9k47J55J99j93j39K12J05k40m4K51j0k59Q2K27j33j93J72J63k01j15K18
$$ 59 -188 -33 166 -27 -166 46 151 -89 -133 118 108 -151 -69 158 25 -168 4 167 -34 -149 69
6723F9P5k44j6K52m2k41Q5K22j24j95J66J44j80j17J94Q3k15l4K03j0j90M4J78
$$ 69 144 -100 -116 136 94 -147 -62 160 36 -159 7 151 -29 -146 48 131 -84 -118 85 75 -115 -71 107
6746A07p2j65J00J57j34j21J55Q6j66o1J83K5j76MJ90n2j69Q3J58j21j46J54J31
$$ 107 35 -130 -30 127 -7 -128 27 113 -53 -114 69 94 -82 -78 112 60 -109 -26 132 11 -135 19 150
6769A50j75r5J90M4k11oK21m8k09Q5K09j37j75J62J45j88j12K15P0k48jK35m0
$$ 150 -25 -120 70 114 -97 -103 118 70 -139 -54 155 18 -157 5 150 -38 -150 65 135 -113 -114 121 81
6792H1k36R9K13j38j82J69J54k06j08K31N3k38qK51l6k43J00K03j51j77J82J56
$$ 81 -155 -56 157 19 -163 6 160 -46 -154 77 130 -108 -116 135 99 -144 -44 159 8 -169 13 169
6814A69k30r3K44K9k57K2K51p2k26J27J88j66j58K14R4k20m3K18J4k37M3K26j02
$$ 169 -61 -154 90 119 -138 -116 135 63 -163 -36 152 -14 -172 42 136 -84 -127 91 105 -132 -89 137 35
6837C5j81J39J61j72j26J85R5k08m6K14jk10M7J95q4j63J03J46j38j13J55P9j61
$$ 35 -146 -7 154 -18 -144 41 136 -72 -118 96 95 -115 -68 127 43 -120 -17 129 -9 -122 33 112 -49
6860d9n8J63K5j76J5J64l8j66P9J40r0j34J23J09j56o1J63L8j64j5J81k2j73N8
$$ -49 -107 56 81 -95 -80 84 46 -120 -41 99 9 -125 -2 107 -49 -110 53 91 -73 -88 93 71 -102 -44
6884d4J75j11j41J28J18j62q4J77N4j91j4J98l2j85O3J78r4j71J38J50j92r7K01
$$ -44 131 20 -121 7 125 -37 -121 56 110 -81 -95 103 71 -114 -51 127 33 -138 0 150 -42 -139 62
6907F2N6k19rK08j8k17P4K05j22j68J45J47j87j02K11O2k18j7K18m2j98P7J94
$$ 62 118 -101 -110 98 80 -137 -63 142 20 -148 -3 144 -43 -145 66 128 -90 -107 111 69 -129 -52 142
6930A42j31j58J76J13k01o7K11K3k11K1K15q0k02J23J77j77j21J84R0j98n4K06
$$ 142 11 -147 29 142 -59 -126 85 108 -103 -82 133 53 -149 -26 151 -26 -147 37 127 -71 -125 81
6952H1Mj99L4K02r1j70J18J46j35j21J58P4j58m4J64J2j49OJ70n4j53Q0J25r2
$$ 81 85 -114 -80 122 31 -139 -21 125 -10 -131 27 101 -57 -101 63 75 -74 -68 102 48 -105 -25 100 8
6976Hj01J01Q9j37n7J49K9j43kJ39k0j47L6J57q7j24J04J08j24r0J41O1j56k1
$$ 8 -93 8 97 -40 -97 52 81 -62 -64 75 55 -92 -56 101 14 -110 -6 102 -22 -112 29 90 -66 -87
7000h7J59j0j53L1J57o6j54J06J34j36j13J71Q0j73m3J77Pj78K4J84o7j68J08
$$ -87 72 62 -91 -60 97 31 -123 -17 117 -19 -132 39 119 -54 -97 80 87 -91 -67 117 50 -118 -10
7023a0J43j26j29J57R1j83n3J91mj92N0J68p0j76J29J41j51j03J73P5k01l2K06
$$ -10 133 7 -122 35 126 -57 -110 81 77 -115 -65 103 33 -143 -14 127 -24 -127 46 121 -80 -112 94
7046I4j5k07P5J90j12j56J43J35j84j01K10L2j91KJ91l2k03Q5J76j19j53J71R5
$$ 94 79 -128 -53 137 25 -131 12 147 -37 -138 72 104 -87 -85 106 74 -129 -44 132 13 -140 31 126
7069A26j66p0J75K8j67k2J84l8j58O6J52j05j10J06R4j31p0J51L8j48nJ32k1j31
$$ 126 -40 -110 65 93 -74 -96 88 50 -108 -42 110 5 -105 1 95 -36 -106 45 83 -65 -70 62 41 -90
7093i0N3J29p3j05Q8J03j14q5J34N3j40l1J56j2j52L7J47o4j38Q4J33j19j04J36
$$ -90 -37 92 19 -86 2 105 -9 -94 40 93 -47 -78 78 66 -86 -49 98 34 -104 -20 113 -6 -110 26
7117B6O4j44l8J51J1j67J9J66m6j58Q0J60j17j27J31J00j51p9J80L4j79PJ78l3
$$ 26 90 -54 -92 59 70 -97 -78 88 42 -116 -36 124 7 -120 11 111 -40 -119 61 95 -84 -77 101 68
7141F8j83Q7J65j26j22J46Q9j72o8J98L0k13J8J97o0j85J13J44j39j29J81P4k00
$$ 68 -115 -28 137 11 -111 35 124 -48 -116 82 112 -101 -83 114 54 -131 -18 126 -13 -142 39 113 -87
7164h7k9J96Kj93M5J88r4j63J32J31j50j03J66P2j73l7J80rj81P2J49q6j35J12
$$ -87 -116 80 82 -111 -66 122 28 -135 -3 128 -22 -125 41 113 -60 -97 83 74 -107 -35 114 28 -107 5
7188EJ17j20j06J50N8j47k5J34pj38K6J39n8j28Q4R7j05q3J19P0j25m7J39J6j41
$$ 5 122 2 -104 46 104 -43 -68 66 59 -79 -53 86 28 -100 -16 81 -24 -107 12 82 -43 -90 49 65 -76
7213g6J5J34l2j33O5J21r2j04J18P6j23n6J38K9j48PJ46k3j44M7J40q4j16Q7J11
$$ -76 -61 73 41 -92 -27 94 2 -102 16 92 -31 -87 51 80 -68 -61 85 62 -82 -35 105 21 -95 -8 103
7238A03j25q9J41O8j60k6J53lj56K2J72q0j47J09J29j34j09J71O8j69l1J78j3
$$ 103 -22 -111 30 98 -62 -88 65 62 -94 -72 100 20 -127 -18 111 -23 -132 39 107 -62 -93 85 72
7261G2j84O3J72r4j54J27J27j60r4J98L3j83j1K03m7j93Q0J70j21j31J45J11j77
$$ 72 -112 -49 123 29 -125 2 129 -31 -125 73 106 -77 -88 115 68 -125 -45 125 4 -127 18 129 -48
7284d8o6J88J1j74OJ84n3j68Q3J34j04j07J34Q8j45n6J52K3j62J4J53m3j32O1
$$ -48 -114 74 85 -89 -83 101 48 -120 -37 97 -7 -114 20 108 -37 -93 59 82 -80 -66 87 44 -88 -27
7308b7J31r6r6J12O8j06o3J29L7j42mJ29k7j25M3J16p1j09J04Q7j24o3J33N1j51
$$ -27 104 8 -88 24 92 -14 -77 52 89 -53 -57 72 45 -80 -37 79 8 -101 3 90 -34 -97 36 87 -64
7333f4k9J58oj43M1J29o4j24P4J38j15r5J24Q1j47m5J37L0j60J7J68m0j66P3J45
$$ -64 -93 65 59 -84 -43 86 22 -102 -28 110 -5 -100 24 105 -42 -87 50 80 -80 -63 105 65 -101 -28 117
7358A17j09j19J23J08j61p1J73K5j74J4J72m5j68P8J53j22j17J58P1j75n5K02
$$ 117 8 -111 12 120 -41 -112 61 86 -88 -74 98 53 -115 -37 116 -6 -123 35 106 -69 -124 78
7380G8Jj96M8J91q2j67J16J40j44j08J70P1k01j9K04l3j79O8J63r5j42J14J30
$$ 78 79 -117 -69 122 40 -127 -11 129 -15 -123 47 118 -83 -102 102 69 -110 -42 121 26 -116 -2 128
7403A28j54r3J80M9j77j1J65j8j74O2J55j06j25J07J16j22r4J36O0j59JJ43j8
$$ 128 -26 -119 61 110 -67 -78 87 69 -105 -43 112 6 -119 -12 104 -18 -112 24 84 -75 -74 69 51
7426E1j31L4J39o2j25J00R8j13p3J21M8j24l3J44rj47M5J33o4j29P9J14j04r5
$$ 51 -80 -46 93 31 -94 6 104 -9 -82 39 87 -37 -70 74 65 -82 -37 96 32 -97 -18 96 -8 -103
7450a03J30O6j45l3J40J2j43LJ61m6j43O7J35r7j10J16R1j43o9J62M3j80OJ66
$$ -103 27 93 -52 -85 55 67 -76 -73 88 42 -101 -34 101 4 -106 10 101 -42 -111 51 94 -86 -80 86
7474H6k4j67O9J63j10j32J33J09j68p1J81L0j91K2J89o0j86J03J52j39j17J54
$$ 86 62 -105 -36 127 17 -115 18 127 -41 -112 69 99 -92 -70 119 59 -127 -24 128 -11 -128 26
7496B6J04k06n0K14jj98M9J79p3j92J25J58j63j11J76P5j92k9J92Qj95M5J86p8
$$ 26 130 -76 -126 88 87 -111 -62 117 44 -148 -23 135 -28 -139 37 112 -80 -109 83 91 -104 -59 127 49
7520D9j64J05J32j36j04J50P7j71k4J69qj57K1J64o7j51R6J24j21r8J50N4j51
$$ 49 -115 -10 122 -14 -118 32 109 -62 -86 83 75 -82 -61 103 36 -115 -19 105 -16 -114 36 90 -61
7543f1k8J54J3j67L6J39n1j40R0J16j04j08J39P5j56k5J38J7j45J1J49m3j35O3
$$ -61 -89 65 78 -89 -53 86 35 -105 -15 101 -3 -111 28 103 -53 -78 60 77 -68 -57 92 49 -86 -23
7567b3J26r1j25J27R4j33p9J54L8j55j4J59k0j65N3J64q2j54J17J19j48q0J54
$$ -23 103 12 -113 14 108 -25 -104 50 88 -67 -81 78 58 -107 -54 110 28 -126 -9 110 -38 -118 36
7590C6P0j73l2J91j7j97P6J67j02j52J35J32j62q8J88L3j97QJ96m8j98Q6J91j28
$$ 36 106 -67 -99 92 75 -122 -46 121 19 -133 2 134 -28 -116 72 105 -92 -84 112 64 -134 -48 143 15
7614A5j71J80Q8j71o3J99K6k09K6J99o9j83R5J58j32j16J44R8j74n8J93J1j88
$$ 15 -156 24 112 -59 -122 77 103 -106 -80 119 50 -133 -38 120 -12 -128 16 114 -60 -118 75 86 -102
7637a02L2J69n9j65J02J35j19r5J33Q2j48n6J60K7j77L1J56p2j34P5J33j17r7
$$ -102 -70 99 40 -125 -23 112 -7 -102 31 113 -35 -91 69 96 -81 -50 106 34 -100 -25 108 -9 -106
7660a06J35O3j44l8J47J3j58J7J51m7j37P4J28j01r9R5J02j18p6J37N4j55j8J60
$$ -106 29 92 -52 -90 57 70 -88 -71 80 33 -104 -30 98 -3 -102 -7 95 -23 -99 38 92 -63 -81 79
7684G9j7j45K8J64p8j40R7J25j08j06J28P1j46m4J60J2j73J9J70o7j48R7J36j31
$$ 79 62 -83 -55 109 31 -109 -12 113 5 -101 27 98 -48 -92 68 80 -93 -74 96 29 -119 -22 114 -17
7708a7j15J72O4j88j7J84kj99O0J83r7j61J43J29j68j03J84O0j97j5J94j5j91
$$ -17 -132 40 104 -84 -101 83 81 -118 -58 125 28 -133 10 139 -29 -132 52 112 -85 -100 94 79 -112
7731a12P6J69j23j34J28J32j78q9J92L9j91nJ82k3j91Q9J62j18j28J31J05j60
$$ -112 -36 133 10 -124 4 136 -42 -131 61 100 -91 -96 86 63 -128 -39 123 5 -123 8 113 -47
7753d7p7J76L5j70%J74l3j69P9J40r2j25J24R3j46o0J64J4j57RJ51l1j44O3J33
$$ -47 -124 52 87 -83 -83 91 58 -111 -32 108 16 -109 15 108 -38 -98 66 80 -77 -68 83 52 -92 -29 104
7778A04p9j21J03R7j29p4J32N1j45j3J46j9j33J8J48n5j25O9J21j08r1J20O6j25
$$ 104 25 -96 7 104 -25 -99 33 84 -61 -74 72 53 -80 -62 86 31 -94 -25 96 -12 -103 17 83 -42
7802d2n6J44L8j51QJ51l8j48O8J43j14j17J45Q6j57n6J74J5j85L5J75n7j82R6
$$ -42 -98 46 84 -67 -59 92 54 -94 -26 117 3 -114 31 117 -40 -96 78 93 -92 -57 118 61 -121 -25
7826b5J47j30j17J55Q4j74n1J84K1k06M4J84p7j69J09J48j43j28J77Q9j89l7J89
$$ -25 122 -8 -125 30 114 -60 -111 73 94 -112 -68 116 39 -130 -21 127 -16 -144 33 122 -67 -104 85
7849H5Kj87L3K01r2j69J23J20j25j16J64Q7j87k1J65mj82N5J53q1j29R0J44j55
$$ 85 87 -100 -67 134 42 -127 -4 116 -9 -125 39 126 -61 -82 83 79 -103 -48 105 24 -105 -15 129 -26
7873b6q5J60L8j62oJ62k4j59N8J38q5j18J00R7j17o9J46M0j55j0J50Kj56L7J37
$$ -26 -111 49 87 -75 -81 81 57 -102 -44 94 9 -109 -9 88 -29 -98 48 88 -67 -77 73 75 -81 -44 93
7898I3o6j14Q6J01j09q7J23N8j23n0J47J5j42mJ39j2j43M4J28p4j22J15Q5j27
$$ 93 27 -87 -1 100 -9 -96 27 85 -38 -88 59 74 -68 -72 67 55 -88 -44 84 10 -112 3 88 -39
7922c9o4J38M7j49k9J75k6j74O9J68j01j42J29J15j46q3J72M1j81PJ85n0j82Q4
$$ -39 -103 35 82 -67 -96 79 53 -121 -52 116 15 -127 2 117 -29 -112 60 101 -80 -73 112 62 -120 -36
7946c6J67j12j49J49J10j77p6J88M8k10QK05o0j91R2J61j13j41J58J09j81p0J94
$$ -36 131 19 -130 19 129 -48 -124 64 112 -98 -90 115 55 -136 -44 117 4 -137 21 130 -51 -121 73
7969G3K7j98J9J82n1j83J08J47j37j04J57P4j65m0J69J5j82L6J63p2j54J16J15
$$ 73 100 -98 -79 103 52 -131 -23 124 -13 -117 40 114 -51 -91 78 93 -89 -53 110 38 -116 0 115
7992A15j23r4J32P8j62l0J42Mj48K6J48o4j30Q9J15j01j00J14P2j15n8J29L3j36
$$ 115 -8 -102 30 108 -54 -84 58 62 -86 -60 88 24 -106 -17 98 -3 -103 11 83 -32 -90 39 72 -64
8016f4QJ25k5j31M9J33o9j19Q5J05j08q2J30O1j51l3J53Rj66M0J52o1j51R7J15
$$ -64 -56 69 44 -87 -38 95 26 -93 -8 97 -11 -93 37 98 -53 -86 67 76 -90 -50 102 41 -110 -13 102
8041A02j19j02J43P3j69l1J62Rj70L3J74o9j69J19J31j41r6J66O4j77k8J83lj92
$$ 102 -17 -119 24 97 -72 -103 59 68 -102 -69 105 36 -133 -14 117 -24 -120 46 110 -67 -95 88 85 -107
8065a07O1J66r6j56J33J38j61j08J79O1j82k9J88j1j81N6J73j02j51J18J43j52
$$ -107 -46 120 24 -132 1 139 -22 -130 49 110 -72 -101 87 76 -105 -49 124 22 -129 -11 132 -20
8087b0j02J60M9j79mJ78l4j71P4J55j02j35J37J07j52n7J50L3j64QJ62l1j57O0
$$ -20 -122 38 87 -92 -96 82 48 -123 -49 106 4 -131 6 113 -39 -96 54 87 -77 -69 93 62 -95 -35
8111c5J42q8j26J12R3j29o0J37M2j52pJ44j5j42M2J18n1j14O5J09q5j01J09Q0
$$ -35 107 19 -107 5 98 -31 -91 46 88 -64 -71 73 58 -84 -42 76 25 -89 -24 85 0 -101 8 88
8135H8j27n4J29M3j45LJ42l7j37O4J26p8j20J10J01j38o4J54K7j50j2J64k4j74
$$ 88 -39 -93 36 79 -66 -63 79 42 -95 -31 95 17 -103 7 108 -30 -94 60 87 -63 -75 89 65 -109
8159a09P3J52j19j13J24J05j52q0J74K8j84J3J80l7j79P6J65j19j34J44J15j74
$$ -109 -36 116 -3 -116 8 113 -39 -119 55 83 -101 -88 92 55 -124 -48 117 -2 -136 8 123 -51
8181e1o9J79L3j79pK02m7j83Q5J62
$$ -51 -120 59 92 -87 -94 108 61 -122 -37 125
8191A25
$$ Imaginary data points
##PAGE= N=2
##DATA TABLE= (X++(I..I)), XYDATA
0@%%%%%%%%%%%%Qj6J6j6J6j7K5l2M0m8N6o5P3q8J04j20J38j62J85k10K42k74L07
$$ 0 0 0 0 0 0 0 0 0 0 0 0 0 8 -8 8 -8 8 -9 16 -16 24 -24 32 -33 40 -48 56 -64 74 -88 97 -113 129 -145 162
35A62l47L94m42M92n48O12o82P59q41R29j028J135j252J379j517J671j842K032
$$ 162 -185 209 -233 259 -289 323 -359 400 -441 488 -540 595 -657 722 -795 876 -966 1066
53A066k241K475k738L032l371L764m222M766n425O247p302Q704j0674J3675j8830
$$ 1066 -1175 1300 -1438 1594 -1777 1987 -2235 2531 -2894 3353 -3949 4755 -5919 7756 -11074
68a1074L0009r4611R4365J65178k64231o7253K45837L5153k66646L5250K46340
$$ -11074 18935 -75676 18689 183867 -80364 -147617 98220 133373 -133273 -98023 148317
79A48317p6549k37674J31131K01222j61265j70767J95532J23004k12318p9482
$$ 148317 71768 -165906 -34775 166447 5182 -165585 29947 152951 -59367 -138849
89a38849K28844K6520k28590J7921K24473o3096k07245R9941J85125j35806j51479
$$ -138849 89995 116515 -112075 -94154 130319 67223 -140022 -40081 145044 9238 -142241
100a42241J62652J14845j84395p4311J97283L5106k03979N435K00202m3863j87414
$$ -142241 20411 135256 -49139 -123450 73833 108939 -95040 -89605 110597 66734 -120680
111a20680Q0032J66208j11880j40273J40311J09591j62860p5648J77244M0023
$$ -120680 -40648 125560 13680 -126593 13718 123309 -39551 -115199 62045 102068
121A02068j82270m826J79514l0141j69986O4593J53997r6379j32492J22761J07575
$$ 102068 -80202 -85028 94486 64345 -105641 -41048 112949 16570 -115922 6839 114414
132A14414j42763q0106J56569M9560j63573j6188J63306j7751j56849M9968J45875
$$ 114414 -28349 -108455 48114 97674 -65899 -82087 81219 63468 -93381 -43413 102462
143A02462p9498j30461J05324J09620j25728q3692J39654N4373j48031k3061J51790
$$ 102462 22964 -107497 -2173 107447 -18281 -101973 37681 92054 -55977 -79038 72752
154G2752r453j50226M1359J42251p0062j28076R4316J08753j14692q4396J31286
$$ 72752 63299 -86927 -45568 96683 26621 -101455 -7139 101614 -13078 -97474 33812
165C3812N5420j42772k3982J48072p131j47262L6637J40204o4366j26167Q9457
$$ 33812 89232 -53540 -77522 70550 63419 -83843 -47206 92998 28632 -97535 -8078
176h078J05332j10352p9922J26327N2390j37349k3768J42512n255j40307L3266
$$ -8078 97254 -13098 -93020 33307 85697 -51652 -75420 67092 61837 -78470 -45204
187d5204J30718n8900j15307Q1827R5725j01798p2653J17149M7241j26083k1343
$$ -45204 85514 26614 -88693 -6866 88859 -12939 -85592 31557 78798 -47285 -68628
198f8628J28343m058j24873K9097J16111n3411j02386P5117Q5014r2480o5766
$$ -68628 59715 55657 -69216 -40119 75992 22581 -79805 -4688 80326 -12154 -77920
209g7920J05080M5139j12836k2734J15287r71j12298K4331J05212m6033r5264
$$ -77920 27160 72299 -40537 -63271 52016 51045 -61253 -36922 68290 22257 -73007
220g3007O5533Q2446q1869o6290R3662M7357j00637k6868J03788N411j03853J6459
$$ -73007 -7474 74972 -6897 -73187 20475 67832 -32805 -59673 44115 49526 -54327 -37868
232c7868J00389l7296r2902N5204Q1942o9705o8008Q1393N1043r0308l1422R5788
$$ -37868 62521 25225 -67677 -12473 69469 -236 -68244 13149 64192 -26116 -57538 38250
244C8250J0910r7625Q726R6164k6956r1230M3911Q1947n9035o8621P1606N2764
$$ 38250 49160 -48465 -39739 56425 29469 -61761 -17850 64097 5062 -63559 8047 60811
256F0811q1724l5682Q9460J7767r3952O86R3917j8652q9240L5506Q0985n1464
$$ 60811 -20913 -56595 32865 50632 -43320 -42634 51283 32631 -56609 -21103 59882 8418
268H418o9785O6464N5787p9116l9658Q7909K2642r2594n041R3299j3514q9841
$$ 8418 -61367 5097 60884 -18232 -57890 30019 52661 -39933 -44974 48325 34811 -55030
280e5030L2626Q2042n0694p0909O6244N7558p8674m2179Q7406K4479r1472n134
$$ -55030 -22404 59638 8944 -61965 4279 61837 -16837 -59016 28390 52869 -38603 -43737
292d3737R0700j4378q6102L3060P8622n0218o8181O4733N4532p5130l8419Q1111
$$ -43737 46963 32585 -53517 -20457 58165 7947 -60234 4499 59031 -16099 -54518 26593
304B6593K0895q3482k583Q2824j5970p8840L3257P1463m7708o1335N8944M8927
$$ 26593 47488 -35994 -38577 44247 28277 -50563 -17306 54157 6449 -54886 4058 52985
316E2985o7489l4098P3283J7413p5898m49P5435j5275p2380K9437O6536m2012
$$ 52985 -14504 -48602 24681 42094 -33804 -34253 41182 25907 -46473 -17036 49500 7488
328G488n7409N2520M5295o0501l1590O6212J7385o9904l047P0895j1003o8356
$$ 7488 -49921 2599 47894 -12607 -44197 22015 39400 -30504 -33551 37344 26341 -42015
340d2015K3882O2447l5184n4085M5307M3877n4237l2087O1068J9540o4869p199
$$ -42015 -18133 44314 9130 -44955 352 44229 -10008 -42095 18973 38513 -26356 -33555
352c3555O5675m694o3847J6627N9310k8401n2291L9101M3646m7979l4330N4857
$$ -33555 32120 27426 -36421 -19794 39516 11115 -41176 -2075 41571 -6408 -40738 14119
364A4119K4258n9440j3035O1098R56n9921J1215N6762k3064n2176L4328M5911
$$ 14119 38377 -21063 -34098 27000 27956 -31965 -20750 36012 12948 -39228 -4900 41011
376D1011m4182l7587N1568K7595n6345j6331N9123L811o0019R580N8560k2607
$$ 41011 -3171 -40758 10810 38405 -17940 -34271 24852 28663 -31356 -21776 36784 14177
388A4177n4617L4058M8465m3630m0132N1460K9330n7240j6497O0528K944o1356
$$ 14177 -40440 -6382 42083 -1547 -41679 9781 39111 -18129 -34626 25902 28846 -32510
400c2510J0173N9932k2456n5839L3613M8606m2977l8647N0201K7048n5501j4623
$$ -32510 -22337 37595 15139 -40700 -7087 41519 -1458 -40105 10096 37144 -18357 -32980
412c2980N8827J857n9557J0527N7068k1710n1645L1408M4018l9970l4589M7253
$$ -32980 25847 27704 -31853 -21326 35742 14032 -37613 -6205 37813 -2157 -36746 10507
424A0507K3754n2404j2419N4878J477n4737R022N2123j9271m6954K9030L9559
$$ 10507 34261 -18143 -30562 24316 25793 -28944 -19922 32201 12930 -34024 -4994 34565
436C4565l7416l0954M3988K1879m8640j2338N0928K168n0392Q122M7286j7932
$$ 34565 -2851 -33805 10183 32062 -16578 -28916 22012 24180 -26212 -18090 29196 11264
448A1264m2569K7079L6662l5137k9572M1333K1337m4961j2444M6213L243m5772
$$ 11264 -31305 -4226 32436 -2701 -32273 9060 30397 -14564 -27008 19205 22448 -23324
460b3324O317M3814j5801m0255K4188L5423l0850k9628L5822K2787l9376j4674
$$ -23324 -17007 26807 11006 -29249 -5061 30362 -488 -30116 5706 28493 -10883 -25557
472b5557M1408N706m1898L249M1154j1587l9323J9245L5980k6039l0655L1567
$$ -25557 15851 21557 -20341 -17092 24062 12475 -26848 -7603 28377 2338 -28317 3250
484C250K3742l5881j5835L9251P361m1605J443M2218j0042m0647J7887L7034k5020
$$ 3250 26992 -8889 -24724 14527 21888 -19717 -18274 23944 13902 -26745 -8858 28176 3156
497C156l1715L1678K4727l7516j6471M1770P766m4021Q39M4243r387m2271J8004
$$ 3156 -28559 3119 27846 -9670 -26141 15629 23395 -20626 -19787 24456 15069 -27202 -9198
510i198L7913k6102l1639L3098K4318l8665j6406M2532P871m4135J177M3109j0180
$$ -9198 28715 2613 -29026 4072 28390 -10275 -26681 15851 23722 -20413 -19236 23873 13693
523A3693l9865J8671L5169k6517k9339L3247K2336l8041j4520M0462O321m0800
$$ 13693 -26172 -7501 27668 1151 -28188 5059 27395 -10646 -25166 15296 21617 -19183
535a9183K172L9501j0931l6586J9345L2153k6457k6661L1789K0374l5421j3162
$$ -19183 -17011 22490 11559 -25027 -5682 26471 14 -26647 5142 25516 -9905 -23067
547b3067L7405M966l7616L596L6223j1658l3708J8809L0153k4901k5185K9567
$$ -23067 14338 19304 -18312 -14716 21507 9849 -23859 -5050 25103 202 -24983 4584
559D584J8768l2527j1453L4049L908l4574L626L4031j0767l1966J6850K8414k1625
$$ 4584 23352 -9175 -20628 13421 17329 -17245 -13619 20412 9645 -22321 -5471 22943 1318
572A318k3720K5393J8138k8544j1746L0786N033l1773J211L1517o807l0076J2012
$$ 1318 -22402 2991 21129 -7415 -19161 11625 16658 -15115 -13904 17613 10806 -19270 -7258
585g258K7289j6975k3129K1418J8102k5090j2839K8007P526k9933j942L0396l833
$$ -7258 20031 3056 -20073 1345 19447 -5643 -18482 9525 17051 -12882 -14824 15572 11739
598A1739k9175R525K6714j5057k3493K0460J9482k5288j4620K8760R164l0594
$$ 11739 -17436 -7911 18803 3746 -19747 713 20195 -5093 -19713 9047 18211 -12383
610a2383l328L1015l004l0203R740K8114j6327k4778K1932K0638k6277j5764K9372
$$ -12383 -15711 15304 12300 -17903 -8163 19951 3624 -21154 778 21416 -4861 -20625 8747
623H747R885l1020l120L1118l923k9918J0577K7804j6588k4745K1709K0385k5541
$$ 8747 18632 -12388 -15508 15610 11687 -18231 -7654 20150 3562 -21183 526 20911 -4630
636d630j4788K7881Q492k9016j901K9281m780k8429J1078K6186j6352k2619K0454
$$ -4630 -19418 8463 16955 -12061 -13962 15319 10539 -17890 -6812 19374 3022 -19597 857
649H57J8029k3614j2572K6027O369k7376m4K7458n783k6340J0828K4094j5380
$$ 857 18886 -4728 -17300 8727 15096 -12280 -12324 15134 9351 -16989 -6161 17933 2553
662B553k0522J9351J5725k2455j0351K4576N024k5820J40K5996n178k4696R882
$$ 2553 -17969 1382 17107 -5348 -15699 8877 13901 -11919 -11779 14217 9039 -15657 -5775
675e775K1973j3958j8358J7491J4329k0525r990K2739N447k3630j050K3188l048
$$ -5775 16198 2240 -16118 1373 15702 -4823 -14813 7926 13373 -10257 -11307 11881 8833
688H833k1853P095J9803j1163j7045J4796J3868j7549j0587J9375P223k0433l424
$$ 8833 -13020 -5925 13878 2715 -14330 466 14334 -3215 -13802 5573 12796 -7637 -11061
701a1061K0614q40j9888N140J8565r115j7009J2728J5024j5853j2245J8127Q691
$$ -11061 9553 8713 -11175 -6035 12530 3415 -13594 -866 14158 -1695 -13940 4187 12878
714A2878j9517m644K0290K82k0669M358K0350q841j9033J2700J6780j5799j3691
$$ 12878 -6639 -11283 9007 9289 -11380 -7022 13328 4487 -14546 -1846 14934 -865 -14556
727a4556J8393R744k0514n001K1839L5k2174M606K1584q814k0010J2688J7219
$$ -14556 3837 13581 -6933 -11934 9905 9940 -12234 -7628 13956 5142 -14868 -2180 15039
740A5039j6148j3304J8868Q807k0818m254K2072l35k2315M867K1186r064j8755
$$ 15039 -1109 -14413 4455 13262 -7556 -11810 10262 9927 -12388 -7521 13665 4601 -14154
753a4154J2750J5499j5994j1770J8825P565k0774l124K1430j161k0849N240J9306
$$ -14154 -1404 14095 -1899 -13669 5156 12721 -8053 -11177 10253 9092 -11757 -6517 12789
766A2789r278j6897J3205J3638j6484r929J8758O128k0013k220K0266j961j9399
$$ 12789 3511 -13386 -181 13457 -3027 -12956 5802 11930 -8083 -10303 9963 8002 -11397
779a1397O258J7514j0212j5014J3528J2263j6192r166J7980N573j8628j674J8185
$$ -11397 -5139 12375 2163 -12851 677 12940 -3252 -12418 5562 11135 -7493 -9167 9018
792I018k158j7157N833J5741r263j3830J2065J1382j3910q577J4880N577j5382
$$ 9018 6860 -10297 -4464 11277 2014 -11816 249 11631 -2279 -10856 4024 9601 -5781
805e781k264J5530j241j5128M512J4240p171j3035R375J1357j1282q995J2864
$$ -5781 -8045 7485 6244 -8884 -4372 9868 2697 -10338 -963 10394 -888 -9883 2981
818B981O031j3983k941J4755l1j5224K939J5079n775j4065Q380J2195j0690r845
$$ 2981 9012 -4971 -7912 6843 6812 -8412 -5473 9606 3831 -10234 -1854 10341 -349 -10194
832a0194J2862P128j4811m072J6170Q55j6568K236J6092n239j4885Q323J2944
$$ -10194 2668 9796 -5015 -9087 7083 7938 -8630 -6394 9698 4459 -10426 -2103 10841
845A0841j1331j0384J3875P475j5660m502J6695J372j6915K066J6188n619j4592
$$ 10841 -490 -10874 3001 10476 -5184 -9686 7009 8381 -8534 -6468 9720 4101 -10491
858a0491Q897J2559j1778j0241J4170P516j5781m334J6403Q41j6109K697J5251
$$ -10491 -1594 10965 -813 -11054 3116 10632 -5149 -9483 6920 7761 -8348 -5651 9600
871I600o244j3910R581J1994j2357r481J4200O559j5248l303J5686l01j5508M064
$$ 9600 3356 -10554 -973 11021 -1336 -10817 3383 9942 -5306 -8609 7077 6776 -8732 -4668
885d668J4627p454j3167J0200J1239j2314q759J3871N651j4766k131J4975j306
$$ -4668 9959 2505 -10662 -462 10777 -1537 -10296 3575 9226 -5540 -7671 7304 5998
898E998j4636M399J3841p128j2445R407J0274j1050p565J2085M741j2807j914
$$ 5998 -8638 -4239 9602 2474 -9971 -564 9710 -1340 -8905 3180 7921 -4886 -6800
911f800J3216q77j3038L371J2173n387j0814P083R087q718o996J0193M665j1228
$$ -6800 6416 5539 -7499 -4128 8045 2658 -8156 -1073 8014 -704 -7700 2493 7158 -4070
925d070k428J1772M16j1907J572J1536l673j0595N825R173p785p597R523O002
$$ -4070 -6498 5274 5690 -6217 -4645 6891 3218 -7377 -1552 7621 -164 -7761 1762 7764
939G764j1016m130J1989J956j2248M04J1935k839j1300N361J0365p846q995R895
$$ 7764 -3252 -7382 4607 6563 -5685 -5281 6654 3815 -7485 -2124 8241 395 -8600 1295
953A295P202j1272n155J2099K765j2516j4J2485k924j1943N626J0950p863r608
$$ 1295 8497 -2775 -7930 4169 6934 -5582 -5596 6889 3965 -7978 -2352 8598 735 -8873
967h873R729P738j1136n291J2042K437j2388M19J2370l118j1983N656J0975p865
$$ -8873 856 8594 -2542 -7833 4209 6646 -5742 -5323 7047 3929 -8054 -2398 8577 712
981G12r210R570O933j0838m358J1807J572j2389J255J2342l881j1557O124J0161
$$ 712 -8498 1072 8005 -2833 -7191 4616 6188 -6201 -4946 7396 3515 -8042 -1918 8243
995H243q077q238R829N819j1252l094J2065M42j2242J967J1826m226j0768O385
$$ 8243 166 -8072 1757 7576 -3676 -6770 5295 5737 -6505 -4538 7288 3062 -7706 -1321
1009a321R013q252o826R658M599j0632k431J1147K50j0985J866J0125l786q812
$$ -1321 7692 -560 -7386 2272 6871 -3761 -6192 4955 5205 -5780 -3914 6211 2425 -6387
1023f387N489P356p041n785Q320M107r075k397R241P42r018R50Q542k760p835
$$ -6387 -898 6458 -583 -6368 1952 6059 -3016 -5413 3828 4570 -4448 -3498 5044 2284 -5551
1038e551M537O901o014n880P110M762p943l366Q466J613q645L09Q557k182q297
$$ -5551 -1014 5887 -127 -6007 1103 5865 -2078 -5444 3022 4635 -4010 -3701 4856 2674 -5623
1053e623L943P867n570p006O917N653p857l986Q573K110r149p9R471j980r327
$$ -5623 -1680 6187 617 -6389 528 6181 -1676 -5662 2911 5021 -4128 -4207 5264 3284 -6043
1068f043L829Q689n399p617O792O130q088m250R138K178r793j61J0019j727r798
$$ -6043 -2214 6475 1076 -6541 251 6381 -1707 -5957 3181 5359 -4434 -4595 5424 3697 -6101
1083f101L585R016n422p645P076N891q454m029R543K082j0251PJ0314k144r691
$$ -6101 -2516 6500 1078 -6567 509 6400 -2054 -6083 3460 5542 -4709 -4702 5612 3468 -6223
1098f223M203Q569o165p102Q002N385r526l361J0421J217j0594R23J0239l131
$$ -6223 -2020 6549 384 -6718 1284 6669 -2857 -6218 4203 5420 -5174 -4251 5988 2857
1112B857r407N374Q103p378o470Q859M687r785k783J0169O75j0017J566R310l708
$$ 2857 -6550 -1176 6927 -451 -6921 1938 6625 -3160 -5943 4226 4901 -5116 -3550 5760 2052
1127B052q255N533P040o975n668Q026L999q537k140Q556K39q251J598P817l322
$$ 2052 -6203 -670 6370 -605 -6273 1753 5752 -2785 -4925 3631 3870 -4381 -2783 5034 1712
1142A712p192M827O246n906n055O586L707p068k170P421N07p591J157P480k582
$$ 1712 -5480 -653 5593 -313 -5368 1218 4925 -2143 -4313 3108 3615 -3976 -2819 4661 2079
1157B079p116L776O485m862n498N889M119o724k619P366J143p841K99Q026j785
$$ 2079 -5037 -1261 5224 362 -5136 753 4872 -1852 -4471 2895 4038 -3803 -3504 4522 2737
1172B737p726L209O952m530n891N789M655o961l277P890J773q336k56Q320j248
$$ 2737 -4989 -1780 5172 642 -5249 540 5195 -1766 -5043 2847 4620 -3716 -3972 4348 3100
1187C100p949K851P257m521o234O051M987p211l664Q006K204q428m88Q408j442
$$ 3100 -4849 -1998 5259 738 -5496 555 5542 -1669 -5333 2673 4877 -3551 -4039 4369 2927
1202B927p951L328P209n049o294O565N106p754l557Q466J696q672K78Q565k307
$$ 2927 -5024 -1696 5513 464 -5830 735 5841 -1913 -5470 2996 4692 -3980 -3702 4863 2556
1217B556q205M309P468o042o320P327M831q170l059Q665J066q867J089Q641l100
$$ 2556 -5649 -1340 6128 86 -6234 1093 5924 -2246 -5305 3360 4426 -4441 -3352 5289 2189
1232B189p996M745P042o040n727P019M064p666k148P965K31p936J469P649k960
$$ 2189 -5807 -1062 5980 -60 -5787 1232 5296 -2370 -4518 3447 3678 -4258 -2789 4860 1900
1247A900p034M245N984n257m634O002L159o578j698O987K86p133J047O886k211
$$ 1900 -5134 -889 5095 -162 -4796 1206 4365 -2213 -3911 3076 3362 -3771 -2724 4162 1951
1262A951o317L241N533m267m556N278L425o083k255O612J141o836pO792j241o437
$$ 1951 -4366 -1125 4408 141 -4415 863 4288 -1795 -4050 2562 3703 -3133 -3140 3652 2411 -4026
1278d026K566N795l838n029M948M222n877l291O552K150o873q41O866n54o705
$$ -4026 -1460 4335 497 -4532 416 4638 -1239 -4530 2022 4172 -2701 -3542 3324 2770 -3935
1293c935J994O396l405n905M672N117n581m131O242K925o733j474P022j33p096
$$ -3935 -1941 4455 1050 -4855 -183 4934 -647 -4778 1464 4389 -2344 -3818 3204 3071 -4025
1308d025J735O890l166o412M410N630n519m413O439K868p096j186P514m72p687
$$ -4025 -2290 4600 1434 -4978 -568 5062 -457 -4870 1569 4437 -2659 -3845 3669 3197 -4490
1323d490K117P456l679o709N039N544o206m073P160K449p898p45Q253r93q081
$$ -4490 -2373 5083 1404 -5305 -266 5278 -928 -5001 2159 4608 -3290 -4035 4218 3225 -4856
1338d856K557P448l988o427N305N114o451l575P286J973p691m60P688r84p299
$$ -4856 -2299 5149 1161 -5266 39 5153 -1298 -4873 2413 4386 -3305 -3765 3923 2939 -4360
1353d360K441O513l791n435M938M271n855l060O473J830o748n43O627p89o179
$$ -4360 -1919 4594 803 -4632 306 4577 -1278 -4338 2135 3965 -2783 -3326 3301 2512 -3667
1368c667K071N580l283m873M361M058n217l095N707K033n905q93N938l88n818
$$ -3667 -1596 3984 701 -4172 189 4247 -970 -4065 1642 3675 -2230 -3123 2815 2427 -3391
1383c391J719N499k925n015L908M376m647l571N246K488n650j233N868k6n951
$$ -3391 -1672 3827 902 -4113 -205 4171 -476 -4047 1199 3687 -1963 -3196 2672 2646 -3305
1398c305J228N893k329n574L306M967m159m050M850L002n474j846N973O52o289
$$ -3305 -2077 3816 1487 -4087 -781 4186 27 -4023 827 3829 -1645 -3491 2482 3134 -3155
1413c155N50O245j656n902K718N285l816m398M839L319n709k157O331R55o644
$$ -3155 -2605 3640 1984 -3918 -1200 4085 269 -4129 710 4029 -1680 -3837 2494 3449 -3195
1428c195L28O600j692o196L119N449m472m463N616L396o543k129P085P02p176
$$ -3195 -2867 3733 2041 -4155 -1036 4413 -59 -4522 1094 4490 -2053 -4182 2903 3605 -3571
1443c571Q29O884k378o307L878N490n216m440O235L169o811j761O988K41o857
$$ -3571 -2742 4142 1764 -4543 -665 4825 -391 -4831 1404 4573 -2238 -3999 2989 3230 -3627
1458c627J350O441k882n771M182M887n168l834N800K609o141j223O208k42o038
$$ -3627 -2277 4164 1282 -4489 -307 4580 -588 -4422 1378 3987 -2154 -3377 2831 2589 -3449
1473c449J636N666k831n119L798M392m562l396N061K256n387j013N578k05n625
$$ -3449 -1813 3853 1022 -4097 -299 4093 -469 -3865 1196 3452 -1935 -2948 2630 2425 -3200
1488c200J387N415k388m966L239M261l952l374M592K348n156j232N503J45n625
$$ -3200 -1813 3602 1214 -3752 -513 3748 -204 -3578 1014 3362 -1794 -3026 2477 2622 -3003
1503c003Q39N486j771n084K676M467l574l669M377K773n001j881N446R80n660
$$ -3003 -2164 3322 1551 -3533 -857 3610 36 -3633 744 3517 -1484 -3365 2081 3061 -2599
1518b599J7N581j065n243K135M767l207m160M178L426m945k539N436J527n690
$$ -2599 -2582 2999 1934 -3309 -1174 3593 386 -3774 404 3830 -1115 -3654 1782 3309 -2381
1533b381l68N743r35n586K303N193l546m607M573L817n396k762N970J452o302
$$ -2381 -2749 2994 2059 -3527 -1224 3969 423 -4184 389 4206 -1190 -3952 2018 3470 -2832
1548b832L5O354j545o181K954N749m223m954N231L837n972k463O459R47o696O14
$$ -2832 -2797 3557 2012 -4169 -1215 4534 311 -4643 588 4425 -1547 -4010 2449 3396 -3300 -2686
1564b686O666k079o300L360N591m419m556N251L292n872j873O274M43o399Q94
$$ -2686 3980 1901 -4399 -1039 4552 133 -4423 828 4120 -1752 -3625 2649 3092 -3307 -2413
1579b413O214k093n706L110M933m034l918M806K762n408j579N778M37n869O37
$$ -2413 3801 1708 -3998 -888 4045 11 -3907 899 3661 -1747 -3326 2452 2889 -2980 -2343
1594b343N671j689n196K716M460l638l620M477K694n119j721N496P09n554L22
$$ -2343 3328 1639 -3557 -841 3619 -19 -3639 838 3532 -1587 -3308 2188 2897 -2657 -2335
1609b335N370j404m973K489M429l480l769M283L033m844k209N188J257n308k06
$$ -2335 3035 1631 -3342 -853 3576 96 -3673 610 3643 -1201 -3410 1778 3035 -2273 -2479
1624b479N247r01n054J968M735k894m313L676L709m320k865M760J856n085p54
$$ -2479 2768 1867 -3187 -1219 3516 622 -3691 -15 3694 -626 -3491 1269 3125 -1960 -2714
1639b714N300l71n392J495N252k524m830L451M132m268l200N012K069n606q06
$$ -2714 2586 2215 -3177 -1682 3570 1046 -3784 -333 3799 -469 -3669 1343 3412 -2194 -3000
1654c000N960m43o046J662N800k815n215L921M310m924l186N749J933o311o59
$$ -3000 2960 2517 -3529 -1867 3933 1118 -4097 -176 4134 -790 -3976 1773 3706 -2605 -3264
1669c264O544o41o424J940N919l191n077M304M062n256k928N955J697o318m39
$$ -3264 3280 2639 -3785 -1845 4074 883 -4194 110 4172 -1084 -4012 1943 3640 -2678 -3117
1684c117O306q25n945K081N331l273m534M314L624n120k574N559J499n718l48
$$ -3117 3189 2364 -3581 -1500 3831 558 -3976 338 3962 -1158 -3732 1827 3326 -2392 -2740
1699b740N628q68n299K087M791l160m152M016L391m644k505N025J474n205l14
$$ -2740 2888 2020 -3279 -1192 3599 439 -3713 303 3694 -950 -3455 1570 3044 -2161 -2475
1714b475N155q30m988J907M687k874m187L616L522m191k653M584J668m855o37
$$ -2475 2680 1850 -3138 -1231 3456 582 -3605 11 3533 -658 -3311 1273 2941 -1914 -2551
1729b551N037l93n037J331M831k116m430K826L831l456l081M059K189m528j303
$$ -2551 2486 2093 -2944 -1613 3218 1102 -3328 -502 3329 -127 -3208 851 3040 -1488 -2791
1744b791M869M46n044M07M979j290m668K185M158l086l520L943K768m676j904
$$ -2791 2078 2524 -2520 -2113 2866 1576 -3092 -907 3251 165 -3355 588 3356 -1320 -3224
1759c224N185R34n415J28N368j288n086K490M585l632l894M606L025n301k016
$$ -3224 1961 2895 -2520 -2392 2976 1688 -3398 -908 3677 45 -3849 757 3782 -1519 -3535
1774c535N720Q38n847M73N735j821n340L093M712m139l936M958K946n509j758
$$ -3535 2185 3023 -2824 -2351 3384 1563 -3777 -684 4028 -111 -4047 911 3857 -1652 -3410
1789c410N790M12n776R18N563k175n153L277M489m146l622M769K556n154j372
$$ -3410 2380 2792 -2984 -2066 3497 1322 -3831 -554 3935 -211 -3833 936 3492 -1662 -3034
1804c034N358J35n394J087N189k166m729L044M057l739l185M305K138m732j005
$$ -3034 2324 2459 -2935 -1848 3341 1175 -3554 -510 3547 -192 -3377 928 3066 -1666 -2671
1819b671M971q9m976J065M798j952m368K783L655l472k823M071J904m515j011
$$ -2671 2300 2211 -2765 -1700 3098 1146 -3222 -439 3216 -256 -3079 992 2896 -1619 -2630
1834b630M807R8m819P53M578j564m134K332L564l064k937L712K224m158j521M396
$$ -2630 2177 2275 -2544 -1791 2787 1223 -2911 -579 2985 -79 -3016 696 2920 -1238 -2759 1637
1850A637Q03m444k2M345q35m116J721L767k521l364L230K869l788k220M197J405
$$ 1637 2440 -2004 -2026 2319 1484 -2632 -911 2856 335 -3029 201 3070 -718 -2938 1259 2664
1866B664m439m37M522n83m500J607M332k566l969L419L328m088k472M586J455
$$ 2664 -1775 -2212 2310 1727 -2773 -1166 3166 600 -3369 50 3378 -710 -3182 1404 2859
1881B859m969k87N147r05n101J992M803k987m193L816L346m520k261N056J059
$$ 2859 -2110 -2397 2750 1845 -3256 -1264 3539 552 -3641 175 3521 -999 -3260 1796 2855
1896B855n357J26N415j228n206K243M713l172l923L959K947m590j877N022Q23
$$ 2855 -2502 -2376 3039 1811 -3395 -1152 3561 389 -3534 425 3372 -1218 -3095 1927 2750
1911B750n247K23N191j229m828K164M194k983l452L752K598m361j659M715P03
$$ 2750 -2497 -2274 2917 1688 -3140 -976 3218 235 -3217 535 3133 -1228 -2887 1828 2531
1926B531m789K02M632j137m285K090L719k953l035L630K321m121j548M389P13
$$ 2531 -2258 -2056 2576 1439 -2846 -756 2963 10 -3025 605 2926 -1195 -2743 1646 2359
1941B359m424J95M259j125l906J945L526k654l069L260K487l643j819L844J056
$$ 2359 -2065 -1870 2389 1264 -2642 -697 2829 175 -2894 366 2853 -790 -2609 1235 2291
1956B291l893k65L881n32l814J296L599j926l293K431K873k879k308L278J588
$$ 2291 -1602 -1867 2014 1482 -2332 -1036 2563 637 -2656 -225 2648 -231 -2539 739 2327
1971B327l609q04L837M7l975O92L970j435l737K175L242k853k589L476J848m001
$$ 2327 -1282 -2086 1751 1798 -2177 -1485 2485 1050 -2687 -512 2730 -123 -2712 764 2612 -1389
1987a389j050M399J78m536P33M386j599m007K468L447l324k721M040J888m555
$$ -1389 -2439 1960 2138 -2398 -1665 2721 1122 -2885 -417 3030 -294 -3015 1025 2913 -1642
2002a642r63M769L2m749R71M468j991l979K938L298l723k540M272J729m619q16
$$ -1642 -2605 2164 2196 -2553 -1582 2886 895 -3084 -146 3152 -571 -3111 1161 2890 -1729 -2545
2018b545M723k13m530J223M161k145l697K981L135l650k389M052J535m223o02
$$ -2545 2178 1965 -2565 -1342 2819 674 -3023 -42 3093 -557 -2946 1106 2641 -1582 -2184
2033b184M216l50m094J314L833k200l380K890K781l370k072L683J245l892l21
$$ -2184 2032 1682 -2412 -1098 2735 535 -2845 45 2826 -544 -2616 1067 2312 -1580 -1901
2048a901L935o10l814J416L560k077l168K622K613l061j889L330J131l511m01
$$ -1901 2034 1424 -2390 -974 2586 509 -2659 -37 2576 -485 -2374 956 2087 -1424 -1825
2063a825L612k72l585Q87L407j443l030J908K559k316k063K742J517l101r41L321
$$ -1825 1787 1515 -2070 -1183 2224 781 -2249 -341 2218 -98 -2161 581 2098 -1003 -1944 1377
2079A377L75l350J35L321p43l135J393K829k056k424K615K003l105j500L455Q54
$$ 1377 1752 -1598 -1463 1858 1115 -2020 -627 2202 146 -2278 337 2340 -765 -2265 1190 2044
2095B044l629j03L618p11l473J527L218k299k875L003K319l491j610L771Q23l926
$$ 2044 -1585 -1688 1930 1219 -2254 -727 2491 192 -2683 320 2639 -852 -2462 1309 2132 -1794
2111a794R9L934j053l769J955L434k702k915L248K277l675j470L964N20m073M36
$$ -1794 -1695 2239 1186 -2583 -628 2806 104 -2811 437 2714 -961 -2431 1533 2053 -2020 -1584
2127a584L994j277l794K013L423k667k824L186K040l536j208L786L42l883M72
$$ -1584 2410 1133 -2661 -648 2775 108 -2716 470 2510 -1026 -2234 1552 1894 -1989 -1517
2142a517L840j281l526J932L032k491k387K973J642l364q65L629N3l623O49L454
$$ -1517 2323 1042 -2484 -552 2480 -11 -2398 575 2217 -1147 -2012 1617 1670 -1953 -1304 2150
2158B150j284l107J895K613k464j981K914J325l189p20L316J42l296M52L080j038
$$ 2150 866 -2241 -346 2267 -197 -2178 736 2061 -1128 -1848 1468 1610 -1686 -1234 1846 808
2174H08k729J563K320k020j944K403J542k679j081K775O12k769j09K702m20k610
$$ 808 -1921 -358 1962 -58 -2002 401 1943 -736 -1817 958 1570 -1199 -1308 1394 974 -1636
2190a636R79K465j495k229J894J962k202j603K473J118k698n14K840j25k892P20
$$ -1636 -657 1808 313 -1916 -22 1940 -262 -1865 608 1726 -972 -1486 1354 1229 -1663 -943
2206i43K879j276k741J834K363k302j827K675J228l012n49L234j48l338Q63L192
$$ -943 1936 660 -2081 -247 2116 -186 -2013 662 1890 -1122 -1671 1563 1415 -1923 -1060 2132
2222B132j499k853K041K410k586j819L050J131l386m20L539k71l480R22L266j586
$$ 2132 633 -2220 -179 2231 -355 -2174 876 2007 -1379 -1799 1740 1469 -2011 -1089 2177 591
2238E91k856K234K293k743j691L141J071l385m25L461k84l299R85K973j654k520
$$ 591 -2265 -31 2262 -481 -2172 969 2040 -1345 -1770 1691 1407 -1892 -907 2066 412 -2108
2254b108K229K036k743j465L068Q05l176j19L063n47k868J230K575j884k147K385
$$ -2108 121 2157 -586 -2051 1017 1822 -1354 -1473 1590 1043 -1825 -595 1980 96 -2051 334
2270C34J635k669j118K818N41k840R6K735p34k528J309K229j702j938K037J558
$$ 334 1969 -700 -1818 1000 1541 -1299 -1203 1532 798 -1730 -421 1808 106 -1832 205 1763
2286A763k235j081K317N67k323q2K296l62k260P87K155j137j928J368J646j596
$$ 1763 -472 -1553 764 1331 -992 -1074 1222 860 -1400 -613 1542 405 -1523 -155 1491 -105
2302a05j320J828R34k074m94K236Q9k312K75K297o54k185J093J925j542j554J919
$$ -105 -1425 403 1337 -737 -1231 1005 1094 -1218 -943 1354 700 -1485 -392 1533 -9 -1563 356
2319C56J177k251p72K495L26k600K04K530p29k329J264K068j785j739K255J316
$$ 356 1533 -718 -1490 1005 1331 -1269 -1065 1465 736 -1593 -329 1739 -46 -1785 470 1786
2335A786k600q07K743K78k761K92K687r25k524J553K227k079j831K424J397k673
$$ 1786 -814 -1621 1122 1400 -1361 -1069 1618 693 -1831 -278 1949 -130 -1961 463 1860 -813
2351h13q73K825K28k814M46K685j058k482J582K203k041j792K394J219k565n75
$$ -813 -1686 1139 1367 -1447 -1001 1684 626 -1856 -274 1929 -112 -1904 490 1709 -856 -1431
2367a431K629n9k639P09K531j289k277J772J861k091j357K308P94k474j78K540
$$ -1431 1198 1139 -1500 -791 1740 451 -1826 -54 1807 -284 -1641 667 1461 -1013 -1191 1349
2383A349m25k462R35K250j331j948J632J549j908j059K097N37k162j23K176k31
$$ 1349 924 -1538 -603 1647 316 -1632 0 1549 -359 -1418 679 1216 -946 -1069 1107 876
2399H76k137N94J966r03j697J177J386j406j079J611Q10j805n13J910K10j875
$$ 876 -1261 -667 1299 396 -1301 -124 1262 -144 -1223 388 1198 -607 -1120 790 1000 -875
2415h75O5J815l98j714P67J583j163j376J466J136j664r03J849N73j967j32J969
$$ -875 -810 1005 607 -1107 -340 1243 80 -1296 170 1306 -358 -1261 588 1161 -806 -938 1031
2432A031l54j889P84J795j184j669J568J384j856r77K030N05k124k7K194m67k201
$$ 1031 677 -1212 -428 1367 183 -1486 82 1466 -390 -1367 663 1168 -956 -983 1211 744 -1457
2449a457R83K053j392j786J703J448j962j028K222N08k378M6K411n46k335R64
$$ -1457 -474 1579 187 -1599 104 1552 -410 -1438 784 1292 -1086 -1040 1371 825 -1510 -546
2465e46K149j361j839J747J374k055q60K246L75k368Q3K409n99k236J068J914
$$ -546 1603 242 -1597 150 1524 -531 -1391 855 1230 -1138 -1055 1354 755 -1481 -413 1501
2481A501j485j500J817J072k107o00K300J16k337L79K180p98j918J195J609j583
$$ 1501 16 -1484 333 1405 -702 -1302 998 1114 -1223 -844 1336 538 -1380 -185 1424 -159
2497a59j216J879Q07k043l99K048M6k000L39J843p21j608J065J326j308j096J480
$$ -159 -1375 504 1311 -732 -1131 917 963 -1037 -698 1145 424 -1184 -119 1207 -101 -1197 283
2514B83Q73j606o01J643K72j587K9J507l11j471O01J423q73j284J055J119j201
$$ 283 1156 -450 -1051 592 864 -723 -694 813 502 -969 -368 1055 182 -1102 -47 1072 -129
2531a29q99J333O43j479l06J577l9j601L42J579n89j526Q82J358j172j059J414
$$ -129 -1028 305 948 -531 -837 740 701 -900 -558 1021 432 -1094 -212 1146 -26 -1085 329
2548C29P14j617l81J760P1j884L15J822o68j667J004J428j327j185J659Q60j914
$$ 329 1043 -574 -955 805 876 -1008 -693 1129 461 -1206 -202 1226 -101 -1286 373 1233 -681
2565f81n01K060J25k071K57J992o48j842J103J593j491j276J778R42j975n89K094
$$ -681 -1182 878 1003 -1068 -811 1181 533 -1309 -206 1387 -104 -1380 398 1340 -635 -1224 870
2582H70J44k082L65J939q26j746J258J488j610j188J890P68k020k84K002j91j920
$$ 870 1014 -1068 -703 1236 410 -1336 -78 1410 -200 -1388 502 1270 -750 -1034 968 777 -1143
2599a143O48J785j096j575J468J251j688q93J791M95j834p1J824l82j709P66J534
$$ -1143 -495 1290 194 -1381 87 1338 -350 -1243 548 1043 -791 -862 962 580 -1129 -363 1171
2616A171j023j320J205J089j360p75J470M13j485o8J473j89j472M28J411o51j263
$$ 1171 148 -1172 33 1122 -238 -1013 457 870 -615 -683 790 601 -871 -443 968 317 -946
2633i46Q32J031r58q30J104O19j267l96J389J35j401Q4J354k86j298N51J161q39
$$ -946 -114 917 -41 -871 233 852 -415 -811 578 713 -688 -604 750 464 -834 -283 878 39
2651C9r76J082P62j253n54J399L20j466l6J461k94j370O13J262r09j141J187R89
$$ 39 -937 145 907 -346 -900 499 819 -647 -683 778 484 -886 -273 989 80 -1061 126 1115
2669A115j433p21J566M11j610r6J649k83j632O73J541j016j381J260J157j468
$$ 1115 -318 -1039 527 938 -672 -768 881 598 -1034 -361 1180 164 -1217 43 1200 -268
2685b68q69J629N03j759n4J793l83j726P46J602j073j386J353J070j592o32J722
$$ -268 -1137 492 995 -764 -818 975 592 -1134 -388 1214 141 -1245 108 1178 -414 -1046 676
2702F76J99j775K12J785o09j682R80J439j254j107J468P27j616l54J738m4j762
$$ 676 875 -900 -688 1097 488 -1194 -214 1225 -29 -1136 332 1059 -557 -911 827 783 -979
2719i79M28J614p10j417R35J181j190q71J380N39j493k27J501k8j469K61J384
$$ -979 -551 1063 353 -1064 -129 1052 -138 -1009 371 910 -583 -810 691 663 -806 -545 839
2736H39n22j194P45R84r07q08J068O42j191m63J280K32j246k8J193j86j139M39
$$ 839 317 -877 -132 852 -55 -863 205 847 -344 -807 473 705 -541 -569 624 438 -701 -262
2754b62J068o75r84Q87Q21r95o59J091M46j169j87J211j07j216L79J164n94j116
$$ -262 806 131 -853 34 855 -140 -799 292 738 -431 -618 593 486 -730 -351 813 219 -897
2772h97P94J000r97p79J160N07j274k44J359rj447K95J453n67j328P87J179j007
$$ -897 -103 897 -100 -879 281 788 -486 -730 629 620 -827 -532 921 354 -974 -187 992 -15
2790a5r69J237P14j453m02J587R3j616J91J579m99j457Q07J269j142r75J380O78
$$ -15 -984 253 967 -486 -888 699 792 -824 -633 946 447 -1010 -203 1066 -76 -1051 329 1007
2808A007j551l84J655L3j653L40J538p13j318J016J079j281q27J504N23j621j60
$$ 1007 -544 -928 727 760 -893 -553 985 272 -1046 -30 1049 -232 -1059 445 968 -653 -813
2825h13J587j82j475N00J334q14j144J097R20j291o49J372L79j380j04J358k06
$$ -813 774 592 -883 -383 951 137 -1007 90 1010 -281 -930 442 821 -559 -663 695 489
2842D89j266M91J147p30r97Q70Q50r81o96J078M54j113j99J092j3j101K22J098
$$ 489 -777 -286 861 131 -866 4 854 -127 -823 255 709 -404 -603 489 476 -625 -403 695
2860F95m35j014N74R05o87p43P97N61r04l65J029J33j069M7J079k14j035L92R41
$$ 695 260 -754 -180 725 38 -705 92 653 -251 -616 413 546 -523 -476 603 389 -646 -254 687
2879F87n94p96Q09O01r49m37J057K97j162r8J193j30j158L67J061n83r90Q10Q87
$$ 687 93 -703 106 707 -242 -679 378 675 -487 -585 608 478 -680 -313 748 165 -825 -15 872
2898H72j053p11J206M91j279k69J325Rj341L17J292o29j188R01J027j090q43J278
$$ 872 -181 -892 314 805 -474 -743 582 591 -750 -433 859 230 -958 -57 970 -120 -963 315
2916C15N72j394k24J433j33j394M53J330p64j198J025R78j232o66J336L29j383
$$ 315 887 -507 -731 702 569 -825 -372 958 194 -1004 21 999 -233 -899 437 766 -617
2933f17kJ396l33j355O32J220q79r95J037P44j168m54J249J50j294J56J263l97
$$ -617 -619 777 444 -911 -279 941 62 -933 104 848 -320 -774 475 625 -669 -513 750 353
2951C53j150N72J012p26q45Q95O27j018l64J061J85j095k5J108j59j040L42Q99
$$ 353 -797 -225 787 61 -784 111 738 -280 -644 417 602 -493 -518 590 431 -609 -267 632
2969F32m87p73O23O43p52n29Q84L58r38j83R11L6q75J12Q45l27p82N30O88o72
$$ 632 145 -628 -5 638 -114 -643 241 599 -339 -522 389 425 -450 -338 507 180 -602 -72 616 -56
2989e6n79P54M80q36l23R08J06r08R1Q99k75q83M45Q79o25p83P71O28q67m59R63
$$ -56 -635 119 599 -237 -560 348 454 -454 -363 536 261 -622 -177 702 77 -706 65 693 -174 -633 330
3010C30K65j056n4J135j94j133M06J054o03r38P83P78r91n27J135K64j235%J242
$$ 330 595 -461 -515 620 426 -707 -301 753 150 -788 -5 773 -218 -745 390 654 -581 -581 661
3029F61k22j213M80J101p43q89R59O35j100l89J211J48j271J35J221m04j061O27
$$ 661 439 -774 -294 807 64 -825 134 769 -331 -720 491 639 -632 -497 724 320 -741 -114
3047a14Q77q31o79J001M70j142j99J145l6j080K35R89m39q78O59P16q30n36R16
$$ -114 763 -68 -747 254 724 -418 -617 528 492 -588 -353 636 197 -681 -22 694 -136 -672 244
3066B44L68r52k14R61K0r37J93Q55l80p40N02O75o16n77P04M50p41k71P26J23
$$ 244 612 -340 -554 407 427 -510 -317 538 158 -582 -80 595 -21 -598 106 556 -185 -456 270 393
3086C93p27L6P40j99p30L56O44m34n57M99M40n61l23O41J58p06%P03p8p21J82
$$ 393 -334 -298 442 243 -487 -131 513 79 -478 21 461 -100 -423 218 376 -330 -330 373 295 -426 -244
3107b44P01l01o51M47N33n53m19O41L31p58k30Q46Q2q55P3Q48k38p75L74P50n96
$$ -244 457 156 -495 -48 485 -68 -487 154 485 -273 -503 343 425 -430 -357 491 253 -522 -148 602 6
3128Fo35P71M96q86l32R34J78r74L5R82l12q95N40P68p12o44Q47M87r63k56R99
$$ 6 -629 142 638 -248 -580 354 532 -442 -407 575 263 -632 -92 676 -36 -680 167 654 -309 -565 434
3149D34j8r49K59Q57m45p92O32O81q05m78Q80K59q85m5Q72j58q44L71P85n59o49
$$ 434 416 -533 -274 583 138 -654 -22 659 -146 -624 256 515 -370 -415 457 299 -545 -174 611 52 -597
3170e97O49M98o88l50P55J64p86L8P71j98p22K97O78l89o23M97M73n60l31N95
$$ -597 52 550 -138 -488 267 431 -355 -317 454 256 -466 -169 509 120 -503 -6 467 -93 -424 171
3190A71J87o20p5O39l2o39J60N66k38m69K92L92l66l25M65K14n08j27N39M1n02
$$ 171 358 -262 -337 302 270 -369 -209 357 119 -350 -58 334 -32 -357 108 322 -186 -313 226 267 -235
3211b35J7N04j34m53K46M02l38l61M01L33m71k88N41J89n63p2N65m3n82J53N99
$$ -235 -218 286 152 -301 -55 347 9 -352 49 382 -89 -377 164 353 -210 -282 283 240 -342 -189 410
3232D10k91n88M21N26n20m21N71L13o65j56P53n1p58K13P32l33o76M72N66n93
$$ 410 119 -469 -48 478 -42 -463 108 421 -244 -400 353 302 -456 -243 489 156 -520 -48 518 -75
3252g5m18P13K33p66m2P76j08p91K80P20m35n92N79L99o39k42O94R5p48Q2P18
$$ -75 -493 220 453 -313 -355 421 313 -478 -198 522 87 -505 74 473 -166 -408 286 381 -367 -285 433
3273D33k41o37L56N11m42m14N59K69o31j30O67j4o36J00N89j73n49L14M45m07
$$ 433 192 -445 -89 422 -20 -434 125 394 -237 -367 300 286 -350 -250 339 166 -383 -69 376 -31
3293c1l33M67K56n11j71N20J06n21J6M70j22l92J78L52k56l12L13K66l52j95L43
$$ -31 -364 103 359 -152 -323 197 303 -218 -202 268 146 -246 -68 284 28 -284 29 295 -57 -252 91
3314I1J13l22o3L36k5l37R9L27j62k88J78K75j96k57K46J98k92j21L12Q2l60l4
$$ 91 204 -118 -181 155 130 -207 -108 219 57 -231 -53 222 26 -231 15 213 -79 -200 112 194 -166 -200
3336b00M29k9m42J09L96j62l67K43L32l38k83M47K05n19j13N35K2n46Q9N36k32
$$ -200 229 200 -242 -133 263 101 -266 -23 309 -29 -312 135 340 -179 -292 243 265 -281 -192 344 112
3357A12m99L95L91n03k98N59K01o05p6O21q2n66K39M80l56l96M43L17n15k10N65
$$ 112 -387 8 399 -104 -402 157 358 -247 -323 298 216 -350 -111 369 13 -383 60 377 -138 -348 217
3378B17O8n45P6M85j78m51L04L93m18k91M73J85m71q6M54Lm75J23M52k53l89L10
$$ 217 285 -260 -184 301 123 -328 -24 369 -49 -340 133 318 -153 -239 215 218 -257 -134 318 65 -324 -14
3400a4L39l53k95L81K11l97j19M18pl81O8L72j16l61J65L34k19k48K42J62k33
$$ -14 325 -28 -323 58 269 -128 -247 171 164 -217 -149 223 107 -254 -89 245 26 -222 20 182 -51
3421e1j14K68P7l10kL03m7k61N5K34p4k21J32J77j82j47K17J12k20j30K53J25
$$ -51 -165 103 180 -130 -132 171 124 -137 -82 152 78 -143 -11 166 -16 -163 54 166 -54 -184 69 194
3443A94l08l7K67j4k76O2K99j26l25K31K89k85k52L37J98l73j22M26Lm52J30M48
$$ 194 -114 -151 116 102 -174 -112 187 61 -264 -33 256 -29 -281 56 254 -119 -241 185 188 -264 -134 314
3465C14k19m22K89L87l62l06M51J62m86k8M78n9n00J69M56k47m11L54K75m03j53
$$ 314 95 -327 -38 349 -13 -319 132 294 -192 -220 258 199 -301 -132 324 77 -334 20 295 -108 -261
3486b61M15O7m52L3M64j54m11K38L19k77k39L38J35l60p4M22m0l93J00L69j63
$$ -261 154 221 -231 -198 266 112 -299 -61 258 -19 -258 80 215 -145 -219 203 163 -230 -130 239 76
3507G6l05K02K80k82j98L41J07l42o4L44J1l35K8L19j04k53J52J92j83j56K15
$$ 76 -229 -27 253 -29 -227 114 221 -121 -185 159 170 -165 -137 182 78 -175 -23 169 -14 -170 45
3528D5J22k47r0K49K4k04jJ84k0j73P4J70j33j22J09J37j08j27J08J14j39o0J61
$$ 45 167 -80 -170 79 103 -101 -102 82 62 -111 -37 133 0 -122 -13 124 16 -111 -3 111 -28 -88 73
3551G3K2j57k5K05kk41L9K51r5k10J13K05j85j65K37J39l29n9L46k3l25M3L42
$$ 73 95 -62 -87 118 116 -125 -86 165 70 -140 -27 178 -7 -172 65 204 -125 -184 162 139 -186 -143 199
3574A99j36l26K50K59l32j73L72J25m12m6M13k5m20J76L34k46k68L06K07l44j63
$$ 199 63 -263 -13 246 -86 -259 113 238 -174 -220 193 168 -252 -76 258 12 -256 50 257 -87 -250
3595b50L91P4l97N2L43j19l06J91K64k76j97L14J44l45n7L22k3l02Q6L05j95k59
$$ -250 141 215 -182 -130 213 94 -212 -21 243 -33 -230 84 228 -117 -174 148 125 -177 -91 214 19 -240
3617b40K53K02k83j52K84J26l15m0L17n1k74J04K57j46k36J75K08j89j63K09R2
$$ -240 13 215 -68 -220 64 190 -125 -165 152 101 -173 -69 188 42 -194 -19 189 0 -163 46 138
3638A38j92m1J85K2k28M3K20r5j61P7J38p1j19O6J05j18p1J31N8j33o3J46N4j57
$$ 138 -54 -95 90 112 -116 -73 147 52 -109 -32 106 35 -84 -18 87 -31 -102 29 87 -46 -109 37 91 -66
3662f6m5J79k2j48N4J46p5j72J37J87k02j39K11J07k30m6K41Nk88J03K74j61k52
$$ -66 -111 68 46 -102 -48 98 23 -149 -12 175 -27 -166 45 152 -78 -124 117 122 -166 -63 211 50 -202
3685b02K23J98k39j76K81J08l37LL30r9l05J55K80j93k71K58J93l06q1K93J1k82
$$ -202 21 219 -20 -196 85 193 -144 -141 189 90 -215 -60 220 27 -244 14 207 -99 -180 113 124 -158
3707a58M9K87j15k66J73K14j98j33K16O6k31k8K80n6k64J27K23j55j78J70J38
$$ -158 -109 178 63 -203 -30 184 -14 -147 69 135 -96 -124 156 100 -164 -37 186 31 -147 23 161
3728A61k12r0K54J2k59M8K27p8k03Q7J93j45j30J63P9j89k2J69K3j82LJ77n2j35
$$ 161 -51 -141 113 125 -134 -86 141 63 -140 -53 140 -5 -135 28 107 -82 -104 65 88 -94 -91 86 34 -101
3752a01P7R4p2o3Q8N1r3l8J02J2o7j8M5L0n2j4N8j2m5K1M6k0p4J0J11m1j01N1
$$ -101 -24 70 -2 -65 23 74 -19 -57 45 57 -10 -28 17 47 -5 -19 39 27 -18 3 49 29 -45 -35 76 35 -66 -15
3780a5O2o5n4R4M8j43k2J74l5j60O6J35p7j34J33J07j77p0K32Jk11K9K07n0k13
$$ -15 47 -18 -72 22 70 -73 -95 79 44 -116 -50 85 8 -126 7 114 -63 -133 99 100 -111 -82 125 75 -138
3805a38J20J83j86j12K11N8k12n2K52j9k25O1J92j12j47J40J00j66p4J90M4k14
$$ -138 -18 165 -21 -133 78 136 -76 -128 124 105 -120 -59 133 21 -126 14 114 -52 -126 64 108 -106
3827a06L6J74p2j51R6J35j46j03J85O7k11qJ93j7j73N6J62r7j39J44J02j54o8
$$ -106 -70 104 32 -119 -23 112 -34 -137 48 115 -96 -104 89 72 -101 -45 117 20 -119 25 127 -27 -95
3850i5J68L1j57j6J60m4j30Q0R0j00o3R6O2j14m7J11%r7L7M8k4l5K9N1n9l5M5
$$ -95 73 104 -53 -69 91 47 -83 -3 87 -13 -76 20 82 -32 -79 32 32 -65 -28 20 -4 -39 -10 41 -18 -53 -8
3877hK0Kk4j3M4j5k5L0J0k4nJ5L6m2m5P6J3o4J6M1oq0N0Q3j00q1J33M0j27j9J27
$$ -8 12 14 -10 -23 21 6 -19 11 21 -3 -8 7 43 1 -44 32 45 -19 -3 38 32 -48 2 85 -15 -96 37 77 -50 -69 58
3908E8pj47M8J35j05j08J41Q2j30q1J53N1j78K3J55p5j28J02J17j03j10J37Q4
$$ 58 51 -96 -48 87 -18 -126 15 97 -33 -114 39 90 -88 -65 90 15 -113 -11 106 3 -107 30 114
3931A14j57k4J43k2j26N2J24q7j26J27R3j55k8J35kj37J4J52o2j61J22J21j48
$$ 114 -43 -67 76 54 -72 -20 104 17 -109 18 111 -44 -72 63 61 -76 -62 90 28 -133 -11 110 -38
3954c8o8J27N1j36k2J60m7j39Q6J34j15r6J02Q5j08m6J29rj11M8R0o1o2M3R6q9
$$ -38 -106 21 72 -64 -86 74 27 -112 -26 108 -7 -103 -1 84 -24 -70 59 50 -61 -13 77 16 -46 -3 93 4
3980Dn6Q2j0l5J4J5Mm1NM3k1k6J4j2K2j9j3K5nrQJ6nk8RN1k9n3M5L8m6mM3J3p9
$$ 4 -52 30 20 -15 -1 14 18 -23 -18 25 4 -22 -8 -20 2 -17 -30 -5 -10 -19 -11 5 0 -28 -19 32 3 -50 -5 33 -13 -17 26 39 -40
4015d0K4J07n3j10P5Q0p7p1P6P0j26j7J44k8j28L6J24m6j32O6J14j04p6J20K1
$$ -40 -16 91 38 -72 3 83 6 -65 11 81 -45 -62 82 54 -74 -38 86 40 -92 -26 88 -16 -92 28 49
4040D9j18JJ29Mj52M2J37q8q8J14M4j06m2J38mj44M8J34o8j06P8Q5r1o9J31K4
$$ 49 -69 -68 61 65 -87 -45 92 4 -84 30 74 -32 -74 64 60 -84 -36 98 30 -76 2 87 -4 -73 58 82
4066H2j52J2J47l5j19K5J25o4j04R6O2j27k0J26pj03mJ05k7r2O3N1n6j9L9M2o0
$$ 82 -70 -58 89 54 -65 -40 85 21 -83 13 75 -52 -72 54 47 -56 -60 45 18 -74 -11 40 -16 -35 4 46 -14
4093a4k3O6jm5J1RoRj1K4mj5J1RKk4k1L8J7n1J6K5j6k0J2K5m0l9Q7%q0MO4mo5
$$ -14 -37 29 28 -17 -6 3 -3 6 -5 19 15 0 11 20 22 -2 -23 15 32 -19 -3 22 6 -14 -2 23 -17 -56 31 31 -49 -45 19 15 -50
4128e0K7Q9q9n4J16K2r3k3R0K5j01NJ14o3p4Q2O2r5n3J01M8j22j0J13l3r5N0P0
$$ -50 -23 66 -23 -77 39 61 -32 -55 35 60 -41 -36 78 15 -59 23 85 -10 -63 38 86 -36 -46 67 34 -61 -11 59
4156E9o1o9P4P6j21l5J34l1r1K8R8n7j07R8P9j13m4J26kq5KJ13n5j02Q6J00j29
$$ 59 -2 -71 3 79 -42 -77 57 26 -65 -37 61 4 -103 -5 74 -39 -83 43 41 -44 -42 71 16 -86 0 100 -29
4183b9m5J20J9r8j2J17k7j01O3P4q3n4P8L2o9l9Q3j1p9N3L5k7m0L3L3l6l1M4O
$$ -29 -74 46 65 -33 -45 72 45 -56 7 81 -2 -56 22 54 -15 -54 29 18 -61 -8 27 0 -40 -7 26 -10 -41 3 9
4212Im1K7lJ0j7KL5j2k4J0J2Jlk2M0j1l1L3Qk4j7L8M1p9l8R9Mr0RP0j3q0L0J03
$$ 9 -32 -5 -8 2 -15 -13 22 10 -14 -4 8 9 6 -16 24 13 -18 15 23 -1 -18 20 61 -18 -56 43 47 -43 -34 36 23 -57 -27 76
4246G6q0q5R7M8q9l5Q7K1r6j0J20l4j10P6Q8p2p7Q1Q3j22k2J25k5j11M5J03n0
$$ 76 -4 -89 8 56 -33 -68 19 40 -56 -66 54 20 -90 -14 74 2 -75 6 89 -33 -55 70 45 -66 -21 82 32
4273C2j28R9J02j26n7J42Mj32J2J35k9j66Q7J31j29q6J29O9j34n3J61rj59N3J44
$$ 32 -96 3 105 -21 -78 64 68 -64 -52 83 54 -112 -25 106 -23 -109 20 89 -45 -98 63 54 -105 -52 92
4298I2q6j18J00J03j11p6J32M6j49J5J39l6j16M3J17p5j02R5N9j08lQ1Mq5nR0
$$ 92 6 -112 -12 91 -20 -96 36 82 -67 -52 87 51 -65 -22 95 20 -82 13 72 -36 -39 42 46 -39 -44 46
4324D6j2r3K8O2l7m2L5L8m3n0Q4K1p7j1O4J5p0kQ2j7r2M0Q9n4o6N2Q7p0p8J02
$$ 46 34 -59 -31 31 -6 -48 -13 25 -18 -68 16 37 -40 -51 13 28 -42 -44 38 21 -71 -31 58 4 -62 -10 77 7 -71 31
4354C1M6j04j1R7Kj10JJ37n2j21Q0R1q1r2P7R0j25o7J62Jj48L5J31k6j55P0J44
$$ 31 77 -27 -38 59 61 -49 -48 89 37 -84 -4 87 6 -86 -9 81 -44 -111 51 52 -96 -61 70 44 -111 -41 103
4381A03j19j05J67M8j63l1J86Nj98N7J87j11j40J34J09j51r0J83O6k29PK19n7
$$ 103 -16 -121 46 94 -69 -100 86 91 -107 -50 137 26 -114 20 129 -22 -112 71 137 -92 -85 134 77
4404G7j91Q5J65j20j55J66J11k00o8K04L3k06QJ93n2j91J15J53j44j06J51P6j48
$$ 77 -114 -29 136 16 -139 27 138 -62 -130 74 107 -99 -91 102 50 -141 -26 127 -17 -123 28 104 -44
4427d4n7J67J3j71L8J47n6j23Q2J17j00j14J30Q0j54k5J24J7j21j2J57m4j53P7
$$ -44 -101 66 79 -92 -54 93 37 -86 -4 113 13 -101 29 109 -45 -70 54 71 -50 -62 95 51 -102 -25
4451b5J33q8j24Q7J12j09j07J50O1j74j4J50K0j74J0J83m5j70R4J34j07j14J31
$$ -25 108 20 -104 -17 95 -14 -121 29 90 -84 -98 52 72 -102 -92 91 46 -124 -30 104 -3 -117 14
4474A4J06j61p4J95L7k05J1J83m1j74O3J76j16j52J69R7j85o8J85O1k19j1K17
$$ 14 120 -41 -115 80 117 -88 -77 106 65 -109 -46 130 14 -138 31 128 -57 -125 60 121 -98 -109 108
4497A08n1k04J08J81j50j68J84J53k31q8K52Ok35M0K43r4k27J49K05j96j68K37
$$ 108 57 -147 -39 142 -8 -176 8 161 -70 -158 94 100 -135 -95 148 54 -173 -24 181 -15 -183 54
4519E4J01k27o3K48%k55P0K47j34j93J46J66j82j38K05Q5k15k8K15l2k08P3J90
$$ 54 155 -72 -135 113 113 -142 -72 175 41 -152 -6 160 -22 -160 45 130 -85 -113 102 70 -138 -65 125
4542A25r5j93J48J45j83p7J65N8j65l3K01j2k12O9J76r3j48J12J31j31j12J73
$$ 125 30 -163 -15 130 -53 -130 35 93 -72 -105 96 84 -128 -59 117 24 -124 -12 119 -12 -124 49
4564D9P8j87l9K00lj93QK00m0k05J01J56j20j35J44J11j60j03K00M7k00j3J90
$$ 49 127 -60 -99 101 98 -95 -87 113 73 -132 -31 125 5 -130 14 125 -35 -138 62 109 -91 -104 86
4587H6j8j95N1J99j02j86J58J52j72j11J88Q1j99n1K36j3k43Q0K28j04k21J45
$$ 86 68 -127 -76 123 21 -165 -7 145 -27 -138 50 131 -68 -119 117 104 -139 -59 169 65 -156 -11
4609a1J93j89j56K41Q6k60l2K62k8k70P6K76j56k38K18J71k35j37K69Q1l00j7
$$ -11 182 -7 -163 78 164 -96 -128 134 106 -164 -88 188 32 -206 12 183 -52 -189 80 161 -139 -156
4631a56L12o2k88J23K55j60k23K16J75k48j17K77N4k77J2K65n6k57J00K44j69
$$ -156 156 94 -194 -71 184 24 -199 17 192 -56 -173 104 158 -119 -107 158 102 -155 -55 189 20
4652B0j73K01J25k19j04K40N4k67J9K35n9k17R5K03j36j80J71J47k15j02K25O4
$$ 20 -153 48 173 -46 -150 90 144 -123 -104 131 72 -145 -50 153 17 -163 8 155 -60 -162 63 127
4674A27k33k3K46k9k42R4K13j24j90J61J61j64j44J96J12k34m3K39lk27L5K25
$$ 127 -106 -129 117 88 -154 -60 153 29 -161 0 161 -3 -147 49 161 -73 -116 123 120 -107 -72 153
4696A53p0k30J40J76j66j48J75J20k11q8K40L5k56K2K42o3k39J12K21j56j90K16
$$ 153 83 -147 -7 169 3 -145 30 150 -61 -149 91 126 -130 -108 134 71 -168 -56 165 9 -181 35
4718C5J36k60p8K73M0k75ML00p9k82J54K39k05k06K49J80l07j07L40K3l33M1L15
$$ 35 171 -89 -167 106 146 -129 -125 175 96 -186 -32 207 2 -204 45 225 -82 -189 151 174 -159 -118 197
4741A97j12k81J70K61k53k04K78J36k98o5K99Kl02N4L02j43k53J91K12k11j83
$$ 197 85 -196 -26 235 -18 -222 56 192 -106 -171 128 130 -172 -118 184 41 -212 -21 191 -20 -203
4762b03K56J35k82n1K91k2k68O6K68j13k46J57K15k18j49K32J04k60n0K64Qk79
$$ -203 53 188 -94 -145 146 124 -144 -78 190 77 -169 -12 203 -15 -164 68 172 -88 -138 126 134 -145
4784a45O8K55j08k35J34K06j70j83K11J34k56p2K58L0k50kK60n7k47J08K27j59
$$ -145 -77 178 70 -165 -31 175 5 -178 33 167 -89 -161 97 127 -123 -125 135 78 -169 -61 166 7
4806Gj73J76J52k03j18K48Q5k68k3K66k0k56N9K44j13k37J80J95k22j54K40J11
$$ 7 -166 10 162 -41 -159 89 174 -94 -117 149 129 -127 -68 176 63 -174 6 201 -21 -175 65 176
4828A76k65p4K95nl03Q2K90j43k66J91K30k39j98L06J16l22l9L18k7l17R1L28
$$ 176 -89 -163 132 127 -176 -94 196 53 -213 -22 208 -31 -229 77 193 -129 -168 150 123 -194 -103 225
4850B25j65k97K46K24k70j75L16R6l20m2L40l5l34J12L09j59k83K14K23k52j75
$$ 225 60 -237 9 233 -37 -212 104 200 -120 -162 178 143 -191 -79 230 71 -212 2 225 -27 -202
4871b02K90R0l05l1L11k8l11Q6L03j68k53K15K01k50j45K85J13l28k3L10m8k86
$$ -202 88 178 -127 -158 153 125 -186 -100 203 35 -218 -3 198 -52 -197 88 201 -127 -150 160 112 -174
4893a74Q8K72j35k42J83K15k39j56K73R6k75n4K75J7k84M6K87j27k30J34K26j90
$$ -174 -86 186 51 -191 -8 207 -32 -188 85 181 -94 -148 127 144 -140 -94 193 66 -164 -30 196 6
4915Fj93K23J43k49r9K72J9k57J2K79o3k80J19K63j91k15K21J79k43j31K71Q0
$$ 6 -187 36 179 -70 -169 103 122 -135 -123 156 93 -187 -68 195 4 -211 10 189 -54 -185 86 166
4937A66k93kL05o6k95J18K94j72k63K33J95k83j31L03P6l33j2L44m9l50J34L11
$$ 166 -127 -129 176 110 -185 -67 227 55 -208 25 220 -63 -194 109 185 -148 -160 184 135 -215 -81 230
4959B30k03k49K42K16l17j57L63O8l59KL42n0l41J30L15k05k59K55K08k99j48
$$ 230 27 -222 20 236 -81 -238 125 193 -166 -164 178 128 -213 -83 232 27 -232 23 231 -68 -216
4980b16L34R1l41mL33p0l19J40K75j91k39K35K00k98j29L11O9l27J3L10o9l01
$$ -216 118 209 -132 -136 197 127 -192 -52 223 32 -207 28 228 -70 -199 112 181 -146 -133 177 108 -193
5002a93J26K69j74k56K43J92k73j35K83R0l03j3L10n4l01J05K74j48k38K00K07
$$ -193 -67 202 28 -228 15 207 -66 -201 82 172 -131 -144 166 112 -189 -84 190 42 -196 4 211
5023B11k51j45K66J04k72m9K78%k86N9K82j08k54J35K20j96j75K12J54k58j06
$$ 211 -40 -185 81 185 -87 -136 142 142 -144 -85 197 89 -165 -30 190 -6 -181 31 185 -73 -179
5044a79K89M4k95OK89o6k84J28K67j94k14K30J87k81j35L26O2l29%L42q5l15J47
$$ -179 110 154 -141 -135 154 88 -196 -68 199 5 -209 21 208 -73 -208 118 180 -149 -149 193 108 -207 -60
5067f0K96j96k66K61K11l13j34L24P2l55J6L57q8l49J52L23k35k55K70J94k97
$$ -60 236 40 -226 35 246 -67 -201 123 195 -160 -144 213 125 -224 -72 251 16 -239 31 225 -72
$$ [...]
8191B8
##END NTUPLES=NMR FID
##END=
