##TITLE=1H_A0902-2
 CDCl3
 8 sc, 
 10.02.2022
##JCAMPDX= 6.0         $$ Bruker NMR JCAMP-DX V2.0
##DATA TYPE= NMR FID
##DATA CLASS= NTUPLES
##ORIGIN= UXNMR, Bruker Analytische Messtechnik GmbH
##OWNER= root
$$ XWIN-NMR		Version 3.5
$$ Thu Feb 10 12:06:31 2022 Russian Standard Time (UT+4h)  she@DPX200
##.OBSERVE FREQUENCY= 200.131346
##.OBSERVE NUCLEUS= ^1H
##.DELAY= (6, 6)
##.ACQUISITION MODE= SIMULTANEOUS
##.ACQUISITION SCHEME= undefined
##.AVERAGES= 8
##.DIGITISER RES= 18
##SPECTROMETER/DATA SYSTEM= spect
##.PULSE SEQUENCE= zg30
##.SOLVENT NAME= CDCl3
##.SHIFT REFERENCE= (INTERNAL, CDCl3, 0, 15.7039)
##AUDIT TRAIL= $$ (NUMBER, WHEN, WHO, WHERE, WHAT)
$$ ##TITLE= Audit trail, XWIN-NMR		Version 3.5
$$ ##JCAMPDX= 5.01
$$ ##ORIGIN= Bruker BioSpin GmbH
$$ ##OWNER= she
$$ F:/spectra/data/she/nmr/H-F/1/audita.txt
$$ ##AUDIT TRAIL=  $$ (NUMBER, WHEN, WHO, WHERE, WHAT)
(   1,<2022-02-10 12:02:54.25 +0400>,<she>,<DPX200>,
      <created by zg, POWCHK disabled, PULCHK disabled
       configuration hash MD5:
       00 E9 B6 7A A2 85 ED C7 34 08 36 98 17 FE 4E 26
       data hash MD5: 16K
       F0 1A 21 14 62 FA CB 05 B0 81 5D D2 79 0A 35 E7>)
$$ ##END=
$$ 
$$ hash MD5
$$ D2 BC 59 FE 2E 8F 66 F7 8E 48 72 A0 4F 0F 94 4D
##$RELAX= 
##$RELAX= 
##$RELAX= 
##$RELAX= 
##$RELAX= 
##$RELAX= 
$$ Bruker specific parameters
$$ --------------------------
##$DU= <F:/spectra>
##$EXPNO= 1
##$NAME= <H-F>
##$PROCNO= 1
##$TYPE= <nmr>
##$USER= <she>
##$AMP= (0..31)
100 100 100 100 100 100 100 100 100 100 100 100 100 100 100 100 100 100 
100 100 100 100 100 100 100 100 100 100 100 100 100 100 
##$AQSEQ= 0
##$AQ_mod= 1
##$AUNM= <au_zg>
##$AUTOPOS= <>
##$BF1= 200.13
##$BF2= 200.13
##$BF3= 200.13
##$BF4= 200.13
##$BF5= 200.13
##$BF6= 200.13
##$BF7= 200.13
##$BF8= 200.13
##$BYTORDA= 1
##$CFDGTYP= 0
##$CFRGTYP= 5
##$CHEMSTR= <none>
##$CNST= (0..31)
1 1 145 1 1 1 1 1 1 1 1 1 1 1 1 1 1 1 1 1 1 1 1 1 1 1 1 1 1 1 1 1 
##$CPDPRG= <>
##$CPDPRG1= <>
##$CPDPRG2= <>
##$CPDPRG3= <>
##$CPDPRG4= <mlev>
##$CPDPRG5= <mlev>
##$CPDPRG6= <mlev>
##$CPDPRG7= <mlev>
##$CPDPRG8= <mlev>
##$CPDPRGB= <>
##$CPDPRGT= <>
##$D= (0..31)
0 1.2 0 0 0 0 0 0 0 0.06 0 0.03 0 0 0 0 0.0002 0 0 0 0 0 0 0 0 0 0 0 0 
0 0 0 
##$DATE= 1644480173
##$DBL= (0..7)
120 120 120 120 120 120 120 120 
##$DBP= (0..7)
150 150 150 150 150 150 150 150 
##$DBP07= 0
##$DBPNAM0= <>
##$DBPNAM1= <>
##$DBPNAM2= <>
##$DBPNAM3= <>
##$DBPNAM4= <>
##$DBPNAM5= <>
##$DBPNAM6= <>
##$DBPNAM7= <>
##$DBPOAL= (0..7)
0.5 0.5 0.5 0.5 0.5 0.5 0.5 0.5 
##$DBPOFFS= (0..7)
0 0 0 0 0 0 0 0 
##$DE= 6
##$DECBNUC= <off>
##$DECIM= 32
##$DECNUC= <off>
##$DECSTAT= 4
##$DIGMOD= 1
##$DIGTYP= 9
##$DL= (0..7)
0 120 120 120 120 120 120 120 
##$DP= (0..7)
150 150 150 150 150 150 150 150 
##$DP07= 0
##$DPNAME0= <>
##$DPNAME1= <>
##$DPNAME2= <>
##$DPNAME3= <>
##$DPNAME4= <>
##$DPNAME5= <>
##$DPNAME6= <>
##$DPNAME7= <>
##$DPOAL= (0..7)
0.5 0.5 0.5 0.5 0.5 0.5 0.5 0.5 
##$DPOFFS= (0..7)
0 0 0 0 0 0 0 0 
##$DQDMODE= 0
##$DR= 18
##$DS= 0
##$DSLIST= <SSSSSSSSSSSSSSS>
$$ [...]
##$SUBNAM2= <"">
##$SUBNAM3= <"">
##$SUBNAM4= <"">
##$SUBNAM5= <"">
##$SUBNAM6= <"">
##$SUBNAM7= <"">
##$SUBNAM8= <"">
##$SUBNAM9= <"">
##$SW= 18.0517287032376
##$SWIBOX= (0..15)
0 0 2 0 0 0 0 0 0 0 0 0 0 0 0 0 
##$SW_h= 3612.71676300578
##$TD= 16384
##$TD0= 1
##$TE= 0
##$TE2= 300
##$TE3= 300
##$TEG= 300
##$TL= (0..7)
0 120 120 120 120 120 120 120 
##$TP= (0..7)
150 150 150 150 150 150 150 150 
##$TP07= 0
##$TPNAME0= <>
##$TPNAME1= <>
##$TPNAME2= <>
##$TPNAME3= <>
##$TPNAME4= <>
##$TPNAME5= <>
##$TPNAME6= <>
##$TPNAME7= <>
##$TPOAL= (0..7)
0.5 0.5 0.5 0.5 0.5 0.5 0.5 0.5 
##$TPOFFS= (0..7)
0 0 0 0 0 0 0 0 
##$TUNHIN= 0
##$TUNHOUT= 0
##$TUNXOUT= 0
##$USERA1= <user>
##$USERA2= <user>
##$USERA3= <user>
##$USERA4= <user>
##$USERA5= <user>
##$V9= 5
##$VALIST= <valist>
##$VCLIST= <CCCCCCCCCCCCCCC>
##$VD= 0
##$VDLIST= <DDDDDDDDDDDDDDD>
##$VPLIST= <PPPPPPPPPPPPPPP>
##$VTLIST= <TTTTTTTTTTTTTTT>
##$WBST= 1024
##$WBSW= 4
##$XGAIN= (0..3)
0 0 0 0 
##$XL= 0
##$YL= 0
##$YMAX_a= 178971
##$YMIN_a= -168354
##$ZGOPTNS= <>
##$ZL1= 120
##$ZL2= 120
##$ZL3= 120
##$ZL4= 120
##$ABSF1= 10
##$ABSF2= 0
##$ABSG= 5
##$ABSL= 3
##$ALPHA= 0
##$AQORDER= 0
##$ASSFAC= 0
##$ASSFACI= 0
##$ASSFACX= 0
##$ASSWID= 0
##$AUNMP= <proc_1d>
##$AZFE= 0.1
##$AZFW= 0.1
##$BCFW= 1
##$BC_mod= 2
##$BYTORDP= 1
##$COROFFS= 0
##$CY= 11.3945322036743
##$DATMOD= 1
##$DC= 2
##$DFILT= <>
##$DTYPP= 0
##$F1P= 2.36226072786647
##$F2P= -0.459571619588291
##$FCOR= 0.5
##$FTSIZE= 0
##$FT_mod= 4
##$GAMMA= 1
##$GB= 0.15
##$INTBC= 1
##$INTSCL= 1
##$ISEN= 128
##$LB= 0.24
##$LEV0= 0
##$LPBIN= 0
##$MAXI= 10000
##$MC2= 0
##$MEAN= 0
##$ME_mod= 0
##$MI= 1.114404
##$NCOEF= 0
##$NC_proc= 0
##$NLEV= 6
##$NOISF1= 3.799351
##$NOISF2= 2.8
##$NSP= 1
##$NTH_PI= 0
##$NZP= 0
##$OFFSET= 15.70392
##$PC= 1
##$PHC0= -16310.17
##$PHC1= 11.80078
##$PH_mod= 1
##$PKNL= yes
##$PPARMOD= 0
##$PSCAL= 0
##$PSIGN= 0
##$REVERSE= no
##$SF= 200.130013532006
##$SI= 16384
##$SIGF1= 3
##$SIGF2= 2
##$SINO= 400
##$SIOLD= 16384
##$SREGLST= <1H.CDCl3>
##$SSB= 0
##$STSI= 0
##$STSR= 0
##$SW_p= 3612.71676300578
##$SYMM= 0
##$S_DEV= 0
##$TDeff= 0
##$TDoff= 0
##$TI= <>
##$TILT= no
##$TM1= 0
##$TM2= 0
##$TOPLEV= 0
##$USERP1= <user>
##$USERP2= <user>
##$USERP3= <user>
##$USERP4= <user>
##$USERP5= <user>
##$WDW= 1
##$XDIM= 8192
##$YMAX_p= 0
##$YMIN_p= 0
$$ End of Bruker specific parameters
$$ ---------------------------------
##NTUPLES= NMR FID
##VAR_NAME=  TIME,          FID/REAL,        FID/IMAG
##SYMBOL=    X,             R,               I
##VAR_TYPE=  INDEPENDENT,   DEPENDENT,       DEPENDENT
##VAR_FORM=  AFFN,          ASDF,            ASDF
##VAR_DIM=   8192,          8192,            8192
##UNITS=     SECONDS,       ARBITRARY UNITS, ARBITRARY UNITS
##FACTOR=    0.0002768,     1,               1
##FIRST=     0,             0,               0
##LAST=      2.2672688,     0,               0
##MIN=       0,             -168354,         0
##MAX=       2.2672688,     178971,          0
$$ Real data points
##PAGE= N=1
##DATA TABLE= (X++(R..R)), XYDATA
0@%%%%%%%%%%%%%%%%%%%qJ6j6J6j6J6j6J6k4L2l2L3m1M8n2O0o7P5q4R2j01J13
41F0j25J35j48J65j84K04k23K45k71K97l26L61m00M43m92N49o15O97p95R11j061
62e73J260j531J918k516L541n603J1154n0816j25188K26563J00542k48983n0432
75a40664K57589o98k53135N0199K38285r9184k11149J41178J78054j76680j39829
86a56034K02937R8852k20303n3835K25524Q223k20516L6501K07119p8264j88001
97a37797J16795J62404j48700j31188J71876R5864j85961n8203J92922J8211j92963
108i6740K2689J85612o1299j71373R4580J51753j22211j26879J44428R6219j60491
119d3712o1041J69582K4607j72469J0759J69901m4345j60836P5274J44119j01732
$$ y = [0, 0, 0, 0, 0, 0, 0, 0, 0, 0, 0, 0, 0, 0, 0, 0, 0, 0, 0, 0, -8, 8, -8, 8, -8, 8, -8, 8, -16, 16, -16, 17, -24, 24, -28, 32, -35, 40, -44, 48, -53, 60, -65, 70, -78, 87, -97, 107, -116, 129, -142, 155, -171, 190, -210, 233, -259, 290, -325, 372, -423, 488, -573, 687, -844, 1074, -1442, 2099, -3504, 7650, -43166, -168354, 58209, 158751, -90232, -140664, 116925, 116227, -136908, -86709, 151576, 52392, -158757, -17579, 160475, -16205, -156034, 46903, 145755, -74548, -128383, 97141, 105364, -115152, -78651, 128468, 50204, -137797, -21002, 141402, -7298, -138486, 33390, 129254, -56707, -114910, 78012, 96223, -96740, -74051, 111561, 50262, -121111, -26531, 125222, 3011, -123868, 20560, 116779, -43712, -104753, 64829, 89436, -83033, -72274, 97627, 53282, -107554, -32280, 111839, 10107]
130A0107j20777J22988R3307j39839o3247J52341L1263j58696P80J57482l0768
141E4941j49393N8221J35573q3869j16354J07163R2378j26037o5709J39131L8357
152H4402j46444j0274J47695j8957j41885M8178J29429p5336j12276R9279R1901
163I5712j19388o8124J33927M0923j41180j1815J41303j7667j35842M6775J25505
174I0129p4437j09941R8130Q9622j15746o5910J27179L9655j33115j1047J33482
185F8001j8511j27918M6228J17236p0111j02500Q9780Q3649j05059o0501J15087
196C5381L4465j19695p984J19811j7433j15904M1189J07211o2266r3204P9427
207I98P4992r2441n4269J02164L1925j08520q752J10303j3636j06930L3816R9019
$$ y = [10107, -110670, 12318, 105625, -34214, -97461, 54880, 86143, -72553, -71773, 85709, 54941, -94452, -36231, 99342, 15473, -100881, 6282, 98660, -27377, -93086, 46045, 84402, -62042, -72316, 75379, 56422, -85463, -37285, 92144, 16808, -95468, 3811, 95712, -23676, -91800, 42127, 83050, -58130, -69945, 71358, 53691, -82151, -35376, 90129, 15692, -94249, 3881, 93503, -22243, -88153, 39026, 78681, -54434, -65481, 68001, 49490, -78428, -32200, 85036, 14925, -87575, 2205, 85854, -19205, -79706, 35381, 69846, -49849, -57833, 61978, 44545, -71359, -30170, 77041, 14775, -78429, 998, 75990, -16451, -70720, 31444, 63369, -45151, -53903, 56400, 42764, -64166, -30350, 68669]
219F8669n1889q7193O8290P1593q2448n3122R3073L3620r9669j4319J02312m921
231D3996j00498K4198R3833m2597q3007N9019O9815p3158n5103Q4551L8786r2011
243c2176k1058R4607K866r3027J5294Q8349l3384q0879N0564P0480o5106n7673
255f1143P5864M3217q3116k7033Q7286Q902q8043J0144Q5373k8349p9901M4707
267a2092P1908n9040o0758P0872M6073p9422k8832Q4627J0493q7070Q094Q6617
279E1470k6378q2176M3122P3392n7249o0994O8758M5905p8022k8517Q4458R775
291D3544q6864Q618Q4893k5419p9000M0600O9437n4350n6319O5775M0729p4022
303b2378k4408P8844Q336q0284P566P7775k3073p1060L7263O1207m9536m9596
$$ y = [68669, 16780, -70413, -2123, 69470, -12978, -66100, 26973, 60593, -39076, -53395, 48917, 43996, -56502, -32304, 61529, 18932, -64075, -5056, 64759, -8399, -63502, 21049, 59835, -32176, -53234, 41373, 44239, -48788, -33494, 54855, 21471, -59408, -8844, 61636, -3470, -61143, 14721, 57938, -25178, -52211, 35075, 43977, -44066, -33922, 51451, 23102, -56799, -12092, 59816, 776, -59982, 10890, 56963, -22459, -51291, 33336, 43829, -43241, -35147, 51470, 25092, -57084, -13962, 59430, 2181, -58813, 9945, 55850, -22172, -50689, 33769, 43544, -43320, -34702, 50191, 24772, -54228, -13628, 55809, 1459, -54860, 10915, 51644, -22378, -46786, 32058, 40394, -39890, -32324, 45451, 22378, -48682, -11419, 49788, 252, -49344]
315d9344N9869L6823o7764k2899P2115Q383p2403N953O9313j9821o3803L3280
327a0298N6055m5530m6214N5099L5051o1445k3163O4921J0320o5736L546O3695
339C6301j7423n9121K9980N2858m0606m5114M9176L5501n5346k3912N8687J1280
351C2261n9646J390N8916j3644n6510K5043N1794l4791m4647M2332L5768m8182
363i916k5559N2825J4194n5881k281N6686q984n5187J9188N1552k8685m5537L7598
376A3L7092m5342k7000N1342J6336n5530n533N7609n667n6795J6969N2777k7706
389H565m6315L7587L8230m6466k8686N3556J7832n7751o214N8604n479n6620J7174
402a5983N2323k8694m5756L9070L7286m7142k7692N2489J7310n5292n957N5498
$$ y = [-49344, 10525, 47348, -20416, -43315, 28800, 37183, -35220, -29267, 40046, 20225, -43578, -10298, 45757, 227, -45987, 9112, 44163, -17282, -40445, 24476, 34796, -30940, -27394, 36301, 18878, -40243, -10263, 42595, 1989, -43125, 6051, 41552, -13794, -37706, 20981, 32261, -27385, -25995, 32921, 19277, -37233, -12190, 39604, 4813, -39834, 2498, 38266, -9916, -35475, 17350, 31544, -24337, -26618, 30068, 21084, -34103, -14915, 36637, 7952, -37585, 13, 37105, -8237, -35237, 16105, 32441, -23089, -28622, 28987, 23320, -33475, -16506, 36271, 8565, -37750, -163, 38067, -8399, -37085, 16471, 34303, -23448, -29662, 28942, 23463, -33157, -15983, 36340, 7646, -38110, 960, 38246, -8896, -36588, 15901, 33211, -22081, -28038, 27460]
414B7460o201n2986J8095M8278k8673m2107L7509L4645m4412k5493M8829J4899
426B9843n0572l707N0209p332m8374J7895M4860k7413l9285L4957L1897m0325
438g347k3265M4024J3618m6358l181M6940p122m5477J6289M2190k4022l7257L0722
451b46L0491l6316k2061M0390J2967m2856m117M3858m282m3199J2336M0277j9728
464G514l5267K6095K8996l1555k2177L6220J4863l9550p191M0803l27l9988P517
477a4047L7704j4753l4120K2011K9261k8524k3443L3541J7232l6994j0570L8977
489A6275K998l9253N352L7704j3707l4813K1416L1014k8299k6054L3990J9508
501B6131l7819j1596L9623L066l9962N755L9110j4605l6632K2676L2226k9125
$$ y = [27460, 21259, -31727, -13632, 34646, 5973, -36134, 1375, 36020, -8392, -33885, 14944, 29843, -20729, -24436, 25773, 18441, -29933, -12038, 32822, 5409, -33876, 1081, 32978, -7347, -30612, 13412, 27030, -19328, -22509, 24431, 17309, -28168, -11879, 30311, 6289, -30968, -246, 30245, -6071, -28132, 12258, 25225, -17631, -21748, 22110, 17828, -25371, -13035, 27242, 7514, -27753, -1658, 27338, -4217, -26394, 9826, 24689, -14861, -22052, 18751, 18424, -21564, -14047, 23657, 8904, -25216, -3205, 26056, -2468, -25911, 7630, 24862, -12132, -22702, 16275, 19273, -19980, -14628, 23076, 9369, -25444, -4028, 26986, -1313, -27367, 6623, 26131, -11688, -23284, 16339, 19405, -20557, -14802, 24308, 9703, -26929, -4253, 27973, -1152]
513a152k6253L3807J9075l7167j0755L9216J630l9548P318L8023j5176l4975K1901
526d056L0382k7655k3998L2216J6230l5222q015L6759J33l7021P403L5618j4455
539H319l2175K0635K6914k5663k0695K9770J4002l3024o902L4786k92l4508O967
552a1866L2390j3049k8964J8888K4338k4285j8646K8499J2493l1027o491L2041
564A4321N44l1631N658K9654j1872k6254J7380K2189k1893j7927K5439J3229k7751
577h914p879K8467K196k7796L405K6428q888k4570J4139K1947j8569j8427K1717
590C256J4259k3769r562K5200M144k5980J749K5799p437k4646J2311K2720j6599
603A445j9757K0409J5462k3505j0085K5664M390k6992J244K7513o828k6689J2185
$$ y = [-1152, -27405, 6402, 25477, -11690, -22445, 16771, 18401, -21147, -13829, 24194, 9018, -25957, -4056, 26326, -1329, -25327, 6889, 23119, -12103, -20118, 16641, 16774, -20247, -12844, 22774, 8319, -23856, -3221, 23693, -1970, -22665, 7105, 21107, -11917, -18819, 15967, 15675, -18833, -11866, 20524, 7475, -21489, -2601, 21737, -2548, -21194, 7305, 19798, -11229, -17720, 14321, 14865, -16766, -11108, 18546, 6674, -19580, -2200, 19989, -1904, -19831, 5608, 18837, -8914, -16793, 11674, 13870, -13926, -10521, 15907, 7019, -17551, -3412, 18535, -34, -18461, 3256, 17515, -6254, -15816, 9384, 13528, -12452, -10703, 15096, 7659, -16987, -4676, 18044, 1445, -18312, 2097, 17559, -5946, -16031, 9633, 14023, -12969, -11725, 15788, 8960, -17729, -5544]
616e544K4158j6880k0207K0832J5429k4229j0110K6946M246k8289J639K7888p053
629H826k6041J2060K3028j6889j8888K1241J3837k4465q490K6272L300k6801J908
642a1102K6036p337k3775J2557K0337j7059j6369K0694J2187k3445p521K4888
654A0091K356k4734K910K3302p935k1181J2740J8463j7060j4950K0303J0742k2057
667g010o234K2671J486k2517L628K1486q689j9499J2928J6824j6073j3736J8327
680C592J0034j9824n605K0379Q80k0056L470J9206p232j7954J0590J5890j3337
693C3j2843J5252R274j6534n601J7575J872j8233J860J8083n281j6960Q142J5151
707A1790j0726j2841J3365R874j5781o436J7487L008j8387K45J8595l642j7916
$$ y = [-5544, 18614, 1734, -18473, 2359, 17788, -6441, -16551, 10395, 14641, -13648, -12009, 15879, 8826, -17215, -5155, 17873, 984, -17904, 3337, 17174, -7291, -15781, 10491, 13791, -13010, -11102, 14934, 7597, -16178, -3621, 16716, -343, -16712, 3982, 16169, -7276, -14797, 10091, 12447, -12287, -9377, 13925, 5990, -15191, -2451, 16012, -1048, -15998, 4305, 15047, -7010, -13244, 9427, 10913, -11604, -7976, 13510, 4821, -14678, -1750, 15074, -999, -14735, 3592, 13626, -6198, -11803, 8576, 9456, -10600, -7130, 12076, 4844, -13110, -2520, 13370, 33, -12810, 2442, 11716, -4818, -10419, 7156, 9028, -9205, -7345, 10738, 5457, -11503, -3361, 11790, 1064, -11777, 1588, 11462, -4319, -10755, 6732, 9740, -8647, -8402, 10193, 6551, -11365]
720a1365P299J6157j0859j3603J3973J0757j6586p750J8648M207j9646k28J9353
733A0357l802j8121P703J6386j1537j4092J5020J1040j7469p487J8724L681j9034
746h631L65J8702m740j7542R009J5519j2478j3006J5033J0101j6874o580J7973
759F851K365j8116K001J7435o011j6253R521J4553j2584j1978J4926Q506j6304
772e088m622J6943P12j7174L234J6792o990j5407J0102J3114j2371j0262J4108
785C091P005j5517l331J6318m29j6183L640J5315o284j3878Q663J1766j0857q954
799i635J2534N899j3592l094J4196N36j4332K066J3646m599j2161O839J0295q820
813b22q423J0733O414j2352m114J3200J732j3243N79J2910l084j2274N880J1157
$$ y = [-11365, -4066, 12091, 1232, -12371, 1602, 12359, -4227, -11977, 6671, 10878, -8768, -8996, 10357, 6555, -11566, -3863, 12523, 986, -13106, 1914, 12954, -4515, -12002, 6722, 10403, -8631, -8266, 10436, 5696, -11846, -2837, 12682, 204, -12802, 2231, 12332, -4542, -11122, 6851, 9216, -8900, -6899, 10536, 4525, -11728, -2207, 12346, -238, -12216, 2710, 11216, -5088, -9710, 7233, 7945, -9229, -5995, 10797, 3807, -11600, -1498, 11616, -755, -11017, 3091, 10096, -5421, -8752, 7566, 7137, -9046, -5406, 9909, 3625, -10253, -1590, 10176, -681, -9635, 2899, 8798, -4794, -7888, 6308, 6844, -7488, -5422, 8224, 3625, -8536, -1697, 8598, -222, -8645, 2088, 8502, -3850, -7964, 5236, 6968, -6275, -5696, 7214, 4130, -8144, -2264, 8893]
827H893q570r552J0684P760j2199n760J3333L226j3959j32J3883l079j3271O001
841b742J2392q657j1123J1018R031j2763o250J3755L181j4278j5J4525l255j4226
855i407O415J3055r006j1143J0950Q788j2562n948J3924K631j4686P77J4650l803
869D635j3935O408J2658q891j0603J1162P785j2888m670J3988J687j4609J209
882f064J4619m179j3668P020J1745r404r396J1432O890j3192m133J4346J145j4484
896g323J693J3724m271j2440O756J0766r202q584J1168O107j2264l720J2683J418
910F511j2604J062J1974l694j0707O024R192p862p706R323O092j0421m063J0920
924D041J717j0796N49J0457k738j0096M928R416o928q196Q375O611r348m801J0169
$$ y = [8893, 323, -9229, 1455, 9215, -2984, -8744, 4589, 7815, -6144, -6276, 7607, 4528, -8743, -2742, 9650, 993, -10130, 888, 9919, -2844, -9094, 4661, 7842, -6436, -6451, 8074, 4819, -9407, -2992, 10063, 1057, -10086, 864, 9652, -2910, -8858, 5066, 7697, -6989, -6212, 8438, 4635, -9300, -2892, 9766, 875, -9728, 1434, 9219, -3669, -8339, 5649, 7336, -7273, -6064, 8555, 4376, -9292, -2272, 9473, 69, -9327, 2105, 8995, -4197, -8330, 6016, 7161, -7323, -5630, 8094, 3823, -8617, -1861, 8905, -297, -8881, 2287, 8394, -3870, -7590, 5093, 6511, -6093, -5031, 6943, 3249, -7458, -1434, 7758, -104, -7810, 1513, 7605, -2816, -6879, 4041, 5758, -5038, -4489, 5968, 3230, -6866, -1938, 7478, 550, -7646, 729, 7340, -2008, -6809, 3360]
939C360K683j0898j97J1198k267j0951M376J0317o187r289P978P610r611n314
953g192J0808K850j1551n41J2005j787j1931M178J1024o400r371Q262P407r900
967b139n319J1369K952j2290m28J2363j997j1708M232J0629o515r136Q780P116
981G909j0570m844J1666K578j2164k45J2165k390j1476N132J0137p558q445R529
995A424O623j1060m530J2088J961j2305Q17J1778l451j0881N872R764q124q197
1009h221R878O124j0870l796J1171J434j1150J045J0834l574j0021N766Q728p303
1023D5p219Q341N530r181l432R694J091r732J070R449k853r044M495Q274o004
1038E24o934P202N214q057l457Q791J738r446R2R699j946r293L558Q454n024p395
$$ y = [3360, 6043, -4855, -5052, 6146, 3879, -7072, -2696, 7621, 1434, -7855, 123, 7733, -1878, -7192, 3616, 6466, -5085, -5626, 6379, 4592, -7339, -3161, 7863, 1463, -7908, 354, 7761, -2139, -7458, 3911, 6863, -5427, -5855, 6508, 4511, -7197, -2965, 7664, 1149, -7987, 793, 7909, -2661, -7505, 4161, 6739, -5425, -5670, 6495, 4105, -7371, -2239, 7898, 340, -8105, 1424, 8047, -3013, -7543, 4545, 6506, -5799, -4982, 6796, 3345, -7536, -1664, 8100, -24, -8221, 1657, 7781, -3089, -6885, 4286, 5720, -5430, -4385, 6449, 2875, -7146, -1380, 7348, 45, -7174, 1167, 6697, -2484, -5916, 3778, 4869, -4863, -3793, 5656, 2803, -6241, -1746, 6528, 524, -6410, 792, 6006, -2051, -5508, 3283, 5021, -4425, -4333, 5366, 3420, -5873, -2315, 6139, 1115, -6280]
1054f280O575O024q109m339R259K515r862p93J0034r75r862L024R122n120p872
1069f659O938O459q382n010R554L317j0310j206J0385j027r912L180R202n245
1083A284q310P234O973q809n185R718L160j0132j009J0296j387j0121L877R425
1097G014o101q204P729O758r033m921J0068K581j0651K8J0668k494j0268M637
1111b189R566o599q312Q300O383r477m089J0177J763j0559N21J0642k808j0095
1125f776M859Q837o409p205P641N381q718l338R507J164r749Q38R398k505q710
1140e785M014P720n571o295O940M606p908k980Q510J498q842L5Q803j740q236
1155e231L430P292m890o301O273N266p539l940Q385K368q672p48Q623r25q448
$$ y = [-6280, 295, 6319, -1790, -6129, 3130, 5645, -4217, -5010, 5024, 4049, -5813, -2789, 6333, 1213, -6659, 279, 6738, -1644, -6654, 2900, 6217, -4093, -5299, 5086, 4059, -5853, -2673, 6529, 1284, -7026, 208, 7181, -1628, -6813, 2905, 6065, -4067, -5076, 5220, 3833, -6288, -2411, 7014, 913, -7291, 438, 7196, -1837, -6758, 3310, 5891, -4760, -4732, 5936, 3442, -6826, -2189, 7377, 778, -7534, 766, 7149, -2328, -6417, 3760, 5523, -5036, -4515, 6127, 3319, -6776, -1917, 6920, 511, -6694, 947, 6328, -2390, -5728, 3779, 4943, -4806, -3968, 5430, 2925, -5785, -1771, 5949, 378, -5917, 1023, 5629, -2279, -5259, 3251, 4749, -4093, -4058, 4745, 3005, -5231, -1801, 5491, 601, -5700, 573, 5839, -1700, -5640, 2745, 5113, -3559, -4307, 4316, 3391, -5057]
1170e057K780Q031m674p216O215O127p318m879Q155L356q816j410R092o91q983
1185e288K617Q608m307q018N881O974p261n367Q236L457q871j508R352m89r548
1200e532K532R201m415q235N983O876p334n243Q623L287r638j088J0071j016r942
1215e870K935R354m802q317O686O713q319m753R448K766j0158q21J0433j251j0082
1230f038L380R055n291p641O893O111q246m436R259K544r651n61R416j328q769
1245e303L106P931m862o848O427N475p487l981Q027K490q283q40Q273r95p936
1260d806K804P283m303o509N491N629o541m391P286K811p664j124P794m98p834
1275d572K077P683l624p081M935O072n935m824O790L417p587j799Q178P9q310
$$ y = [-5057, -2277, 5754, 1080, -6136, 79, 6206, -1112, -5991, 2164, 5520, -3296, -4706, 4386, 3695, -5288, -2671, 5937, 1630, -6388, -507, 6467, -794, -6161, 2075, 5532, -3339, -4847, 4505, 4016, -5532, -3000, 6201, 1786, -6449, -466, 6410, -924, -6167, 2456, 5743, -3895, -4983, 5088, 4072, -5870, -2935, 6419, 1617, -6700, -14, 6699, -1620, -6373, 3075, 5841, -4317, -5138, 5295, 4044, -6038, -2658, 6397, 1106, -6535, 358, 6469, -1777, -6213, 3046, 5590, -4061, -4622, 4794, 3466, -5303, -2197, 5734, 872, -5976, 451, 5926, -1561, -5542, 2485, 4975, -3308, -4148, 4125, 3130, -4806, -2002, 5281, 978, -5531, -40, 5589, -952, -5343, 1943, 4754, -2910, -4034, 3760, 3262, -4572, -2495, 5188, 1564, -5517, -582, 5490, -445, -5269, 1521, 4938, -2649, -4448, 3730, 3809, -4501]
1290d501J463Q091k841p581M224O680n622n369O845L828p721k343Q326Q44q640
1305d317P87Q461k548p711M179O693n675n536P054M189q181k543Q764P51q804
1320d437J062Q471k908p875M831O930o582n593P849M075q656k398R097M65r132
1335d801J665Q703l723p874N445O846o841n559P907L895q528j936Q673o7q484
1350d679J902Q108l625p445N132O344o246m911O930L359p415j703P743l1p780
1365d317J688P431l047o769M148N893n148m732O073L304o738j837P136M83p325
1380c757P87P252k110o762L400N871m531m828N543L750o459k597P140J284p370
1395c387M2P210j348o824K694O299m130n496N388M501o277l430O835K287p213
$$ y = [-4501, -3038, 5053, 2212, -5369, -1145, 5535, -87, -5456, 1389, 5217, -2504, -4847, 3479, 4323, -4317, -3530, 4931, 2383, -5328, -1149, 5544, -131, -5667, 1387, 5576, -2605, -5148, 3616, 4367, -4437, -3375, 5096, 2188, -5687, -856, 6074, -508, -6101, 1748, 5823, -2833, -5231, 3866, 4331, -4801, -3136, 5567, 1844, -6030, -585, 6261, -580, -6139, 1768, 5663, -2865, -4801, 3872, 3805, -4679, -2777, 5331, 1706, -5739, -607, 5737, -509, -5420, 1510, 4869, -2546, -4249, 3494, 3463, -4317, -2629, 4802, 1755, -5014, -866, 5027, -121, -4853, 1220, 4524, -2214, -4051, 3085, 3568, -3757, -2970, 4282, 2172, -4590, -1190, 4681, 150, -4678, 865, 4615, -1844, -4441, 2699, 3983, -3387, -3345, 3865, 2517, -4307, -1613, 4686, 556, -4940, 448, 4949, -1328, -4758, 2077, 4364, -2849]
1410b849q84P318p24p096K307O647l688o078M929N292o006m121O790K626p239
1425b776r93P447o71p502K371P244l974o544N312N416o325m079P188K462p871
1440c295o25Q198j231q053K857P535m283o653N618N335o757l672P582J912q010
1455c542k63Q130j328p845K872P084m274n891N391M566o334l184P058J750p467
1470c277k53P371j151o860K397O153l633n313M852M246n800l069O358J925o620
1485b674p26O617n92o359K013N824l305n142M378M401n243l532N910K405o260
1500b285j085O314k29o242J516O101k814n706L948N015m790m113N425L031n949
1515a863j801O379M02o573R28O488k109o167L143N618m200m687N180L470n951
$$ y = [-2849, -3733, 3585, 2861, -4235, -1928, 4719, 1031, -5047, -118, 5174, -832, -4953, 1837, 4463, -2776, -3769, 3678, 3007, -4495, -2124, 5120, 1146, -5398, -86, 5330, -995, -5074, 2114, 4576, -3295, -3920, 4278, 3047, -5006, -2149, 5386, 1103, -5550, 68, 5403, -1354, -5026, 2556, 4468, -3542, -3805, 4325, 2997, -4848, -1976, 5108, 834, -5057, 334, 4900, -1434, -4618, 2440, 4190, -3277, -3530, 3841, 2690, -4170, -1773, 4380, 747, -4566, 286, 4532, -1268, -4337, 2021, 3946, -2674, -3400, 3217, 2625, -3734, -1721, 4103, 798, -4344, 34, 4435, -808, -4340, 1570, 3975, -2285, -3370, 2944, 2715, -3527, -2011, 4090, 1276, -4430, -482, 4533, -257, -4370, 1055, 4086, -1863, -3664, 2715, 3117, -3456, -2528, 3960, 1851, -4316, -1173, 4445, 245, -4442, 738, 4208, -1743]
1530a743k168O528Q93o904M32O977j841o565L206N769m438m780N600L626o623
1545b031k290P318Q02p521O87P321k179o810L715N980n189m856O389L522p144
1560b286k158P542O81p603R73P228k641o497M124N550n309m524O230L309o808
1575b189j867O977L34o790J169O415k549n926L834N179m838m188N492L042n860
1590a765j779O068M30o156R62N997k234n561L230M949m058m133M785L035n366
1605a596j769N723N12n877N98N912j695n620K713N001l621m133M399L172n074
1620a355k186N669J116n974l5N933r66n650J969N183l024m543M059L729m915k813
1636c803N471J897n845q37N985m08n835J745N412k999m868M118M205n100l292
$$ y = [-1743, -3911, 2617, 3510, -3394, -2962, 4015, 2174, -4391, -1185, 4584, 146, -4634, 966, 4592, -2031, -4321, 2997, 3799, -3722, -3035, 4286, 2107, -4703, -988, 4992, -197, -5053, 1336, 4858, -2286, -4444, 3098, 3779, -3824, -2851, 4377, 1736, -4761, -637, 4913, -396, -4920, 1310, 4619, -2189, -4056, 2921, 3255, -3535, -2366, 4049, 1500, -4426, -592, 4587, -251, -4439, 1053, 4095, -1765, -3544, 2524, 2954, -3202, -2240, 3757, 1523, -4038, -808, 4141, 83, -4050, 735, 3770, -1596, -3365, 2358, 2870, -3007, -2409, 3503, 1808, -3812, -1099, 3902, 281, -3852, 547, 3719, -1355, -3541, 2128, 3244, -2730, -2765, 3168, 2202, -3448, -1479, 3704, 680, -3863, 196, 3925, -990, -3803, 1668, 3565, -2280, -3117, 2868, 2460, -3375, -1630, 3782, 783, -4085, 33, 4238, -862, -4154]
1651d154N826K090o216p17O313p13o232K176N945l578n338M775M401n628l229
1666d279O202J873o584l22O714j289o500K731N969l892n189M857M112n652k739
1681c988O163J229o391J99O372j487o124K677N531l718m580M546L427n151k261
1696c556N641J058n943J67N914j280n538K265M935l178m166M068L224m835k166
1711c390N333J117n515j62N509q62n237J953M695k998l994L866L261m558k503
1726c485N059J631n310o28N271m21n045J420M776k415m426L321L912m042l195
1741c577M484K410m818j466N083L75n227Q00N162j844m924K749M506l572l828
1756c687M352K843m978j686N399N42n712O36N766j806n502K944M824l931l907
$$ y = [-4154, 1672, 3762, -2454, -3171, 3142, 2429, -3803, -1627, 4318, 740, -4598, 177, 4578, -1050, -4279, 1923, 3796, -2788, -3110, 3604, 2315, -4185, -1454, 4515, 623, -4566, 291, 4403, -1249, -3988, 2175, 3404, -2987, -2788, 3584, 2097, -4027, -1350, 4181, 463, -4117, 429, 3856, -1295, -3556, 2085, 3143, -2800, -2633, 3281, 2001, -3537, -1272, 3663, 485, -3681, 387, 3611, -1224, -3390, 1943, 3060, -2455, -2617, 2892, 2030, -3207, -1254, 3441, 443, -3551, 315, 3576, -982, -3485, 1574, 3205, -2105, -2733, 2538, 2117, -2928, -1508, 3268, 853, -3573, -252, 3660, -382, -3577, 907, 3317, -1501, -2967, 2116, 2491, -2736, -1936, 3226, 1382, -3542, -793, 3713, 141, -3687, 665, 3508, -1470, -3156, 2243, 2785, -2927, -2291, 3475, 1669, -3833, -889, 3935, 4, -3903]
1771c903M806K820n561j614O103L12o274R77O034k137n509L260M729m349l693
1786c999N254K523n858j305O109J55o077J025N755k260n090L379M252m318l351
1801c806N034K390n503j304N651J38n479J009N079k105m598L144L964m011l172
1816c569M603K231m894j223M966J69m936J000M706k100m280K989L731l624l078
1831c309M151K216m512j183M671J45m696Q11M618j653m408K425L947l071l275
1846c123L578K482m005j671M395Q26m683N2M721q59m528J586M178k360l658L167
1862I8K979l917k178M472J365m823n23M985m30m899J519M524k592l929L520L291
1878C462m366k510N025J511n339l80N334p87n105J987M705l150m116M153L272
$$ y = [-3903, 903, 3723, -1838, -3452, 2651, 2963, -3311, -2334, 3700, 1563, -3946, -686, 4043, -306, -3999, 1255, 3778, -2080, -3385, 2724, 2879, -3198, -2173, 3582, 1322, -3768, -389, 3863, -455, -3806, 1228, 3618, -1885, -3189, 2462, 2600, -2879, -1870, 3209, 1104, -3494, -350, 3614, -397, -3569, 1034, 3265, -1629, -2852, 2114, 2283, -2653, -1653, 3053, 953, -3327, -338, 3393, -231, -3309, 842, 3058, -1454, -2637, 2034, 2179, -2517, -1706, 2912, 1259, -3149, -724, 3223, 152, -3123, 455, 2937, -1068, -2739, 1656, 2482, -2201, -2149, 2572, 1713, -2815, -1229, 2949, 589, -3069, 98, 3077, -840, -3018, 1454, 2819, -2004, -2527, 2458, 2028, -2871, -1352, 3172, 580, -3349, 171, 3462, -904, -3414, 1611, 3122, -2217, -2597, 2737, 1950, -3155, -1168, 3537, 387, -3729, 424, 3696]
1893C696m828k301N196J213n363j6N325j264n047K455M531l401l876M108L067
1908C495m628k042M959Q62n027L19M918j369m667K294M260l114l559L729K642
1923C072m136j646M411O37m587L81M574j368m268K142L742k773l084L365K267
1938B729l888j332M218M29m332L58M269j090m000J816L528k512k882L090K206
1953B607l546j583L881R68m069k54M009m50l774J148L476j833l153K545K733l136
1969d31k207L535J591l766r03L906O4l953Q79L830j790l558K537L177l188k618
1985b895L737J807m106q37M296j72m330J138M256k070l951K909L350l574k498
2000b940M032J562m392n42M637n24m616J504M317k332l782L005L092l632k223
$$ y = [3696, -1132, -3433, 1763, 2976, -2387, -2403, 2922, 1658, -3389, -934, 3597, 196, -3680, 428, 3495, -1133, -3175, 1784, 2646, -2381, -2062, 2856, 1487, -3180, -886, 3374, 260, -3299, 430, 3072, -1064, -2710, 1701, 2338, -2249, -1868, 2706, 1338, -2930, -788, 2954, 181, -2903, 462, 2729, -1159, -2491, 1727, 2156, -2176, -1818, 2451, 1361, -2639, -823, 2705, 193, -2689, 401, 2607, -939, -2522, 1359, 2327, -1742, -1996, 2013, 1563, -2211, -1063, 2413, 580, -2573, -28, 2705, -431, -2638, 897, 2488, -1278, -2181, 1725, 1789, -2164, -1285, 2545, 755, -2803, -266, 2911, -277, -2895, 842, 2649, -1457, -2294, 2002, 1830, -2500, -1362, 2894, 824, -3127, -218, 3132, -442, -2940, 1092, 2654, -1738, -2280, 2357, 1833, -2783, -1279, 3038, 706, -3076, -71, 3021, -611, -2834]
2015b834M164J229m478k59M530o22m369J406M029k201l429K921K638l490j825
2030b590L889J036m132k19M131n99l873J420L376k103k835K757K230l322j526
2045b360L666P82l735n2L605o36l380J395L008k102k553K645K053k983j553L184
2061I84R89l283l24L230l99l043J005K856j524k656J973K375k366j903K600J380
2077A894k771p97K926J95l067M18L101j017k932J501K667j948k281K451J717k908
2093h51j051L222L80l393K42L433q86l282J584K872k240k304K808J686l277j045
2109b102L614L33l750M58L564j199l212J906K761k575k222L166J576l548q56L665
2125A579J46l584N71L416j363l058K103K590k687k036L059J465l279q15L350L2
$$ y = [-2834, 1330, 2559, -1919, -2178, 2352, 1730, -2639, -1233, 2796, 595, -2834, 87, 2725, -765, -2590, 1299, 2335, -1797, -2016, 2115, 1516, -2357, -937, 2439, 336, -2499, 258, 2488, -834, -2360, 1306, 2088, -1647, -1699, 1906, 1270, -2110, -715, 2293, 191, -2362, 283, 2336, -647, -2200, 984, 1973, -1310, -1634, 1596, 1197, -1846, -841, 2015, 491, -2165, -192, 2183, -183, -2086, 514, 1894, -877, -1674, 1252, 1447, -1620, -1202, 1899, 882, -2050, -549, 2118, 170, -2111, 340, 2057, -851, -1902, 1320, 1700, -1693, -1451, 1982, 1096, -2186, -602, 2270, 30, -2274, 534, 2220, -1057, -2102, 1512, 1845, -1905, -1447, 2117, 918, -2294, -388, 2373, -202, -2424, 742, 2318, -1230, -2086, 1579, 1725, -1859, -1288, 2128, 765, -2293, -190, 2400, -287, -2323, 736, 2201, -1078, -1893, 1457, 1489]
2141A489l241P53K988j453k679K004K312k477j801K789J170k913m78K891j96k840
2157a682Q71K710j474k415J922J998k203j526K400R97k578l72K649k22k600P01
2173h24K473j058k262J360J977j681j553J922J107k108p07K266L61k386j2K398
2189A273l99k252P69K034j144j806J552J541j966j209K270Q25k400m37K478n0
2205A079k475O51K336j230k089J734J799k137j458K464R83k650l79K692k94k604
2221a578R07K477j483k262J996J896k399j361K603P69k714j60K771m89k736J106
2237f57K567j627k215J985J784k266j286K528O57k671j1K688n44k579J017K373
2253A743j458k005J852J489k144r10K326L70k435J36K455o41k284J080J943j444
$$ y = [1489, -1752, -999, 1989, 536, -2143, -139, 2173, -304, -2105, 684, 1854, -1059, -1537, 1354, 1158, -1682, -811, 1899, 425, -1990, -68, 1930, -273, -1799, 601, 1598, -980, -1352, 1297, 1075, -1525, -824, 1649, 591, -1671, -311, 1666, -15, -1568, 354, 1461, -647, -1354, 912, 1273, -1113, -1125, 1273, 874, -1378, -609, 1425, 281, -1525, 27, 1568, -398, -1607, 663, 1488, -912, -1349, 1129, 1079, -1396, -745, 1591, 361, -1728, 6, 1805, -332, -1790, 674, 1657, -993, -1372, 1320, 1026, -1578, -671, 1806, 323, -1939, 57, 1953, -446, -1807, 796, 1565, -1149, -1309, 1462, 973, -1763, -657, 1910, 283, -1932, 53, 1837, -429, -1715, 813, 1470, -1201, -1212, 1476, 932, -1647, -630, 1743, 285, -1720, 132, 1621, -523, -1433, 893, 1263, -1172, -1036, 1419, 778, -1506, -426, 1517, 73]
2269G3j533J753J098k034o46K212J84k225K10K090n40j901Q84J639j213j338J513
2286B26J012j685p16J747M96j800j98J755j32j625M68J480p55j386J018J296j272
2303g1j106J444Q42j525n44J590K15j699J68J746n67j702Q88J576j155j369J404
2320A35J062j655o42J839J77j921K25J950n93j901R72J705j339j337J630R33j870
2337f30n13K073J04k179L20K122p29j928J114J641j462j313J799R26k071m98K180
2354I56Q0k136K85K029p15j812J151J485j520j137J795P62j926m05J989k0j916
2371a055M85J705q95j463J267J200j546r04J753N42j792j48J714k46j586O01J451
2388A083r44j277J226J024j358p61J400M72j396j82J386j41j335M09J245o00j157
$$ y = [73, -1460, 293, 1391, -643, -1289, 923, 1107, -1118, -908, 1182, 642, -1259, -375, 1264, 51, -1287, 226, 1238, -447, -1163, 584, 1080, -720, -918, 837, 705, -920, -452, 1028, 273, -1113, -95, 1201, -71, -1177, 267, 1109, -416, -960, 630, 845, -854, -686, 1060, 493, -1209, -321, 1255, 100, -1269, 135, 1197, -458, -1100, 739, 916, -1005, -780, 1170, 577, -1324, -352, 1353, 14, -1323, 307, 1240, -630, -1143, 930, 1034, -1145, -825, 1297, 568, -1360, -246, 1395, -67, -1380, 419, 1345, -726, -1224, 956, 1036, -1100, -815, 1214, 499, -1313, -162, 1323, -197, -1334, 461, 1223, -703, -1108, 881, 861, -1055, -570, 1135, 240, -1223, 44, 1244, -302, -1206, 547, 1089, -703, -851, 863, 617, -969, -368, 1083, 139, -1138, 88, 1112, -246, -1007, 393, 865, -531, -713, 673, 532, -803, -394, 851, 251, -906]
2405i06P27J051q33q99R66O51j054m17J144K25j245k1J317j85j293L89J182n66
2423B33j043P81Q92j041o85J273M43j398k04J426l8j409L36J322o92j152J003
2440D7R34j254p32J423N10j569j77J577j72j512N42J389q72j248J174J083j421
2457b78q34J573N02j607j63J612k05j576O04J482r58j292J198J059j356p67J481
2474D75L97j546J8J537m43j433P47J298r98j100J206P93j363m02J401M0j412K87
2492d98J392n88j292Q45J080j012p91J104N10j178k18J238n1j233K86J147m40
2509C01j007N37Q61o66o77Q09M76r08l18R45K04r73r7R81m1r41K22Q33l91p58
2529f08N43P09p15o40Q58N10r13l53R47J64r62N7J000l33r65N64R03p62p74Q95
$$ y = [-906, -179, 872, 39, -860, 106, 757, -297, -714, 430, 655, -590, -611, 706, 521, -772, -383, 799, 233, -810, -29, 863, -178, -863, 410, 853, -545, -749, 677, 639, -770, -434, 888, 196, -956, 47, 981, -273, -1005, 418, 928, -641, -818, 759, 587, -925, -383, 1006, 134, -1114, 60, 1143, -278, -1112, 461, 963, -644, -807, 805, 600, -976, -372, 1110, 152, -1140, 58, 1117, -239, -1006, 475, 872, -674, -656, 881, 438, -995, -248, 1050, 52, -1048, 158, 951, -412, -814, 587, 627, -785, -498, 894, 306, -986, -141, 939, -73, -864, 240, 750, -428, -646, 592, 541, -692, -406, 741, 301, -706, -169, 692, 26, -651, 158, 634, -274, -592, 353, 557, -416, -513, 468, 427, -514, -292, 541, 150, -608, -65, 644, -71, -711, 147, 657, -256, -609, 338, 502, -460, -403, 597, 264, -701, -137, 766, 4, -770, 125]
2549A25O10j005l73J119N2j138K12J159m69j131O79J049q76q75J054O03j183l30
2567g18J290N6j379K20J389n09j272P24J086r13q68J138N71j306k62J408k9j412
2585g86L12J306n46j159Q30R15j077o09J250K99j329k9J343k14j276N03J085p60
2603E8q56R56O07j110l98J212J73j237R2J118k99r77M91Q33o89o68Q35N16r26
2622b69l43R21K05q84n6Q48j24p94L07P26m27o70N35O17o09n44O65M13p12k34
2642d29P21R5p74O0Q16k10q31L51P64m78o41N67N09p01l52Q39J38r09M5R27j78
2663C29r29L56Q61n33p33P46N35q91l87J036K17j100m7J138j74j086M16R55o23
2682H6q36Q46O83j042m97J166K72j188l7J132k24j069N08R73p93p93R76N96j094
$$ y = [125, 735, -270, -643, 476, 528, -610, -398, 761, 292, -839, -160, 889, 13, -862, 192, 795, -388, -718, 572, 628, -751, -531, 858, 349, -923, -199, 887, -26, -894, 244, 815, -491, -753, 655, 626, -786, -474, 832, 286, -873, -43, 872, -205, -814, 436, 735, -594, -623, 720, 506, -770, -267, 818, 58, -798, 158, 765, -345, -743, 469, 642, -595, -503, 615, 316, -661, -170, 663, -26, -694, 141, 657, -269, -612, 309, 514, -370, -426, 422, 298, -496, -189, 537, 110, -560, -25, 592, -17, -561, 104, 517, -195, -429, 292, 387, -387, -327, 489, 279, -552, -201, 563, 85, -556, 11, 520, -181, -533, 306, 444, -465, -420, 507, 329, -600, -244, 617, 84, -649, 97, 632, -259, -646, 390, 607, -493, -540, 598, 424, -662, -246, 709, 86, -750, 96, 779, -263, -760, 406, 678, -510, -547, 585, 361, -708, -200, 773, -20, -813, 163, 759, -335]
2701c35l70J138J18j141J88J087n12r32P42P90r10o20J023L99j073j25J051j56
2719C62r60L89Q75n80p90P53O25q39m08Q38K17q24l0Q05j63p91L25P32m36o31
2739e31M67N38n12m19N73K61o12j27O38K5o51M6O61j01o42K14N55l10m52M09L70
2760D00n07l08O28J90o63q9O68l5o28J52N94l21n41M94M66o20l78O81L01p52j66
2781d34P84l9p75K39P42l95p18N42O69o87n50P82L92q54j74Q80l2q99K31R27m58
2802A73q36O30O96p45n11Q54K80r42l0R74k22r49M37Q51n99p13P28N18q64k67
2822e37R42qr36J96R21l62q58N40P05o83m83P65K70q07r2Q55q3q41K33P81l63
2843A55o30M42M93n25l70O12K39o75j12O72K2o33M8N89j42n30K50M48l62l69M36
$$ y = [-335, -705, 433, 551, -590, -402, 685, 173, -759, -17, 773, -137, -757, 266, 665, -408, -533, 518, 362, -598, -209, 666, 86, -704, 49, 674, -165, -573, 265, 482, -342, -372, 433, 270, -521, -196, 536, 100, -531, -64, 474, -38, -457, 116, 377, -235, -362, 276, 301, -350, -304, 357, 256, -386, -172, 383, 73, -379, 30, 400, -107, -415, 213, 403, -260, -349, 319, 284, -344, -192, 402, 81, -460, 34, 500, -120, -498, 183, 484, -268, -434, 350, 311, -464, -225, 517, 122, -596, -54, 615, -72, -622, 160, 552, -302, -476, 404, 372, -527, -296, 631, 173, -663, -33, 663, -82, -593, 261, 541, -401, -431, 543, 321, -628, -191, 660, 61, -652, 76, 594, -270, -537, 405, 397, -539, -343, 578, 216, -642, -102, 603, -80, -563, 202, 472, -335, -427, 428, 345, -496, -263, 518, 155, -475, -33, 460, -65, -435, 177, 416, -259, -371, 301, 323, -310, -262, 327, 185, -345, -95, 353, -9, -378, 58]
2864E8L04m73k60N01J91n33n6N04p4m68J79M58k87m41M02L83m35l15M65K30n07
2885a74r6N45l3n90J72N87k55n83L38N34m37m50N28L39o40j81O87O2p47M4P90
2906D40k00p48L67O24m96n01O30L69p63k02Q40M8q83J66P98l01p15M86N90o60
2926a11m21P96K37q66l7Q52j28p96L00P05m99n74O64L94p75k28Q01R9q08P3P59
2947D37k66o44M25N11n48m14O36L11o78j75O55M7o16R4N65k10n05L16M69m19l79
2968c88M54L05m63k06M62R0m60L5M45j40m30K15L95k52l69K96L00l59j85L91P0
2989B06m07j3M52n8m92J49M57k12l92K74L24l33k71M33K03n04j19N35N9n58J5
3010b52N56j05n31K39M74l71m10M72L53n64k75O42J45o63J0O30j65o03L33N49
$$ y = [58, 362, -111, -371, 130, 321, -212, -268, 236, 162, -306, -127, 331, 44, -397, 5, 388, -47, -362, 103, 333, -174, -270, 275, 242, -348, -176, 411, 156, -427, -89, 445, 8, -442, 86, 425, -215, -396, 291, 353, -394, -350, 440, 240, -508, -141, 483, -13, -514, 116, 485, -278, -480, 360, 408, -475, -309, 489, 188, -527, -41, 549, -111, -532, 264, 501, -365, -402, 450, 322, -474, -174, 531, 32, -542, 122, 516, -259, -487, 314, 413, -395, -322, 437, 171, -473, -48, 463, -85, -499, 137, 448, -230, -405, 250, 297, -319, -225, 340, 130, -375, -59, 410, -9, -388, 66, 371, -92, -298, 164, 254, -206, -171, 274, 134, -296, -81, 314, 62, -307, -11, 289, -70, -255, 136, 206, -201, -214, 238, 180, -312, -163, 294, 82, -310, -36, 288, -45, -316, 117, 320, -184, -303, 232, 291, -267, -252, 304, 199, -332, -93, 381, 10, -400, 72, 425, -139, -414, 228, 373, -290, -280, 350, 185, -418, -85, 464]
3030D64m89m74O08L49o76j97O86L2o88J51O80l55n99N18M82o01l59O57K20o91
3050b82k7O93j66o49L40N64m53m82N34L93o05k36O16O2o08P8N95k06n73L18N03
3071D09l81m17M23L00m43j91M71Q1n14M6M91j15m46J56L99k11l30K81K42l32j38
3092b19L66P7m01pL97l6l67R0L28j69k63K27K24k87k02L36J59l68j21L68O4l69
3114a73mL66p3l73J60L65k37l49L01L26l36k95M01K07m59p4M95n5m89J23N25k36
3136A16m93L51L97m14k89N08J27n42k8N83j04n88K55N17l65m19M50K83n20j53
3156c28N91po06J40N74k62m96L53M04m47k69N07J46n57rN72j00n36J93M78k75
3177F6m03L64K89m22j84M58J17m86k9M85p0m20J29L54k05k95K73K35l39j63L49
$$ y = [464, -25, -499, 109, 458, -218, -415, 271, 303, -385, -234, 446, 91, -508, 10, 492, -109, -468, 189, 409, -282, -309, 384, 218, -431, -91, 473, 20, -462, 72, 465, -140, -376, 240, 302, -306, -228, 367, 161, -412, -94, 409, 28, -389, 34, 334, -109, -300, 171, 252, -262, -216, 275, 160, -286, -130, 269, 58, -272, 9, 251, -81, -219, 147, 224, -177, -184, 213, 177, -190, -100, 228, 59, -204, 23, 247, -40, -242, 94, 253, -115, -236, 132, 196, -173, -177, 189, 116, -257, -97, 268, 31, -318, -17, 309, -27, -322, 79, 286, -173, -247, 248, 193, -296, -173, 352, 116, -377, -26, 371, -43, -332, 176, 303, -239, -267, 316, 212, -376, -121, 396, 31, -388, 62, 345, -175, -328, 263, 256, -350, -210, 364, 102, -394, -41, 363, -84, -353, 154, 300, -257, -266, 306, 206, -330, -137, 341, 66, -337, 27, 316, -106, -290, 168, 285, -201, -230, 255, 185, -235, -106, 248, 43, -252, 21, 256, -83, -246, 103]
3198A03J06l52m7L32k3l15J06K76j83k27K47J89k67j66K85J26k86n2K79qk77P7
3220g7K70r9l01J53K84j80k58K09K09k32j79K80J29l42o0L73J0l91L5M01j10l87
3242b63J92L34k94k61L72J97m42j28M91L5n02Q1M70k04m00L27L36m21k51M93J47
3263C09n34j4N13q6m65J88M26l34l46M41K41m97j40N10L7n08O7M83j91m40L29
3284a1L39l82k88M30K03m41j29M59J3m31R6L95j79l51K47L18l00k50L19J71l20
3305i2p8L19ml12P5L07j52k70J91K33k13j74K15J02k24n7K61k9k55O1K40p3k42
3328a71Q4K27j20j84J68J23j79r7K15R0k41q3K61N5k57k5K63l0k60R3K73j74k57
3351b26K47K32k87j97L12J54l66m6L66n6l72J49L67k41l33K95K80l64j76L88O7
$$ y = [103, 209, -143, -190, 142, 119, -196, -90, 186, 3, -224, 23, 212, -55, -221, 64, 190, -96, -148, 131, 123, -154, -77, 193, 94, -207, -54, 230, 50, -208, 1, 210, -22, -201, 79, 208, -134, -194, 179, 189, -202, -167, 234, 124, -263, -71, 263, -31, -292, 80, 277, -165, -293, 198, 233, -269, -188, 282, 78, -322, 5, 341, -80, -331, 162, 309, -225, -239, 274, 188, -277, -89, 337, 3, -343, 98, 339, -158, -298, 212, 249, -259, -192, 291, 100, -340, -11, 328, -54, -342, 88, 291, -150, -279, 180, 193, -238, -142, 253, 74, -277, -30, 288, -12, -262, 57, 228, -92, -170, 149, 145, -167, -92, 215, 63, -207, -16, 217, 4, -170, 45, 147, -77, -134, 127, 98, -157, -96, 144, 71, -171, -87, 140, 20, -164, 4, 127, -52, -149, 66, 156, -85, -168, 93, 148, -109, -134, 129, 99, -161, -68, 205, 31, -226, 21, 253, -34, -231, 81, 235, -131, -177, 189, 133, -239, -90, 277, 36, -297, -2, 278, -86, -262, 126, 193]
3372A93l94L0M07j43l85K39L44l07k60L55J58l83n7M08m9m13J53L98k33l45K86
3393BK74l15k07L74R3l94j0M04p4l79J14L60j63l18K21K33k66j52K80J04l23l6
3415a78L26k5l05R3K43j02k03J40J71j98j21K37P7k35m8K32J7k03J8J92o5j74
3437a11J13J51j37j54J54J59j75j49J86Q9j79o9J87M3k34pK81o4k78R4K86j31
3459E5k67J87K40k66j68L26J07l69l3L85j8m02J16L62j99l13K94K38l57j69L99
3480A48R8m26lM26j12l65J88K94k64k48L49J63l91q4M01ll87Q1L54j62l14K56
3502aK58l35j89L68J33l73o3L75j3l49J01L29j90k81K33K48k70k06L01J34l05
3523i5n4K82j6k66P1K46j08k49J59K07j88j48J74J09j99m9K06jk14M8J87l8j93
$$ y = [193, -201, -171, 236, 93, -292, -53, 291, -16, -276, 79, 237, -146, -203, 205, 156, -257, -104, 294, 61, -284, 2, 276, -39, -246, 128, 221, -173, -183, 221, 147, -232, -118, 242, 79, -239, -18, 215, -51, -203, 77, 181, -142, -178, 148, 123, -182, -89, 154, 52, -151, -11, 160, -38, -159, 78, 155, -80, -128, 104, 121, -82, -64, 128, 63, -111, 2, 153, 16, -138, 16, 175, 0, -149, 37, 126, -53, -122, 65, 108, -126, -133, 148, 84, -194, -100, 186, 55, -212, -25, 215, -51, -219, 107, 214, -155, -188, 197, 179, -223, -107, 255, 56, -257, 37, 275, -82, -251, 148, 246, -180, -183, 243, 131, -234, -46, 248, -16, -264, 85, 248, -143, -227, 174, 171, -216, -135, 219, 57, -257, -1, 257, -78, -267, 101, 234, -139, -202, 173, 160, -189, -88, 241, 51, -230, 3, 251, -19, -225, 76, 210, -95, -149, 133, 117, -149, -78, 168, 60, -189, -30, 177, -11, -159, 15, 124, -75, -124, 82, 81, -133, -85, 102, 64, -129]
3546a29O2J84p2j65J12J21j24r9J46J08j90r4K18P3k43k1K38rk42N9K51j41k45
3569b02K00K27k67j82K86J44l34o4L58l8l54J23L45k01l19K66K69l16j96L62J14
3590B21l93J1L64p7l70J65L45k40k95L11J98l12j14L34L2l74O6L73j57l35K17
3611c0K78k46k38K87J69l32q2L56nl60N4L62j18l37J80K73k27k03K70J42k96q9
3633a92L25L5l20J9L05p3k52J04K17j49j87K15J35k25j13K42P4k30m2K15Mk12
3655a05M4J98j06j82J12J90j42j82J70J66k17j12K18P7k48k8K87k2l00P3L09j37
3677F3k70J77K59k40k07L22J26l76m6L99j7m27J05L91j73l44K64K72l34k12L98
3698A30J18m19n8M37m3m14J30L67k08l11K75K59l55j71L89R8m09nL88o6l50J56
$$ y = [-129, -67, 117, 45, -120, -8, 113, -11, -110, 36, 144, -46, -140, 78, 151, -92, -113, 125, 116, -126, -67, 184, 43, -202, -2, 225, -42, -224, 62, 206, -128, -192, 166, 128, -226, -103, 242, 41, -278, -12, 257, -59, -255, 107, 221, -172, -161, 203, 126, -244, -79, 266, 26, -269, 42, 240, -72, -186, 148, 180, -194, -128, 245, 88, -247, -30, 248, 2, -236, 51, 220, -112, -194, 162, 157, -203, -149, 213, 95, -242, -62, 211, -16, -219, 51, 193, -103, -192, 133, 168, -152, -133, 172, 99, -153, -49, 168, 19, -168, 47, 182, -43, -156, 86, 160, -70, -112, 103, 107, -105, -61, 137, 31, -151, -39, 151, 9, -173, -3, 163, -54, -166, 52, 129, -119, -147, 140, 118, -182, -109, 200, 63, -207, -30, 229, -11, -218, 104, 230, -146, -192, 207, 190, -237, -132, 259, 86, -258, 6, 278, -56, -268, 130, 248, -171, -229, 208, 165, -249, -119, 248, 40, -271, 4, 263, -92, -263, 126, 224, -185, -190, 198, 132, -218, -62]
3720f2L19k53k71L18K21l64j26L57Q4l85LL83r4l65J90K97k28k86K91K30l29j52
3742b22L26O9l24j0L32n9l28J30L00j79k55J91K19k04j63K26J09k59m7K78Jk75
3764a44K7K87p3k57R0K52j53j88J81J64k19j60K69J28l21n4L08Ll06N6L03j27
3786F6l00K08K76k92k21L33J58l66j01M05Jm03J17L89j95l74K77L37l34k80L99
3807A00J81m30n6M35m0m27J26M07j97l91K90L03l36k20L52J36l89n0M16n3m12
3828b55J49L70k21l18K58K65l26j83L79J00m05j1M12n5l95J22L75k05l15K80K37
3849B58l13j75L50J20l84m2L79k5l58R9L04j45k76K03K33k57j89K87J32k91r4
3870a84K97M3l11J7K98p6k77J24K58j70k45K18K23k52j77L02R4k95l8L22k0l47
$$ y = [-62, 257, 4, -267, 51, 272, -92, -218, 139, 223, -162, -159, 224, 130, -235, -45, 252, 24, -262, 29, 259, -70, -222, 104, 173, -151, -161, 171, 112, -216, -86, 214, 35, -220, -29, 190, -14, -177, 49, 158, -101, -148, 130, 131, -144, -117, 170, 97, -160, -70, 182, 29, -159, 22, 186, -33, -193, 76, 204, -117, -171, 137, 140, -166, -110, 193, 66, -234, -26, 250, -42, -263, 70, 228, -138, -239, 166, 167, -236, -119, 270, 75, -299, -22, 315, -19, -299, 100, 281, -149, -205, 230, 190, -237, -111, 296, 99, -292, -2, 301, -35, -255, 97, 233, -156, -206, 210, 157, -255, -106, 264, 43, -275, -17, 248, -78, -261, 118, 218, -187, -198, 214, 159, -236, -114, 261, 56, -259, 21, 258, -55, -230, 120, 240, -144, -186, 193, 168, -190, -91, 213, 68, -208, -5, 228, -29, -218, 69, 201, -90, -184, 113, 156, -155, -138, 160, 84, -193, -69, 189, 19, -226, -8, 215, -37, -214, 88, 182, -113, -151, 171, 151, -196]
3892a96J06L34j62l14K32K62k80k17L39J42l97n3M17l8m26J13M08j82l86K80L00
3913B82l46k20L99J34m26p6M53j5m48J25M09k00l57K87K84l41k19L94J56m36n2
3934b13M38m5l97J11L92k08l53L04K71l56j96L70J34m06n2M12n7m01J45L62k21
3955C4l30K98K80l33k36L81J30l84k6L68k3l80J02L71j75l30K37K69k56k29L03
3976G1J60l25r3L58J3l48L3L45r2l26J43L02k06k62K61J95k97j48L17J16l73m5
3998b01L80k6l76J12L39j81l15K67K81l39k10L84J29m11l9M16l0m18J20M10k25
4019F7l61L10L07l72k37M15J57m54o4M73n2m59J49M21k21l98L13L33l90k35M02
4040A04J61m42n7M54l3m69J39M37k35l65K96L20l60k28M08J41m58k8M71o7m36
$$ y = [-196, -90, 244, 82, -232, 0, 262, -18, -235, 104, 246, -151, -204, 213, 175, -251, -138, 270, 88, -298, -18, 282, -64, -284, 115, 249, -177, -253, 200, 185, -263, -138, 271, 71, -286, 1, 285, -56, -275, 119, 275, -161, -213, 225, 180, -217, -106, 286, 78, -275, 29, 300, -56, -252, 118, 252, -154, -206, 206, 149, -252, -107, 255, 34, -296, 2, 282, -51, -287, 94, 224, -160, -186, 182, 159, -221, -119, 252, 77, -253, -16, 253, -3, -232, 71, 231, -94, -187, 171, 184, -164, -131, 214, 122, -204, -61, 241, 35, -227, 34, 229, -68, -216, 101, 217, -156, -201, 179, 153, -223, -111, 228, 47, -268, -1, 280, -59, -269, 115, 244, -167, -206, 210, 180, -238, -118, 292, 67, -294, 16, 323, -49, -286, 129, 286, -168, -232, 241, 189, -270, -121, 300, 79, -319, -6, 327, -63, -298, 104, 265, -177, -234, 220, 187, -282, -143, 294, 59, -306, -10, 310, -50, -278, 130, 271, -187, -215, 256, 189, -247]
4061b47J37M21k31l84L29K90l72k12M00J32m34l8M29l9m32J20L97k02l38K46L02
4082B74l14k42L82J57m02r3M02L2m13N9L99j42l63K14L26k78k63L10K38l65j56
4103b38M00O3l97OM02q6l91J63L75k38l47L27K52l64k01L96J17m33l0M61q3m41
4125b87J77M18k51l75L21L03l95k18M57J29m86l7M95n6m80J68M46k49l88L35L14
4146C41m04k33M46J59m99m2M90n8m73J47M42k46l81L15L33m08k39M47J37m68o1
4167b55M96n3m84J58M37k47l92L37L23m04k32M43J58m68m4M83p2m37J31M30k18
4188I0l93L08L25l73k40M08J47m20p5M45k5m47J20M22k01l87K51L43l10k74L55
4209F9K01m10j10M32L5m47M6M43j32m12K23L68l00k91L44K36m16j44M61O1m78
$$ y = [-247, -110, 311, 80, -304, 25, 315, -57, -269, 131, 263, -171, -209, 220, 181, -251, -131, 266, 64, -274, -28, 274, -40, -282, 100, 257, -145, -238, 164, 196, -217, -158, 241, 99, -264, -50, 276, -2, -265, 45, 283, -82, -238, 162, 225, -172, -166, 236, 150, -241, -78, 297, 59, -288, 39, 291, -73, -274, 122, 239, -194, -224, 237, 154, -287, -110, 308, 57, -318, 3, 306, -89, -307, 150, 279, -207, -244, 251, 195, -285, -117, 329, 80, -308, 27, 341, -63, -296, 150, 309, -190, -232, 258, 200, -273, -126, 316, 70, -311, 4, 337, -71, -310, 137, 274, -194, -255, 241, 188, -296, -138, 299, 52, -340, -3, 320, -84, -316, 127, 285, -183, -227, 256, 184, -253, -122, 308, 90, -303, 5, 330, -43, -283, 125, 272, -148, -223, 222, 197, -250, -130, 292, 91, -296, -45, 298, -12, -286, 69, 270, -140, -250, 182, 217, -230, -184, 259, 127, -285, -62, 306, 6, -285, 59, 295, -121, -265, 196, 257, -221]
4230b21N0M61j29m38K10L99l02l58L98K54m34j83M71Q7m98J6M94j14m89K23M22
4251C19k96l77L76L10m42k10M87J12n10MN04j00m84J95M60k96l88L81L07m40k13
4272c01M82J22n20j2N33j20m82K03M38k97l80L71L10m59j91M77J03n11JN14j12
4293A69m92K06M39l01l65L75K80m11k11M73J23n05j4N08r8m56J58M35k39l89L26
4314A1L26l96k31M30J50m61o8M81k9m83J33M30k13l93K94L32l59k71M12J96m65
4335a74r3M70Mm76R5M61j91m27K92L72l68k81M19K07m61j22N12%n04J06M79k07
4357A13m21K68L92l56l22M20K19m68j14M83K5n11P4N11j82m55K56M12l61l26M17
4378G4K51m80j44N07L6n22Q6M86j64m65K75M09l61l26M38K24m74j30N09M2n36
$$ y = [-221, -171, 290, 161, -277, -67, 332, 30, -328, 70, 324, -110, -293, 178, 265, -233, -217, 277, 163, -326, -103, 319, 23, -354, 22, 332, -110, -320, 167, 279, -231, -227, 277, 177, -307, -112, 348, 52, -336, 45, 352, -88, -301, 181, 303, -217, -229, 304, 184, -298, -95, 343, 46, -334, 37, 347, -112, -303, 174, 277, -234, -233, 281, 169, -323, -117, 322, 21, -344, 31, 311, -100, -311, 162, 285, -220, -234, 274, 176, -280, -122, 313, 74, -315, 11, 337, -59, -290, 140, 290, -171, -239, 242, 213, -270, -137, 293, 80, -313, -19, 313, -46, -317, 95, 291, -174, -267, 203, 207, -269, -174, 287, 96, -331, -39, 333, -35, -316, 103, 310, -151, -273, 239, 239, -265, -159, 320, 113, -308, -40, 352, -4, -326, 94, 313, -155, -269, 214, 239, -272, -198, 313, 131, -324, -68, 344, -17, -343, 74, 325, -155, -299, 208, 244, -278, -192, 294, 130, -335, -60, 349, -12, -338, 100, 324, -150, -280, 229, 271, -265]
4399b65R0M90j79m52K77L96l63l32M36K37m89j35N10K6n07Q6M74j71m71K80L99
4420C37l59l13M11K29m46j48M84N8n02N8M87j52m53K40L98l03l54L92K74m45j71
4441b78M69O7m61NM86j21m70K23M22l10l60L69K80m24k04M77J02n22J4N05j20
4462A49m78K10M42k88l92L85L02m29k27M95J23n15j9N22p7n15J93M69k88m07L66
4483B1L32m40k40M97J42n22k9N15p5n12J94M64k96m13L82L27m51k36M81J50n23
4504b32k6N23q9n12K05M67k93m10L82L42m50k47N07J37n31j0N25r4n22K08M81
4525C61l10l87L67L23m39k27M77J27m99m4N32q7m97J78M49k59m13L35L39m20k40
4546c34M61J45m83m5M95m3m91J53M54k40m06L25L31l88k55M47J70m88o4N13m8
$$ y = [-265, -175, 315, 136, -316, -39, 357, -6, -338, 98, 335, -154, -289, 221, 247, -260, -174, 300, 129, -342, -62, 337, -22, -335, 76, 305, -141, -289, 195, 253, -249, -191, 296, 144, -309, -69, 329, 26, -328, 64, 338, -107, -278, 191, 258, -203, -198, 288, 167, -303, -80, 342, 32, -328, 41, 321, -103, -307, 170, 272, -250, -236, 269, 149, -329, -119, 323, 35, -357, 28, 330, -99, -326, 169, 292, -223, -242, 280, 203, -312, -119, 350, 62, -345, 21, 353, -87, -327, 170, 312, -210, -239, 276, 201, -311, -117, 347, 51, -362, 20, 347, -104, -340, 141, 291, -232, -258, 265, 176, -336, -131, 336, 43, -367, 15, 357, -93, -340, 167, 304, -227, -237, 288, 194, -328, -120, 361, 51, -336, 31, 354, -85, -312, 165, 292, -207, -251, 281, 194, -303, -125, 324, 65, -348, -13, 326, -94, -334, 127, 272, -211, -256, 239, 196, -295, -142, 312, 72, -334, -9, 322, -66, -321, 126, 296, -192, -256, 257, 209]
4567B09m70J30M53k13m41L16L59l84k74M30J83m84q5M85Nn04J29M44k06m14K93
4588c9L67l69l03M34K13m82r5M88%m95J11M82j86m58K98L75l69k93M14K31m69
4609a45j34N07K0n11J03M78k05m35K78L92l68l28M53K08m91j05N06On21J01M95
4630C04j91m66L03L91l78l00M28K19m74j25N23nn03J09M66j84m46K88L87l71k85
4651c10M12K07m57j17M77K6m82P0M72j91m18K61L66l34l08L98K27m49j31M71L0
4672B20m60M8M62j59m27K51L81l26l13L83K38m26j50M69O2m82M9M77j47m40K33
4693e7L87l12l25L63K62m29j53M40P7m68K7M48r6m60K04M04k90l40L51K74m09
4714a02j92M52R7m76MM74j01m52J89M23k73l70L58K95m27j89M60J19m94j2M99
$$ y = [209, -261, -131, 322, 109, -332, -16, 343, -41, -315, 115, 298, -186, -271, 214, 219, -285, -156, 288, 82, -332, -39, 328, -41, -344, 90, 303, -179, -274, 214, 214, -281, -170, 312, 126, -332, -34, 341, -28, -321, 93, 324, -145, -279, 228, 248, -263, -160, 318, 113, -322, -44, 348, -20, -348, 105, 313, -178, -283, 223, 229, -292, -191, 304, 113, -353, -50, 341, -37, -337, 91, 310, -164, -289, 234, 229, -274, -165, 301, 117, -329, -41, 346, -25, -310, 102, 309, -148, -265, 212, 238, -244, -174, 298, 107, -311, -50, 316, -18, -326, 72, 299, -150, -281, 190, 220, -240, -192, 270, 111, -316, -65, 316, -10, -323, 60, 298, -128, -278, 191, 253, -229, -180, 297, 150, -290, -57, 330, 18, -307, 56, 318, -111, -264, 176, 253, -215, -188, 260, 164, -296, -92, 312, 22, -318, 33, 307, -102, -294, 158, 255, -221, -217, 257, 156, -296, -107, 316, 43, -327, 31, 326, -101, -290, 170, 289, -205, -217, 282]
4735B82j00m62J91M31k89l60L44L04m34k16M79J05m87j5M85q8m71J81M41k84l76
4756c39L61K88m04k10M46J31m81lM63q1m45J75M13k66l52L19L02l90k14M36J18
4777B67m44j7M49o1m61J66M14k55l56L17K80l56k38M31J25m47m5M66p8m21J35
4798a29M16k28l69L08K99l72k16M17J35m33n8M51k1m37J21M07k20l47K75L11l35
4819b5k63M11J64m39p3M38j8m39J15M06j94l82K87L20l53k51M00J67m32r0M59
4840B08j5m67J24M34k13l91K98L35l62k54M17J71m53p6M78k0m77J23M43k12l89
4861b98K93L29l61k47L95J76m46p1M44k1m47J19M12j87l91K75L26l62k28M04J36
4882B50m19o0M27j8m29J07M25k13l58K71L04l37k30L89J66m26p3M30km21R7L82
$$ y = [282, 182, -280, -89, 342, 53, -307, 37, 341, -93, -309, 170, 275, -212, -227, 258, 170, -301, -120, 321, 37, -339, 22, 310, -94, -304, 142, 273, -208, -211, 252, 171, -274, -99, 314, 48, -304, 15, 317, -73, -287, 149, 267, -177, -194, 255, 194, -267, -101, 313, 58, -298, 19, 299, -57, -295, 136, 261, -186, -231, 235, 157, -264, -129, 287, 59, -310, -2, 297, -75, -291, 126, 261, -172, -230, 221, 200, -237, -116, 291, 71, -276, -1, 310, -25, -288, 123, 287, -152, -225, 213, 195, -244, -129, 277, 83, -299, -12, 308, -45, -296, 104, 271, -161, -251, 208, 193, -274, -150, 284, 71, -320, -22, 313, -49, -303, 114, 285, -168, -244, 234, 214, -263, -140, 303, 91, -298, -5, 324, -37, -284, 111, 287, -159, -230, 214, 193, -254, -135, 277, 90, -301, -26, 300, -62, -290, 114, 250, -169, -229, 198, 180, -249, -142, 283, 70, -288, -17, 287, -50, -280, 109, 275, -151, -224, 206, 204, -217, -120, 262]
4904B62j74l49K46L17l37k32L65J74m02r4L95K7m23P3L98j55l54K13L21k83k79
4925b91L40K02l77j04L92L8m09M4L96j15l76J96L50k77k72L21K09l55j51M03P1
4946B35m31M6M03j23l85J82L74k81k98L32K18l82j51M10P6m33LM32j00m07J86
4967i4L66k60l19L41K41l81j58M08R2m34J6M17r2m02J70L76k63k93L20K35l63
4988g7j60L82P7l99J5M00j01m00J96L25k42k89L07K30l49j66L94O0l92RL98j11
5010A07l61J74L36k42k90L01K30l43j53L71P4l75jL84q8l52J54L32k14k98K80
5031B6K33l33j49L43Q5l55k8L67n2l55J25L34k05k80K50K31l04j89L46J19l82
5052a73j8L68l3l63J09L49j91l10K70K50l21j80L64J11l72n5M02l9l91J30L55
$$ y = [262, 88, -261, -15, 302, -35, -267, 98, 272, -130, -224, 171, 198, -225, -152, 246, 91, -263, -50, 271, -12, -291, 49, 251, -126, -230, 162, 200, -209, -165, 231, 116, -260, -64, 286, 9, -263, 58, 267, -88, -239, 164, 235, -196, -150, 253, 130, -255, -73, 301, 20, -278, 54, 272, -110, -261, 149, 225, -208, -205, 227, 127, -280, -94, 272, 12, -307, 34, 275, -106, -264, 144, 236, -198, -182, 235, 143, -259, -89, 287, 24, -269, 51, 286, -77, -237, 145, 222, -177, -162, 238, 137, -263, -67, 258, 16, -273, 34, 264, -85, -251, 143, 203, -189, -180, 218, 107, -254, -80, 256, 14, -276, 25, 255, -88, -241, 130, 204, -171, -172, 212, 124, -228, -74, 258, 44, -254, 26, 259, -74, -223, 120, 205, -150, -178, 189, 137, -218, -93, 241, 36, -244, 6, 237, -67, -256, 90, 209, -173, -191, 177, 144, -219, -110, 239, 48, -262, 8, 258, -63, -243, 121, 232, -140, -195, 207, 168, -223, -93, 262]
5073B62k00l11K59K63l23k04L65J29l93m0L90l9l84J15L58j99l31K90K54l25j91
5094b55L52J23l73m4L94m5l89J35L40j78l02K59K45l16j81L51J03l59k8L82o2
5115A52l74J30L47k09k91K73K30l17j64L30J06l75k7L79n0l64J14L33j80k89K35
5136a1K42k98j72L31J07l40m5L48rl41Q8L25j73k67K13K28k49j86K85J43l17p9
5158a77L36Jl24O2L10j22l07J91K65k50k11K87J57l20j07L54K2l58N1L67j48l13
5180b34J90K84k44k36L02J76l45r2L54J4l56N9L57j27l27K09K75k61k28K94J77
5201B41l43q1L67kl69O5L36j24l19J96K66k65k15L07J66l54q0L59J7l63O8L47
5223B20j44l11K21K54k72k02K94J70l38q7L70Kl56P7L31j55k78J97K54k63k02
$$ y = [262, 62, -249, 10, 273, -50, -254, 111, 240, -153, -193, 197, 158, -226, -111, 247, 48, -283, 7, 261, -64, -255, 97, 220, -153, -197, 197, 152, -237, -102, 238, 60, -242, 17, 262, -54, -235, 116, 219, -140, -168, 214, 152, -222, -92, 255, 46, -245, 28, 258, -59, -223, 107, 213, -162, -189, 190, 140, -224, -110, 223, 43, -246, -11, 231, -67, -239, 92, 199, -141, -186, 162, 153, -188, -100, 225, 52, -215, -2, 226, -23, -209, 76, 219, -98, -177, 159, 160, -164, -102, 208, 86, -221, -30, 235, -15, -226, 61, 218, -102, -209, 145, 167, -191, -140, 227, 79, -234, -44, 240, -4, -240, 62, 238, -107, -199, 155, 169, -187, -128, 229, 102, -225, -16, 259, -2, -230, 64, 241, -102, -183, 184, 182, -187, -122, 214, 90, -229, -33, 233, -32, -247, 60, 226, -128, -208, 151, 168, -195, -127, 220, 76, -235, -14, 240, -32, -234, 60, 230, -108, -195, 175, 177, -179, -102, 229, 74, -204, -7, 247, -16, -218]
5244b18L03J36l25o2L13J6l23N1L07j31k88J88K35k16j96K47J60k98p5K97K9l13
5266a63M7K90r6k69J42K64k07k13K47J67k82r9L02M3l12J6L20p9l14J55K64j90
5288C3k46K63J74l04j23L25M9l34NL35p5l28J45K87k07k32K65J75k98j29L41O2
5310A83l60L5L30q9l04J58K67k09k35K80J82l16j03L23M6l45L6L25j06l20J88
5331c4K72k43k30K89J58l14j01L29L7l53N2L32j32k95J91K69k43k16K93J36l16
5352a19n5L13J7l34O0L20j28k94K01K42k24j90K45J41k75q4L08Jk92L6K82r9k59
5375a87J38K32j91j87K32J42k60q3K66N3k99J2K85n8k81J25K46j79k01K21J78
5396B04k73j26K98O2k88j6K99l9k91J10K78j85k42K43J71k61j34K91Q1l18lL18
$$ y = [-218, 85, 221, -104, -166, 147, 163, -160, -109, 198, 67, -221, -33, 202, -14, -210, 37, 197, -101, -176, 121, 150, -163, -116, 174, 78, -191, -49, 215, 8, -205, 42, 209, -73, -172, 130, 173, -139, -123, 197, 118, -196, -41, 223, 33, -213, 50, 224, -80, -203, 122, 171, -163, -158, 177, 102, -226, -81, 206, -1, -233, 32, 207, -91, -220, 121, 183, -177, -142, 188, 99, -205, -47, 220, 11, -224, 56, 238, -78, -181, 142, 188, -157, -121, 204, 98, -222, -34, 238, -5, -235, 54, 212, -102, -203, 126, 163, -190, -138, 194, 62, -233, -42, 227, -16, -232, 61, 197, -119, -174, 139, 156, -178, -118, 202, 74, -220, -19, 223, -1, -191, 54, 195, -80, -164, 144, 145, -147, -111, 171, 72, -187, -49, 183, -8, -195, 37, 179, -81, -164, 102, 155, -144, -132, 153, 95, -186, -61, 185, 6, -195, 26, 204, -69, -195, 103, 165, -123, -139, 160, 121, -170, -60, 218, 33, -209, 34, 205, -56, -190, 101, 182, -136, -139, 179]
5418A79p6l06J42K64j81k50K33J97k81j32L10N9l17nL30p2l08J47K79j99k39K61
5440C5J89k99j28L35N0l51L5L39r8l05J45K81k12k42K95J48l01j01L25K4l34L4
5462a36L25j01l04J64K60k26j94K53J54k95r3L13J8k99K8K94r1k53J44K27j91
5483cj76K24J43k56q2K57M5k86K3K76p9k54J31K26j79k00K13J69k61j21K88N6
5505A54k81rK86n2k87J15K71j81k31K21J72k38j33K78Q4l05oL04n5k88J06K70
5527A95j60k30K13J91k53j25K77P1l05j9L16l4l21J09K83j78k39K17J97k60j49
5548b04L09P0l33%L32o9l11J27K84j91k42K54J80k96j15L25N2l27OL37q2l14J63
5571d5K66k18k14K56J73k91j08L04N0l26K9L00r8k72J49K46k01k03K39J39k58
$$ y = [179, 103, -203, -61, 203, 22, -228, 5, 202, -79, -211, 99, 158, -159, -164, 166, 94, -214, -67, 212, 13, -226, 35, 224, -75, -203, 132, 182, -169, -134, 205, 107, -198, -53, 228, 16, -226, 69, 217, -84, -185, 140, 164, -170, -136, 189, 88, -216, -52, 208, -18, -212, 41, 195, -100, -193, 120, 138, -161, -133, 161, 70, -183, -39, 188, -3, -179, 45, 188, -68, -150, 107, 152, -134, -111, 165, 86, -168, -37, 189, 10, -190, 23, 192, -69, -190, 98, 154, -127, -136, 150, 98, -189, -74, 197, 16, -215, 6, 178, -60, -193, 85, 169, -136, -142, 162, 107, -181, -75, 195, 35, -195, 18, 209, -44, -169, 108, 179, -126, -145, 171, 137, -184, -75, 208, 30, -209, 8, 205, -55, -204, 105, 175, -158, -158, 174, 105, -206, -79, 205, 14, -228, 26, 206, -90, -205, 120, 172, -155, -149, 188, 106, -208, -45, 221, 3, -211, 45, 218, -73, -181, 123, 173, -153, -124, 176, 78, -194, -45, 201, 0, -203, 36, 175, -83]
5592h3r6K71L9k73J5K86r4k52J25K36j69k03K15J72k44j22K71N3k70RK79n1k90
5615a76J18K46j42k20J93J82k41j31K47J00k91l6K90k1k93Q6K56j22k50J85K06
5636A86k28j75K86J01k82n4L10j7k90O2K83j29k57K04K09k33j76K77J17k99n6
5657a61K98j1l00Q8K95j49k66J99K38k74j71L00J14l35l2L31l7l32J18L04j77
5678D0k70K17K30k70j63L07Q9l18j4L29o2l01J12K85j72k39K22J85k49j25K75
5699A08O1k82k5L15o2k83J12K45j61k11K03J65k38j22K64O0k70j5K80m2k65Q4
5721g9K50j40k27J93J83k21j45K59J03k92m2K90j7k61O5K50j15k25J73K03k06
5742aj72K38J18k62o8K72J5k72M1K68j09k48J48K16j98j86K42J37k74p3K86J2
$$ y = [-83, -179, 92, 131, -142, -127, 159, 65, -187, -62, 174, 5, -198, 17, 189, -55, -177, 94, 147, -123, -114, 165, 114, -176, -58, 188, 46, -174, 19, 201, -40, -171, 76, 176, -115, -151, 139, 118, -175, -89, 167, 45, -205, -20, 186, -42, -217, 69, 170, -112, -166, 144, 127, -163, -101, 182, 53, -204, 0, 209, -24, -200, 77, 194, -105, -161, 137, 126, -174, -86, 209, 60, -206, -7, 231, -43, -214, 86, 200, -135, -167, 164, 127, -205, -87, 217, 40, -230, -13, 217, -53, -216, 91, 180, -138, -152, 177, 115, -186, -74, 211, 39, -200, 22, 207, -42, -167, 108, 169, -113, -138, 177, 115, -168, -56, 189, 28, -183, 20, 185, -53, -175, 89, 149, -121, -136, 144, 102, -163, -79, 171, 31, -196, -3, 180, -41, -186, 73, 176, -116, -158, 132, 115, -146, -81, 169, 54, -171, 2, 205, -1, -173, 65, 183, -79, -147, 125, 140, -132, -91, 177, 68, -180, -32, 184, -14, -200, 42, 179, -95, -168, 118, 130]
5764A30k89L7K99j09k63J52K51k08k01K58J32k90p3L26Ql23N4L19j35k86J80K63
5786B32k41k08K83J48l30o5L35Ql36O3L18j48k75J90K31k49j59K67J26l05o8L18
5808A35j6k93P8K65j23k35J83K00k29j45K55R7k69n1K87pk80N5K66j14k36J73
5830dJ99k14j51K35J11k53q6K72K4k75M6K52r4k47J41K16j88j84K24J37k28r9
5852a66K44M7k61K1K59p0k44J22K37j65k00J95J56k18j14K51O3k67j3K75m4k69
5874a61R1K57j66k13K06J72k44j18K78O9l09j0L05n8l00J24K74j80k41K40J87
5895B03k84j40L26P8l36LL15n8k96J29K77j97k32K45J89k74j42L07O0l15K2K94
5917A74p6k75J27K58k03k18K42J63k69r2K60L8k80K3K85r0k57J35K32j73j89K02
$$ y = [130, -159, -122, 177, 68, -195, -43, 208, 0, -201, 57, 189, -101, -174, 152, 160, -163, -109, 210, 75, -211, -31, 232, -9, -217, 66, 214, -116, -181, 154, 162, -174, -111, 207, 59, -216, -26, 205, -44, -203, 64, 190, -115, -183, 135, 119, -174, -96, 169, 46, -189, -6, 194, -35, -180, 75, 172, -97, -148, 139, 132, -148, -93, 173, 59, -177, -4, 195, -19, -170, 65, 176, -77, -163, 109, 133, -142, -96, 156, 62, -185, -44, 172, -16, -200, 24, 161, -67, -166, 78, 125, -136, -115, 144, 74, -170, -48, 189, 24, -176, 19, 175, -43, -157, 94, 157, -110, -123, 152, 108, -161, -70, 187, 21, -192, 14, 186, -58, -176, 102, 171, -138, -148, 157, 99, -201, -77, 197, 17, -224, 16, 203, -81, -221, 105, 183, -153, -150, 165, 107, -189, -60, 217, 20, -212, 33, 222, -52, -194, 113, 173, -142, -120, 174, 98, -177, -50, 208, 5, -213, 29, 192, -77, -169, 91, 129, -151, -128, 157, 67, -190, -55, 177, 4, -185, 17]
5939A7J43k17j15K67M7k65QK73n2k64J07K42j57k02J95J58k24j15K45O3k62j7
5961a25K62k7k60Q4K37j39j99J62J64k02j37K35Q9k44m2K44Qk54N4K48j15k13
5983a70J56K01j89j72K20J35k61n9K67J0k84N5K70j04k62J66K31k24j80K57J17
6004A80k79o8K95Ql02N8L00j33k77J88K24k28j80K73J20k96n5L11j6k94Q0K82
6026A91j29k59J95K00k40j36K57Q6k80k1K88l4k68R0K54j45k23J87J74k27j32
6047a72K42Q9k84j5K72l5k57P3K51j34k15J69J85k10j31K39R6k58m6K67j6k44
6069a34O8K31j15k16J56J80j78j48K25Q5k31n4K43J2k39L9K32r1k28J35J90j60
6091Bj65J83J34k21r1K43L0k52J8K50o8k43J19K31j74j78K09J49k49q9K68L8k78
$$ y = [17, 160, -57, -172, 95, 142, -123, -115, 158, 106, -158, -51, 191, 34, -168, 27, 185, -39, -154, 91, 154, -108, -125, 137, 110, -150, -66, 171, 32, -167, -5, 159, -43, -180, 55, 144, -100, -142, 102, 110, -144, -90, 158, 43, -170, -14, 187, -2, -174, 46, 181, -80, -139, 128, 138, -146, -91, 179, 75, -187, -21, 210, -14, -194, 63, 180, -99, -167, 128, 136, -166, -108, 192, 59, -218, -30, 194, -34, -214, 59, 179, -117, -172, 139, 123, -171, -91, 191, 62, -197, -2, 198, -42, -178, 79, 165, -115, -136, 152, 118, -150, -60, 194, 49, -174, 13, 187, -40, -172, 70, 159, -125, -140, 132, 97, -160, -87, 164, 30, -185, -16, 169, -41, -172, 67, 163, -95, -141, 126, 110, -134, -66, 165, 50, -166, -10, 170, -8, -156, 69, 154, -77, -131, 112, 124, -115, -76, 156, 65, -163, -28, 162, 2, -163, 20, 154, -67, -158, 85, 115, -137, -119, 131, 63, -180, -61, 170, -4, -182, 27, 176, -73, -162, 106, 144, -134]
6114a34J7L00r1k72J44K38j89k07K32J54k63j02K95K6k94K6K80q2k56J39K29k00
6136a0j89K36J36k61q7K78J8k73L2K78j02k41J52K12k00j72K47J09k45o6K69K0
6158A41k68L5K58q7k51J54K03j70j71K09J18k53o5K55J3k61M8K49r5k31J32K01
6180A64j74j71K14J20k32p7K39K8k43K9K36o4k34J11K08j47j52J68J51k17j08
6201a51K43N0k43mK43m1k40Q3K42j59j87J90J52k26j26K47Q1k68k2K73l5k76R0
6224h4K53j48k19K08J84k46j43K82Q2k96k0K92l7k83J09K69j70k38K30J76k53
6245e2j25K80P2k96rK99o6k89J30K64j87k27K29J66k52j13K76M2k93K7K75p2k61
6268a82J21K43j77k02K12J61k45j01K74L7k77K8K72o1k69J18K33j45k15K09J47
$$ y = [-134, -117, 183, 92, -180, -36, 202, 13, -194, 38, 192, -71, -173, 122, 148, -146, -120, 160, 78, -178, -39, 190, -10, -199, 37, 173, -88, -175, 103, 121, -152, -120, 158, 56, -185, -33, 179, -21, -193, 54, 163, -82, -148, 121, 141, -127, -92, 166, 79, -172, -18, 185, 15, -156, 53, 171, -82, -147, 108, 121, -140, -92, 157, 62, -169, -37, 164, -10, -181, 33, 153, -79, -156, 83, 111, -132, -103, 133, 69, -165, -54, 154, 7, -145, 23, 174, -43, -151, 92, 142, -101, -105, 138, 97, -143, -60, 182, 23, -164, 26, 178, -48, -174, 73, 154, -114, -136, 137, 102, -174, -84, 169, 21, -198, 10, 194, -52, -195, 87, 169, -127, -147, 145, 108, -175, -66, 203, 33, -205, 25, 201, -52, -177, 103, 175, -121, -130, 169, 103, -186, -56, 208, 21, -206, 23, 189, -63, -176, 100, 142, -151, -124, 151, 79, -182, -61, 182, 5, -197, 15, 176, -69, -170, 104, 141, -136, -108, 164, 103, -166, -48, 185, 40, -175, 34, 181]
6289A81k26j08K46O4k65rK48l7k49R8K15j31j97J70J58j98j29K29P6k42l9K46
6311A01Jk50O9K26j04k22J62J93j91j50K03J29k40p2K68Pk68N4K59r9k61J52K39
6334B06j97j90K31J26k64q2K98J8l09L5L03j08k66J58K44k21j93K59J34k92p0
6355a80L06J3k93N0K81j13k60J67K22k03j91K68J31k92o7L00J4l09O1K91j29k55
6377a88J67K20k22j67K57J18k78o8K84kk83O8K57j15k52J75K03k04j67K47J16
6398A66k51p5K70K8k84M5K65q6k49J38K23j72j84J99J44k28q8K43M0k42jK40m5
6421I6k44R3K27j40j93J54J74k17j24K39P6k48l6K66k3k70P7K63j32k30J92J80
6443A80k13j49K58R6k72n0K96rk88O2K86j37k44J83K15k41j62K79J03l06l2L03
$$ y = [181, -45, -153, 93, 157, -108, -117, 131, 94, -155, -57, 158, 27, -170, 0, 158, -40, -169, 60, 136, -106, -145, 101, 102, -148, -79, 147, 43, -179, -17, 176, -15, -165, 38, 167, -73, -145, 123, 130, -138, -84, 175, 76, -185, -33, 206, 9, -181, 50, 176, -88, -170, 128, 146, -163, -128, 175, 67, -199, -41, 203, -18, -211, 48, 182, -110, -180, 126, 139, -154, -104, 177, 64, -196, -29, 193, -10, -201, 67, 198, -94, -161, 139, 153, -156, -95, 196, 67, -188, -21, 199, -23, -190, 67, 185, -93, -161, 123, 121, -162, -94, 163, 48, -204, -29, 174, -30, -197, 50, 166, -85, -160, 110, 138, -146, -101, 164, 78, -171, -33, 190, 18, -166, 33, 177, -51, -139, 104, 144, -98, -99, 141, 96, -148, -55, 172, 32, -161, -7, 167, -50, -174, 65, 141, -107, -143, 123, 100, -170, -93, 170, 38, -192, 0, 180, -33, -182, 76, 172, -100, -150, 146, 137, -151, -89, 197, 60, -184, -1, 214, -27, -189, 90, 193, -113, -145, 158]
6465A58l3l01R6K75j56k47K09J98k49j52K71J02k92k8K98m7k86J11K64j58k29
6486a96K01J92k34j44K82O4k83kK78m1k73J04K58j71k22K08J66k30j18K52O3k75
6508a21j5K80m5k62Q9K40j37k13J84J72k12j29K23R3k54l5K55Jk50M8K40j05j90
6531a43J34J68j70j42K17J05k32o7K43J8k56M0K47q3k43J42K08j93j71K18J32
6552A72k44r3K71K5k83M9K64r7k57J47K44j92k04K35J48k78q3K96K9l01M5L01
6574A94j11k66J47K46k07j99K48J47k75o5K89J1l12N7K83r5k82J69K19k03j83
6595a88K43J22k76o6K94J1k96N3K63j04k53J78J96k00j74K55J14k68n4K78Pk68
6617a33N4K49r4k36J48K08j95j64K15J25k40o7K39K6k38J6K33q2k08J02J95j30
$$ y = [158, 125, -176, -80, 195, 39, -208, 1, 199, -50, -202, 69, 171, -121, -149, 149, 102, -184, -73, 191, 33, -196, 5, 197, -37, -181, 101, 165, -118, -120, 158, 117, -156, -52, 206, 35, -187, 21, 187, -43, -161, 91, 154, -121, -136, 144, 99, -163, -74, 166, 29, -184, 0, 172, -40, -169, 54, 147, -107, -142, 113, 114, -136, -88, 152, 47, -143, -9, 159, -11, -153, 64, 169, -63, -130, 113, 131, -125, -85, 162, 79, -164, -22, 186, -7, -178, 40, 172, -72, -165, 106, 131, -152, -103, 161, 64, -193, -46, 198, 6, -198, 37, 185, -93, -176, 120, 149, -152, -107, 194, 83, -183, -36, 210, 3, -196, 52, 199, -76, -141, 148, 159, -153, -96, 187, 92, -190, -21, 198, -5, -188, 55, 177, -99, -165, 129, 140, -156, -103, 160, 56, -197, -19, 177, -23, -197, 58, 172, -96, -150, 128, 135, -133, -79, 170, 76, -160, -12, 196, 1, -163, 52, 177, -63, -130, 109, 135, -103, -87, 146, 64, -144, -42, 153, 23]
6639B3j88J67J52k02j00K18L6k07j0K29m9k10P7K13j14j89J60J63j80j47K33Q6
6661A61k50k9K62k5k59Q3K34j21k28J77J88k17j38K37R9k78m2K77j2k87P6K61
6683A69j36k19J76J85k17j49K64Q4k64m3K85k5k62Q1K39j23k32J89J98k33j46
6704a79K68Q5k77l2K75k8k65R0K41j46k02J84J72k28j30K53N9k55j4K54m3k46
6726a64R9K30j50j93J69J72k11j09K22P2k29j8K27k3k30P3K04r2k00J45J63j64
6748gj25J71J00k06m6K09J5k23K6K14o0j84Q2J69j38j39J60J21k00q3K17L4k33
6771a26J6K20m3k14R5J97j46j62J87J34k11j01K33O0k47J8K25m3k39J03K21j51
6793B6j95J88J67k38r4K31O5k56oK51m9k54J13K19j43k07J83J64k28q7K32L5k38
$$ y = [23, -165, 2, 154, -48, -148, 70, 106, -101, -111, 118, 69, -141, -64, 149, 35, -154, 6, 169, -11, -158, 75, 161, -89, -118, 144, 119, -140, -57, 177, 56, -172, 5, 193, -24, -162, 75, 174, -104, -146, 131, 119, -168, -92, 169, 33, -186, -10, 175, -42, -191, 73, 157, -107, -150, 135, 110, -152, -71, 168, 45, -187, 2, 200, -33, -179, 89, 174, -103, -135, 140, 112, -153, -63, 178, 32, -170, 14, 186, -42, -172, 81, 140, -115, -129, 125, 82, -164, -65, 165, 15, -178, -9, 163, -48, -157, 65, 137, -92, -110, 117, 94, -136, -63, 141, 49, -151, -6, 157, -7, -132, 39, 139, -67, -113, 96, 111, -112, -86, 128, 68, -116, -34, 135, -3, -142, 18, 139, -61, -144, 73, 107, -126, -110, 110, 67, -147, -52, 145, -1, -163, 24, 158, -53, -154, 79, 139, -108, -90, 135, 92, -147, -44, 177, 26, -169, 19, 186, -52, -146, 85, 150, -106, -112, 139, 90, -164, -51, 168, 25, -182, 1, 165, -63, -150, 82, 117, -121]
6816a21K0K45o6k32J08K07j44j83J89J28k05r6K49L0k33K0K30q1k13J23J86j59
6838Bj43J81J02k12o4K19K6k17K0J90m2j91R0J58j19j36J47J06j59p4J67N2j80
6861g7j9J72rj66O2J54q6j48J12J41j43j00J46Q2j72m6J83Qj75K0J82p3j71J01
6885b2J51j36j27J68R7j91o1K01K2k08K0K06p1k01J16J66j30j35J66J00k01m7
6907a17K02K0k07K0K16n9k15J06J86j48j39J65J26k06p3K22K2k20MK22o8k00J19
6930b2J57j46j24J68J01k08m8K12rj93L4J83q1j54J20J33j45j20J88P2j77m0J88
6953H9Lj82M2J62o4j49R6J37j26j03J28P7j49n5J39L6j59J4J41l0j43M9J35o7
6977B1j25Q9R6j04p2J14O0j40l5J52Qj50L1J45n4j28Q9J12j14q3J29O8j39m9J56
$$ y = [-121, -101, 144, 78, -154, -46, 161, 17, -166, 23, 151, -54, -150, 99, 129, -104, -84, 146, 65, -148, -25, 161, 2, -141, 40, 142, -70, -134, 85, 111, -106, -86, 104, 62, -129, -39, 119, 0, -136, 11, 117, -42, -116, 51, 103, -77, -96, 76, 67, -99, -37, 117, 31, -117, -5, 136, -7, -107, 39, 121, -51, -97, 86, 94, -81, -61, 121, 48, -123, -22, 129, -7, -134, 34, 131, -60, -121, 80, 102, -106, -86, 120, 49, -152, -36, 130, 0, -135, 31, 131, -70, -117, 85, 105, -102, -82, 134, 75, -140, -34, 152, 4, -135, 30, 156, -50, -123, 99, 121, -99, -95, 127, 59, -141, -22, 135, -11, -135, 33, 134, -74, -122, 90, 81, -112, -78, 105, 24, -130, -10, 123, -22, -142, 46, 118, -59, -99, 89, 92, -90, -48, 114, 50, -99, -3, 134, 8, -95, 33, 110, -39, -94, 45, 81, -78, -64, 77, 47, -96, -47, 88, 21, -104, -15, 81, -23, -95, 19, 79, -61, -96, 56, 64, -86, -55, 90, 36, -92, -3, 109, -5, -88, 41, 109, -30, -79, 77]
7002G7K3j63PJ71o6j49Q2J46j31j06J30R1j67o4J87J5j78K8J66n3j73R0J62j37
7026a2j19J48R3j51o4J82Rj77L5J82p7j66J17J31j30j09J51P4j63m2J86k0j63
7049h5L8J65q5j47J18J07j32p9J46M3j65j4J60rj60M4J45o8j26R6R8r7q0J13O4
7074I0j30l4J29J3j30K4J12l6j20O5J02p4r1R9O9j12m0R9L5j16j2J20j0j27L3
7099d2J22p1j10Q9R1q9q2J07N6j23k6J33j0j22K2J49n9j29R2J04j01q9J40M8j39
7124c9l6J60Nj64K8J46o8j31R2J13j10r0J28P1j56m5J67Lj59K4J48p2j30J01J12
7149I8j30p1J48M0j51j3J51j9j49O2J33q1j13J13Q6j33n4J40L6j48OJ30m0j14
7173g3O1J06q0j01J00P4j07m6J09Qr0j7J06k3q5K0Q9m4p4N3P4n9o9Q3M3q1k9Q7
$$ y = [77, 100, -63, -56, 115, 49, -100, -18, 128, -3, -109, 21, 112, -55, -119, 68, 83, -95, -67, 99, 46, -127, -37, 125, -12, -131, 17, 110, -41, -105, 77, 86, -91, -56, 126, 49, -117, 0, 131, 1, -108, 43, 117, -46, -88, 98, 78, -85, -47, 118, 33, -114, 4, 111, -21, -100, 46, 89, -76, -90, 70, 61, -99, -55, 90, 22, -104, -8, 90, -7, -87, 26, 90, -40, -74, 55, 68, -62, -38, 74, 38, -82, -17, 85, 11, -80, 19, 88, -24, -64, 35, 70, -46, -58, 62, 52, -75, -42, 80, 9, -101, -12, 79, -10, -92, 15, 71, -52, -78, 55, 45, -77, -55, 94, 35, -94, -2, 102, 1, -88, 52, 100, -39, -75, 85, 90, -74, -46, 100, 32, -99, -7, 106, -4, -94, 34, 105, -51, -96, 71, 74, -85, -61, 87, 15, -115, -14, 98, -32, -103, 45, 85, -66, -79, 72, 53, -96, -34, 99, 18, -95, 18, 104, -29, -83, 57, 93, -55, -49, 81, 41, -73, -12, 94, 14, -87, 13, 87, -20, -66, 43, 51, -39, -56, 50, 27, -58, -38, 51, 7, -67, -14, 60, 1, -68, 15, 58, -23, -52, 35]
7201C5K2r5J0Q4j4p8L6P5n6o4N7N9p0m7R0L3j03k1J02j0q6NR8m5q9P2N0o7o5R7
7231A5N0j09k2J05K0j33M4J01n1j09Q1J02j09o2J09N3j27k5J36oj24L8J20o1j09
7256g3P2R0q7o9J04L6j24pJ35m3j11O2R2p0q8J03M7j04k7J17nj16K8J04l1r9N8
7283fP7o9n1O7M0o5l2R2Qq9jR6k5p7L8O3m8n8N6L1n4k9O6J5o5j5O4Op4K3N2k5
7315A1n3L7L7l1m4M6L8o2j9N9K2p9QP4k1n3K7N5m0n1N1N1n7m3P3Mp0nQ4j3q5L8
7347a1P3p1m9N0O9p9m5R0K4j05RR8k4j07N1R0o0o3P0N3q4m2J12Lr8J9Q6l1q4N8
7377BQ1q1m6Q5K7r0pR2k1p6K4O9n0o2O8L6p2j9P2Pp7lO8j1o2L6M4m2l6N4K8m6
7409hk2L6K4m2mM1Lm4K1L3k4m3L0M4k1l0J9L8n0j0L0Mm0LM2j2l6NL7j8l1NM5l0
$$ y = [35, 57, -38, -28, 56, 42, -36, 0, 75, 19, -45, 12, 71, 1, -46, 44, 77, -26, -47, 55, 45, -41, -36, 62, 17, -72, 0, 50, -17, -82, 15, 65, -44, -66, 39, 59, -74, -30, 71, 20, -89, -8, 94, -15, -77, 32, 85, -42, -67, 69, 63, -61, -23, 97, 36, -73, -1, 89, 2, -67, 37, 73, -51, -58, 77, 34, -77, -15, 77, 7, -81, 22, 69, -35, -62, 55, 50, -66, -38, 66, 35, -64, -6, 71, 2, -49, 18, 58, -7, -39, 53, 61, -28, -29, 67, 42, -35, 3, 66, 18, -40, 16, 47, -7, -36, 30, 45, -20, -35, 29, 35, -39, -16, 36, 11, -42, -5, 32, 1, -43, 3, 41, -21, -40, 19, 41, -38, -30, 44, 23, -30, -3, 52, 12, -39, 12, 63, 6, -37, 36, 40, -30, -35, 49, 36, -49, -11, 62, -9, -58, -8, 61, -18, -63, 27, 51, -54, -45, 53, 29, -78, -27, 63, 3, -60, 10, 63, -21, -63, 49, 52, -46, -27, 59, 28, -56, 2, 83, 2, -44, 41, 68, -22, -29, 63, 42, -34, -10, 59, 9, -53, 15, 51, -21, -40, 32, 39, -38, -41, 27, 16, -46, -10, 34, -8, -44, 10, 38, -8, -30, 6, 30, -12, -16, 25, 28, -16, 5, 38, 14, -29, 1, 45, 24, -6, 13, 51, 1, -9, 21, 25, -15, -12, 30, 18, -18, -13, 24, 6, -25, -20, 25, -5]
7443ek7L6K4n2%N8j4n1RO3k5m5L0M4m2l0M9L0n4k6P5ro3J1O7k4o3L6N7n9n7Q4
7475B7L4q1k0P0mp2K8O6m4o0O1M6o9k7P4Pp6J1P9l4n8M9M8o8k4P0K4o7J1M4j9
7506B6o1M9L8l3m1L6L5n1k3M2J2m4nL7j7j2LL6l1k4J6J9j0k1K8J2k5nL4jl2QL4
7539B9pk3MK9j1j5RRj0j4K0joj7K0J3k8%J9k2nLK6k5k3J1L2j8k5L9J3m6jM1nm2
7575b7J1O5l4n0L3M5m1k9O4Ro5J2M6on7L0M6m6k4M0K8o5lO3j7o2K9M5l8l0L3K6
7607C1n5pM9mm5K0M2k9l1K2M1m1j1M9j1l2pN2ql9K4L4l8j4L1J4l3%K2%k8lM0j9
7641A6j7J2J3j3j7J6mj1nJ7Oj8oJ8KmoJ3j1LLJ7k2nJ1J9j5nJ3j1KlL2j5k2LJ7
7678B3ok1J3J5ok4J3K3l4j2K6Mk5j3M8rm3J5L6k8k2M7J0n3%M9ml7J3L3k0l7M4
$$ y = [-5, -32, 4, 28, -24, -24, 34, 20, -31, -22, 41, 16, -29, 1, 45, 3, -27, 22, 52, -2, -28, 47, 38, -25, -14, 53, 29, -34, 2, 59, 0, -57, 27, 61, -20, -40, 30, 26, -46, -18, 48, 4, -56, 5, 51, -18, -45, 29, 36, -40, -29, 50, 16, -42, 7, 55, -13, -37, 33, 57, -10, 1, 45, 26, -35, 14, 52, 19, -22, 14, 49, -2, -25, 17, 29, -15, -20, 17, 0, -12, -9, 27, -4, -28, -12, 7, -3, -24, 4, 16, -9, -14, 20, 19, -13, -5, 29, 22, -1, 3, 32, 21, 6, 15, 24, 14, 0, 20, 19, 13, -4, 16, 29, 1, 1, 20, -2, -7, -4, 22, -3, -26, -15, 17, -1, -26, 13, 26, -20, -21, 20, 15, -27, -16, 49, 15, -35, -2, 43, 2, -27, 37, 46, -19, -7, 39, 33, -24, 6, 52, 6, -18, 22, 50, -15, -18, 45, 28, -34, -5, 40, 2, -28, 5, 31, -24, -31, 18, 14, -31, -11, 31, 2, -29, -7, 34, -7, -18, 31, 20, -12, -19, 33, 25, -14, 10, 44, 6, -8, 23, 37, 4, 4, 26, 26, -2, -5, 35, 16, -1, 11, 24, 11, -6, 10, 6, -5, -10, 7, 13, -5, -11, 7, 9, 5, -1, 12, 1, 4, 7, 24, 2, -3, 8, 27, 12, 7, 20, 9, 11, 8, 40, 25, 3, 6, 23, 17, -4, 9, 24, 18, -6, 7, 30, -4, -16, 10, 14, -11, -24, 24, 15, -28, -13, 23, -5, -27, 20, 30, -23, -23, 26, 22, -15, -2, 31, 11, -26, 18]
7711A8K4l7j8N7jo3K3M7k7n3M7K8m5k7N4jn6J3M8j6m9K0M7l4k9L8K0m7KL4Pl9
7743a5JM3j7k9K5K8l4j8L6K2m6OL1ll2J4K4j4l2J9K2l7mK3J6l1mK2lk1jK2j8j1
7777a6K0J7j8k1J9J3j9jJ5Nqj2K1J8l9jL4Nl3RK8ml4J3K4j9j9J8K1m7lM4%n1M
7812a7M6j8m6M4K5l8k3L2K7o1LO8k6n4L0M4l5l1M4K5n7oO3%m9J5N3m2l2L0L4l3
7844A5l6M8K0o2kM8jn4K2M3l5m4M5K9n0j5M5Ql7qL7Nn7L5J8pl3L2K7l1k0N1j5
7877B1k3JL8nl4K1K0k1l2L4J3k1pK0Jl6jL2qj7j5L9Om5ML6j8l2L6J3k0l5L4K5
7911B4k6k3M4J3m1%N5j9m7J8N1l1l9K8L7l8l3O3J4o5QN9k5o3L8M8n5l1M6K3n7
7942b4j4P7j3o8K5N7l0n8M5L9m5l0O3K3o4lO7j4n9K8N5l6m8N2K7n9j9O8%o0ON6
$$ y = [18, 42, 5, -13, 44, 43, -20, 3, 50, 23, -30, 17, 45, 0, -27, 27, 26, -30, -17, 31, 15, -34, -14, 33, -1, -30, 8, 28, -19, -17, 17, 24, -15, -14, 29, 12, -17, 8, 36, 2, -16, 20, 42, -4, 2, 33, 30, -2, 12, 36, 22, -10, 9, 31, -6, -10, 13, 29, -2, -6, 16, 13, -8, -9, 13, -5, -16, 4, 21, 3, -18, 1, 14, -5, -6, 9, 14, 6, -6, 15, 33, -6, -7, 27, 32, -1, 8, 36, 32, -2, 11, 35, 16, -3, 15, 36, -11, -14, 30, 30, -21, -17, 29, 11, -35, 9, 34, -4, -27, 5, 32, -29, -26, 42, 16, -38, -8, 36, 1, -30, 14, 39, -18, -24, 39, 39, -10, 5, 58, 16, -16, 14, 48, 15, -21, 27, 47, -15, -17, 31, 30, -24, -2, 41, 6, -38, 7, 36, -14, -29, 16, 24, -13, -21, 16, 21, -36, -1, 17, 10, -23, 9, 36, 5, -15, 36, 21, -2, -1, 37, 32, -2, 19, 39, 18, -14, 20, 33, 12, 5, 25, 26, -10, -11, 21, 13, -4, -19, 20, 26, -19, -15, 21, 3, -29, 7, 20, 0, -35, -1, 24, -2, -25, 19, 32, -9, -9, 46, 27, -20, -2, 49, 18, -21, 7, 44, 6, -27, 36, 50, -15, -7, 52, 27, -36, 2, 50, -5, -36, 10, 33, -24, -38, 39, 26, -42, -17, 40, 10, -48, -3, 36, -9, -39, 24, 47, -17, -20, 47, 33, -26, 2, 57, 21, -27, 25, 52, -7, -26, 42, 42, -18, -12, 44]
7974D4k0n5K8M1l2m5M6L1n0k4N9Ln7RN4k3l7K9K1k3l0M7J4l9lK9J6m9QL5Jk9L
8007BM6k9l5K4L6k9l0L3J7l4k2M1Ml7nL9Kn6J0N5k7m1L3L4m1k0N2J7o1jN3Np2
8040c7K5P3l6m6M6L0n9l0Q0Qo4rP3j8p0L3N4m8n3P0M1o9k9P1Kp2J7O4k3o7L5O1
8072E3o1o2Q0M2p3j9P0J2p1J4O7k9n9L8N4m4m9O6L7p7qN8%o3J8N7l4n2M8M4o8
8103a1j9M9J8n4j9N8Ln4J3N4k2n4L0L6k4m4M0K8k1k7M1J6m5j7O1J1o7J5M8qo2
8134b7L8N2m5m8N6L7p0k3N3K8q5LQ5k8o6K7O4o2l8O0L2p5k4Q7Lq5K7P6k6q3M9
8165hP3o4n3Q1L2p9j8R7mj11L4R3n2p8O9O4o2p2Q3L9r3l0J10qq8O
$$ y = [44, 24, -31, -3, 38, 6, -39, 7, 38, -12, -36, 23, 26, -31, -22, 32, 9, -28, 1, 22, -1, -31, 16, 30, -9, -12, 17, 33, -16, -8, 27, 28, -1, 2, 48, 19, -16, 8, 44, 15, -15, 18, 35, 1, -21, 20, 24, -13, -18, 21, 23, -33, -23, 32, 5, -36, -3, 31, -10, -30, 22, 39, -22, -23, 30, 35, -37, -12, 61, 25, -21, 25, 55, -4, -34, 46, 54, -10, -19, 54, 36, -34, -1, 53, 5, -48, 22, 63, -6, -35, 36, 38, -34, -17, 47, 24, -43, -8, 53, -8, -70, 10, 52, -21, -40, 30, 42, -29, -15, 52, 23, -36, 2, 56, 12, -37, 29, 66, -11, -19, 39, 39, -24, -6, 51, 17, -35, 13, 57, -11, -30, 19, 37, -17, -36, 22, 25, -29, -16, 38, 16, -38, -8, 28, 4, -40, 0, 28, 7, -20, 21, 37, -8, -25, 36, 47, -20, -5, 43, 35, -27, 11, 63, 18, -30, 26, 63, -7, -30, 23, 51, -34, -31, 54, 26, -40, -13, 51, -11, -49, 11, 43, -32, -56, 31, 34, -51, -24, 52, 26, -57, -8, 65, 1, -52, 29, 61, -18, -36, 61, 57, -54, -20, 73, 21, -57, 12, 76, 14, -58, 25, 64, -29, -59, 51, 43, -45, -39]
8191c9
$$ Imaginary data points
##PAGE= N=2
##DATA TABLE= (X++(I..I)), XYDATA
0@%%%%%%%%%%%%JrJ6j6J6j6K4l2M0m8N6o4P2q8J04j20J37j58J81k08K38k69L04
35A61l39L79m26M79n36N96o64P37q15R04j000J103j217J342j478J626j792J976
53A036k179K407k663K952l281L663m110M638n281O079p101Q463j0380J3299j8308
68a0766K9160r1755R2660J59672k57996o4596K39786L3589k59886L4792K40029
79A44689p4917k31515J28037J95889j57268j66158J90523J19606k06733p7259
89a35106K22679K5829k22309J7232K18194o0887k01467R6407J80094j31059j47607
100a38000J57055J12204j78098p3102J90565L5461j97212L498J93821m0457j81769
111a16034P5205J61679j05695j37270J32981J08547j54921p6665J69355M2940
$$ y = [0, 0, 0, 0, 0, 0, 0, 0, 0, 0, 0, 0, 0, 1, -8, 8, -8, 8, -8, 16, -16, 24, -24, 32, -32, 40, -48, 56, -64, 73, -85, 96, -112, 126, -143, 161, -178, 201, -225, 254, -282, 314, -350, 387, -428, 476, -524, 579, -638, 704, -774, 852, -940, 1036, -1143, 1264, -1399, 1553, -1728, 1935, -2175, 2463, -2818, 3261, -3840, 4623, -5757, 7542, -10766, 18394, -73361, 19299, 178971, -79025, -143621, 96165, 129754, -130132, -95340, 144689, 69772, -161743, -33706, 162183, 4915, -161243, 29280, 148886, -57847, -135106, 87573, 113402, -108907, -91675, 126519, 65632, -135835, -39428, 140666, 9607, -138000, 19055, 131259, -46839, -119941, 70624, 106085, -91127, -87629, 106192, 65735, -116034, -40829, 120850, 15155, -122115, 10866, 119413, -35508, -112173, 57182, 100122]
121A00122j74969r348J73160k4299j64874N7840J50249q9204j29949J15399J06121
132A10248j35309p9795J49178N0473j56581j8209J56855j4695j50973M5794J40716
143I7702p4130j26370R8986J06874j18830q2380J32511N4576j40834k4931J44919
154F8093o009j44083L6709J37049o4611j23827Q8332J05453j08268q2182J24623
165C1279N4376j36034k4118J41355n808j40695L4032J34110o0576j20907Q4741
176h245J01096j04947p6796J20378N0452j31032k3113J36133m678j34186L1617
187d3321J25001n6152j10276P7980R1717r7021o9922J11810M5803j20500k1093
198f5974J22722l109j19513K6952J11373n0223r8530P1200Q2073q8038o3688J00231
$$ y = [100122, -74847, -84195, 88965, 64666, -100208, -42368, 107881, 18677, -111272, 4127, 110248, -25061, -104856, 44322, 94795, -61786, -79995, 76860, 62165, -88808, -43014, 97702, 23572, -102798, -3812, 103062, -15768, -98148, 34363, 88939, -51895, -76826, 68093, 62084, -81999, -45290, 91759, 27148, -96679, -8347, 97106, -11162, -93344, 31279, 85655, -50379, -74497, 66858, 61050, -79645, -45613, 88497, 27921, -92986, -8245, 92851, -12096, -88892, 31486, 81938, -49094, -72207, 63926, 59248, -74938, -43321, 81680, 25528, -84748, -6768, 84949, -12072, -81994, 29816, 75619, -44881, -65974, 56748, 53639, -65874, -38922, 72451, 22228, -76302, -5102, 76971, -11067, -74755, 25476]
210B5476M4007j07813k2566J10353j98j07722K2769J01013m3658r1588O2405P9407
222G1885p8153o4009Q9628M5800r6443k5996R9518N270r9648J5845R6345l5894
234B4148q9162N3151P8514o7045o4987P8153M8661q6635k9857R1848J0212r3514
246d6513Q529R2020k5925q7150M2129P8136n6654o5181O8709M9783p8289l3333
258e3739Q5570J6116q9653J536Q9336j8702q4582L4804P6416n0074o5391O4336
270E973N1695p6221l5991Q4285J9466q8247k506Q8349j5248q4457L3306P6545
282E6949n0193o5560O4474N2638p5710l7853Q3401K0903q6671k429Q5355j6044
294B9260q0462L3486P2988m9287o2805O2423M9711p1599l4488P6680J8112p8568
$$ y = [25476, 69483, -38330, -60896, 49457, 49259, -58463, -35694, 65319, 21661, -69927, -7522, 71885, -6268, -70277, 19351, 65151, -31292, -57288, 42230, 47500, -52148, -36303, 60042, 24148, -65014, -11863, 66651, -394, -65381, 12772, 61433, -25202, -55059, 36789, 47001, -46513, -37984, 54036, 28111, -59039, -16910, 61226, 4572, -60609, 8100, 57883, -20406, -53739, 31831, 47947, -41706, -40170, 49166, 30464, -54118, -19314, 57102, 7028, -58363, 5973, 57668, -18553, -54544, 29741, 49207, -39040, -41546, 46803, 31555, -52902, -19596, 56949, 6756, -58804, 5670, 58308, -17402, -55255, 28146, 49049, -37622, -40051, 45304, 29260, -51202, -17716, 55272, 5985, -56820, 5603, 55314, -16285, -50773, 25907, 44019, -34549]
306c4549r77P7638j6285p3642L2201O6554m5400n6983N5653M5288o3452l1338
318d5292O8720J5682p1006J36P0480j4798o7501K8002O1901l9768n3112M9508
330B952M1602n6874k8670O2144J5276o5505j747O6209j1460o3476K3470N7608
342D1529l3998m9480M3447L9575n1693k8191N7762J6255o0894m611O1176o605
354B4272n8954J7808N4190k8763m7113L8444L8725m6309k9844N2308K0237n6079
366b1078r572N7056j805n5437J3168N2070k4154m7405L4506M1099m3314l2894
378c7760M9680K3228n3603j2466N5711N72n6001J1967N4047k3917m9820L4247
390d115M3595m2847l5246M9767K4577n4664j2158N7100o69n7244J2878N5276k4186
$$ y = [-34549, -35526, 42112, 25827, -47815, -15614, 50940, 5540, -51443, 4210, 49498, -13954, -45292, 23428, 39110, -31896, -31760, 38720, 23922, -43579, -15577, 46324, 6556, -46556, 2952, 44554, -12320, -40990, 21154, 36430, -29075, -30822, 35387, 23927, -39549, -16079, 41529, 7531, -41949, 1498, 41073, -10620, -38811, 18951, 35206, -25688, -30299, 30877, 24272, -34682, -16874, 37316, 8553, -38560, -116, 38609, -7700, -37544, 14764, 35001, -21078, -30650, 26406, 24601, -30836, -17668, 34402, 10248, -37157, -2651, 38448, -4866, -37760, 11920, 35148, -18455, -30921, 24790, 25362, -30639, -18672, 35375, 11458, -38362, -4115, 39480, -3367, -38613, 11154, 35731, -18933, -31091, 26009, 25340, -31904, -19026, 36250, 12064]
403A2064n0721L4276M3212m2481l3360M8641K2201n3003j0462N5535j545n5494
415c1137J3051N2365k3250m6604L2069L8852l9773k9484M6151J8881n0303q050
427b7232N1833k175n0957J1936M7764k1424m2159L0208L4655l7532k6288M3062
439A1691J7669m6777q606M8187r68m6934J0461M3430j9358l8619K7561L2855l4724
452d132k5968L9989J8119m2802r786M3544J172m2813P814M0666j6652l7017K4317
465c549L2199l0212k6595L4610J9941l7683j2065L9250L498l9348M816L8389j2439
478A0812l6472J9455L3024k5585k7723L0445K1048l4144j3683L7122N820l9166
490a9047K395L9443j0288l7673J7401L4107k3928k8986L0082K2299l5440j4438
$$ y = [12064, -38657, -4381, 38831, -3650, -37010, 11631, 33832, -19171, -29633, 25902, 24357, -31137, -18086, 34279, 11029, -35575, -3506, 35346, -4427, -33911, 12240, 31121, -19182, -27232, 24601, 22426, -28531, -16595, 31169, 9745, -32414, -2206, 32449, -5083, -31371, 11691, 29360, -17417, -26023, 22164, 21196, -25738, -15277, 28153, 8795, -29824, -2263, 30592, -4132, -30100, 9889, 28008, -14794, -24580, 18964, 20136, -22677, -14863, 25803, 9151, -27866, -3549, 28650, -1562, -28157, 6453, 26394, -11289, -23354, 15896, 19394, -19954, -15138, 23251, 10812, -25660, -6205, 26819, 1234, -26489, 3956, 25004, -9140, -22823, 14299, 20119, -19047, -16652, 22791, 12503, -25170, -7769, 26338, 2410, -26576, 3506, 25805, -9635, -24073]
502b4073L9178O297m0986J635M0968r571l8878J7585L4526k5037k8460L1326K1582
515B6092l6232j4253L9569O343m0744K010L9415j0189l6186J7845L1752k4926
527D96k6334L0990J9812l5127j2586L6993N132l7069K554L5772j0518l2996J8092
540d789K8862k4336k3842K8941J8180l2073j1665L3816M163l3901L590L2554j0783
553H717l0273J7118K7113k2595k2577K6741J6692k9299j0067L0600L311l1112
565a5631L454L0650r897k8715J5349K5350j9560k1017K2903J5907k5719j0065
577a6991K7671M008k8431J563K8020o432k6643J1038K4052j5468k0194J9375J5611
590A7179k2516j0952K5035O272k6679j304K6959l895k5667Q941K3351j3810k0468
$$ y = [-24073, 15105, 21402, -19584, -17949, 23019, 13448, -25430, -7845, 26681, 1644, -26816, 4510, 26092, -10140, -24393, 15176, 21519, -19225, -17215, 22200, 12011, -24175, -6330, 25422, 496, -25838, 5152, 24964, -10163, -22749, 14244, 19376, -17693, -15139, 20633, 10115, -22881, -4789, 24073, -263, -24105, 4836, 23016, -9057, -20722, 13094, 17257, -16644, -13054, 19500, 8717, -21556, -4438, 22675, 80, -22497, 4244, 20936, -8363, -18430, 12170, 15481, -15631, -12177, 18473, 8576, -20139, -4790, 20560, 1000, -20017, 2886, 18793, -6926, -16991, 10680, 14688, -13743, -12180, 15840, 9408, -17235, -6197, 17855, 2387, -17807, 1568, 17179, -5337, -16289, 8746, 15018, -11661, -12965, 13994, 10099, -15568, -6627, 16724, 2914, -17554]
603a7554J8602J6877k2825j2513K5735P634k7145k494K7387l101k6627R162K4650
616A7788j4986k1597J9838J7867k3520j3508K6155Q199k7528k009K7433m318k6206
629a6392J0196K4214j5445k1367J9901J7277k3144j2077K4981O359k5767m99K5842
642A4079n394k4935J0909K2706j5438j9271J8797J5083k1440j0124K3472M491
654A2935k4487J159K4294o239k3029J0578K0808j4552j7355J8010J2806k0591
666e663p842K2252L029k3097J590K2971o140k1390J0302J8502j3774j4949J6708
679B499J1180j9218p137K0851K942k1152J014K0258m633j8666Q212J6459j1736
692H73j3652J4710J0490j6702p410J7842M317j8319q03J8004l034j6879O706J5356
$$ y = [-17554, 1048, 17925, -4900, -17413, 8322, 15956, -11189, -13683, 13704, 10603, -16024, -6862, 17788, 2802, -18795, 1043, 18910, -4610, -18118, 8037, 16236, -11292, -13301, 14132, 9814, -16392, -6196, 18018, 2573, -18794, 1107, 18384, -4760, -16837, 8144, 14503, -11264, -11763, 14079, 8685, -16250, -5341, 17365, 1927, -17344, 1453, 16536, -4904, -15028, 8444, 12935, -11552, -10393, 13901, 7662, -15367, -4789, 16019, 1467, -15888, 2122, 14928, -5663, -13505, 8747, 11776, -11321, -9731, 13240, 7100, -14290, -3988, 14514, 740, -14209, 2499, 13679, -5539, -12676, 8175, 11117, -10035, -9021, 11237, 6604, -12062, -3850, 12609, 873, -12779, 1931, 12421, -4281, -11691, 6151, 10468, -7851, -8654, 9350, 6316, -10563, -3857, 11499]
706A1499r956j3701J2830J1683j5248q887J6809N455j7539j764J7814k100j7769
719a0874O110J7062r873j5398J2889J2972j5177r927J7084O182j8563j829J9230
732I888k541j8958O390J7939r820j6059J2962J3098j5685r191J7588N020j8771
745h140j002J9351k982j8959O862J7285j0315j4530J3157J1288j5575p761J7602
758F281L892j8721Q4J8571l763j7380P156J5463j0474j2884J3615R623j5991o108
772a0636J7330K669j7761P81J7362m473j5994Q165J3732j1312j1095J3750Q404
785A0922j5552n432J6526K048j6428J467J5392m709j4002P692J2404j0391j0354
798a0417J2424P814j3463n100J3767K328j3773O66J3484l750j2644O414J1369
$$ y = [11499, 1543, -12158, 672, 12355, -2893, -11780, 5029, 10484, -7055, -8819, 8995, 6895, -10874, -4764, 12298, 2425, -12973, -84, 12888, -2289, -12216, 4868, 11050, -7513, -9342, 9888, 7347, -11611, -5221, 12718, 2898, -13161, -199, 12899, -2786, -11977, 5611, 10631, -8140, -9142, 10209, 7227, -11732, -4870, 12415, 2100, -12430, 727, 12015, -3560, -11321, 6281, 10173, -8548, -8464, 10107, 6344, -11036, -3880, 11583, 1109, -11775, 1840, 11463, -4528, -10636, 6694, 9363, -8398, -7617, 9745, 5272, -10722, -2557, 11175, -137, -11232, 2518, 10922, -4630, -10062, 6464, 8512, -7916, -6449, 8943, 4234, -9768, -2076, 10328, -63, -10417, 2007, 9821, -3642, -8742, 5025, 7353, -6420, -5754, 7730, 3980, -8664, -2250, 9119]
811I119q361r912R924Q076j1260n652J2253K796j2762n1J2963k423j2969M831
825c428J2393p187j0953R219Q845j0871o508J2412M000j3786j173J4471j691j4217
839h474M306J3264o777j1800R344R732j1780p109J3592M321j4618j618J4996j184
853F195j4699M268J3543p369j1642J0028R461j2192p175J3895M518j4842j419
866g430J4797j785j3981M862J2800p839j1288J0590R190j2664o585J3799L726
879H192j4216p08J4224k601j3704N984J2463q826j0700J0925Q634j2467o111J3574
893D663K975j3991L71J3718l450j2987O061J1921q350j0262J0228P831j1403n056
907g731J2003K316j2332K93J2416k880j1809N119J0490o787q794Q123O920r425
$$ y = [9119, 758, -9154, 770, 8846, -2414, -8066, 4187, 6983, -5779, -5830, 7133, 4710, -8259, -3428, 8965, 1778, -9175, 44, 8889, -1982, -8490, 3922, 7922, -5864, -7037, 7434, 5743, -8474, -4168, 9096, 2319, -9481, -137, 9595, -2185, -9294, 4298, 8619, -5999, -7617, 7379, 6195, -8504, -4236, 9307, 1938, -9704, 324, 9785, -2407, -9582, 4313, 8831, -6011, -7430, 7367, 5582, -8399, -3537, 9263, 1424, -9864, 726, 9916, -2748, -9333, 4466, 8192, -6024, -6732, 7492, 4891, -8813, -2829, 9634, 808, -9892, 1033, 9667, -2800, -8911, 4663, 7638, -6353, -5982, 7736, 4286, -8701, -2640, 9281, 931, -9331, 897, 8728, -2675, -7731, 4272, 6588, -5744, -5451, 6965, 4085, -7724, -2605, 7885, 1098, -7696, 427, 7347, -2078]
921b078m757J0552K371j1098k02J1109j650j0785L486J0036n462q707P358O948
935G121q869n242J0122L556j1083j628J1519o13j1184K889J0339n054r362P245
949b44Q126r273o453J0767M365j1486k161J1700k24j1631K907J1103n624r996
963h124P867Q505r500o786J0758M663j1666j960J1951q96j1677L520J1091n835
977A911j0184P938Q654r690o416J0835L828j1485j210J1911j480j1959M184J1249
991H086o560r777Q396P852r896n602J1232K955j2139j02J2303k500j1779M678
1005b853J0784o698r234Q621P045j0144m550J1063K209j1514qJ1497k185j0834
1019f801M340R434o156p700P641N960q909m183R874K234j0208k34R844j583r160
$$ y = [-2078, -6835, 3717, 6088, -5010, -5212, 5897, 4247, -6538, -3052, 6984, 1522, -7185, 173, 7121, -1748, -6990, 3132, 6688, -4395, -6023, 5496, 4883, -6301, -3412, 6927, 1873, -7489, -244, 7882, -1391, -7844, 2923, 7288, -4198, -6359, 5341, 5117, -6514, -3607, 7496, 1872, -8124, -257, 8248, -1252, -8038, 2720, 7383, -4283, -6243, 5708, 4812, -6865, -3345, 7746, 1911, -8273, -335, 8319, -1371, -7787, 3048, 6876, -4609, -5819, 6092, 4612, -7347, -3163, 8086, 1526, -8251, 145, 7997, -1899, -7501, 3731, 6686, -5453, -5555, 6748, 4248, -7531, -2853, 7931, 1233, -8001, 620, 7665, -2479, -7029, 4034, 6243, -5271, -5279, 6218, 4033, -6801, -2461, 6973, 817, -6883, 758, 6718, -2191, -6374, 3500, 5734, -4474, -4708, 5136, 3553, -5607]
1034e607L337Q329n191p254O922N848q104m408Q788K969r225j265R396p83r146
1049e394K869Q553m656p850O203O987p616n633Q686L793r276j746R545k76r732
1064e543K380R609m460q890O209P596p505o015Q597M178r630j977J0287l23j0378
1079e865K393R965m201r155N957P864p684n954R044L804r977j731J0544l21j0680
1094e997K499J0137m673q871O586P246q242n489R728L513j0806j252J1118j058
1108D439j0684L203R845n325q659P431P041r210n051J0266L008j0715r61J0709
1122E337j277j0222L652R162n783p727P391O235q575m597R372K635r626m39R315
1137D853j626q721L476Q024n165p106O626N764p582m135Q038K459q339p07Q562
$$ y = [-5607, -2270, 6059, 868, -6386, 536, 6384, -1720, -6128, 2660, 5629, -3596, -4861, 4535, 3752, -5394, -2525, 6028, 1372, -6478, -275, 6712, -904, -6537, 2149, 5942, -3334, -5080, 4465, 4189, -5543, -3163, 6446, 1986, -6904, -695, 6901, -604, -6619, 1978, 6156, -3474, -5451, 4836, 4513, -5865, -3472, 6493, 2292, -6863, -906, 6958, -726, -6680, 2364, 6168, -3809, -5540, 5004, 4683, -5997, -3498, 6639, 1966, -6905, -319, 6927, -1315, -6804, 2924, 6437, -4369, -5621, 5497, 4439, -6245, -3042, 6803, 1478, -7181, 250, 7291, -1919, -6970, 3296, 6304, -4411, -5372, 5337, 4060, -6162, -2510, 6652, 869, -6858, 533, 6768, -1807, -6404, 2968, 5603, -4023, -4462, 4853, 3227, -5494, -2018, 6006, 841, -6265, 361, 6125, -1457, -5592, 2446, 4905, -3434, -4141, 4421]
1152D421j180q493L008P943m420p149N555O160o651m783P646L028q347j203Q685
1167D220m15q826J973Q667l598p942N156O692o473n255P600L802q650k155R353
1182D149L45r432J441Q964l108q231M838P234o580n873Q038M244q969k568R420
1197C912Q33r535J155R225l335q412N326P291o991o027Q348M515r373k551R855
1212D236L05r763J921R357m059q710O106P652p855o053R025M108r663k004R986
1227D589k35j0024K597R536m710q549O348P201p554n609Q532L637r198j386R370
1242D545p41r133K536Q632m113p786N556O416o698m712P478K997q056j345Q454
1257D030l19q470J938P957l357p038M578N975n794m748O947L313p758j798Q084
$$ y = [4421, 3241, -5252, -2244, 5699, 1279, -5870, -315, 5845, -806, -5589, 2057, 5085, -3262, -4465, 4220, 3805, -5021, -3048, 5619, 2021, -5921, -765, 5927, -546, -5801, 1799, 5601, -3049, -5204, 4149, 4494, -4938, -3497, 5467, 2359, -5872, -1034, 6200, -380, -6253, 1785, 6029, -2940, -5508, 3912, 4745, -4790, -3635, 5590, 2255, -6157, -831, 6460, -531, -6558, 1790, 6305, -3068, -5619, 4236, 4541, -5222, -3301, 6056, 1997, -6713, -607, 7045, -810, -6863, 2162, 6270, -3393, -5397, 4589, 4354, -5670, -3073, 6463, 1753, -6796, -448, 6753, -801, -6410, 2122, 5759, -3439, -4825, 4545, 3804, -5329, -2793, 5839, 1726, -6060, -504, 5912, -786, -5498, 1980, 4977, -3079, -4424, 4030, 3711, -4759, -2821, 5136, 1779, -5259, -681, 5294, -500, -5248, 1699, 5012, -2746, -4544, 3540]
1272C540M11q091R85P830k538p232M152O285n560n200O665M098p531k846Q103
1287C071J268q218M51P963k135p530L739O988n277o133O555M901p394l400P864
1302B713J801q201OQ333j952q061L720P396n151o444O334N194p421l478Q209J503
1318D501q624M64Q687k250q470L980P783n610o525O980M839q018l014Q802J143
1333D668r305Q21R280k739q625M408P513n860o126P186M484q267k646Q884P97
1348D473q932Q88Q556k469p860M112O736n585n339O719L889p463k508P912J040
1363D169p985N66P581k159o856L572O029m811n182N932M106o708k813P057J434
1378C932p100l0P029j471o798L004O271m297n509N250M598o003l466O613K052
$$ y = [3540, 3951, -4140, -3155, 4675, 2137, -5095, -943, 5342, -218, -5418, 1247, 5345, -2186, -5032, 3071, 4339, -3879, -3428, 4535, 2400, -5130, -1391, 5597, 320, -5813, 742, 5643, -1751, -5151, 2713, 4514, -3687, -3681, 4652, 2700, -5361, -1641, 5755, 604, -5840, 494, 5688, -1733, -5211, 2998, 4501, -4123, -3659, 5028, 2778, -5692, -1712, 6071, 461, -6064, 916, 5755, -2263, -5277, 3525, 4668, -4637, -3816, 5464, 2725, -5900, -1492, 6021, 161, -5965, 1221, 5705, -2562, -5208, 3676, 4473, -4459, -3571, 4985, 2516, -5344, -1232, 5504, -81, -5420, 1299, 5188, -2275, -4783, 3129, 4169, -3816, -3250, 4331, 2172, -4684, -1112, 4917, 106, -5076, 856, 4962, -1746, -4559, 2498, 3932, -3168, -3198, 3831, 2360, -4438, -1434, 4837, 540, -4969, 281, 4879, -1124, -4590, 2023, 4075]
1393D075p013m77P141j001p047K283O814l520o232M650N251n593l980O306K671
1408D328o939j314P407j19p524J538P175k820o515M030N639n273m497O424L110
1423D650p250j645P641K49p731J249P482k899o786M535N730n911m529P012L257
1438E054p862j723Q241j5q130J827P596l523o846N105N883o514m596P489L018
1453E004p919j354P968l58p758K132P280l834o431N157N365o095m138O715K729
1468D463p099j095P180n76o945K049O537l298n950M375N075n260l861N856K504
1483C955o249j148O522j92o622J515O393k720n766L690M914m547l912N374K755
1498C962o096j492O495K69o562Q19O415j936n978L108N257m254m301N180L340
$$ y = [4075, -2938, -3415, 3726, 2725, -4322, -2039, 4775, 1255, -4977, -327, 4924, -669, -4649, 1657, 4328, -2611, -3925, 3482, 3363, -4161, -2623, 4552, 1732, -4783, -753, 4886, -387, -4884, 1540, 4650, -2600, -4245, 3396, 3645, -4086, -2837, 4645, 1746, -5040, -505, 5225, -686, -5215, 1797, 5054, -2808, -4531, 3710, 3695, -4435, -2608, 4988, 1465, -5381, -276, 5607, -907, -5503, 1986, 5004, -2915, -4269, 3699, 3341, -4417, -2285, 4995, 1161, -5270, -113, 5252, -843, -4981, 1734, 4463, -2636, -3731, 3449, 2873, -4072, -2023, 4514, 1216, -4734, -359, 4716, -544, -4405, 1451, 3955, -2294, -3442, 3080, 2888, -3734, -2219, 4174, 1454, -4312, -622, 4292, -255, -4167, 1207, 3962, -2134, -3626, 2869, 3138, -3424, -2605, 3810, 1874, -4104, -996, 4261, 7, -4294, 886, 4226]
1513D226n901k383O458J260o672%O525j306o124K555N654l813n025M975M137n832
1529a266l051O355J804o618m23O729j157o575K731O128m111n416N216M481o124
1544a297l243O826J669p209N7P270j693p099L195O627m572n737N743M414o576
1559a625k865P131J245p470M03P542k018p143L432O298m564n190N530L872o350
1574a772k379O906Q33p069N63O877j809o403K980N621m096m568N063L356n744
1589a641k189O213J044o413J49O265j375n768K527N070l573m316M572L438n357
1604a354k422N804J331n912k14N796r67n558K233N120l390m495M284L754m897
1619h87k947N381J901n680o54N734n76n633J699N422k717n064L655M405m420l466
$$ y = [4226, -1675, -4058, 2400, 3660, -3012, -3012, 3513, 2207, -3917, -1362, 4292, 479, -4546, 429, 4566, -1266, -4317, 2038, 3842, -2776, -3199, 3530, 2373, -4202, -1471, 4657, 546, -4870, 346, 4827, -1297, -4540, 2286, 3955, -3254, -3197, 4073, 2380, -4719, -1524, 5103, 531, -5206, 537, 4951, -1625, -4490, 2641, 3886, -3584, -3181, 4361, 2343, -4800, -1368, 4930, 366, -4824, 706, 4578, -1772, -4151, 2755, 3588, -3481, -2918, 3959, 2150, -4253, -1273, 4348, 252, -4316, 747, 4103, -1641, -3830, 2383, 3427, -2986, -2837, 3428, 2053, -3715, -1188, 3882, 309, -4007, 565, 4003, -1354, -3776, 2028, 3359, -2553, -2767, 3029, 2062, -3496, -1263, 3857, 467, -4028, 256, 4010, -887, -3834, 1547, 3448, -2232, -2886, 2848, 2272, -3361, -1662, 3760, 1043, -4021, -366, 4039, -381, -3847]
1635c847M988K381n438j224N835k0o028J278N871k408n389L399M686m377l718
1650d011N319K505o052j170O453j25o532J363O313k667n716L962M749n107l569
1665d285N974K374o644j058O934l48o794J790O226l133n400M353M450n427l315
1680d303O203K027o529p08O470o17o148J946N636l259m874M353L946n105k969
1695c931N563J901n801o78N799o57n526J898N101k959m556L822L889m551k951
1710c637N022J811n232o43N313n24n300J667N073k676m578L466L858m055l000
1725c435M576K023n033r18N301j47n310J029N166j838m824K675M221l472l426
1740c412M159K570m729j760N186Q77n423J00N346j110n006K095M543l101l969
$$ y = [-3847, 1141, 3522, -1916, -3140, 2695, 2675, -3353, -2075, 3796, 1388, -4001, -602, 4084, -293, -4011, 1308, 3813, -2239, -3409, 3044, 2919, -3613, -2250, 4063, 1396, -4320, -358, 4391, -716, -4285, 1689, 4063, -2581, -3639, 3295, 2947, -3847, -2057, 4169, 1036, -4364, -11, 4439, -988, -4303, 1900, 3927, -2602, -3310, 3160, 2543, -3605, -1659, 3977, 718, -4156, 197, 4143, -962, -3931, 1632, 3533, -2268, -2946, 2853, 2196, -3330, -1432, 3669, 710, -3846, -24, 3865, -686, -3637, 1385, 3196, -2036, -2679, 2634, 2110, -3190, -1523, 3550, 874, -3704, -238, 3620, -435, -3435, 1141, 3164, -1869, -2787, 2514, 2367, -2943, -1914, 3252, 1414, -3410, -735, 3486, 14, -3412, 747, 3317, -1412, -3172, 2014, 2891, -2532, -2432, 2914, 1804, -3202, -1107, 3436, 335, -3634]
1755c634M104L226m927k308N423J292n631j93N668j076n468K424M988l652m299
1770d063M621L478n352k457N860J180o068K57N961j660n633K924N141m031m408
1785d250M932L341n522k079N822P55n920N82N848j877n526L018M867l882m022
1800c913M545K998n078j806N458N21n579O79N429j687n069K585M482l413l616
1815c464M128K574m646j517M996N10n167M70N077j454m663K359L991l137l242
1830c185L850K451m468j588M845O82m898J80M725j015m425J900L991k787l422
1845c164L514K804m012k186M361J463m553n93M578l93m419J326M190k164l934
1860c182K978L492l658k794M129J934m457r80M729q6m874J187M804k229m430L077
$$ y = [-3634, 470, 3696, -1231, -3539, 1884, 3176, -2455, -2648, 3020, 1944, -3524, -1100, 3888, 236, -4063, 558, 4036, -1316, -3773, 2087, 3267, -2801, -2544, 3417, 1757, -3876, -952, 4189, 158, -4250, 682, 4023, -1499, -3578, 2244, 2999, -2921, -2339, 3509, 1632, -3894, -876, 3991, 109, -3913, 632, 3630, -1448, -3254, 2204, 2725, -2854, -2175, 3254, 1567, -3502, -917, 3565, 152, -3464, 664, 3238, -1408, -2925, 2071, 2581, -2586, -2116, 2961, 1507, -3156, -797, 3194, 57, -3185, 665, 3116, -1352, -2940, 1905, 2587, -2311, -2131, 2594, 1579, -2846, -946, 3045, 258, -3164, 350, 3154, -858, -3044, 1317, 2780, -1773, -2366, 2212, 1819, -2600, -1274, 2916, 752, -3182, -204, 3288, -370, -3164, 965, 2899, -1558, -2538, 2191, 2105, -2769, -1582, 3222, 993, -3437, -360]
1876c60L834l830l021M508J972n059p61N345m26n374J496N166k519m623L478L778
1892C604m319k687M944J559n353m49N550o70n425J772M926k761m176L596L317
1907C428m342k362M938J324n231k88N174o83m882J644M388k601l729L475K929
1922C182m120k078M485J251m666l15M598o92m303J693L819k548l296L283K689
1937B982l827j966M163J088m229j73M131p17l964J593L701k369l284K967K716
1952B812l322k086L570J377l808n49L908k78l881R85L757j582l507K111L134k697
1968e6k507L174J772l558j059L901L44m121M43M103j240l799J989L327k706k759
1984b752L421K063m050j233M421L43m487N02M366j421m030K387L489l294k757
$$ y = [-360, 3474, -356, -3377, 1131, 3103, -1956, -2717, 2628, 2202, -3172, -1676, 3490, 971, -3652, -174, 3604, -715, -3402, 1542, 3101, -2252, -2701, 2849, 2179, -3246, -1474, 3452, 691, -3485, 111, 3428, -914, -3276, 1662, 2986, -2245, -2533, 2641, 1958, -2924, -1280, 3108, 507, -3222, 253, 3182, -938, -3016, 1469, 2720, -1946, -2261, 2337, 1645, -2658, -965, 2854, 306, -2990, 293, 2982, -845, -2811, 1352, 2440, -1789, -1962, 2169, 1452, -2512, -919, 2782, 413, -2871, 96, 2812, -510, -2596, 974, 2351, -1457, -2006, 1902, 1624, -2257, -1272, 2485, 903, -2604, -493, 2641, -56, -2563, 611, 2383, -1175, -2234, 1667, 2011, -2110, -1667, 2436, 1196, -2603, -614, 2713, 7, -2752, 669, 2732, -1318, -2551, 1870, 2213, -2274, -1772, 2594, 1173, -2857, -470, 3019, -275, -3032]
1999c032L968J980m418j156M660K00m638Q46M367j892l880K771L324l509k695
2014c104M100J875m416r13M446o9m306J021M075j954l679K776L113l355k401L704
2030I13J596l894p26L987k53l897J169L645j942l241K511K722k984k036L349J184
2046B103l544l12L600m83l537J159L355j756k984K279K399k653j750K938J137
2061A951l213m95L370j18l337O70L105j116k803J583K434k078j985K512J490k816
2077h46j029L005N90l119n1L085n79k900J214K642j817k367K361K037k848j524
2093b146L138Q88l249j84L280n69l243J363L057k114k671K665K155l048j533L356
2109A145P63l540J34L552r81l408J717L100k311k682K847K023l240j214L461M02
$$ y = [-3032, 936, 2916, -1502, -2658, 2002, 2202, -2436, -1590, 2777, 885, -2995, -224, 3100, -409, -3104, 996, 2871, -1545, -2458, 1988, 1919, -2387, -1366, 2709, 755, -2924, -148, 2965, -390, -2791, 913, 2509, -1385, -2111, 1876, 1623, -2274, -1105, 2540, 598, -2643, -132, 2590, -394, -2430, 919, 2103, -1441, -1753, 1847, 1364, -2173, -1014, 2341, 585, -2399, -120, 2279, -374, -2124, 814, 1951, -1262, -1757, 1613, 1495, -1842, -1172, 1933, 817, -1986, -403, 2031, -47, -2032, 480, 1970, -846, -1875, 1130, 1720, -1399, -1450, 1635, 1056, -1844, -630, 2012, 195, -2172, 189, 2226, -622, -2146, 992, 1880, -1369, -1553, 1727, 1158, -2085, -722, 2335, 221, -2450, 215, 2370, -678, -2211, 1145, 1908, -1632, -1498, 2054, 1073, -2335, -618, 2482, 171, -2511, 336, 2359, -881, -2095, 1366, 1768]
2125A768l573L66L571j088l406J759L000k320k386K721J725l055j012L307K74
2140A651l412M50L288j058k984J595K527k089j989K566J344k900o70L029R2l036
2156a596M61K883j031k568J597K107k058j617K399J161k647o97K762J87k680L12
2172a025K470p83k232J230J979j621j736J954J397k119j038K185O82k229k50K261
2188A125k52k221P18K131j082k019J408J835j713j520K019J033k213n47K369P7
$$ y = [1768, -1805, -1439, 2132, 1044, -2362, -603, 2397, 77, -2309, 412, 2137, -918, -1930, 1377, 1651, -1761, -1311, 1977, 919, -2065, -470, 2057, -32, -2021, 545, 1889, -1011, -1681, 1348, 1440, -1596, -1135, 1748, 717, -1851, -254, 1853, -205, -1822, 577, 1738, -909, -1606, 1156, 1343, -1337, -1025, 1445, 662, -1570, -340, 1639, 18, -1718, 236, 1633, -486, -1524, 661, 1343, -886, -1136, 1125, 873, -1348, -630, 1501, 419, -1600, -192, 1643, -70, -1590, 429, 1462, -751, -1298, 1071, 1148]
$$ [...]
8191E8
##END NTUPLES=NMR FID
##END=
