##TITLE=1H_9P117_TFA
CDCl3
 8 sc, 
 2.11.2023
##JCAMPDX= 6.0         $$ Bruker NMR JCAMP-DX V2.0
##DATA TYPE= NMR FID
##DATA CLASS= NTUPLES
##ORIGIN= UXNMR, Bruker Analytische Messtechnik GmbH
##OWNER= root
$$ XWIN-NMR		Version 3.5
$$ Thu Nov  2 18:00:48 2023 Russian Standard Time (UT+4h)  she@DPX200
##.OBSERVE FREQUENCY= 200.1305
##.OBSERVE NUCLEUS= ^1H
##.DELAY= (6, 6)
##.ACQUISITION MODE= SIMULTANEOUS
##.ACQUISITION SCHEME= undefined
##.AVERAGES= 8
##.DIGITISER RES= 18
##SPECTROMETER/DATA SYSTEM= spect
##.PULSE SEQUENCE= zg30
##.SOLVENT NAME= CDCl3
##.SHIFT REFERENCE= (INTERNAL, CDCl3, 0, 15.7039)
##AUDIT TRAIL= $$ (NUMBER, WHEN, WHO, WHERE, WHAT)
$$ ##TITLE= Audit trail, XWIN-NMR		Version 3.5
$$ ##JCAMPDX= 5.01
$$ ##ORIGIN= Bruker BioSpin GmbH
$$ ##OWNER= she
$$ F:/spectra/data/she/nmr/H-F/1/audita.txt
$$ ##AUDIT TRAIL=  $$ (NUMBER, WHEN, WHO, WHERE, WHAT)
(   1,<2023-11-02 17:59:22.90 +0400>,<she>,<DPX200>,
      <created by zg, POWCHK disabled, PULCHK disabled
       configuration hash MD5:
       00 E9 B6 7A A2 85 ED C7 34 08 36 98 17 FE 4E 26
       data hash MD5: 16K
       40 C8 62 1D 05 84 48 00 31 3A 85 38 72 59 44 39>)
$$ ##END=
$$ 
$$ hash MD5
$$ A7 E2 0D 0D 74 15 4B 69 20 FE 8E 47 50 D5 A4 D8
##$RELAX= 
##$RELAX= 
##$RELAX= 
##$RELAX= 
##$RELAX= 
##$RELAX= 
$$ Bruker specific parameters
$$ --------------------------
##$DU= <F:/spectra>
##$EXPNO= 1
##$NAME= <H-F>
##$PROCNO= 1
##$TYPE= <nmr>
##$USER= <she>
##$AMP= (0..31)
100 100 100 100 100 100 100 100 100 100 100 100 100 100 100 100 100 100 
100 100 100 100 100 100 100 100 100 100 100 100 100 100 
##$AQSEQ= 0
##$AQ_mod= 1
##$AUNM= <au_zg>
##$AUTOPOS= <>
##$BF1= 200.13
##$BF2= 200.13
##$BF3= 200.13
##$BF4= 200.13
##$BF5= 200.13
##$BF6= 200.13
##$BF7= 200.13
##$BF8= 200.13
##$BYTORDA= 1
##$CFDGTYP= 0
##$CFRGTYP= 5
##$CHEMSTR= <none>
##$CNST= (0..31)
1 1 145 1 1 1 1 1 1 1 1 1 1 1 1 1 1 1 1 1 1 1 1 1 1 1 1 1 1 1 1 1 
##$CPDPRG= <>
##$CPDPRG1= <>
##$CPDPRG2= <>
##$CPDPRG3= <>
##$CPDPRG4= <mlev>
##$CPDPRG5= <mlev>
##$CPDPRG6= <mlev>
##$CPDPRG7= <mlev>
##$CPDPRG8= <mlev>
##$CPDPRGB= <>
##$CPDPRGT= <>
##$D= (0..31)
0 1.2 0 0 0 0 0 0 0 0.06 0 0.03 0 0 0 0 0.0002 0 0 0 0 0 0 0 0 0 0 0 0 
0 0 0 
##$DATE= 1698933562
##$DBL= (0..7)
120 120 120 120 120 120 120 120 
##$DBP= (0..7)
150 150 150 150 150 150 150 150 
##$DBP07= 0
##$DBPNAM0= <>
##$DBPNAM1= <>
##$DBPNAM2= <>
##$DBPNAM3= <>
##$DBPNAM4= <>
##$DBPNAM5= <>
##$DBPNAM6= <>
##$DBPNAM7= <>
##$DBPOAL= (0..7)
0.5 0.5 0.5 0.5 0.5 0.5 0.5 0.5 
##$DBPOFFS= (0..7)
0 0 0 0 0 0 0 0 
##$DE= 6
##$DECBNUC= <off>
##$DECIM= 32
##$DECNUC= <off>
##$DECSTAT= 4
##$DIGMOD= 1
##$DIGTYP= 9
##$DL= (0..7)
0 120 120 120 120 120 120 120 
##$DP= (0..7)
150 150 150 150 150 150 150 150 
##$DP07= 0
##$DPNAME0= <>
##$DPNAME1= <>
##$DPNAME2= <>
##$DPNAME3= <>
##$DPNAME4= <>
##$DPNAME5= <>
##$DPNAME6= <>
##$DPNAME7= <>
##$DPOAL= (0..7)
0.5 0.5 0.5 0.5 0.5 0.5 0.5 0.5 
##$DPOFFS= (0..7)
0 0 0 0 0 0 0 0 
##$DQDMODE= 0
##$DR= 18
##$DS= 0
##$DSLIST= <SSSSSSSSSSSSSSS>
$$ [...]
##$SUBNAM2= <"">
##$SUBNAM3= <"">
##$SUBNAM4= <"">
##$SUBNAM5= <"">
##$SUBNAM6= <"">
##$SUBNAM7= <"">
##$SUBNAM8= <"">
##$SUBNAM9= <"">
##$SW= 18.0518050122584
##$SWIBOX= (0..15)
0 0 2 0 0 0 0 0 0 0 0 0 0 0 0 0 
##$SW_h= 3612.71676300578
##$TD= 16384
##$TD0= 1
##$TE= 0
##$TE2= 300
##$TE3= 300
##$TEG= 300
##$TL= (0..7)
0 120 120 120 120 120 120 120 
##$TP= (0..7)
150 150 150 150 150 150 150 150 
##$TP07= 0
##$TPNAME0= <>
##$TPNAME1= <>
##$TPNAME2= <>
##$TPNAME3= <>
##$TPNAME4= <>
##$TPNAME5= <>
##$TPNAME6= <>
##$TPNAME7= <>
##$TPOAL= (0..7)
0.5 0.5 0.5 0.5 0.5 0.5 0.5 0.5 
##$TPOFFS= (0..7)
0 0 0 0 0 0 0 0 
##$TUNHIN= 0
##$TUNHOUT= 0
##$TUNXOUT= 0
##$USERA1= <user>
##$USERA2= <user>
##$USERA3= <user>
##$USERA4= <user>
##$USERA5= <user>
##$V9= 5
##$VALIST= <valist>
##$VCLIST= <CCCCCCCCCCCCCCC>
##$VD= 0
##$VDLIST= <DDDDDDDDDDDDDDD>
##$VPLIST= <PPPPPPPPPPPPPPP>
##$VTLIST= <TTTTTTTTTTTTTTT>
##$WBST= 1024
##$WBSW= 4
##$XGAIN= (0..3)
0 0 0 0 
##$XL= 0
##$YL= 0
##$YMAX_a= 130712
##$YMIN_a= -138371
##$ZGOPTNS= <>
##$ZL1= 120
##$ZL2= 120
##$ZL3= 120
##$ZL4= 120
##$ABSF1= 10
##$ABSF2= 0
##$ABSG= 5
##$ABSL= 3
##$ALPHA= 0
##$AQORDER= 0
##$ASSFAC= 0
##$ASSFACI= 0
##$ASSFACX= 0
##$ASSWID= 0
##$AUNMP= <proc_1d>
##$AZFE= 0.1
##$AZFW= 0.1
##$BCFW= 1
##$BC_mod= 2
##$BYTORDP= 1
##$COROFFS= 0
##$CY= 11.3945322036743
##$DATMOD= 1
##$DC= 2
##$DFILT= <>
##$DTYPP= 0
##$F1P= 15.7292609196834
##$F2P= 12.9074282941183
##$FCOR= 0.5
##$FTSIZE= 0
##$FT_mod= 4
##$GAMMA= 1
##$GB= 0.15
##$INTBC= 1
##$INTSCL= 1
##$ISEN= 128
##$LB= 0.24
##$LEV0= 0
##$LPBIN= 0
##$MAXI= 10000
##$MC2= 0
##$MEAN= 0
##$ME_mod= 0
##$MI= 1.114404
##$NCOEF= 0
##$NC_proc= 0
##$NLEV= 6
##$NOISF1= 3.799351
##$NOISF2= 2.8
##$NSP= 1
##$NTH_PI= 0
##$NZP= 0
##$OFFSET= 15.70392
##$PC= 1
##$PHC0= -23875.53
##$PHC1= 15.65269
##$PH_mod= 1
##$PKNL= yes
##$PPARMOD= 0
##$PSCAL= 0
##$PSIGN= 0
##$REVERSE= no
##$SF= 200.130013532006
##$SI= 16384
##$SIGF1= 3
##$SIGF2= 2
##$SINO= 400
##$SIOLD= 16384
##$SREGLST= <1H.CDCl3>
##$SSB= 0
##$STSI= 0
##$STSR= 0
##$SW_p= 3612.71676300578
##$SYMM= 0
##$S_DEV= 0
##$TDeff= 0
##$TDoff= 0
##$TI= <>
##$TILT= no
##$TM1= 0
##$TM2= 0
##$TOPLEV= 0
##$USERP1= <user>
##$USERP2= <user>
##$USERP3= <user>
##$USERP4= <user>
##$USERP5= <user>
##$WDW= 1
##$XDIM= 8192
##$YMAX_p= 0
##$YMIN_p= 0
$$ End of Bruker specific parameters
$$ ---------------------------------
##NTUPLES= NMR FID
##VAR_NAME=  TIME,          FID/REAL,        FID/IMAG
##SYMBOL=    X,             R,               I
##VAR_TYPE=  INDEPENDENT,   DEPENDENT,       DEPENDENT
##VAR_FORM=  AFFN,          ASDF,            ASDF
##VAR_DIM=   8192,          8192,            8192
##UNITS=     SECONDS,       ARBITRARY UNITS, ARBITRARY UNITS
##FACTOR=    0.0002768,     1,               1
##FIRST=     0,             0,               0
##LAST=      2.2672688,     0,               0
##MIN=       0,             -138371,         0
##MAX=       2.2672688,     130712,          0
$$ Real data points
##PAGE= N=1
##DATA TABLE= (X++(R..R)), XYDATA
0 0 0 0 0 0 0 0 0 0 0 0 0 0 0 0 0 0 0 -1 8 -8 8 -8 8 -16 16 -16 24 -24 31 -33 40 -47 53 -60 68 -78 89 -100 113
39 113 -125 141 -158 175 -196 219 -242 268 -295 326 -360 396 -437 481 -528 580 -640 703 -776
58 -776 856 -948 1052 -1169 1306 -1461 1640 -1840 2043 -2153 1663 2289 101738 -105989 -84406
73 -84406 4587 -12921 -61703 -110334 108433 -44062 -74428 120088 6885 14875 3146 39389
85 39389 31560 -113230 50397 -2705 -68833 30136 -8395 46988 -39305 -6713 66190 -99465
97 -99465 -15399 -6578 -52795 -33984 -60444 42311 -62298 -57704 67874 -53417 -10440 25682
109 25682 29786 27115 -20906 90932 -3577 -51121 39940 -52580 -42953 -44295 -23325 -820 -57750
122 -57750 41574 9958 -20341 37858 -18620 15612 -11124 -13143 29815 -21806 26732 8772
134 8772 4303 36106 -21324 28205 11211 -10893 25272 -9426 16995 -13523 -19204 6857 -47754
147 -47754 -14130 -18894 -23352 9272 -11980 29887 22562 13720 38062 8873 24228 2802 -1931
160 -1931 19462 -20272 1872 2707 -12597 -2329 -12305 7071 -12086 -8439 18824 -11687 1679
173 1679 10113 -2498 -818 -5115 11919 -3635 -337 27245 8284 13445 23299 16008 8874 -1661
187 -1661 7337 -7466 -19085 -5937 -13086 -14824 -12695 -7860 -1857 -9073 201 9074 6060 7563
201 7563 12404 16488 7945 2432 9604 3017 -8175 -2324 1390 -5246 -5956 772 1735 -7796 -6853 -1069
217 -1069 -10683 -11393 -6264 -5747 -3644 -3870 5535 7064 3893 11884 9291 10223 7920 5199 10525 -781
233 -781 236 1012 -8587 -5900 -10209 -7325 -9099 -10416 1707 -6863 -700 7382 481 5562 4410
248 4410 9373 4709 311 14733 1335 1158 9336 2077 2695 -3973 4185 -608 -12392 1342 -6147
263 -6147 -9550 -5758 -6785 38 -9403 -337 6525 -2850 7586 5908 8719 7807 2008 12838 1178
278 1178 920 4623 -4207 435 -6852 -3669 -3405 -10896 -869 -7521 -5119 189 -5423 1967 -774
293 -774 3460 4843 -153 10734 3804 3040 8907 3312 5475 -70 3380 3106 -7409 1163 -2634
308 -2634 -6360 -4209 -6389 -375 -6999 -3840 2966 -3426 2146 2122 4541 5601 1239 8797 5034 2602
324 2602 5828 1308 2818 -2244 -1586 -47 -6864 -3059 -4764 -6201 -3152 -5893 -2252 -2983 -1710 1411
340 1411 -1276 3605 3370 1450 5601 4128 4336 2190 3086 4444 -2763 -560 461 -4393 -4774 -4287
356 -4287 -2350 -5741 -6009 183 -2462 -2839 1206 2461 2322 1324 5612 5683 1312 4921 4722 1898 1503
373 1503 1352 1613 -1457 -1647 198 -3594 -2423 -2261 -4167 -2792 -3023 -1531 -2535 -663 2773 -216
389 -216 3060 5945 3195 3301 4094 5317 521 -1041 3429 -2159 -4430 -1445 -2587 -4906 -5902 -1582
405 -1582 -2183 -5853 295 708 -1240 496 1483 2872 -1077 1302 3522 -31 2277 2513 2584 2309 643
422 643 2207 -2046 -2281 -1579 -5456 -3315 -3810 -4185 -3172 -2761 655 -1807 316 4859 1666 3073 5200
439 5200 4878 2848 412 3380 -1224 -4567 -734 -2244 -2959 -2964 -139 759 -3250 406 35 -3156 -2038
456 -2038 -2360 -637 -2141 -667 2370 65 2661 2741 2555 3460 1699 3009 1828 569 371 -3097 -2815
473 -2815 -4567 -6699 -4895 -4644 -2010 -1192 1187 4904 3236 4005 4052 2735 1501 -615 1635 200
489 200 -1056 1632 1076 719 199 477 1453 -1393 143 1026 -101 -572 -1567 -514 -1885 -2913 -1275
506 -1275 25 1555 3177 5602 7615 5720 5255 4437 1622 -1492 -2705 -2490 -4389 -4522 -2445 -1758
522 -1758 -1755 -841 17 1095 466 1505 2697 1757 1130 974 331 -718 -2063 -1604 -676 142 1186 2411
540 2411 3570 2853 940 403 -1883 -4436 -5190 -4618 -3756 -3502 -737 1442 1677 2429 3689 3848 3168 2877
558 2877 3758 2734 1002 326 -1047 -2492 -3713 -4064 -2955 -2672 -1191 1138 2485 2378 1208 1339 -216
575 -216 -2377 -2614 -2358 -1885 -1024 456 2938 2664 2546 3306 2388 477 -570 86 -688 -2827 -2061 -2079 -3566
594 -3566 -3916 -3375 -1486 -1625 601 3218 3588 4294 3419 3388 1775 -1088 -1326 -2136 -2254 -1334 -1239 1082 869
613 869 517 938 263 -178 -1731 -829 -298 -1814 -1089 -581 -686 -952 -608 2100 1648 1706 4141 4252 3578
632 3578 1787 1796 95 -3587 -3245 -3179 -3866 -2851 -1553 609 234 856 1934 797 1363 380 410 594 -61
651 -61 668 364 231 -391 -1133 -6 -63 -589 480 465 879 -647 -848 -447 -3128 -3103 -2583 -1978 -1517 -908
671 -908 2499 2595 2013 3413 2872 1633 322 612 435 -2097 -1362 -727 -1643 -1915 -1709 -674 -954 -1040 521
690 521 352 668 794 781 778 -613 -7 255 -271 149 712 1611 1433 1192 1392 695 8 -1055 -1488 -1140 -2230
711 -2230 -2168 -1402 -1206 -693 -503 726 935 528 1266 1621 1717 690 768 914 -458 -905 -466 -867 -1141 -1279
731 -1279 94 -566 -1340 -185 -74 -856 -1063 -394 136 -889 -129 941 450 509 764 1815 1473 694 1284
750 1284 834 195 60 -166 -502 -1456 -1398 -1035 -1239 -986 -599 337 685 339 1013 1490 1199 956 866 1126 635
771 635 114 478 591 -118 -269 264 -164 -1209 -967 -417 -1046 -1312 -644 -48 -829 -767 350 406 96 518
791 518 1363 1039 441 721 1105 408 -265 82 -264 -698 -939 -281 -864 -1297 -821 -297 -420 -384 121 623 138
812 138 313 554 947 893 455 1314 1186 344 257 303 421 -450 -618 -136 -744 -1010 -942 -364 -496 -628 107 224
834 224 -233 184 712 776 620 591 1115 573 -343 176 297 -253 -799 -331 -424 -1078 -708 -426 -477 -776 -638 -145
856 -145 -352 -416 125 359 256 209 864 507 343 556 611 406 136 -78 63 -208 -940 -613 -711 -562 -676 -437
878 -437 111 34 -110 465 852 835 112 1125 959 274 54 694 392 -469 -179 493 -496 -946 48 -146 -734
899 -734 -791 139 -381 -1186 -213 237 -433 -381 374 971 63 514 1224 427 137 422 580 -469 -651 -339 -790
920 -790 -1025 -841 -859 -693 -506 -138 79 244 575 264 434 420 136 -77 -10 184 -123 -259 575 473 -91
941 -91 113 762 -47 -447 -74 -86 -1245 -787 -218 -105 -729 -22 651 374 542 1533 1075 480 775 679 224
962 224 -650 -483 -615 -1021 -726 -538 -280 -452 143 422 300 -290 -144 441 -162 -399 -104 -74 172 -195 60
983 60 454 318 -50 397 342 61 -69 64 -273 -1133 -1040 -902 -1115 -911 -499 502 544 731 1051 1213 925
1004 925 386 572 424 -209 -423 -504 -43 -427 -589 207 149 -272 488 751 262 -479 238 398 -1049 -639
1024 -639 -167 -328 -459 66 1053 896 471 1252 1059 -106 -351 -390 -707 -1411 -1083 -568 -910 -797 68 167
1044 167 47 503 996 471 554 535 386 167 -376 -463 -583 -565 -408 -70 232 377 452 394 340 360 -617 -503 -635
1067 -635 -1050 -958 -300 54 -35 416 1005 779 908 828 1236 412 115 -137 28 -908 -763 -286 -730 -858 -216
1088 -216 520 433 293 923 747 -87 -93 197 -378 -803 -583 -183 -128 -132 470 617 77 68 685 184 -122 -386 -337
1111 -337 -579 -1134 -884 -637 -543 -349 286 654 978 664 772 1085 621 -260 -300 -145 -773 -575 -313 -121 -220
1132 -220 -236 403 238 148 232 315 108 -78 73 172 -186 -488 88 251 96 429 698 711 682 659 347 65 -726
1155 -726 -447 -424 -809 -835 -548 -304 -261 305 631 236 450 446 559 81 -118 17 5 -269 -325 -115 -237 -154 -286
1178 -286 391 -55 101 75 100 -257 -64 -193 -384 -604 -429 61 188 64 487 696 505 312 -89 189 -168
1199 -168 -89 -153 -266 -577 -569 -429 -185 -161 -68 212 375 150 196 519 523 184 174 250 -54 -262 -12 121 144 -84
1223 -84 302 -110 -34 -25 0 -446 -416 -211 -303 -139 -315 -19 484 55 76 540 315 235 525 505 4 -262 -142
1246 -142 -382 -293 -483 -489 -164 -357 107 248 142 44 28 301 100 -312 221 -7 -142 37 284 73 11 30
1268 30 177 4 -148 62 271 -67 -571 -160 -229 115 -369 192 208 -195 94 274 509 18 172 254 216 -123
1290 -123 226 89 -273 -210 -5 -132 -379 -321 15 43 -337 94 176 -271 -113 10 144 6 98 198 176 -40
1312 -40 130 -26 259 -243 99 -43 87 -385 -378 -12 -147 -260 -21 -65 229 87 132 423 -56 182 329 152
1334 152 -26 59 373 135 -150 63 62 -293 132 149 -89 -279 -233 121 -16 -79 57 238 -13 -326 108 -37
1356 -37 46 -25 225 298 -162 4 248 1 -366 -230 -264 -103 -6 -132 -53 -217 -112 61 32 85 -15 133 -65
1379 -65 -139 194 -123 354 -202 -105 82 57 -23 198 90 -48 -68 -136 3 -377 -265 -153 112 -47 48 259 222
1402 222 142 101 357 102 106 238 -149 -52 -162 -148 -400 -269 -234 126 -345 -89 -182 70 18 21 40 34 15 169 57
1427 57 -246 35 188 379 113 189 406 318 -286 19 -23 -352 -312 -186 -101 -188 75 -57 226 144 -42 145 326
1450 326 109 54 175 285 -134 -8 328 -302 -225 50 110 -30 39 146 256 103 -147 266 18 -744 -275
1471 -275 -4 109 -42 282 376 140 153 218 142 4 -197 -1 -153 -553 -45 -151 180 -283 -126 147 -19
1492 -19 -5 86 95 -125 119 -37 -156 -233 -112 -14 -315 6 -14 387 90 17 112 238 129 -142 -265 101 -140
1515 -140 -271 250 -119 197 134 531 197 106 226 273 61 14 -78 -198 -325 -163 79 -41 -154 362 262 150
1537 150 137 346 194 -25 65 137 -168 -584 -102 -110 119 186 107 47 223 -26 392 -163 -169 -71 -347 -312 -369 -209
1561 -209 -53 222 53 233 280 335 202 208 434 228 -242 -123 -76 -219 -258 -57 27 -94 61 173 208 -106 262
1584 262 97 -46 45 -110 -149 -461 -297 32 187 -30 368 125 464 343 132 85 -356 -125 38 86 -225
1605 -225 -252 -259 138 -52 102 202 322 -68 -131 -58 -30 43 -112 -32 -373 -230 112 44 -11 87 302 314 34 185
1629 185 -240 -343 -54 -271 -49 -121 -182 -332 227 -52 173 381 271 138 82 262 255 -16 -159 -55 10 -189
1651 -189 14 -19 -251 98 332 174 70 224 306 -138 -119 98 114 -118 151 133 148 72 142 25 126 69 138
1674 138 51 -117 -335 -419 143 -159 -152 -284 21 -350 74 292 145 -50 -262 -91 -12 -189 65 -155 -139 -174
1696 -174 -207 -14 63 67 95 147 100 270 -108 23 -128 -227 92 164 -102 159 31 165 99 -57 108 117 40 -31 88
1721 88 -137 -46 -86 92 26 69 155 63 -303 -42 -21 64 283 178 256 -124 -10 89 35 248 75 -97 -380 -154
1745 -154 -8 -61 -25 173 58 -93 -69 41 -109 32 -5 -61 75 27 153 -70 -33 -68 -64 113 -60 -71 285 -35
1769 -35 -292 -40 -23 -159 -10 7 13 19 -295 -85 241 180 25 1 -143 -11 40 36 43 -58 -27 394 162 -325 132
1794 132 39 126 -133 -88 20 -151 -171 25 -1 -109 90 135 127 -191 -38 6 -24 -84 68 -83 -184 -231 -213 166
1818 166 110 -3 -263 -1 -90 -163 -1 145 -301 17 244 -115 -59 -118 373 -109 -173 -125 154 -167 -61 288
1840 288 -59 -128 486 74 -49 -109 133 74 56 -172 14 114 -273 47 -10 195 -91 -82 83 62 310 -4 -127
1863 -127 -288 -18 -76 140 75 53 310 -198 272 28 -88 71 -72 -85 362 -64 -321 -29 137 -175 -17
1884 -17 -51 -183 15 -64 105 -246 -265 -128 -198 -132 -23 77 -77 161 -55 87 -88 -121 -130 78 -27 123 -204
1907 -204 -68 131 -127 3 89 -330 -152 147 231 -324 -77 107 193 4 34 272 33 188 193 -127 -329 105
1929 105 144 31 -204 -117 -84 -13 -239 43 -311 9 73 86 2 -293 -262 -61 -159 -61 73 149 191 -113 43 32
1953 32 6 7 153 59 -230 -118 -202 -75 -29 -174 -84 -30 -300 187 300 -10 -70 5 -363 -38 -403 29 42 20
1977 20 -178 -54 29 31 17 294 11 247 -170 -125 15 -302 121 141 -145 -59 179 -30 -222 -11 204 93 87
2000 87 -267 133 50 -235 -38 -57 -66 -174 201 297 157 115 24 128 66 67 34 255 -279 -99 -74 14 183 -193 -85
2025 -85 -156 181 79 4 -212 317 -165 -125 -273 146 -118 -238 -214 -87 -67 -16 200 309 26 -78 -134 -18 248
2048 248 1 -79 99 -176 3 25 148 -188 -18 63 159 -95 46 -43 -135 -104 61 165 131 -26 312 36 -9
2071 -9 -4 -68 56 -97 -183 178 -105 -105 136 -100 -91 -70 141 128 198 -41 -122 -189 12 -50 -338 40 105 -98 -24 -213
2097 -213 -147 -2 66 102 -132 113 204 102 160 75 -209 -55 -141 -215 -172 -221 -19 -97 -120 -66 83 49 201 237 44
2122 44 -224 -36 -103 -78 98 281 -93 389 -9 -12 102 -103 -277 -69 46 -14 -322 -181 -36 -181 -59 -254
2144 -254 11 -96 -289 -279 182 -168 -82 -198 -182 -54 -146 -38 -118 -235 -153 -73 49 -155 -47 187 48 35 71
2167 71 -116 -49 -140 292 5 219 61 167 -288 356 -21 -54 -13 -59 117 -102 -193 -50 81 177 27 47 21
2190 21 335 47 1 -135 -43 48 -228 -143 -109 -227 -128 192 44 184 16 83 -19 -277 37 -22 -271 125 -73
2213 -73 -196 -85 220 218 -10 -313 72 6 27 -48 -151 164 -60 243 -36 -205 -202 -235 -173 151 229 3 63 -94
2237 -94 218 -131 99 -17 -138 -127 -29 -84 -8 -327 -90 19 41 -109 169 -80 198 138 236 -21 -99 -48 -85 -160
2261 -160 -159 106 172 -23 78 189 41 19 -195 -7 -213 -123 204 43 -99 174 13 67 185 355 -103 285
2283 285 183 125 196 -39 250 -127 -312 476 245 -19 -34 -215 64 -124 -70 -132 4 -75 -163 -87 -98 51 53 111
2307 111 63 -134 -1 133 -42 19 -18 -164 61 -11 -330 107 -18 -26 108 121 -162 -33 -173 -74 191 39 -243
2330 -243 87 -315 76 -3 188 32 -196 -88 -73 -62 -345 -20 62 16 111 129 -131 149 -118 113 250 -9
2352 -9 -217 66 3 94 103 -53 32 85 -57 114 164 -4 38 29 -28 0 145 -5 -49 11 27 59 -91 163 -23 -213
2378 -213 -67 -205 -65 94 -19 -6 11 -120 63 79 167 -139 0 262 -365 51 126 -34 126 -63 202 -179
2400 -179 56 -119 -13 139 36 36 80 -133 8 69 291 95 153 31 -67 -31 96 -111 29 -230 -51 180
2422 180 72 -422 291 -140 252 37 275 96 65 -18 308 126 -144 80 75 145 -98 164 96 93 141 -28 68
2445 68 -166 71 -37 -10 6 -41 -27 -112 -47 40 81 -24 -177 -103 -22 -16 -205 192 109 -37 20 12 -57 -312 104 92
2471 92 33 -207 -48 -144 -121 44 -78 -74 -40 -329 -5 66 126 146 -89 -39 22 41 126 196 -373 -72 63 -244 -262
2496 -262 -45 -76 -210 95 206 21 -106 77 -169 115 -69 187 -76 -79 56 -206 -181 -151 -4 222 -168 -162
2518 -162 -119 122 82 -104 -165 39 65 158 -109 -72 -14 -9 35 -132 344 -64 -97 124 206 199 18 -19 -23 55 57 -94 184
2545 184 114 197 -9 17 108 -397 326 -124 184 -16 -81 -198 -54 -230 -140 80 85 64 116 -49 -51 -61 -277 -102
2569 -102 -160 -156 -483 -14 -22 362 0 -29 162 39 -152 -6 137 94 26 -121 159 -32 85 90 150 -324 -72 41
2593 41 -36 -82 135 -57 -157 41 -164 74 -132 -57 60 -51 -56 -27 330 -92 -29 220 -292 56 -174 -118 34
2616 34 -69 148 -67 -84 128 -220 221 -46 -30 4 32 -304 -200 -38 -196 -61 121 137 -79 47 -3 130
2638 130 270 31 40 135 -230 -26 -160 -59 14 88 -51 65 -29 -3 -175 -222 -39 32 -450 6 -52 102 -33
2661 -33 -256 99 -79 79 -255 210 -99 168 226 -62 -284 -95 293 -69 -129 -79 -159 -157 50 21 -43 -171 89
2684 89 -35 71 26 76 -215 41 24 -53 -172 -140 32 120 23 234 -53 -47 -104 153 139 -25 112 64 41 100 142
2709 142 104 -125 55 2 87 -26 -24 137 243 105 -251 294 -290 -179 -349 -60 -126 59 33 109 39 -98 8
2732 8 174 -140 -201 104 -71 -64 292 -68 308 41 -138 -139 172 235 1 80 -74 -100 20 -177 14 -64 -104 -36
2756 -36 346 180 -98 207 13 -132 -196 44 51 -132 -16 134 144 226 -62 152 -160 -238 112 -50 -128 78 -68
2779 -68 -47 224 44 171 -71 -125 -151 -138 50 167 7 363 -51 102 -96 -28 -132 40 -65 -58 166 -12 -209
2802 -209 -21 60 -337 97 -51 -77 22 139 -232 58 -52 131 443 139 -25 5 32 -47 -40 -80 26 -189 -6
2825 -6 -156 -27 163 139 39 231 117 38 -108 81 -5 -108 -55 118 199 -295 164 69 234 117 -97 -55 204
2848 204 -36 -18 167 87 25 -134 55 -100 64 -72 -299 -107 -1 -7 -55 -111 -73 -37 -207 -336 -294 -56 -124 14
2872 14 30 175 97 40 -36 -29 -10 -124 -193 64 -97 16 -7 166 51 128 -110 -3 32 -123 319 -282 -87 99
2896 99 53 51 120 -92 -117 -12 -70 -220 -105 -175 81 207 62 -185 -171 -123 193 40 -117 -16 -1 -235 -85 -90
2920 -90 -4 12 -48 3 170 -16 121 -29 -126 -16 50 -144 -248 15 153 -237 -91 80 104 -34 42 103 48 -35
2944 -35 -133 193 -284 -24 72 219 -12 101 -1 27 63 -291 46 113 63 125 -47 122 100 -127 143 173 265 -58
2968 -58 -158 1 94 -58 301 200 161 -213 5 -126 -77 181 155 68 -107 -68 208 -155 62 -313 -208 7
2990 7 12 160 -14 -195 176 115 64 -341 1 153 -41 -9 -125 -252 159 -224 77 -73 -121 196 157 32 116
3013 116 -41 38 71 133 -71 -111 -268 -156 102 335 -53 13 27 54 112 -202 22 88 131 -278 -83 -275 -122
3036 -122 12 214 154 87 -68 508 -140 -115 -49 68 26 -7 46 100 54 -177 139 -143 81 76 -309 54 6 -78
3060 -78 177 -199 -79 199 25 72 84 162 -23 -56 -27 -105 -109 -262 -82 2 -98 -234 25 -3 256 -119 -15 147
3084 147 105 100 117 9 80 -54 165 219 127 97 -132 49 -62 52 142 -92 -51 -302 -28 37 26 -138 40 -113
3108 -113 57 -49 -158 -130 -85 -40 -99 -31 72 -19 154 76 387 -27 -39 -150 57 113 -46 -115 31 73 -32 -30
3132 -30 40 -100 91 58 12 -220 35 -2 -72 -78 -82 -55 -39 -99 -28 172 -52 132 82 4 30 -191 -131 133 5 -105
3158 -105 222 42 65 -114 -146 202 33 -95 -198 -110 2 -34 6 -63 -135 -166 -274 -302 69 -24 199 70 -30
3181 -30 -26 173 65 -50 244 227 -132 -62 201 -160 -104 -149 243 -112 127 105 -102 -199 -138 18 55 -108 152 -38
3205 -38 -356 -39 -277 -1 -35 -94 -175 -140 214 -138 35 -97 274 115 -84 -3 17 -121 -75 200 97 4 -184
3228 -184 45 -54 -91 -1 50 -75 -249 129 -76 155 -106 132 327 -223 -143 83 -75 24 92 -193 229 37
3250 37 13 51 -56 149 -176 160 -60 110 41 -76 26 173 -18 10 -73 -142 -5 -8 -55 90 190 -62 100
3273 100 56 276 151 -93 139 -169 -56 -121 -37 -228 -66 -154 6 -17 110 31 252 209 32 -171 -99 31 -39
3296 -39 101 -20 -7 56 154 -126 137 -29 -69 347 -79 -212 126 -4 148 104 128 13 -194 -138 46 22 -110
3319 -110 174 110 187 97 10 -155 -166 66 181 255 178 106 323 -131 -42 -102 53 52 -154 131 21 189 108 8
3343 8 -97 -126 -117 -32 225 -148 210 -126 -2 -76 -145 1 -113 35 -125 55 -13 37 235 -115 -96 -16 -168 241
3367 241 126 -72 37 -34 -2 169 15 -62 -19 -50 -30 40 -118 133 -115 209 101 51 -167 -110 -100 126 -220
3390 -220 -145 -129 -126 -218 -42 216 -28 224 -153 -1 -130 89 -167 187 -49 247 -48 -149 -255 -141 81 73
3412 73 61 -41 118 34 108 86 245 -40 34 10 -76 204 -28 87 -177 106 167 -144 -26 -149 -55 -96 47 142
3436 142 141 52 -71 25 -100 -47 -119 49 115 385 -14 -28 -89 152 -234 4 138 -40 64 -122 258 -90 144
3459 144 120 -172 -65 -222 -249 -210 97 -122 -7 -43 257 67 118 -25 -61 157 132 108 -38 -108 132 -192 82
3482 82 45 -311 30 145 152 43 29 39 33 -39 -212 -106 -130 150 101 -139 52 -87 87 322 205 -8 40 -16
3506 -16 -162 120 274 -11 252 85 -57 73 -73 -15 132 -118 163 -91 226 14 -112 103 54 -69 116
3527 116 35 -56 2 43 -237 33 -283 48 257 -156 -180 -304 63 -106 -4 74 247 59 -43 -26 54 -70 -231
3550 -231 -24 52 -286 145 47 22 -114 64 -72 -175 -65 -43 -33 103 -62 162 -21 -185 189 207 165 -156
3572 -156 -185 50 61 1 -312 -12 -62 -161 91 -156 381 -88 97 139 103 -79 17 245 -120 -159 80 -270 -289
3595 -289 52 -110 -30 388 -13 -6 -28 16 -259 -48 -6 100 -173 32 -119 -114 94 -54 44 -129 40 232 192
3618 192 -170 -289 80 12 -125 -123 -131 -46 -104 129 -98 1 -10 39 -65 4 14 29 0 171 252 -30 -3 183 208 -266
3644 -266 38 -134 44 224 74 -13 -167 4 -8 71 98 -167 0 52 -194 178 -124 -17 142 152 -62 -9
3666 -9 196 27 -78 36 11 105 101 91 71 -125 120 -208 -113 67 -51 273 15 -75 -46 172 251 -83 -167 -113 76
3691 76 -96 438 -89 -69 79 -17 -96 103 -367 -13 -80 81 56 -29 38 116 56 60 172 148 -81 -39 -261 101 -111
3716 -111 1 62 -116 -186 -263 46 153 99 4 232 -220 9 49 -97 136 -72 -14 118 93 155 99 125 -121 200
3740 200 60 -90 -354 -320 -5 166 -217 -33 225 62 -87 105 270 -68 91 140 -81 150 -33 87 240
3761 240 7 -92 87 368 92 -93 57 -32 87 -33 153 -104 51 110 -212 -98 17 -36 -24 171 191 207
3783 207 -38 93 75 -29 -96 260 -52 14 54 -62 136 -9 248 62 194 -11 115 218 112 14 -138 275
3805 275 77 6 22 -135 -35 -255 -13 -74 -103 130 10 257 186 48 -60 41 -54 315 392 -3 301 -262
3827 -262 -26 53 -20 286 157 14 183 102 -28 -22 -259 206 80 -116 127 93 353 -38 -91 -104 -52 45 139 235
3851 235 -162 -119 -112 -259 36 166 -11 23 -59 112 72 -81 9 -354 144 -66 4 -135 64 155 -59 17 1 109
3875 109 -88 -134 -31 -41 29 -122 -56 27 -61 -25 -92 12 -52 85 19 -5 204 -62 51 223 -96 74 147 311
3899 311 -111 -38 -159 121 102 -61 52 240 304 -168 288 -13 -267 152 133 227 -47 -3 -8 357 163 30 6
3922 6 -69 -128 -5 129 -185 112 237 -223 -19 -110 -45 -37 55 -139 -66 -36 106 102 99 -103 -36 140 -16 97 102 -16
3948 -16 24 208 -7 41 7 238 -115 -10 -74 117 -102 23 -235 -20 -267 26 -67 116 -20 -84 -12 241 -110
3971 -110 -102 17 106 210 -208 -235 -145 122 96 -68 -1 78 146 -225 18 -63 162 34 18 -39 -21 -25 -312 67 -12
3996 -12 109 -35 45 18 -199 8 26 2 33 159 30 114 -60 -60 166 -105 -74 -62 3 95 -243 262 193 -324 155
4021 155 20 -126 174 82 61 -5 -194 108 26 60 -158 -181 135 -4 -3 165 -63 129 83 144 -145 133 -8
4044 -8 95 9 87 17 -148 8 11 -250 75 69 10 -149 -64 64 79 126 -84 -135 166 45 -206 6 -177 -129 154
4069 154 -13 53 7 108 -118 -137 134 -89 -1 -297 -111 -48 15 90 -4 225 -75 166 7 50 124 88 3 114
4093 114 77 71 47 -92 52 -106 -42 67 -139 -165 39 221 13 242 76 -143 101 -166 -118 110 -163 -103 -74
4116 -74 87 84 58 -107 36 154 -196 151 -264 47 -45 -67 -179 -384 15 29 -64 100 8 114 76 -105 -223
4139 -223 207 217 76 -179 -223 -55 268 -251 50 103 183 -196 221 -183 -25 335 -60 77 -10 90 152 253
4161 253 115 -193 -95 125 49 37 94 -30 146 79 -202 -6 -152 -10 -19 -155 150 -93 -101 -49 -72 -47 -28 85
4185 85 -92 -16 -79 -73 -185 160 -37 -212 39 54 -107 -5 38 207 169 69 -120 -37 187 136 197 208 76 -284
4209 -284 150 -169 -113 -147 -143 -102 -27 57 74 -69 -88 -29 -83 -182 165 260 34 -48 252 -51 -118 91 -145 48 23
4234 23 52 198 -17 5 225 2 22 83 168 -23 259 -44 -268 -265 46 -40 -90 -200 -60 -78 33 12 288 38
4258 38 -110 17 252 -208 212 179 -53 84 352 -138 47 72 -26 -252 -34 -105 -107 178 -42 -48 116 330 -115
4281 -115 -158 -245 -99 56 10 -72 -126 7 149 332 86 41 -141 -256 -7 -48 -159 22 228 49 -126 -62 49
4304 49 -125 -110 10 96 131 111 70 8 29 192 -6 57 173 -19 -91 121 -71 23 66 180 -67 -144 246 -70
4328 -70 -85 321 119 -399 -31 29 -254 21 9 -9 -24 -79 33 -192 -127 -131 138 162 17 78 -62 -84 20 161
4352 161 -24 58 -42 296 -179 -50 6 383 113 270 58 -45 -148 51 165 -149 -19 -268 -31 -220 -28
4373 -28 139 103 -10 -47 1 -247 -4 -340 -247 194 34 -9 -148 -34 101 -122 -11 12 -167 -120 211 -37 4
4396 4 -56 -133 -216 104 49 124 41 101 -227 -145 -173 -105 126 55 164 43 -29 2 182 163 113 155 33 -57 133 201 154
4423 154 -14 31 -84 -38 102 21 -219 147 151 -54 -13 172 256 306 -45 -112 57 -172 191 51 -157 0 26
4446 26 58 -179 213 128 136 -3 25 480 71 238 -76 -57 4 21 213 -56 -288 -99 -8 48 174 164 -183 77
4470 77 -90 173 65 121 228 109 152 -65 32 84 140 -160 -171 -132 104 257 87 -88 -81 106 -54 153 -28
4493 -28 -137 247 -24 94 -212 -151 115 320 -26 296 -230 165 122 -31 -11 -194 -73 -24 16 4 135 -215
4515 -215 -218 -67 102 53 -60 52 -150 -87 69 189 -60 -103 -339 52 45 6 -373 -87 97 -35 322 -64 39
4538 39 71 -84 -92 1 -302 201 50 -15 -228 61 -125 146 124 81 10 -130 61 -127 17 -18 -301 102 253
4561 253 28 253 -10 214 -91 -12 -122 -36 -76 256 -25 -13 91 259 -54 -55 57 1 -170 -77 85 72 -139
4584 -139 62 -75 168 -118 -74 -52 172 -122 31 -1 233 74 101 -419 36 -122 75 104 121 35 102 123 -44
4607 -44 216 -170 103 196 -42 176 -93 -46 -55 -93 102 -168 -112 106 100 -115 70 -47 -57 60 -7 49 -108 -5
4631 -5 -269 156 -26 6 -124 66 71 -35 -27 116 -179 -166 -54 -97 -39 -132 174 16 -148 30 315 -99 80 -113
4655 -113 157 225 58 229 1 146 -63 40 181 -139 -239 90 137 -150 256 165 -231 50 -94 -131 -131 180
4677 180 -14 70 132 -8 138 -85 -159 260 143 109 91 96 127 -10 57 -223 -130 38 -68 12 -178 -36 -252 72
4701 72 -99 32 161 162 -119 -205 77 150 -57 94 -139 -77 209 85 -242 -148 212 -5 -21 91 121 285 17
4724 17 27 -128 -18 3 123 -163 -282 1 102 209 50 -5 -304 -72 -52 -21 31 -152 -296 85 96 92 -85
4747 -85 -133 11 138 -49 -111 243 86 -118 -68 0 -101 78 -42 -248 -71 128 302 79 -75 -106 178 -170
4769 -170 299 -102 107 -94 127 -13 62 -99 -24 56 -226 150 -242 122 54 -97 21 -181 -42 124 -174
4790 -174 37 -37 -27 -265 -15 -377 -9 -76 57 -14 -160 -71 -46 76 37 1 -45 430 -49 -60 179 -116 2
4813 2 433 148 112 -158 42 180 67 157 146 -252 -43 43 -86 -47 46 165 -34 -260 178 196 -30 -101 256
4836 256 -133 -4 -89 78 -86 -22 80 21 143 -186 8 -91 279 58 43 -150 155 -199 -29 -198 -84 -63
4858 -63 -47 124 -151 9 204 85 -180 -139 85 -21 86 62 158 69 -8 -17 304 242 158 -63 46 222 -112 -149
4882 -149 170 -16 43 170 -22 -2 -30 218 100 43 -69 237 -106 -30 238 -93 313 -20 -69 -29 -87 2 -125
4905 -125 -233 56 128 118 -80 -147 -73 30 -141 64 190 -58 -77 -72 82 -84 -218 68 -6 141 78 175 110 66
4929 66 -60 56 195 -157 -28 80 55 -72 -189 186 161 133 384 -102 -100 -103 134 -61 125 -63 -49 -62 -89 250
4953 250 70 -2 112 140 93 -132 -13 58 -69 38 -116 226 94 67 111 -176 -43 116 -32 110 -26 95
4975 95 169 95 -27 -57 -61 203 142 39 51 -74 33 18 180 133 76 22 -138 34 6 -173 -172 139 -285 -255 107
5000 107 -24 -60 31 26 71 182 121 210 -48 -104 -31 -51 89 147 4 -134 -38 -93 32 199 131 -116 31 -137 -62
5025 -62 -18 52 102 201 112 84 -16 70 -104 15 134 -62 84 26 -328 171 180 -54 -5 -74 -19 7 189 -185 8
5050 8 -153 -43 -118 34 150 6 -101 -27 82 -1 -40 -84 182 193 -15 10 -148 -92 66 -80 -227 172 15
5073 15 111 -77 165 -143 292 270 240 106 -125 161 -164 183 -289 175 78 195 6 45 45 47 -77 3 -73 -32
5097 -32 24 210 126 90 115 -227 -89 14 -57 111 203 116 227 -62 169 132 -68 34 -21 -203 240 98 -50
5120 -50 4 -37 -177 156 -38 -55 -59 -124 80 -87 -23 88 8 -60 -59 266 109 -161 215 63 -145 -100 89 -205
5144 -205 -66 -153 228 -259 -380 80 -13 21 -165 -200 -25 -9 -279 163 126 -136 -55 -106 -112 60 72 63 -22 -4 88
5169 88 99 91 -179 -31 -58 -49 9 -50 -84 -236 -176 5 153 -171 -47 165 -95 -4 67 -128 67 -111 -16 94 -19
5194 -19 106 -282 -111 -70 144 -65 228 103 -211 -25 -68 110 -55 -110 0 47 -209 -76 -347 -9 -26 16
5216 16 18 106 -35 -22 -7 97 26 -127 -197 -155 17 -35 32 -202 141 37 133 99 -194 288 -43 49 -164 -221 291
5241 291 -181 106 -258 40 -391 -148 -90 -44 -24 -58 77 84 13 -72 21 -186 86 -29 55 77 16 -235 -174 -150 -54
5266 -54 -2 -166 276 124 98 -202 -152 214 -86 80 -9 -396 21 -239 -173 153 -52 174 -117 -5 46 -51 68
5289 68 -23 -87 25 343 -73 31 -126 295 218 166 -164 -92 22 33 44 10 -271 47 -152 16 94 -294 135
5312 135 94 86 -125 -415 174 -342 76 -160 41 168 -62 -124 -158 273 50 92 -46 117 -42 244 13 5 -12
5335 -12 48 -35 98 -56 -43 135 -74 114 191 88 -85 -21 -87 152 79 101 -101 -111 -176 132 17 122 80 190
5359 190 437 -94 150 -303 -10 -209 -91 65 167 189 -131 114 67 -95 -185 -183 -27 -95 -87 93 -2 -69 -92 103
5383 103 -145 -186 -137 -14 60 -137 66 76 212 210 -253 -114 -215 -120 89 25 75 -28 83 -87 -49 -74 -326 17
5407 17 -178 -40 -308 126 199 -29 -42 -81 8 49 -119 -298 13 278 -115 -37 48 -151 -181 70 93 -262 -282 -112
5431 -112 -115 -34 36 99 -29 23 -7 105 -172 116 92 -7 -115 -174 6 -28 -48 42 -22 29 217 -29 13 -95 -218
5456 -218 176 119 -44 145 52 -111 22 91 -224 129 146 10 7 -88 -162 -250 105 347 92 18 -123 65 201
5479 201 -181 93 201 26 -13 -184 -39 31 -180 -20 35 -113 -135 -151 -89 -107 317 141 83 -146 -112 -69 -19 118
5503 118 91 15 74 -76 112 -33 36 -100 151 19 150 -70 6 -66 6 -87 61 -21 174 -26 -90 -275 -194 -98
5527 -98 112 -231 -236 95 6 37 67 -51 -254 18 -42 80 -96 241 -208 -74 33 50 -95 -32 264 293 -44
5550 -44 -48 -25 -52 -56 -25 -193 -39 30 -132 -151 -26 233 213 75 -16 249 3 12 -5 -244 66 62 -63 -145 127 166
5576 166 2 41 -71 39 -309 47 -285 -35 46 121 172 158 45 54 70 24 -314 -14 151 -176 -154 -263 28
5599 28 14 -30 77 165 -142 62 139 241 233 35 -71 221 206 215 -88 253 -14 -5 -102 223 153 60 316 -14 -40
5624 -40 -98 -27 -119 -78 290 -77 -128 91 -87 85 81 -165 -200 -118 199 -38 -84 -211 84 -24 99 152 -234 -198
5648 -198 -226 117 112 10 154 -192 51 95 129 271 197 16 -124 83 -26 186 -19 142 -259 -27 33 -302
5670 -302 -91 -51 153 -28 -115 -5 -215 218 356 -199 65 -172 -104 121 214 -81 -8 37 -220 75 -170 44
5692 44 -179 122 75 -220 453 161 -177 76 23 44 88 -18 -51 236 -205 39 237 -127 82 20 -23 205 36
5715 36 256 -144 28 -16 118 92 175 186 144 106 93 -95 -52 -7 -5 -124 201 -9 -226 -95 -142 162 125 -107 -286
5740 -286 -158 5 74 -59 -13 -229 -196 374 190 -245 147 -24 68 64 -15 -205 132 -282 -118 70 -144 -52 126
5763 126 -167 61 100 -109 -62 -70 -3 -83 -21 -208 32 -68 85 6 28 -154 -77 51 -20 -31 23 103 -123 -98 -40
5788 -40 -26 -150 -166 148 -90 84 -302 30 249 -210 29 114 17 87 224 -21 102 133 185 -11 36 287 -9
5811 -9 -62 1 79 -36 193 35 129 -299 -185 -83 0 157 -5 -224 7 92 83 112 334 162 -267 -69 264 -248
5835 -248 -58 -66 8 224 18 37 110 305 -49 212 4 14 -17 218 -4 -152 54 -122 -104 123 48 3 86 -130
5859 -130 15 114 112 2 -203 -48 -50 316 -321 80 -47 31 -65 240 23 266 106 73 -44 -123 -130 1 107 -109
5883 -109 230 -363 -30 -9 -206 -244 -69 -339 131 121 395 -65 120 -88 134 -99 -207 73 -280 -138 35
5904 35 239 235 -225 -141 370 -74 60 -47 109 -45 -203 -162 -42 -40 160 182 -73 -63 -133 -33 312 -4 -14 68
5928 68 176 64 180 -68 -165 46 -44 306 -20 18 146 -53 171 23 62 152 -84 -46 -115 152 -50 -7 62
5951 62 8 324 -72 -61 146 -27 -151 -62 -45 -85 131 -93 138 -57 23 1 -108 131 -49 76 -112 62 0
5974 0 -47 -80 -125 -15 -7 33 31 -70 128 155 -181 215 -93 -51 -3 -174 -2 -107 -13 -139 -108 222 146 -85 18
5999 18 111 -15 -76 438 -11 135 -119 -200 -36 -105 -80 82 48 -71 -95 -2 76 -43 -89 -145 -99 122 -122 28
6023 28 -177 238 38 131 73 -90 81 2 160 29 -1 56 2 -115 38 -76 32 7 -415 -28 -84 -45 107
6046 107 -23 58 144 49 73 -3 -147 -3 8 177 -10 129 -37 8 73 139 249 206 132 -9 -1 58 143 44 9 8
6072 8 -310 57 -68 143 -155 -224 57 -58 143 -93 7 -57 -1 13 -171 95 -151 85 -287 98 -51 111
6094 111 -74 57 24 99 -130 -122 -281 99 -19 -90 45 -200 -41 -156 -215 294 229 127 -16 -190 -30 -333
6116 -333 216 -62 144 -59 -21 -60 160 2 -8 -168 53 70 74 24 -22 127 91 -215 -154 -127 -13 42 33 -108 112
6141 112 -97 137 -141 -140 117 86 35 241 -349 199 156 30 -96 -19 80 -45 -253 -117 167 -47 -29 168 -125
6164 -125 -25 90 357 -176 -27 -65 -41 -71 62 15 29 252 130 -31 -220 78 -135 69 27 -118 -145 -16
6186 -16 92 178 129 129 265 249 175 215 -45 82 154 -60 -136 -109 108 61 195 -107 156 -161 -124 -128 -151 96 218
6211 218 51 95 115 -20 -11 -31 -44 -48 -36 3 160 -65 174 54 180 65 -146 -49 35 -203 55 -139 -96 70
6235 70 46 -192 161 -204 56 -117 45 73 127 106 40 -233 -95 -13 -73 43 -117 149 -38 -463 -201 -17 4
6258 4 435 26 93 143 150 -256 177 16 -47 -47 67 225 61 47 114 -163 49 158 59 -47 170 91 184 168 90
6283 90 -83 171 118 175 97 27 -7 58 30 151 195 -125 32 -66 98 -151 -96 -3 -83 -118 -184 -128 193 -18 -51 32
6309 32 185 -216 83 45 -21 -244 -48 41 34 -182 145 202 -91 258 -30 -69 -97 -154 10 -137 -152 -47 -34 -65
6333 -65 -85 138 -55 -39 6 -106 180 -150 -17 -26 -33 85 26 -43 53 -10 -16 -115 158 -65 -160 -120 -171 106 81 -8 75
6360 75 -90 15 150 -73 -253 112 46 -21 171 -173 -144 -7 127 49 -53 -236 -101 4 -101 69 -171 301
6382 301 -19 50 143 -104 342 -31 62 67 -83 -182 -87 114 259 25 117 123 -111 6 118 50 -79 22 77 12
6406 12 -231 -311 66 144 294 36 52 -149 -293 -129 73 3 -21 -159 -113 40 32 210 52 66 -117 27 -44 86
6430 86 151 -222 88 -70 -46 -171 75 -129 112 -135 126 -5 52 108 -206 -249 -294 93 -102 225 -22 35 -67
6453 -67 -31 -124 -43 103 226 -134 89 -64 -140 65 119 217 -131 61 315 -248 -231 124 -223 229 -13 14 171
6476 171 -91 -116 -209 201 -155 52 -89 -62 176 335 -16 -100 -523 228 -34 -176 -154 -101 -85 2 -102 46 -124
6499 -124 -158 -80 -83 -59 237 -40 -216 326 -77 264 -33 -143 121 -197 -165 12 242 -169 -47 30 -236 188
6521 188 155 20 66 135 140 38 88 118 231 173 298 82 -45 55 -12 13 -218 -127 20 29 97 -150 13 181 -147
6546 -147 70 275 29 334 103 94 -56 -14 203 -18 206 -73 -121 -209 -16 205 167 -219 -106 156 31 -53
6568 -53 246 82 -294 -4 -133 49 91 100 -152 -363 -262 -103 101 -12 65 11 -40 -87 133 -58 273 172 231
6591 231 66 -49 96 -143 165 32 -6 22 59 145 -122 184 247 44 38 -78 -151 15 -65 -6 40 120 66 -62
6615 -62 -71 150 224 -91 -71 111 46 40 -139 -12 19 163 32 185 -80 47 -24 67 165 -26 -33 174 239 -67 17
6640 17 3 105 201 202 -242 -72 -124 -70 -181 55 -194 93 -84 -176 37 178 143 124 14 -188 -81 69 -120
6663 -120 89 89 290 -73 72 145 -184 160 -258 -36 83 -137 116 115 138 63 -266 -57 -203 22 28 -167 26
6686 26 68 -67 -138 -130 -11 130 -36 95 -45 -124 -45 -16 128 37 68 -225 -129 -177 58 -143 28 103 -147 -89 -134
6711 -134 24 -98 15 -66 -52 -25 132 167 -58 132 146 340 115 35 105 -31 77 80 -384 -43 239 365 -110
6734 -110 -55 -7 -124 197 197 -179 -101 18 -151 129 -161 17 -126 32 136 -53 -101 176 -7 -53 138 -70
6756 -70 96 -46 -245 136 192 212 72 -61 -4 0 72 -170 41 -73 46 -240 -71 -42 -185 1 149 21 117
6779 117 134 -93 -54 127 100 -6 216 130 -117 -132 148 -113 -29 182 -321 -220 213 -165 -232 -163 255 -13 164
6802 164 79 318 166 -144 -230 43 -39 28 -18 -43 76 -38 -276 80 234 -147 326 66 -171 -41 174 -135
6824 -135 77 -17 65 -28 181 21 66 -196 51 -212 -274 231 102 65 146 -288 -31 333 -82 -87 185 -100 -208
6847 -208 -164 35 121 -24 -284 45 183 -49 45 79 -9 77 228 -27 -150 -86 79 279 48 86 12 -150 191
6870 191 442 -85 2 10 -45 94 -67 -83 -102 -133 -46 136 55 -262 123 97 65 -6 -157 -155 -3 26 -61 157 -208
6895 -208 24 -28 128 4 60 -5 -2 183 76 -77 68 -53 75 39 -11 96 -70 109 -189 235 222 254 -179
6918 -179 -7 -15 101 187 -3 -96 23 -274 4 124 -9 -35 -118 248 -64 99 -101 -183 -299 -235 143 14 27
6941 27 20 -155 136 23 -100 160 191 -106 15 -105 -129 144 253 26 68 60 -119 39 -134 -36 -3 88 218 177
6965 177 47 -214 99 -109 -110 -172 42 -101 13 -68 -96 -243 67 91 -168 232 131 -190 -39 -82 -208 -62
6987 -62 204 128 197 10 112 53 -149 -49 79 204 -59 -17 111 -69 206 -178 99 -188 -24 -27 127 3
7009 3 114 98 -144 18 58 -12 6 49 -144 -79 -85 338 -62 -164 -106 -188 -132 -82 5 72 -20 111 164 -12 -152 78
7035 78 12 43 -96 -36 80 -21 -32 -79 -113 -66 117 7 -4 15 -98 -220 35 -86 -207 73 4 -52 -103 38
7059 38 -23 0 289 -59 197 -194 -149 -63 -99 -93 -160 -67 174 -5 86 45 171 238 -17 -142 67 158 -220 49 135
7084 135 28 48 12 -92 -249 -70 53 -58 195 -90 207 33 -77 13 27 202 145 83 -64 -144 -58 -218 29
7107 29 -179 61 21 120 -70 174 42 -129 -63 62 58 152 -83 -145 -278 167 62 -188 136 -205 -79 99 37
7130 37 119 94 -136 -257 -262 63 140 -152 -138 9 -199 -77 140 45 -80 -190 96 -175 207 376 65 28 -128
7153 -128 -23 -172 -129 34 53 -72 32 63 -88 210 -76 95 -61 218 -140 -49 223 22 94 -9 100 -56
7175 -56 -185 20 174 86 -92 -84 25 107 48 178 -191 21 -69 -228 71 69 29 -37 -34 -258 40 10 -35 369 -155
7200 -155 49 -76 125 -222 145 28 41 -256 148 160 24 73 100 72 -20 180 -40 76 -52 75 -56 -38
7222 -38 70 -80 -58 -83 109 -249 -147 -180 21 -110 -91 -163 -78 197 -12 -19 21 -21 -17 27 -149 -27 200 40 232
7247 232 -172 -71 309 34 -19 70 42 -61 -121 -18 70 297 -61 186 52 54 28 -188 238 -5 -27 -231 229
7270 229 90 -161 88 33 -6 17 261 24 389 131 281 172 222 54 -165 102 -194 21 -144 -122 172 -227
7292 -227 85 -96 -148 54 -178 88 41 -180 39 253 5 -79 77 146 106 36 -207 15 5 21 -134 161 -17
7315 -17 -138 -162 128 -5 254 -143 -22 273 -167 -91 49 -170 45 -148 13 -79 83 151 -282 -111 -76 -125
7337 -125 -34 -14 -14 274 -75 59 15 -215 -107 -114 -13 -124 94 210 -46 -214 -75 -86 -65 74 44 -163 140
7360 140 -192 -11 -71 68 -27 103 -153 164 146 -74 81 -19 67 -134 87 91 -28 148 -221 -55 -66 29 -199
7383 -199 41 -193 100 -79 100 -45 -156 -268 -28 -243 2 -215 61 221 -43 -113 59 43 253 168 -163
7404 -163 53 113 207 -205 139 -58 114 -122 310 -14 154 -36 18 -143 -38 -143 35 -64 4 -25 -86 -105 25
7427 25 -235 -75 11 244 -92 28 -27 326 -128 -225 -76 103 191 -20 170 -208 -204 4 -66 41 114 -137 -22
7450 -22 261 233 128 37 144 -166 136 -41 -57 81 -99 -40 -178 -74 73 188 162 72 46 157 -67 89 -83
7473 -83 -163 -50 -92 -92 -50 -254 -39 147 88 114 77 -126 -26 -12 -435 150 24 126 -228 -72 201 -76 -7 184
7497 184 -115 -87 160 128 102 155 -72 -114 159 17 -55 -31 103 -109 -69 128 310 26 134 17 10 -129 -110 112
7521 112 -64 -142 49 88 156 -53 -79 -175 -98 -33 -26 -134 127 -294 -87 48 61 25 -129 67 -303 -69 -89 167
7545 167 78 -7 5 -199 21 -63 254 21 -118 -36 -54 0 187 85 -147 110 -103 163 214 -98 -20 -98 -77 33
7569 33 32 31 -38 159 33 -125 -72 37 -211 70 -24 122 -194 -77 274 90 54 -40 118 -230 234 46 8 62
7593 62 234 -68 -133 18 20 29 -225 36 -57 -137 -125 -110 146 -238 64 66 148 -42 117 142 -98 328 -187 179 -114
7618 -114 -77 -26 -191 19 -189 -38 91 -178 -4 -29 -164 -8 20 201 125 -53 104 -218 -58 241 -22 -38
7640 -38 -40 29 42 -225 -128 220 -161 -136 -232 -122 -6 -339 11 -151 33 -330 54 219 -63 -6 -89 188 -133
7663 -133 14 -20 65 -142 -130 -67 48 -86 -137 -24 -82 -37 -61 185 234 90 393 -16 129 146 -163 0 207
7686 207 -188 9 34 69 72 21 -105 250 -27 48 -146 -39 -86 -69 18 39 105 121 90 -84 -14 -205 118 221 -60
7711 -60 -4 7 18 125 -214 85 -60 -7 201 42 115 87 -155 130 -177 126 79 126 -107 -223 -117 -192 198
7734 198 -19 143 -143 38 36 -176 -125 -152 244 203 -298 -180 66 20 16 197 -106 -50 53 11 49 57 -154 -95 -83
7759 -83 185 45 -18 253 61 -168 -214 -95 34 45 -144 -310 -124 99 111 -54 -244 -213 -37 -9 70 95 36
7782 36 -168 -91 114 131 224 -204 44 -77 -194 71 84 135 -240 -104 23 312 93 -87 308 77 105 -129
7804 -129 28 -214 -58 110 17 -85 -55 -130 26 216 -71 -114 -43 99 217 107 40 -82 -129 -24 -108 126 9
7827 9 0 69 149 249 -45 20 1 50 -124 169 170 69 71 112 2 -95 114 48 -10 110 171 -264 -189 22 -142 -186 -188
7854 -188 -50 -134 129 -63 -192 10 45 -215 -174 28 78 16 160 66 -150 151 -37 127 -182 107 164 81 -37
7877 -37 43 39 -125 -55 -31 200 77 -17 -53 -30 -73 26 188 -124 164 -125 -142 8 93 236 -134 -268 -70 91
7901 91 61 -61 11 57 -70 -234 214 -194 85 -241 70 256 -48 82 -106 -235 -54 98 314 14 68 351
7923 351 -181 18 -105 -30 -90 -277 167 -8 -129 16 -227 226 123 -166 -97 291 98 41 100 -203 63 -218
7945 -218 -145 40 204 -137 96 33 84 -158 47 157 59 9 -305 252 -281 -20 -177 -260 63 -142 -219 98
7967 98 194 101 42 -143 177 0 -106 -11 216 66 -55 -34 50 -75 23 135 -184 4 202 -153 -120 -160 87
7990 87 -89 -134 65 -120 -31 93 124 -181 -81 -34 -206 -32 -45 -14 -194 85 134 43 -140 129 23 -50 110
8013 110 -123 -36 213 -113 -38 49 -86 -441 -5 59 25 -161 46 -152 72 -31 217 -90 15 -78 324 -172
8035 -172 -216 -46 9 -75 -67 85 -95 -154 -108 -131 44 152 10 -42 252 182 -63 -9 -10 309 297 -186 103 53 39
8060 39 -114 15 -57 247 -52 -66 -66 166 -70 142 9 100 84 -70 -234 -88 -16 -21 110 -91 59 148 12 -101
8084 -101 92 -15 -110 171 -231 16 171 -49 -151 -5 52 135 284 -40 7 81 -138 32 -19 -94 -285 -37
8106 -37 -2 136 262 228 91 90 -82 190 -244 -159 -59 -38 69 -152 54 -5 -153 144 87 -199 281 203 42
8129 42 185 24 229 197 -120 -290 79 -11 115 28 -237 -361 111 78 -30 -68 99 191 26 26 -148 29 -64
8152 -64 208 -57 -177 105 256 59 -45 248 -106 -121 68 -35 -192 -24 -284 -115 -114 -13 358 -128 -26
8173 -26 32 -2 -61 -199 -55 124 172 111 -107 -91 -98 -44 269 3 -31 -45 -123 50
8191E0
$$ Imaginary data points
##PAGE= N=2
##DATA TABLE= (X++(I..I)), XYDATA
0 0 0 0 0 0 0 0 0 0 0 0 0 -8 8 -8 8 -16 16 -24 24 -32 40 -48 56 -64 72 -87 97 -113 131 -152 174 -198 225
33 225 -255 287 -321 361 -407 453 -504 560 -624 692 -768 848 -936 1033 -1137 1253 -1381
50 -1381 1521 -1676 1846 -2037 2252 -2493 2766 -3080 3445 -3876 4391 -5022 5816 -6847 8247
65 8247 -10265 13436 -19167 32859 -138371 -92474 48227 -131923 -17303 11773 93976 -61347
77 -61347 -15348 130712 -98449 -39813 40635 -41412 -14628 -62784 68360 -29311 -84232 68022
89 68022 -45804 -28785 -12174 -6117 40640 -84256 43369 23531 -82430 13995 -21619 2486
101 2486 -35240 5097 100915 -41156 54429 88616 -14425 18691 -8700 22124 -57796 -56847
113 -56847 46135 -78422 -28214 18066 -29936 695 -26443 40534 1319 -19102 68747 -6862
125 -6862 19327 22172 -9854 26536 -30876 11576 8852 -12554 36871 -8288 32413 15513 -21036
138 -21036 24760 -27742 -14534 -14609 -24215 10981 -27667 16551 18523 -5524 35391 7063 29286
151 29286 24163 8156 40360 3602 12812 4844 -13675 231 -36545 -10176 -7378 -27317 8490
164 8490 760 8341 4903 4789 18356 -17009 3485 8997 -14285 8355 8745 11706 6136 10677
178 10677 22434 -7152 4036 10641 -11932 -6444 -6239 -6708 -17634 -18532 -4094 -19550 -15140 -1525
192 -1525 -1392 4715 6477 17385 17917 8031 12628 10651 1983 -4115 -2409 342 -9532 -9512 491 -4834
208 -4834 -11273 -3390 -1038 -7444 -7854 -410 767 -6804 348 5474 -417 3356 6404 9830 8589
223 8589 6600 14159 7354 4050 4548 -1774 -1578 -10938 -8348 -6390 -14732 -5529 -6162 -5236 -795 -1227
239 -1227 7224 459 6472 12369 1126 10324 8354 3983 3905 711 7001 -6826 -3133 5246 -9728
254 -9728 -4139 -2734 -4036 -6774 -10961 2474 -8692 -9238 3706 -2628 2077 924 7896 10262 -322
269 -322 12273 7151 2296 5929 -663 4463 -5655 -4948 716 -11405 -4359 -6634 -6900 -2602 -8035
284 -8035 2710 -1910 -362 7671 -587 7712 5907 4550 7866 1949 8767 633 -177 6585 -4460
299 -4460 -1059 -2090 -3714 -3724 -9695 -302 -5563 -8453 349 -3919 -305 -1676 2046 6861 -1294 6424
315 6424 6310 2617 5252 1566 5557 -342 -2713 1921 -5201 -4014 -5015 -5360 -3441 -8492 -2637 -2969
331 -2969 -4637 839 -1496 1600 2523 1910 5444 2430 5758 3964 1675 5785 975 96 240 -994
347 -994 -2014 -5790 -2077 -2787 -7693 -2944 -2062 -3132 -2708 64 3694 -612 2560 6890 3134 3417
363 3417 4830 4992 2348 -653 3177 -63 -3382 -691 -2351 -3337 -4394 -3072 -2300 -5347 -2162 -1637
379 -1637 -3469 -148 136 640 1557 2482 3728 1401 4259 4356 -147 2065 1853 -1469 -3295 -2895 -2277
396 -2277 -8075 -5785 -2083 -6048 -4661 -1120 654 -906 -966 5051 1300 -456 3746 2630 1263 787
412 787 2951 2347 -1863 1697 667 -2186 -783 -2038 -1518 -3438 -3167 -1791 -5298 -2232 -2052 -3446
428 -3446 678 1187 3257 3101 5265 7004 1928 4002 3585 -1012 -1238 -1806 -649 -4855 -3829 647
444 647 -3795 -3135 -295 -475 -1032 -1656 2799 1098 -1195 3291 1031 433 34 898 2642 279 3550
461 3550 4110 2550 3710 1206 753 -1359 -4112 -3535 -5320 -3383 -2886 -2421 1620 1130 2800 3824 4100
478 4100 5391 2942 5063 4909 1815 1888 612 -97 -2360 -3043 -336 -1957 -916 1676 1666 1894 -67
495 -67 941 -409 -3260 -1903 -1949 -1174 -570 950 4017 3324 3438 4359 3300 2082 -57 480 -175 -3038
513 -3038 -3187 -3484 -4676 -5915 -5228 -2409 -2480 -588 2764 3843 3885 3490 3060 1314 -1605 -1816 -1828 -2415
531 -2415 -1742 -279 1190 1026 557 538 0 -1242 -2472 -2045 -2195 -2705 -2884 -1959 -2113 -2369 -1286 598
549 598 1627 2245 4826 6282 4717 3544 2434 265 -2859 -4665 -4119 -4774 -4345 -2397 -242 704 640
566 640 1815 1878 838 379 599 994 63 -757 375 92 -1031 -849 169 947 578 1740 2906 1168
584 1168 92 -718 -2299 -4842 -6052 -3829 -3779 -3052 281 2150 3369 3266 4028 3899 1506 1828 1137
601 1137 357 -123 -1130 -457 -1523 -2095 -1573 -2069 -363 -454 644 2265 2019 1646 798 268 -755 -2886
619 -2886 -1464 -628 -734 1735 3357 4517 3208 3006 3088 -361 -1523 -1689 -2517 -3338 -3708 -1592 -1770 -2765
637 -2765 -683 -375 441 481 1923 3349 2087 2305 1805 209 -382 -1886 -1630 -1965 -1790 -373 -178 1186
655 1186 782 208 987 -913 -1823 -2307 -1655 -1097 -2018 56 997 478 1382 2327 2907 1877 1830 3280 1354
674 1354 194 387 -764 -2157 -3353 -2269 -2163 -2427 -392 567 1202 700 1378 2064 537 113 624 303
692 303 213 -523 938 526 -222 558 215 76 -291 -768 21 -731 -1095 -1175 -1726 -1496 -2164 -1505 -431 -641
712 -641 402 1203 2060 2171 1535 2228 907 -283 -261 -460 -889 -1737 -1302 -395 -700 -576 132 -177 -873 -695
732 -695 665 113 -165 674 973 500 32 1181 973 312 1038 1213 1073 257 94 496 -637 -1334 -973
751 -973 -1177 -1499 -1537 -866 -277 -724 -111 812 771 796 739 1249 1150 281 473 496 -99 -853 -556 -259 -1000 -1009 -358
774 -358 -701 -951 -1112 -85 -266 -936 -157 188 66 145 639 1240 440 433 1095 806 213 181 490 -48 -841
795 -841 -239 -524 -1177 -1002 -685 -469 -679 -641 255 144 668 417 807 1035 646 962 870 565 179 362 334
816 334 48 -759 -244 -322 -954 -1127 -583 -564 -1282 -707 -104 -263 -301 241 905 448 142 684 862 13 -93
837 -93 510 389 -658 -261 -55 -833 -1219 -813 -191 -977 -819 -22 -218 -330 -135 600 521 -2 497 1018 677
858 677 312 680 513 245 -18 583 8 -443 -600 -197 -489 -725 -269 -527 -645 -380 -15 3 479 132 580
879 580 1289 795 519 434 757 159 -332 -109 -95 -676 -761 -412 -303 -1203 -725 181 -329 -561 -82 259 -437
900 -437 -290 669 373 -133 518 801 47 208 876 549 -232 43 197 -752 -1327 -886 -569 -1179 -591 204
920 204 133 -110 578 1054 953 407 1025 457 493 569 145 333 321 73 9 -68 330 -139 -69 385 166 -753 -375
943 -375 265 -303 -846 188 179 -341 337 1187 846 809 1154 1213 195 58 211 -415 -1243 -782 -278 -839 -1004
964 -1004 -225 -59 -327 219 777 728 29 471 485 202 -259 -271 -48 -243 -116 299 495 404 520 256 473
985 473 -410 -478 -645 -902 -1132 -773 -197 -39 -396 733 713 792 620 976 950 422 640 394 -55 -454 -762
1006 -762 -955 -580 -693 -586 -173 570 193 330 523 165 -290 -357 -111 -516 -753 163 -42 -171 299 625
1026 625 406 -162 428 391 -567 -791 -234 -570 -1433 -1111 -430 -831 -781 249 680 461 1006 1346 1248 306 277
1047 277 191 -614 -605 -494 -663 -383 -96 404 150 411 320 305 157 31 -143 -366 -367 -495 -493 -252 287 210 495
1070 495 952 1332 732 738 891 -185 -688 -938 -795 -1045 -1217 -450 -182 -342 189 967 514 290 734 1073
1090 1073 4 -451 150 27 -754 -602 -131 -275 -363 -75 373 340 330 511 190 -470 -529 -406 -851 -800 -753
1111 -753 -252 112 604 641 945 1139 637 520 380 311 -508 -531 -438 -879 -720 -619 -67 -329 -122 523 173
1132 173 319 328 559 142 -470 -198 -130 -560 -424 -41 434 -145 707 635 608 150 -86 109 -494 -766 -360 -617
1154 -617 -1002 -646 -303 156 -110 138 662 682 542 721 321 -181 -511 -463 -335 -454 -642 -122 -93 -167 61
1175 61 251 246 -32 5 144 25 -469 -145 -42 -261 -113 90 364 96 67 575 701 452 219 174 -180 -498
1197 -498 -563 -527 -621 -782 -324 44 7 -212 500 471 134 439 392 94 -411 -158 20 -151 -274 -13 -261 -12
1219 -12 -38 -52 384 -242 -84 -72 8 -441 -231 113 -342 27 -53 443 138 174 343 514 -93 145 -32 -101 -324
1242 -324 -285 -33 -305 -442 -210 136 213 53 119 680 254 170 250 424 8 40 39 -104 -124 245 105 -239 -172
1265 -172 41 232 -241 -257 34 -349 -437 -173 50 -165 -41 -124 234 133 71 159 144 -52 -111 -69 -446 -220 -268
1288 -268 -31 -232 -274 -17 -71 46 -391 47 50 -112 46 29 36 140 -51 395 -37 -96 -18 297 413 112 158
1311 158 -31 236 -275 119 40 -117 -280 -168 207 -284 3 352 221 21 227 259 294 -93 170 492 -366
1332 -366 -12 -12 -169 -308 95 -157 -225 -266 53 162 -277 -129 -3 97 -50 -108 245 -104 -75 17 143 37
1354 37 154 71 221 -114 14 -94 -6 -263 -106 -162 -157 -293 -77 108 -116 24 135 286 3 224 162 -38
1376 -38 162 -18 197 -65 -284 313 -1 -21 147 -181 55 62 -250 -340 -60 -85 -104 -49 124 -235 105 330 384
1399 384 27 156 129 30 -11 -258 221 -243 -482 -144 -153 -560 5 90 136 34 182 172 16 110 44 -47 55 46
1423 46 265 -14 61 155 47 420 -61 296 -97 -101 -59 304 -199 -147 -267 -195 122 22 -241 70 199 10 24
1446 24 120 153 -42 14 -228 -231 -68 186 -184 -111 37 165 126 82 258 12 -294 -261 -54 -68 -125 -180 64 -40
1470 -40 -157 -146 65 204 -277 -88 38 -426 -470 -112 -114 -300 -296 94 -146 31 106 401 178 25 121 264 409
1493 409 -46 -2 -14 -323 -322 119 -183 -184 159 290 198 36 145 82 -19 -459 -349 -158 -225 -80 54 129 303
1516 303 7 151 398 259 77 -19 -24 -216 -99 -95 -202 -429 236 107 76 52 305 342 254 244 137 -142 -165 -175
1540 -175 -10 -301 -189 333 306 107 92 215 -7 -27 -71 -89 -134 -513 -438 -140 -204 -67 -50 279 28 350 161
1563 161 346 124 58 132 223 -219 -177 -52 -258 -193 -10 21 177 161 73 135 -69 217 327 -97 -58 -311 65
1586 65 -57 75 333 258 99 162 522 244 59 -34 189 -40 -205 -250 -274 -389 -178 -5 425 238 -37 138
1608 138 288 -58 250 -89 -110 -515 -131 -68 -251 -221 -99 33 185 -67 296 165 -32 -5 155 72 -76 -13
1630 -13 -136 -129 156 310 325 253 422 151 330 14 156 69 75 -348 -165 -127 117 -55 86 166 75 99 487 38
1654 38 -13 77 103 273 -227 99 41 -139 -97 -7 358 54 -50 -13 55 8 -121 -130 -46 -29 -22 -235 -362 -295 70 -58
1680 -58 -70 477 155 197 107 -62 -74 363 -206 -247 26 -113 223 61 -101 14 211 193 245 239 171 -73 -128 -48
1704 -48 -130 116 125 -135 213 349 119 -259 57 -25 -133 14 -93 18 380 277 -29 132 23 111 118 207 -227
1727 -227 63 268 32 105 -79 -127 -120 -26 204 -185 47 163 -13 -287 -188 196 -136 40 -45 95 -125 89
1749 89 208 -22 -84 47 -85 10 196 -188 -278 -72 287 207 -95 137 -170 -16 289 -67 135 101 94 4 243
1772 243 72 -86 -92 70 0 -120 21 -169 264 -86 9 16 286 -203 141 -47 40 -148 -122 145 98 -121 205
1795 205 31 21 103 -167 95 -231 12 -72 185 -179 81 -63 -191 -201 -82 224 -171 119 119 -245 231 192
1817 192 137 64 56 -175 -195 -27 -1 50 -26 -112 25 117 70 92 29 145 48 -88 -113 125 -118 284 -301 164 57
1842 57 -196 9 -257 67 -63 300 67 -279 -218 90 -153 -146 161 -51 -288 41 71 100 -318 -17 -50 -108 36
1865 36 134 70 -164 -273 115 67 128 -69 -85 -19 -147 -100 295 152 -15 -3 -275 -272 -391 -133 -64 128 -54 203
1889 203 -40 -190 117 163 74 128 -74 194 101 -73 2 -3 111 16 -78 -34 20 -37 -108 185 33 -91 131 80 -80
1914 -80 -57 109 -256 53 -277 118 231 283 11 47 -133 23 178 -17 -101 -201 200 0 -68 87 0 270
1936 270 -3 -115 101 -182 219 -106 46 3 131 24 28 65 -74 -60 34 -55 -253 -60 103 -291 82 -17 31
1959 31 -46 242 54 -122 -165 93 -150 -72 123 245 -148 -229 4 171 1 37 -54 -224 -125 59 18 183 -297
1982 -297 -42 105 -29 -4 -49 40 -15 16 31 105 22 78 -48 41 -146 -29 -87 60 -248 -126 -16 -4 -107 -132
2006 -132 97 136 135 269 52 130 8 163 38 -198 3 149 15 83 80 67 -37 112 157 157 -265 -17 191 81
2030 81 -112 -40 21 141 -87 201 261 -80 171 129 30 107 191 -81 147 -182 9 -135 -102 -50 -14 43 90 -42
2054 -42 17 160 173 152 40 -133 -86 -149 -208 65 105 119 -80 88 -63 -132 -36 123 -133 31 -162 118 -55 -56
2078 -56 -153 -7 -114 -55 82 61 77 150 74 103 -41 -88 65 369 -24 -274 -153 36 -31 87 152 -37 -10 292
2102 292 62 31 -195 -109 149 -58 -172 -51 174 66 -161 -212 260 51 91 -111 62 -1 -188 -114 26 21 16
2125 16 78 84 -175 170 15 -29 -1 192 -49 -272 -55 -101 -36 -83 202 0 72 -241 19 33 3 56 137 -154 205
2150 205 -135 -379 66 126 -103 36 66 164 57 10 251 140 -117 -1 -176 -90 -35 20 121 -69 77 -219
2172 -219 15 -122 223 11 -234 -71 -2 9 154 20 18 -19 0 -53 -192 278 98 187 274 91 -160 -87 -140 -172
2196 -172 74 99 10 48 -284 96 49 -203 -28 -196 -222 38 106 -90 -9 -173 126 -106 61 -45 79 33 110
2219 110 84 191 53 -133 -12 96 197 -98 -154 -130 -236 -13 -136 296 -59 37 -36 -4 212 -164 -132 -79 115
2242 115 -40 -303 266 157 -27 66 -37 35 -161 -149 109 123 90 -19 49 199 0 -114 159 -90 148 -73
2264 -73 122 211 -88 -16 15 -233 35 64 -168 -137 -40 177 13 -383 -105 144 122 60 -1 -44 160 129 -111 59
2288 59 46 -10 313 36 153 -258 199 -35 -25 -69 280 149 -249 -25 89 230 122 92 -132 -102 -13 -4 -66 205
2312 205 -303 -71 30 -5 -48 58 -134 161 238 -68 62 -275 60 35 -26 -332 340 -30 -71 78 32 -99
2334 -99 -53 10 -55 -59 -44 89 61 85 -196 -41 -202 -190 -89 -234 -99 142 -17 -46 126 -70 94 -172 -145 -7
2358 -7 115 113 -173 4 -171 40 7 116 63 -109 -4 -121 -239 -79 -315 81 122 -14 -253 -189 194 122 174
2381 174 -214 42 -35 -165 -281 53 88 -64 69 -153 0 106 -20 -112 -121 -272 -50 -85 -248 -34 -122 177
2403 177 -112 64 -156 102 196 34 4 -27 126 -33 111 -120 -138 16 19 32 -194 -124 51 30 223 141 -45
2426 -45 -64 185 76 105 -76 -98 -106 78 -47 -235 -20 41 -19 161 30 165 225 -266 92 278 -48 -120 41
2449 41 201 46 -224 21 -76 -5 -95 -108 2 -84 -79 46 108 -117 49 -92 -155 -140 -97 42 108 110 67 -9 -15 287
2475 287 286 252 278 157 -191 -122 -116 -158 -94 -192 48 3 -46 107 -90 218 -49 -24 -272 -20 129 33 55 -19 62 -162
2501 -162 -40 76 119 62 -46 -188 68 -18 -15 188 -91 -9 -27 75 41 18 -72 377 10 8 -92 89 37 -51 -2
2526 -2 98 161 11 -51 -31 67 -215 -137 -6 -138 31 -67 183 -102 -176 -6 219 178 107 -16 23 -196 -150 -72 -83
2551 -83 39 -90 113 91 271 23 -174 82 -156 69 -150 97 68 87 127 -60 -131 -65 56 -134 151 182 -121
2574 -121 74 -10 -107 191 -133 69 155 41 0 40 120 34 -51 -81 -164 -38 -54 -49 179 89 228 216 -70 -394 -40
2599 -40 18 13 165 103 -44 -69 5 273 -30 148 13 -95 50 -43 70 -93 -7 80 99 -1 48 -11 250 -19
2623 -19 207 -149 -16 40 108 277 -45 -200 -140 -1 202 55 -240 -30 -38 -185 223 -3 256 -132 141 165
2645 165 20 -87 -262 -19 -6 -75 242 23 3 33 -206 38 -116 11 -46 -109 -191 -89 219 -18 -61 -44 -68
2668 -68 -65 125 -349 96 -55 -182 -150 54 165 -78 27 85 -64 112 117 85 311 -336 211 -66 122 -106 28
2691 28 251 -69 186 140 76 -4 8 -142 -188 -299 56 73 61 105 168 48 -40 -280 -26 109 -149 -76 -206 -169
2715 -169 34 69 1 106 18 6 -111 -74 -89 157 318 -326 310 -129 217 94 132 78 -139 102 153 74 -103
2738 -103 -22 -127 -66 182 -228 254 -94 -108 4 195 -91 146 -76 -360 -50 15 -86 82 -10 544 147 -53
2760 -53 80 -237 25 81 115 -461 201 -79 -165 212 42 -140 -141 -88 -158 -67 66 -60 68 -110 -144 -30 -152
2783 -152 -28 -115 -10 52 46 -61 -325 36 97 81 -96 -134 250 -134 -5 -201 -123 58 -1 167 118 110 129 -311
2807 -311 55 -15 103 -34 85 59 75 128 -22 -223 -115 33 -226 -183 65 -50 -108 116 -133 -84 -42 -80 38
2830 38 -16 -74 62 36 -50 12 -18 4 10 20 46 100 -148 6 5 -269 -246 -215 160 -263 230 -53 173 -69 -139 65
2856 65 203 143 -109 58 32 79 -96 181 -168 -350 25 26 -27 -193 -303 222 43 -325 -70 -25 -36 -68 -52 89
2880 89 74 29 -354 28 76 139 -51 75 -27 151 -159 -38 0 120 -22 193 8 -103 42 -197 215 51
2902 51 2 -150 -20 155 168 -329 -132 224 151 17 -33 -112 -1 -98 65 -93 -54 -46 48 60 -152 -127 -23 198
2926 198 -196 -93 -69 -413 241 377 198 -115 112 -81 192 102 185 -36 -111 -117 132 -89 65 14 -156 -120 53
2949 53 36 5 19 28 -397 -126 -111 -60 144 2 427 -50 46 -32 78 90 -123 146 122 -243 66 -226 54 -141
2973 -141 221 151 -77 58 47 -19 78 37 -18 -44 -69 33 84 -117 68 -190 96 77 125 78 5 158 222 4 -82
2998 -82 -100 105 206 13 -37 -6 -191 23 -14 -166 141 -7 -38 -107 -177 131 -25 161 158 20 36 122 275 -120
3022 -120 81 124 -60 76 5 52 322 -18 147 236 285 -88 231 -40 -135 -32 179 -60 155 -207 -82 -300
3044 -300 140 -22 77 -154 -136 -125 67 -32 -72 -53 9 -3 -209 -283 -236 126 -21 133 184 -94 -160 -149 -116 -153 -197
3069 -197 -222 -19 -129 -77 132 -54 -211 -103 -69 -109 202 29 -41 -257 -230 -136 -24 -117 298 -138 -85 -166 163
3092 163 205 87 329 -75 103 -58 174 158 -32 14 57 -338 -51 -69 80 -127 -132 68 -82 115 -236 129
3114 129 39 158 241 -129 263 138 152 -180 -214 85 -50 64 -105 299 197 87 198 92 -150 -68 370 -33
3136 -33 172 -40 -88 80 256 92 191 5 -69 -172 -143 0 -133 38 106 87 -99 67 10 -33 26 -247 -12
3159 -12 -93 -123 -75 216 -127 -38 183 -229 -18 114 -106 114 108 89 13 102 77 137 -71 43 -73 9 -22 48 233
3184 233 -28 2 -37 -334 -196 24 -66 233 82 44 -144 52 245 19 -43 -43 -35 -84 -170 232 -55 141 -61 -74
3208 -74 -15 -207 -91 -206 5 43 104 -125 -103 111 8 173 63 -46 -24 -113 -186 -72 -282 40 226 183 -65
3231 -65 11 138 114 69 6 -12 -168 -101 -52 -13 -263 23 38 10 37 -98 -71 30 -93 246 48 168 223 -37 96
3256 96 -148 -109 82 -162 255 79 -129 -107 -8 16 -217 149 -55 102 -22 132 -10 -36 273 200 -43 -41 -164
3279 -164 56 -14 88 -133 71 -63 81 -83 5 -311 45 -100 190 126 307 215 -244 169 54 186 -232
3300 -232 -110 -134 -95 106 9 -148 87 -9 -138 -5 -155 51 63 37 122 -16 182 65 -36 177 312 -215
3322 -215 -137 154 -228 341 75 181 -54 106 214 -11 -195 231 61 -75 16 196 -225 -107 80 -116 164
3343 164 -2 60 271 2 -223 -310 -261 144 114 344 83 -137 -21 -59 179 183 -224 133 184 -132 -138 -30 69 -75
3367 -75 -55 6 -227 92 -238 241 -157 -259 -200 -175 135 -5 -81 15 63 -346 46 164 6 68 -49 17 22 165
3391 165 13 86 229 96 187 190 330 -159 -94 -114 171 -8 96 -13 -105 172 0 -13 -55 36 112 180 151 55 -56
3416 -56 80 44 19 -281 -166 65 67 200 95 -183 24 -49 16 32 27 446 -88 82 111 111 -89 -43 21 227 171
3441 171 -101 -9 11 52 10 38 -17 205 -227 9 -164 275 77 -180 -89 110 -124 33 -226 -11 58 227 49
3464 49 146 -261 149 -21 -197 -252 -172 -263 -149 159 -75 15 -263 162 -132 110 -45 -7 -139 -8 181 11
3486 11 177 -77 -111 205 6 156 -153 -89 -44 -37 -4 31 -228 -14 109 170 -67 40 -85 155 -60 97 -160
3509 -160 -58 -148 143 132 -141 41 105 114 26 79 135 -22 -32 27 246 45 277 -160 -95 -64 -14 47 -119 -308 148
3534 148 141 -38 234 209 33 69 121 -83 138 -124 160 -518 -102 -87 -68 -186 -18 21 198 118 -461 166 136
3557 136 23 42 -15 50 -61 204 56 16 169 -79 -90 31 247 443 16 -157 24 -40 -236 -106 215 -100
3579 -100 14 -169 286 -22 -121 -87 -563 107 -162 63 241 -304 -245 -70 129 140 -209 23 -48 17 -63 -131 -46
3602 -46 -102 196 285 -232 199 8 -33 -85 108 -44 -14 215 27 26 44 205 157 43 -33 84 -217 4 18 129
3626 129 -137 99 -193 238 34 -31 -91 -34 -196 -23 227 -229 -42 63 75 61 -132 -166 134 -26 -169 -83
3648 -83 223 -169 -45 -29 88 143 -279 -192 -293 -29 132 169 -67 22 106 168 21 5 126 -8 84 14 -11 -117
3672 -117 45 -92 -195 92 -243 -113 -15 481 -105 55 11 -139 65 115 -18 -108 -82 -91 70 39 -57 -275 -141
3695 -141 -112 -65 -45 140 163 -1 19 -3 315 284 254 3 186 47 -192 -13 -216 22 93 9 274 -31 -242
3718 -242 28 -55 165 111 -206 -264 78 111 72 199 -40 -4 -64 157 7 -180 328 -32 -217 109 -17 -127
3740 -127 -83 64 -54 -234 85 -89 -182 -220 -209 18 -1 -1 211 115 30 -228 102 -227 107 -25 157 -186 -147
3763 -147 -113 -273 -122 -94 -156 20 139 46 -116 113 -40 101 64 83 70 108 26 -33 11 -10 25 -103 -67 -99 47
3788 47 -138 123 -235 -40 175 50 -119 -45 -133 21 56 -59 -59 -160 -52 -86 15 -123 -140 -150 66 91 71 190
3812 190 27 169 -100 -140 138 355 227 -6 29 126 44 62 412 -27 143 -242 -217 -3 32 -100 -26 -30 216
3835 216 -52 -3 -130 -139 -62 351 -56 -244 87 88 -51 -39 89 -92 -102 31 108 156 -211 -195 30 -86 278 88
3859 88 -82 93 -68 -213 -1 72 105 -87 -36 -210 49 130 -58 -241 -77 -445 79 56 -106 58 211 -109
3881 -109 109 54 385 -80 56 185 104 -199 7 -39 37 2 -267 25 -166 174 10 75 -65 66 -199 -226
3903 -226 108 -137 44 -41 -275 146 157 -168 -182 -29 -23 -48 140 20 277 41 30 393 59 8 -168 119 71
3926 71 -50 34 -35 -274 -45 152 -73 116 -25 69 118 -189 54 11 -52 -61 231 247 -5 -91 77 -28 -119 -53
3950 -53 -200 99 -78 106 202 96 -70 66 -91 -71 18 -24 -87 -263 -17 49 148 -27 35 -171 -18 36 57 41
3974 41 134 -203 31 -139 20 -145 180 -35 -1 -98 -169 65 -10 -128 -236 174 179 68 -17 -58 -61 4 -75 154 -289
3999 -289 73 66 -275 233 -61 -132 123 171 -145 -89 -71 -74 125 87 -77 82 53 108 77 -56 265 111 -6 -170
4023 -170 346 54 135 -27 58 -45 -35 49 -171 -139 29 29 241 98 -165 -130 -132 -28 -281 90 59 92 -27 101
4047 101 -29 -28 -32 288 169 -217 -121 -208 92 163 -119 82 182 46 -271 -57 531 118 -43 87 209 -98
4069 -98 -74 -22 77 31 63 -94 -282 79 235 226 237 -155 118 153 5 -152 42 110 10 -41 11 -164 19 -138
4093 -138 290 76 -14 69 -25 123 -132 18 -66 -165 12 5 -44 -108 -81 1 -102 194 303 33 -68 -73 21 75 129
4118 129 -155 207 126 3 95 62 -139 -160 37 129 62 300 253 -196 -65 72 62 114 31 -214 140 94 -30 -150
4142 -150 -74 40 186 67 126 -323 17 212 119 -317 -70 84 -91 264 -152 -275 66 209 -150 -17 -127
4163 -127 275 200 -224 190 36 65 10 -37 122 -15 96 -7 -154 -179 2 -7 -42 -63 26 -86 146 -124 163
4186 163 -219 34 -38 -2 89 -95 105 -77 197 -150 -65 -158 101 -321 98 33 201 -90 -219 116 24 -1 -45
4209 -45 -134 10 94 66 214 56 -46 73 56 -136 -199 140 -87 47 -88 -49 -151 62 -147 53 -34 102 23
4232 23 -101 -11 -168 -6 -203 -330 75 -104 4 130 34 -37 6 197 15 184 58 211 -70 -275 70 -184
4254 -184 -58 -71 -33 -26 -163 -98 -46 -165 39 33 48 292 -238 28 -113 -47 122 157 58 -226 95 157 330 -259
4278 -259 -206 240 -51 85 244 -87 -172 -136 190 -3 -173 136 281 59 -19 -108 246 -288 -69 -202 -42 -37
4300 -37 -139 47 -130 77 83 101 54 -54 10 101 169 -103 10 -64 -122 -129 -63 -24 48 44 -156 180 -202 205 88 260
4326 260 -72 288 -41 -13 -116 -12 -124 61 326 51 -126 50 -90 109 104 -18 -144 47 -192 57 -172
4347 -172 86 38 -107 26 88 34 135 24 250 -45 -6 146 21 94 78 108 134 -96 -57 -59 -168 -52 18 -193
4371 -193 111 -146 -138 -8 376 65 -214 -187 22 -15 99 328 -148 -93 188 285 198 159 -42 21 -31 -35 36 -156
4395 -156 -85 -87 -261 -23 -14 -124 -233 149 -7 154 31 158 -47 100 -216 -199 25 81 166 157 201 227 -48 53
4419 53 18 125 -92 49 -128 -202 -165 256 -131 -118 -8 122 -26 42 -97 -246 197 -139 163 97 37 -124 127
4442 127 -4 150 35 243 -143 -184 -151 133 215 -71 177 21 172 160 57 147 385 112 95 -14 -9 -118 -194
4465 -194 6 49 -41 21 114 -55 68 78 212 -88 130 243 253 100 23 28 35 155 -365 -104 17 63 -144 -48
4489 -48 -130 98 195 -7 177 275 -143 -378 -269 111 27 32 121 -160 -49 52 -18 -84 50 -72 103 73 63 37
4513 37 323 37 -70 -56 -158 -81 -61 -34 -12 241 -82 -77 107 233 -39 47 -110 -89 81 -100 -171 -129 1 -31
4537 -31 4 -305 75 -131 26 211 -44 -171 114 88 84 58 7 296 -84 -156 -43 -177 90 10 38 119 101 94 -123
4562 -123 65 55 150 160 24 -106 125 79 -61 -141 -26 329 -134 -88 -84 15 156 -106 -55 -135 178 -308 52 -17
4586 -17 217 125 60 125 -29 173 -97 24 87 21 -73 -123 -56 82 -209 196 -66 9 -190 3 52 69 207 60
4610 60 8 14 -73 -132 -207 77 -128 -354 181 -84 151 -140 -108 155 76 240 -114 -28 37 155 89 1 -18 -110 154
4635 154 65 -129 45 54 -74 66 11 139 22 20 11 -12 -78 162 28 31 -90 278 274 71 13 -52 162 89 143 -15
4661 -15 -71 -158 -82 177 118 -27 -245 -7 -163 -4 53 31 -142 55 -10 41 74 -62 111 181 -128 -59 -168 -156
4685 -156 -80 53 -63 -146 -17 -35 188 58 -94 -296 -55 -121 -76 3 181 120 -166 -15 -49 1 -228 48 -38
4708 -38 -22 90 112 191 118 -127 13 -32 119 -11 -38 -39 -351 34 101 46 83 -152 -7 195 -203 21 -192 -48
4732 -48 39 -238 123 -111 339 61 -338 265 -91 54 -97 -55 -255 -3 -159 31 41 16 -160 119 141 -358
4754 -358 -36 -88 -124 36 248 -35 193 132 -65 18 -185 321 116 29 -56 77 -186 264 -217 -170 -59 207
4776 207 -39 35 -146 -150 -213 71 -29 -120 -231 116 -34 -177 123 275 -205 83 155 76 -188 -40 105 29 -4
4799 -4 -154 -61 -32 -112 -51 72 44 -135 -83 106 36 101 116 94 -136 208 -175 -52 53 180 -31 229 99 226
4823 226 127 -70 136 -6 -88 1 -97 149 -95 -65 193 22 123 61 102 -48 26 74 229 164 183 -191 -53 257
4847 257 154 -102 -111 95 -164 -14 181 205 -97 103 14 -206 247 -10 102 -36 -3 -11 -262 -60 -65 -67 -210 -136
4871 -136 118 52 -129 -64 4 51 -6 -395 6 -121 -44 -217 -186 137 -3 160 12 71 50 -115 -266 49 -30
4894 -30 19 -121 -111 103 -138 -48 -51 43 -115 -175 196 -81 -41 81 101 71 38 -333 75 -116 -4 221 52 -57
4918 -57 -233 -64 257 -70 -190 121 -145 -87 9 -28 23 105 253 -8 106 -164 47 0 76 -115 126 52 284
4941 284 192 176 124 -39 -96 38 7 -64 131 -100 -67 -83 -21 -257 24 151 -48 -193 -146 16 -186 -79 101
4964 101 -227 -88 -63 -54 -197 -54 181 228 -51 -147 79 98 -8 -112 -7 -100 52 -24 -75 118 -46 -79 -27 75
4988 75 68 -26 197 288 83 173 8 -128 -122 102 -26 -40 -9 -164 -139 -181 -177 -137 -21 -256 -249 123 -45 -95 161 111
5014 111 18 -76 183 -92 -42 -163 45 88 198 -25 -15 119 -274 50 20 423 90 107 -49 16 -124 -48 -144
5037 -144 178 6 164 -73 -285 183 -119 170 -99 -182 -93 190 -66 -200 12 22 -16 9 181 -282 91 23
5059 23 -139 90 -46 30 239 -37 68 91 205 -319 2 33 23 98 -61 -119 -40 -92 -18 -1 -99 190 -193 -128
5083 -128 62 68 83 -14 -335 -152 -126 -104 -311 320 -78 -158 -161 48 23 -164 -110 149 -65 133 85 33 24 -47 -179
5108 -179 -10 183 -51 60 111 65 226 24 -297 -273 -216 -255 -199 24 -68 14 81 -10 -97 61 166 -199 10 111
5132 111 -100 31 48 -20 86 -136 90 -246 -39 17 -259 -42 45 -60 -149 14 142 175 5 97 43 -94 -127
5155 -127 -45 98 66 -58 -107 50 148 -217 2 -203 19 107 -164 -89 -24 84 -98 4 -46 -91 79 -111 -212
5178 -212 -111 151 84 -1 41 -29 -70 110 50 139 60 102 6 18 -162 74 159 71 331 -46 -331 -91 399 2
5202 2 -194 -82 127 110 60 35 128 -94 2 11 -53 -97 65 -189 174 301 24 212 3 58 34 215 68 -123
5226 -123 168 -137 -82 60 20 -220 -105 -41 -112 -256 17 223 20 101 -48 69 -136 -392 -175 75 72 79 22
5249 22 -27 -55 -42 -242 -92 256 -150 -245 88 64 121 -84 212 -22 -36 124 93 163 -3 -3 233 -109 82 -148
5273 -148 -159 76 -126 88 0 64 -1 17 232 -53 76 349 156 95 -179 37 -180 14 97 84 -198 -115 -159
5296 -159 38 101 61 -52 159 -138 39 64 219 18 309 -60 43 -17 -270 79 -165 122 -145 -119 104 -210
5318 -210 40 135 275 -226 -128 -112 79 149 39 -245 123 -114 -304 117 89 -105 -298 233 44 100 22 54 77
5341 77 -125 0 108 220 -61 208 -201 -162 -95 168 -167 88 83 -175 -3 105 169 -66 -146 68 98 308 -71
5364 -71 144 -93 11 101 25 37 -16 -110 3 -121 29 -268 29 26 -126 33 -100 -18 -34 -115 -25 17 -106 -218
5388 -218 30 -155 -50 -38 -136 -72 -172 12 -1 114 -64 -29 197 119 -28 47 -11 -52 27 -49 -44 -248 -17 -125
5412 -125 -61 -199 -40 -10 99 82 -85 123 160 -25 135 259 -70 148 67 143 190 -80 -25 31 28 -180 1 191
5436 191 215 35 -70 60 229 -32 -22 87 168 -109 15 -198 -43 290 -63 -94 261 -255 139 50 -17 234
5458 234 291 -289 4 -151 118 -160 66 -155 -67 222 -61 52 140 -89 -146 -50 57 76 -99 -88 -27 146 -94
5481 -94 -19 56 345 -138 -170 75 93 -42 18 24 -173 -87 -143 84 221 -169 67 189 79 -16 -6 244 21 295
5505 295 -50 -40 -48 87 -32 -209 130 357 -260 -123 -63 -2 44 81 -111 -3 -100 -24 -291 -59 75 -15 19 -283
5529 -283 -92 -49 -191 23 -71 -107 -65 -155 245 -98 116 150 -182 114 -70 65 193 54 120 -5 17 379 -25
5552 -25 66 -39 -11 -86 195 26 -224 -212 -185 226 350 4 73 0 183 220 42 150 52 25 -292 59 100 -133
5576 -133 153 -124 -149 -172 131 105 -37 23 31 51 113 -318 -342 -4 -134 -22 65 -20 -78 -58 -157 77 48 45 -241 65
5602 65 -119 195 -190 58 69 -118 62 -161 -252 -25 -46 -35 -241 13 -221 -46 95 -113 349 49 -91 35
5624 35 302 166 -49 290 53 -258 231 -142 -3 194 113 -146 137 -143 140 75 284 -190 38 171 301
5645 301 -21 -28 169 272 79 160 -10 76 23 -60 -95 58 -26 293 -142 -285 -70 68 -142 67 -90 -157 88
5668 88 98 92 -122 -49 -80 362 -71 -68 -268 42 101 154 48 -8 26 -284 -124 -68 -231 87 -68 -14 -244 -99 -87
5693 -87 -25 -80 -198 -110 110 68 19 -141 -143 -121 67 -99 -245 -42 118 204 18 -357 198 -12 223 53 132 -40
5717 -40 77 -229 -72 125 -10 241 -56 -59 52 -151 -17 26 -81 -58 7 57 -92 87 88 -91 87 -119 113
5740 113 285 48 -25 -329 101 70 -76 198 -59 174 -61 45 141 162 -43 -130 -10 -84 187 -343 -65 110
5762 110 111 65 -264 18 140 229 -22 145 -75 -177 139 29 -170 51 120 108 -143 -53 -179 -156 34 55 -123
5785 -123 69 22 -174 -61 -24 124 -72 -37 161 -38 -297 -333 -49 -93 -81 284 -97 276 -33 -62 -172 -173 -114
5808 -114 -13 185 125 -57 57 -203 -49 -179 -56 -248 -79 -3 153 -55 3 42 107 49 -112 -127 20 -69 -118
5831 -118 149 83 -52 -71 -186 -181 -114 -88 -176 20 261 0 64 151 16 -215 -62 353 193 -127 -70 17 -120 -41
5855 -41 100 41 -87 109 -51 -32 -112 -239 48 118 -171 -25 284 -32 30 24 61 -87 62 -69 -41 -37 -53 -137 -318
5880 -318 -50 167 -37 56 162 -40 229 95 -91 -10 -75 189 172 -37 -89 36 -190 66 186 69 92 -143
5902 -143 25 40 35 190 -178 -8 10 -20 -75 64 205 1 -66 -75 45 -134 117 51 249 142 -63 -271 -220 -111
5926 -111 196 -153 -55 -207 112 -45 74 14 66 4 159 -11 188 -4 -391 273 -10 -90 89 248 143 -247
5948 -247 -6 -127 -44 67 -162 103 186 106 -104 -138 -102 4 23 -2 -202 -177 30 185 -44 -79 -78 -111 -201 28
5972 28 -142 -124 241 -120 -13 139 -4 224 16 79 24 4 -257 -47 180 21 53 149 -51 -149 9 -16 176
5995 176 94 -252 -13 73 95 -323 56 116 10 -4 -51 147 -105 -249 140 146 48 135 211 -74 -127 4 -35 88
6019 88 265 143 -256 -115 -272 35 104 170 -228 -87 277 24 -171 -38 159 -222 231 -121 -35 201 -132
6040 -132 59 121 -216 174 -118 -220 32 -67 -208 -139 34 -85 -18 135 -196 -173 34 249 183 223 -159 -129 143
6063 143 205 -153 246 133 119 -390 284 -106 -86 113 -4 72 18 261 -121 58 67 12 1 -35 -188 119 -69
6086 -69 -3 -32 -206 -105 103 77 -3 -154 -26 -9 38 200 58 -60 -102 81 116 -187 -27 53 -108 -32 -206 88
6110 88 104 -76 -67 27 121 -44 -12 -40 -81 -139 -38 -116 -23 -58 28 275 51 -52 -20 86 -228 36 150 -205 134
6135 134 73 -86 -128 -151 -150 -92 76 -34 -32 141 259 58 -110 -148 -123 209 -77 -187 57 -52 9 -142 -226 -43
6159 -43 43 77 131 -170 93 100 54 -218 60 44 -169 81 -61 -52 30 -68 -71 -62 30 4 188 26 -81 -73 252 -53 -299
6186 -299 205 118 162 -47 10 -109 113 -119 99 147 109 92 67 104 -71 22 -145 -228 -76 30 103 272 208 1
6210 1 -53 -25 37 24 95 -102 29 27 -126 -87 -50 11 35 -184 -89 60 39 -121 -44 -22 -61 65 83 45 7 175 28
6237 28 132 -106 -54 13 -152 83 -125 52 -167 -263 34 -4 -77 -99 2 -266 -99 -192 -154 350 -142 18 -25
6260 -25 18 -148 -111 -132 22 -14 48 361 137 34 -31 -227 7 111 223 141 66 -52 79 -79 -67 72 -174
6283 -174 65 187 -91 -72 46 -149 -82 -106 -29 -41 -67 -311 94 -257 43 120 43 85 120 1 -71 25 -251 1
6307 1 8 -192 -189 -94 -59 70 147 -197 -166 -13 -29 152 -65 -70 -196 121 260 -93 57 186 176 -154 -4 106 8
6332 8 -86 -193 16 60 -122 -179 -107 3 -17 124 123 -21 79 -96 63 171 80 -66 -6 146 -178 44 -290 -259
6356 -259 30 82 242 298 -40 96 6 -82 -1 -1 -133 -123 -63 -35 79 -55 -9 194 -1 -13 -102 174 32 -85
6380 -85 -202 133 -7 -49 -106 -21 -102 -165 -95 67 -22 237 -148 92 150 180 -250 -25 -13 -64 -31 -93 -32 -12 26 125
6406 125 23 -114 -22 -52 50 207 361 206 55 270 95 -42 77 104 -147 296 108 112 -11 -50 -71 -157 -156
6429 -156 -91 -15 -155 -189 -204 -27 142 -42 -68 91 16 -124 165 95 -75 91 -159 -4 109 -55 125 -14
6451 -14 -36 -39 75 161 31 236 358 161 -6 -135 221 58 -56 35 -132 70 -193 -167 24 -71 -13 79 -248
6474 -248 -46 20 -20 -122 -89 110 -81 28 114 153 -8 91 164 223 -44 -59 -53 167 -7 34 105 -128 172 51
6498 51 75 -4 250 9 -28 137 -84 -98 28 127 -64 31 -64 58 -141 -11 -35 48 -294 57 -94 233 72
6521 72 -86 173 80 99 -26 -33 -275 -127 -8 -256 -48 -21 -176 -109 118 351 -55 56 -143 25 -8 193 79
6544 79 102 95 -430 12 23 -17 342 7 199 -165 -192 119 118 -41 -238 57 130 -10 98 -84 74 396 23
6567 23 13 4 -93 91 263 -17 -133 -57 25 24 -17 6 216 153 -186 -69 93 -164 -95 121 14 78 46 -29 68 -132
6593 -132 181 -37 338 11 383 -69 -66 261 150 81 -2 -147 126 -36 -200 300 84 139 -46 -60 -69 9 73
6616 73 -24 -266 -74 183 -3 91 -65 -166 -257 73 306 3 71 -7 1 -145 -61 -17 -135 -226 -210 -73 -237 -29
6640 -29 38 204 127 26 -18 171 -189 -201 -263 71 52 -68 0 137 38 -225 -96 133 -124 -28 -37 -236 -115 -152
6664 -152 6 160 103 -159 105 -196 163 8 -283 87 -72 -105 -225 122 112 104 -30 -116 2 -248 -145 -22
6686 -22 -52 145 -38 243 -88 -212 51 -85 -123 11 34 58 271 338 53 144 -177 0 -168 -211 182 133 78
6709 78 177 94 -144 -56 -132 45 116 -91 -109 215 186 -299 -142 30 80 -53 -8 53 225 -138 -229 222 3 85
6733 85 -11 81 18 76 -282 55 -13 -132 -32 90 -228 49 -6 28 50 -250 -290 -198 -299 94 204 -67 295 207
6757 207 276 -82 61 -11 -74 -8 -194 185 -111 -172 82 52 35 132 -341 -3 -86 121 -70 63 166 -188 -105
6780 -105 171 -95 -2 340 11 -111 212 231 -206 188 -2 93 -188 -122 -84 276 -30 -187 -63 20 -25 126
6802 126 -8 -240 -112 -2 -148 -403 32 -90 20 96 7 -100 -63 19 -12 155 -75 30 220 -33 28 -48
6824 -48 108 201 127 81 -68 86 -85 99 -125 101 -173 5 36 145 -252 198 85 4 -29 13 197 58 -71
6847 -71 214 30 157 -10 28 20 301 41 107 84 81 133 123 21 201 136 123 -103 -12 -147 49 202 27 -90
6871 -90 172 52 235 37 218 4 -219 -28 -113 9 7 99 225 192 -179 0 -33 39 42 -48 -49 -29 -199 -131 89
6896 89 17 -135 -25 34 142 -141 -34 170 -93 14 161 256 -85 -127 -50 20 96 -102 -136 187 -165 -93 -10 -300
6920 -300 -294 222 20 -117 259 -129 -7 28 416 -160 -61 180 -181 -81 -58 121 109 47 -142 -66 43 282 39
6943 39 -99 35 82 172 -152 -22 -4 -17 255 125 212 -24 139 -72 28 102 71 30 101 171 -224 -20 -52 160
6967 160 -60 97 209 -134 29 -172 -65 95 59 -141 210 62 302 -76 18 -1 -124 118 158 215 205 -25
6989 -25 -70 86 89 155 178 -171 -41 -6 126 -7 64 -34 -95 4 -12 391 56 191 -118 120 -102 41 -2 -78 -51
7014 -51 76 -312 60 -112 113 101 11 -56 16 -243 -154 -268 -80 144 -218 107 75 -35 -10 -154 39 18 -57
7037 -57 -69 9 -244 -92 35 -87 120 214 100 -241 38 -58 69 -53 -163 180 228 144 -109 135 -355 -61
7059 -61 190 -219 -26 117 -156 65 -13 194 19 181 -18 -80 -13 142 40 -129 71 101 -94 114 118 -16
7081 -16 41 -284 -130 -75 118 2 -108 -19 116 204 127 53 99 -127 -8 -147 3 17 -134 46 32 257 4
7104 4 -250 -22 115 -68 23 8 192 19 -153 -97 -203 0 51 91 173 -144 -100 -104 -122 -179 -45 -118 -27 -213 146
7129 146 -5 71 -63 -6 204 -22 111 -37 88 306 96 156 86 20 76 -84 189 -253 -152 87 156 -5
7151 -5 -85 -176 275 53 -318 59 148 22 -181 -115 -94 135 -124 33 -72 -23 147 224 114 294 -62 30 -54 -128
7175 -128 -25 -44 -100 31 -195 -91 82 -29 198 17 -9 -123 83 42 -146 -138 108 37 -71 27 -90 -211 147
7198 147 -134 53 156 -275 4 29 40 -58 -43 -153 -152 -49 -28 -38 25 -54 -65 74 -114 49 260 1 86 -116
7222 -116 -83 35 57 -7 -211 -80 158 -50 161 113 -36 73 -234 1 93 -176 -101 -10 -261 -161 9 -6 134
7245 134 78 -180 73 93 -104 -84 32 -81 82 20 -124 167 48 88 197 -270 -137 -107 251 -5 4 -49 72
7268 72 1 -119 26 164 -256 -132 45 5 -24 -68 -198 139 32 -5 -88 237 32 18 134 136 58 118 -201 -74
7292 -74 -213 -115 -204 132 93 24 147 -53 -124 -48 -282 -202 -58 45 -60 80 81 -149 -115 -142 -35 76 4 168
7316 168 -131 41 228 -60 -115 85 -135 167 240 34 -6 95 -175 -160 67 -144 -143 -74 -17 -179 66 198 87
7339 87 -35 168 45 448 104 83 -199 28 -18 -16 11 5 79 -106 349 86 111 161 -45 -200 -248 -234 -223 117 43
7364 43 -50 -91 -196 -153 118 180 -22 -59 -12 99 26 44 196 119 -3 8 -122 -148 44 -208 -18 -45 -236 -125
7388 -125 109 112 -173 221 -109 -56 209 251 -122 3 109 -203 -320 12 -124 -118 173 61 -139 -233 118 -95
7410 -95 114 -105 123 -203 -48 162 -54 -116 -47 -2 98 -81 147 -48 87 26 105 19 157 23 -41 199 -422
7433 -422 25 -6 51 -40 -279 -39 8 97 68 138 -245 -44 53 28 -114 23 58 19 157 14 -154 -351 74 103
7457 103 5 30 -181 -58 14 135 164 111 -100 -215 113 -128 105 -306 156 98 -109 -27 148 23 -12 14 18 339
7481 339 -40 48 180 -36 275 130 56 10 68 -265 67 -30 -186 -60 -233 120 -191 313 200 -63 52 -7
7503 -7 -39 -33 -258 -174 53 -74 121 -110 161 186 -81 16 32 -82 105 63 181 179 -127 7 -44 52 174 226 201
7528 201 223 -59 209 309 -6 -249 59 98 -119 -126 -117 156 -89 -287 -113 175 101 35 46 -81 -151 -99 18 -1
7552 -1 217 95 64 -121 24 101 178 53 -70 -25 -60 -49 -68 -91 -167 -16 -61 -131 36 27 15 -23 -148 -76 -150 8
7578 8 130 32 -349 35 -43 160 109 -31 84 -266 -88 28 -121 -118 100 -24 -16 -144 -111 40 20 -77 340 17
7602 17 -50 -215 -183 15 -131 147 121 -39 97 2 91 227 3 11 -204 75 11 -58 -47 0 -98 0 -153 267 166
7627 166 -15 73 -256 -194 83 -8 -269 47 -21 116 4 197 69 109 127 -99 -64 -290 -82 -143 -217 -59 -22
7650 -22 233 -46 30 -48 -26 -125 24 221 82 0 59 -217 -22 65 -33 -195 -65 180 4 232 237 -82 -95 -241
7674 -241 -178 90 119 -269 230 151 -111 101 66 -36 98 40 -16 214 -188 -158 -148 23 -234 -49 -290 70 -57
7697 -57 99 -193 -79 148 25 -122 83 142 -118 -148 -166 -277 -29 200 205 115 89 47 35 -202 -213 161 -122 -111
7721 -111 -211 -189 -148 3 148 -145 246 150 -6 125 -215 -239 -64 -185 44 -20 163 -10 209 149 36 130
7743 130 214 143 -78 96 36 168 255 -80 -145 -58 29 -4 26 -79 186 -17 -106 -60 -386 214 -285 -144 5 -221
7767 -221 130 -111 -143 -187 18 124 -101 13 15 -62 96 78 52 -220 -260 -143 55 -252 118 -34 131 46 -223
7790 -223 -299 -102 22 -91 76 244 -38 56 136 -70 -60 -237 145 70 69 121 -134 24 -29 -255 72 -35 107
7813 107 -178 -34 -146 59 -153 -198 -26 -33 -212 -165 -49 -118 17 -91 -51 -81 -98 2 169 38 221 -144 -22
7836 -22 -76 92 141 22 -49 113 -139 72 -168 108 150 -253 50 -204 -19 -23 186 23 -20 44 44 -171 27 85
7860 85 15 -94 64 -4 101 -21 208 -109 148 -61 11 -179 -91 -292 -311 72 -107 14 124 63 -4 -185 -25
7883 -25 -22 -285 18 -150 -283 123 3 116 169 177 -158 236 -152 -318 73 -84 50 -42 226 -52 21 41 71
7906 71 -3 -43 -69 -200 -71 -28 -82 124 -247 229 170 -24 50 131 -200 -17 -203 -176 164 -56 87 -136 -182 -120
7930 -120 -42 24 55 172 30 -106 -141 -329 -324 -42 30 -18 87 -197 44 41 392 79 81 114 26 108 61 89 -150 -136
7956 -136 -213 -56 -211 58 111 -105 179 -20 -295 85 150 -203 22 -98 -178 172 -236 -89 -1 -73 -94 169
7978 169 162 81 -255 -58 -24 195 -14 -17 -99 -469 -49 186 182 156 -141 118 -122 138 -72 19 16 22 -387 48 103
8003 103 -218 52 210 29 278 -9 -229 54 -251 -10 102 -212 -99 9 117 -65 -176 99 -11 15
8023 15 -172 228 105 325 -132 182 215 259 -47 -199 -165 -314 54 28 22 -13 -94 -17 -21 117 -94 246 -371 231
8047 231 -150 -45 -248 115 17 -28 -8 130 -1 141 198 -80 -42 -176 -270 -19 -209 144 132 175 -57 -8 -157
8070 -157 -386 90 23 228 -54 -27 -171 10 44 171 -147 49 -257 208 -151 -82 69 -269 52 -40 122 -111
8092 -111 -84 59 -8 -356 -28 -4 -19 -150 191 123 -50 203 40 -111 47 -39 -9 75 -406 -90 43 -75 -258
8115 -258 14 -86 52 -174 -82 18 17 147 254 -133 160 -16 137 118 -55 179 -257 99 -40 323 -127
8136 -127 -113 -315 -93 130 -42 -95 220 -288 -5 -68 -26 223 11 115 -17 -41 -26 -130 183 16 -34 120
8158 120 -251 -39 15 55 6 -141 -232 -92 -75 5 -180 -166 35 -104 -59 77 -118 -271 103 -212 125 -33 -40
8181 -40 28 144 -55 119 -7 -130 -10 172 -66 -15
8191a5
##END NTUPLES=NMR FID
##END=
