##TITLE=1H_9P117_D2O
 D2O
 8 sc, 
 3.11.2023
##JCAMPDX= 6.0         $$ Bruker NMR JCAMP-DX V2.0
##DATA TYPE= NMR FID
##DATA CLASS= NTUPLES
##ORIGIN= UXNMR, Bruker Analytische Messtechnik GmbH
##OWNER= root
$$ XWIN-NMR		Version 3.5
$$ Fri Nov  3 14:39:10 2023 Russian Standard Time (UT+4h)  she@DPX200
##.OBSERVE FREQUENCY= 200.1313
##.OBSERVE NUCLEUS= ^1H
##.DELAY= (6, 6)
##.ACQUISITION MODE= SIMULTANEOUS
##.ACQUISITION SCHEME= undefined
##.AVERAGES= 8
##.DIGITISER RES= 18
##SPECTROMETER/DATA SYSTEM= spect
##.PULSE SEQUENCE= zg30
##.SOLVENT NAME= D2O
##.SHIFT REFERENCE= (INTERNAL, D2O, 0, 15.7039)
##AUDIT TRAIL= $$ (NUMBER, WHEN, WHO, WHERE, WHAT)
$$ ##TITLE= Audit trail, XWIN-NMR		Version 3.5
$$ ##JCAMPDX= 5.01
$$ ##ORIGIN= Bruker BioSpin GmbH
$$ ##OWNER= she
$$ F:/spectra/data/she/nmr/H-F/1/audita.txt
$$ ##AUDIT TRAIL=  $$ (NUMBER, WHEN, WHO, WHERE, WHAT)
(   1,<2023-11-03 14:38:04.04 +0400>,<she>,<DPX200>,
      <created by zg, POWCHK disabled, PULCHK disabled
       configuration hash MD5:
       00 E9 B6 7A A2 85 ED C7 34 08 36 98 17 FE 4E 26
       data hash MD5: 16K
       BF FD 2F D3 B1 8D F6 93 50 1F 00 39 D7 36 59 3F>)
$$ ##END=
$$ 
$$ hash MD5
$$ 6D 1E 80 E3 92 8C 8D 2B 98 F6 D7 66 47 BC 2D 33
##$RELAX= 
##$RELAX= 
##$RELAX= 
##$RELAX= 
##$RELAX= 
##$RELAX= 
$$ Bruker specific parameters
$$ --------------------------
##$DU= <F:/spectra>
##$EXPNO= 1
##$NAME= <H-F>
##$PROCNO= 1
##$TYPE= <nmr>
##$USER= <she>
##$AMP= (0..31)
100 100 100 100 100 100 100 100 100 100 100 100 100 100 100 100 100 100 
100 100 100 100 100 100 100 100 100 100 100 100 100 100 
##$AQSEQ= 0
##$AQ_mod= 1
##$AUNM= <au_zg>
##$AUTOPOS= <>
##$BF1= 200.13
##$BF2= 200.13
##$BF3= 200.13
##$BF4= 200.13
##$BF5= 200.13
##$BF6= 200.13
##$BF7= 200.13
##$BF8= 200.13
##$BYTORDA= 1
##$CFDGTYP= 0
##$CFRGTYP= 5
##$CHEMSTR= <none>
##$CNST= (0..31)
1 1 145 1 1 1 1 1 1 1 1 1 1 1 1 1 1 1 1 1 1 1 1 1 1 1 1 1 1 1 1 1 
##$CPDPRG= <>
##$CPDPRG1= <>
##$CPDPRG2= <>
##$CPDPRG3= <>
##$CPDPRG4= <mlev>
##$CPDPRG5= <mlev>
##$CPDPRG6= <mlev>
##$CPDPRG7= <mlev>
##$CPDPRG8= <mlev>
##$CPDPRGB= <>
##$CPDPRGT= <>
##$D= (0..31)
0 1.2 0 0 0 0 0 0 0 0.06 0 0.03 0 0 0 0 0.0002 0 0 0 0 0 0 0 0 0 0 0 0 
0 0 0 
##$DATE= 1699007883
##$DBL= (0..7)
120 120 120 120 120 120 120 120 
##$DBP= (0..7)
150 150 150 150 150 150 150 150 
##$DBP07= 0
##$DBPNAM0= <>
##$DBPNAM1= <>
##$DBPNAM2= <>
##$DBPNAM3= <>
##$DBPNAM4= <>
##$DBPNAM5= <>
##$DBPNAM6= <>
##$DBPNAM7= <>
##$DBPOAL= (0..7)
0.5 0.5 0.5 0.5 0.5 0.5 0.5 0.5 
##$DBPOFFS= (0..7)
0 0 0 0 0 0 0 0 
##$DE= 6
##$DECBNUC= <off>
##$DECIM= 32
##$DECNUC= <off>
##$DECSTAT= 4
##$DIGMOD= 1
##$DIGTYP= 9
##$DL= (0..7)
0 120 120 120 120 120 120 120 
##$DP= (0..7)
150 150 150 150 150 150 150 150 
##$DP07= 0
##$DPNAME0= <>
##$DPNAME1= <>
##$DPNAME2= <>
##$DPNAME3= <>
##$DPNAME4= <>
##$DPNAME5= <>
##$DPNAME6= <>
##$DPNAME7= <>
##$DPOAL= (0..7)
0.5 0.5 0.5 0.5 0.5 0.5 0.5 0.5 
##$DPOFFS= (0..7)
0 0 0 0 0 0 0 0 
##$DQDMODE= 0
##$DR= 18
##$DS= 0
##$DSLIST= <SSSSSSSSSSSSSSS>
##$DSPFIRM= 0
$$ [...]
##$SUBNAM2= <"">
##$SUBNAM3= <"">
##$SUBNAM4= <"">
##$SUBNAM5= <"">
##$SUBNAM6= <"">
##$SUBNAM7= <"">
##$SUBNAM8= <"">
##$SUBNAM9= <"">
##$SW= 18.0517328524113
##$SWIBOX= (0..15)
0 0 2 0 0 0 0 0 0 0 0 0 0 0 0 0 
##$SW_h= 3612.71676300578
##$TD= 16384
##$TD0= 1
##$TE= 0
##$TE2= 300
##$TE3= 300
##$TEG= 300
##$TL= (0..7)
0 120 120 120 120 120 120 120 
##$TP= (0..7)
150 150 150 150 150 150 150 150 
##$TP07= 0
##$TPNAME0= <>
##$TPNAME1= <>
##$TPNAME2= <>
##$TPNAME3= <>
##$TPNAME4= <>
##$TPNAME5= <>
##$TPNAME6= <>
##$TPNAME7= <>
##$TPOAL= (0..7)
0.5 0.5 0.5 0.5 0.5 0.5 0.5 0.5 
##$TPOFFS= (0..7)
0 0 0 0 0 0 0 0 
##$TUNHIN= 0
##$TUNHOUT= 0
##$TUNXOUT= 0
##$USERA1= <user>
##$USERA2= <user>
##$USERA3= <user>
##$USERA4= <user>
##$USERA5= <user>
##$V9= 5
##$VALIST= <valist>
##$VCLIST= <CCCCCCCCCCCCCCC>
##$VD= 0
##$VDLIST= <DDDDDDDDDDDDDDD>
##$VPLIST= <PPPPPPPPPPPPPPP>
##$VTLIST= <TTTTTTTTTTTTTTT>
##$WBST= 1024
##$WBSW= 4
##$XGAIN= (0..3)
0 0 0 0 
##$XL= 0
##$YL= 0
##$YMAX_a= 194269
##$YMIN_a= -158354
##$ZGOPTNS= <>
##$ZL1= 120
##$ZL2= 120
##$ZL3= 120
##$ZL4= 120
##$ABSF1= 10
##$ABSF2= 0
##$ABSG= 5
##$ABSL= 3
##$ALPHA= 0
##$AQORDER= 0
##$ASSFAC= 0
##$ASSFACI= 0
##$ASSFACX= 0
##$ASSWID= 0
##$AUNMP= <proc_1d>
##$AZFE= 0.1
##$AZFW= 0.1
##$BCFW= 1
##$BC_mod= 2
##$BYTORDP= 1
##$COROFFS= 0
##$CY= 11.3945322036743
##$DATMOD= 1
##$DC= 2
##$DFILT= <>
##$DTYPP= 0
##$F1P= 15.7292609196834
##$F2P= 12.9074282941183
##$FCOR= 0.5
##$FTSIZE= 0
##$FT_mod= 4
##$GAMMA= 1
##$GB= 0.15
##$INTBC= 1
##$INTSCL= 1
##$ISEN= 128
##$LB= 0.24
##$LEV0= 0
##$LPBIN= 0
##$MAXI= 10000
##$MC2= 0
##$MEAN= 0
##$ME_mod= 0
##$MI= 1.114404
##$NCOEF= 0
##$NC_proc= 0
##$NLEV= 6
##$NOISF1= 3.799351
##$NOISF2= 2.8
##$NSP= 1
##$NTH_PI= 0
##$NZP= 0
##$OFFSET= 15.70392
##$PC= 1
##$PHC0= -23872.22
##$PHC1= 2.852691
##$PH_mod= 1
##$PKNL= yes
##$PPARMOD= 0
##$PSCAL= 0
##$PSIGN= 0
##$REVERSE= no
##$SF= 200.130013532006
##$SI= 16384
##$SIGF1= 3
##$SIGF2= 2
##$SINO= 400
##$SIOLD= 16384
##$SREGLST= <1H.CDCl3>
##$SSB= 0
##$STSI= 0
##$STSR= 0
##$SW_p= 3612.71676300578
##$SYMM= 0
##$S_DEV= 0
##$TDeff= 0
##$TDoff= 0
##$TI= <>
##$TILT= no
##$TM1= 0
##$TM2= 0
##$TOPLEV= 0
##$USERP1= <user>
##$USERP2= <user>
##$USERP3= <user>
##$USERP4= <user>
##$USERP5= <user>
##$WDW= 1
##$XDIM= 8192
##$YMAX_p= 0
##$YMIN_p= 0
$$ End of Bruker specific parameters
$$ ---------------------------------
##NTUPLES= NMR FID
##VAR_NAME=  TIME,          FID/REAL,        FID/IMAG
##SYMBOL=    X,             R,               I
##VAR_TYPE=  INDEPENDENT,   DEPENDENT,       DEPENDENT
##VAR_FORM=  AFFN,          ASDF,            ASDF
##VAR_DIM=   8192,          8192,            8192
##UNITS=     SECONDS,       ARBITRARY UNITS, ARBITRARY UNITS
##FACTOR=    0.0002768,     1,               1
##FIRST=     0,             0,               0
##LAST=      2.2672688,     0,               0
##MIN=       0,             -158354,         0
##MAX=       2.2672688,     194269,          0
$$ Real data points
##PAGE= N=1
##DATA TABLE= (X++(R..R)), XYDATA
$$ plain form
0 0 0 0 0 0 0 0 0 0 0 0 0 0 0 0 0 0 8 -8 8 -8 8 -8 16 -16 16 -23 24 -29 32 -38 42 -48 54 -62 69 -77 87 -98
38 -98 109 -121 136 -151 167 -183 203 -225 248 -275 302 -330 367 -403 444 -491 544 -602 670 -748
58 -748 840 -950 1083 -1247 1460 -1744 2143 -2742 3748 -5739 11170 -57229 -158354 5456
72 5456 78325 24732 80924 194269 147077 61870 35455 -26274 -102772 -93123 -92885 -127910 -85126
85 -85126 -2766 -2002 -1926 55743 71117 29307 22650 34402 21246 25274 58329 63687 35345 -6764
99 -6764 -51520 -85743 -114478 -131035 -75937 19183 43242 34183 89160 111160 27269 -13664 31660
112 31660 13525 -43446 -12544 23008 -18859 -23992 12906 -21612 -61391 -27054 -24440 -61447
124 -61447 -9345 67783 51530 44064 94548 62186 -36128 -48063 -21103 -56618 -62449 8619
$$ packed form
0@%%%%%%%%%%%%%%%%Qj6J6j6J6j6K4l2L2l9M7n3O1p0Q0r0J02j16J31j46J64j85
38i8K07k30K57k87L18l50L86m28M73n23N77o32O97p70Q47r35J035j146J272j418
58g48J588j790K033k330K707l204L887m885O490r487J6909o8399j01125J63810
72E456P2869n3593N6192J13345m7192q5207k6415o1729p6498R649K38l5025M2784
85h5126Q2360P64P6N7669J5374m1810o657J1752j3156M028L3055N358k8342m2109
99f764m4756l4223k8735j6557N5098R5120K4059r059N4977K2000q3891m0933M5324
112C1660j8135n6971L0902L5552m1867n133L6898l4518l9779L4337K614l7007
124f1447N2102P7128j6253p466N0484l2362r8314j1935K6960l5515n831P1068
$$ plain form
136 8619 39319 11238 8783 15881 -12021 -31899 -21261 -10826 737 19743 29582 31830 32306
149 32306 16958 -4376 -18685 -37024 -46245 -25748 -4641 5977 34604 52736 21731 -6877
161 -6877 -6041 -30079 -56969 -19667 22886 11437 18268 54524 28154 -26494 -17268 -3197 -38020
174 -38020 -34898 16319 20883 886 26159 36382 -6031 -23703 -9354 -26653 -41561 -5406
186 -5406 25218 19317 27520 43222 18250 -19173 -25218 -23941 -32174 -20533 10633 27030 22450
199 22450 16976 11357 -5859 -26849 -28291 -11963 -3824 1238 23318 36963 19134 4568 5529
212 5529 -13453 -40233 -28098 -4594 -7541 3135 36777 33934 1890 -224 373 -30183 -38213
225 -38213 -3701 10382 2967 23653 40085 11289 -12867 -6474 -16729 -36999 -19299 9648
$$ packed form
136H619L0700k8081k455P098k7902j9878J0638J0435J1563J9006R839K248M76
149C2306j5348k1334j4309j8339r221K0497K1107J0618K8627J8132l1005k8608
161f877Q36k4038k6890L7302M2553j1449O831L6256k6370n4648R226J4071l4823
174c8020L122N1217M564j9997K5273J0223m2413j7672J4349j7299j4908L6155
186e406L0624n901Q203J5702k4972l7423o045J277q233J1641L1166J6397m580
199B2450n474n619j7216k0990j442J6328Q139N062K2080J3645j7829j4566R61
212E529j8982k6780J2135K3504k947J0676L3642k843l2044k114N97l0556q030
225c8213L4512J4083p415K0686J6432k8796k4156O393j0255k0270J7700K8947
$$ plain form
237 9648 9160 10834 29921 24122 -5512 -14132 -10601 -23043 -26640 -988 19092 16699 19408 27102
251 27102 10443 -17592 -23265 -16760 -21960 -17281 10026 25411 16442 13475 16125 -3341 -26121
264 -26121 -20249 -7804 -10090 83 25261 27005 10276 7406 2537 -21772 -32020 -15518 -7266
277 -7266 -7281 14089 32768 19673 3893 5941 -4380 -27307 -23182 -1289 2311 3070 21306 25864
291 25864 4558 -8271 -7464 -18433 -28930 -12565 8442 10597 15094 27648 20965 -2761 -11928
304 -11928 -10970 -20973 -22359 -2007 13005 10889 14412 18800 4226 -15399 -15837 -12632 -16520 -7257
318 -7257 15335 22074 14416 15884 13101 -9228 -24304 -16844 -12907 -15154 -33 20699 19047 8347
332 8347 9030 3549 -16162 -21665 -8342 -2720 -815 14398 24553 13543 1863 -764 -12113 -26286
$$ packed form
237I648m88J674J9087n799k9634q620L531j2442l597K5652K0080k393K709P694
251B7102j6659k8035n673O505n200M679K7307J5385q969k967K650j9466k2780
264b6121N872J2445k286J0173K5178J744j6729k870m869k4309j0248J6502Q252
277g266j5K1370J8679j3095j5780K048j0321k2927M125K1893L600P59J8236M558
291B5864k1306j2829Q07j0969j0497J6365K1007K155M497J2554o683k3726r167
304a1928R58j0003j386K0352J5012k116L523M388j4574j9625m38L205l888R263
318g257K2592O739p658J468k783k2329j5076P460L937k247J5121K0732j652j0700
332H347O83n481j9711n503J3323N622J905J5213J0155j1010j1680k627j1349j4173
$$ plain form
346 -26286 -19786 -4857 -423 6017 22125 22873 7064 -852 -1952 -13796 -21345 -8149 5704 6186
360 6186 10054 19331 10974 -7621 -12901 -11934 -18919 -16723 3114 15866 13268 16365 20986 5478
374 5478 -13524 -13498 -10996 -17105 -9942 9503 13605 7545 11214 9014 -9449 -17124 -8495 -8034 -9169
389 -9169 8195 22947 15065 7910 9956 -2070 -21500 -20578 -9955 -8905 -2400 14787 19993 10530
403 10530 5679 3314 -8954 -17544 -10094 -1311 206 6313 16211 14409 1934 -5205 -7167 -14641
417 -14641 -19255 -8018 5719 8496 12705 21254 13866 -3581 -8450 -9327 -18363 -16368 2610 10163
431 10163 5735 12585 15405 -2480 -13531 -5528 -7004 -14493 -296 16117 10281 6073 14719 6547
445 6547 -12937 -14202 -9053 -14692 -11104 7236 14500 11216 13051 10606 -3877 -13356 -11768 -10284
$$ packed form
346b6286O500J4929M434O440J6108P48j5809p916j100j1844p549J3196J3853M82
360F186L868R277q357j8595n280R67o985K196J9837J2752k598L097M621j5508
374E478j9002K6K502o109P163J9445M102o060L669k200j8463p675Q629M61j135
389i169J7364J4752p882p155K046j2026j9430R22J0623J050O505J7187N206r463
403A0530m851k365j2268q590P450Q783J517O107R898j802j2475p139j962p474
417a4641m614J1237J3737K777M209Q549p388j7447m869q77r036J995J8978P553
431A0163m428O850K820j7885j1051Q003j476p489J4197J6413n836m208Q646q172
445F547j9484j265N149n639L588J8340P264l284J835k445j4483r479J588J484
$$ plain form
459 -10284 -5999 4437 12663 12563 8405 1989 -5434 -11913 -14337 -9981 -1159 3327 7098 15296 15408
474 15408 2964 -2745 -924 -10954 -19346 -6688 4522 824 6973 19564 9521 -7096 -5906
487 -5906 -7727 -18888 -10826 8880 10313 8261 17155 11406 -8006 -10245 -5893 -13623 -12239 4565
501 4565 8562 2249 8700 12770 313 -7793 -4413 -7818 -12017 -4463 5583 10125 13223 12328 4558
516 4558 -3715 -11711 -17565 -12457 -2488 2449 9800 16697 8983 -2372 -2676 -5654 -14038 -7742 5140
531 5140 3336 3354 13989 10005 -3221 -1087 -88 -15517 -17103 -1041 219 -2821 13382 21128 5092
546 5092 -2231 1523 -10272 -18902 -4515 7017 4061 9210 15579 3057 -9488 -7963 -9895 -13545
560 -13545 -4435 5556 6088 8540 12137 7249 1299 -991 -6032 -10187 -8384 -5801 -1348 7610 10119
$$ packed form
459a0284M285J0436Q226j00m158o416p423o479k424M356Q822M486L771Q198J12
474A5408j2444n709J821j0030q392J2658J1210l698O149J2591j0043j6617J190
487e906j821j1161Q062J9706J433k052Q894n749j9412k239M352p730J384J6804
501D565L997o313O451M070j2457q106L380l405m199P554J0046M542L098q95p770
516D558q273p996n854N108R969M937P351O897p714j1355l04k978q384O296J2882
531E140j804J8J0635l984j3226K134R99j5429j586J6062J260l040J6203P746j6036
546E092p323L754j1795q630J4387J1532k956N149O369j2522j2545J525j932l650
560a3545R110R991N32K452L597m888n950k290n041m155J803K583M453Q958K509
$$ plain form
575 10119 5762 4948 71 -12794 -14150 -3801 -1336 1708 16026 18395 3559 -915 10 -13058
589 -13058 -18225 -3814 1438 -4052 5376 14631 3861 -1845 5733 -435 -12536 -5849 1552 -4270
603 -4270 1116 14241 10401 508 1017 -4106 -16536 -14729 -2630 1211 5274 14179 13719 4492 -1307
618 -1307 -5446 -10233 -8676 -3435 147 4409 7585 5018 3124 1586 -4609 -8531 -4866 -4709 -5284 4366
634 4366 11882 7252 5805 7774 -2628 -14215 -9769 -4963 -7504 1336 14185 9704 2634 4801
648 4801 -865 -12835 -9658 -592 -2164 3 10377 9807 1069 1626 1936 -7963 -10585 -4016 -2648
663 -2648 -2432 5245 10876 7497 4538 1666 -4822 -9945 -8728 -5102 439 6375 8859 7982 5047 -1535
679 -1535 -7832 -7580 -6531 -5110 1263 7734 6470 5222 6613 874 -7556 -6041 -4005 -7974 -4108
$$ packed form
575A0119m357q14m877j2865j356J0349K465L044J4318K369j4836m474R25j3068
589a3058n167J4411N252n490R428R255j0770n706P578o168j2101O687P401n822
603d270N386J3125l840r893N09n123j2430J807J2099L841M063Q905m60r227n799
618a307m139m787J557N241L582M262L176k567j894j538o195l922L665J57n75R650
634D366P516m630j447J969j0402j1587M446M806k541Q840J2849m481p070K167
648D801n666j1970L177R066j572K167J0374n70q738N57L10r899k622O569J368
663b648K16P677N631l379k959k872o488n123J217L626N541N936K484q77k935o582
679a535o297K52J049J421O373O471j264j248J391n739q430J515K036l969L866
$$ plain form
694 -4108 6748 7647 3966 6898 5783 -5542 -9495 -5022 -5936 -5411 4656 10620 6124 4236 4083
709 4083 -3421 -10128 -7149 -3962 -3299 1817 8502 7658 4039 2958 -1000 -6433 -7790 -4865 -2499 199
725 199 5225 8273 6524 2184 -1245 -3651 -7607 -8723 -3082 2949 4384 6289 9160 4655 -2959
740 -2959 -5127 -5117 -7743 -5671 2123 5402 4254 6777 6032 -1660 -5659 -4211 -5836 -6447 55 6140
756 6140 5100 5107 6736 1637 -5550 -6163 -5085 -5955 -3192 4744 7572 4846 4609 3133 -2770 -7735 -6041
773 -6041 -3482 -2403 1681 6953 7201 3829 1633 -1089 -5754 -8028 -4672 -1521 323 4655 7905
788 7905 5438 1067 -658 -3518 -7639 -6296 -1113 1352 2762 6642 7334 1637 -2394 -2875 -5703 -7726
804 -7726 -3390 2547 3723 4545 6659 4636 -1606 -4348 -4318 -6012 -4873 481 4725 4762 4960 4958 579
$$ packed form
694d108J0856Q99l681K932j115j1325l953M473r14N25J0067N964m496j888j53
709D083p504o707K979L187O63N116O685q44l619j081l958n433j357K925K366K698
725A99N026L048j749m340l429k406l956j116N641O031J435J905K871m505p614
740b959k168J0k626K072P794L279j148K523p45p692l999J448j625o11O502O085
756F140j040PJ629n099p187o13J078q70K763P936K828k726k37j476n903m965J694
773f041K559J079M084N272K48l372k196k722m665k274L356L151J844M332L250
788G905k467m371j725k860m121J343N183K465J410L880O92n697m031m81k828k023
804g726M336N937J176Q22K114k023o242k742L0j694J139N354M244L7J98km379
$$ plain form
821 579 -4557 -5308 -4586 -4676 -1563 4106 5912 4659 4097 2026 -2827 -6220 -4853 -3621 -2142 1939 6044
838 6044 5426 3114 1813 -1000 -5659 -7025 -3237 -1038 340 4307 7352 4538 530 -822 -3377
853 -3377 -6618 -5161 -780 1256 2790 6195 5608 1594 -1711 -2623 -5183 -6183 -1868 1769 2908 4719
869 4719 6205 3096 -1627 -2936 -3914 -5901 -4073 1168 4063 3797 4540 4196 423 -4129 -4964 -3945
885 -3945 -3189 -571 3469 5357 4349 3314 1455 -2439 -5517 -4596 -2651 -1992 1659 5535 5265 2715
901 2715 1653 -555 -5209 -5663 -2345 -1131 311 5038 6466 2458 227 -204 -3893 -7110 -3756 345
917 345 643 2918 5960 4629 453 -964 -2416 -5058 -4844 -1446 562 2028 4562 4749 2298 -683
933 -683 -2695 -4680 -4890 -2786 1008 3268 4552 4364 2813 -264 -3929 -4531 -3502 -3303 -949 3706
$$ packed form
821E79n136p51P22r0L113N669J806j253n62k071m853l393J367J232J479M081M105
838F044o18k312j301k813m659j366L788K199J378L967L045k814m008j352k555
853c377l241J457M381K036J534L405n87m014l305r12k560j000M315L637J139J811
869D719J486l109m723j309r78j987J828N241K895k66P43l44l773m552q35J019
885c945P56K618M040J888j008j035j859l894l078R21J945O59L651L876k70k550
901B715j062k208m654m54L318J214J442M727J428m008k231m31l689l217L354M101
917C45K98K275L042j331m176j417j452k642K14L398K008J466K534J87k451k981
933f83k012j985k10K104L794K260J284j88j551l077l665o02J029J99K354M655
$$ plain form
949 3706 4608 2819 2459 2111 -2551 -4946 -2532 -2135 -2553 1368 5478 3741 1707 2339 -1131 -5770 -4882
966 -4882 -1912 -1743 689 5854 5075 2288 1766 -411 -5077 -5197 -2052 -1198 -75 3682 4897 1945
982 1945 635 131 -2569 -3842 -2921 -1386 413 2615 3681 3642 2969 -390 -3517 -3980 -4043 -3879 -14
999 -14 3912 4094 3930 3841 95 -4617 -3741 -2307 -3165 -56 4577 3082 1117 2660 879 -3928 -3848 -1035
1017 -1035 -2826 -2462 2840 4172 1957 3181 3114 -1770 -4669 -2923 -3490 -3227 1729 4686 3509 2844
1033 2844 1897 -2098 -4503 -3286 -2322 -866 2397 3723 2702 2507 753 -1907 -2445 -2236 -3331 -2047
1049 -2047 1098 1812 1941 4126 3683 -734 -2149 -2049 -4371 -3836 1591 3247 2199 3862 3544 -2238
1065 -2238 -4307 -2334 -3315 -3422 1745 4518 2113 2033 3545 -323 -3441 -1458 -1886 -3579 -945 2147
$$ packed form
949C706R02j789l60l48m662k395K414L97m18L921M110j737k034O32l470m639Q88
966d882K970J69K432N165p79k787n22k177m666j20L145Q54J123L757J215k952
982A945j310n04k700j273R21J535J799K202J066l9o73l359l127m63o3J64L865
999a4L926J82j64q9l746m712Q76J434q58L109M633j495j965J543j781m807Q0K813
1017a035j791L64N302J332k215J224o7m884k899J746n67K63M956K957j177o65
1033B844r47l995k405J217R64J456L263J326j021j95j754k660n38K09j095J284
1049b047L145P14J29K185m43m417j415J00k322N35N427J656j048J663l18n782
1065b238k069J973r81j07N167K773k405q0J512l868l118J983m28j693K634L092
$$ plain form
1081 2147 1416 1725 3334 1514 -2191 -2466 -2715 -3680 -1219 2010 3332 4003 3501 767 -2216 -3156 -3761
1098 -3761 -3197 -648 2068 2004 3368 3020 -7 -1818 -624 -2055 -3354 -105 1604 474 2240 4380
1114 4380 1198 -1524 -769 -2675 -5025 -2005 1160 1297 2293 5058 2237 -1662 -1661 -1788 -4105 -1911 1669
1131 1669 2198 1618 2842 1716 -1490 -2093 -1200 -2794 -1966 464 1410 1693 2998 2587 691 -618 -2088
1148 -2088 -3564 -2525 -690 305 2304 3663 2261 -188 -1072 -2448 -3709 -1861 738 990 2048 3919
1164 3919 1853 -748 -480 -1473 -3788 -2213 482 74 539 3048 3273 69 -359 -553 -3033 -3377 -900
1181 -900 658 1356 2750 3371 751 -960 -1404 -2871 -2901 -1056 641 1609 2831 2527 1545 -262 -1377
1198 -1377 -1880 -2509 -1313 -189 1246 2178 2292 1546 565 -1207 -2888 -2278 -1447 -867 531 3249 2883
$$ packed form
1081B147p31L09J609j820l705k75k49r65K461L229J322O71n02k734k983r40o05
1098c761N64K549K716o4J364l48l027j811J194j431j299L249J709j130J766K140
1114D380l182k722P55j906k350L020L165J37R96K765k821l899Jj27k317K194L580
1131A669N29n80J224j126l206o03Q93j594Q28K430R46K83J305m11j896j309j470
1148b088j476J039J835R95J999J359j402k449q84j376j261J848K599K52J058J871
1164C919k066k601K68r93k315J575K695m08M65K509K25l204m28j94k480l44K477
1181i00J558O98J394O21k620j711m44j467l0J845J697R68J222l04r82j807j115
1198a377n03o29J196J124J435R32J14p46r81j772j681O10Q31N80J398K718l66
$$ plain form
1215 2883 1275 506 -184 -2737 -3249 -1186 -236 401 2334 3057 1151 170 -185 -2104 -3084 -1240 -293
1232 -293 -89 1334 3064 1822 326 -128 -1280 -3104 -2291 -859 55 1115 2358 2557 871 -786
1248 -786 -1616 -1970 -2418 -1421 473 1958 2279 2268 1554 -115 -1848 -2085 -1893 -1780 -378 1479 2282 1320
1266 1320 1369 648 -1679 -2090 -1669 -1504 -497 1226 2702 1678 1259 831 -892 -2580 -1982 -1350 -650 681
1284 681 2381 2455 1229 635 -57 -1674 -2342 -1210 -649 430 1223 2343 1690 591 -343 -1341 -2438 -1762
1302 -1762 -676 412 1222 2450 2375 764 -476 -1057 -1662 -2095 -1198 285 1358 1505 2041 1299 -376
1319 -376 -1434 -1609 -1440 -1569 9 1794 1732 1502 1418 343 -1250 -1635 -1665 -1478 -565 1044 1884 1521 1348
1338 1348 402 -691 -1787 -1426 -1114 -794 662 1754 1616 1225 442 -474 -1957 -1772 -1428 -533 276 1381
$$ packed form
1215B883j608p69o90k553n12K063R50O37J933P23j906r81l55j919r80J844R47
1232b93K04J423J730j242j496m54j152j824Q13J432R14J060J243J99j686j657
1248g86q30l54m48R97J894J485L21j1p14j669j733k37J92J13J402J857Q03r62
1266A320M9p21k327m11M21J65J007J723J476j024m19m28j723j688N98O32P00J331
1284F81J700P4j226n94o92j617o68J132N61J079P93J120o53j099r34r98j097O76
1302a762J086J088Q10J228p5j611j240n81o05m33Q97J483J073J47N36p42j675
1319c76j058j75J69j29J578J785o2k30q4j075j593l85l0J87R13J609Q40l63j73
1338A348r46j093j096L61L12L20J456J092j38l91p83r16j483J85L44Q95Q09J105
$$ plain form
1356 1381 2231 1359 667 -173 -1093 -2255 -1508 -496 527 934 1706 1846 949 -454 -1330 -1384 -1822 -1160 188
1375 188 1087 1353 1847 1038 -515 -976 -1354 -1499 -1233 49 854 1384 1536 1634 -40 -1320 -1351 -1455 -1414 -347
1395 -347 986 1608 849 1024 627 -779 -1569 -1133 -1255 -382 482 1395 1596 1016 49 -714 -1490 -1745 -1437
1414 -1437 -343 567 1344 1903 1344 517 -359 -753 -1427 -1314 -217 56 786 1405 1706 231 -691 -799 -1233
1433 -1233 -1786 -761 532 910 1183 1782 1221 -472 -1031 -975 -2184 -1245 7 737 837 1476 1206 -123
1451 -123 -677 -1158 -1376 -927 364 778 1091 1064 794 -151 -652 -1287 -1551 -913 -176 507 1259 1330 1191 481
1471 481 -188 -726 -1622 -1098 -451 385 1027 1709 931 -298 -484 -1186 -1895 -1364 -15 238 687 2024 1432
1490 1432 -98 -203 -478 -1635 -1697 74 -4 290 1254 1412 379 -324 -59 -1249 -1543 -369 -27 615
$$ packed form
1356A381Q50q72o92q40r20j162P47J012J023M07P72J40q97j403q76n4m38O62J348
1375A88Q99K66M94q09j553m61l78j45K66J282Q05N30J52R8j674j280l1j04M1J067
1395c47J333O22p59J75l97j406p90M36j22Q73Q64R13K01n80r67p63p76k55L08
1414a437J094R10P77N59n59q27q76l94o74J13J097K73P30O19L01j475r22j08m34
1433a233n53J025J293L78K73N99n61j693n59N6j209R39J252P30J00O39k70j329
1451a23n54m81k18M49J291M14L13k7k70r45n01o35k64O38P37O83P52P1j39p10
1471D81o69n38q96N24O47Q36O42O82p78j229j86p02p09N31J349K53M49J337n92
1490A432j530j05k75j157o2J771p8K94R64J58j033p03K65j190k94J174L42O42
$$ plain form
1508 615 1450 1638 597 -157 -713 -1682 -1699 -711 -117 612 1313 1370 539 257 -198 -1137 -1025 -197 -279 79 985
1529 985 1165 302 129 58 -1365 -1631 -517 -787 -224 1170 1783 750 256 211 -1231 -1598 -866 31 92
1548 92 1119 1555 424 -142 163 -953 -1555 -554 -119 -341 561 1120 778 642 313 -321 -1197 -1010 -720
1567 -720 -355 435 1398 1416 536 197 -931 -1460 -892 -743 -280 931 1475 410 405 472 -634 -1410 -473 -134
1587 -134 -554 556 1413 271 350 875 -167 -1079 -995 -517 -945 -17 1400 1179 667 865 -302 -1402 -1062
1606 -1062 -499 -584 -25 1092 1027 457 441 -202 -1160 -914 -382 -396 73 783 580 487 430 36 -943 -859 -831 -760
1628 -760 -17 892 755 892 1120 63 -886 -1028 -710 -1286 27 1106 1004 744 718 15 -1177 -901 -361
1647 -361 -692 -339 1053 911 358 586 712 -458 -1013 -716 -818 -650 353 963 650 806 464 -268 -882
$$ packed form
1508F15Q35J88j041p54n56r69j7R88N94P29P01N7q31k82m55r39J12Q28q2L58R06
1529I85J80q63j73p1j423k66J114k70N63J394O13j033m94m5j442l67P32Q97O1
1548I2J027M36j131n66L05j116o02J001M35k22R02N59l42j36l29o34q76J87K90
1567g20L65P90R63J8q80l39j128n29N68J49M63J211N44j065nO7j106p76R37L39
1587a34m20J110Q57j142P9N25j042r12Q4M78m28R28J417k21n12J98j167j100L40
1606a062N63q5N59J117o5n70j6o43r58K46N32j4M69P10k03r3n7l94r79Q4K8P1
1628g60P43R09j37J37K28j057r49j42L18n76J313J079j02k60k6p03j192K76N40
1647c61l31L53J392j42n53K28J26j170n55K97j02J68J003O10l13J56l42p32o14
$$ plain form
1666 -882 -1015 -877 -460 301 757 871 874 513 -259 -672 -704 -847 -183 227 446 676 791 523 -260 -629 -516
1687 -516 -1132 -691 417 405 509 980 517 -424 -865 -652 -741 -655 37 751 661 829 954 -58 -341 -682 -755
1708 -755 -861 -96 785 809 750 896 136 -241 -521 -762 -502 -730 200 729 791 730 341 -267 -483 -796 -701 -91
1730 -91 99 593 1016 727 141 -258 -475 -866 -928 -16 200 228 662 731 343 -337 -234 -566 -627 -277 -44 176
1752 176 602 897 714 -151 -251 -812 -950 -541 163 370 262 872 746 -77 -420 -495 -645 -559 -213 404 696
1773 696 553 464 71 -290 -660 -848 -599 -255 192 446 808 591 412 30 -435 -849 -346 -140 -61 692 711
1794 711 438 96 -156 -489 -981 -410 95 63 402 833 512 -34 -6 -288 -850 -650 -382 25 269 605 604
1815 604 195 134 -224 -663 -696 -426 -13 395 507 488 715 271 -403 -592 -456 -505 -246 490 326 709 451
$$ packed form
1666h82j33J38M17P61M56J14Ll61p72m13l2j43O64M10K19K30J15k68p83l69J13
1687e16o16M41J108j2J04M71m63r41m41K13q9Q6O92P14r0J68J25j012k83l41p3
1708g55j06P65Q81K4n9J46p60l77k80k41K60k28R30N29O2o1l89o08k16l13R5O10
1730i1J90M94M23k89n86l99k17l91o2R12K16K8M34O9l88o80J03l32o1L50K33K20
1752A76M26K95j83q65j00n61j38M09P04K07j08O10j26q23l43p5j50Q6L46O17K92
1773F96j43q9l93l61l70j88K49L44M47K54L62k17j79l82m65m14N03K06P9P53J9
1794G11k73l42k52l33m92N71N05l2L39M31l21n46K8k82n62K00K68M07K44L36j
1815F04m09o1l58m39l3K70M13M08J12j9K27m44o74j89J36m9K59P36j64L83k58
$$ plain form
1836 451 339 -137 -760 -380 -264 -181 110 563 729 485 454 -142 -592 -449 -693 -131 -143 364 759 342 62
1857 62 -8 -673 -691 -468 -204 153 410 717 607 431 45 -380 -716 -461 -432 -75 188 447 571 373 -40
1878 -40 -405 -219 -295 -478 -142 430 658 474 141 266 -303 -370 -539 -427 57 188 392 564 611 26 -283
1899 -283 -173 -476 -124 -158 286 860 448 494 117 14 -555 -444 -61 -195 -14 305 774 306 131 -163 -661
1920 -661 -834 -141 -182 93 436 500 388 468 9 -497 -496 -465 -167 305 665 401 232 90 -142 -481 -539 -498 -510
1943 -510 -63 376 412 478 386 -171 -503 -321 -125 -349 -164 282 444 613 541 230 -281 -412 -474 -428 -334 465
1965 465 524 298 282 131 -205 -230 -430 -294 -164 156 351 575 544 115 -169 -469 -336 -546 -348 118 457
1986 457 234 437 265 -123 -294 -239 -229 -212 -8 325 463 556 118 117 -341 -381 -374 -121 48 318 130 393 510
$$ packed form
1836D51j12m76o23L80J16Q3K91M53J66k44l1n96m50J43k44N62j2N07L95m17k80
1857F2p0o65j8K23K64L57K57L07j10j76l86m25l36K55K9L57K63K59J24j98m13
1878d0l65J86p6j83L36N72K28j84l33J25n69o7j69J12M84J31K04J72M7n85l09
1899b83J10l03L52l4M44N74m12M6l77j03n69J11L83j34J81L19M69m68j75k94m98
1920f61j73O93m1K75L43O4j12Q0m59n06JL1K98M72L60k64j69j42k32l39n8M1j2
1943e10M47M39L6O6r2n57l32J82J96k24J85M46J62J69p2l11n11j31o2M6R4P99
1965D65N9k26j6j51l36k5k00J36J30L20J95K24l1m29k84l00J33k10J98M66L39
1986D57k23K03j72l88j71N5J0J7K04L33J38R3m38jm58m0PK53J69K70j88K63J17
$$ plain form
2009 510 -144 -73 -175 -376 -517 -151 348 303 600 275 59 -17 -370 -323 -365 133 84 169 421 170 -131 -583
2031 -583 -441 -397 -305 -19 87 401 404 530 149 -52 -316 -190 -357 -190 114 237 312 165 271 17 -193 -514
2053 -514 -420 -220 57 -31 444 463 111 -197 -90 -353 -200 -34 167 390 415 275 375 -262 -116 -654 -456
2074 -456 -263 203 176 238 248 453 -86 43 -174 -389 -293 -101 -43 220 482 373 -84 -190 -246 -589 -359 -34
2096 -34 124 442 522 156 41 142 -139 -240 -154 -102 77 138 293 252 -87 76 -309 -577 -407 -29 71 -16
2118 -16 306 456 -152 -301 23 -523 -368 12 -67 193 165 358 123 18 157 -353 -12 -81 -98 118 143 209
2140 209 183 87 -30 -347 -612 -270 4 246 323 325 51 -131 -270 -417 -473 -60 4 117 414 121 1 309
2162 309 -150 -368 -231 -350 87 -5 420 558 110 83 -46 -313 -518 243 319 63 351 403 118 11 -201
$$ packed form
2009E10o54P1j02k01j41L66M99m5K97l25k16p6l53M7m2M98m9Q5K52k51l01m52
2031e83J42M4R2K86J06L14LJ26l81k01k64J26j67J67L04J23P5j47J06k54k10l21
2053e14R4K00K77q8M75J9l52l08J07k63J53J66K01K23K5j40J00o37J46n38J98
2074d56J93M66k7O2J0K05n39J29k17k15R6J92N8K63K62j09m57j06n6l43K30L25
2096c4J58L18Q0l66j15J01k81j01Q6N2J79O1J55m1l39J63l85k68J70L78J00q7
2118a6L22J50o08j49L24n46J55L80p9K60k8J93k35j05J39n10L41o9j7K16K5O6
2140B09k6r6j17l17k65L42K74K42P7Kk74j82j39j47n6M13O4J13K97k93j20L08
2162C09m59k18J37j19M37r2M25J38m48k7j29k67k05P61P6k56K88N2k85j07k12
$$ plain form
2183 -201 -353 -382 -249 -74 231 403 282 351 207 149 -114 -392 5 -200 92 314 333 -41 -71 -189 -88 -391
2205 -391 -53 62 -289 440 410 207 79 -49 -238 -140 -88 -20 -122 310 235 -56 293 300 -262 -217 -317 -62 80
2228 80 102 214 21 123 186 -159 -119 -254 -34 44 242 309 -83 144 -108 54 -248 -261 -222 -114 162 393 530
2251 530 301 187 -172 -49 -499 -11 -171 -103 268 570 290 -120 -45 -255 -84 -206 -174 212 13 121 365
2272 365 251 105 -230 -61 -237 -137 -95 218 52 224 212 45 -224 -325 -284 62 51 175 230 197 63 52
2294 52 7 -280 -154 -183 4 -29 566 204 187 -63 -392 -65 -101 -200 -3 268 102 167 127 168 -99 -314 -87
2317 -87 -155 45 257 273 157 -55 -71 -138 -189 -20 23 -168 205 146 269 31 134 -99 43 -197 -211 -74 -106
2340 -106 110 480 288 128 114 -61 -405 -25 -112 127 183 155 230 197 -105 -97 -260 -262 -201 -400 383 57 271 -118
$$ packed form
2183b01j52k9J33J75L05J72j21O9j44n8k63k78L97k05K92K22J9l74l0j18J01l03
2205c91L38J15l51P29l0k03j28j28j89R8N2O8j02M32p5k91L49Pn62M5j00K55J42
2228H0K2J12j93J02O3l45M0j35K20P8J98O7l92K27k52J62l02j3L9J08K76K31J37
2251E30k29j14l59J23m50M88j60O8L71L02k80m10P5k10J71j22L2L86j99J08K44
2272C65j14j46l35J69j76J00M2L13j66J72j2j67k69j01M1L46j1J24N5l3j34j1
2294E2m5k87J26k9J87l3N95l62j7k50l29L27l6r9J97K71j66O5m0M1k67k15K27
2317h7o8K00K12J6j16k12j6o7n1J69M3j91L73n9J23k38J03k33J42k40j4J37l2
2340a06K16L70j92j60j4j75l44L80q7K39N6k8P5l3l02Qj63kO1j99P83l26K14l89
$$ plain form
2364 -118 -44 -10 -44 -212 -96 172 397 286 309 29 -246 -354 -111 -455 -47 -59 -209 289 289 -64 -10 -64 20
2387 20 -131 -115 39 69 71 81 206 156 -230 -269 -42 -240 149 188 222 288 224 148 -254 -171 -202 -74 93 -5 304
2412 304 149 59 -157 124 -65 -112 -140 -81 -131 -115 308 -34 -130 -12 -37 -5 -152 171 74 24 194 167 47 131
2436 131 -229 -236 -233 25 121 29 -2 269 36 -87 -57 -34 -89 -50 -82 384 249 268 252 100 -166 -335 -221 -69 99
2461 99 165 -36 129 72 -263 -132 -327 -130 -133 -15 111 324 244 -82 -116 -67 -216 127 -309 19 144 -67 167
2484 167 166 -180 -13 2 -91 -230 -236 -192 74 -6 -35 -122 -196 -41 -106 -231 -94 -44 50 105 124 5 375 278 -322 -174
2510 -174 -218 -38 59 165 237 -46 26 -68 -154 -167 -64 147 -20 130 -18 -144 -234 -93 -32 -102 53 5 203 260
2534 260 201 128 -46 253 -55 -109 -91 -12 21 232 18 -30 77 -43 -216 -59 108 22 -28 195 7 178 -251
$$ packed form
2364a18P4L4l4j68J16K68K25j11K3k80k75j08K43l44M08j2j50M98%l53N4n4Q4
2387B0j51J6J54L0KJ0J25n0l86l9K27j98L89L9L4O6o4p6m02Q3l1J28J67r8L09
2412C04j55r0k16K81j89m7k8N9n0J6M23l42r6J18k5L2j47L23r7n0J70k7j20Q4
2436A31l60pLK58R6r2l1K71k33j23L0K3n5L9l2M66j35J9j6j52k66j69J14J52J68
2461I9O6k01J65n7l35J31j95J97lJ18J26K13q0l26l4M9j49L43m36L28J25k11K34
2484A67jl46J67J5r3j39oM4K66q0k9q7p4J55o5j25J37N0R4N5J9j19L70r7o00J48
2510a74m4J80R7J06P2k83P2r4q6j3J03K11j67J50j48j26r0J41O1p0J55m8J98N7
2534B60n9p3j74K99l08n4J8P9L3K11k14m8J07j20j73J57J67q6n0K23j88J71m29
$$ plain form
2557 -251 -54 -64 -162 -195 4 -52 186 132 113 12 -96 -133 -309 5 -197 57 194 105 -113 190 -56 -262 -189
2580 -189 70 -117 139 266 4 180 178 -55 5 -283 5 -98 79 96 387 216 61 28 -1 -151 102 -233
2602 -233 44 164 177 -11 226 253 -41 -180 169 26 23 180 178 251 219 -14 -232 46 -64 167 -120 110 170
2625 170 117 189 28 -127 -88 87 -15 71 -2 147 114 206 276 32 -130 -346 -160 210 -112 288 347 338 -119 -44
2649 -44 -178 -262 29 -50 182 105 208 41 -94 -163 202 -68 37 -325 -52 89 196 233 -17 20 117 60 6
2672 6 -178 116 27 141 3 -162 209 29 -235 -44 101 10 -5 55 101 132 -199 -195 -2 -379 -29 34 71 179
2696 179 234 122 53 -43 155 62 -15 -125 386 336 249 -102 169 -27 3 -212 -200 76 36 200 71 3 -157 -159
2720 -159 52 -111 -48 -155 179 144 89 354 -115 -8 -134 -106 -102 -207 211 163 80 -47 133 9 -117 -104 -14
$$ packed form
2557b51J97j0r8l3J99n6K38n4j9j01j08l7j76L14k02K54J37q9k18L03k46k06P3
2580a89K59j87K56J27k62J76kk33O0k88K88j03J77J7K91j71j55l3k9j50K53l35
2602b33K77J20J3j88K37K7k94j39L49j43lJ57kP3l2k33k18K78j10K31k87K30O0
2625A70n3P2j61j55L9J75j02Q6p3J49l3R2P0k44j62k16J86L70l22M00N9rm57P5
2649d4j34q4K91p9K32p7J03j67j35o9L65k70J05l62K73J41J07L7k50L7R7n7n4
2672Fj84K94q9J14j38j65L71j80k64J91J45r1j5O0M6L1l31MJ93l77L50O3L7J08
2696A79N5j12o9r6J98r3p7j10N11n0q7l51K71j96L0k15J2K76m0J64j29o8j60k
2720a59K11j63O3j07L34l5n5K65m69J07j26K8Mj05M18m8q3j27J80j24j26J3R0
$$ plain form
2743 -14 -155 78 58 -10 188 33 1 -122 -277 -79 -173 178 124 15 249 110 -104 -77 -155 -305 241 0 -9
2766 -9 -38 82 133 -41 -189 -254 122 -318 -80 -79 -55 50 255 -11 -35 -60 -68 -68 190 -23 -170 48 15 82 1 103
2792 103 -81 -172 135 252 -68 -25 214 5 -102 72 -179 73 72 -188 17 150 33 138 0 -89 -6 -114
2814 -114 -162 77 -104 38 29 -117 82 77 -143 -295 -141 104 93 -85 193 134 65 -399 73 107 -106 -31 139
2837 139 32 53 167 -282 -40 -141 -208 -23 -50 6 221 -176 -29 -59 -34 -169 -157 93 35 270 95 169 261
2860 261 48 -140 -46 -137 -88 -159 -60 138 285 265 10 -112 -244 -161 -328 33 54 -26 -92 74 -34 -240 -329 -58
2884 -58 -120 -412 115 -35 69 190 208 60 -35 -130 -56 -78 28 -59 -26 -77 228 173 166 -267 -228 -110 -101 -44 32 134
2910 134 -162 119 -27 -39 -74 108 -209 -87 -32 95 161 -25 -2 -225 63 -88 -115 214 135 90 -10 -93 -238
$$ packed form
2743a4j41K33k0o8J98j55l2j23j55J98r4L51n4j09K34j39k14K7p8j50N46k41r
2766ik9J20N1j74j48o5L76m40K38JK4J05K05k66k4k5q%K58k13j47K18l3O7q1J02
2792A03j84r1L07J17l20M3K39k09j07J74k51K52jk60K05J33j17J05j38q9Q3j08
2814a14m8K39j81J42rj46J99nk20j52J54K45j1j78K78n9o9m64M72L4k13P5J70
2837A39j07K1J14m49K42j01o7J85k7N6K15l97J47l0K5j35J2K50n8K35j75P4R2
2860B61k13j88R4r1M9p1R9J98J47k0k55j22j32Q3j67L61K1q0o6J66j08k06q9K71
2884e8o2k92N27j50J04J21J8j48r5r5P4k2J06q7L3n1L05n5pm33L9J18RN7P6J02
2910A34k96K81j46j2l5J82l17J22N5J27O6j86K3k23K88j51k7L29p9m5j00q3j45
$$ plain form
2933 -238 116 -55 -10 222 71 -30 262 120 -164 -16 -61 -117 -53 -139 12 15 -185 -270 -57 154 22 -90 -273
2956 -273 -214 270 -137 238 -8 -105 234 175 -84 -12 38 -165 -31 -127 -67 126 99 -85 22 -35 180 -174 -261
2979 -261 257 264 -30 -39 -93 -135 -370 21 -18 31 210 54 -71 -23 -105 -85 35 -115 -173 -316 90 85 -24 -34 40
3004 40 52 -79 -26 154 211 -235 77 -9 -215 -66 192 -250 -155 -52 265 107 -158 -20 80 81 -29 82 -135
3027 -135 -123 0 62 172 140 -58 -162 107 -50 78 34 93 -108 169 86 37 -167 -118 -81 49 47 -23 83 -27
3051 -27 -159 -33 -165 13 -263 -137 51 -243 43 174 199 149 81 -255 -46 55 222 59 168 156 49 75
3073 75 -149 -152 -64 -190 -201 -166 9 113 76 72 -31 -326 78 -13 141 264 71 52 -103 29 -98 -164 -52 107
3097 107 -69 128 -189 117 105 -42 203 145 -154 -28 19 -84 58 233 267 162 182 87 -18 186 52 -162
$$ packed form
2933b38L54j71M5K32j51j01K92j42k84J48m5n6O4q6J51Lk00q5K13K11j32j12j83
2956b73N9M84m07L75k46r7L39n9k59P2N0k03J34r6O0J93k7j84J07n7K15l54q7
2979b61N18Pk94rn4m2k35L91l9M9J79j56j25M8q2K0J20j50n8j43M06nj09j0P4
3004D0J2j31N3J80N7m46L12q6k06J49K58m42R5J03L17j58k65J38J00Jj10J11k17
3027a35J2J23O2J10l2j98j04K69j57J28m4N9k01K77q3m9k04M9L7J30kp0J06j10
3051b7j32J26j32J78k76J26J88k94K86J31K5n0o8l36K09J01J67j63J09j2j07K6
3073G5k24lQ8j26j1L5J75J04l7mj03k95M04r1J54J23j93j9j55J32j27o6J12J59
3097A07j76J97l17L06j2j47K45n8k99J26M7j03J42J75L4j05K0r5j05K04j34k14
$$ plain form
3119 -162 -62 148 173 -206 237 41 -204 -72 31 -110 -30 -41 -34 34 50 -4 117 -48 9 -291 -56 -31 -162
3142 -162 207 182 117 -168 191 -127 9 134 165 170 54 204 28 55 -25 138 -114 14 -192 71 -65 70
3164 70 -42 51 84 -198 -223 -31 327 -186 210 -14 198 -84 53 -144 128 -172 -170 28 9 169 -106 -55 210
3187 210 -98 28 -167 36 190 -2 113 -29 -120 -84 -235 -89 8 -59 38 -27 -114 -210 210 -93 -30 146 -65
3210 -65 -146 -167 -96 -12 -17 49 16 -234 -336 -161 -67 100 175 285 -133 110 90 40 -204 -140 176 -12 26 265 -124
3235 -124 150 -100 -155 -27 -95 -14 -62 167 195 99 108 -30 138 -9 -26 22 -75 220 -9 177 98 222 -101 5
3259 5 -330 -182 102 20 4 -108 -47 192 -108 -27 112 -108 -64 87 -68 72 42 -205 87 -258 21 -62 -33
3282 -33 -24 -219 153 62 87 27 -52 48 64 -288 15 -138 -44 361 88 -41 -106 -62 -134 69 -91 -87 109 322 224
$$ packed form
3119a62J00K10K5l79M43j96k45J32J03j41Q0j1PO8J6n4J21j65N7l00K35K5j31
3142a62L69k5o5k85L59l18J36J25L1Nj16J50j76K7q0J63k52J28k06K63j36J35
3164G0j12R3L3k82k5J92L58n13L96k24K12k82J37j97K72l00KJ98j9J60k75N1K65
3187B10l08J26j95K03J54j92J15j42r1L6j51J46R7o7R7o5q7r6M20l03O3J76k11
3210f5q1k1P1Q4nO6l3k50j02J75R4J67P5J10m18K43k0n0k44O4L16j88L8K39l89
3235a24K74k50n5J28o8Q1m8K29K8r6Rj38J68j47j7M8r7K95k29J86p9J24l23J06
3259El35J48K84q2j6j12O1K39l00Q1J39k20M4J51j55J40l0k47K92l45K79q3K9
3282c3Rj95L72r1K5o0p9J00J6l52L03j53R4M05k73j29o5M4p2K03j60MJ96K13r8
$$ plain form
3307 224 45 -11 -190 -338 242 -41 -37 147 74 38 65 -90 222 -42 -53 -44 141 -26 26 26 72 140 60 20 -72 76
3333 76 -61 157 -5 -59 53 4 -134 -78 75 37 -252 77 81 191 -33 70 -11 -145 243 -362 -166 244 16
3356 16 -123 -91 192 13 246 -97 33 -63 -107 235 61 219 34 3 -119 112 -72 39 285 -21 69 143
3378 143 168 -162 38 44 -202 -130 65 -185 66 -36 -55 114 -79 -135 -224 -173 -256 -10 5 52 24 117 69 -87 -43
3403 -43 -181 -53 41 19 193 178 143 -364 -124 -45 -6 85 20 84 -59 112 66 -7 -77 -38 90 -5 90 -13 229
3428 229 -3 18 38 -40 -39 -13 8 -27 -30 -217 15 25 156 -183 -237 -92 13 -157 221 70 -91 42 79 -146
3452 -146 -152 120 56 138 -52 108 139 9 -165 190 71 -205 115 17 217 156 93 59 109 68 -65 282 -130 40
3476 40 -38 -71 55 145 -63 83 -232 -108 96 176 -74 -124 112 -102 -195 -107 204 -210 -136 -10 99 86 253
$$ packed form
3307B24j79n6j79j48N80k83MJ84p3l6K7j55L12k64j1RJ85j67N2%M6O8q0m0r2J48
3333G6j37K18j62n4J12m9j38N6J53l8k89L29MJ10k24J03q1j34L88o05J96M10k28
3356A6j39L2K83j79K33l43J30r6m4L42j74J58j85l1j22K31j84J11K46l06R0P4
3378A43K5l30K00Ok46P2J95k50K51j02j9J69j93n6q9N1q3K46J5M7k8R3m8j56M4
3403d3j38J28R4k2J74j5l5n07K40P9L9R1o5O4j43J71m6p3p0L9J28r5R5j03K42
3428B29k32K1K0p8JK6K1l5lj87K32J0J31l39n4J45J05j70L78j51j61J33L7k25
3452a46oK72o4Q2j90J60L1j30j74L55j19k76L20r8K00o1o3l4N0m1j33L47m12J70
3476D0p8l3J26R0k08J46l15J24K04Q0k50n0K36k14r3Q8L11m14P4J26J09j3J67
$$ plain form
3499 253 -16 -73 -249 -81 -91 -149 -236 -228 95 -28 -108 -25 189 -170 -266 -66 -69 -79 130 280 -79 -32 -109 63 59
3524 59 -140 -93 -153 -97 119 249 67 -42 -37 -90 14 -145 -217 12 150 29 -106 153 0 -77 209 -83 70
3547 70 31 -131 -13 -93 111 32 -50 -41 -1 156 97 -54 -161 65 118 161 -109 -95 6 42 73 55 -132 178 111
3572 111 -201 -109 -161 223 -140 -92 -100 -3 159 136 3 -129 122 -98 -310 38 71 165 22 -12 -57 11 -36 -202
3596 -202 -281 14 97 -80 194 -151 46 16 -9 21 -46 -11 -116 -110 207 -38 -10 -116 -34 161 -92 -196 -307 -131
3620 -131 -99 -15 187 -61 -177 18 -151 202 -211 311 15 56 -85 -24 -13 -113 73 -235 -46 -52 -37 119 22
3643 22 84 -67 -32 45 -195 20 -136 267 -91 -277 -15 -57 -118 -38 -54 113 -38 44 -208 88 110 73 85 -279
3667 -279 78 -170 -46 116 90 93 272 -152 -94 -23 -169 84 21 -106 -31 206 188 81 -360 -103 -212 -56 -202
$$ packed form
3499B53k69n7j76J68j0n8q7QL23j23q0Q3K14l59r6K00lj0K09J50l59M7p7J72m
3524E9j99M7o0N6K16J30j82j09Nn3J04j59p2K29J38j21j35K59j53p7K86k92J53
3547G0l9j62J18q0K04p9q2RM0J57n9j51j07K26N3M3k70J4J01L6L1j8j87L10o7
3572A11l12R2n2L84l63M8qR7J62k3j33j32K51k20k12L48L3R4j43l4m5O8m7j66
3596b02p9K95Q3j77K74l45J97l0k5L0o7L5j05OL17k45K8j06Q2J95k53j04j11J76
3620a31L2Q4K02k48j16J95j69L53m13N22k96M1j41O1J1j00J86l08J89oJ5J56r7
3643B2O2j51L5P7k40K15j56M03l58j86K62m2o1Q0j6J67j51Q2k52K96K2l7J2l64
3667b79L57k48J24J62k6LJ79m24N8P1j46K53o3j27P5K37j8j07m41K57j09J56j46
$$ plain form
3690 -202 -145 151 295 74 73 44 17 -123 -48 90 74 55 -47 50 236 -58 -119 -166 -299 209 172 113 34 -158 244
3715 244 187 -49 -218 -77 -38 111 -124 -97 315 106 -211 -44 32 -143 -205 62 119 15 -228 -157 7 38 -138
3738 -138 -63 -22 10 10 113 22 -179 -44 -126 -123 -234 -143 -161 -226 -275 130 -107 16 -2 225 -241 -91 -19 -193 237
3763 237 3 -192 -13 5 23 -191 80 -40 -107 55 71 173 74 204 -66 155 94 -117 163 -53 27 212
3785 212 245 -13 -14 -93 -332 212 382 -149 209 39 48 129 -127 -104 153 -13 -39 -52 -23 226 142 274 -187 53
3809 53 -144 -123 -86 -72 -104 288 -15 114 30 -85 -44 -138 150 -143 -38 256 -53 203 208 -91 -183 -131 -2 27
3833 27 65 -116 81 2 79 120 -471 4 -230 -61 199 243 123 126 308 190 52 -194 -38 56 -207 174 453
3856 453 84 77 -222 -247 -117 107 108 -187 84 156 53 251 -84 -54 -226 -5 58 84 -93 110 -269 18 -152
$$ packed form
3690b02N7K96J44k21jk9k7j40P5J38j6j9j02R7J86k94o1m7j33N08l7n9p9j92M02
3715B44n7k36j69J41L9J49k35K7M12k09l17J67P6j75o2K67N7j04k43P1J64L1j76
3738a38P5M1L2%J03r1k01J35q2Lj11R1j8o5m9M05k37J23j8K27m66J50P2j74M30
3763B37k34j95J79J8J8k14K71j20o7J62J6J02r9J30k70K21o1k11K80k16Q0J85
3785B12L3k58jp9k39N44J70n31L58j70RQ1k56K3K57j66k6j3K9K49q4J32m61K40
3809E3j97K1L7J4l2L92l03J29q4j15M1r4K88k93J05K94l09K56Nk99r2N2J29K9
3833B7L8j81J97p9P7M1n91M75k34J69K60M4j20LJ82j18j38k46J56R4k63L81K79
3856D53l69pk99k5J30K24Jk95K71P2j03J98l35L0j72K21O3K6j77K03l79K87j70
$$ plain form
3879 -152 45 -285 -370 -95 141 116 64 187 -21 -352 -248 10 145 -83 -50 -128 75 112 -152 61 -29 -251
3901 -251 -173 -203 146 -48 131 369 -2 268 -246 -107 -169 -286 -67 64 -124 -82 14 64 -79 -44 2 161 144
3924 144 2 -19 -160 -181 174 199 -121 -115 -65 -167 39 201 -144 -53 180 -125 45 -93 149 -50 225 66
3946 66 93 -16 144 83 77 -38 -207 13 -125 -21 219 196 93 315 96 -143 83 -194 35 96 -30 -182
3968 -182 -47 90 39 141 -172 100 -280 -32 -141 77 71 -2 -109 114 -219 -169 118 -288 12 -101 6 -367
3990 -367 38 -201 -228 27 13 -41 36 -36 -45 56 -137 -373 -59 136 73 51 57 232 69 201 -86 78 84 -52
4014 -52 -68 111 318 68 344 74 -187 -125 -84 -233 149 -14 -9 22 305 229 17 106 -54 -160 -238 -221 309 273
4038 273 8 186 -49 -202 -31 -58 -213 241 -124 -95 -180 120 -87 53 -164 -158 -148 83 -6 -83 -66 4 232
$$ packed form
3879a52J97l30q5K75K36k5n2J23k08l31J04K58J35k28L3p8K03L7k64K13r0k22
3901b51P8l0L49j94J79K38l71K70n14J39o2j17K19J31j88M2R6N0j43L5M6J59j7
3924A44j42k1j41k1L55K5l20ON0j02K06J62l45R1K33l05J70j38K42j99K75j59
3946F6K7j09J60o1oj15j69K20j38J04K40k3j03K22k19k39K26k77K29O1j26j52
3968a82J35J37n1J02l13K72l80K48j09K18op3j07K23l33N0K87m06L00j13J07l73
3990c67M05k39k7K55j4n4P7p2rJ01j93k36L14J95o3k2OJ75j63J32k87J64Oj36
4014e2j6J79K07k50K76k70k61O2M1j49L82j63NL1K83p6k12Q9j60j06p8J7N30l6
4038B73k65J78k35j53J71k7j55M54l65K9q5L00k07J40k17OJ0K31q9p7J7P0K28
$$ plain form
4061 232 -352 -27 -320 105 -71 72 -21 162 56 -49 -123 -45 -13 42 -114 322 66 58 204 -4 -8 -104 -222
4084 -222 -84 48 -125 -66 -3 72 148 97 112 -57 104 399 -55 70 213 239 -89 43 5 -110 -170 -35 -121
4107 -121 -25 58 -360 74 -212 41 -159 156 22 -185 -118 -46 -48 212 468 -90 -20 45 -132 -255 -106 -25 -79
4130 -79 -44 168 -77 -59 -92 65 234 -211 223 99 -54 114 73 157 65 -73 -210 -270 -29 77 -88 122 -287
4153 -287 -105 94 52 75 84 397 112 251 125 162 -98 0 -76 -373 334 -37 80 -71 88 -54 -201 42
4175 42 -294 -232 32 106 74 106 220 -81 40 225 43 217 -265 -97 103 106 78 173 -211 -422 2 73 -98
4198 -98 33 -125 -205 110 75 131 -66 -147 -315 -101 -117 -155 -82 225 78 47 -115 -282 -91 -64 -54 -130 -259 46
4222 46 16 48 142 43 100 -105 -163 -86 -34 -40 -41 -61 246 -132 -204 12 -154 119 -71 -21 46 -108 -72 34 71 32 -165
$$ packed form
4061B32n84L25k93M25j76J43r3J83j06j05p4P8L2N5j56M36k56qJ46k08mr6j18
4084b22J38J32j73N9O3P5P6n1J5j69J61K95m54J25J43K6l28J32l8j15o0J35q6
4107a21R6Q3m18M34k86K53k00L15j34k07O7P2kK60K56n58P0O5j77j23J49Q1n4
4130g9L5K12k45J8l3J57J69m45M34j24j53J68m1Q4r2j38j37o0K41J06j65K10m09
4153b87J82J99m2K3RL13k85J39j26L7k60R8p6k97P07l71J17j51J59j42j47K43
4175D2l36O2K64P4l2L2J14l01J21J85j82J74m82J68K00Lk8R5l84k11M24P1j71
4198i8J31j58q0L15l5N6j97q1j68K14j6l8P3L07j47l1j62j67J91K7J0p6j29L05
4222D6l0L2R4r9N7k05n8P7N2ojk0L07l78p2K16j66K73j90N0O7j54L6J06L7l9j97
$$ plain form
4249 -165 57 196 -123 72 -94 163 -87 -240 136 -66 -32 -78 -123 -106 44 -75 -68 -256 -201 -304 89 -88
4271 -88 102 241 343 -113 30 160 17 -95 140 114 237 5 69 60 54 160 -200 -341 -26 104 306 235 271
4294 271 -108 -63 -72 -34 94 -18 -188 -90 272 -133 67 136 77 -229 -106 6 152 -154 -106 110 139 128 -156
4317 -156 -47 -88 -177 174 -10 96 358 201 -268 -85 -151 155 -41 17 -73 2 105 19 356 40 31 1 -28 -135
4341 -135 66 22 -264 -56 144 -38 -88 -123 56 28 -168 -12 219 96 208 -217 -110 -78 -254 -126 121 -76
4363 -76 7 97 -43 -123 197 -201 -3 -195 -77 38 243 -20 -53 42 20 51 -382 -97 37 21 -64 97 66 122
4387 122 -74 81 -155 -55 -260 282 100 236 71 -1 -3 -270 -53 51 -175 -225 -13 43 142 98 -168 -128 104
4410 104 73 113 119 -304 80 -344 -80 -47 -274 -141 -5 -167 -158 -95 242 110 63 -7 -148 16 -102 -47 109 -80
$$ packed form
4249a65K22J39l19J95j66K57k50j53L76k02L4m6m5J7J50j19Pj88N5j03L93j77
4271h8J90J39J02m56J43J30j43j12K35k6J23k32O4roJ06l60j41L15J30K02p1L6
4294B71l79M5rL8J28j12j70R8L62m05K00O9n9l06J23J12J46l06M8K16K9j1k84
4317a56J09m1q9L51j84J06K62j57m69J83o6L06j96N8r0P5J03q6L37l16rl0k9j07
4341a35K01m4k86K08K00j82n0l5J79k8j96J56K31j23J12m25J07L2j76J28K47j97
4363g6Q3R0j40q0L20l98J98j92J18J15K05k63l3R5k2L1m33K85J34j6q5J61l1N6
4387A22j96J55k36J00k05N42j82J36j65p2kk67K17J04k26n0K12N6R9m4k66M0K32
4410A04l1M0Om23L84m24K64L3k27J33J36j62RO3L37j32m7p0j41J64j18N5J56j89
$$ plain form
4434 -80 6 -219 -16 91 -7 -74 -122 -318 -26 -4 33 64 -1 74 -270 115 -84 186 57 94 31 56 172 -296
4458 -296 -60 -284 -4 222 -79 112 -62 31 -2 -102 76 -147 -173 -189 51 116 -117 5 -88 19 91 17 -137
4481 -137 -101 41 -21 57 -331 -115 -112 -45 -75 29 36 2 -41 195 236 15 253 22 -229 291 -321 113 -4 51
4505 51 -114 -36 132 21 -234 22 -423 -110 -106 272 266 44 279 -9 62 -56 -121 -15 -122 312 270 34 97
4528 97 -64 26 -287 117 180 7 -185 207 -4 -8 -117 168 -4 -141 -45 -136 181 71 -234 250 -58 -60 -26
4551 -26 -74 -21 -128 -223 4 -16 93 178 19 -45 -438 -271 -251 -45 -91 164 57 -77 131 -45 -15 -82 -128 121
4575 121 162 -6 56 78 -82 -185 -65 12 -253 167 -23 -80 -1 -72 14 -122 38 33 122 -2 -138 94 85 215
4599 215 -236 -204 -164 -173 -12 151 -212 -47 172 -67 -66 31 194 74 -59 94 271 122 314 -103 112 50 191
$$ packed form
4434h0Q6k25K03J07r8o7m8j96K92K2L7L1o5P5l44L85j99K70j29L7o3K5J16m68
4458b96K36k24K80K26l01J91j74R3l3j00J78k23k6j6K40O5k33J22r3J07P2p4j54
4481a37L6J42o2P8l88K16LO7l0J04Pl4m3K36M1k21K38k31k51N20o12M34j17N5
4505E1j65P8J68j11k55K56m45L13ML78ok22K35k88P1j18o5J06j07M34m2k36O3
4528I7j61R0l13M04O3j73j92L92k11mj09K85j72j37R6r1L17j10l05M84l08kL4
4551b6m8N3j07r5K27k0J09Q5j59o4l93J67K0K06m6K55j07j34K08j76L0o7m6K49
4575A21M1j68O2K2j60j03J20P7k65M20j90n7P9p1Q6j36J60nQ9j24j36K32rJ30
4599B15m51L2M0rJ61J63l63J65K19k39JR7J63j20j33J53J77j49J92m17K15o2J41
$$ plain form
4622 191 194 -134 -234 -83 76 -36 304 78 -6 129 -322 -151 30 267 32 180 78 -23 -143 95 0
4643 0 -170 -51 105 -184 -84 122 -188 -52 -265 -364 -82 94 -94 29 130 31 -103 -75 -166 -95 -57 20 110
4666 110 116 -17 -36 24 98 203 -159 -140 -15 13 -74 391 28 135 -11 -94 222 -106 -139 -254 -23 128 35 81
4690 81 299 -90 -118 -27 54 -11 -53 -31 116 -3 -16 110 126 -98 6 19 59 -149 211 307 -177 129 253 -105
4714 -105 47 -62 9 187 170 -99 122 267 -279 -301 -77 82 -332 94 193 -17 173 159 163 -48 -200 -110 -154
4737 -154 56 173 149 -70 182 -95 -164 -101 9 -104 -172 41 -26 80 -105 -100 -1 36 -96 -134 104 146 90 -169
4761 -169 33 -82 -109 -196 118 -115 -68 57 8 -26 -320 172 29 -126 -241 22 66 -110 -25 54 131 -32 -75
4784 -75 117 -2 151 140 167 -63 174 44 227 -313 -1 -2 201 -79 162 130 -159 123 255 -79 -102 84
$$ packed form
4622A91Ll28j00J51J59j12L40k26q4J35m51J71J81K37k35J48j02j01j20K38r5
4643@j70J19J56k89J00K06l10J36k13r9K82J76j88J23J01r9j34K8r1P1L8P7R0
4666A10Oj33j9O0P4J05l62J9J25K8q7M65l63J07j46q3L16l28l3j15K31J51r3M6
4690H1K18l89k8R1Q1o5m2K2J47j19j3J26J6k24J04J3M0k08L60R6m84L06J24l58
4714a05J52j09P1J78j7k69K21J45n46k2K24J59m14M26R9k10J90j4Mk11j52R0m4
4737a54K10J17k4k19K52k77o9O3J10j13o8K13o7J06j85NR9L7j32l8K38M2n6k59
4761a69K02j15k7q7L14k33M7J25m9l4k94M92j43j55j15K63M4j76Q5P9P7j63m3
4784g5J92j19J53j1K7k30K37j30J83n40L12jK03k80K41l2k89K82J32l34k3J86
$$ plain form
4806 84 -210 2 233 78 407 312 -68 98 53 -266 -233 153 -117 -95 -133 -222 -130 -140 198 36 -6 71 -103 -27
4830 -27 152 20 216 148 -133 154 136 213 56 -67 177 -17 -20 -72 -185 19 -35 -15 -10 -165 225 168 -28 -134
4854 -134 226 33 -259 -91 49 -54 -115 -111 310 -205 -161 -51 51 -122 39 -106 -9 -177 17 95 174 -2
4876 -2 -198 -40 -284 38 -11 129 -79 174 -165 120 -284 -175 -200 182 119 60 47 -34 -145 20 78 -8 41 -50
4900 -50 18 129 189 71 128 129 -114 -133 264 35 -174 68 77 -11 101 110 27 34 -229 179 76 -10 173 109 295 -25
4926 -25 -223 -29 103 18 -185 185 159 40 -84 31 -36 -324 -240 148 39 -20 -415 -72 -59 -86 -10 -85 -82 -53
4950 -53 -56 -20 220 104 -99 154 -13 46 18 -115 -138 -89 110 187 -56 -179 35 -176 -280 -244 105 -75 100
4973 100 337 61 135 5 -119 -112 -204 105 159 -140 -21 86 173 -23 -248 -173 -271 105 131 150 93 359 81 21
$$ packed form
4806H4k94K12K31j55L29r5l80J66m5l19L3L86k70K2l8q9R2j0L38j62m2P7j74P6
4830b7J79j32J96o8k81K87j8P7j57j23K44j94ln2j13K04n4K0Nj55L90n7j96j06
4854a34L60j93k92J68J40j03o1MM21n15M4J10J02j73J61j45R7j68J94P8P9j76
4876bj96J58k44L22m9J40k08K53l39K85m04J09k5L82o3n9j3q1j11J65N8q6M9r1
4900e0O8J11O0j18N7Jk43j9L97k29k09K42Rq8J12Rq3Pk63M08j03q6J83o4J86l20
4926b5j98J94J32q5k03L70k6j19j24J15o7k88Q4L88j09n9l95L43J3k7P6p5LK9
4950e3lL6K40j16k03K53j67N9k8j33k3M9J99P7k43j23K14k11j04L6L49j80J75
4973A00K37k76P4j30j24Pr2L09N4k99J19J07Q7j96k25P5r8L76K6J9n7K66k78o0
$$ plain form
4997 21 -59 -200 35 -21 47 -157 57 89 30 -177 166 -20 -170 -142 89 104 -42 80 94 145 -260 -20 -200
5020 -200 -40 196 82 -31 28 -30 -18 57 -14 -232 247 0 -13 44 -34 -3 -38 -141 1 -195 -8 -90 47 35
5044 35 -196 65 8 -12 -127 -46 -104 8 -31 -75 427 -55 -85 180 -404 37 -255 197 42 -13 147 195 -123
5067 -123 -173 -69 -147 -232 -129 -62 7 127 136 358 154 -144 -94 -72 -43 131 -24 -72 -88 148 -78 -191 99 -5
5091 -5 78 -11 135 33 -95 -111 -29 -35 219 -52 -71 180 -35 109 116 204 34 62 30 -81 -5 -176 -72 -59 236
5116 236 -30 13 -82 175 -29 -70 6 -60 91 88 269 142 -254 72 -52 -132 -309 -10 -10 146 160 88 71 36 211
5141 211 141 -53 126 132 363 -72 -78 277 42 -64 -31 63 -7 22 146 125 -75 73 -3 -188 165 37 -130 -61
5165 -61 15 58 -123 40 -69 70 61 72 -51 36 -32 47 -7 -75 28 -102 -95 -95 -210 15 16 294 -90 -200 103 87
$$ packed form
4997B1q0j41K35n6O8k04K14L2n9k07L43j86j50K8K31J5j46J22J4N1m05K40j80
5020b00J60K36j14j13N9n8J2P5p1k18M79k47j3N7p8L1l5j03J42j96J87q2J37j2
5044C5k31K61n7k0j15Q1n8J12l9m4N02m82l0K65n84M41k92M52j55n5J60M8l18
5067a23n0J04p8q5J03O7O9J20RK22k04k98N0K2K9J74j55m8j6K36k26j13K90j04
5091eQ3q9J46j02j28j6Q2oK54k71j9K51k15J44PQ8j70K8l2j11P6j71J04J3K95
5116B36k66M3r5K57k04m1P6o6J51lJ81j27l96L26j24q0j77K99%J56J4p2j7l5J75
5141B11p0j94J79OK31m35oL55k35j06L3R4p0K9J24k1k00J48p6j85L53j28j67O9
5165f1P6M3j81J63j09J39rJ1j23Q7o8P9n4o8J03j30P%j15K25JK78l84j10L03j6
$$ plain form
5191 87 -201 -36 8 57 269 121 -251 102 -64 117 6 -306 36 260 15 121 -73 118 86 77 -46 -126
5213 -126 135 182 -143 58 130 39 44 -356 -91 -25 -170 -21 313 -101 -231 326 22 217 -41 -48 -149 182 108
5236 108 -20 78 -19 64 69 130 -238 60 94 -84 58 74 62 197 -290 -178 -45 -189 -195 11 -249 43 257 -111
5260 -111 112 66 23 -343 -28 173 -116 -131 80 102 -79 123 -96 21 -145 -87 152 -155 60 -179 -60 -128
5282 -128 139 25 19 102 28 71 18 186 -128 94 210 -117 69 -67 -16 -32 84 74 23 -223 -244 17 235 145
5306 145 -216 -7 164 13 -150 308 41 -21 -5 -310 -195 30 -114 -336 -33 173 4 187 -225 -197 -108
5327 -108 84 -4 -22 90 117 -257 -24 -4 59 -11 170 146 232 193 148 -195 -16 -111 -48 -16 91 214 -107 -20 -59
5352 -59 71 71 -105 -90 -14 -108 15 152 147 260 189 80 -119 -111 -196 -51 140 51 -36 196 81 86 -46 -245 1
$$ packed form
5191H7k88J65M4M9K12j48l72L53j66J81j11l12L42K24k45J06j94J91l2rj23q0
5213a26K61M7l25K01P2r1Nm00K65O6j45J49L34m14j30N57l04J95k58pj01L31p4
5236A08j28R8r7Q3NO1l68K98L4j78J42J6j2J35m87J12J33j44oK06k60K92K14l68
5260a11K23m6m3l66L15K01k89j5K11K2j81K02k19J17j66N8K39l07K15k39J19o8
5282a28K67j14oQ3p4M3n3J68l14K22J16l27J86j36N1j6J16j0n1k46k1K61K18r0
5306A45l61K09J71j51j63M58k67o2J6l05J15K25j44k22L03K06j69J83m12K8Q9
5327a08J92q8j8J12K7l74K33K0O3p0J81k4Q6l9m5l43J79r5O3L2J07J23l21Q7l9
5352e9J30%j76J5P6r4J23J37nJ13p1j09j99Qq5J45J91q9q7K32j15Nj32j99K46
$$ plain form
5377 1 -119 148 -88 58 24 148 -150 160 -10 -43 144 138 -1 28 199 -33 -96 -135 81 396 -120 51 84
5400 84 278 -30 77 60 -47 -33 70 91 -237 131 306 -97 192 12 -49 -57 219 -5 236 45 -198 -126 -22
5423 -22 -37 -276 -142 -225 159 -371 227 22 16 146 -10 -47 23 -108 92 10 -46 -1 12 3 -236 -55 20 -108 116
5448 116 -299 -160 -133 -211 207 -55 8 -17 67 -46 291 67 175 122 -263 -239 139 118 -212 113 -22 106 71
5471 71 -102 242 -277 22 291 -336 -146 -374 54 -50 40 11 -205 96 -44 151 -148 -124 105 144 -2 -157
5493 -157 66 152 29 -89 -2 200 43 65 -31 34 214 80 75 -124 77 -158 16 -123 66 226 22 43 -117
5516 -117 29 -92 156 35 108 -212 -139 234 6 -76 73 -7 -60 -116 -5 -97 -128 17 -192 -27 -217 -123 -99
5539 -99 82 184 308 -145 -119 -190 -130 30 95 -33 162 -205 -356 -8 -200 76 153 -117 36 101 119 27 141
$$ packed form
5377Aj20K67k36J46l4J24k98L10j70l3J87oj39K9J71k32o3l9K16L15n16J71L3
5400H4J94l08J07j7j07J4J03K1l28L68J75m03K89j80o1qK76k24K41j91k43P2J04
5423b2j5k39J34q3L84n30N98k05oJ30j56l7P0j31K00q2n6M5J3rk39J81P5j28K24
5448A16m15J39K7p8M18k62O3k5Q4j13L37k24J08n3l85K4L78k1l30L25j35J28l5
5471G1j73L44n19K99K69o27J90k28M28j04R0k9k16L01j40J95k99K4K29L9j46j55
5493a57K23Q6j23j18Q7K02j57K2r6O5J80j34nj99K01k35J74j39J89J60k04K1j60
5516a17J46j21K48j21P3l20P3L73k28q2J49q0n3n6J11r2l1J45k09J65j90R4K4
5539i9J81J02J24m53K6p1O0J60O5j28J95l67j51L48j92K76P7k70J53O5J8r2J14
$$ plain form
5562 141 51 -80 45 91 -113 29 -175 20 25 -34 122 -1 86 -132 107 92 -282 -30 -155 202 94 7 70
5585 70 -87 -27 111 43 -64 -4 -99 126 40 126 -157 -69 -81 105 87 -28 47 -130 79 -342 92 -198 237 -203
5609 -203 -120 265 -263 187 97 -10 -33 38 -315 -5 205 9 6 -463 -46 -23 -45 -25 -119 -192 -210 92 129 191 49
5634 49 -42 146 -95 -122 11 -8 -7 -17 7 34 8 41 -6 -25 41 -189 59 -359 -131 77 -73 116 209 39 187
5659 187 76 148 -178 5 55 -23 124 -188 41 242 -140 10 -30 -371 51 -81 -193 -85 49 -253 -33
5680 -33 -66 -41 -37 157 -170 -3 56 -77 -87 -114 -339 75 -177 -123 191 -70 -35 87 195 58 -29 -240 211 222
5704 222 -162 203 -256 49 84 -154 -68 -4 -6 91 90 -281 -120 0 -64 -110 -230 67 -351 -233 -93 -181 -167 -92
5728 -92 67 44 -11 -304 175 73 248 228 -35 19 92 -369 -16 -79 -149 -156 34 -30 -51 -62 -73 190 -281 -6 -16
$$ packed form
5562A41r0j31J25M6k04J42k04J95Nn9J56j23Q7k18K39j5l74K52j25L57j08q7O3
5585G0j57O0J38o8j07O0r5K25q6Q6k83Q8j2J86j8j15P5j77K09m21M34k90M35m40
5609b03Q3L85n28M50r0j07k3P1l53L10K10j96lm69M17K3k2K0r4p3j8L02L7O2j42
5634D9r1J88k41k7J33j9Jj0K4K7k6L3m7j9O6k30K48m18K28K08j50J89R3j70J48
5659A87j11P2l26J83N0p8J47l12K29K01l82J50m0l41M22j32j12J08J34l02K20
5680c3l3K5MJ94l27J67N9j33j0k7k25M14k52N4L14k61L5J22J08j37q7k11M51J1
5704B22l84L65m59L05L5k38Q6O4kR7jl71J61J20o4m6j20K97m18J18J40q8J4P5
5728i2J59k3n5k93M79j02J75k0k63N4P3m61L53o3p0pJ90o4k1j1j1K63m71K75j0
$$ plain form
5753 -16 310 139 -81 391 -58 -14 37 -5 -12 -36 -18 -35 42 137 156 266 218 172 -333 174 136 83 63 13 10 30 -90
5780 -90 148 29 26 68 -57 -60 -13 -115 -96 -123 -44 -174 7 54 -195 -223 54 -181 -110 79 -61 121 78 68 -1
5805 -1 -13 229 135 38 375 -225 -59 74 -49 188 36 -19 -111 114 -238 -240 223 -167 119 -278 159 48 -35
5828 -35 38 0 -189 30 89 116 -49 113 -76 4 47 -205 92 217 9 28 -16 107 43 62 -9 27 170 72 -101
5853 -101 -180 -16 1 44 357 50 -191 65 -69 48 204 111 -75 26 109 -66 -119 191 13 41 -167 -146 138
5876 138 132 -35 -9 -112 86 -51 44 97 -48 -115 260 19 -168 -110 -28 -38 135 -53 -60 56 23 -145 323 56
5900 56 -222 172 -143 -21 58 -24 34 71 120 -119 100 -27 -67 -114 12 -98 -136 88 152 -159 -23 -109 -76 -121
5924 -121 115 -283 54 277 140 140 -129 -122 123 -207 -291 11 -157 -12 -75 366 258 -210 260 -228 -282 33
$$ packed form
5753a6L26j71k20M72m49M4N1m2pk4J8j7P7R5J9J10m8m6n05N07l8n3k0n0lK0j20
5780i0K38j19lM2j25lM7j02J9k7P9j30J81M7k49k8K77k35P1J89j40J82m3j0o9
5805aj2K42r4r7L37o00J66J33j23K37j52n5r2K25l52kM63l90K86l97M37j11q3
5828c5P3l8j89K19N9K7j65J62j89Q0M3k52K97J25k08J9m4J23o4J9p1L6J43r8j73
5853a01p9J64J7M3L13l07k41K56j34J17J56r3j86J01Q3j75n3L10j78K8k08K1K84
5876A38oj67K6j03J98j37R5N3j45o7L75k41j87N8Q2j0J73j88pJ16l3j68M68k67
5900E6k78L94l15J22P9q2N8L7M9k39K19j27m0m7J26j10l8K24O4l11J36q6L3m5
5924a21K36l98L37K23j37%k69PK45l30q4L02j68J45o3M41j08m68M70m88n4L15
$$ plain form
5946 33 -113 -33 55 -106 -155 -18 -143 95 29 60 -274 -237 52 -71 -110 216 187 43 -184 -60 -50 11 -175 116
5970 116 -213 144 116 136 -54 61 84 -211 58 -88 52 62 -293 81 53 -123 -41 77 -53 131 -47 205
5992 205 -14 -38 -213 -167 -141 318 22 81 6 -149 -17 50 97 -70 233 64 192 -103 125 -59 97 -166
6014 -166 391 -38 -193 223 191 -52 47 -170 -121 -58 -265 -53 -19 -29 -50 32 119 25 8 -201 -79 136 -65 -47
6038 -47 -158 131 364 110 -172 -114 -149 -171 -177 -82 -93 -170 -104 50 -51 49 -110 83 -229 249 -108 -25 183 115
6062 115 -74 85 252 -49 -71 -53 -45 49 -32 179 -52 -26 -118 -54 23 -165 87 25 45 161 139 75 17 44 -10 91
6088 91 10 176 173 -1 33 3 103 -161 92 85 38 -73 55 243 -27 201 281 45 -2 -249 -98 -65 181 80
6112 80 241 -14 8 -149 53 110 90 -182 -114 -24 -4 -54 -94 32 -112 21 -86 -70 121 -124 146 -305 -208 280
$$ packed form
5946C3j46Q0Q8j61m9J37j25K38o6L1l34L7K89j23l9L26k9j44k27J24J0O1j86K91
5970A16l29L57k8K0j90J15K3k95K69j46J40J0l55L74k8j76Q2J18j30J84j78K52
5992B05k19k4j75M6K6M59k96N9p5j55J32O7M7j67L03j69J28k95K28j84J56k63
6014a66N57m29j55M16l2k43R9k17M9O3k07K12L4j0k1Q2Q7r4j7k09J22K15k01J8
6038d7j11K89K33k54k82N8l5k2oR5j1p7O6J54j01J00j59J93l12M78l57Q3K08o8
6062A15j89J59J67l01k2J8QR4q1K11k31K6r2O4P7j88K52o2K0J16k2o4n8K7n4J01
6088I1q1J66lj74L4l0J00k64K53pm7j11J28J88k70K28Q0k36m7k47J51L3K46j01
6112H0J61k55K2j57K02N7k0k72O8R0K0n0m0J26j44J33j07J6J91k45K70m51R7M88
$$ plain form
6136 280 -172 93 23 406 127 -11 -60 -218 -36 -32 -251 -30 -160 21 123 -103 96 -178 -124 -182 103 59
6158 59 88 170 -89 238 -55 -130 -223 -128 94 -217 -189 -117 219 134 158 -173 -141 91 25 111 40 136 47 140 67 -4
6184 -4 -106 -183 -51 -71 230 -342 -9 473 227 32 166 -124 -117 -167 125 -22 101 98 128 291 -169 53 -4 193
6208 193 -253 -114 150 -217 -197 -167 82 -217 -100 -260 151 16 -212 173 67 -105 -75 -66 -264 127 -76 -126
6230 -126 -254 26 -58 35 35 133 232 42 -94 -283 20 35 -189 -59 177 -120 -228 -32 -58 165 -19 5 -50
6253 -50 206 259 -182 -23 -248 148 -146 -118 -111 -6 141 426 23 -8 15 -40 -137 -33 260 297 -17 -61 66 -167
6277 -167 -93 -18 -182 -88 -53 -25 180 -63 273 396 -54 126 -79 -163 -33 -53 229 157 -141 11 101 -136 -96
6300 -96 -125 20 82 97 -42 17 58 -75 45 -42 -17 225 -225 -50 85 -92 -137 36 63 -20 6 -208 -20 213
$$ packed form
6136B80m52K65p0L83k79j38m9j58J82Mk19K21j30J81J02k26J99k74N4n8K85m4
6158E9K9Q2k59L27k93p5r3R5K22l11K8P2L36q5K4l31L2K32o6Q6p1R6q9R3p3p1
6184dj02p7J32k0L01n72L33M82k46j95J34k90Pn0K92j47J23lL0J63m60K22n7J97
6208A93m46J39K64l67K0L0K49k99J17j60M11j35k28L85j06j72L0Rj98L91k03n0
6230a26j28K80q4R3%R8R9j90j36j89L03J5k24J30K36k97j08J96k6K23j84K4n5
6253e0K56N3m41J59k25L96k94K8PJ05J47K85m03l1K3n5r7J04K93L7l14m4J27k33
6277a67P4P5j64R4L5K8K05k43L36J23m50J80k05q4J30k0K82p2k98J52R0k37M0
6300i6k9J45O2J5j39N9M1j33J20q7K5K42m50J75J35j77m5J73K7q3K6k14J88K33
$$ plain form
6324 213 -15 -75 -87 48 -44 231 -298 -286 -23 -46 -143 174 -87 63 -52 -162 25 57 -112 43 -18 -319 166
6347 166 193 -23 15 -55 -330 89 -16 70 79 -166 -139 -118 -101 -217 40 -136 76 34 158 167 -32 -204 37 -156
6371 -156 29 272 83 133 203 -234 14 -247 -14 96 -188 111 -25 70 33 107 110 -36 -126 -60 -11 82 52 134
6395 134 -25 -227 -85 -41 -421 114 -82 -33 146 115 -166 -152 -42 26 -287 -52 82 -99 -88 -87 154 -124 20
6418 20 118 197 -150 -2 40 46 -47 -131 67 -94 -57 19 -163 24 296 405 -210 -86 184 -47 -114 -113 -44 -536 -95
6443 -95 -138 -30 92 -87 157 232 15 -13 -259 70 90 98 -64 59 266 -14 -165 -49 28 45 -68 -158 49
6466 49 140 28 -133 24 -242 -189 67 -24 116 68 -229 -65 273 -122 -214 62 -131 -125 128 95 -398 140 -414
6489 -414 50 -95 -423 -132 143 -307 20 154 -130 104 246 115 -27 48 -39 -3 79 26 -70 -62 -133 142 -165
$$ packed form
6324B13k28o0j2J35r2K75n29J2K63k3r7L17k61J50j15j10J87L2j69J55o1l01M85
6347A66K7k16L8p0k75M19j05Q6Rk45K7K1J7j16K57j76K12m2J24Rj99j72K41j93
6371a56J85K43j89N0P0m37K48k61K33J10k84K99j36R5l7P4Lj46r0O6M9R3l0Q2
6395A34j59k02J42M4l80N35j96M9J79l1k81J4J10O8l13K35J34j81J1JK41k78J44
6418B0R8P9l47J48M2Or3q4J98j61L7P6j82J87K72J09o15J24K70k31o7JO9m92M41
6443i5m3J08J22j79K44P5k17k8k46L29K0Qj62J23K07k80j51J16P7J7j13r0K07
6466D9R1j12j61J57k66N3K56r1J40m8k97J64L38l95r2K76j93OK53l3m93N38n54
6489d14M64j45l28K91K75m50L27J34k84K34J42j31j42P5q7L6Q2n3r6Qp1K75l07
$$ plain form
6512 -165 163 130 -34 -6 66 -16 -282 255 -32 -3 98 -19 3 -35 -28 -70 -10 62 71 -220 -140 6 87 180 -69 135
6538 135 42 -342 209 -102 102 -63 170 -21 83 -100 -79 177 12 -70 117 -185 -64 10 -180 -18 245
6559 245 13 54 -214 -144 -616 20 -129 -63 59 211 122 -19 -173 -133 -73 177 8 -219 190 50 76 30 -198
6582 -198 -69 9 -178 8 -41 -47 -79 10 88 -15 -224 -92 -130 25 121 -86 -40 145 185 -209 51 -95 -37 188
6606 188 200 0 96 -36 160 137 -58 183 261 -258 -7 199 26 -48 92 142 -97 95 -174 -81 343 -43
6628 -43 4 -2 327 -29 -7 -89 -120 -25 185 269 168 240 155 16 3 76 254 125 -125 91 -27 237 -93 -95 1
6653 1 -101 74 -13 127 241 -19 177 -143 -162 -103 -82 -67 -9 -98 -64 -47 137 349 -110 -1 171 -153 8 -161
6677 -161 -77 69 117 128 -173 -79 -189 -97 -243 -21 268 40 62 -61 50 200 -71 -157 104 171 61 -180 -43
$$ packed form
6512a65L28l3j64K8P2q2k66N37k87K9J01j17K2l8Pm2O0P2Rk91Q0J46Q1R3k49K04
6538A35r3l84N51l11K04j65K33j91J04j83K1K56j65q2J87l02J21P4j90J62K63
6559B45k32M1k68P0m72O36j49O6J22J52q9j41j54M0O0K50j69k27M09j40K6m6k28
6582a98J29P8j87J86m9ol2Q9P8j03k09J32l8J55R6k07M6J85M0l94K60j46N8K25
6606A88J2k00R6j32J96k3j95K41P8n19K51K06j73p4J40N0k39J92k69R3M24l86
6628d3M7oL29l56K2q2l1R5K10Q4j01P2q5j39j3P3J78j29k50K16j18K64l30kR6
6653Aj02J75q7J40J14k60J96l20j9N9K1J5N8q9L4J7J84K12m59J09J72l24J61j69
6677a61Q4J46M8J1l01R4j10R2j46K22K89k28K2j23J11J50k71q6K61O7j10k41J37
$$ plain form
6700 -43 -124 142 -10 -116 166 -118 -40 -101 -11 -28 -17 -177 -352 151 295 47 22 -181 -167 -268 70 126 29 -34
6724 -34 124 -22 37 153 -106 5 39 86 -146 -49 4 16 -164 241 -50 145 242 -88 -7 -83 -163 343 60 120
6748 120 -30 -73 29 5 -265 105 -41 246 27 -9 -23 -67 140 -6 -30 -63 -20 -107 -200 -28 143 -93 145
6771 145 111 278 -86 250 29 -212 -1 196 68 58 44 -3 -47 -23 -190 -99 -73 155 153 177 -53 -55 -55 -19 -128
6796 -128 -85 -190 20 -102 130 103 -87 106 -25 -79 85 241 -26 282 53 -121 -1 162 -69 95 -24
6817 -24 178 60 151 78 40 -45 -149 -253 71 193 127 -178 131 -157 1 138 24 -148 -279 -67 89 90 236
6840 236 223 -1 139 222 -95 -20 -96 46 -61 -37 -302 -173 -209 -206 141 -198 -125 -113 -9 -201 -187 162 33 94
6864 94 5 147 55 -16 -450 -35 -7 -2 242 -69 -3 70 -75 66 -113 126 -51 99 28 116 -19 -48 -329 -63
$$ packed form
6700d3q1K66j52j06K82k84P8o1R0j7J1j60j75N03J44k48k5k03J4j01L38N6r7o3
6724c4J58j46N9J16k59J11L4M7k32R7N3J2j80M05k91J95R7l30Q1p6q0N06k83O0
6748A20j50m3J02k4k70L70j46K87k19l6j4m4K07j46k4l3M3q7r3J72J71k36K38
6771A45l4J67l64L36k21k41K11J97j28j0j4m7m4K4j67R1K6K28kK4k30k%L6j09
6796a28M3j05K10j22K32k7j90J93j31n4J64J56k67L08k29j74J20J63k31J64j19
6817b4K02j18R1p3l8q5j04j04L24J22o6l05L09k88J58J37j14j72j31K12J56JJ46
6840B36j3k24J40Q3l17P5p6J42j07K4k65J29l6LL47l39P3J2J04j92J4L49j29O1
6864I4q9J42r2p1m34M15K8NK44l11O6P3j45J41j79K39j77J50p1Q8j35k9k81K66
$$ plain form
6888 -63 -376 14 -21 -122 117 -40 43 24 -198 -122 120 -137 -107 -28 -275 63 115 72 26 -195 69 -15 -237 99
6912 99 82 225 114 -41 192 -168 -276 95 10 244 35 220 -91 121 69 -89 -68 -284 56 -165 151 8
6934 8 110 -1 -34 332 95 -275 -65 83 -59 2 -151 86 -42 -236 -115 71 38 147 231 28 70 184
6956 184 55 55 -26 57 2 -185 68 71 -265 -203 -214 -39 -165 -36 216 46 128 -22 -196 131 -9 8 -77 -15
6980 -15 41 -263 11 -102 87 -199 137 -5 -179 -118 164 14 -36 145 237 24 -94 20 -35 -65 -8 -52 93
7003 93 0 169 -165 -61 -144 -42 -113 -199 135 102 -85 317 5 -32 20 116 3 -4 32 -71 -82 -157 -90 1 -247
7028 -247 -51 -111 -40 -76 -102 -15 -154 143 -119 -224 -68 87 -302 182 62 14 226 206 141 12 84 -43 -40 4
7052 4 -39 -237 107 -206 45 -27 -45 -43 -5 -305 254 210 -186 269 -59 241 11 125 25 70 -153 39 29 -121
$$ packed form
6888f3l13L90l5j01K39j57Q3j9k22P6K42k57L0P9k47L38N2m3m6k21K64q4k22L36
6912I9j7J43j11j55K33l60j08L71q5K34k09J85l11K12n2j58K1k16L40k21L16j43
6934HJ02j11l3L66k37l70K10J48j42O1j53K37j28j94J21J86l3J09Q4k03M2J14
6956A84j29%q1Q3n5j87K53Ll36O2j1J75j26J29K52j70Q2j50j74L27j40J7q5O2
6980a5N6l04K74j13J89k86L36j42j74O1K82j50n0J81R2k13j18J14n5l0N7m4J45
7003I3r3J69l34J04q3J02p1q6L34l3j87M02l12l7N2R6j13pL6j03j1p5O7R1k48
7028b47J96o0P1l6k6Q7j39K97k62j05J56J55l89M84j20m8K12k0o5j29P2j27LM4
7052Dm3j98L44l13K51p2j8KL8l00N59m4l96M55l28L00k30J14j00M5k23J92j0j50
$$ plain form
7076 -121 25 -141 -124 -343 50 213 -58 218 210 170 -120 -126 -76 -6 -132 21 81 138 -104 -80 348 -135 181 66
7100 66 -28 121 -26 84 21 232 101 222 74 -157 -64 32 -22 -65 84 122 -195 -10 90 -194 119 32 -185
7123 -185 -4 171 86 -131 275 -43 -153 -34 31 -80 195 -202 -143 0 -219 29 31 5 -147 268 225 -143
7145 -143 90 163 -43 -3 -319 -287 -297 -203 177 215 42 59 189 -18 -306 155 111 84 33 229 45 30 116 -183
7169 -183 68 60 115 -157 -69 -25 108 -177 60 161 -50 -168 19 54 -40 -60 267 -103 -29 119 -185 -30 33
7192 33 16 -284 82 -221 147 4 129 51 -74 -123 -52 74 110 101 -141 53 -42 -194 145 101 -66 -127 -279 3
7216 3 -58 -29 246 -76 78 -82 -306 161 149 60 168 16 -77 65 98 -58 -2 -88 174 -112 -140 -175 -28 -50
7240 -50 15 230 2 185 69 -239 -22 88 -247 359 -136 -2 92 -359 71 3 88 163 -229 -230 -60 106 143
$$ packed form
7076a21J46j66J7k19L93J63k71K76qm0k90oN0P0j26J53O0N7k42K4M28m83L16j15
7100F6r4J49j47J10o3K11j31J21j48k31R3R6n4m3J49L8l17J85J00k84L13q7k17
7123a85J81J75q5k17M06l18j10J19O5j11K75l97N9J43k19K48Kk6j52M15m3l68
7145a43K33P3k06M0l16L2j0R4L80L8j73J7J30k07k88M61m4k7n1J96j84j5Q6k99
7169a83K51qN5k72Q8M4J33k85K37J01k11j18J87L5r4k0L27l70P4J48l04J55O3
7192C3j7l00L66l03L68j43J25p8j25m9P1J26L6rk42J94r5j52L39m4j67o1j52K82
7216Co1K9K75l22J54j60k24M67j2q9J08j52r3J42L3j56N6q6K62k86k8l5J47k2
7240e0O5K15k28J83j16l08K17J10l35O06m95J34R4m51M30o8Q5P5l92jJ70J66L7
$$ plain form
7263 143 61 -298 145 274 -76 62 75 -225 -141 70 -27 28 151 152 11 97 -63 -169 -85 92 76 17 -91 55
7287 55 139 -175 125 17 -74 -201 -76 63 -18 -289 182 176 -122 -326 -34 -42 -134 -338 -11 11 -4 107 119 -181
7311 -181 -141 -379 18 -37 -57 -69 -145 74 164 -64 -134 -82 245 48 -103 219 -123 -34 52 185 21 -43 -141 -24
7335 -24 300 -60 192 124 -21 -70 -188 -105 -182 42 27 -21 101 -201 -101 116 92 -98 -2 331 -192 56 22
7358 22 -140 12 -93 -132 -71 -206 2 -118 -139 50 120 -16 -113 40 -66 -85 -45 -293 24 214 80 20 -118
7381 -118 314 -61 63 -24 -233 -139 15 -71 209 17 11 186 110 -26 -24 105 -366 204 -36 136 37 -254 149
7404 149 -36 -85 -206 -36 140 10 147 -112 15 77 -199 27 -55 -149 72 -285 -110 43 -204 -60 -46 -13
7426 -13 173 -149 -94 30 150 70 22 23 -221 33 -245 -9 -91 -226 148 21 -300 351 -41 97 -56 125
$$ packed form
7263A43q2l59M43J29l50J38J3l00Q4K11r7N5J23Jj41Q6j60j06Q4J77j6n9j08J46
7287E5Q4l14L00j08r1j27J25J39q1k71M71ok98k04K92qr2k04L27K2j5J11J2l00
7311a81M0k38L97n5k0j2p6K19R0k28p0N2L27j97j51L22l42Q9Q6J33j64o4r8J17
7335b4L24l60K52o8j45m9j18Q3p7K24j5m8J22l02J00K17k4j90R6L33n23K48l4
7358B2j62J52j05l9O1j35K08j20k1J89P0j36r7J53j06j9M0k48L17J90j34o0j38
7381a18M32l75J24q7k09R4J54q6K80j92oJ75p6j36KJ29m71N70k40J72r9k91M03
7404A49j85m9j21J70J76j30J37k59J27O2k76K26q2r4K21l57J75J53k47J44J4L3
7426a3J86l22N5J24J20q0m8Jk44K54k78K36q2j35L74j27l21O51l92J38j53J81
$$ plain form
7448 125 76 -184 -62 -45 -87 257 -47 -133 209 -55 256 -13 110 -32 -185 -160 221 -34 -20 -140 -76 17 -70
7471 -70 180 -72 86 82 -95 -4 -37 176 81 -110 -81 176 81 45 -1 23 -170 111 176 135 82 -79 27 158 189
7496 189 64 -107 -276 -267 -262 167 -25 -140 178 115 -6 124 -10 -269 130 315 -147 83 -69 108 165 -37
7518 -37 12 38 -239 150 131 -3 -113 53 -221 -112 -3 -44 161 -74 -244 -160 -124 284 219 -186 -4 30 -199
7541 -199 185 -45 -3 2 88 -143 -211 38 152 -200 69 147 177 -99 -119 -85 216 87 108 340 -113 -159 -40 -2
7565 -2 108 -76 -119 -71 96 121 235 82 -30 -93 -216 103 138 94 -16 -59 195 48 -268 93 -50 -7 -300
7588 -300 142 -76 -271 -262 112 57 -152 347 55 -79 -18 -197 134 9 25 96 165 -177 -13 248 -202 33
7610 33 201 -219 116 105 23 -395 -60 122 -29 -8 194 -63 169 -116 31 -28 44 -34 178 80 62 151 58 37
$$ packed form
7448A25m9k60J22J7m2L44l04q6L42k64L11k69J23j42j53K5L81k55J4j20O4R3q7
7471g0K50k52J58mj77R1l3K13r5j91K9K57r5l6m6K4j93K81O5m1n3j61J06J31L1
7496A89j25j71j69RNM29j92j15L18o3j21J30j34k59L99J85m62K30j52J77N7k02
7518c7M9K6k77L89j9j34j10J66k74J09J09m1K05k35j70Q4L6M08o5m05J82L4k29
7541a99L84k30M2NQ6k31o8K49J14l52K69P8L0k76k0L4L01j29K1K32m53m6J19L8
7565bJ10j84m3M8J67K5J14j53j12o3j23L19L5m4j10m3K54j47l16L61j43M3k93
7588c00M42k18j95RL74n5k09M99k92j34O1j79L31j25J6P1O9l42J64K61m50K35
7610C3J68m20L35j1q2m18L35J82j51K1K02k57K32k85J47n9P2p8K12r8j8Q9r3k1
$$ plain form
7634 37 -16 -76 120 -57 62 -29 -34 7 30 -33 -26 146 -131 -60 37 104 139 148 316 -106 -54 -212 76 4 -143 9
7660 9 134 150 -90 18 -174 105 -184 54 70 -205 -112 -234 -196 62 -146 17 216 152 -105 -70 203 -2 129
7683 129 123 -182 -42 -210 93 -189 -80 -17 29 -53 -21 80 167 196 214 71 -180 108 56 -198 212 -188 0
7706 0 47 188 -30 -138 -2 11 39 -120 -12 -95 160 101 -86 80 -82 288 -8 -178 46 -28 -58 29 -270
7729 -270 256 -98 -190 28 -208 1 69 -50 191 -176 212 -18 -23 147 -82 5 -290 26 -84 212 95 39
7751 39 150 -176 -87 16 -70 88 126 87 68 137 223 -83 3 127 -32 -65 21 19 -34 -152 -25 -14 158 -259 55
7776 55 -178 32 -56 45 24 35 -103 -19 249 27 -7 36 -134 -103 -358 -73 -207 18 111 -95 126 138 233 187
7800 187 46 67 122 -32 303 -79 280 -11 -84 36 -72 -258 -110 -207 -51 -63 39 -215 46 81 5 17 -44
$$ packed form
7634C7n3o0J96j77J19r1nM1K3o3PJ72k77P1R7O7L5RJ68m22N2j58K88p2j47J52
7660IJ25J6k40J08j92K79k89K38J6k75R3j22L8K58k08J63J99o4k57L5K73k05J31
7683A29ol05J40j68L03k82J09O3M6q2L2J01Q7K9J8j43k51K88n2k54M10m00J88
7706@M7J41k18j08J36J3K8j59J08q3K55n9j87J66j62L70k96j70K24p4l0Q7k99
7729b70N26l54r2K18k36K09O8j19K41l67L88k30nJ70k29Q7k95L16j10K96j17n6
7751C9J11l26Q9J03q6J58L8l9j9O9Q6l06Q6J24j59l3Q6kn3j18J27J1J72m17L14
7776E5k33K10q8J01k1J1j38Q4K68k22l4M3j70L1k55K85j34K25R3k06K21J2R5m6
7800A87j41K1N5j54L35l82L59k91p3J20j08j86J48r7J56j2J02k54K61L5p6J2o1
$$ plain form
7823 -44 113 159 32 -90 249 145 -247 -115 88 -122 -254 -72 19 143 -8 29 -28 43 77 -113 130 125 193
7846 193 -83 66 25 -188 30 22 -32 47 -130 -236 -216 -92 -26 117 118 -33 -181 136 -40 -152 76 194 67
7869 67 155 -136 -106 -36 158 -63 32 82 -238 -34 -14 -234 301 122 -161 -38 -20 238 -158 -201 120 86 119 42
7893 42 -117 -111 62 188 -3 82 -125 -41 -150 58 222 67 -261 -72 181 -43 156 -83 -85 -46 -37 -4 -152 -54
7917 -54 52 -8 76 -70 -9 240 62 -45 -312 -197 172 71 26 257 -22 -236 -109 29 28 126 93 -99 144
7940 144 -162 -55 47 19 -71 -348 -269 97 180 12 -141 -219 243 131 61 79 -234 -9 34 -100 11 10 -15 -113
7964 -113 -38 -173 42 207 -14 51 -6 -54 96 -212 -117 219 91 -92 107 12 97 44 -34 119 -148 -221 -70
7987 -70 -70 -197 36 67 -269 -174 -116 253 128 208 76 -217 -28 10 52 340 -178 -51 43 -85 37 -226 83
$$ packed form
7823d4J57M6j27j22L39j04l92J32K03k10j32J82R1J24j51L7n7P1L4j90K43nO8
7846A93k76J49m1k13K18qn4P9j77j06K0J24O6J43Jj51j48L17j76j12K28J18j27
7869F7Q8k91L0P0J94k21R5N0l20K04K0k20N35j79k83J23J8K58l96m3L21l4L3p7
7893D2j59OJ73J26j91Q5k07Q4j09K08J64j55l28J89K53k24J99k39kL9RL3j48R8
7917e4J06o0Q4j46O1K49j78j07k67J15L69j01m5K31k79k14J27J38jR8l3j92K43
7940A44l06J07J02k8r0k77P9L66Q3j68j53p8M62j12p0J8l13K25M3j34J11jk5r8
7964a13P5j35K15J65k21O5n7m8J50l08R5L36j28j83J99r5Q5n3p8J53k67p3J51
7987g0%j27K33L1l36R5N8L69j25Q0j32k93J89L8M2K88n18J27R4j28J22k63L09
$$ plain form
8010 83 -27 -112 90 311 220 -69 -200 -188 -29 -125 55 119 60 -131 144 -257 101 -12 -87 -144 -39 -47 -206 23
8034 23 -299 -210 -93 -181 247 119 4 148 -152 225 -146 65 93 79 -38 75 -84 61 117 -100 -120 -121 18
8057 18 248 -87 -115 -25 -141 93 -417 42 -137 -69 -223 -84 42 215 -70 -71 -81 194 76 -216 -29 54 231
8080 231 97 -114 40 -207 -98 20 -56 -154 -368 -20 -57 -236 154 -39 74 -125 -32 49 -26 -1 -11 71 -261
8103 -261 -52 -226 264 -27 -49 232 -49 -30 238 -273 -130 147 -18 63 186 -17 112 -211 85 -218 -48
8124 -48 -165 65 362 130 88 -128 -226 27 45 -227 38 -60 -249 183 237 -148 64 -50 16 55 -34 -17 42 106
8148 106 -262 240 112 11 -371 55 -116 -216 70 69 -32 60 -93 -137 95 -211 7 42 90 -19 -22 262 -4
8171 -4 226 -210 -75 84 48 5 -27 76 -64 -43 -44 174 -88 -164 -23 173 -13 -94 96 -84
$$ packed form
8010H3j10q5K02K21r1k89j31J2J59r6J80O4n9j91K75m01L58j13p5n7J05qj59K29
8034B3l22Q9J17q8M28j28j15J44l00L77l71K11K8j4j17J13j59J45N6k17k0jJ39
8057A8K30l35k8R0j16K34n10M59j79O8j54J39J26J73k85jj0K75j18k92J87Q3J77
8080B31j34k11J54k47J09J18p6r8k14L48l7j79L90j93J13j99R3Q1p5K5j0Q2l32
8103b61K09j74M90k91k2K81k81J9K68n11J43K77j65Q1J23k03J29l23K96l03J70
8124d8j17K30K97k32m2k16r8K53J8k72K65r8j89M32N4l85K12j14O6L9q9J7N9O4
8148A06l68N02j28j01l82M26j71j00K86jj01R2j53m4K32l06K18L5M8j09lK84k66
8171dK30m36J35J59l6m3l2J03j40K1jK18k62p6J41J96j86q1J90j80
8191h4
$$ Imaginary data points
##PAGE= N=2
##DATA TABLE= (X++(I..I)), XYDATA
$$ plain form
0 0 0 0 0 0 0 0 0 0 0 0 0 -3 8 -8 8 -8 15 -16 16 -24 25 -32 40 -47 56 -64 73 -82 97 -112 128 -146 164 -187
34 -187 210 -238 266 -299 334 -374 415 -462 512 -566 628 -694 766 -844 929 -1025 1128 -1244
52 -1244 1370 -1513 1669 -1850 2053 -2287 2559 -2877 3261 -3733 4327 -5103 6159 -7695 10155
67 10155 -14707 26082 -122079 -137089 13868 -78062 -21028 93828 84616 -512 36566 49987
79 49987 31603 57277 85132 30165 21468 40165 -16239 -93216 -81554 -81925 -118990 -102829 -30885
92 -30885 11262 55421 111690 127560 90518 46960 7062 -19928 -37975 -46779 -18292 29387
104 29387 6497 -53787 -41535 -20296 -77601 -86964 7824 49913 21722 61669 111283 62658
116 62658 21091 35028 -8676 -73579 -53322 -36133 -67970 -29622 45116 24052 -9750 29241
$$ packed form
0@%%%%%%%%%%%lJ1j6J6j6K3l1L2m0M9n7P2q7J03j20J37j55J79k09K40k74L10l51
34a87L97m48N04n65O33p08P89q77R74j078J194j322J460j610J773j954K153k372
52a244K614k883L182l519L903m340M846n436O138o994Q060r430J1262j3854J7850
67A0155k4862M0789j48161j5010J50957r1930N7034J14856r212q5128L7078J3421
79D9987j8384K5674K7855n4967q697J8697n6404p6977J1662l71l7065J6161P1944
92c0885M2147M4159N6269J5870l7042m3558l9898k6990j8047q804K8487M7679
104B9387k2890o0284J2252K1239n7305r363R4788M2089k8191L9947M9614m8625
116F2658m1567J3937m3704o4903K0257J7189l1837L8348P4738k1064l3802L8991
$$ plain form
128 29241 17899 -56555 -41075 30178 25292 13493 65644 72619 5042 -29942 -27470 -49086 -61033
141 -61033 -31973 -3493 11076 27678 33263 25244 16687 1287 -17414 -22024 -21490 -16491 8407
154 8407 29090 25752 26411 24192 -14831 -45721 -31301 -24909 -30445 10638 54565 31701 9733
167 9733 26082 -176 -53930 -37147 1797 -13584 -11204 40067 43802 5906 11037 18264 -24196
180 -24196 -43504 -15403 -12686 -21833 13300 41489 20878 7095 12724 -10147 -40175 -29400 -4770
193 -4770 1762 14491 37329 38012 13134 -7183 -17323 -28108 -36045 -24171 2814 15500 16114
206 16114 25299 28145 3254 -16954 -11968 -15748 -28015 -8319 22714 19231 13117 28572 16093
219 16093 -24717 -29316 -13841 -25506 -24047 17250 34779 15727 17434 24197 -7804 -34355 -18707
$$ packed form
128B9241j1342p4454J5480P1253m886j1799N2151O975o7577l4984K472k1616j1947
141f1033K9060K8480J4569J6602N585q019q557j5400j8701m610N34M999K4898
154H407K0683l338O59k219l9023l0890J4420O392n536M1083M3927k2864k1968
167I733J6349k6258n3754J6783L8944j5381K380N1271L735l7896N131P227m2460
180b4196j9308K8101K717r147L5133K8189k0611j3783N629k2871l0028J0775K4630
193d770O532J2729K2838O83k4878k0317j0140j0785p937J1874K6985J2686O14
206A6114R185K846k4891k0208M986l780j2267J9696L1033l483o114J5455j2479
219A6093m0810m599J5475j1665J459M1297J7529j9052J707O763l2001k6551J5648
$$ plain form
232 -18707 -9906 -18965 1516 31771 24418 8551 14045 3924 -26271 -30606 -12932 -10716 -8192
245 -8192 17239 32760 18229 6217 5822 -9289 -29987 -24274 -3013 2314 6777 25844 30202
258 30202 7233 -8332 -9000 -20416 -33246 -16733 7817 10443 14031 29466 22851 -3527 -11602
271 -11602 -9577 -21878 -23431 1716 15447 9796 16532 23584 1632 -21346 -16578 -13678 -22993 -9575
285 -9575 19393 23723 14776 20091 16469 -9940 -24520 -15868 -14769 -16534 2190 22111 17381 8597
299 8597 10763 663 -20964 -22806 -8623 -4809 -809 18496 28474 15056 4374 1688 -13167
312 -13167 -28734 -20775 -5890 -2643 5939 23561 22560 5045 -1044 -2632 -17097 -23292 -6103
325 -6103 7847 6218 13462 24558 12174 -9046 -12512 -13050 -23393 -19725 2170 13938 12171 18859
$$ packed form
232a8707Q801r059K0481L0255p353j5867N494j0121l0195m335J7674K216K524
245h192K5431J5521j4531j2012l95j5111k0698N713K1261N327M463J9067M358
258C0202k2969j5565o68j1416j2830J6513K4550K626L588J5435o615k6378q075
271a1602K025j2301j553K5147J3731n651O736P052k1952k2978M768K900r315J3418
285i575K8968M330q947N315l622k6409j4580Q652J099j765J8724J9921m730q784
299H597K166j0100k1627j842J4183L814M000J9305R978j3418j0682k686j4855
312a3167j5567P959J4885L247Q582J7622j001j7515o089j588j4465o195J7189
325f103J3950j629P244J1096j2384k1220l466n38j0343L668K1895J1768j767O688
$$ plain form
339 18859 21767 3961 -11864 -11225 -12590 -17665 -5868 12798 13639 9731 13338 6614 -13519 -20127
353 -20127 -12513 -11687 -9799 8411 23600 18113 11998 11928 120 -18636 -20441 -10385 -9080 -4475
367 -4475 12846 20071 8710 1797 2352 -9500 -21541 -12434 1973 2932 8598 22652 19419 1874
381 1874 -3672 -6726 -21144 -23607 -6697 2234 1894 14478 23821 9799 -4306 -2525 -7950 -19516
395 -19516 -11797 6411 9179 8152 15429 12167 -5317 -13457 -11895 -15084 -15101 -294 13332 14139 13480
410 13480 15806 7921 -7840 -14667 -11294 -11752 -10703 2276 14694 12034 6886 7690 -970 -16204
424 -16204 -15664 -5214 -4009 856 17752 20718 6561 1955 842 -14832 -23899 -9312 -1163 -4662
438 -4662 7524 22085 12206 98 4411 -688 -17385 -14131 -437 -444 837 14687 15965 2653
$$ packed form
339A8859K908j7806j5825O39j365n075J1797J8666Q41l908L607o724k0133o608
353b0127P614Q26J888J8210J5189n487o115p0j1808j8756j805J0056J305M605
367d475J7321P225j1361o913N55j1852j2041R107J4407R59N666J4054l233j7545
381A874n546l054j4418k463J6910Q931l40J2584R343j4022j4105J781n425j1566
395a9516P719J8208K768j027P277l262j7484q140J562l189j7J4807J3626Q07o59
410A3480K326p885j5761o827L373m58J049J2979J2418k660n148Q04q660j5234
424a6204N40J0450J205M865J6896K966j4157m606j113j5674r067J4587Q149l499
438d662J2186J4561r879j2108M313n099j6697L254J3694pJ281J3850J278j3312
$$ plain form
452 2653 -3307 -5272 -15220 -18079 -6774 3173 8776 15706 17580 9096 -858 -8514 -13032 -13822 -9579
467 -9579 -1437 7009 9739 7531 8348 4818 -7830 -11884 -5196 -6187 -8802 5789 17652 9924 5756
482 5756 10731 -1359 -20089 -15228 -6365 -9781 -1042 18044 16267 4475 5705 909 -16194 -14836
496 -14836 -1710 -2265 -962 13835 15132 2022 1306 3738 -8741 -15960 -7882 -3752 -4449 4320 13709
511 13709 12529 8258 2540 -5982 -11895 -12254 -8975 720 11478 12854 10605 8897 -1830 -15237
525 -15237 -13141 -7756 -9564 -1269 12648 10609 4133 9976 6041 -8401 -7430 -895 -9557 -9866 7955
540 7955 10387 1210 8072 11650 -7884 -17539 -7548 -8271 -10861 6800 20188 12236 7739 9535 -3657
555 -3657 -16345 -10919 -5253 -5863 2020 10514 6773 2351 3303 -1956 -7566 -6095 -4493 -3917 1991 7381
$$ packed form
452B653n960j965r948k859J1305R947N603O930J874q484r954p656m518p90M243
467i579Q142Q446K730k208Q17l530j2648m054O688r91k615J4591J1863p728m168
482E756M975j2090j8730M861Q863l416Q739J9086j777j1792J230m796j7103J358
496a4836J3126n55J303J4797J297j3110p16K432j2479p219Q078M130o97Q769R389
511A3709j180m271n718q522n913l59L279R695J0758J376k249j708j0727j3407
525a5237K096N385j808Q295J3917k039o476N843l935j4442R71O535q662l09J7821
540G955K432r177O862L578j9534r655R991p23k590J7661J3388p952m497J796j3192
555c657j2688N426N666o10P883Q494l741m422R52n259n610J471J602N76N908N390
$$ plain form
571 7381 9066 11806 8422 -1956 -7266 -9713 -16430 -12882 2393 8206 7072 13665 12473 -4613
585 -4613 -10394 -3500 -7577 -9539 6524 13010 2812 3861 9516 -3196 -13118 -4310 -4036 -12594 -3421
600 -3421 9578 5681 5629 15001 7867 -6869 -7158 -6294 -13196 -8044 6781 9837 6718 8288 4035
615 4035 -7436 -11137 -8278 -6376 -1007 6671 9149 9100 7506 1414 -3965 -4972 -8305 -9588 -2996
630 -2996 1230 1096 7599 12450 4138 -2411 -705 -6850 -13857 -4890 5544 3822 7179 14355 5561
645 5561 -7196 -6114 -6059 -13226 -6706 6906 6594 4094 10604 8187 -4130 -5625 -2059 -7959 -8696
660 -8696 1113 5163 2778 6916 9261 1329 -4899 -5929 -8177 -8670 -2037 4464 8248 9984 7184
675 7184 1384 -3593 -8315 -10564 -6382 -333 2234 6467 9761 5490 -6 -1319 -4157 -9860 -5950
$$ packed form
571G381J685K740l384j0378n310k447o717L548J5275N813j134O593j192j7086
585d613n781O894m077j962J6063O486j0198J049N655j2712r922Q808K74q558R173
600c421J2999l897n2R372p134j4736k89Q64o902N152J4825L056l119J570m253
615D035j1471l701K859J902N369P678K478m9j594o092n379j007l333j283O592
630b996M226j34O503M851q312o549J706o145p007Q967J0434j722L357P176q794
645E561j2757J082N5p167O520J3612l12k500O510k417j2317j495L566n900p37
660h696R809M050k385M138K345p932o228j030k248m93O633O501L784J736k800
675G184n800m977m722k249M182O049K567M233L294m271n496j313k838n703L910
$$ plain form
690 -5950 727 -104 2293 10335 8561 -531 -984 -1514 -10194 -10983 -1401 2320 2032 8696 11314 2537
706 2537 -3362 -2939 -6982 -10264 -3706 3429 3802 5834 8570 4273 -1976 -4101 -5688 -7822 -5076 950
722 950 4495 5573 6910 6436 1330 -4760 -6641 -6285 -5491 -3160 3461 8363 6664 3882 3020 -1763
738 -1763 -8444 -7793 -3075 -1798 1210 7933 8595 3536 1721 -309 -6605 -9147 -4054 -1180 -319 4820
754 4820 9374 4949 871 404 -3556 -9212 -6521 -648 708 2710 8439 7739 1294 -2157 -3087 -6722
770 -6722 -8301 -2833 2491 3649 5452 7259 4542 -1226 -4464 -4856 -6417 -4678 440 4612 5136 5580
786 5580 5316 424 -5242 -5623 -5060 -5207 -1782 4479 6603 4902 4674 3036 -3342 -7079 -5051 -3417
802 -3417 -3238 1990 7423 5928 2917 2335 -1136 -6539 -7044 -3503 -1436 545 5625 7509 4191 1026
$$ packed form
690e950O677q31K397Q042j774r092m53n30q680p89R582L721k88O664K618q777
706B537n899M23m043l282O558P135L73K032K736m297o249k125j587k134K746O026
722I50L545J078J337m74n106o090j881L56P94K331O621M902j699k782q62m783
738a763o681O51M718J277L008O723O62n059j815k030o296k542N093K874Q61N139
754D820M554m425m078m67l960n656K691N873J356K002N729p00o445l451r30l635
770f722j579N468N324J158J803J807k717n768l238l92j561J739N118M172N24M44
786E580k64m892n666l81N63j47L425O261K124j701k28j638o378l737K028J634
802c417J79N228N433j495l011n82l471n403n05L541K067J981N080J884l318l165
$$ plain form
818 1026 -329 -4090 -7413 -5136 -844 1095 3077 6498 5916 1471 -1277 -3043 -5930 -6443 -2009 1992
834 1992 3188 5107 6570 3128 -1653 -3339 -4249 -6394 -4391 1250 4260 4067 4930 4776 205 -4719
850 -4719 -4743 -4266 -4569 -1038 4164 5597 4124 3929 1828 -3423 -6049 -4701 -3746 -2032 2654 5844 4677
867 4677 2891 2093 -1885 -5812 -5341 -2983 -1515 903 5425 6201 3402 1202 -461 -4230 -6754 -4693
883 -4693 -679 1175 2994 5668 5269 1422 -1356 -2944 -4935 -5194 -1898 1763 2829 4003 5396 2788
899 2788 -2108 -3574 -3920 -5657 -3731 1514 3800 3596 5076 4566 -852 -4197 -3149 -4035 -4926 -284
915 -284 4722 3816 2787 3845 1019 -3699 -4339 -3175 -3199 -1386 2992 4700 4033 3305 1582 -2046 -4545
932 -4545 -4452 -3825 -1855 1497 4351 5070 3509 1370 -1109 -3592 -5144 -3567 -106 1410 2906 4951
$$ packed form
818A026j355l761l323K277M292J939J982L421n82m445k748j766k887n13M434M001
834A992J196J919J463l442m781j686r10k145K003N641L010j93Q63j54m571m924
850d719k4M77l03L531N202J433j473j95k101n251k626J348R55J714M686L190j167
867D677j786p98l978l927M71K358J468K418M522P76k799k200j663l769k524K061
883d693M014J854J819K674l99l847k778j588j991k59L296L661J066J174J393k608
899B788m896j466l46j737J926N245K286k04J480n10n418l345J048q86q91M642
915b84N006r06j029J058k826m718o40J164k4J813M378J708o67p28j723l628k499
932d545R3O27J970L352K854P19j561k139k479k483j552J577L461J516J496K045
$$ plain form
948 4951 4406 -90 -1763 -1920 -4423 -5462 -838 1958 1519 3661 6121 2543 -1677 -1588 -3072 -6027
964 -6027 -3308 1942 2312 3018 5598 3474 -2113 -2863 -2985 -5111 -2903 2378 3424 2672 4079 3105 -1084
981 -1084 -3016 -2705 -3836 -3297 -224 1764 3179 4126 3227 1167 -817 -3186 -5101 -3369 -491 558
997 558 3389 5599 3256 -352 -1128 -3455 -5987 -3019 571 980 2630 5839 3257 -1007 -832 -1170
1013 -1170 -5044 -3956 635 465 -104 3882 4746 410 -583 -157 -3946 -5096 -1332 846 1319 4254
1029 4254 5601 1573 -1534 -2378 -4544 -5180 -1551 1047 2240 3916 4104 1459 -606 -1252 -3104 -2888
1045 -2888 -972 -728 573 3434 3332 1340 1341 13 -4208 -4596 -1670 -1519 -185 4677 5667 2100 978
1062 978 441 -4671 -5653 -1442 -335 -620 3344 5401 841 -1086 330 -2087 -4559 -1290 710 -406
$$ packed form
948D951n45m496j673j57k503j039M624K796m39K142K460l578m220Q9j484k955
964f027K719N250L70P06K580k124n587p50j22k126K208N281J046p52J407r74m189
981a084j932L11j131N39L073J988J415R47q99k060j984k369j915J732K878J049
997E58K831K210k343l608p76k327k532K968L590M09J650L209k582m264J75l38
1013a170l874J088M591j70n69L986Q64m336r93M26l789j150L764K178M73K935
1029D254J347m028l107q44k166o36L629K598J193J676J88k645k065o46j852K16
1045b888J916K44J301K861j02j992Jj328m221l88K926J51J334M862R90l567j122
1062I78n37n112r82M211J107k85L964K057m560j927J416k417k472L269K000j116
$$ plain form
1078 -406 1743 4358 2237 401 715 -1254 -4477 -3547 -1387 -707 1381 4314 3769 1865 588 -2391
1094 -2391 -4215 -3027 -1476 367 2942 4073 2363 1386 125 -2761 -3898 -1713 -1171 -1442 1858 3641
1110 3641 1544 1531 2670 -662 -3821 -2348 -1471 -2459 326 4047 2869 1204 1602 -698 -4840 -3498
1126 -3498 -831 -1338 1055 4640 3324 891 984 -433 -3308 -2787 -1076 -921 -404 2149 2823 1649 1283
1143 1283 390 -2114 -2635 -2186 -1941 230 2451 3096 2583 2618 -135 -3059 -3030 -2615 -2376 198 3117 2528
1161 2528 2248 2062 -317 -2745 -1938 -1188 -1867 -305 2726 2223 1116 2158 1380 -2387 -2945 -1414 -2219
1178 -2219 -1786 1621 3230 2236 2466 1538 -1483 -3110 -2271 -1896 -1213 1370 2737 2032 1658 691 -882
1195 -882 -2381 -2086 -1611 -474 944 2039 2258 2088 894 -845 -1421 -2364 -2607 -1445 692 1568 1814
$$ packed form
1078d06K149K615k121j836L14j969l223R30K160O80K088K933n45j904j277k979
1094b391j824J188J551J843K575J131j710r77j261k886j137K185N42k71L300J783
1110C641k097j3J139l332l159J473Q77r88K785L721j178j665L98k300m142J342
1126c498K667n07K393L585j316k433R3j417k875N21J711J55N17K553O74j174l66
1143A283q93k504n21M49K45K171K221O45n13L5k753k924K9M15K39K574K919n89
1161B528k80j86k379k428Q07P50o79J562L031n03j107J042p78l767n58J531q05
1178b219M33L407J609r94K30r28l021j627Q39L75O83K583J367p05l74r67j573
1195h82j499K95M75J137J418J095K19j70j194j739n76r43k43J162K137Q76K46
$$ plain form
1212 1814 2942 1533 -1163 -2125 -2014 -2511 -1768 866 1991 1646 2409 2046 -631 -2056 -1890 -2351 -2022
1229 -2022 67 2092 1941 1649 1970 420 -1564 -1604 -1886 -1877 -569 1551 2416 1723 1783 644 -1269 -2597
1247 -2597 -2400 -1705 -794 965 2278 2329 1516 371 -387 -1772 -2487 -1766 -275 642 1568 2378 1946 322
1265 322 -682 -1298 -2408 -2371 -506 125 1381 2144 2403 934 -422 -863 -2004 -2648 -1081 805 1149
1282 1149 1580 2326 1243 -708 -1553 -1619 -2093 -1429 199 1600 1735 1892 1714 26 -1283 -1691 -1771 -1413
1300 -1413 -572 905 1829 2024 1420 497 -957 -1778 -2063 -1104 -496 477 2128 1943 1130 846 -392 -1826
1318 -1826 -2149 -1477 -431 85 1518 2456 1626 336 -487 -1377 -2108 -1642 -388 266 985 2080 1969 724
1336 724 -624 -1056 -2079 -1952 -877 587 1045 1755 2233 1136 -503 -1058 -1378 -1932 -1412 198 1358
$$ packed form
1212A814J128j409k696r62J11m97P43K634J125l45P63l63k677j425J66m61L29
1229b022K089K025j51k92L21j550j984m0k82RJ308K120Q65o93O0j139j913j328
1247b597J97O95R11J759J313N1q13j145p58j385p15P21J491R17R26Q10m32j624
1265C22j004o16j110L7J865O31J256P63K59j469j356m41j141o44J567J886L44
1282A149M31P46j083j951q45o6m74O64J628J401J35J57j78j688j309m08q0L58
1300a413Q41J477R24J95o04r23j454q21k85R59O08R73J651j85q13k84j238j434
1318a826l23O72J046N16J433R38q30j290q23q90p31M66J254O54P19J095j11j245
1336G24j348m32j023J27J075J464M58P10M78j097j639n55l20n54N20J610J160
$$ plain form
1353 1358 1198 1921 1346 -183 -1109 -1855 -1325 -1585 -531 1262 2013 1639 1029 395 -644 -1833 -1674 -1088
1371 -1088 -562 511 1598 1938 1244 241 -393 -1588 -1970 -1283 -728 202 1321 1970 1256 601 -169 -1182
1389 -1182 -2215 -1374 -48 153 1087 1990 1620 115 -463 -952 -1683 -1835 -711 328 1085 1746 1714 1042
1407 1042 117 -1115 -1216 -1527 -1357 -228 631 1376 1345 931 79 -1252 -1414 -1455 -927 -127 1337 1779 1136
1426 1136 1104 243 -1205 -1841 -1276 -1013 -1093 254 1592 1190 736 774 -43 -1556 -1214 -395 -525 94 1558
1445 1558 1775 873 249 -209 -1623 -1662 -1043 -546 448 1351 1676 1161 470 -114 -936 -1489 -1148 -588 246 809
1465 809 923 909 748 -181 -1358 -1166 -1070 -1147 143 1312 1559 1341 1596 317 -1465 -1551 -1072 -1359 -621 855
1485 855 1332 853 797 292 -1335 -1387 -537 -839 -255 1160 1455 635 638 715 -723 -1555 -1265 -1112 -783 349
$$ packed form
1353A358j60P23n75j529r26p46N30k60J054J793P51l74o10o34j039j189J59N86
1371a088N26J073J087L40o94j003o34j195l82O87N55R30J119O49p14o55p70j013
1389a182j033Q41J326K01R34R03l70j505n78m89p31j52J124J039P57O61l2o72
1407A042r25j232j01l11J70J129Q59P45l1m14q52j331j62m1N28Q00J464M42o43
1426A136l2q61j448o36N65K63q0J347J338m02m54L8q17j513L42Q19j30O19J464
1445A558K17r02o24m58j414l9O19M97R94R03L25n15o91n84q22n53L41N60Q34N63
1465H09J14j4j61r29j177J92R6p7J290J169K47k18K55j279j782q6M79k87P38J476
1485H55M77m79n6n05j627n2Q50l02N84J415K95q20LP7j438q32K90J53L29J132
$$ plain form
1505 349 1221 1252 1195 818 -515 -1230 -1284 -1117 -709 672 1204 1041 1146 39 -796 -1135 -1060 -1070 -628 652
1525 652 935 1101 1262 1051 -391 -867 -494 -1406 -1193 764 780 666 1326 1385 -333 -1145 -646 -1311 -1342 446
1545 446 1358 818 1072 992 -313 -1273 -832 -664 -847 -47 914 468 800 1186 105 -557 -269 -928 -1310 -509
1565 -509 663 776 975 1460 405 -418 -884 -1375 -1487 -209 616 661 1492 1188 83 -984 -484 -1187 -1230
1584 -1230 -158 708 121 879 1439 380 -265 -123 -601 -1460 -748 339 162 682 1603 920 -575 -318
1602 -318 -458 -1516 -865 570 683 726 1359 628 -271 -634 -821 -1013 -746 158 780 536 946 644 -153 -154
1622 -154 -720 -811 -757 -371 97 543 1258 1022 -42 -282 -789 -1706 -874 -50 -126 754 1596 1163 -127 -118 -577
1643 -577 -1404 -817 232 206 169 1261 930 77 -319 -95 -1215 -1130 -214 111 49 1069 1233 629 -22 -152
$$ packed form
1505C49Q72L1n7l77j333p15n4J67M08J381N32j63J05j107q35l39P5j0M42J280
1525F52K83J66J61k11j442m76L73r12K13J957J6j14O60N9j718q12M99o65l1J788
1545D46R12n40K54q0j305r60M41J68j83Q00R61m46L32L86j081o62K88o59l82Q01
1565e09J172J13J99M85j055q23m66m91j12J278Q25M5Q31l04j105j067N00p03m3
1584a230J072Q66n87P58N60j059o45J42m78q59P12J087j77N20R21o83j495K57
1602c18j40j058O51J435J13M3O33p31q99l63j87j92K67R04O22k44M10l02p97j
1622a54n66r1N4L86M68M46P15k36j064k40n07r17Q32Q24p6Q80Q42m33j290Rm59
1643e77q27N87J049k6l7J092l31q53l96K24j120Q5R16L25o2J020J64o04o51j30
$$ plain form
1663 -152 -1256 -1204 -630 -50 382 885 1091 336 232 -586 -826 -1144 -723 -262 467 831 828 584 252 -180 -871
1684 -871 -764 -347 -266 50 915 1096 570 478 110 -835 -1222 -551 -234 74 936 1075 699 229 -38 -798 -1040
1705 -1040 -399 238 -117 829 874 736 92 19 -544 -758 -459 -139 85 508 960 753 429 -10 -409 -780
1725 -780 -593 -692 -140 568 699 578 633 162 -498 -799 -819 -252 -249 291 760 717 395 31 -538 -868 -506 -570
1747 -570 -480 193 686 569 540 629 -77 -704 -786 -591 -409 85 932 807 474 95 -149 -813 -737 -546 -346 36
1769 36 745 998 765 647 -50 -315 -767 -953 -408 -109 328 773 512 258 -305 -630 -701 -563 -210 264 647
1790 647 588 939 614 -47 -522 -616 -740 -688 14 320 582 506 223 362 -561 -538 -662 -317 -77 353 819 590
1812 590 697 266 -202 -695 -588 -473 -374 310 446 631 389 269 -62 -371 -738 -391 56 -269 578 746
$$ packed form
1663a52j104N2N74N80M32N03K06p55j04q18k40l18M21M61P29L64lk44l32m32o91
1684h71J07M17Q1L16Q65J81n26r2l68r45l87O71L17L08Q62J39l76m70k67p60k42
1705a040O41O37l55R46M5j38o44p3n63k14K99L20K24M23M52k07l24m39l99l71
1725g80J87r9N52P08J31j21N5m71o60l01k0N67LN40M69m3l22l64n69l30L62o4
1747e70R0O73M93j17k9Q9p06o27q2J95J82M94Q47j25l33l79k44o64P6J91K00L82
1769C6P09K53k33j18o97k65m52j86N45K99M37M45k61k54n63l25p1J38L53M74L83
1790F47n9L51l25o61m75r4j24N2P02L06K62p6k83J39r23K3j24L45K40M30M66k29
1812E90J07m31m68m93J07J15R9O84J36J85k42j20l31l09l67L47M47l25Q47J68
$$ plain form
1832 746 646 37 116 -367 -425 -341 -93 272 300 382 795 356 -126 -371 -404 -463 -295 -81 242 652 610 371 -383
1855 -383 -284 -618 -884 -323 -152 292 336 601 306 -124 -173 -408 -577 -484 144 221 599 517 307 302 -83 -561 -507
1878 -507 -276 -467 160 556 592 365 71 -75 -240 -490 -416 -289 134 294 475 427 -137 -159 -386 -759 -569
1899 -569 17 131 473 551 574 332 -206 -239 -580 -673 -126 -45 252 240 591 580 14 -73 -490 -437 -355 55 169
1922 169 260 646 446 -14 -328 -298 -573 -182 33 198 398 720 258 157 -245 -475 -566 -112 -116 53 196 469
1944 469 282 53 -323 -516 -592 -359 119 -58 219 520 420 164 -35 -234 -348 -344 -141 -69 269 705 474
1965 474 -85 139 -128 -823 -578 92 121 277 259 528 207 29 -319 -274 -620 -521 -32 -81 247 503 359 31
1987 31 -308 -539 -532 -498 -503 29 561 323 220 228 -342 -294 -450 -109 -138 138 424 315 85 231 113 -446 -471 -136
$$ packed form
1832G46j00o09P9m83n8Q4K48L65K8Q2M13m39m82k45l3n9J68K14L23M10m2k39p54
1855c83R9l34k66N61J71M44M4K65k95m30m9k35j69R3O28P7L78q2k10nl85m78N4
1878e07K31j91O27L96L6k27k94j46j65k50P4J27M23J60J81m8n64k2k27l73J90
1899e69N86J14L42P8K3k42n38l3l41r3N47Q1K97j2L51j1n66q7m17N3Q2M10J14
1922A69R1L86k00m60l14L0k75L91K15J65K00L22m62j01m02k30r1M54mJ69J43K73
1944D69j87k29l76j93p6K33M78j77K77L01j00k56j99j99j14MK03P2L38M36k31
1965D74n59K24k67o95K45O70K9J56j8K69l21j78l48M5l46R9M89m9L28K56j44l28
1987C1l39k31PL4nN32N32k38j03Qn70M8j56L41k9K76K86j09k30J46j18n59k5L35
$$ plain form
2011 -136 -24 71 360 380 26 -103 135 -359 -699 -118 -237 -76 478 781 436 158 124 -175 -422 -564 7
2032 7 83 21 467 325 -251 -78 -210 -182 -411 -16 -256 288 288 211 489 135 9 -584 -347 -371 -348 200 384
2055 384 480 161 -11 -205 -316 -368 -247 -177 69 362 220 110 186 -224 -365 -179 -352 -564 29 449 294
2076 294 163 232 57 -268 -497 -360 -245 162 451 339 404 217 -214 -387 -367 -199 -96 143 381 418 69
2097 69 -3 155 -291 -62 -340 -235 -154 64 408 261 306 103 -141 -131 -158 -359 -49 462 523 212 599 4
2119 4 -207 -420 85 -381 -173 231 172 22 25 -103 -375 -325 -103 -240 -416 275 116 186 120 -56 -86 -304 -128
2142 -128 -175 143 91 335 172 614 195 -208 -281 -314 -77 159 126 589 502 198 39 -323 -83 -26 -311 -118
2164 -118 187 439 46 422 297 -375 -465 -205 -174 -348 11 110 361 240 285 -142 -142 -314 -249 -82 83 334
$$ packed form
2011a36J12R5K89K0l54j29K38m94l40N81j19J61N54L03l45k78l4k99k47j42N71
2032GP6o2M46j42n76J73j32K8k29L95k40N44%p7K78l54j26n93K37k4K3N48J84
2055C84R6l19j72j94j11n2J21P0K46K93j42j10P6m10j41J86j73k12N93M20j55
2076B94j31O9j75l25k29J37J15M07K89j12O5j87m31j73K0J68J03K39K38L7l49
2097F9p2J58m46K29k78J05Q1K18L44j47M5k03k44J0k7k01L10N11O1l11L87n95
2119Dk11k13N05m66K08M04n9j50Lj28k72N0K22j37j76O91j59P0o6j76l0k18J76
2142a28m7L18n2K44j63M42m19m03p3l3K37K36l3M63q7l04j59l62K40N7k85J93
2164a18L05K52l93L76j25o72r0K60L1j74L59R9K51j21M5m27%j72O5J67J65K51
$$ plain form
2186 334 206 275 45 -55 -254 -88 -101 -236 -43 224 522 436 277 -14 -54 -86 -153 -57 78 -7 262 425 285
2209 285 38 -124 -130 -308 -345 -59 12 154 468 146 36 -238 -215 -219 -385 59 7 -32 117 84 -52 128 -462
2232 -462 -324 -228 -326 59 -213 237 384 34 -165 -107 -281 -343 -63 -116 79 138 258 -40 -65 -304 -142 -218 -136
2255 -136 -138 87 383 257 305 50 -228 -261 -401 -112 -196 182 200 245 136 -27 -198 -204 -560 -309 -67 167 167 255
2279 255 65 173 -138 -45 -355 -228 254 63 113 -28 316 -184 -24 -179 -203 -303 45 77 158 176 -216 -76
2301 -76 0 18 -326 -264 169 2 397 212 345 67 -275 -204 -526 -250 4 105 198 244 198 181 -121 -99 -246
2324 -246 -224 -107 -80 4 273 130 56 70 -89 -86 -296 70 167 -54 60 38 208 -6 -299 -189 -448 -159 9
2347 9 148 347 197 149 -39 3 -170 -455 -154 -184 -47 -40 -16 -63 39 -453 -335 -352 -405 -110 43 -184 -6 365
$$ packed form
2186C34j28O9k30j00j99J66j3j35J93K67K98q6j59k91m0l2o7R6J35q5K69J63j40
2209B85k47j62oj78l7K86P1J42L14l22j10k74K3mj66M44n2l9J49l3j36J80n90
2232d62J38R6r8L85k72M50J47l50j99N8j74o2K80n3J95N9J20k98k5k39J62p6Q2
2255a36kK25K96j26M8k55k78l3j40K89q4L78J8M5j09j63j71ol56K51K42K34%Q8
2279B55j90J08l11R3l10J27M82j91N0j41L44n00J60j55k4j00L48L2Q1J8l92J40
2301g6P6J8l44O2M33j67L95j85J33k78l42P1l22K76K54J01R3M6m6j7l02K2j47
2324b46K2J17K7Q4K69j43p4J4j59Lk10L66R7k21J14k2J70k14k93J10k59K89J68
2347IJ39J99j50m8j88M2j73k85L01l0J37PK4m7J02m92J18j7n3K95J53k27J78L71
$$ plain form
2371 365 -38 -43 -199 83 169 140 -130 120 104 30 -98 -198 -143 -143 -58 -6 6 249 231 273 -106 52 -79 -40 -35 -192
2397 -192 55 -5 227 -70 178 18 -100 -350 -230 -83 -34 -1 233 211 107 -24 28 -105 -322 -295 -94 -183
2419 -183 382 -77 154 59 -62 -381 -163 -145 110 90 139 158 -9 76 -36 -128 -335 -208 134 157 14 195 281
2442 281 -99 -308 165 -61 -146 -366 150 179 50 262 61 -241 -111 -25 22 27 47 -243 -28 127 95 69 -82
2465 -82 -329 -68 -223 -109 74 110 -36 55 88 -242 -121 -2 -153 71 68 22 91 222 7 -379 84 -58 -369
2488 -369 -34 169 303 139 -12 -121 -207 12 23 85 10 -91 307 55 -52 40 114 -109 -382 -175 83 2
2510 2 -149 169 236 80 -226 -142 -45 -150 -5 -84 137 188 122 -83 -173 -6 -101 -83 86 110 66 144 330 -156 -26
2535 -26 -181 -114 -127 -143 206 -83 89 49 29 62 -193 -88 -80 19 360 191 153 -22 175 20 -39 -171 -47 -67
$$ packed form
2371C65m03nj56K82Q6k9k70K50j6p4j28j00N5%Q5N2J2K43j8M2l79J58j31L9Nj57
2397a92K47o0K32k97K48j60j18k50J20J47M9L3K34k2j04j31N2j33k17K7K01q9
2419a83N65m59K31r5j21l19K18J8K55k0M9J9j67Q5j12r2k07J27L42K3j43J81Q6
2442B81l80k09M73k26q5k20N16K9j29K12k01l02J30Q6M7NK0k90K15J55l2k6j51
2465h2k47K61j55J14J83L6j46R1L3l30J21J19j51K24lm6O9J31k15l86M63j42l11
2488c69L35K03J34j64j51j09q6K19J1O2p5j01L98k52j07R2P4k23k73K07K58q1
2510Bj51L18O7j56l06Q4R7j05J45p9K21N1o6k05r0J67r5J8J69K4m4P8J86m86J30
2535b6j55O7j3j6L49k89J72m0k0L3k55J05QR9L41j69l8j75J97j55n9j32J24k0
$$ plain form
2559 -67 -123 -157 -15 145 96 -122 179 -61 -144 302 58 -86 -40 434 116 -278 23 -107 -302 -5 9 -27 15
2582 15 -10 -18 -216 146 -271 -107 5 9 22 224 195 65 -21 -166 61 -381 -156 -56 197 170 293 219 -192 -64
2606 -64 -113 -312 -351 209 196 174 97 22 -131 -99 169 -346 -224 58 100 243 265 39 120 32 29 -393 -53 -51 -2 217
2632 217 49 325 -1 114 0 -40 -154 -316 -12 236 218 -4 -166 -89 14 -349 -52 11 71 79 214 10
2654 10 30 118 -4 -328 -313 166 93 121 172 65 142 -42 -104 -20 -10 -112 -25 -2 158 231 215 -331 29 -381 -3
2679 -3 -112 180 117 62 157 89 -133 26 -190 -189 88 -57 -90 294 505 59 -120 -21 -39 209 -206 191 85 -61
2703 -61 156 -71 192 -43 -139 -100 15 175 -37 142 -8 -83 184 159 -46 -35 -201 -175 147 35 107 22 -227
2726 -227 -158 -205 -28 -147 -249 -32 5 35 10 -14 315 -172 96 -350 -259 -32 86 -100 108 -24 -153 217
$$ packed form
2559f7n6l4J42J60m9k18L01k40q3M46k44j44M6M74l18l94L01j30j95K97J4l6M2
2582A5k5qj98L62m17J64J12MJ3K02k9j30q6j45K27m42K25J00K53k7J23p4m11J28
2606f4m9j99l9N60j3k2p7p5j53L2K68n15J22K82M2J43K2k26Q1q8lm22L40KM9K19
2632B17j68K76l26J15j14m0j14j62L04K48j8k22j62P7J03l63K97O3O0QJ35k04
2654A0K0Q8j22l24J5M79p3K8N1j07P7j84o2Q4J0j02Q7K3J60P3j6n46L60m10L78
2679cj09K92o3n5R5o8k22J59k16JK77j45l3L84K11m46j79R9j8K48m15L97j06j46
2703f1K17k27K63k35r6L9J15J60k12J79j50p5K67k5k05J1j66K6L22j12P2q5k49
2726b27O9m7J77j19j02K17L7L0k5k4L29m87K68m46R1K27J18j86K08j32j29L70
$$ plain form
2748 217 -5 -155 -30 -228 140 -84 -110 174 -225 -183 17 -147 114 -153 -93 16 -67 158 137 -146 -27 -56
2770 -56 234 196 10 146 84 -5 -324 188 144 -232 -22 17 -26 1 64 115 -103 315 -191 -288 103 -17 -177 -37
2794 -37 98 130 143 173 -36 -5 -309 117 176 9 372 -27 45 -140 -64 -82 -17 -119 -162 63 168 256 3 255
2818 255 -35 112 112 -370 -28 83 49 -54 66 -57 -180 -69 2 -140 -53 -227 184 95 -203 95 -1 -219
2840 -219 105 -252 125 60 -16 -47 -206 -46 -9 151 -105 -32 87 -89 -32 191 188 85 1 120 8 -43 34 -126
2864 -126 151 176 -50 -5 -42 14 -187 61 -173 8 203 -133 5 339 127 130 -82 -434 384 113 144 -33
2886 -33 27 81 -31 -97 -230 89 88 38 139 -89 1 -294 4 -26 -251 239 -172 -9 -91 -121 -68 -125 77 -65
2910 -65 -123 -141 64 -117 -28 -43 143 35 -30 -50 24 -213 -115 -53 -79 -28 -8 42 261 22 -46 -252 27 15 -71 36
$$ packed form
2748B17k22j50J25j98L68k24k6K84l99M2K00j64K61k67O0J09q3K25k1k83J19k9
2770e6K90l8j86J36o2q9l19N12m4l76K10L9m3K7O3N1k18M18n06r7L91j20j60J40
2794c7J35L2J3L0k09L1l04M26N9j67L63l99P2j85P6j8O5j02m3K25J05Q8k53K52
2818B55k90J47%m82L42J11l4j03J20j23j23J11P1j42Q7j74M11q9k98K98r6k18
2840b19L24l57L77o5p6l1j59J60L7J60k56P3J19j76N7K23lj03q4J19j12n1P7j60
2864a26K77K5k26M5l7N6k01K48k34J81J95l36J38L34k12Lk12l52Q18k71L1j77
2886c3O0N4j12o6j33L19jn0J01k28R0k95K98l0k25M90m11J63q2l0N3n7K02j42
2910f5n8j8K05j81Q9j5J86j08o5k0P4k37R8O2k6N1K0N0K19k39o8k06K79j2q6J07
$$ plain form
2936 36 64 55 100 18 -71 -27 -21 -302 31 -156 -201 110 39 15 43 -128 -157 6 -233 9 31 97 159 -78 -158 -66 -135
2963 -135 -240 -177 -104 -70 341 -108 -120 -207 -103 -89 -121 -108 168 258 54 303 241 -253 -66 -16 -419 -122 63 267
2987 267 -53 159 21 -7 -120 -43 -264 -105 102 131 -144 -96 34 -32 -106 -4 -60 174 -32 -111 -65 -165 16
3010 16 33 -128 33 8 -167 -69 -61 143 33 134 144 -88 -101 52 -90 -99 -278 -33 83 67 -99 -141 -46 -228
3034 -228 -18 -189 158 35 51 -40 173 136 183 -132 -36 146 -151 31 205 143 -3 113 -2 -10 -139 -13 -63
3057 -63 196 -159 106 257 77 -17 -201 -123 166 -172 -72 16 -3 117 -183 -10 -238 -162 -75 -111 236 267 46
3080 46 14 34 101 18 -80 20 23 -12 4 100 96 400 231 -179 -26 -191 -58 217 -217 38 -32 154 37 -216 -234
3105 -234 -85 -36 98 181 -177 23 73 -20 219 -81 -161 -253 -154 336 113 7 -41 0 -241 94 106 -137 -28
$$ packed form
2936C6K8rM5q2q9M4Ok81L33j87m5L11p1k4K8j71k9J63k39K42K2O6O2k37q0R2o9
2963a35j05O3P3L4M11m49j2q7J04J4l2J3K76R0k04K49o2m94J87N0m03K97J85K04
2987B67l20K12j38k8j13P7k21J59K07K9k75M8J30o6p4J02n6K34k06p9M6j00J81
3010A6J7j61J61k5j75R8QK04j10J01J0k32j3J53j42rj79K45J16j6j66m2R5j82
3034b28K10j71L47j23J6r1K13l7M7l15R6J82k97J82J74o2j46J16j15qj29J26n0
3057f3K59l55K65J51j80r4j84P8K89l38J00Q8j9J20l00J73k28P6Q7l6L47L1k21
3080D6l2K0O7q3r8J00Ll5J6R6mL04j69m10J53j65J33K75m34K55p0J86j17k53j8
3105b34J49M9J34Q3l58K00N0r3K39l00q0r2R9M90k23j06m8M1k41L35J2k43J09
$$ plain form
3128 -28 147 67 40 15 102 -216 -21 -72 -118 -170 99 -189 92 8 -18 338 -122 -111 -40 101 -15 -51 -7 49 56 -166
3154 -166 89 -89 134 -285 70 156 343 -1 -273 -103 -193 -94 -202 -420 191 -169 51 165 -73 -79 -368 -55
3176 -55 35 -84 -203 19 -52 -112 42 7 -67 21 75 -42 -223 -115 111 -13 -173 134 9 -6 -143 -128 61
3199 61 157 103 -20 147 129 170 27 273 32 -86 211 31 74 155 -21 104 -37 -104 -195 -273 -10 277 97
3222 97 314 -183 -152 -6 77 11 62 -54 -98 -29 191 370 -116 -109 89 -167 -177 -305 82 72 56 75 128 -51 -125
3247 -125 -37 85 3 279 188 -46 40 12 -68 133 -198 -86 30 -323 135 135 78 -113 -9 -56 49 -68 346
3270 346 128 19 307 108 -108 -83 55 249 -98 -4 129 -87 -158 -122 221 -96 -183 -163 -86 79 -197 -53
$$ packed form
3128b8J75q0k7k5Q7l18J95n1m6n2K69k88K81q4k6L56m60J1P1J41j16l6M4N6Pk22
3154a66K55j78K23m19L55Q6J87l44k72J70r0R9j08k18O11l60K20J14k38ok89L13
3176e5R0j19j19K22p1o0J54l5p4Q8N4j17j81J08K26j24j60L07j25j5j37J5J89
3199F1R6n4j23J67j8M1j43K46k41j18K97j80M3Q1j76J25j41o7r1p8K63K87j80
3222I7K17m97L1J46Q3o6N1j16m4O9K20J79m86PJ98k56j0j28L87j0j6J9N3j79p4
3247a25Q8J22q2K76r1k34Q6k8q0K01l31J12J16l53M58%n7j91J04m7J05j17M14
3270C46k18j09K88j99k16K5J38J94l47R4J33k16p1L6L43l17q7K0P7J65k76J44
$$ [...]
8191F2
##END NTUPLES=NMR FID
##END=
