##TITLE=1H_75CAA
 aceton-d6
 8 sc, 
 28.11.2023
##JCAMPDX= 6.0         $$ Bruker NMR JCAMP-DX V2.0
##DATA TYPE= NMR FID
##DATA CLASS= NTUPLES
##ORIGIN= UXNMR, Bruker Analytische Messtechnik GmbH
##OWNER= root
$$ XWIN-NMR		Version 3.5
$$ Tue Nov 28 13:55:29 2023 Russian Standard Time (UT+4h)  she@DPX200
##.OBSERVE FREQUENCY= 200.1313
##.OBSERVE NUCLEUS= ^1H
##.DELAY= (6, 6)
##.ACQUISITION MODE= SIMULTANEOUS
##.ACQUISITION SCHEME= undefined
##.AVERAGES= 8
##.DIGITISER RES= 18
##SPECTROMETER/DATA SYSTEM= spect
##.PULSE SEQUENCE= zg30
##.SOLVENT NAME= Acetone
##.SHIFT REFERENCE= (INTERNAL, Acetone, 0, 15.7039)
##AUDIT TRAIL= $$ (NUMBER, WHEN, WHO, WHERE, WHAT)
$$ ##TITLE= Audit trail, XWIN-NMR		Version 3.5
$$ ##JCAMPDX= 5.01
$$ ##ORIGIN= Bruker BioSpin GmbH
$$ ##OWNER= she
$$ F:/spectra/data/she/nmr/H-F/1/audita.txt
$$ ##AUDIT TRAIL=  $$ (NUMBER, WHEN, WHO, WHERE, WHAT)
(   1,<2023-11-28 13:53:52.98 +0400>,<she>,<DPX200>,
      <created by zg, POWCHK disabled, PULCHK disabled
       configuration hash MD5:
       00 E9 B6 7A A2 85 ED C7 34 08 36 98 17 FE 4E 26
       data hash MD5: 16K
       48 76 DC A5 38 B3 64 79 A5 2D 3A 3D 30 F7 7A 81>)
$$ ##END=
$$ 
$$ hash MD5
$$ E3 0C 8B D3 5F 17 B8 A3 B2 19 01 DA 51 30 EB 94
##$RELAX= 
##$RELAX= 
##$RELAX= 
##$RELAX= 
##$RELAX= 
##$RELAX= 
$$ Bruker specific parameters
$$ --------------------------
##$DU= <F:/spectra>
##$EXPNO= 1
##$NAME= <H-F>
##$PROCNO= 1
##$TYPE= <nmr>
##$USER= <she>
##$AMP= (0..31)
100 100 100 100 100 100 100 100 100 100 100 100 100 100 100 100 100 100 
100 100 100 100 100 100 100 100 100 100 100 100 100 100 
##$AQSEQ= 0
##$AQ_mod= 1
##$AUNM= <au_zg>
##$AUTOPOS= <>
##$BF1= 200.13
##$BF2= 200.13
##$BF3= 200.13
##$BF4= 200.13
##$BF5= 200.13
##$BF6= 200.13
##$BF7= 200.13
##$BF8= 200.13
##$BYTORDA= 1
##$CFDGTYP= 0
##$CFRGTYP= 5
##$CHEMSTR= <none>
##$CNST= (0..31)
1 1 145 1 1 1 1 1 1 1 1 1 1 1 1 1 1 1 1 1 1 1 1 1 1 1 1 1 1 1 1 1 
##$CPDPRG= <>
##$CPDPRG1= <>
##$CPDPRG2= <>
##$CPDPRG3= <>
##$CPDPRG4= <mlev>
##$CPDPRG5= <mlev>
##$CPDPRG6= <mlev>
##$CPDPRG7= <mlev>
##$CPDPRG8= <mlev>
##$CPDPRGB= <>
##$CPDPRGT= <>
##$D= (0..31)
0 1.2 0 0 0 0 0 0 0 0.06 0 0.03 0 0 0 0 0.0002 0 0 0 0 0 0 0 0 0 0 0 0 
0 0 0 
##$DATE= 1701165232
##$DBL= (0..7)
120 120 120 120 120 120 120 120 
##$DBP= (0..7)
150 150 150 150 150 150 150 150 
##$DBP07= 0
##$DBPNAM0= <>
##$DBPNAM1= <>
##$DBPNAM2= <>
##$DBPNAM3= <>
##$DBPNAM4= <>
##$DBPNAM5= <>
##$DBPNAM6= <>
##$DBPNAM7= <>
##$DBPOAL= (0..7)
0.5 0.5 0.5 0.5 0.5 0.5 0.5 0.5 
##$DBPOFFS= (0..7)
0 0 0 0 0 0 0 0 
##$DE= 6
##$DECBNUC= <off>
##$DECIM= 32
##$DECNUC= <off>
##$DECSTAT= 4
##$DIGMOD= 1
##$DIGTYP= 9
##$DL= (0..7)
0 120 120 120 120 120 120 120 
##$DP= (0..7)
150 150 150 150 150 150 150 150 
##$DP07= 0
##$DPNAME0= <>
##$DPNAME1= <>
##$DPNAME2= <>
##$DPNAME3= <>
##$DPNAME4= <>
##$DPNAME5= <>
##$DPNAME6= <>
##$DPNAME7= <>
##$DPOAL= (0..7)
0.5 0.5 0.5 0.5 0.5 0.5 0.5 0.5 
##$DPOFFS= (0..7)
0 0 0 0 0 0 0 0 
##$DQDMODE= 0
##$DR= 18
##$DS= 0
##$DSLIST= <SSSSSSSSSSSSSSS>
$$ [...]
##$SUBNAM2= <"">
##$SUBNAM3= <"">
##$SUBNAM4= <"">
##$SUBNAM5= <"">
##$SUBNAM6= <"">
##$SUBNAM7= <"">
##$SUBNAM8= <"">
##$SUBNAM9= <"">
##$SW= 18.0517328524113
##$SWIBOX= (0..15)
0 0 2 0 0 0 0 0 0 0 0 0 0 0 0 0 
##$SW_h= 3612.71676300578
##$TD= 16384
##$TD0= 1
##$TE= 0
##$TE2= 300
##$TE3= 300
##$TEG= 300
##$TL= (0..7)
0 120 120 120 120 120 120 120 
##$TP= (0..7)
150 150 150 150 150 150 150 150 
##$TP07= 0
##$TPNAME0= <>
##$TPNAME1= <>
##$TPNAME2= <>
##$TPNAME3= <>
##$TPNAME4= <>
##$TPNAME5= <>
##$TPNAME6= <>
##$TPNAME7= <>
##$TPOAL= (0..7)
0.5 0.5 0.5 0.5 0.5 0.5 0.5 0.5 
##$TPOFFS= (0..7)
0 0 0 0 0 0 0 0 
##$TUNHIN= 0
##$TUNHOUT= 0
##$TUNXOUT= 0
##$USERA1= <user>
##$USERA2= <user>
##$USERA3= <user>
##$USERA4= <user>
##$USERA5= <user>
##$V9= 5
##$VALIST= <valist>
##$VCLIST= <CCCCCCCCCCCCCCC>
##$VD= 0
##$VDLIST= <DDDDDDDDDDDDDDD>
##$VPLIST= <PPPPPPPPPPPPPPP>
##$VTLIST= <TTTTTTTTTTTTTTT>
##$WBST= 1024
##$WBSW= 4
##$XGAIN= (0..3)
0 0 0 0 
##$XL= 0
##$YL= 0
##$YMAX_a= 804231
##$YMIN_a= -680651
##$ZGOPTNS= <>
##$ZL1= 120
##$ZL2= 120
##$ZL3= 120
##$ZL4= 120
##$ABSF1= 10
##$ABSF2= 0
##$ABSG= 5
##$ABSL= 3
##$ALPHA= 0
##$AQORDER= 0
##$ASSFAC= 0
##$ASSFACI= 0
##$ASSFACX= 0
##$ASSWID= 0
##$AUNMP= <proc_1d>
##$AZFE= 0.1
##$AZFW= 0.1
##$BCFW= 1
##$BC_mod= 2
##$BYTORDP= 1
##$COROFFS= 0
##$CY= 11.3945322036743
##$DATMOD= 1
##$DC= 2
##$DFILT= <>
##$DTYPP= 0
##$F1P= 15.7292609196834
##$F2P= 12.9074282941183
##$FCOR= 0.5
##$FTSIZE= 0
##$FT_mod= 4
##$GAMMA= 1
##$GB= 0.15
##$INTBC= 1
##$INTSCL= 1
##$ISEN= 128
##$LB= 0.24
##$LEV0= 0
##$LPBIN= 0
##$MAXI= 10000
##$MC2= 0
##$MEAN= 0
##$ME_mod= 0
##$MI= 1.114404
##$NCOEF= 0
##$NC_proc= 0
##$NLEV= 6
##$NOISF1= 3.799351
##$NOISF2= 2.8
##$NSP= 1
##$NTH_PI= 0
##$NZP= 0
##$OFFSET= 15.70392
##$PC= 1
##$PHC0= -24229.88
##$PHC1= 7.8527
##$PH_mod= 1
##$PKNL= yes
##$PPARMOD= 0
##$PSCAL= 0
##$PSIGN= 0
##$REVERSE= no
##$SF= 200.130013532006
##$SI= 16384
##$SIGF1= 3
##$SIGF2= 2
##$SINO= 400
##$SIOLD= 16384
##$SREGLST= <1H.CDCl3>
##$SSB= 0
##$STSI= 0
##$STSR= 0
##$SW_p= 3612.71676300578
##$SYMM= 0
##$S_DEV= 0
##$TDeff= 0
##$TDoff= 0
##$TI= <>
##$TILT= no
##$TM1= 0
##$TM2= 0
##$TOPLEV= 0
##$USERP1= <user>
##$USERP2= <user>
##$USERP3= <user>
##$USERP4= <user>
##$USERP5= <user>
##$WDW= 1
##$XDIM= 8192
##$YMAX_p= 0
##$YMIN_p= 0
$$ End of Bruker specific parameters
$$ ---------------------------------
##NTUPLES= NMR FID
##VAR_NAME=  TIME,          FID/REAL,        FID/IMAG
##SYMBOL=    X,             R,               I
##VAR_TYPE=  INDEPENDENT,   DEPENDENT,       DEPENDENT
##VAR_FORM=  AFFN,          ASDF,            ASDF
##VAR_DIM=   8192,          8192,            8192
##UNITS=     SECONDS,       ARBITRARY UNITS, ARBITRARY UNITS
##FACTOR=    0.0002768,     1,               1
##FIRST=     0,             0,               0
##LAST=      2.2672688,     0,               0
##MIN=       0,             -680651,         0
##MAX=       2.2672688,     804231,          0
$$ Real data points
##PAGE= N=1
##DATA TABLE= (X++(R..R)), XYDATA
$$ [...]
1981D049n586k450N206L085n602l263N144L705m226m096M092L920l982m161L920
$$ 4049 -1537 -3987 1219 4304 -1298 -4561 583 4288 62 -4034 58 3978 -4 -4165 -245
1996b45M578l238m733K774M819k257m833J937M782j990n145J407N051q87n162
$$ -245 4333 1095 -3638 -864 3955 1698 -3135 -1198 3584 1594 -3551 -2144 2907 2020 -3142
2011c142L83N192k60m730J92M716M53m953q77M843J005m150j553M032J699l926
$$ -3142 -2759 2433 2173 -2557 -2365 2351 2804 -2149 -3026 1817 2822 -1328 -2881 1151 2850 -1076
2027a076j816M050J968l873k381L246K701k956k965L440K548k718k745K459L183
$$ -1076 -2892 1158 3126 -747 -3128 118 2819 -137 -3102 338 2886 168 -2577 -118 3065
2042C065k120l410J680L415j840l206J531L318j301l615P26L894p96l438P17K721
$$ 3065 945 -2465 -785 2630 790 -2416 -885 2433 1132 -2483 -1757 2137 1341 -2097 -1380 1341
2058A341L4l551p7L965L22l140n91K972O09k729q87K937P83l002j088K745J452
$$ 1341 1375 -2176 -2253 1712 2034 -1106 -1697 1275 1884 -845 -1732 1205 1988 -1014 -2102 643 2095
2075B095k439j379J934J883k225j868K327J706j886j687J133K204j430k047J492
$$ 2095 -344 -1723 211 2094 -131 -1999 328 2034 148 -1539 -406 1798 368 -1679 -187
2090a87J776j407j680P94K083p59k277N34K139n35j699J09K192j43k229L26K012
$$ -187 1589 182 -1498 -704 1379 620 -1657 -1123 1016 481 -1218 -1109 1083 940 -1289 -963 1049
2107A049j66j535l42J626L01j777k75J877M42j521o20J241P83j146j019J574N42
$$ 1049 883 -652 -994 632 933 -844 -1119 758 1200 -321 -941 300 1083 -63 -1082 492 1034
2124A034j271q85J207J121q50j245R28Q11q22p46N09J131q35j297O09J267l87
$$ 1034 -237 -1122 85 1206 356 -889 39 850 28 -718 -209 922 87 -1210 -601 666 279
2141B79q70J27J006l34q37Q7J276j86j061r1P45R7o54J0Q98J8q06j99O62L12k99
$$ 279 -591 -464 542 208 -629 -542 734 548 -513 -604 141 238 -416 -406 492 510 -296 -495 167 479 180
2162A80n64P11K01o47l22P17M18l74p60L18N78m10m33K58L99k13q04L30P46k66
$$ 180 -384 327 528 -119 -441 276 694 320 -440 -122 456 46 -387 -129 270 57 -747 -417 329 63
2182F3n74K23L19J53n36K2O27L4o29j34P26j14L3m12M66O5m88k05O07j80j55l11
$$ 63 -511 -288 31 184 -352 -330 297 331 -298 -432 294 180 213 -199 267 332 -156 -361 246 66 -89 -400
2204d00K88N99l64j93L10rq1m07L60L72j06n60P1j5N8j77N1M58k02n10K62J06
$$ -400 -112 487 123 -70 240 231 150 -257 103 475 369 -191 -120 -135 -77 -254 -203 255 53 -457 -195 -89
2226h9K51n1l05J53K7j75O8N20o0l94P8r9j6J92k55L30O9n34K23p9N88k46j44
$$ -89 162 111 -194 -41 -14 -189 -121 399 339 -55 23 -76 -92 100 -155 175 244 -290 -67 -146 442 196 52
2249E2K36k14r9J07q9J91n2k55J76K2k02M0N2l5k04J87j99K4J05k15M1K31J57
$$ 52 288 74 -25 82 -7 184 132 -123 53 75 -127 -87 -35 -70 -274 -87 -286 -262 -157 -372 -331 -100 57
2272E7k2j35L56L1l49L8R2l8Qq7O6jj39J16L6R1m7p1N0J36k83J06J43p7J02j4
$$ 57 35 -100 256 287 -62 -24 68 30 38 -49 17 16 -123 -7 29 120 73 2 52 188 -95 11 154 77 179 165
2298A65m6J01j24j25lr8P0r1J8J86k49l56L12K54n7N9j82K99P2l17J25J82Lrm2
$$ 165 119 220 96 -29 -32 -130 -60 -151 -133 53 -196 -552 -240 14 -43 16 -166 133 205 -112 13 195 198 189 147
2323A47j65J90j97J28J71l48qj4M2J97q3k0K26k73P7J16RL2q4k10J14J4k00P2
$$ 147 -18 172 -25 103 274 -74 -82 -96 -54 143 60 40 266 -7 70 186 195 227 143 -67 47 61 -139 -67
2347f7l2J73k64k27J83K97k49j49K30J81P9k81j9M02p3j34J27j54K61k38q2R0
$$ -67 -99 74 -190 -417 -234 63 -186 -335 -105 76 155 -126 -145 257 184 50 177 23 284 46 -36 54
2369E4J39l44j06J23K20j25k05M15k7k40R7O4J88J6l79K01L12l60k47M2K09K3
$$ 54 193 -151 -257 -134 86 -39 -244 171 144 -96 1 65 253 269 -110 91 403 43 -204 -162 47 70
2391G0j95l18O45k49n23K21M69p0k69j3M64k4l62QN17Om32j55M78K72p92J48K18
$$ 70 -125 -443 202 -47 -570 -349 120 50 -219 -232 232 208 -154 -146 371 377 -55 -210 268 540 -252 -104 114
2414A14K53n01l71N20M55n88k23M54J65k37n28O04M91n49m55N79L25n89m19M06
$$ 114 367 -134 -505 15 470 -118 -341 113 278 41 -487 117 608 59 -396 183 508 -81 -500 -94
2434i4M24l73o15L82O09k17m41RO08n1p38L98M49l01n32K17O54p4n97R8N17r3
$$ -94 330 -43 -658 -276 333 116 -325 -316 292 241 -497 -99 350 49 -483 -266 388 314 -283 -185 332 239
2456B39m31j95O35L77q19j61O42K3m73j72M66K14l09n18O24M53o86l62N88K58
$$ 239 -192 -387 248 625 -194 -355 287 310 -163 -335 131 345 36 -482 142 595 -91 -453 135 393
2476C93l81o23O47M97o42p03P72K82k28m53J22O65j28p57M23P14k66o22j11P85
$$ 393 12 -611 36 533 -109 -812 -40 242 14 -439 -317 348 220 -537 -114 600 334 -288 -399 386
2496C86op80L18O40k03p42J20N28K56p90l40Q49L05o53l82Q26J37p07l73M99M97
$$ 386 380 -400 -82 558 355 -387 -267 261 517 -273 -613 236 541 -112 -494 332 469 -238 -611 -112 385
2517C85l66n05M84O70p16n14N56M54l85o49K58P54l86p02N67M87k34m39n3R00
$$ 385 19 -486 -2 668 -48 -562 -6 448 63 -586 -328 426 40 -662 -95 392 158 -281 -334 566
2537E66l50n59N2P30o5n30n4O11P7p99m0O93j32l79j99N20K15n99k98P92K01o93
$$ 566 216 -343 -291 439 374 -156 -210 401 478 -321 -361 332 200 -179 -378 142 357 -242 -540 252 453 -240
2559b40j67M04M19m54o21P31L87n76m30L58O44l82n90L54N86m78m05P4P97r8o40
$$ -240 -407 -3 416 -38 -659 72 459 -117 -547 -189 455 73 -517 -163 423 -55 -460 -386 411 313 -327
2580c27R0P75k51o36K65O47k6p10k70P93J06p71L0P23j63l80o16R30J13o36j35
$$ -327 -237 538 287 -349 -84 563 537 -173 -443 350 456 -315 -285 438 275 -105 -721 209 322 -314 -449
2601d49M53J99k05n25L60M24m12l96L64O36j41o95J55P19k17p38M41M66j85m74
$$ -449 4 203 -2 -527 -167 257 -155 -551 -187 449 308 -387 -232 487 270 -468 -27 439 254 -220
2621b20k28P81j79n82K34O12o0o45J64M33J39p74K52N58j44n37j1L58K35o04k53
$$ -220 -448 333 154 -428 -194 418 358 -287 -123 310 449 -325 -73 485 341 -196 -207 151 386 -218 -471
2642d71N24J18k65l85N80J08k30k18L10M66o01l23J50O85k68m47J58M88l73l04
$$ -471 53 171 -94 -479 101 209 -21 -239 71 537 -64 -387 -237 448 180 -267 -109 379 6 -298
2662b98K99M06j24p04M1P15j63n74M06K32N8m83m5N81ln23J88J06K33o52N2L62
$$ -298 1 407 283 -421 -380 335 172 -402 4 236 294 -189 -234 347 344 -179 9 115 348 -304 -252 110
2684A10K4l70JJ72P0k75P8K31Lj67K6N4J55J26k27R4J41l82O2J92J9K0m09J63
$$ 110 134 -236 -235 -63 7 -268 -190 41 44 -123 -97 -43 112 238 11 105 246 -136 -74 118 137 157 -252 -89
2708h9L13p8m13J17L05j3k80J33K59j51j70m2K39N4k44j88L77Rk23kO1J3j84p2
$$ -89 224 146 -267 -150 155 142 -138 -5 254 103 -67 -109 130 184 -60 -248 129 138 -85 -87 -26 -13 -197 -269
2732b69L27Jj25j67L94j87p3J24j3J39ok29R2J61j52L2j41M5Q5j68J4K07j62j03
$$ -269 58 59 -66 -233 161 -26 -99 25 12 151 145 -84 8 169 17 49 -92 -47 38 -130 -116 91 -71 -174
2756a74L26j14Q0M2j93J13R8j56K6n8K9r6n9L56k55j78J30r7M5R3K08l19L32k03
$$ -174 152 38 118 160 -33 80 178 22 48 -10 19 -77 -136 220 -35 -213 -83 -180 -135 -42 166 -153 179 -24
2780b4m5J48j7N4j13K4kj06l2pJ69R3j35r6J61N6j41R2r1J86k11k4J0J93j78M0
$$ -24 -69 79 62 116 3 27 25 -81 -113 -120 49 142 7 -89 72 128 -13 79 -12 174 -37 -61 -51 142 -36 4
2806Dl5K09j6l14J40mm9o2K73j98n1J28j66K78j22n4o6J9J91j40q5J39j4m0J9
$$ 4 -31 178 162 -152 -12 -16 -65 -127 146 -52 -103 25 -141 137 15 -39 -105 -86 105 -35 -120 19 5 -35 -16
2831a6p1J45R7k82L90j33r9j31J82o3j94N5J48J19l07M8K01Q5o4j64l7K20j73
$$ -16 -87 58 155 -127 263 130 31 -100 82 19 -175 -120 28 147 -160 -112 89 174 110 -54 -91 129 -44
2854d4j68J56J75j79j64J50L13j61k00J76j08j9J87k46J66N4j11K3M7j13R8j12
$$ -44 -212 -56 119 -60 -224 -74 239 78 -122 54 -54 -73 114 -132 34 88 -23 0 47 -66 32 -80
2876h0O6M7k58K82O5O4l09Ok9J95q4k53M31n4n5k51R3M41l12k68L55O9l60o2J40
$$ -80 -14 33 -225 57 122 186 -123 -117 -146 49 -35 -288 143 89 34 -217 -124 317 5 -263 92 161 -199 -261 -121
2901a21L98j05m55L14K45m27k03K28M52k54k62j27O53j94l37R2L16N3m04o3L08
$$ -121 277 172 -283 31 276 -151 -354 -126 326 72 -190 -317 336 142 -195 -103 213 266 -138 -201 107
2922A07L3k80p5M62R2m98r7L58J94m82rL26J96m68q1K87K85m29m18O90N7l16m36
$$ 107 140 -140 -215 247 339 -159 -256 102 296 -186 -195 131 327 -141 -222 65 350 -79 -497 193 250 -66 -502
2945e02L79M97k06p38M16P43m53o17J36P34p5o51J12Q34l39o34j3Q38p0r19K05
$$ -502 -123 374 168 -570 -154 589 136 -481 -345 389 314 -337 -225 609 270 -364 -377 461 391 -528 -323
2966c23P62q7p05j7Q97o8o16l09Q22M17j049k97O95N21r10m37R19N71j046l96
$$ -323 439 352 -353 -370 527 459 -157 -466 356 773 -276 -573 122 643 -267 -704 215 786 -260 -656
2986f56N41Q58p74q21P68Q40q13p80Q03Q00n40j004N02R45j13j169J43J262L1
$$ -656 -115 743 -31 -852 -84 756 -57 -837 -34 766 226 -778 -276 669 556 -613 -470 792 823
3005H23j653K79J219o0j196j48J583Q6j449n11J623J87j196m80J187P96j347q87
$$ 823 -830 -551 668 608 -588 -736 847 933 -516 -1027 596 783 -413 -893 294 1090 -257 -1144
3023a144J312Q38j252p34J239P83j129j296J447J095j050j282J164J230j004j411
$$ -1144 168 1006 -246 -980 259 1042 -87 -1383 64 1159 109 -1173 -9 1221 217 -1194
3039a194O77J724q00j650Q98J350l88j628M71J456j77j611K9J786J66k090J29
$$ -1194 -517 1207 407 -1243 -345 1005 617 -1011 -540 916 739 -872 -843 943 1109 -981 -852
3056h52J543K72j733k31J595N35j838n67J807O63j471r21J453J119j603j196J328
$$ -852 691 963 -770 -1001 594 1129 -709 -1276 531 1194 -277 -1198 255 1374 -229 -1425 -97
3073i7J633j708j277J492J402j028j768J131J868j263j861J015J967q25k280O37
$$ -97 1536 -172 -1449 43 1445 417 -1351 -220 1648 385 -1476 -461 1506 681 -1599 -962
3089i62K295l99k240L01K293l38k089JK267j4k302j77K318K01k248m17K224R38
$$ -962 1333 934 -1306 -1005 1288 950 -1139 -1138 1129 1115 -1187 -1364 954 1155 -1093 -1510 714 1652
3107A652k316j018K263J061k070j182J992J341j829j600J704J729j582j988J696
$$ 1652 -664 -1682 581 1642 -428 -1610 382 1723 -106 -1706 -2 1727 145 -1843 -147
3122a47J785j449k072J315K398j262k173Q64K597j017k521N89K741m99k615J69
$$ -147 1638 189 -1883 -568 1830 568 -1605 -741 1856 839 -1682 -1093 1648 1149 -1466 -1297
3138a297K625Q1k683k71K803K49k702m16K451R14k621r32K724Q52k334j352K534
$$ -1297 1328 1409 -1274 -1545 1258 1507 -1195 -1611 840 1754 -867 -1799 925 1777 -557 -1909 625
3155F25J436k368j615K268J736k163k114K000K407j937k225J535K650j656k666
$$ 625 2061 -307 -1922 346 2082 -81 -2195 -195 2212 275 -1950 -415 2235 579 -2087
3170b087J492K627j066k773Q68K941p51l170O76K841N9l208j33L155J11k850m42
$$ -2087 -595 2032 966 -1807 -939 2002 1251 -1919 -1243 1598 1657 -1551 -1684 1471 1582 -1268 -1710
3187a710K832N92k834j009L121J171l123j126K798J442k723j726K602K074k577
$$ -1710 1122 1714 -1120 -2129 992 2163 -960 -2086 712 2154 -569 -2295 307 2381 -196
3202a96k237K477K330k254k648K267K607j847k910J755K935j411l033J195L132
$$ -196 -2433 44 2374 120 -2528 -261 2346 499 -2411 -656 2279 868 -2165 -970 2162
3217B162j037l054P66L261n48l475L17L306J79l442l03L628K19l326q11L348J143
$$ 2162 1125 -1929 -1163 2098 1550 -1925 -1608 1698 1877 -1565 -1868 1760 1979 -1347 -2158 1190 2333
3234B333l498j017L011J584l118j645K955J870k888k099K597K464k541k397K252
$$ 2333 -1165 -2182 829 2413 -705 -2350 605 2475 -413 -2512 85 2549 8 -2389 -137
3249a37K584k104k860K009K984j833l076J454L231j061l423P32L613r45l263P05
$$ -137 2447 343 -2517 -508 2476 643 -2433 -979 2252 1191 -2232 -1500 2113 1168 -2095 -1390
3265a390L299j38l624J60L555J90l679k95L472M58l430r90L451J533l603j403
$$ -1390 1909 1771 -1853 -1693 1862 2052 -1627 -1922 1550 2008 -1422 -2412 1039 2572 -1031 -2434
3281b434L196J636k918j926K586K292k646k319K512K486k281k669K095L013k028
$$ -2434 762 2398 -520 -2446 140 2432 -214 -2533 -21 2465 184 -2485 -390 2623 595
3296E95l177J744L297j416l359J058L463j086l467R53L510m75l532K28L557Ql547
$$ 595 -2582 -838 2459 1043 -2316 -1258 2205 1119 -2348 -1395 2115 1640 -1892 -1664 1893 1901 -1646
3313a646k62L395N65l404p88L462Q11l338j084L347J292l035j608K568K332l082
$$ -1646 -1908 1487 2052 -1352 -2140 1322 2133 -1205 -2289 1058 2350 -685 -2293 275 2607 -475
3329d75j960K665K251k527k468K152K885k002l076J928L159j750l135J454K967
$$ -475 -2435 230 2481 -46 -2514 -362 2523 521 -2555 -627 2532 782 -2353 -899 2068
3344B068j051l330Q81L421n34l339L37L413p5l537q9L424L79l413n80L301Q86
$$ 2068 1017 -2313 -1432 1989 1455 -1884 -1547 1866 1791 -1746 -1835 1589 1968 -1445 -2025 1276 2162
3361B162l099j493L351J411l124j590K839J881k711k037K615K245k341k592K275
$$ 2162 -937 -2430 921 2332 -792 -2382 457 2338 -373 -2410 205 2450 109 -2483 -208
3376b08K603j816k784J700K766j750k792J550K949j237k837P13L068o80l228N74
$$ -208 2395 579 -2205 -505 2261 511 -2281 -731 2218 981 -1856 -1143 1925 1245 -1983 -1409
3392a409L099q0l215j89L446L16l394n38L162Q73k971j091K904J312k784j601
$$ -1409 1690 1610 -1605 -1794 1652 1968 -1426 -1964 1198 2071 -900 -1991 913 2225 -559 -2160
3408b160K718J607k534j817K384K183k322k318K167K356k035k380J744K407j461
$$ -2160 558 2165 -369 -2186 198 2381 59 -2259 -92 2264 229 -2151 -407 2000 539
3423E39k660J436K716j290k629Q37K987q83k867M81L088k72k981r1K966K67k970
$$ 539 -2121 -685 2031 741 -1888 -1051 1936 1053 -1814 -1333 1755 1483 -1498 -1589 1377 1644 -1326
3440a326l53K733O91k737n09K430R16k613j037K425J325k344j544K098J707j924
$$ -1326 -1679 1054 1745 -992 -1501 929 1845 -768 -1805 620 1945 -399 -1943 155 1862 -62
3456f2j842J763K173j769k193J599K139j291k358J392K198r51k595J170K276p47
$$ -62 -1904 -141 2032 263 -1930 -331 1808 517 -1841 -449 1749 798 -1797 -627 1649 902
3472I02k460N28K628n01k459MK724n4k474j05K381L38k469n54K445N36k020j048
$$ 902 -1558 -1030 1598 1097 -1362 -1358 1366 1312 -1162 -1267 1114 1452 -1017 -1571 874 1410 -610 -1658
3490a658K035J190k055j087J720J400j660j321J354J769j468j866J432J702j266
$$ -1658 377 1567 -488 -1575 145 1545 -115 -1436 -82 1687 219 -1647 -215 1487 221
3505B21j694R46K058j039j917P42K043n62j994K61K099J5k266J30K037m4j899
$$ 221 -1473 -527 1531 492 -1425 -683 1360 798 -1196 -935 1164 1179 -1087 -957 1080 1036 -863
3522h63k09J911K06j863o24K208N55j927p84J650R51j684p51J494J056j596q68
$$ -863 -1072 839 1045 -818 -1442 766 1321 -606 -1390 260 1211 -473 -1224 270 1326 -270 -1138
3539a138J009J623j475j331J249J513j106j648J109J545q47j617N36J706o01j607
$$ -1138 -129 1494 19 -1312 -63 1450 344 -1304 -195 1350 503 -1114 -578 1128 527 -1080
3555a080N17J351L1j662r8J707Q9j708n0J472M46j512n62J582L56j409l33J029
$$ -1080 -563 788 819 -843 -941 766 855 -853 -903 569 1015 -497 -1059 523 879 -530 -863 166
3573A66Q23j231r29J419Q51j222q33Q35J206j038r41P13J149o59j178M77J237
$$ 166 989 -242 -1171 248 1099 -123 -956 -121 1085 47 -894 -181 968 309 -869 -392 845
3590H45l36j353L26J404l82j392K15J397j26j293Q6J279j66r52k98J251K78j148
$$ 845 509 -844 -518 886 504 -888 -673 724 598 -695 -609 670 504 -448 -746 505 783 -365
3608c65l61J099M88j329l15R54M97p80n60M19J253j168n00Q06N50n57p53M39Q33
$$ -365 -726 373 861 -468 -783 171 668 -112 -672 -253 1000 -168 -668 138 688 131 -622 -183 650
3627F50o02p99N80O62k68r16L88Q41j2j141J95R72r0r34L4Q11K2p30j65R14J32
$$ 650 48 -751 -171 491 223 -693 -305 536 524 -617 -422 550 460 -474 -440 371 393 -337 -502 412 544
3648E44q50j26N21M94p15m78P35L44n87l55L83N60m22p22O77L72l73l74J77O72
$$ 544 -306 -432 89 583 -132 -610 125 469 -118 -473 -90 470 48 -674 3 375 2 -372 -195 477
3668D77k27p23L51M33Ro89J29M36K06o72j52Q46j14o41L3O35L5n79j23N24J02
$$ 477 250 -473 -122 311 320 -369 -240 196 402 -270 -422 424 310 -331 -298 337 372 -207 -330 194 296
3689B96m93j95M13L08n26k95M74L32m61k83L45M52k98l88K98K55j96k59o8N53
$$ 296 -197 -392 21 329 -197 -492 -18 314 -147 -430 -85 367 69 -319 -21 234 38 -221 -289 264
3709B64k38l36M4M15l2l14q7M99q1k59j42M46K6l59PJ33K32m16j20M16J63m83
$$ 264 26 -310 -266 149 117 -197 -284 215 134 -125 -267 179 205 -154 -147 -14 218 -198 -318 98 261 -222
3731b22Q3P6J58Pl44J65K97k33j0o3J53J05k15k23K53o2j04J72J17n0j15j58L75
$$ -222 -139 -63 95 102 -242 -77 220 -13 -23 -86 67 172 -43 -266 -13 -75 -179 -7 110 60 -55 -213 162
3754A62j7m28K18L05J3m62J40N3K28k60p7K02m7j72L1P2J82j05j28J71j33J8j9
$$ 162 145 -283 -65 240 253 -209 -69 -16 212 -48 -125 77 30 -142 -111 -39 143 38 -90 81 -52 -34 -53
3777e3l5K33l3j91O9n0K17k38K6K00o5j44o6J65q9m8j06J98O6k73J12K24k7j90
$$ -53 -88 145 112 -79 -10 -60 157 -81 -55 145 80 -64 -130 35 -54 -102 -208 -10 56 -217 -105 119 92 -98
3801i8m0K33J27j08o9J22J42l36q4J08J54j45p5l9K46r1j72Q3J55J3k09N5L4R7
$$ -98 -138 95 222 114 45 167 309 -27 -111 -3 151 6 -69 -108 138 47 -125 -42 113 126 -83 -28 6 103
3825A03l95K09J89P5l39J99j29L4K6L1M7KK8j10J8J36k49k1J00J47j91k18L82
$$ 103 -292 -83 106 181 -158 41 -88 -54 -28 3 50 52 80 -30 -12 124 -125 -146 -46 101 -90 -308 74
3848G4J2j24p8n4L26l40P8J17n9mN2j39K12Q0k62N9K57k73j00J33J22o9p5K19
$$ 74 86 -38 -116 -170 156 -184 -106 11 -48 -52 0 -139 73 153 -109 -50 207 -66 -166 -33 89 20 -55 164
3872A64k05J94k37NJ67j3j0j06J2K5p4J24L1k5P8k50J41k23K85J25k78R0p8o3
$$ 164 -41 153 -84 -79 88 75 65 -41 -29 -4 -78 46 77 52 130 -120 21 -202 83 208 -70 20 -58 -121
3896a21N8K44k56J38J36k06K1Q3j24J76k35J24N2nK3k42J03p7J25l9N4L9j29o0
$$ -121 -63 181 -75 63 199 -7 14 97 -27 149 -86 38 90 85 108 -134 -31 -108 17 -22 32 71 -58 -118
3920a18J34K5m9j74R8J91j37O8k3R6q8j39j9K70m0r1M3p1K8J14k50K42j50l6o2
$$ -118 16 41 -8 -182 -84 107 -30 38 15 111 23 -116 -135 135 95 4 47 -24 4 118 -132 110 -40 -76 -138
3945a38K09J61j50k79K00ok5k7m9QJ55j81%K64p5j42LL05l44K4j1K33o1k11K33
$$ -138 71 232 82 -197 3 -3 -28 -55 -104 -96 59 -122 -122 142 67 -75 -72 233 -111 -87 -98 135 74 -137 96
3970I6j26O6j24J60Lr1q0J72j42J11j47J97J24k08p1l8K41j06j39j8K20K6j56
$$ 96 -30 36 -88 72 75 -16 -96 76 -66 45 -102 95 219 11 -60 -98 143 37 -102 -120 100 126 -30
3993c0r7J90l5j45L8K50k45q1J20K5n6Oj12J49K03j38j95J98J91k46Kj3L35k41
$$ -30 -127 63 28 -117 -79 171 -74 -155 -35 -10 -66 -60 -172 -23 180 42 -153 45 236 -10 -8 -21 314 73
4017G3j61j36K36M9k50J87Q8q6K1j23L28j82k16J45J13J27k63r0R5J02j80K6J68
$$ 73 -88 -224 12 61 -189 -2 86 0 21 -102 226 44 -172 -27 86 213 -50 -140 -45 57 -123 -97 71
4040G1J08j18n7K5J33k06r8O0K59k12j97M39J6k91k34K94O5k58J7L01N0j43j52
$$ 71 179 61 4 29 162 -44 -142 -82 177 -35 -232 207 223 -68 -302 -8 57 -201 -184 117 167 24 -128
4063a28J49R8p2n4k51K33J80k31RQ8K9j54m6K92j37m26L50J03nj02n5L03j82J7
$$ -128 21 119 47 -7 -258 -25 155 -76 -67 21 50 -104 -150 142 5 -421 -71 32 27 -75 -130 173 -9 8
4087Hj76L85j52k8l95M82J66pk96l2K98k59j5j76M22k04j61J69L9j66o%L20p5
$$ 8 -168 217 65 37 -358 124 290 283 -13 -45 253 -6 -21 -197 225 21 -140 29 68 -98 -104 -104 216 141
4111A41j87j1K87j88j67p7L40rj31j25K50p7j76JK33R8k85p7K20K29l87J10j0
$$ 141 -46 -57 230 42 -125 -202 138 129 -2 -127 123 46 -130 -129 104 202 -83 -160 60 289 -98 12 2
4134BJ54n7k28RK73k60j80M74k0j68j87K22K41k98Q3k33K65o3L3j96J25O0j45
$$ 2 156 99 -129 -120 153 -107 -287 187 167 -1 -188 34 275 -23 60 -173 92 29 62 -134 -9 51 -94
4157i4j2K95M9l60MJ62N9m9j73K48N7k47j45K13J41k69M5R2k18K16r8K70J56l63
$$ -94 -106 189 238 -122 -118 44 103 54 -119 129 186 -61 -206 7 148 -121 -76 16 -202 14 -84 186 342 -21
4181b1j16J93L4L4j60j8J06L9l65M40k7j49j06L5K45j22j35J25nJ87k09m8J02
$$ -21 -137 56 90 124 -36 -54 52 91 -274 166 139 -10 -116 -81 164 42 -93 32 27 214 5 -43 59
4204E9J96l02jJ82k33lN1J49j15m3k40M34j28Q0k04J08o4mJ9O9R7m6k77J52n0
$$ 59 255 -47 -48 134 -99 -102 -51 98 -17 -60 -300 134 6 86 -118 -10 -74 -78 -59 10 107 61 -216 -64 -114
4229a14K70j74j33K25q0n0r6K40k2L1j24n7K25j61o3L03k00L6j90J37rM2j69J88
$$ -114 156 -18 -151 74 -6 -56 -152 88 66 97 -27 -84 141 -20 -83 220 20 56 -134 3 -6 36 -133 55
4253E5N1P7k89J36L2J6j13P0j5J60l12J92r2J25M6j41R6l8j20K6K23j28p5PO5
$$ 55 106 183 -106 30 62 78 -35 35 20 180 -132 60 -32 93 139 -2 94 56 -64 -38 185 57 -18 -11 54
4278E4j82Q0q6K24J2j97J98k16R3op2P7J8o4o6n8J50Q3j99J11J03j35J38j69K15
$$ 54 -128 -48 -134 90 102 -95 103 -113 -20 -26 -98 -21 -3 -67 -133 -191 -41 42 -157 -46 57 -78 60 -109 106
4303A06m7j08NJ43k16P6o8J25k06L64k98J26N1j18J59pq3l2j75K78N8o6M4o5O0
$$ 106 59 -49 -44 99 -117 -41 -109 16 -190 174 -124 2 53 -65 94 87 4 -28 -203 75 133 67 111 46 106
4328A06P5m11J48M4P3rO0K4K7l08J81M9q7O4k82K36J73n5p5o3Q1Mk43J22M0P8
$$ 106 181 -230 -82 -38 35 26 86 110 137 -171 10 59 -28 36 -246 -10 163 108 33 -30 51 55 -188 -66 -26 52
4354E2j76J27M6N8j32J25j04L8n7l3K01j00l2J55j54L0j29L2j2q5J55k5l9J1l1
$$ 52 -124 3 49 107 -25 100 -4 34 -23 -56 145 45 13 168 14 44 -85 -53 -65 -150 5 -20 -59 -48 -79
4379g9j21J31J18j30o3J03K7K2K6j98J13nJ0J14Nq5o7J41q6mj66K81Q1r6j30p1
$$ -79 -200 -69 49 -81 -144 -41 -14 8 34 -164 -51 -56 -46 68 73 -12 -79 62 -24 -28 -194 87 168 72 -58 -129
4405a29R6k5nJ14J03k5k02l8O6Q2p6Q4K8P0M0p5r9n8P7j11P0P4m2O8j49J02qj90
$$ -129 -33 -58 -63 51 154 129 -73 -111 -45 37 -39 45 73 143 183 108 9 -49 28 -83 -13 61 19 87 -62 40 32 -158
4433a58J15J57P7l86K17P3k9q4j07K56j16j75J60L5m5J07LK2r2NJ11j83K0J1Q2
$$ -158 -43 114 191 -195 22 95 66 -18 -125 131 15 -160 0 35 -10 97 100 122 30 35 146 -37 -17 -6 76
4458G6k5L2j27QO7o2p2J20j4Q4J10l42R8N3l5l0K53k87J46O9j66J17j14k0J89
$$ 76 51 83 -44 -36 31 -31 -103 17 3 87 197 -145 -47 6 -29 -59 194 -93 53 122 -44 73 -41 -61 128
4483A28j86jl6R1j01L3O3J22n2M8q6N9k97r1M08j60J61j33l0J44r8n4O3J01j43
$$ 128 -58 -59 -95 -4 -105 -72 -9 113 61 109 23 82 -215 -306 102 -58 103 -30 -60 84 -14 -68 -5 96 -47
4508d7K2K1Q8q5k00K45o5Rq2J63j6J71k39j58L20q2r4r6K49k36O3R0K1k8n7M7
$$ -47 -25 -4 84 -1 -201 44 -21 -12 -94 69 53 224 -15 -173 147 65 -29 -125 124 -112 -49 41 62 34 -23 24
4534B4j8J1j40R2RJ02j62Q1k7K32j04j73j05L37k39J8j04J66k7r2MM55k35k19
$$ 24 6 17 -123 -31 -22 80 -82 -1 -28 204 100 -73 -178 159 -80 -62 -166 0 -27 -119 -115 340 105 -114
4558a14K27k1J24l44j7K24K39l73O0J49r5j74m3J77J44j38j85J13K97k98k40L68
$$ -114 113 92 216 -128 -145 79 318 -55 5 154 59 -115 -158 19 163 25 -160 -47 250 -48 -288 80
4580H0J17k20j91K69K2j49Qj65M96l12j17J47L61l04m82M08j0J35k45q1K90Ol12
$$ 80 197 -23 -214 55 77 -72 -64 -229 267 -45 -162 -15 346 42 -440 -32 -42 93 -152 -233 57 63 -249
4603b49p0M59M2m34K3J69M39l82l80L91K90l52k67M80K08n45o1K27J43j61l56
$$ -249 -319 140 182 -252 -229 -60 379 -3 -383 8 298 -54 -321 159 367 -178 -239 -12 131 -30 -386
4624c86M29K42j57l39l6O92k69m38J04M29j05k95Q5J95Q5n59K43L85j09m25J7
$$ -386 43 285 128 -211 -247 445 176 -262 -158 271 166 -129 -44 151 236 -323 -80 305 196 -229 -212
4645b12L49P5l87m8N06q9l47q8M81Pm10j5L09J49l83k33L54L41l66k65L65J57
$$ -212 137 212 -175 -223 283 194 -153 -241 240 247 -163 -178 131 280 -103 -336 18 359 -7 -272 93 250
4667B50l18l36M12K43j40n05K66N55k79m47K97L56j94o15K26N10m4n08j85P52
$$ 250 -68 -404 8 251 111 -394 -128 427 148 -299 -2 354 160 -455 -229 281 237 -271 -456 296
4687B96L7p24m8O66J21p10L7N52Q0m15l37O06P9m82q8M38J05l04j99K04M75m14
$$ 296 333 -391 -439 227 348 -362 -325 227 307 -108 -445 161 240 -242 -330 108 213 -91 -290 -86 389 -25
4709b5l01K87M67k87n22L40N19m68l43J03P03k55m07o5O43j67o32J65N89M5o15
$$ -25 -326 -39 428 141 -381 -41 478 10 -333 -230 473 218 -189 -254 389 222 -410 -245 344 389 -226
4730b26l20Q44j9o64r0P79J12p99J61M15K63o65k85O53J08k06m68M84L12m61k32
$$ -226 -546 298 279 -385 -475 304 416 -383 -222 193 456 -209 -494 159 267 61 -407 77 389 -72 -304
4751c04K12O30n03m44M25N06m97m75L08O07l61n98L09N41j68o37J73O90j90p00
$$ -304 -92 538 35 -409 16 522 25 -450 -142 465 104 -494 -185 356 188 -449 -276 414 224 -476
4771d76K34O75j40p64J2Q07J39q38j46P43N3n07k01O24L06p24j74N59L12m63m80
$$ -476 -242 433 293 -471 -459 348 487 -351 -497 246 299 -208 -409 215 521 -203 -377 182 494 31 -449
4792d49M97L75l44o25M79O54m60o26L20N31l1p49L24N23l32n94K93N35j9p95J88
$$ -449 48 423 79 -546 -67 587 127 -499 -179 352 321 -428 -104 419 87 -507 -214 321 302 -493 -305
4813c05P04j25p57J26P92L2q46o5P52J18o85j54N08L43n54l47O58K95o45n39P45
$$ -305 399 274 -483 -357 435 467 -379 -444 308 426 -259 -413 95 438 -116 -463 195 490 -155 -694 51
4834E1M24l23p20N84L88m55n78N18P43m97n65M00N59m71m50K17O33j09p81J42
$$ 51 475 152 -568 16 404 -51 -629 -111 632 135 -430 -30 529 58 -392 -175 458 349 -432 -290
4854b90O61k19n41K01O14j7p83p8R72r6p63p9Q03j5o60k86P37K91p07l18O99M80
$$ -290 371 152 -389 -188 426 409 -374 -452 520 424 -339 -418 385 370 -290 -576 161 452 -255 -573 126 606
4876F06o22n21O31M02m91o18O04O79n83o45L94N07k70o89M90N60j86p58L74N32
$$ 606 -16 -537 94 496 5 -613 -9 670 87 -558 -164 343 73 -616 -126 434 248 -510 -136 396
4896C96j45n44LP05l9p84Q1Q26j28q03rQ68n3m97j92O50P0o95j96N11M40p36j30
$$ 396 251 -293 -290 415 376 -408 -327 499 371 -432 -441 427 374 -123 -315 335 405 -290 -486 25 465 -271 -401
4919d01N94L95o38m19M66L95l71n01N43N69p57m15M14M78k09n46K64O06j95n65
$$ -401 193 588 -50 -469 -3 392 21 -480 63 632 -125 -540 -126 352 143 -403 -139 467 272 -293
4939b93K23M95j32p64J66N03K9p21Q5P08L4o34o4O16K30p66k52P70K00n69l89
$$ -293 -70 425 293 -471 -305 198 227 -494 -409 299 333 -301 -365 251 481 -285 -537 233 433 -136 -525
4960e25Q51J65n70l79N41L38m05n70O88J84k07n80M59N21o04l33L27N66k84o50
$$ -525 326 491 -79 -458 83 421 16 -554 134 318 111 -469 -10 511 -93 -426 -99 467 183 -467
4980d67K48O23j68p81L03N21k04l69K4M85K8n69J02M95J12o44k2L35K90n37j58
$$ -467 -219 404 236 -545 -242 279 75 -294 -270 215 243 -326 -224 271 383 -261 -283 52 342 -195 -353
5001c53M98J62k69l90M67K58n18k22L51M18n91j67K47M98l99n40N40L85j41n12
$$ -353 145 307 38 -352 115 373 -145 -367 -16 402 -189 -356 -109 389 -10 -550 -10 375 234 -278
5021b78K33L90m66j64K05L40l9o46K09M54ln17L25J80R7n46k37O67J14n55L0M46
$$ -278 -45 345 -121 -285 -80 260 221 -425 -216 238 235 -282 43 223 320 -226 -463 204 318 -237 -207 239
5043B39N7l53k84M00R5l28l8J57M15m38j82L30K52k13m33L13M77n08l87N00K72
$$ 239 296 -57 -341 59 154 -174 -212 -55 360 -78 -260 70 322 109 -324 -11 466 -42 -429 71 343
5064C43m46k83K80L38j63m03J81M69k15l05q4N32q8m50J03M55L5n08M7L24M2m73
$$ 343 -103 -386 -106 232 69 -334 -153 316 101 -204 -288 244 156 -294 -191 264 299 -209 -162 162 204 -269
5086b69R5L51J94m66j7J46L06l75p6K58O2k56k98M39K43k87m00N10R1j41m08L04
$$ -269 -174 177 371 -95 -112 34 340 -35 -111 147 209 -47 -345 94 337 50 -350 160 251 110 -298 6
5108FL67k80l90J89J32l7l05K44K84n1k94J24K30m3l10J02K98j05l34o8M10q4
$$ 6 373 93 -297 -108 24 -13 -318 -74 210 159 -135 -11 219 176 -134 -32 266 161 -173 -241 169 85
5130H5n4k45M24n3j36k89M38O6l17qK1K93l71j52L25J30k25j74J73L18o5l70p3
$$ 85 31 -214 210 157 21 -268 170 236 -81 -89 -68 225 -146 -298 27 157 -68 -242 -69 249 184 -186 -259
5153b59L48q7Kj47L29Lm34L78N5p1k54j3K68j19q2m1K33L0k61q5K52P4j41j46
$$ -259 89 2 4 -143 186 189 -245 133 188 117 -137 -150 118 -1 -83 -124 109 139 -122 -207 45 119 -22 -168
5177a68J60J33l10N7J59J03k26l0K26J0n7j79J44J62k99J28L0J39j01j19r6J47
$$ -168 -8 125 -185 -128 31 134 -92 -122 104 114 57 -122 22 184 -115 13 43 182 81 -38 -134 13
5199A3O3k28J28K35k53q9K38M7Qk22O0J13j46j65K20J52l6j78j01K00J54k36r1
$$ 13 76 -152 -24 211 -42 -131 107 154 162 -60 0 113 -33 -198 22 174 138 -40 -141 59 213 -23 -114
5222a14K14o3O7l33J66K32k39J2l7K73r4j2j88K71j45j06J38J68j84j68L3K28
$$ -114 100 37 104 -229 -63 169 -70 -58 -95 178 84 72 -116 155 10 -96 42 210 26 -142 -109 119
5244A19L5k58J02K17j95l2j13J47P0j89J76j76Q4K51l19J90j43r9J22N8j9O6O0
$$ 119 154 -104 -2 215 20 -12 -125 22 92 -97 79 -97 -13 238 -81 109 -34 -133 -11 47 28 94 154
5267A54j79M8rj3P9j74M0j5p8K99k27p2J54J68k43L3OJ30j17J47l20K41M4n2N4
$$ 154 -25 23 14 1 80 -94 -54 -69 -147 152 -75 -147 7 175 -68 -35 -29 101 -16 131 -189 52 96 44 98
5292I8j18J6n4NJ05K6j24J8P3j6J45j80K3J06j34P1n3Q7O1k69J51M2j8j03J35
$$ 98 -20 -4 -58 -53 52 78 -46 -28 45 29 174 -6 17 123 -11 60 7 94 155 -114 37 79 61 -42 93
5317I3r8R8j88J03J24j11j08L6J32r9l5J22o1n7k9O4m1J4K3m4J02l2j70J13N1
$$ 93 -5 93 -95 8 132 21 -87 -51 81 -18 -53 69 8 -49 -78 -14 -55 -41 -18 -62 40 8 -162 -49 2
5342Bj0M9p3k1J56j18J02Pp3n9j28M8J79P7j56j66K03Q4r7N5J2k7p3mJ10k7l9
$$ 2 -8 41 -32 -53 103 -15 87 94 21 -38 -166 -118 61 138 -18 -184 19 103 6 61 73 46 -27 -31 79 52 13
5369A3jp0kJ77k15N5j1M9j0q3J97j76j37J24K08l1j51l8J70p1J53j15q9K9K4K07
$$ 13 12 -58 -60 117 -98 -43 -54 -5 -15 -98 99 -77 -214 -90 118 87 -64 -102 68 -3 150 35 -54 -25 -1 206
5395B06n8k07j20J37L6k00K91j77J86j75K2N9k3J13q7j25Q5J00k7n3R3o3m2Om6
$$ 206 148 -59 -179 -42 -6 -206 85 -92 94 -81 -59 0 -23 90 3 -122 -37 63 36 -17 76 13 -29 -23 -69
5420f9m6o5P0J54Q7k79J9J86O6P8k13P3M0j94k9K1M7L6j05J35m3J86j88o0K74
$$ -69 -115 -180 -110 44 131 -148 -129 57 123 201 -12 61 101 -93 -122 -101 -54 -18 -123 12 -31 155 -33 -93 181
5445A81k00N0j67L24k20J09r2Q0P1j04q0J58L7k12M1R0J35j22kq6J12j60O2M5
$$ 181 -19 31 -136 188 -32 77 -15 65 136 32 -48 110 147 -65 -24 66 201 79 77 -9 103 -57 5 50
5469E0j6r3O6j2j5oP1n3P8Q5j88Q5j08L6R4J21l26J21J01J6j73J60k41J43K0o2
$$ 50 34 -59 7 -5 -20 -26 45 -8 70 155 -33 52 -56 -20 74 195 -131 -10 91 107 -66 94 -147 -4 16 -46
5495d6q1l4J81J85l30K95j03r7J82k15J3o5nM1J37p8l8J12qn9nRk0j76K57Qp4
$$ -46 -127 -161 20 205 -125 170 67 -30 152 -63 -50 -115 -120 -79 58 -20 -58 54 46 -13 -18 -9 -29 -205 52 60 -14
5522a4J15j08k4j50J56K22l27J06J47o2l1nj40%J53R5p5j43l2J79k27J88L6l3
$$ -14 101 -7 -31 -181 -25 197 -130 -24 123 61 30 25 -115 -115 38 133 58 -85 -117 62 -165 23 59 26
5546B6j32J69K9j89R3J05p4j40P8K42k10M1L7r3J42j19o8P8l4K0k14K19j30M3
$$ 26 -106 63 92 -97 -4 101 27 -113 -35 207 -3 38 75 -18 124 5 -63 15 -19 1 -213 6 -124 -81
5570h1K22l31K91k12J01O1r9NJ38j18m5K21j40O4o1j31R9QJ1R5k22O3K5R0m1K3
$$ -81 141 -190 101 -111 -10 51 -48 -43 95 -23 -68 153 13 77 16 -115 -16 -8 3 98 -124 -61 -36 54 13 36
5596C6r1n6K79j42j03K0q3K13p4o3M0N2j05rJ13p9K28j27J23j19lj02r8J88l8
$$ 36 -55 -111 168 26 -77 -57 -140 73 -1 -64 -24 28 -77 -86 27 -52 176 49 172 53 50 -52 -150 38 0
5621@j8O6j00jJ36j31o6K25j74N8P3KM7j12R5Q1r4l49J81J40M5q2m1O9n9m2K1
$$ 0 -18 48 -52 -53 83 -48 -114 111 -63 -5 68 70 117 5 100 181 87 -262 -81 59 104 22 -19 50 -9 -51 -30
5648c0N3k6o1J36J0p9Q7j78J38m0L4O4j8j52R0j20o9R8J10Q3k16k5J50R2j21O4
$$ -30 23 -3 -64 72 82 3 90 -88 50 10 44 108 90 -62 28 -92 -161 -63 47 130 -86 -111 39 131 10 74
5674G4o1Q0j52j0K8l4q6K35R5j90n1K58j11O7j47LJ26j22r7o0J27j04K3J26k87
$$ 74 13 93 -59 -69 -41 -75 -161 74 169 -21 -72 186 75 142 -5 -2 124 2 -95 -155 -28 -132 -109 17 -270
5699b70L02n3k4M3l0j15M9O1nJ22J6O6j38q9m8J32j19J01J63k80J26p2j10J64
$$ -270 32 -21 -45 -2 -32 -147 -98 -37 -42 80 96 162 24 -65 -113 19 -100 1 164 -116 10 -62 -172 -8
5723hj2j87J70n4k5K24O5rj97J76k00L1Pnj5l6L2L1p0Q8m0J6L9O6j42j8n3K4R6
$$ -8 -20 -207 -37 -91 -116 108 173 164 -33 143 -57 -26 -19 -24 -39 -75 -43 -12 -82 6 -34 -18 21 87 -55 -73 -126 -102 -6
5752fQ9J08j42o2j2p7K22j4j88K9k7J16rp4Q3J13j42k02J10M9n8N3m0J71j84J59
$$ -6 83 191 49 -13 -25 -102 120 106 -82 -53 -80 36 27 -47 36 149 7 -195 -85 -36 -94 -41 -81 90 -94 65
5778F5j32l7J08k5j42K18p5j34J73j51K55j13p4K12r1J9O0K3j28K6j93J14p0J98
$$ 65 -67 -104 4 -21 -163 55 -20 -154 19 -132 123 10 -64 148 57 76 136 159 31 57 -136 -22 -92 106
5802A06j87K06j57K5J5j74R9rJ10j28Q7O9j31P7JK8p6Q5j34J15n8J04j74J50k63
$$ 106 -81 125 -32 -7 8 -166 -67 -76 34 -94 -7 62 -69 8 9 37 -39 46 -88 27 -31 73 -101 49 -214
5827b14K47K4k63L43j68j7M1Oj53Q5K43j02r0J02k09K28j32N0j01o6J03k0L3q2
$$ -214 33 57 -206 137 -31 -48 -7 -1 -154 -69 174 72 -18 84 -125 103 -29 21 -80 -146 -43 -63 -30 -112
5851a12M9P1J00j95J81n5j02J24m9n9Q5j0K4m4R2K7j69K00k04J69o6j46J27j17
$$ -112 -63 8 108 -87 94 39 -63 61 12 -47 38 28 52 8 100 127 -42 158 -46 123 57 -89 38 -79
5875g9M2J23j5q7L2j34J94M5k04J42j45q1K37j65K36p1r1J16l2j09k2J25m5Pm2
$$ -79 -37 86 71 -16 16 -118 76 121 -83 59 -86 -167 70 -95 141 70 -21 95 63 -46 -68 57 12 19 -23
5900b3M1o1M3q3L7j17J74o1m2J89j31j18l4R3K21j87Q7J0o1OJ5k02J51L6M0R4
$$ -23 18 -43 0 -83 -46 -163 11 -50 -92 97 -34 -152 -186 -93 128 -59 28 38 -23 -17 -2 -204 -53 -17 23 117
5926A17L6k12N5J37l08Q5J88l6j02J95j88Q7k0j07mK4J19j06P8m0J8j13N8Q1O
$$ 117 153 -59 -4 133 -175 -90 98 62 -40 155 -33 54 34 -73 -77 -53 66 -40 38 -2 16 -97 -39 42 48
5951D8Q6N9k27K6N9j49L3N7P5k92K52J63j1l08J59p1j75K58j13L6mo4m5k3J21
$$ 48 134 193 -34 -8 51 -98 -65 -8 67 -225 27 190 179 -129 30 -41 -216 42 -71 -35 -39 -103 -148 -171 -50
5976e0P2Q9j18R6j86J02J40j83lJ80k73K46P9r0q3P2j56K4P2j21O7L2p9L7m2o5
$$ -50 22 111 -7 89 -97 5 145 -38 -41 139 -134 112 191 101 18 90 -66 -42 30 -91 -24 8 -71 -34 -76 -141
6002a41J62q1J15k6l8l8J15N9j88j33K06n8L6lk7OJ8J24p2O3J6j99J99j04m2j16
$$ -141 21 -60 55 29 -9 -47 68 127 -61 -194 12 -46 -10 -13 -40 -34 -16 108 36 99 115 -84 115 11 -31 -147
6028a47J57l5q7J04K6q0N7N3j1n5L6K6l8j25J47k8K5O2j48J06j13LP2M7o2O3r0
$$ -147 10 -25 -112 -8 18 -62 -5 48 37 -18 18 44 6 -119 28 0 25 87 -61 45 -68 -65 7 54 -8 55 -35
6055c5m8M7kQ5q8J33k03J22J39k56J52j59R4Q7j22qK3ll1%Q6j58J00J19j33O6
$$ -35 -83 -36 -38 47 -41 92 -111 11 150 -106 46 -113 -19 68 -54 -62 -39 -42 -73 -73 13 -145 -45 74 -59 7
6081Gmm4R2Q5k19Q3L7J5j10J30j13Q3J14j55k9j55K36M6p4m6N6Q3j70M1o9J51
$$ 7 3 -41 51 136 -83 0 37 52 -58 72 -41 42 156 1 -28 -183 53 99 25 -21 35 118 -52 -11 -80 71
6107G1q8q2J08K0Qm5L3p6P6O9m7l0K6j8q8P6j24K06o3m9Q3r1o1k3J99q6o3Q1j4
$$ 71 -17 -99 9 29 37 -8 25 -51 25 94 47 17 43 25 -63 13 -111 95 32 -17 66 -25 -86 -109 90 4 -59 22 8
6136HJ00j26k1N0kK33j97j91K36O0k62J35r1O4N9k03M1K90l86J25J07j73K06q0
$$ 8 108 -18 -39 11 9 242 45 -146 90 150 -112 23 -68 -4 55 -148 -107 183 -203 -78 29 -144 62 -18
6160a8oJ39l24L03n3l0p6j20J53K5n8L5%k8O1j0R4N8j29j93K61N0k19mJ35j59
$$ -18 -24 115 -209 94 41 11 -65 -185 -32 -7 -65 -30 -30 -58 3 -7 87 145 16 -177 84 134 -85 -89 46 -113
6186a13J12m9j2J59q1o7j18J58M6r4L6p3J28Pj07K08l10J70M2j59J03LJ0J18r8
$$ -113 -1 -50 -62 97 16 -51 -169 -11 35 -59 -23 -96 32 39 -68 140 -170 0 42 -117 -14 -11 -1 117 19
6211A9Nj73n0J37J10j35K60n5l20K06p0J89q4j19K41j07o3N7n4J23o8N3Mj64k9
$$ 19 24 -149 -199 -62 48 -87 173 118 -202 4 -66 123 39 -80 161 54 -9 48 -6 117 49 102 106 -58 -87
6236h7J59n9O3pj57L9k8J29j52J17k10J99j3J3N8o2J94k56M3L0j65J40J12O3j46
$$ -87 72 13 76 69 -88 -49 -77 52 -100 17 -193 6 -7 6 64 2 196 -60 -17 13 -152 -12 100 163 17
6261A7r5J98j95J50k56J50R2j22j9J7P7J2M4n2N8q1j13J25k0J11J0k31J50lP1
$$ 17 -78 120 -75 75 -181 -31 61 -61 -80 -63 14 26 70 18 76 -5 -118 7 -13 98 108 -123 27 24 95
6286I5n7J58k31K5J8J82r7j84M9K02J8k40L8K80k74p7O0J29r8q2Q5Rj49J70rR3
$$ 95 38 196 -35 -10 8 190 93 -91 -42 160 178 -62 -24 256 -18 -95 -35 94 -4 -86 -1 8 -141 29 20 113
6312A13j05k9j51J65k7J48j39m9J15j79k5O9K70k39O5l8J05p3L8M8Qj96j5K36
$$ 113 8 -21 -172 -7 -34 114 -25 -74 41 -138 -163 -94 176 -63 2 -36 69 -4 34 82 90 -106 -121 115
6336A15j11P6r3j68J60M8P6p9J36o8l1q2J40k30J74q8K1m1m8J13p1J52j50j4J
$$ 115 4 80 -13 -181 -21 27 103 24 160 92 61 -21 119 -111 63 -25 -4 -45 -93 20 -51 101 -49 -63 -62
6361f2O9j39q5K16K5J71k15j16M37j82p3J21p7j44j67L56j86o8k7J62J4o1j31
$$ -62 7 -132 -217 -1 24 195 -20 -136 301 119 46 167 90 -54 -221 135 -51 -119 -146 16 30 -31 -162
6384a62J04P0Q9r9mJ21j95k35K61O9jn9L2oJ42j10j07J60P7j05j64K32O7k8l41
$$ -162 -58 12 101 2 -2 119 -76 -311 -50 19 18 -41 -9 -15 127 17 -90 70 147 42 -122 110 177 149 -192
6409a92L81j05j03K0K33j15k11p0J20L12j50l47K23q6R4j24K04J09j50j77K47
$$ -192 189 84 -19 1 234 119 -92 -162 -42 270 120 -227 -4 -90 4 -120 84 193 43 -134 113
6430A13j61P1j76K73n8j36N5j32J42J54j86P8Q0j69m4P8K03j70j4J4K64j80r6
$$ 113 -48 23 -153 120 62 -74 -19 -151 -9 145 -41 37 117 -52 -96 -18 185 15 1 15 279 99 3
6453Ck23K42J17j51jL8J4J8j35J34Q6j11j53R2M7k3j75L11m0j14l09L48R1k07
$$ 3 -220 22 139 -12 -13 25 39 57 -78 56 142 31 -122 -30 17 -6 -181 130 90 -24 -333 15 106 -101
6477a01j19L10Kj28j28J28Q6O9j92r6J59P7k3k09O8K65k08J00M3j20p2l6J91M2
$$ -101 -220 90 92 -36 -164 -36 50 119 -73 -169 -10 67 44 -165 -97 168 -40 60 103 -17 -89 -125 66 108
6501A08p1j47K3J89j71Q5N4J93k44j40K03J13j40k68J93Q0q6k24K92L4m7k94K43
$$ 108 37 -110 -87 102 -69 16 70 263 19 -121 82 195 55 -213 -20 60 -26 -250 42 76 29 -265 -22
6524b2j7l5J46k07J86j5Lj10J22Q9l70Q7K73j58L9j27J38J27j87P5j37J47P8k07
$$ -22 -39 -74 72 -135 51 36 39 -71 51 140 -230 -143 130 -28 11 -116 22 149 -38 37 -100 47 125 -82
6548h2k5K95j5k43k4K19j74P3n9J63j64j42O3L03p9r9j49J81j31j35K01M5K65
$$ -82 -107 188 173 -70 -94 125 -49 24 -35 128 -36 -178 -115 188 109 10 -139 42 -89 -224 -23 22 287
6571B87m22m5K04l0j78K70M4K1j34k90K68J22k77J32RJ39k29J6J74j34J81o7j46
$$ 287 -135 -180 24 -6 -184 86 130 151 17 -273 -5 117 -160 -28 -19 120 -109 -93 81 -53 128 61 -85
6594h5K08j43o2K98j26j24j85L02J69j43k21k0J72J01j07j64K57J0l18J04N6K6
$$ -85 123 -20 -82 216 90 -34 -219 83 252 109 -112 -132 40 141 34 -130 127 137 -181 -77 -21 5
6616EJ3r4p8K81p4q3L8K5%k0P8r2J13k22J25L2L5k39M9K26j71j53O1J18L9j21
$$ 5 18 -76 -154 127 53 -30 8 33 33 13 91 -1 112 -110 15 47 82 -157 -108 118 -53 -206 -145 -27 12 -109
6642a09J22R6k04n8J34J10k9j53R7Q9O8k73o8L79j28j07j8J83j15j06p0K06PQ
$$ -109 13 109 -95 -153 -19 91 62 -91 6 95 163 -110 -178 201 73 -34 -52 131 16 -90 -160 46 53 61
6666F1j88J10K46k15j57K13O4k70PM4K6N9j19M2J81j68O2p5J14Q9k54J4K12m8
$$ 61 -127 -17 229 14 -143 70 134 -136 -129 -85 -59 0 -119 -77 104 -64 -2 -77 37 126 -128 -114 98 50
6690E0k19K76N9j4l10KL23k78J37j13LQ1l7J23j46J11r0j49K33N2j76j4J3L01
$$ 50 -169 107 166 152 -158 -156 167 -111 26 -87 -84 -3 -40 83 -63 48 -42 -191 42 94 -82 -96 -83 218
6714B18l33Q8r4J05j12O1J01R2j15l8o7K9R4j89J57J41j14j72J25o4K63k66J3
$$ 218 -115 -27 -121 -16 -128 -67 34 126 11 -27 -94 -65 29 -160 -3 138 24 -148 -23 -87 176 -90 -77
6737g7J24P6k94R1J58m2J15j89J10K04l28j65J94k8j5r1K51Qr8j79R0J01ll9M8
$$ -77 47 123 -171 -80 78 36 151 -38 72 276 -52 -217 -23 -51 -66 -157 94 102 4 -175 -85 16 13 -26 22
6762B2N8k50J81O9Q6ok71K56O2j22k64N4Q4P4J3j29J35L4j46J30mj54P1K3J46
$$ 22 80 -170 11 80 166 160 -111 145 207 85 -179 -125 -41 33 46 -83 52 86 -60 70 66 -88 -17 6 152
6787A52p6j87m5J55J35j14j01n2L04k43l5Q0Q0m4K0K09Rl61R0L1J04j27j3q8K10
$$ 152 76 -111 -156 -1 134 20 -81 -133 171 -72 -107 -27 53 9 29 238 247 -114 -24 7 111 -16 -29 -117 93
6812I3K7j17j65J73k8p5L1N8p1O6k4o7J75j7j11K32j46j34K5K65j63J1k09R9J39
$$ 93 120 3 -162 11 -17 -92 -61 -3 -74 -8 -32 -99 76 59 -52 180 34 -100 -75 190 27 38 -171 -72 67
6837F7q1j65J67O8k31K94l9p3J4o5n4K41j48rj40J64N9j43P0o7j62Q8N6K32o4
$$ 67 -14 -179 -12 56 -175 119 80 7 21 -44 -98 143 -5 -14 -154 10 69 -74 -4 -71 -233 -145 -89 143 79
6862G9k60j0K69k2J86l24Q0K7n0rM2On7K2J79j52l2n5K75m9k38j5j76L64P6m9
$$ 79 -181 -191 78 56 242 -82 -2 25 -25 -34 8 14 -43 -21 158 6 -26 -81 194 145 -93 -108 -284 80 156 107
6888A07k68J77q5O9l5k9J16p8j10J63N5k62J21L5J8N7j20R7k3R6n2L3j04Kl8J56
$$ 107 -161 16 -69 0 -35 -64 52 -26 -136 27 82 -180 -59 -24 -6 51 -69 28 5 101 49 82 -22 -20 -58 98
6914I8k8j79K0m5J20j51k5K63q1K2L1N2r3m7P3J7R0k36K6J23J84j98k59J44J09
$$ 98 70 -109 -89 -134 -14 -165 -190 73 -8 14 45 97 4 -43 30 47 137 -99 -73 50 234 36 -223 -79 30
6939C0j78N6J97j3j55j6O5%R5j77J04j0R6k65J72j68J12J2o9K13j26J12p3p5J78
$$ 30 -148 -92 105 92 -63 -79 -14 -14 81 -96 8 -2 94 -171 1 -167 -55 -43 -112 101 -25 87 14 -61 117
6964A17j77K7j37K10KN2r8O4n0QN5o9J31j07j1k62J49K2K16l19j6K48M8K1j10
$$ 117 -60 -33 -170 40 42 94 -4 60 10 18 73 4 135 28 17 -245 -96 -74 142 -177 -193 55 103 124 14
6989A4k4o2J16J38j26j3O1lNj51P5K20j61o8p6J04P5j35J1m2J01k1j41J54m1m1
$$ 14 -10 -72 44 182 56 43 104 101 106 -45 30 250 89 21 -55 49 124 -11 0 -42 59 38 -103 51 10 -31
7015c1mk2K02j30J18k87K41j36O2j6K6p2J63j58J62j34j12jK55r3j03J12O5p6
$$ -31 -35 -57 145 15 133 -154 87 -49 13 -3 23 -49 114 -44 118 -16 -128 -129 126 33 -70 42 107 31
7039C1o4J03J5j16J25p9m8K04l71J20J31m1m2j6J43j40l6R8o1L2K9K9j62K09j15
$$ 31 -33 70 85 -31 94 15 -33 171 -200 -80 51 10 -32 -48 95 -45 -81 17 -44 -12 17 46 -116 93 -22
7064b2M3j70K63k53J78N7k62K42r9j0M9krQ1p8R6j14j10l2K91j44P8j15n6J71
$$ -22 21 -149 114 -139 39 96 -166 76 -23 -33 16 14 5 86 8 104 -10 -120 -152 139 -5 73 -42 -98 73
7089G3Qm1R4j14j27K6Q4j92Q7Nm7R4M3R0j73J38k3k2j40Q7q6O5K7j6K31p0p2k03
$$ 73 81 40 134 20 -107 -81 3 -189 -102 -97 -144 -50 -7 83 -90 48 25 3 -137 -50 -136 -71 -44 -60 171 101 29 -174
7117a74K58q9J21j11j28j5O1J04r7L3r4J91l0l2j7o5rJ32m1m0N9J4o3K13j35m8
$$ -174 84 -5 116 5 -123 -138 -77 27 -70 -37 -131 60 30 -2 -19 -84 -93 39 -2 -42 17 31 -32 181 46 -2
7143bo5K14j52Q5k76J95K0K9P2o3j22O9K22k04N1k35J01M2J04j34m6%k9Q8K8J5
$$ -2 -67 147 -5 80 -196 -1 19 48 120 57 -65 4 226 22 73 -162 -61 -19 85 -49 -95 -95 -124 -36 -8 7
7169Gj23J87Q7l44K06m2L6q5J34j82P7J01j66K8O9O6k27J29Q6k31J75K26k59m6
$$ 7 -116 71 158 -186 20 -22 14 -71 63 -119 -42 59 -107 -79 -10 56 -171 -42 44 -187 -12 214 -45 -91
7193i1J08j23N5j9NK0l3j13K20J07r8l3o7n2K18k51N9J1J78j79nO1J15K7j20q5
$$ -91 17 -106 -51 -70 -65 -45 -78 -191 29 136 38 5 -62 -114 104 -147 -88 -77 101 -78 -83 -22 93 120 0 -85
7219h5J09lj29R3R5j88J64j74J85m9n3M1j01l3M5J95k18kJ04j38J81j2K3n5j51
$$ -85 24 21 -108 -15 80 -108 56 -118 67 18 -35 6 -95 -128 -83 112 -106 -108 -4 -142 39 27 50 -5 -156
7244a56J23M8J8j0P1k5P6j97K8j1R7j0k16J82%J0j38K41j37J4j4J24L7k21j14
$$ -156 -33 15 33 23 94 69 145 -52 -24 -35 62 52 -164 18 18 28 -110 131 -6 8 -6 118 155 -66 -180
7269a80J46r0K10j05Q5l8J7l0j69J27K6j01J37L0k08J32L4J31j05%j78J74k6j27
$$ -180 -34 -124 86 -19 66 28 45 15 -154 -27 -1 -102 35 65 -143 -11 23 154 49 49 -129 45 19 -108
7293a08K7J07K4k7po2j88J34J54j19k6O4L5l7P5j97J06K9K3j08K12j10k5J91k06
$$ -108 -81 26 50 23 16 -46 -234 -100 54 -65 -91 -27 8 -29 46 -151 -45 -16 7 -101 111 1 -24 167 -39
7318c9J60j48j27O2K42q8j69J27O7Qr9q1l8q1J09N8K5jp3Q1l7Q5q5J07O7r6q3
$$ -39 121 -27 -154 -92 150 62 -107 20 87 95 -4 -85 -123 -204 -95 -37 -12 -13 -86 -5 -42 43 -42 65 132 36 -47
7345d7N5LK5jk1J14o3K0j18Q4o6Q1r5l7J05m5j67J85M3j91J44L1j47K3L3oP1j11
$$ -47 8 11 36 35 14 128 65 85 -33 51 -15 66 -29 -66 39 -6 -173 12 55 -136 8 39 -108 -85 -52 -58 13 -98
7373i8K80k95j1K36j56K60l00n6J85M9m9K4p0m2o4j6M5O1L9j75J55M5M6j22l7
$$ -98 182 -113 -124 112 -44 216 -84 -140 45 94 45 69 -1 -43 -107 -123 -78 -17 22 -153 2 47 93 -29 -66
7398f6J17r9M2O3n6m5pJ59j26Q5l7L8k3j50J24KM3j33J94q9ok32J65J49R5j79
$$ -66 51 -48 -6 57 1 -44 -51 108 -18 67 30 68 45 -105 19 21 64 -69 125 36 30 -202 -37 112 207 28
7424B8j04j92K27QRJ17j56k7O2j08N8J03j05k6q1K56k04L6Q3n8O6l8j3o9P9J57
$$ 28 -76 -268 -41 -33 -24 93 -63 -90 -28 -136 -78 25 -80 -106 -187 69 -135 -99 -16 -74 -8 -46 -59 -128 -49 108
7450A08k3mj61n5R6j9L0j36K21L9j0l0N8LOj33Q5k01N0J08j23K50j62K0p0O4M4
$$ 108 85 81 -80 -135 -39 -58 -28 -164 57 96 86 56 114 117 123 -10 75 -126 -76 32 -91 159 -3 17 -53 11 55
7477E5k9OL8k46K31q7j3NJ46k04J59p9r4J04R1q2J2j46j25K50p0J2J02p7P8j93
$$ 55 26 32 70 -176 55 -32 -45 -40 106 -98 61 -18 -112 -8 83 1 13 -133 -258 -8 -78 -66 36 -41 37 -156
7503a56J68o7p%l6J30rk1L3R5j11R8p5m9K12j89q3J04j40O0L4j3J28k87J82J57
$$ -156 12 -55 -62 -62 -98 32 23 2 35 130 19 117 42 -7 205 16 -67 37 -103 -43 -9 -22 106 -181 1 158
7529A58j70j34J32k8Q9j25J57j74J69j53J45k37J97q8J76k02J0J03n0O1nJ13k34
$$ 158 -12 -146 -14 -42 47 -78 79 -95 74 -79 66 -171 26 -62 114 -88 -78 25 -25 36 31 144 -90
7552i0m6J27Q0n9N0l3M6j09J26p6L8j93P2J41k20J28r4J54J6m9JJ14n9N6J3j27
$$ -90 -136 -9 71 12 62 29 75 -34 92 16 54 -139 -67 74 -146 -18 -112 42 58 9 10 124 65 121 134 7
7578Gj23N6j30J40J3n2K14l6j12l9J83j57PR9j85O5R8poJ5J06j96K7J35r7k7l2
$$ 7 -116 -60 -190 -50 -37 -89 125 89 -23 -62 121 -36 -29 70 -115 -50 48 41 35 50 156 -40 -13 122 25 -2 -34
7605c4kj23L14j54jL5l4j20J27rJ35k08P6L8j1J0j07P2K7l8J9P1Q3k56J14J1%
$$ -34 -36 -159 155 1 0 35 1 -119 8 -1 134 -74 2 40 29 39 -68 4 31 -7 12 83 166 -90 24 35 35
7632C5J04jk17M6J01J4p0J10nm4j45N2Mq7J39PN2k05O0k4K48k5n3j52J19J69k30
$$ 35 139 138 -79 -33 68 82 12 122 117 73 -72 -20 -16 -103 36 43 95 -110 -50 -74 174 149 96 -56 63 232 2
7659Bq6m2L5J64m8q9R8k2j01J28M9j29J01j06J12k90K44k6J65n6j74K51k8p3N3
$$ 2 -84 -126 -91 73 25 -64 34 12 -89 39 88 -41 60 -46 66 -224 20 -6 159 103 -71 180 152 79 132
7684A32j30K4n7O4K3o3J40j50O9j02l3M9N6m4J35n4j22k5J17K9j27j21L63j04
$$ 132 2 26 -31 33 56 -7 133 -17 52 -50 -83 -34 22 -22 113 59 -63 -88 29 58 -69 -190 173 69
7708F9j98K25l6o0kj32J57l0J1j58P2N8n9j11J65J69j82l2KLn9J2m4K41m8L6p8
$$ 69 -129 96 60 0 -2 -134 23 -7 4 -154 -82 -24 -83 -194 -29 140 -42 -74 -72 -69 -128 -116 -160 81 33 69 -9
7735iNK72l27N7N0p0PO9O8j80J8Q4l1j30j01M26K8k38j24K66j06l7%j60j5O4J42
$$ -9 -4 268 -59 -2 48 -22 -15 54 122 -58 -40 44 13 -117 -218 208 236 -2 -126 140 34 -3 -3 -163 -178 -114 28
7762B8J69k77K02j66k00K59j04J7q9J01O8j64K8J82j14qj17J34J33Jrj73O8K05
$$ 28 197 -80 122 -44 -244 15 -89 -72 -161 -60 8 -156 -128 54 -60 -68 -185 -51 82 83 74 -99 -31 174
7786A74j76q2j12R0K24k39N0N5j34J24o2k6K26LKq3j94m9K50j74m1K71j15m5K11
$$ 174 -2 -84 -196 -106 118 -121 -71 -16 -150 -26 -88 -114 112 115 117 34 -160 -209 41 -133 -174 97 -18 -63 148
7811A48k58J44l0P0L1j49N7m9J6n3J28%j21P9l7L5j15J51J9O2j99J28r5N5k31
$$ 148 -110 34 4 74 105 -44 13 -36 -20 -73 55 55 -66 13 -24 11 -104 47 66 128 -71 57 -38 17 -214
7836b14J61J73j8K6p4J12j38rJ1J3k3K2n6qq1K80j79M3n2j47J67r7JJ28r1Q3J5
$$ -214 -53 120 102 128 54 166 28 19 30 43 20 42 -14 -22 -103 177 -2 41 -11 -158 9 -88 -87 41 -50 33 48
7863D8l5k9P5K4l4q5k1K38kj52q6J19J2q4j15J53o3J15k05J23j54J04L6J72J8
$$ 48 13 -16 59 83 49 -36 -57 181 179 27 -59 60 72 -12 -127 26 -37 78 -127 -4 -158 -54 -18 154 172
7888A72n9j20R1j03m2j02OO1J66j4Jl7N9j0j56N6L6J04k11o1L6j7N2R0L2k31K80
$$ 172 113 -7 84 -19 -61 -163 -157 -96 70 56 57 20 79 69 -87 -31 5 109 -102 -163 -127 -144 -92 -2 30 -201 79
7915G9k45K49o9j08J38j60J11k1J24p7J30k25N7o1J32j07J94p4L2j92k7L48j88
$$ 79 -166 83 14 -94 44 -116 -5 -26 98 21 151 -74 -17 -78 54 -53 141 67 99 -93 -120 228 40
7938D0k0j27J37O8j49K8k06L03j97J03j33P9J6L9K30j11J7j69J58k2j77L8j8Q5
$$ 40 20 -107 30 98 -51 -23 -229 74 -123 -20 -153 -74 -58 -19 211 100 117 -52 106 84 -93 -55 -73 12
7962A2j0p6R5m0K16j14j02N8j00p4J94j11O8j29K31j35Kj5Q8k5n9O7r0n8J29o4
$$ 12 2 -74 21 -19 197 83 -19 39 -61 -135 59 -52 16 -113 118 -17 -15 -30 58 33 -26 41 -49 -107 22 -42
7988d2L8n5N3K7j04K82k23r4o2K57Q0j05j46M5K39j05p4R2J3j1l6k22K15m5J25
$$ -42 -4 -59 -6 21 -83 199 -24 -118 -180 77 157 52 -94 -49 190 85 11 103 116 105 69 -153 62 17 142
8013A42k03J48j53k1J19J12r1j04p6K3L3J26J7N6k14K18k35j6K6j44J66Q6N7q2
$$ 142 -61 87 -66 -87 32 144 53 -51 -127 -104 -71 55 72 128 -86 132 -103 -119 -93 -237 -71 15 72 -10
8037a0Mp1R4p5J8j47J93j50J00p9K06j09j63Q9J20j21Q7Q6O9j11P4k61L06j20
$$ -10 -6 -77 17 -58 -40 -187 6 -144 -44 -123 83 -26 -189 -100 20 -101 -14 72 141 30 104 -157 149 29
8061B9l1J06j23J22j45m1L27m40J74J4j04K29j61K8%P6k17K46j91J96l1p7K0J38
$$ 29 -2 104 -19 103 -42 -83 244 -196 -22 -8 -112 117 -44 -16 -16 60 -157 89 -102 94 63 -14 6 144
8085A44j97m6J70q0LqJ25p7K2j89Q4J24jj17R5M9p2j2N6J14j53q0j1Q2N0M4r4
$$ 144 -53 -99 71 -9 -6 -14 111 34 56 -133 -49 75 74 -43 52 101 29 17 73 187 34 -46 -57 25 75 119 25
8112B5j39J7J01o3R1O2q8j6K11j72O8p1kO3J2k12J35n1N9q5J08LM1r9o6O8n1K4
$$ 25 -114 -97 4 -59 32 94 6 -10 201 29 97 26 24 87 99 -113 22 -29 30 -55 53 56 97 -2 -68 0 -51 -27
8140b7P2o7n2N0J29j55o0J2K3J62r5M6P3n9K5p2j14K86j31m6j02R9o2N6j36J48
$$ -27 45 -22 -74 -24 105 -50 -110 -98 -75 87 -8 38 111 52 77 5 -109 177 46 0 -102 -3 -65 -9 -145 3
8166Cq4l4J38M1m9Rr6r5K65R3j79k6o6j7kQ7J62r2m1j24Q8P3p6j62K85
$$ 3 -81 -115 23 64 15 24 -72 -167 98 191 12 -14 -80 -97 -99 -12 150 58 17 -107 -19 54 -22 -184 101
8191A01
$$ Imaginary data points
##PAGE= N=2
##DATA TABLE= (X++(I..I)), XYDATA
0@%%%%%%Qj6J6j6J6k4L2m0N6p2Q3r9J28j53J78k17K62l11L62m18M90n71O57p58
$$ 0 0 0 0 0 0 0 8 -8 8 -8 8 -16 16 -24 32 -40 43 -56 72 -81 97 -120 142 -169 193 -225 265 -306 351 -407
30d07Q71r92J129j282J450j636J836k055K302k571K863l186L536l916M333m789
$$ -407 464 -528 601 -681 769 -867 969 -1086 1216 -1355 1508 -1678 1858 -2058 2275 -2514
46b514N292n839O433p089P813q605R482j0460J1550j2779J4169j5758J7600j9755
$$ -2514 2778 -3061 3372 -3717 4096 -4509 4973 -5487 6063 -6716 7453 -8305 9295 -10460
60a0460K2323k5448K9340l4353M1085n0653O5432r1512J51121n36676q6015R27327
$$ -10460 11863 -13585 15755 -18598 22487 -28166 37266 -54246 96875 -439801 -525816 401511
72D01511j29694k84822N771J12188m11531j49122N99911O60019l45317p58354
$$ 401511 271817 -13005 -7234 104954 -306577 -455699 144212 804231 458914 -299440
82b99440j58709M22845J58647m8967J94175J65500n02450o12252K10210P68361
$$ -299440 -458149 -35304 123343 74376 268551 434051 -68399 -680651 -470441 297920
92B97920J85347m93606k99940J65923O008j66014K85255O04881j6868p12858l79769
$$ 297920 483267 -10339 -310279 -144356 -138348 -304362 -19107 585774 568906 -143952 -523721
103e23721M40021M65516j03727k25754M1764r7578m05957p5748N65447M33318
$$ -523721 -83700 381816 278089 52335 94099 -3479 -409436 -485184 80263 513581
113E13581l26034n29060m306K69805L8188J3245K78433J02958m50353m14664K91531
$$ 513581 187547 -341513 -345819 -76014 -37826 -24581 253852 356810 -93543 -508207 -216676
124b16676N83319P0882l44558j26547P1844j58222j80316K87510M32036j54594
$$ -216676 366643 437525 92967 -33580 38264 -119958 -300274 -12764 419272 264678
134B64678n90837j85012L78096K82130o2919n806J15267j57461l49291N2860M90996
$$ 264678 -326159 -511171 -133075 149055 86136 80330 195597 38136 -311155 -258295 232701
145B32701K26143l21206l15503N1087R3938o5887Q7704L06965Q484m69217l07886
$$ 232701 458844 137638 -177865 -126778 -32840 -98727 -11023 295942 304426 -164791 -472677
156d72677K83441L87099l5567k13837N575L6685j86201o7547L63214L45841j89030
$$ -472677 -189236 197863 162296 -51541 -45966 -9281 -195482 -263029 100185 446026 256996
167B56996m24505n8300K44198P7139p4961Q9739R0969k54415l29505J27257M36618
$$ 256996 -167509 -225809 18389 95528 20567 110306 201275 -53140 -382645 -255388 181230
178A81230J19268k80281j68590Q7908P52j02187J41176L05418l1642l96151j74799
$$ 181230 300498 20217 -148373 -60465 -59713 -161900 -20724 284694 253052 -143099 -317898
189c17898K74303K53279o5336r6154N5676n8758k57911n0789L30539K30776k21587
$$ -317898 -43595 209684 144348 48194 103870 45112 -212799 -263588 66951 297727 76140
200G6140l07373K7071J79687J7129p833J66215P8385k57043k55074J47073L21815
$$ 76140 -231233 -204162 -24475 -7346 -15179 151036 229421 -27622 -282696 -135623 186192
211A86192L3750k00423o8739N1515p8010q6152J81326K53319r1904l41957j05312
$$ 186192 219942 19519 -49220 2295 -75715 -161867 19459 272778 180874 -161083 -266395
222b66395K09587J36831o1582m588Q1579q7544k14360L2559L12533J51643j95231
$$ -266395 -56808 80023 18441 13853 95432 7888 -206472 -173913 138620 290263 95032
233I5032j97716L3136O1634n2435K8771J78791K2235k64308j82633J68162K44253
$$ 95032 -102684 -69548 -7914 -60349 -31578 147213 169448 -94860 -277493 -109331 134922
244A34922m555j26142o200J0445j24507n4365K04821K03083j07643k48272k9681
$$ 134922 130367 4225 -1975 8470 -116037 -170402 34419 237502 129859 -118413 -148094
255a48094J55204N8310l3543N7560N3062j53927k09051N5533K53701Q0886j58150
$$ -148094 7110 65420 31877 89437 142499 -11428 -220479 -164946 88755 169641 11491
266A1491j06769M3081J1439m0906Q7952J76711j7993k38282j20862J40847J48289
$$ 11491 -95278 -52197 -40758 -81664 6288 182999 165006 -73276 -194138 -53291 94998
277I4998k2276n1579K4564l5376j39770j4800K04362J42869j25099j93190j0834
$$ 94998 72722 21143 45707 10331 -129439 -144239 60123 202992 77893 -115297 -126131
288a26131R2057J5171L662R8000M1836j49838j45155R0429K00570L6101j15812
$$ -126131 -34074 -18903 -15241 82759 124595 -25243 -170398 -79969 120601 156702 40890
299D0890n9261M942n3629m1499J11514J49233m7903j96077o6641J20717R6295
$$ 40890 -18371 -13429 -67058 -108557 2957 152190 104287 -91790 -158431 -37714 58581
310E8581j2318m372K0279p2054j27899J8889J80072R6012r9214j17223J456L7916
$$ 58581 46263 41891 62170 -9884 -137783 -118894 61178 157190 57976 -59247 -57791 -19875
322a9875r17L7494R4185p197j61370j12831Q1908J42480K3100n8753j9983j1429
$$ -19875 -20792 16702 110887 103690 -57680 -170511 -88603 53877 76977 18224 -1759 -13188
334a3188n9662n370J24968J09776o6381j54588m2271P4874N0524Q167L4688J2811
$$ -13188 -72850 -78220 46748 156524 90143 -64445 -106716 -31842 18682 26849 61537 74348
346G4348r0857j06461L8892J47874N5802q5621q3537r653J541J173O5896R5816
$$ 74348 -16509 -122970 -84078 63796 119598 33977 -49560 -59213 -57672 -56499 9397 105213
358A05213j6021j31133o7551P5755R5400J0411l0650j8325m6098p5637P110J18676
$$ 105213 89192 -41941 -109492 -33737 61663 72074 41424 23099 -22999 -98636 -91526 27150
370B7150Q2928n7898j07840k3095M9097L3936K3183M1915n737r5177q1045M6205
$$ 27150 110078 52180 -55660 -78755 -29658 4278 27461 69376 63639 -31538 -112583 -66378
382f6378J18384M3204n1257m9402j7859j8028M348O5247O6582l6265j14319n3060
$$ -66378 52006 95210 43953 -5449 -23308 -41336 -36988 28259 94841 58576 -55743 -108803
394a08803N3455P0288K4952J549j0647m9201n7667K3853J01154N2566n5398q2168
$$ -108803 -55348 14940 39892 41441 30794 -18407 -76074 -52221 48933 101499 46101 -36067
406c6067k4388K0062K3542L7875M6627j1913q4297n9841L8482Q4248L1147l3747
$$ -36067 -60455 -40393 -16851 21024 67651 55738 -28559 -88400 -49918 34330 65477 31730
418C1730m2445l2890k3388K2061P4973N6819k9580p8945l3196L1890M1715K4853
$$ 31730 -10715 -43605 -66993 -44932 30041 86860 57280 -21665 -54861 -22971 18744 43597
430D3597R160k3419o3070n0801K7878Q3608M2311l3035n4367k6667K901K3603
$$ 43597 52757 29338 -33732 -84533 -56655 26953 69264 36229 -18138 -44805 -41904 -18301
442a8301M4183L6373k3309p2556m0495L2908O2947L3746q448k9917m0196k8863
$$ -18301 25882 62255 38946 -33610 -74105 -41197 21750 55496 47048 17131 -23065 -51928
454e1928K0467N9640L3195l2084o3221l0052J7975L7205L8849K3570j8598n4501
$$ -51928 -31461 28179 61374 29290 -33931 -63983 -46008 -8803 30046 53616 35018 -19483
466a9483l6418K6835O2929K7856k6546m3414k9681m516K4611M5479L1252k0606
$$ -19483 -55901 -29066 33863 61719 35173 -8241 -37922 -42438 -17827 27652 58904 38298
478C8298n8168l5210J6291M3469L0725k887l1167m0712k0021K9279N7894L1483
$$ 38298 -19870 -55080 -38789 4680 35405 32518 1351 -39361 -59382 -30103 27791 59274
490E9274j9453m5923k8846N979K7638L1517J3710k4925m8326k8972J8532N0979
$$ 59274 39821 -6102 -34948 -28969 -1331 30186 43896 18971 -29355 -58327 -39795 11184
502A1184L5068p962l6252l5722q090K6558L9832K0303j8900m3063k6038J2254
$$ 11184 46252 38290 2038 -33684 -41774 -15216 24616 44919 26019 -17044 -43082 -30828
514c0828L9071L7072N599k9915m0484k0769J5659L6398K2439j0364l7318l4087
$$ -30828 8243 45315 50914 20999 -19485 -40254 -24595 11803 34242 23878 -13440 -47527
526d7527O35L4950M0994J5797k2324l7796k1110J0142L3655K9303j586l1103l5560
$$ -47527 -46892 -11942 29052 44849 22525 -15271 -36381 -26239 7416 36719 35133 4030 -31530
539c1530q899K6730L6524J7909j1976l4409l0483j835K8450L5410P106k8158l3549
$$ -31530 -40429 -13699 22825 40734 28758 -5651 -36134 -37969 -9519 25891 32997 4839 -28710
552b8710j0459K1641L6578K3876l079k8487l4025q345K3630L1028J0133k1184
$$ -28710 -39169 -17528 19050 42926 39847 11360 -22665 -31010 -7380 23648 33781 12597
564A2597l2632j7538P282K9887L0523L647k6896l4655j2616K1804L2872J6509
$$ 12597 -20035 -37573 -30291 -404 30119 33766 6870 -27785 -40401 -18597 14275 30784
576C0784j0623k8188k1416L918K6930L1039Q544k2805l2883j7967Q656K7154K0385
$$ 30784 20161 -8027 -29443 -25525 1405 32444 40988 18183 -14700 -32667 -24011 3143 23528
589B3528k994k4504k7956m740K5557L4609J6612j5757l2697j9085P006K4158K2733
$$ 23528 20534 -3970 -31926 -36666 -11109 23500 40112 24355 -8342 -27427 -20421 3737 26470
602B6470K103j9124k6447j2915J5036L0442J8342q787l0429k7248k082K0597K7039
$$ 26470 28573 9449 -16998 -29913 -14877 15565 33907 25120 -5309 -32557 -34639 -14042 12997
615A2997J1369j5563k6850j2797J3424L0163K0517l205k0843k5252j0272J3681
$$ 12997 24366 8803 -18047 -30844 -17420 12743 33260 30055 9212 -16040 -26312 -12631
627a2631K5003J5320j1235k7851j7997N483K3082K3455M928j7725k6927j4727
$$ -12631 12372 27692 16457 -11394 -29391 -23908 -826 22629 27557 9832 -17095 -31822
639c1822J2791K8257J6975n679k0617j7278m4J7206K3498J0647j6026k9490j8114
$$ -31822 -19031 9226 26201 20522 -95 -17373 -17417 -211 23287 33934 17908 -11582 -29696
652b9696N158K1805J7764P66j5298k1637q620J7265K8323J4139j1710k5541j4910
$$ -29696 -24538 -2733 15031 15797 499 -21138 -29758 -12493 15830 29969 18259 -7282 -22192
665b2192L382J5979K0217Q333j2694k3807j2940J1834K4590J2392o572j9292k0758
$$ -22192 -18810 -2831 17386 25719 13025 -10782 -23722 -11888 12702 25094 18522 -770 -21528
678b1528p291J3273K4889J4847j1973k3689r620J0602J9966J4575R58j3454k3560
$$ -21528 -28819 -15546 9343 24190 12217 -11472 -21092 -10490 9476 24051 25009 11555 -12005
691a2005j4600J1442K4325J2191q807j8953j2469O6J1136K0406J1202j3839k7322
$$ -12005 -26605 -15163 9162 21353 12546 -6407 -18876 -18810 -7674 12732 23934 10095 -17227
704a7227j3463J3278K4204J1417k813r705j3697p501J0034K2004J2276j3559k5309
$$ -17227 -30690 -17412 6792 18209 15396 5691 -8006 -15507 -5473 16531 28807 15248 -10061
717a0061j1727M076J2589J4891P277q299k1092j2062J4732K5078Q259j1178j5746
$$ -10061 -21788 -17712 -5123 9768 17045 8746 -12346 -24408 -9676 15402 23661 12483 -3263
730c263r948k544O771J8710J4351r907k3420j0351J0511J6558O119k505r387j7475
$$ -3263 -13211 -15755 -8984 9726 24077 14170 -9250 -19601 -9090 7468 13587 11082 1695 -15780
744a5780j1824J0544K5061J3503j1600j8459m052O009P912J1734Q145q678k3165
$$ -15780 -27604 -17060 8001 21504 9904 -8555 -12607 -6598 1314 13048 21193 12515 -10650
757a0650j3929J3372K2166N551p411q704q072o810M447J9985J4010j3833k5297
$$ -10650 -24579 -11207 10959 16510 9099 395 -7677 -14487 -10040 9945 23955 10122 -15175
770a5175p675J3015J4769N961K184k186j4874j3251Q484K1767P799j4501j7054
$$ -15175 -22850 -9835 4934 10895 13079 10893 -3981 -17232 -8748 13019 20818 6317 -10737
783a0737m625J472L743J4137J4411n961k2583j2197J4879J9662J494p753n376
$$ -10737 -15362 -13890 -10147 3990 18401 12440 -10143 -22340 -7461 12201 13695 5942 566
796E66o787q810L411K0584J5308j1489k1175m437Q692O720L073N028k082j8130
$$ 566 -6221 -15031 -11620 8964 24272 12783 -8392 -12829 -4137 2583 5656 10684 8602 -9528
810i528j5088J1895K4033P547j1465j0911m99r67o48J1380J2245q614k2080r071
$$ -9528 -24616 -12721 11312 18859 7394 -3517 -4016 -4983 -5631 5749 17994 9380 -12700 -21771
824b1771J3715J4724J006j480l01r741j2079L771K0181J0602j4106j7698L84Q292
$$ -21771 -8056 6668 7674 6194 5893 -3848 -15927 -12156 8025 18627 4521 -13177 -12793 -4501
838d501M596O217Q990j450j7947j2625J1054J6637O96r322n941k813n887J040
$$ -4501 95 6312 15302 13852 -4095 -16720 -5666 10971 11667 2345 -3596 -6409 -12296 -11256
852a1256J7580J4442r874k0076m159J1390Q344j283R89j16j2310j1876Q154K0210
$$ -11256 6324 20766 10892 -9184 -13343 -1953 6391 5108 6097 5981 -6329 -18205 -10051 10159
866A0159O966j2201j1115N80l79j655Q489J1198m497j9148q361J4626J5799L57
$$ 10159 17125 4924 -6191 -5611 -5990 -7645 844 12042 7545 -11603 -19964 -5338 10461 10818
880A0818m628j433n090q532L11J5704R655j1892j5443n57P785M298K516O630N72
$$ 10818 6190 4757 -333 -8865 -8554 7150 16805 4913 -10530 -11087 -3302 996 3512 10142 10714
895A0714j4958j1902Q154J6617L240j0337p316R33p80K44J0532J0900n755j6869
$$ 10714 -4244 -16146 -7992 8625 11865 1528 -5788 -4855 -5635 -5391 5141 16041 10286 -6583
909f583o987R411Q412j836j486K03o217q520L829J6767R432r950j2634q81M388
$$ -6583 -13570 -4159 4253 2417 931 1134 -5083 -13603 -9774 6993 16425 6475 -6159 -7040 -2652
924b652K535L271N723j110j2543q029R088J2975J582o253m806k496n027r78J1047
$$ -2652 -117 3154 8877 7767 -4776 -12805 -3717 9258 10840 4587 -219 -2715 -7742 -8720 2327
939B327R085o370j3643l845R292Q634J148M93j303q197p825L231J1493N174p425
$$ 2327 11412 5042 -8601 -12446 -3154 5480 6628 7121 5818 -2379 -10204 -6973 4520 9694 2269
954B269q137o30R95K055O928O723k770j3381p664P513R928K155k855k761k507
$$ 2269 -5868 -6498 -5503 -3448 3480 10203 7433 -5948 -13612 -6099 3829 5984 3129 368 -2139
969b139l245J842J0584P140o437j1139l973L328L946K139K928r21q580o382N121
$$ -2139 -5384 -3542 7042 14182 7745 -3394 -7367 -4039 -93 2046 4974 4053 -4527 -10909 -5788
984e788J1136M536n509o957k169j197J792O701N305l061r503m061O551O894J186
$$ -5788 5348 9884 4375 -2582 -4751 -5948 -4156 2545 7850 4789 -4714 -8775 -2224 4670 5856
999E856j233k934n537n596J105R606O305m679p454k255M007N288L422K167k694
$$ 5856 4623 1689 -3848 -9444 -8339 1267 7572 2893 -4561 -6816 -2809 2479 5901 8068 5374
1014E374p961n017M118P300L077k949m403k196k249J873P148M355l911r351n161
$$ 5374 -2587 -7604 -3486 3814 6891 3942 -461 -2657 -4906 -3033 4115 8470 4559 -4792 -9953
1029i953M053O595K724J97k656m444j873K934P499M044m349o602l758k86K968
$$ -9953 -5900 695 3419 3616 960 -3484 -5357 -2423 5076 9120 4771 -1831 -5589 -5875 -2907
1044b907M831L111j880p048l874M073O592L659j829m964m135j387K841O918L366
$$ -2907 1924 5035 3155 -3893 -7767 -3694 2898 6557 4728 -236 -4371 -5758 -2917 4001 7367
1059G367k437n314l327J653M038L091P46l655o617l267K143O073M000j564m383
$$ 7367 4930 -384 -3711 -2058 1980 5071 5817 2162 -4455 -7722 -5579 494 4494 2930 -1453
1074a453l356r8M541N237J128l053n752k969K145M128L469O60l246m324j588K187
$$ -1453 -4809 -4907 -366 4871 5999 2946 -2806 -5775 -3630 498 3967 4627 1381 -2943 -4531 -2344
1090b344N113K430k842m940m177P59N396M710J250k819m080o75J902L396L147
$$ -2344 2769 5199 2357 -2583 -6760 -6001 -605 4105 5355 2536 -1544 -2219 -317 3079 6226
1105F226j433m621m328j314L429M567J483j823m391l373J106M289M152Lm983m100
$$ 6226 4793 172 -4156 -5470 -2041 2526 4009 2186 -2205 -5578 -4472 -183 3969 3972 -1011 -5111
1121e111r2K745M309K984o57l114l621m39L761L204K0l032m620k346J116M165
$$ -5111 -5203 -2458 1851 4835 4178 1064 -2557 -2996 765 3969 3989 957 -3663 -6009 -4893 -728
1137g28M947L88m203l517OL360L807M70j727l248l366P97L482L713R49l033m294
$$ -728 4219 4607 404 -3113 -3107 253 4060 4530 2803 -445 -3811 -3014 468 4181 5130 2097 -2197
1154b197j594R48L299K450j408l827l402j86M143M018J457j541l366j220J615
$$ -2197 -3791 -2843 456 2906 1498 -2329 -5731 -5917 -1774 2244 3701 2160 -1206 -2426 -811
1169h11K367J978j5l066l484j572K059M582K195j552l293k640M46K354K598J407
$$ -811 1556 3534 3519 453 -3031 -4603 -2544 2038 4233 2681 -612 -3252 -2806 -452 2146 3553
1185C553k776m206o12L014L990J829j208j541k324k208J253L387J641k890n051
$$ 3553 777 -3429 -4041 -1027 2963 4792 3584 2043 -281 -2489 -1236 2151 3792 902 -4149
1200d149j263K312K265K100J320j425l486k257K651N252N95l395k048k61n2Q79
$$ -4149 -5412 -3100 -835 1265 2585 1160 -2326 -4583 -1932 3320 3915 520 -1528 -1789 -1841 -962
1216i62L054L618j919n949j733K790K530J27r79l22k260l293K671O566K319m172
$$ -962 2092 5710 3791 -2158 -3891 -1101 1429 1556 577 255 -2005 -5298 -2627 3939 6258 2086
1232B086l993O59K388j241qL451q9n600l474L474N887m53l692j53J13l019n77
$$ 2086 -1907 -1248 1140 -101 -109 3342 3253 -2347 -5821 -2347 3540 3087 -605 -758 -645 -3664 -4241
1249d241M571M310l538o478J337N476Q79j747J295K656k878o297J430P285O62
$$ -4241 330 4640 1102 -5376 -4039 1437 2316 569 1864 4520 1642 -4655 -3225 4060 4722
1264D722o145k502L267J299k966J649O325p11q151k630O105M555l736l755L945
$$ 4722 -1423 -3925 -658 641 -2325 -676 5649 4938 -3213 -5843 262 4817 1081 -2674 1271
1279A271J226n358j411O936M784n726p477K848M783k606k997M128L491n570o745
$$ 1271 2497 -2861 -4272 2664 7448 1722 -5755 -2907 1876 -730 -3727 401 3892 -1678 -8423
1294h423N531R829k073p593K69N161j597n647K762Q286j835r918n48Q599K740
$$ -8423 -2892 6937 4864 -2729 -2460 2701 1104 -4543 -1781 6505 4670 -5248 -5796 2803 5543
1309E543n769j519N741j161r106o9J0150L269q854n299P259M937o036k904Q054
$$ 5543 -226 -1745 3996 2835 -6271 -6340 3810 7079 -1775 -7074 185 5122 -914 -3818 4236
1324D236L405r413p309P339Q609n495p272M852N273n691n905O970R519n863j1570
$$ 4236 7641 -1772 -9081 -1742 6867 1372 -5900 -1048 4225 -1466 -7371 -401 9118 3255 -8315
1339h315L123R909j513p965K179R230l204j0691K575J2521O40j1269k823Q934
$$ -8315 -5192 4717 3204 -4761 -2582 6648 3444 -7247 -4672 7849 8489 -2780 -5603 3331
1353C331J207r954j38J1622J323j2646m203J1948O889r909o539R200M593j0477
$$ 3331 4538 -5416 -5554 6068 7391 -5255 -9458 2490 9379 -530 -7069 2131 6724 -3753
1367c753n903J0952R161r614j0516P869R786o723q399P319R129q980j2708P764
$$ -3753 -9656 1296 10457 843 -9673 -1804 7982 1259 -7140 179 9308 328 -12380 -4616
1381d616J4414n259j3097L300J2535k938j2567M265J4967l007j6272l90J4769
$$ -4616 9798 4539 -8558 -5258 7277 4339 -8228 -3963 11004 7997 -8275 -8665 6104
1394F104K112j3127j642J3448O07j4783j991J5916N322j5637p809J2989P219j2676
$$ 6104 8216 -4911 -6553 6895 7502 -7281 -9272 6644 11966 -3671 -11480 1509 8728 -3948
1408c948o060J3431Q090j3564j0922J2973J2557j0725j2032R149J0538r700j2604
$$ -3948 -10008 3423 11513 -2051 -12973 0 12557 1832 -10200 -1051 9487 -213 -12817
1421a2817J0804J5255r011j6826O695J6182m368j5340M297J5938m838j7923L529
$$ -12817 -2013 13242 4231 -12595 -5900 10282 5914 -9426 -5129 10809 5971 -11952 -8423
1434h423J8716p3j7736j195J6986J351j6925j152J8050K049j9557o096J8623P821
$$ -8423 10293 10220 -7516 -8711 8275 9626 -7299 -8451 9599 11648 -7909 -14005 4618 12439
1448A2439j6566q128J6044P974j5797r439J6101J2074j5469j3926J3231J3635
$$ 12439 -4127 -12255 3789 11763 -4034 -13473 2628 14702 -767 -14693 -1462 12173
1460A2173j1731j2586J1722J4646j2348j6813J1139J8182q353j8597N848J7526
$$ 12173 442 -12144 -422 14224 1876 -14937 -3798 14384 6031 -12566 -6718 10808
1472A0808n501j7881N947J9754m026k0136J407K0086P74j9290j309J9123K53k0537
$$ 10808 5307 -12574 -6627 13127 9101 -11035 -9628 10458 11232 -8058 -9367 9756 10009 -10528
1486a0528k153K1232N809k0631p495J9002P778j8161q202J7946R515j8560j2419
$$ -10528 -12681 8551 14360 -6271 -13766 5236 13014 -5147 -13349 4597 14112 -4448 -16867
1499a6867J7854J4381j5412j3826J4188J4045j4231j5757J4329J7732j3027j9241
$$ -16867 987 15368 -44 -13870 318 14363 132 -15625 -1296 16436 3409 -15832
1511a5832R945J9260p894j8866P696J9976p057k0816N308K1649k632k1591K20
$$ -15832 -5887 13373 5479 -13387 -5691 14285 7228 -13588 -8280 13369 10737 -10854 -10634
1524a0634K0875p5k0825K26K1520K061k2248n123K1742O812k0677q109J9655Q114
$$ -10634 10241 10166 -10659 -10433 11087 13148 -9100 -14223 7519 14331 -6346 -14455 5200 13314
1538A3314j9413r684J9962J2438j8784j3807J6971J4171j5300j5182J5416J6003
$$ 13314 -6099 -15783 4179 16617 -2167 -15974 997 15168 -132 -15314 102 16105
1550A6105j5576j7930J4196J9635j1126j9933R310J9709q584k0382Q282K1407
$$ 16105 529 -17401 -3205 16430 5304 -14629 -5319 14390 5806 -14576 -6294 15113
1562A5113o699k2481L936K2477j377k1931J287K1565n94k2514j899K3269M425
$$ 15113 8414 -14067 -10131 12346 10969 -10962 -9675 11890 11296 -11218 -13117 10152 14577
1575A4577k3179o809K1523P580k0075p896K0340R860k0633j2175J9360J3673j7731
$$ 14577 -8602 -15411 6112 13692 -6383 -14279 6061 15921 -4712 -16887 2473 16146 -1585
1588a585j4270J6166J5061j6010j5886J5879J8224j4188j9836J1777K0047r979
$$ -1585 -15855 311 15372 -638 -16524 -645 17579 3391 -16445 -4668 15379 5400
1600E400k0365R420K0713q630k1751P120K2996m480k2860K431K2457k001k2464
$$ 5400 -14965 -5545 15168 6538 -15213 -8093 14903 10423 -12437 -10006 12451 10450 -12014
1613a2014J008K2701O91k3641l116K3393N469k2150o298K1212O987k1103r021
$$ -12014 -11006 11695 12386 -11255 -14371 9022 14491 -7659 -13957 7255 14242 -6861 -15882
1626a5882K1252J0585k0187j2291J8522J3445j6704j4095J6513J5304j6422j6858
$$ -15882 5370 15955 -4232 -16523 1999 15444 -1260 -15355 1158 16462 40 -16818
1638a6818J4736J8195j2624j8732J0876J9089r737j9458R717K0297p928k1570
$$ -16818 -2082 16113 3489 -15243 -4367 14722 4985 -14473 -4756 15541 7613 -13957
1650a3957N353K1863m069k1603L175K1355k468k1731L59K2877K101k2591m040
$$ -13957 -8604 13259 9190 -12413 -9238 12117 9649 -12082 -11723 11154 13255 -9336 -13376
1663a3376K1369M537k0652n645K0796P235k1026q695K0114J0559j8127j1506J6992
$$ -13376 7993 12530 -8122 -13767 7029 14264 -6762 -15457 4657 15216 -2911 -14417 2575
1676B575J2428j7202j3629J6843J4911j5202j6005J2890J7362j1481j7655J1086
$$ 2575 15003 -2199 -15828 1015 15926 724 -15281 -2391 14971 3490 -14165 -3079
1688c079J7966j0109j9169Q288J9863o067k0347M767J9965l548k0050K763K0248
$$ -3079 14887 4778 -14391 -6103 13760 7693 -12654 -7887 12078 8530 -11520 -8757 11491
1701A1491p56k1304j429K0858K698j9813l881J9194M822j9143n975J9542P708
$$ 11491 10735 -10569 -11998 8860 11558 -8255 -12136 7058 11880 -7263 -13238 6304 14012
1714A4012j8665r437J7054J0459j6118j1455J6283J2371j5662j3554J4609J4976
$$ 14012 -4653 -14090 2964 13423 -2695 -14150 2133 14504 -1158 -14712 -103 14873
1726A4873j2813j5693J1294J5804j0619j6309J0012J6976q262j8124O745J8632
$$ 14873 2060 -13633 -2339 13465 2846 -13463 -3451 13525 5263 -12861 -6116 12516
1738A2516n123j8375M170J7756l213j8599J366J9471q1j8854j460J7982K850j7434
$$ 12516 7393 -10982 -6812 10944 7731 -10868 -9502 9969 9888 -8966 -10426 7556 10406 -7028
1752g028l687J7556M674j7822o420J7100P610j5430q815J5044R585j4631j0216
$$ -7028 -10715 6841 11515 -6307 -12727 4373 11983 -3447 -12262 2782 12367 -2264 -12480
1765a2480J4538J1326j3437j2664J1433J3518j0581j3826J0525J4075r671j4836
$$ -12480 2058 13384 -53 -12717 -1284 12234 1653 -12173 -1648 12427 2756 -12080
1777a2080Q218J6007o963j6387N858J5846m721j6261L754J6700k357j7097J009
$$ -12080 -3862 12145 5182 -11205 -5347 10499 5778 -10483 -6729 9971 7614 -9483 -8474
1790h474J6852N21j6148j636J5594K247j5983l386J6028M829j5413n787J4492
$$ -8474 8378 8899 -7249 -8885 6709 8956 -7027 -10413 5615 10444 -4969 -10756 3736
1803C736P090j3690p632J3448Q158j3093r482J2300J0623j0838j1384J0111J1453
$$ 3736 10826 -2864 -10496 2952 11110 -1983 -11465 835 11458 620 -10764 -653 10800
1816A0800r417j1797Q865J2346p735j3814O564J4034n596j3437M696J3388l614
$$ 10800 1383 -10414 -1549 10797 3062 -10752 -4188 9846 4250 -9187 -4491 8897 5283
1829E283j4314L059J4716j911j4473M38J3786R6j3741o70J4000J586j3919k855
$$ 5283 -9031 -5972 8744 6833 -7640 -7202 6584 6680 -7061 -7731 6269 7855 -6064 -8919
1843h919J3781M140j2933n135J2460N522j2238o177J2068P221j0779q080R729
$$ -8919 4862 9002 -3931 -9066 3394 8916 -3322 -9499 2569 9790 -989 -9069 660
1856F60Q827r288q815Q366R280q219j0117P230J0831o058j1182N663J0768m649
$$ 660 9487 199 -8616 -250 9030 811 -9306 -2076 8755 2697 -8485 -2822 7946 3297
1870C297j0942L817J1747l237j2223K126J1929j191j1276M99J1155J9j1574n15
$$ 3297 -7645 -3828 7919 4682 -7541 -5415 6514 5323 -5953 -5454 5701 5720 -5854 -6369
1884f369J1418J466j1036k615J0433L615j0151l866J0346M280r794m876R234N769
$$ -6369 5049 6515 -4521 -7136 3297 6912 -3239 -7105 3241 7521 -2273 -7149 2085 7854
1898G854q592o652Q081O419p477o918P464P272o503q194N614Q556n162q389M507
$$ 7854 -738 -7390 691 7110 -367 -7285 179 7451 948 -7246 -1632 6924 1762 -6627 -2120
1913b120Q248l672r044L304R547k604r051J611Q749j096q666M47Q868j4r389n85
$$ -2120 6128 2456 -6588 -3284 6263 3659 -5392 -3781 4968 3872 -4794 -4347 4521 4507 -4882 -5467
1929e467Q804J806q178k149Q130K322p848k833P943L522p391m263O731M728o455
$$ -5467 3337 5143 -3035 -5184 2946 5268 -2580 -5413 2530 6052 -1339 -5602 1129 5857 -598
1944e98m466O088M752o017n594N333O234n123o295M245O119l385o306L410O826
$$ -598 -5064 1024 5776 -241 -5835 -502 5732 609 -5686 -1441 4678 1293 -5013 -1603 5223
1959E223k900o920K232O676j536o811J106O692r92o833M54O991K34o739p86O312
$$ 5223 2323 -4597 -2365 4311 2775 -4036 -2930 3762 2770 -4063 -3609 3382 3616 -3123 -3909 2403
1975B403J558o504j472O316J760n999k192N626L393n341l400N090K932m524l589
$$ 2403 3961 -2543 -4015 2301 4061 -1938 -4130 1496 4889 -452 -3852 1238 4170 -354 -3943
1990c943M239L874m267m326L714M499l011m416K834M459k542n043K589N010j745
$$ -3943 296 4170 -97 -4423 -709 3790 779 -3637 -803 3656 1114 -3929 -1340 3670 1925
2005A925n085J345M773q51m976Q20N138q36n235K68M836M70m794p65M926Q14m507
$$ 1925 -3160 -1815 2958 2107 -2869 -2049 3089 2253 -2982 -2714 2122 2592 -2202 -2967 1959 2773 -1734
2022a734r16M603J537m235k042M017J662l643j920L421K243l468k734L147K965
$$ -1734 -2650 1953 3490 -745 -2787 1230 2892 -751 -2671 750 2993 -475 -3209 -62 2903
2037B903k580l188K250L012k197l053K068L552k126l360J879L238j286l014O96
$$ 2903 323 -2865 -615 2397 200 -2853 -785 2767 641 -2719 -840 2398 1112 -1902 -1206
2052a206L632j169l666R55L348k70l451J2L302L25l249j15L139M57l095r11K925
$$ -1206 2426 1257 -2409 -1454 1894 1624 -1827 -1815 1487 1812 -1437 -1552 1587 2044 -1051 -1962 963
2069I63J190k576j388K719R17k328j177K335J694k619k029K204J689j685j774
$$ 963 2153 -423 -1811 908 1825 -503 -1680 655 2349 -270 -2299 -95 1594 -91 -1865
2084a865J449K172j593k215J778J955j050j944P56J771p42k034Q32K113p07k010
$$ -1865 -416 1756 163 -2052 -274 1681 631 -1313 -557 1214 472 -1562 -730 1383 676 -1334
2100a334K30K297m9j889j99J936j80j772K1J878M08j751o60J870N24j738m18J289
$$ -1334 -1104 1193 1144 -745 -944 992 812 -960 -939 939 1347 -404 -1064 806 1330 -408 -826 463
2118D63O72j684q32J572Q81j437o00R15J005q51j056Q50J178j135q79M56J118
$$ 463 1135 -549 -1381 191 1072 -365 -965 -50 955 104 -952 -102 1076 -59 -938 -482 636
2135F36n61r04M57J211o59j137O68J032j33j127LR16J54j041J38R33j3p26j92
$$ 636 75 -829 -372 839 180 -957 -289 743 610 -517 -514 402 556 -485 -347 586 573 -153 -345
2154c45Q14M91j087j34M19Q5m73l89Q47N64j162k56O41M32m88l97L02M60m28l47
$$ -345 469 960 -127 -261 158 243 -230 -619 228 792 -370 -626 15 447 -41 -438 -136 324 -104 -451
2174d51L25N32m64j83MN39j95n09L43L34l55m70J80L07M42m30J17K74j37j88q7
$$ -451 -126 406 -58 -241 -237 302 107 -402 -59 275 -80 -550 -370 -63 379 -51 66 340 203 15 -72
2195g2L11L15n12l76N07M8l31o9J75K87m68j82L38L35n07q6J45R4Q4k17K34K25
$$ -72 239 554 42 -334 173 221 -110 -179 -4 283 -185 -367 -29 306 -201 -287 -142 -48 36 -181 53 278
2217B78k57j62m2K07R1k67J22J37k48l69N96J27j31l26J47L41P1l24M55j48j51
$$ 278 21 -141 -183 24 115 -152 -30 107 -141 -510 86 213 82 -244 -97 244 315 -9 446 298 147
2238A47p4l03M24J77k82rk1k19o3j0K73M5k89M7K0J02J76k01q3L93k58j67J58
$$ 147 73 -230 194 371 89 80 59 -160 -223 -233 40 85 -204 -157 -137 -35 141 -60 -143 250 -8 -175 -17
2261a7Q4n9k07j53K69j70l0K09jo8R4m2L02K37m05P4o5p0R1o9J69J35k07m1lj18
$$ -17 67 8 -199 -352 -83 -253 -283 -74 -75 -143 -49 -91 211 448 43 117 52 -18 73 4 173 308 101 60 57 -61
2287f1O3l5j67M6j09j38N4J19K30N1j48J60k22J41J83j49j34p8P0J34O1j34J45
$$ -61 2 -33 -200 -154 -263 -401 -347 -228 2 53 -95 65 -157 -16 167 18 -116 -194 -124 10 71 -63 82
2310H2j33l55L11o7J94J12k90L3K68j04J31P9n5J76m42M4K75r3k02J54k68L13
$$ 82 -51 -406 -95 -162 32 144 -146 -113 155 51 182 261 206 382 -60 -16 259 166 -36 118 -150 163
2332A63l17j02L10o1k28J22jN6J98k88P2K19j85Q7P5kP0j54l13L07j24o1J45r8
$$ 163 -154 -256 54 -7 -235 -113 -114 -58 140 -148 -76 143 -42 45 120 118 188 34 -279 28 -96 -157 -12 -110
2356a10J6k4r0N15n2k18N4J16q2r6k35N52P5m57j7K74o2j3k34J12O5k28k73M47
$$ -110 -94 -118 -208 307 255 37 91 207 125 29 -206 346 421 -36 -53 221 159 146 -88 24 89 -139 -412 35
2380C5J63j73l24J7O32j76m27L59M6l6k53K3M49o7m94J28K72l2l03k10N38J98
$$ 35 198 25 -299 -282 350 174 -253 106 152 116 -137 -114 335 268 -226 -98 174 142 -161 -371 167 365
2402C65o72J98L68J2l19j96N59P1m13j89N43K9n39J8J71L33m84l37N25J80n06
$$ 365 -307 -109 259 271 -48 -244 315 386 -27 -216 327 356 -183 -165 6 339 -145 -482 43 223 -283
2423b83l21L35R12n54o97Q58K97o02k95K04N20k21p89N77N22l93o02M38L07p5
$$ -283 -604 -269 643 89 -608 250 547 -55 -350 -146 374 153 -636 -59 463 70 -532 -94 213 138
2443A38o35J63P67l08l13m4O93lp57%Q81m8p84N6N34j08m17j01O34J06q91N2N97
$$ 138 -497 -334 433 125 -188 -232 461 458 -299 -299 582 534 -250 -194 340 232 -185 -286 348 454 -437 -385 212
2466B12K59n81l52N98L98q77l14P58M70m30o97M10O35l09m86L33P06o01l91J03
$$ 212 471 -110 -462 136 534 -343 -657 101 571 141 -556 -146 489 180 -306 27 733 132 -259 -156
2486a56O72l11o54M12M99l36n70P6P38R2r70J30Q57j32o71J5N72L21p91l25Q18
$$ -156 516 205 -449 -37 462 126 -444 -368 370 462 -508 -378 479 347 -324 -309 263 584 -207 -532 286
2507B86M8o07l50P17M00p24k77N56L22n60l39O53M61m68o74O24M62m34o29O19
$$ 286 334 -273 -623 94 494 -230 -507 49 371 -189 -528 125 586 118 -556 68 530 96 -533 86
2527H6N73l93q51M17O49k26o53K92M48k20n93P8Q17n8p11n0P08l4o91J8P44J54
$$ 86 659 266 -585 -168 481 255 -398 -106 342 122 -471 -393 424 366 -345 -395 313 279 -412 -394 350 504
2549E04q61J7M41L99n00o48P24M49q89n5N60J75k85n60M66N11n27k43L11M81j99
$$ 504 -357 -340 101 500 0 -648 76 525 -364 -419 141 316 31 -529 -63 448 -79 -322 -11 470 271
2570B71n26Q2Q35m12o05M67J90mn32k0P59l11n67J0O95j98m55jM83K48o72j05
$$ 271 -255 -173 662 250 -355 112 302 298 -234 -254 505 194 -373 -363 332 134 -321 -322 161 409 -263 -368
2592c68O01J61n52n3L55L41n65m88O66K83n49k51M28L68m11l63M32L14j80o23
$$ -368 233 394 -158 -211 144 485 -80 -568 98 381 -168 -419 9 377 -34 -397 35 349 169 -454
2612d54L11Q07m39o11L67N53m86m75L20N12k94k93j14N97j58m48k1N19Ql80k73
$$ -454 -143 664 225 -386 -19 534 48 -427 -107 405 111 -182 -296 301 143 -305 -326 193 201 -179 -452
2633d52P82m9o37Q8N10L8n50j37N15L69o99l1M03N3l35k71K79L97l71k81K52N38
$$ -452 330 281 -356 -268 242 280 -270 -407 108 477 -222 -253 150 203 -132 -403 -124 273 -98 -379 -127 411
2655D11k76m53L72L01k84m23L47K13j47m42L42M44l09n46K20M55P5o24j14N40
$$ 411 135 -318 54 355 71 -352 -5 208 61 -381 -39 405 96 -450 -230 225 300 -324 -438 102
2675A02j16m21K32K50K92l36m62O34J49m71l2M3M06l07j80K38J26j93l65L81J15
$$ 102 -14 -435 -203 47 339 3 -459 175 324 -147 -179 -136 270 -37 -217 21 147 -46 -411 -30 85
2696H5J8l94K01K86k70k14L10J80n7l06J04K63j5l46O8L06l81p1R7K34O5o08K92
$$ 85 103 -291 -90 196 -74 -288 22 202 145 -161 -57 206 191 -155 -87 219 -162 -233 -136 98 163 -445 -153
2719a53J59k63j50L75J3J48r6j25L22j13k18J20P8k4M9l28M9M02j98j65J00L1
$$ -153 6 -257 -407 -32 -19 129 33 -92 230 117 -101 19 97 73 122 -206 -157 245 47 -118 -18 13
2741A3M6j49J44J11k18L5O0j75K29j21J83j52m6j2J8K2o0j2MK29k35J75m3K0j03
$$ 13 59 -90 54 165 -53 -18 42 -133 96 -25 158 6 -40 -52 -34 -12 -72 -84 -80 149 -86 89 46 66 -37
2766c7J13k2J1j42N2J40o2k44K29m0R2K2n1n1J45j65Q7J74k09R9r8N4j88P6K36
$$ -37 76 54 65 -77 -25 115 53 -191 38 -2 90 112 61 10 155 -10 77 251 42 141 43 97 -91 -15 221
2791B21%k14Q1j30N7j44P2K64j88j31O4M5j89P0J38j50RMO5J35mj86J75j51J72
$$ 221 221 7 88 -42 15 -129 -57 207 19 -112 -48 -3 -192 -122 16 -134 -125 -121 -56 79 75 -111 64 -87 85
2816H5q0L6Q8r5r5nK04j84O8rm1q4J18J83n9N3k32l9K73k05o9L2j63J50j28j3
$$ 85 5 41 129 34 -61 -66 138 -46 22 13 -28 -112 6 189 130 183 -49 -88 185 -20 -89 -57 -220 -70 -198 -211
2842b11O6K53k67m7J89J12k44R2Q7J42m3k46K29j06K33l27K16q1j54n7J44K35
$$ -211 -145 108 -159 -206 -17 95 -149 -57 30 172 129 -117 112 6 239 -88 128 47 -107 -164 -20 215
2864B15j88l5m5J63J10l14Q6J65n1k03k2K29J15m17o2M90k88o4o7J15J56l82j6
$$ 215 27 -8 -53 110 220 -94 -8 157 106 -97 -119 110 225 -192 -254 236 -52 -116 -183 -68 88 -294 -310
2887c10K80N1k46j2K95J19j77r2L37j54k90n9L72K20k58j48J94J48l53j49K68
$$ -310 -30 21 -225 -237 58 177 0 -92 245 91 -199 -258 114 334 76 -72 122 270 -83 -232 36
2908C6J56j39k60J78L92k70m41L26L90k41k32q6L64%l85k5N25m3n63p4M51K05
$$ 36 192 53 -207 -29 363 93 -348 -22 368 127 -105 -191 173 173 -212 -237 288 245 -318 -392 59 264
2930B64o22m4P28j23m53j83L23M62n15l46O10L65m50n31O22M61m43n20L88M29
$$ 264 -358 -402 326 203 -250 -433 -110 352 -163 -509 101 466 16 -515 107 568 125 -395 -7 422
2950D22j62o48K46O38j58n80J60M32j64o90L11Q56k14r50L04M90J5n96q8O40M5
$$ 422 260 -388 -142 496 338 -242 -82 350 186 -504 -193 663 449 -501 -197 293 308 -288 -376 264 309
2971C09o25j52P04K35o81l05O59L80p08n97J000O11j047m16O65P55r07n67O05
$$ 309 -316 -468 236 471 -210 -515 144 524 -184 -781 219 830 -217 -633 32 787 -120 -687 -82
2990h2R46n95j061P71P80n80j084O64J054n55j111N26J124l76j058N2J301q0j401
$$ -82 864 269 -792 -21 759 179 -905 -241 813 258 -853 -327 797 421 -637 -585 716 636 -765
3009g65Q9J348nj362j02J379K40j436k40J218M71j159p21J346P39j436m15J102
$$ -765 -676 672 667 -695 -797 582 822 -614 -854 364 835 -324 -1045 301 1040 -396 -811 291
3027B91Q04j285r40J289R87j044j170J106J013q26j301Q06J400o83j556P62J432
$$ 291 1095 -190 -1130 159 1146 102 -1068 38 1051 225 -1076 -270 1130 447 -1109 -347 1085
3044A085n31j724N08J685l94j517J23J851l16j927N22J558J51j785l33J763M20
$$ 1085 554 -1170 -662 1023 629 -888 -765 1086 770 -1157 -635 923 1074 -711 -1044 719 1139
3061A139j793n42J841O92j792j000J947Q03j595j060J546J362j560j350J368J395
$$ 1139 -654 -1196 645 1337 -455 -1455 492 1295 -300 -1360 186 1548 -12 -1362 6 1401
3077A401j311j412J081J647j169j729R35J925p67k174Q30K028m79k234O62K032
$$ 1401 90 -1322 -241 1406 237 -1492 -557 1368 601 -1573 -743 1285 806 -1428 -766 1266
3093A266k90k225J22K145L1j996l57K144L59k227l46J984Q39k165j021K405Q48
$$ 1266 976 -1249 -1127 1018 1049 -947 -1304 840 1199 -1028 -1374 610 1449 -716 -1737 668 1516
3110A516k248r36K151J100j877j505K103J496j772j733J623J914j595k075J426
$$ 1516 -732 -1668 483 1583 -294 -1799 304 1800 28 -1705 -82 1832 237 -1838 -412
3125d12K194j232k325R79K616j100k431P15K764m66k856J92K726l0k672q6K724
$$ -412 1782 550 -1775 -796 1820 720 -1711 -996 1768 1302 -1554 -1362 1364 1334 -1338 -1424 1300
3142A300K25k872k69K802M62k629p18K517J117k780j093K522J343k256j511K152
$$ 1300 1525 -1347 -1616 1186 1648 -981 -1699 818 1935 -845 -1938 584 1927 -329 -1840 312
3158C12J721k052k086K064K125j872k408J664K663j547k795J641K585j435k679
$$ 312 2033 -19 -2105 -41 2084 212 -2196 -532 2131 584 -2211 -570 2015 580 -2099
3173b099J204K650p32k825M94L033m95k921J36L013J35l143j44L002O08l078r15
$$ -2099 -895 1755 1023 -1802 -1308 1725 1230 -1691 -1555 1458 1593 -1550 -1694 1308 1916 -1162 -2077
3190b077L059J149k984j378K958J396k713j577K568J861k605j875K368K368k432
$$ -2077 982 2131 -853 -2231 727 2123 -590 -2167 401 2262 -343 -2218 150 2518 86
3205H6k385K119K612j902k885J766K858j722k738J312L138j281l069O82L491n78
$$ 86 -2299 -180 2432 530 -2355 -589 2269 547 -2191 -879 2259 978 -2091 -1409 2082 1504
3221A504l483N64L204n2l400k48L331N08l451n29L292R80l406j074L080J571l230
$$ 1504 -1979 -1415 1789 1737 -1663 -1911 1420 1928 -1523 -2052 1240 2220 -1186 -2260 820 2391 -839
3238h39j703L083J761k647k193K714K501k921j952K094K611k200k708J820L046
$$ -839 -2542 541 2302 -345 -2538 176 2677 -244 -2196 -102 2509 309 -2399 -579 2467
3253B467j804l080J750L065j318l351J089L308q57l523Q84L351k61l684J23L758
$$ 2467 663 -2417 -667 2398 1080 -2271 -1182 2126 1269 -2254 -1370 1981 1720 -1964 -1841 1917
3269A917K0l602k96L510L90l445o83L322J250l410j389L363J458l149j854L241
$$ 1917 1937 -1665 -1961 1549 1939 -1506 -2189 1133 2383 -1027 -2416 947 2405 -744 -2598 643
3285F43K014k942k273K620K533k669k422K096L044k047l010J662L129j490l297
$$ 643 2657 -285 -2558 62 2595 -74 -2496 -400 2644 597 -2413 -751 2378 888 -2409
3300b409J450L217r53l601R39L565q31l469M50L365K17l725j70L472N18l380q59
$$ -2409 -959 2258 1305 -2296 -1357 2208 1377 -2092 -1642 1723 1940 -1785 -1955 1517 2035 -1345 -2204
3317b204L346J098l358j276L426J350l149j708L011K042k944k139K645K319k440
$$ -2204 1142 2240 -1118 -2394 1032 2382 -767 -2475 536 2578 -366 -2505 140 2459 19
3332A9k479K366K562k341k693J934L114j625l171J345L308j308l135R20L200o18
$$ 19 -2460 -94 2468 127 -2566 -632 2482 857 -2314 -969 2339 1031 -2104 -1184 2016 1398
3348A398l315K22L618l63l302j08L575K74l472m83L100R80l240j137L264J234
$$ 1398 -1917 -1695 1923 1560 -1742 -1850 1725 1999 -1473 -1956 1144 2124 -1116 -2253 1011 2245
3364B245l107j587L152J672k807j874K586K189k517k486K499K328k109k595J878
$$ 2245 -862 -2449 703 2375 -432 -2306 280 2469 -48 -2534 -35 2293 184 -2411 -533
3379e33K881j918k656J500K858j292k981J100K995o24l451P16L314l72l125m6
$$ -533 2348 430 -2226 -726 2132 840 -2141 -1041 1954 1330 -2121 -1405 1909 1537 -1588 -1634
3395a634L156K32l042n80L051P95l171q92L055J154l015j208K917J279k598j756
$$ -1634 1522 1754 -1288 -1868 1183 1978 -1193 -2085 970 2124 -891 -2099 818 2097 -501 -2257
3411b257K464J958k287k048K105K321k119k299K001K411j679k769J406K881j211
$$ -2257 207 2165 -122 -2170 -65 2256 137 -2162 -161 2250 571 -2198 -792 2089 878
3426H78k718R21K855r52k630N33K768l92k952L63K742K51l134k68K874N02k698
$$ 878 -1840 -919 1936 984 -1646 -1113 1655 1263 -1689 -1326 1416 1667 -1467 -1735 1139 1641 -1057
3443a057p77K889P96k540j433K862J192k578j367K561J520k268j845J992K009
$$ -1057 -1834 1055 1851 -689 -2122 740 1932 -646 -2013 548 2068 -200 -2045 -53 1956
3458A956j910j987J746K027j388k116R74K365j036k304R08K259o61k321M35K455
$$ 1956 46 -1941 -195 1832 444 -1672 -698 1667 631 -1673 -765 1494 833 -1488 -1053 1402
3474A402l72k369K29K381J00k654j20K406O11k552o87K633M60k103r82K140J200
$$ 1402 1030 -1339 -1110 1271 1371 -1283 -1403 1003 1614 -938 -1625 1008 1468 -635 -1617 523 1723
3491A723k158j254K067J489k145j299J826J228j413j660J409J720j098j903J151
$$ 1723 -435 -1689 378 1867 -278 -1577 249 1477 64 -1596 -187 1533 435 -1468 -317
3506c17J846q96j931N52K189o46k128M08K221l43k223K90K050p2j876k74K136
$$ -317 1529 633 -1298 -746 1443 797 -1331 -923 1298 955 -1268 -978 1072 1000 -876 -1150 986
3523I86J24j856m24J940N99k094o81J743R51j643q98J519J108j384j451J478J388
$$ 986 1110 -746 -1170 770 1369 -725 -1406 337 1288 -355 -1253 266 1374 -10 -1461 17 1405
3540A405j277j316J017J572j335j266Q97J548o81j618O13J611o67j487L00J772
$$ 1405 128 -1188 -171 1401 66 -1200 -303 1245 564 -1054 -441 1170 503 -984 -684 1088
3556A088l10j585K0J512O8j731J73J428J91j491l23J343O45j401o24J273P57j378
$$ 1088 778 -807 -787 725 793 -938 -765 663 854 -637 -960 383 1028 -373 -997 276 1033 -345
3574c45o12J033R66j221r87J187Q79p63j131R42J089p88j171O01J335o14j303
$$ -345 -957 76 1042 -179 -1166 21 900 137 -994 -52 1037 249 -922 -321 1014 400 -903
3591i03M63J248l60j471O14J051L8j353m2J209Q9j066k19J186J52j098j75R67
$$ -903 -440 808 448 -1023 -409 642 680 -673 -715 494 583 -483 -702 484 636 -462 -637 330
3609C30K37q56o16J144M78r73m40Q30N37p49o68P59P99q06p75O58Q68o29q40N62
$$ 330 567 -289 -905 239 717 -256 -696 134 671 -78 -746 13 812 6 -769 -111 757 128 -712 -150
3629a50P75m10p65J90R35j97q80P3R04q7o51k93R77J9q48k50J000J45q73j70O86
$$ -150 625 215 -550 -360 575 378 -502 -429 475 388 -263 -556 421 440 -408 -658 342 487 -386 -556 130
3650A30L96p44o19R99L15p11k16L86O47o43l80N09L44n35l49K90N50l03o84L42
$$ 130 526 -218 -837 162 477 -234 -450 -64 583 -60 -440 69 413 -122 -471 -181 369 66 -618 -276
3670b76N41j2o16J39N99m2m93J9M50K1o64n5O49L4m60j41N54J16n72J6L13K08
$$ -276 265 253 -363 -224 375 333 -160 -141 309 330 -334 -389 260 294 -166 -307 247 363 -209 -193 120 328
3692C28n68J0N01K25n48l03L49M24l93k82K46M18j73l77J45K37m5l94n1M79p2
$$ 328 -240 -230 271 496 -52 -355 -6 418 25 -257 -11 407 234 -143 2 239 194 -200 -251 228 156
3713A56l39J24M05k13j12k56N37K9m38p6M30o4l59J2J96R5j06j16K40Jq9k80J18
$$ 156 -183 -59 346 133 21 -235 302 331 -107 -183 247 183 -176 -164 32 127 21 -95 145 146 57 -223 -105
3736a05M39l49k76K91O4p3o8l9K75k21j51J38K08j44l7r2L29j06k87J47J25J40
$$ -105 334 -15 -291 0 64 -9 -77 -116 159 -62 -213 -75 133 -11 -48 -140 189 83 -204 -57 68 208
3758B08k26k68K17L11m37N1J40J99j86m6j3K68k18l34L63P5j52j05O7K98q0k07
$$ 208 -18 -286 -69 242 -195 -144 -4 195 9 -37 -50 218 0 -334 29 104 -48 -153 -86 212 132 -75
3780g5M3Q1m7m1j8N3J70k96P8K14j26j98K46n4mq1k80M54O3k54oP7P8k20R5Q1
$$ -75 -32 49 2 -39 -57 -4 166 -130 -52 162 36 -162 84 30 26 -55 -335 119 182 -72 -78 -1 77 -143 -48 33
3806C3J22k58jJ57r0J14k58J68J8J6l53K78O5J54j84K3Q3j65J8Q2M4j24l2J22
$$ 33 155 -103 -104 53 -37 77 -181 -13 5 21 -332 -54 11 165 -19 4 87 -78 -60 22 66 -58 -90 32
3830C2P8j68J5n9K51j17j55N6P5rP7k00K71j18k2r4m1K58j07l4J24j10j0L3k3
$$ 32 110 -58 -43 -102 149 32 -123 -67 8 -1 76 -124 147 29 7 -87 -128 130 23 -11 113 3 -7 26 3
3855CP2P6k02J14r9J69j81R6J21j62j24J12p4M4m8MK28q4Q9k4j92m6l7Q8J6J31
$$ 3 75 151 -51 63 -36 133 -48 48 169 7 -117 -5 -79 -35 -83 -79 149 65 154 130 -62 -108 -145 -57 -41 90
3881I0nr5J58m8r3K3k81J81l9N4O0j52O8J97j82O9KK0R0n4n0m7Q2qp2j16L2P9
$$ 90 85 -10 148 100 7 30 -251 -70 -109 -55 5 -147 -79 118 -64 5 7 27 117 63 13 -34 48 40 -32 -148 -116 -37
3909c7k8J7l0k9P2j28J94J16k62J22J40k42R4k9Lr8J5J89mn4J86k40J49j10k7
$$ -37 -65 -48 -78 -107 -35 -163 31 147 -115 7 147 -95 -1 -30 -27 -125 -110 79 75 21 207 -33 116 6 -21
3934b1j45J82Q8j7k22Q3m6L6k0J28k1N6K4m6j9l8j18J78M4r8Q6k00P2nJ27k25
$$ -21 -166 16 104 87 -135 -52 -98 -62 -82 46 25 81 105 59 40 2 -116 62 106 8 94 -106 -34 -39 88 -137
3960a37J30R5j34p4K44q3o1l05L89O4k02J32L1J3j56J76m7J31k62M8PN1j3j45
$$ -137 -7 88 -46 -120 124 41 -20 -325 64 128 -74 58 89 102 -54 122 75 206 -56 -8 -1 50 37 -108
3984a08p4L89j69k42K62O0j30p1J63j4m5l5oJ94M0j99j11J65Q0k29M9p7L25j10
$$ -108 -182 207 38 -204 58 118 -12 -83 80 66 21 -14 -20 174 214 15 -96 69 149 -80 -31 -108 217 107
4008A07l39K38J0k2j89K70K3J4k05l9K13j69q5K43l9o6R8k81K58j20k7J85K5J7
$$ 107 -232 6 16 -6 -195 75 98 112 -93 -132 81 -88 -173 70 31 -35 63 -218 40 -80 -107 78 103 120
4032A20k95P3M12j86k70J4O8L91n43J21J56P6Q3m14K27K01j74n5J32r6l3j51K03
$$ 120 -175 -102 310 124 -146 -132 -64 327 -216 -95 61 137 220 -194 33 234 60 5 137 41 8 -143 60
4055F0J74j01m72K51J26Qk37K23R6k22j0N3J27q8p5j02M02j36j22j6O2J60k65
$$ 60 234 133 -339 -88 38 46 -191 32 128 -94 -104 -51 76 -12 -87 -189 213 77 -45 -61 1 161 -104
4078a04J5K83r2k23m0J74J23k37j94K85J93m1k31R6J59l84o3L21K4K4k96K61J27
$$ -104 -89 194 102 -121 -161 13 136 -101 -295 -10 183 142 -89 7 166 -218 -281 40 64 88 -208 53 180
4101A80j85q2L1J74j9l73J75K72j33q1J46r6J43k39n0J23L13m24J34J79N2l68
$$ 180 -5 -87 -56 118 99 -274 -99 173 40 -41 105 9 152 -87 -137 -14 299 -125 9 188 240 -128
4123a28J09J51L6j88j53L29Rj00k49J12K31l11n2K46K21l17J8j09L28q8j95n0
$$ -128 -19 132 168 -20 -173 156 165 65 -184 -72 159 -152 -204 42 263 -54 -36 -145 183 95 -100 -150
4145a50L36j63k92J78Q2j54K6J27J14o7j46Q4R5n4%j32Q4K45k37n8k5J55Q7r7
$$ -150 186 23 -269 -91 -9 -163 -137 -10 104 37 -109 -25 70 16 16 -116 -32 213 -24 -82 -107 48 135 38
4169C8j4R6k95K08p7K83j64j25K7L75l59o6Q1K16l30m7K00K9J11j83j53J37n8
$$ 38 24 120 -175 33 -44 239 75 -50 -23 352 -7 -73 8 224 -106 -153 47 76 187 4 -149 -12 -70
4192g0L1m1ML30l67M8J57n2k13R6J91J68j55k17P6P7j19M6J63Nm7m47M21K12l96
$$ -70 -39 -80 -76 254 -113 -65 92 40 -173 -77 114 282 127 -90 -14 63 -56 -10 153 158 111 -336 85 297 -99
4217i9j12J56L14l74j0J61Oj5j26r1L63k3j44r4K30m6o2J7p8n4J63j26rJ69k51
$$ -99 -211 -55 259 -115 -125 36 42 27 -99 -190 173 150 6 -88 142 96 34 51 -27 -81 82 -44 -53 116 -135
4242a35Q4r4K18j56n4K51o8m0j84K12Q3q5m5L4O9n2j98P1N0J7q0P3J27k19n0J00
$$ -135 -51 -145 73 -83 -137 114 46 6 -178 34 117 32 -13 21 90 38 -160 -89 -39 -22 -102 -29 98 -121 -171 -71
4268g1K88k11lm1P8j29J15J19n0j1k4q8J14J66m74J51J80k31K43k40J17J20q7
$$ -71 217 6 3 -38 40 -89 26 145 95 84 60 -28 86 252 -222 -71 109 -122 121 -119 -2 118 31
4291C1K6j07J13N5k26K37j12j44K0O0Q7k0k19J21J29K3k17J42N7p1j2J56j08k4
$$ 31 57 -50 63 118 -108 129 17 -127 -107 -47 40 20 -199 -78 51 74 -143 -1 56 -15 -27 129 21 -3
4315cK3p1o6K96j63O6M4j70j0m4K15o8k2j60K00o5Q9r9J74l02L01j0k14P8k7J02
$$ -3 20 -51 -117 179 16 82 126 -44 -54 -98 117 49 27 -133 67 2 91 -8 166 -136 165 155 -59 19 -8 94
4341I4Qk04J01Nl5O9L7q4j30J07L0j95J07M3j4K6oP3rq8R9j15K45m2l20K51P8
$$ 94 102 -102 -1 4 -31 38 75 -9 -139 -32 -2 -197 -90 -47 -61 -35 -41 32 23 -65 34 -81 164 122 -198 53 131
4368A31j21k19K97j46J76p7j41M7n6J29k6p5J39j66R2J50nl4k04J46N1r7j73K55
$$ 131 10 -209 88 -58 118 41 -100 -53 -109 20 -6 -81 58 -108 -16 134 129 95 -109 37 88 -9 -182 73
4392G3k0o1N7j55J4K28k07L9R3j84J73p2J7J10j07j8j08J33mQ6j22J85j06j62
$$ 73 53 -8 49 -106 -92 136 -71 -32 61 -123 50 -22 -5 105 -2 -20 -128 5 1 87 -35 150 44 -118
4416a18r2J43J04l2Kj8j26P1K52p8k50J05O3l0M6k08L14k19N7o9Nn3M4q9J53K13
$$ -118 -210 -67 37 5 7 -11 -137 -66 186 108 -142 -37 26 -4 42 -166 148 -71 -14 -83 -78 -131 -87 -176 -23 190
4442A90k14k16K38o1o5P6K12k09K50k91J10L6j27pp1P0Q3J9N3qn3j11J91O5j53
$$ 190 -24 -240 -2 -63 -128 -52 160 -49 201 -90 20 56 -71 -78 -149 -79 4 23 76 68 15 -96 95 160 7
4467GL0k8r8K03l18J23J06j28K44j36M0Q1j02R0r6N4r5o6J86o6r2K42j94Q8j74
$$ 7 37 9 -89 114 -204 -81 25 -103 141 5 45 126 24 114 18 72 -23 -89 97 31 -61 181 -13 75 -99
4492i9J46o1K5n9J85j91J33k3r5J07j4j17k6J09j4Q9j52J18L1k28J1J16ql7P4
$$ -99 47 -14 11 -48 137 -54 79 56 -39 68 54 -63 -89 20 6 95 -57 61 92 -136 -125 -9 -17 -54 20
4517B0N4J3j36j04L17j34j41m0J20K38J1l94L01j8m2k64J81K38l68P9J8J47j61
$$ 20 74 87 -49 -153 164 30 -111 -151 -31 207 218 -176 125 107 65 -199 -18 220 -148 -69 -51 96 -65
4540f5m5J37R0M4k36qJ79j29J7j14K64j78M8p8K52j89R6k65K64j18RK1Q0M6m12
$$ -65 -110 27 117 161 -75 -83 96 -33 -16 -130 134 -44 4 -74 178 -11 85 -180 84 -34 -25 -4 76 122 -290
4565b90J24K20J1l4j68J90P5r0l10K36L53j87l56K09K92n45M6J65K87k61l02J98
$$ -290 -166 54 65 31 -137 53 128 38 -272 -36 317 130 -226 -17 275 -270 -224 -59 228 -33 -335 -137
4587a37L38o2l80R3M37k48k95J71L23q5n14J92L79o6m20R3J74K34l21k18M41m4
$$ -137 201 139 -241 -148 289 41 -254 -83 240 155 -359 -167 212 146 -274 -181 -7 227 -94 -312 129 85
4609H5k57j07K24J79k22j48K77L06l41l20M43J02j01m33K23L10j96j99J25L69
$$ 85 -172 -279 -55 124 -98 -246 31 337 -4 -324 119 221 120 -313 -90 220 24 -175 -50 319
4629C19j60m15J88M10l11l36J41M87k62k71P6L43k8m71j0M68M4n90R8M88O2o94
$$ 319 159 -256 -68 342 31 -305 -164 323 61 -210 -134 209 181 -290 -300 168 212 -378 -280 208 270 -424
4651d24J58M81J6n21p4N52qk34j10J43K91l07k60M51J7j49m43M20M02l89l66L51
$$ -424 -266 215 231 -290 -364 188 180 -54 -164 -21 270 -37 -297 154 171 22 -421 -1 401 12 -354 -3
4673cL01j12m50M3P25m98l30K98L50k39l51J59M08J0o77R3N40J03o12%M88Pm14
$$ -3 298 186 -264 -221 504 6 -324 -26 324 85 -266 -107 301 311 -366 -273 267 370 -242 -242 246 253 -161
4696a61k92O77j4l91j14M39K06l25l43L59J10l01k56L98L25l95l00K82M28l00
$$ -161 -453 224 210 -181 -295 144 350 25 -318 41 151 -150 -406 -8 317 -78 -378 -96 332 32
4716C2n30M27N21l55o58M54M87r2n30M7N84j98m81l8N84R1n20J5O71j74n78j20
$$ 32 -498 -71 450 95 -563 -109 378 286 -244 -197 387 189 -292 -330 254 345 -175 -160 511 337 -241 -361
4738c61P04J53p33k96O87K77n71k23M32M25o46l31L93M43m01n58N43M08j86n95
$$ -361 343 496 -237 -533 154 431 -140 -363 69 494 -152 -483 -90 353 -48 -606 -63 345 159 -436
4758d36L53M01j91n30L46M36j72p46N25M31r3q91L72O08k24n46j7R33j20o49m16
$$ -436 -83 318 127 -403 -57 379 207 -539 -14 417 324 -567 -195 413 189 -357 -374 559 439 -210 -626
4779f26P43K33o48n6N09M00p46k34N54M40n87o53N90N93n18o11N67M82o53j23
$$ -626 117 350 -298 -354 155 555 -191 -425 129 569 -18 -671 -81 512 -6 -617 -50 432 -221 -344
4799c44J86O29l67o06L46O52l26o77K05O49j03o85L05M67k9p12J60M58J96o60
$$ -344 -158 471 104 -502 -156 496 170 -507 -302 347 244 -441 -136 331 302 -410 -250 208 404 -256
4819b56q2N79K61p54o4N04K41o93l29Q53L35n86o45Q23K82o04n35P92M37o04n56
$$ -256 -338 241 502 -252 -316 188 429 -264 -593 260 595 9 -636 187 469 -135 -670 122 559 -45 -601
4840f01L64Q74o37n48M31Q13n46n76L48N01j86o30J57Q31j21p50k34P80R3q59
$$ -601 -237 637 0 -548 -117 696 150 -426 -78 423 237 -393 -236 595 474 -276 -510 270 363 -496
4860d96J58O65O7q77Q1O74J77o07k34N45K93o16k61N93M91r36j25O73J43n97m16
$$ -496 -338 327 394 -483 -402 272 449 -158 -392 153 446 -170 -431 162 653 -283 -408 265 408 -189 -605
4881f05N72L67l18o23L82O97m14n79L68P59l62p40L95N49l16p74M10P99k30q67
$$ -605 -33 334 16 -607 -225 472 58 -521 -153 606 244 -496 -101 448 132 -642 -232 567 337 -530
4901e30L74L34J59p52p0R01j10o22p8O76J20o81k71P47J12m71j75M20L57n25l14
$$ -530 -156 178 337 -415 -485 416 306 -316 -394 282 402 -279 -550 197 309 -162 -337 83 440 -85 -399
4922c99N06M11o24l12O04K32m32m40M72L96l98n86O19L67j97p29L28O22k34o30
$$ -399 107 518 -106 -418 186 418 -14 -454 18 414 16 -570 49 416 219 -510 -182 440 206 -424
4942d24Q2P20r6n16j45P50j5p20P7N72J57p43r5N32Q5k07m85N24K66n09k34N13
$$ -424 -342 378 282 -234 -379 371 356 -364 -287 285 442 -301 -396 136 221 14 -471 53 319 -190 -424 89
$$ [...]
8191A2
##END NTUPLES=NMR FID
##END=
