##TITLE=1H_75CAA-2
 aceton-d6
 8 sc, 
 29.11.2023
##JCAMPDX= 6.0         $$ Bruker NMR JCAMP-DX V2.0
##DATA TYPE= NMR FID
##DATA CLASS= NTUPLES
##ORIGIN= UXNMR, Bruker Analytische Messtechnik GmbH
##OWNER= root
$$ XWIN-NMR		Version 3.5
$$ Wed Nov 29 14:00:35 2023 Russian Standard Time (UT+4h)  she@DPX200
##.OBSERVE FREQUENCY= 200.1313
##.OBSERVE NUCLEUS= ^1H
##.DELAY= (6, 6)
##.ACQUISITION MODE= SIMULTANEOUS
##.ACQUISITION SCHEME= undefined
##.AVERAGES= 8
##.DIGITISER RES= 18
##SPECTROMETER/DATA SYSTEM= spect
##.PULSE SEQUENCE= zg30
##.SOLVENT NAME= D2O
##.SHIFT REFERENCE= (INTERNAL, D2O, 0, 15.7039)
##AUDIT TRAIL= $$ (NUMBER, WHEN, WHO, WHERE, WHAT)
$$ ##TITLE= Audit trail, XWIN-NMR		Version 3.5
$$ ##JCAMPDX= 5.01
$$ ##ORIGIN= Bruker BioSpin GmbH
$$ ##OWNER= she
$$ F:/spectra/data/she/nmr/H-F/1/audita.txt
$$ ##AUDIT TRAIL=  $$ (NUMBER, WHEN, WHO, WHERE, WHAT)
(   1,<2023-11-29 13:59:16.96 +0400>,<she>,<DPX200>,
      <created by zg, POWCHK disabled, PULCHK disabled
       configuration hash MD5:
       00 E9 B6 7A A2 85 ED C7 34 08 36 98 17 FE 4E 26
       data hash MD5: 16K
       82 8C C1 C6 37 87 EF C2 FE 59 14 0E 64 BF 6A 6B>)
$$ ##END=
$$ 
$$ hash MD5
$$ C7 FC ED EB 72 EC 7B DA FB 3E 08 17 B3 DC E7 B2
##$RELAX= 
##$RELAX= 
##$RELAX= 
##$RELAX= 
##$RELAX= 
##$RELAX= 
$$ Bruker specific parameters
$$ --------------------------
##$DU= <F:/spectra>
##$EXPNO= 1
##$NAME= <H-F>
##$PROCNO= 1
##$TYPE= <nmr>
##$USER= <she>
##$AMP= (0..31)
100 100 100 100 100 100 100 100 100 100 100 100 100 100 100 100 100 100 
100 100 100 100 100 100 100 100 100 100 100 100 100 100 
##$AQSEQ= 0
##$AQ_mod= 1
##$AUNM= <au_zg>
##$AUTOPOS= <>
##$BF1= 200.13
##$BF2= 200.13
##$BF3= 200.13
##$BF4= 200.13
##$BF5= 200.13
##$BF6= 200.13
##$BF7= 200.13
##$BF8= 200.13
##$BYTORDA= 1
##$CFDGTYP= 0
##$CFRGTYP= 5
##$CHEMSTR= <none>
##$CNST= (0..31)
1 1 145 1 1 1 1 1 1 1 1 1 1 1 1 1 1 1 1 1 1 1 1 1 1 1 1 1 1 1 1 1 
##$CPDPRG= <>
##$CPDPRG1= <>
##$CPDPRG2= <>
##$CPDPRG3= <>
##$CPDPRG4= <mlev>
##$CPDPRG5= <mlev>
##$CPDPRG6= <mlev>
##$CPDPRG7= <mlev>
##$CPDPRG8= <mlev>
##$CPDPRGB= <>
##$CPDPRGT= <>
##$D= (0..31)
0 1.2 0 0 0 0 0 0 0 0.06 0 0.03 0 0 0 0 0.0002 0 0 0 0 0 0 0 0 0 0 0 0 
0 0 0 
##$DATE= 1701251956
##$DBL= (0..7)
120 120 120 120 120 120 120 120 
##$DBP= (0..7)
150 150 150 150 150 150 150 150 
##$DBP07= 0
##$DBPNAM0= <>
##$DBPNAM1= <>
##$DBPNAM2= <>
##$DBPNAM3= <>
##$DBPNAM4= <>
##$DBPNAM5= <>
##$DBPNAM6= <>
##$DBPNAM7= <>
##$DBPOAL= (0..7)
0.5 0.5 0.5 0.5 0.5 0.5 0.5 0.5 
##$DBPOFFS= (0..7)
0 0 0 0 0 0 0 0 
##$DE= 6
##$DECBNUC= <off>
##$DECIM= 32
##$DECNUC= <off>
##$DECSTAT= 4
##$DIGMOD= 1
##$DIGTYP= 9
##$DL= (0..7)
0 120 120 120 120 120 120 120 
##$DP= (0..7)
150 150 150 150 150 150 150 150 
##$DP07= 0
##$DPNAME0= <>
##$DPNAME1= <>
##$DPNAME2= <>
##$DPNAME3= <>
##$DPNAME4= <>
##$DPNAME5= <>
##$DPNAME6= <>
##$DPNAME7= <>
##$DPOAL= (0..7)
0.5 0.5 0.5 0.5 0.5 0.5 0.5 0.5 
##$DPOFFS= (0..7)
0 0 0 0 0 0 0 0 
##$DQDMODE= 0
##$DR= 18
##$DS= 0
##$DSLIST= <SSSSSSSSSSSSSSS>
$$ [...]
##$SUBNAM2= <"">
##$SUBNAM3= <"">
##$SUBNAM4= <"">
##$SUBNAM5= <"">
##$SUBNAM6= <"">
##$SUBNAM7= <"">
##$SUBNAM8= <"">
##$SUBNAM9= <"">
##$SW= 18.0517328524113
##$SWIBOX= (0..15)
0 0 2 0 0 0 0 0 0 0 0 0 0 0 0 0 
##$SW_h= 3612.71676300578
##$TD= 16384
##$TD0= 1
##$TE= 0
##$TE2= 300
##$TE3= 300
##$TEG= 300
##$TL= (0..7)
0 120 120 120 120 120 120 120 
##$TP= (0..7)
150 150 150 150 150 150 150 150 
##$TP07= 0
##$TPNAME0= <>
##$TPNAME1= <>
##$TPNAME2= <>
##$TPNAME3= <>
##$TPNAME4= <>
##$TPNAME5= <>
##$TPNAME6= <>
##$TPNAME7= <>
##$TPOAL= (0..7)
0.5 0.5 0.5 0.5 0.5 0.5 0.5 0.5 
##$TPOFFS= (0..7)
0 0 0 0 0 0 0 0 
##$TUNHIN= 0
##$TUNHOUT= 0
##$TUNXOUT= 0
##$USERA1= <user>
##$USERA2= <user>
##$USERA3= <user>
##$USERA4= <user>
##$USERA5= <user>
##$V9= 5
##$VALIST= <valist>
##$VCLIST= <CCCCCCCCCCCCCCC>
##$VD= 0
##$VDLIST= <DDDDDDDDDDDDDDD>
##$VPLIST= <PPPPPPPPPPPPPPP>
##$VTLIST= <TTTTTTTTTTTTTTT>
##$WBST= 1024
##$WBSW= 4
##$XGAIN= (0..3)
0 0 0 0 
##$XL= 0
##$YL= 0
##$YMAX_a= 280740
##$YMIN_a= -335210
##$ZGOPTNS= <>
##$ZL1= 120
##$ZL2= 120
##$ZL3= 120
##$ZL4= 120
##$ABSF1= 10
##$ABSF2= 0
##$ABSG= 5
##$ABSL= 3
##$ALPHA= 0
##$AQORDER= 0
##$ASSFAC= 0
##$ASSFACI= 0
##$ASSFACX= 0
##$ASSWID= 0
##$AUNMP= <proc_1d>
##$AZFE= 0.1
##$AZFW= 0.1
##$BCFW= 1
##$BC_mod= 2
##$BYTORDP= 1
##$COROFFS= 0
##$CY= 11.3945322036743
##$DATMOD= 1
##$DC= 2
##$DFILT= <>
##$DTYPP= 0
##$F1P= 15.7292609196834
##$F2P= 12.9074282941183
##$FCOR= 0.5
##$FTSIZE= 0
##$FT_mod= 4
##$GAMMA= 1
##$GB= 0.15
##$INTBC= 1
##$INTSCL= 1
##$ISEN= 128
##$LB= 0.24
##$LEV0= 0
##$LPBIN= 0
##$MAXI= 10000
##$MC2= 0
##$MEAN= 0
##$ME_mod= 0
##$MI= 1.114404
##$NCOEF= 0
##$NC_proc= 0
##$NLEV= 6
##$NOISF1= 3.799351
##$NOISF2= 2.8
##$NSP= 1
##$NTH_PI= 0
##$NZP= 0
##$OFFSET= 15.70392
##$PC= 1
##$PHC0= -24748.32
##$PHC1= 9.2527
##$PH_mod= 1
##$PKNL= yes
##$PPARMOD= 0
##$PSCAL= 0
##$PSIGN= 0
##$REVERSE= no
##$SF= 200.130013532006
##$SI= 16384
##$SIGF1= 3
##$SIGF2= 2
##$SINO= 400
##$SIOLD= 16384
##$SREGLST= <1H.CDCl3>
##$SSB= 0
##$STSI= 0
##$STSR= 0
##$SW_p= 3612.71676300578
##$SYMM= 0
##$S_DEV= 0
##$TDeff= 0
##$TDoff= 0
##$TI= <>
##$TILT= no
##$TM1= 0
##$TM2= 0
##$TOPLEV= 0
##$USERP1= <user>
##$USERP2= <user>
##$USERP3= <user>
##$USERP4= <user>
##$USERP5= <user>
##$WDW= 1
##$XDIM= 8192
##$YMAX_p= 0
##$YMIN_p= 0
$$ End of Bruker specific parameters
$$ ---------------------------------
##NTUPLES= NMR FID
##VAR_NAME=  TIME,          FID/REAL,        FID/IMAG
##SYMBOL=    X,             R,               I
##VAR_TYPE=  INDEPENDENT,   DEPENDENT,       DEPENDENT
##VAR_FORM=  AFFN,          ASDF,            ASDF
##VAR_DIM=   8192,          8192,            8192
##UNITS=     SECONDS,       ARBITRARY UNITS, ARBITRARY UNITS
##FACTOR=    0.0002768,     1,               1
##FIRST=     0,             0,               0
##LAST=      2.2672688,     0,               0
##MIN=       0,             -335210,         0
##MAX=       2.2672688,     280740,          0
$$ Real data points
##PAGE= N=1
##DATA TABLE= (X++(R..R)), XYDATA
$$ [...]
$$ plain form
1307 1475 1704 -3339 -5121 -705 2309 -283 -1516 2799 5255 741 -3233 -715 1354 -2285 -5224
1322 -5224 -1014 4010 1931 -1559 1289 4937 1421 -4200 -3044 1386 24 -4119 -1454 4528 3880
1337 3880 -1199 -1057 3136 1700 -4599 -4765 1059 2126 -2302 -2033 3993 5350 -730 -3490 950 2176
1353 2176 -3321 -5435 330 4343 361 -2326 2463 5358 -213 -5031 -1477 2554 -1293 -5291 -232
1368 -232 5765 2730 -2576 2 4576 889 -5814 -3746 2624 1303 -3801 -1172 5630 4500 -2592
1383 -2592 -2767 2972 1726 -5333 -5263 2209 4024 -1852 -2666 4344 5649 -1740 -5057 438 2865 -3073
1399 -3073 -5677 1381 5878 578 -3224 1902 5565 -560 -6399 -1742 3861 -459 -5248 -126 6563
1414 6563 3039 -3743 -1280 4634 1015 -6299 -3798 3740 2723 -3743 -1780 5856 4555 -3838 -4088
$$ packed form
1307A475K29n043j782M416L014k592j233M315K456m514l974K518K069l639k939
1322e224M210N024k079l490K848L648l516n621J156M430j362m143K665N982o48
1337C880n079J42M193j436o299j66N824J067m428K69O026J357o080k760M440J226
1353B176n497k114N765M013l982k687M789K895n571m818L554M031l847l998N059
1368b32N997l035n306K578M574l687o703K068O370j321n104K629O802j130p092
1383b592j75N739j246p059P0P472J815n876q14P010J305p389l317N495K427n938
1399c073k604P058M497n300l802N126L663o125n839M657N603m320m789N122O689
1414F563l524o782K463N914l619p314K501P538j017o466J963P636j301q393k50
$$ plain form
1429 -4088 2899 2545 -5074 -5256 3333 5426 -1798 -3452 3905 5459 -2785 -6365 526 4058 -2547
1444 -2547 -5586 2219 7056 644 -4512 1007 5626 -1108 -7438 -1763 4964 712 -5052 36 7298
1459 7298 3019 -5049 -2395 4370 974 -6610 -3823 4887 3889 -3748 -2137 6039 4594 -4641 -5293
1474 -5293 2689 3244 -4896 -5354 3998 6323 -1806 -4245 3348 5541 -3221 -7062 822 5076 -1923
1489 -1923 -5638 2314 7567 363 -5727 382 5709 -1178 -7624 -1378 6158 1486 -5372 -258 7279
1504 7279 2424 -6132 -2933 4690 1545 -6590 -3356 6053 4418 -4206 -2805 5577 4204 -5474 -5893
1519 -5893 3152 4062 -4327 -4855 4512 6628 -2132 -5121 2795 5189 -3623 -7123 1241 5895 -1236
1534 -1236 -5349 2532 7636 -132 -6523 -300 5465 -1059 -7560 -1031 6889 1938 -5298 -296 7026
$$ packed form
1429d088O987l54p619j82Q589K093p224j654P357J554q244l580O891L532o605
1444b547l039P805M837o412n156N519M619o734o330N675O727m252n764N088P262
1459G298m279q068K654O765l396p584K787Q710r98p637J611Q176j445r235o52
1474e293P982N55q140m58R352K325q129k439P593K193q762l841P884M254o999
1489a923l715P952N253p204o090O109N327o887o446O246P536m672o858N114P537
1504G279m855q556L199P623l145q135L234R409j635q624J401Q382j373r678m19
1519e893R045R10q389n28R367K116q760k989P916K394q812l500Q364M654p131
1534a236m113P881N104p768o391O223N765o524o501O529P920m951p236N002P322
$$ plain form
1549 7026 2021 -6701 -3358 4836 1750 -6412 -2908 6515 4610 -4327 -3261 5186 3802 -5849 -5745
1564 -5745 3627 4443 -3956 -4552 4681 6473 -2672 -5471 2519 5019 -3493 -6730 1735 6446 -956
1579 -956 -5358 2183 6972 -725 -6870 -600 5487 -533 -6832 -527 6972 1941 -5336 -883 6198
1594 6198 1401 -6933 -3268 5087 2298 -5566 -2445 6458 4457 -4674 -3803 4613 3325 -5735 -5303
1609 -5303 3945 4939 -3425 -4051 4698 6009 -3140 -5750 2195 4786 -3397 -6354 2372 6712 -891
1624 -891 -5184 1964 6525 -1070 -7064 -601 5397 -439 -6264 -34 6890 1868 -5378 -1117 5721
1639 5721 1095 -6798 -2920 5148 2495 -5036 -2239 6149 3987 -4850 -3782 4154 3112 -5201 -4716
1654 -4716 4218 4972 -3236 -3831 4244 5173 -3462 -5743 2160 4690 -3046 -5508 2724 6474 -950 -5237
$$ packed form
1549G026n005q722L343Q194l086q162L504R423j905q937J066Q447j384r651J04
1564e745R372Q16q399n96R233J792r145k799P990K500q512l237Q465M711p402
1579i56m402P541M789p697o145O270O087o020o299O305P499n031p277M453P081
1594F198m797q334L665Q355k789p864L121Q903k001r131Q71Q416j288r060M32
1609e303R248R94q364o26Q749J311r149k610P945K591q183k957Q726M340p603
1624h91m293P148M561p595n994O463N998n836n825O230O924n022p246M261O838
1639E721m626p893L878Q068k653p531K797Q388k162q837J068P936j042q313M85
1654d716Q934P54q208n95Q075R29q635k281P903K530p736k462Q232L750p424m287
$$ plain form
1670 -5237 1568 5640 -1602 -6753 -152 5416 -153 -5490 484 6687 1271 -5614 -1253 5053 583
1685 583 -6249 -2336 5365 2596 -4605 -1728 5713 3174 -4961 -3798 3768 2822 -4751 -3867 4401 4762
1701 4762 -2939 -3557 3837 4498 -3618 -5523 2189 4436 -2606 -4741 2729 5916 -1042 -4960 1317
1716 1317 4948 -1750 -6097 119 5187 -84 -4909 697 6006 617 -5331 -1108 4582 491 -5671
1731 -5671 -1644 5301 2316 -4276 -1532 5005 2461 -4881 -3426 3654 2581 -4114 -2971 4341 4188
1746 4188 -2899 -3481 3188 3563 -3633 -4770 2188 4157 -2014 -3908 2682 5172 -1443 -4655 932
1761 932 4055 -1746 -5220 520 5006 86 -4163 709 5041 201 -5005 -1054 4100 346 -4816
1776 -4816 -946 4945 2025 -3752 -1345 4243 1671 -4598 -2812 3499 2328 -3553 -2342 4079 3608
$$ packed form
1670e237O805M072p242n151O601N568n569n337N974O203n416o885M361O306m470
1685E83o832L913P701k769p201K877P441k539q135J163P566r46p573Q84Q268L61
1701D762p701o18P394O61q116j905P712K247p042k135P470L187o958l918O277
1716A317L631o698m347O216N068n271m825N606N309n389n948M223N690m091o162
1731e671M027O945k985o592K744O537k544p342J455P080j073o695J143P312j53
1746D188p087n82O669L75p196j137O958J969o171j894O590K490o615l212N587
1761I32L123n801l474N740M486m920m249M872M332m840n206L951N154l754n162
1776d816L870N891k920n777K407N588k572o269J786O311j171n881J211O421m71
$$ plain form
1791 3608 -2973 -3134 2851 2914 -3286 -4035 2241 3865 -1798 -3375 2443 4217 -1654 -4312 732 3557
1807 3557 -1420 -4391 858 4507 56 -3647 491 4227 -67 -4678 -899 3656 495 -3844 -519
1822 -519 4394 1760 -3422 -1386 3494 1196 -4069 -2302 3177 2294 -2893 -1814 3641 2870 -2814 -2912
1838 -2912 2208 2320 -2968 -3280 2422 3553 -1588 -2795 2193 3401 -1773 -3965 795 3094 -1440
1853 -1440 -3570 1135 4054 -67 -3287 338 3474 -425 -4036 -668 3231 528 -3145 -218 3853
1868 3853 1237 -3185 -1286 2792 916 -3427 -1834 3002 1995 -2394 -1433 2998 2103 -2625 -2560 1950
1884 1950 2014 -2451 -2416 2318 2984 -1412 -2403 1692 2600 -1827 -3314 847 2695 -1064 -2729 1256 3482
1901 3482 -262 -2904 258 2631 -632 -3309 -215 3015 467 -2474 89 3222 685 -2827 -1088
$$ packed form
1791C608o581j61N985O3o200p49O276J624n663j577N818J774n871k658N044K825
1807C557m977k971N249L649m451l703M138L736m294m611L779M555l161m339L325
1822e19M913k634n182K036M880k298n265J767N479q83n187J079N455p71n684r8
1838b912N120J12n288l12N702J131n141j207M988J208n174k192M760K299m534
1853a440k130M705K919m121l220L625L136l899l611L368L899k703l673K927M071
1868C853k616m422J899M078j876m343J593M836j007m389R61M431q95m728O5M510
1884A950O4m465L5M734O66m396r91M095R08m427j487M161J848l759j665L985K226
1901C482l744k642L162K373l263k677L094L230k548k941K563L133k537l512J739
$$ plain form
1916 -1088 2217 585 -2889 -1171 2703 1623 -1978 -1052 2391 1554 -2382 -2111 1582 1485 -1850 -1668
1932 -1668 1977 2423 -1196 -1978 1302 1880 -1672 -2618 831 2175 -770 -2044 1142 2684 -410 -2328
1948 -2328 193 2020 -590 -2547 84 2581 345 -1969 115 2385 328 -2451 -916 1813 392
1963 392 -2168 -616 2291 1298 -1588 -970 1708 927 -2098 -1553 1375 1306 -1321 -1182 1707 1817 -1164
1980 -1164 -1696 884 1282 -1384 -1928 822 1948 -441 -1450 927 1872 -477 -1928 44 1538 -482
1996 -482 -1903 278 2001 448 -1421 55 1776 42 -2037 -666 1336 307 -1549 -331 1846
2011 1846 1023 -1254 -780 1300 542 -1608 -1145 1034 1098 -1003 -827 1372 1262 -970 -1345 542 930
2028 930 -922 -1452 742 1498 -312 -1081 637 1350 -479 -1602 -21 1161 -262 -1188 282 1573
$$ packed form
1916a088L305j632l474J718L874j080l601R26L443q37l936K71L693r7l335J82
1932a668L645M46l619p82L280N78l552r46L449J344k945j274L186J542l094j918
1948b328K521J827k610j957K631K497k236k314K084K270k057k779J535K729j421
1963C92k560J552K907r93k886O18K678p81l025N45K928o9k627J39K889J10k981
1980a164n32K580L98k666n44K750J126k389j009K377R45k349j451J972J494k020
1996d82j421K181J723j553j869J476J721j734k079J371K002j029j856J218K177
2011A846q23k277M74K080p58k150M63K179O4k101J76K199j10k232l75J887L88
2028I30j852n30K194P56j810p69J718P13j829j123J581J182j423r26J470J291
$$ plain form
2044 1573 277 -1145 -173 1133 -137 -1579 -486 1106 423 -913 -127 1401 643 -1059 -698 687
2060 687 275 -1238 -788 1011 900 -598 -454 949 843 -843 -1084 398 668 -703 -853 758 1150
2077 1150 -134 -732 403 908 -488 -1229 -13 811 -94 -813 204 1188 103 -910 -166 645 -159
2094 -159 -1117 -332 811 354 -603 7 961 381 -791 -585 464 181 -823 -472 808 646 -364 -348
2112 -348 583 448 -664 -711 263 399 -367 -412 591 817 -112 -522 244 358 -449 -791 15 626 -30 -466
2132 -466 308 802 30 -623 -251 283 -89 -698 -97 703 336 -184 65 538 170 -700 -459 199 36 -392
2152 -392 -136 472 497 -142 -244 265 131 -527 -474 97 331 -74 -150 396 497 -56 -335 12 109 -241 -503
2173 -503 32 416 79 -154 205 381 63 -432 -206 132 -105 -329 26 444 244 -77 -53 255 68 -461
$$ packed form
2044A573j296j422R72J306j270j442J093J592o83j336P86J528p58j702L61J385
2060F87m12j513M50J799j11j498J44J403j06j686k41J482K70j371j50J611L92
2077A150j284n98J135N05j396p41J216Q24r05p19J017R84j085j013P44Q11q04
2094a59r58P85J143m57r57O10R54n80j172K06J049k83j004L51J280j62j010J6
2112c48R31j35j112m7R74J36p66m5J003K26r29m10P66J14q07l42Q06O11o56m36
2132d66P74M94p72o53L72N34l72o09O01Q00l67n20K49M73l68q70K41O58j63m28
2152c92K56O08K5o39j02N09j34o58N3N71K34m05p6N46J01n53k79L47R7l50k62
2173e03N35L84l37k33L59J76l18m95K26L38k37k24L55M18k00l21K4L08j87n29
$$ plain form
2193 -461 -347 78 172 -88 -76 364 370 -59 -204 5 8 -254 -362 60 273 57 66 259 301 -114 -352 -144 -12
2216 -12 -196 -291 14 295 178 39 49 132 -16 -322 -212 89 42 -117 22 292 270 -84 -79 11 -74 -249 -195 42
2240 42 188 65 34 324 189 -63 -134 -74 -54 -110 -147 145 207 47 21 58 122 -57 -325 -198 -70 -94 -93 116 199
2265 199 153 -16 -77 -5 -163 -220 -155 48 96 49 104 230 91 -66 -115 -66 -129 -193 -101 121 159 161 155 134 61 -22 -181
2292 -181 -77 -30 -48 54 114 195 84 20 -6 -31 -163 -239 -141 -32 9 8 144 222 142 12 -98 -83 -80 -126 -62 44
2318 44 119 89 197 88 101 -75 -191 -101 -97 -86 22 59 139 69 37 25 -4 -119 -158 -33 -3 35 -5 28 115 75 -86
2345 -86 -89 -123 -131 -177 -82 61 167 16 136 145 59 -12 -166 -127 -83 -146 32 92 135 114 -17 81 -12 -130 -211 -67 17
2372 17 -50 23 149 242 37 9 10 11 -136 -219 -27 41 25 9 99 144 -2 -205 -118 -54 -54 -169 -39 171 172 -15 101
$$ packed form
2193d61J14M25R4k60J2M40Om29j45K09Lk62j08M22K13k16RJ93M2m15k38K08J32
2216a2j84r5L05K81j17j39J0Q3j48l06J10L01m7j59J39K70k2l54NR0q5j75N4K37
2240D2J46j23l1K90j35k52p1O0K0n6l7K92O2j60k6L7O4j79k68J27J28k4JK09Q3
2265A99m6j69o1P2j58n7O5K03M8m7N5J26j39j57m9M9o3o4R2K22L8Kok1p3q3j59
2292a81J04M7j8J02O0Q1j11o4k6k5j32p6R8J09M1jJ36P8q0j30j10J5Lm6O4J06
2318D4P5l0J08j09J3j76j16R0MJ1J08L7Q0p0l2j2k9j15l9J25L0L8m0L3Q7m0j61
2345h6ll4qm6R5J43J06j51J20Rq6p1j54L9M4o3J78O0M3k1j31R8r3j18q1J44Q4
2372A7o7P3J26R3k05k8JJj47q3J92O8j6j6R0M5j46k03Q7O4%j15J30K10Jj87J16
$$ plain form
2399 101 109 21 -134 -67 27 -45 -104 -37 167 173 -54 -38 89 -25 -208 -141 58 33 -51 -11 239 243 -128 -143 1 -30
2425 -30 -131 -219 99 191 25 -59 212 163 -114 -278 -93 46 -79 -200 86 228 93 -97 55 173 -7 -254
2447 -254 -88 155 -53 -91 82 304 122 -203 -77 110 -101 -298 -155 123 189 -166 -80 288 160 -157 -197
2468 -197 53 9 -212 -180 269 202 -77 -73 161 197 -130 -281 -23 128 -92 -170 77 296 86 -145 94 273
2490 273 -45 -298 -48 209 -4 -198 18 378 46 -222 -113 107 33 -292 -173 269 123 -133 32 240
2510 240 190 -242 -275 109 100 -190 -156 267 232 -64 -177 110 193 -198 -319 26 166 -67 -211 135 347 -36
2532 -36 -239 9 208 -140 -267 -77 230 83 -215 92 329 92 -258 -136 125 9 -219 -118 252 173 -92
2553 -92 -161 166 176 -275 -240 122 224 -145 -155 171 324 -107 -179 126 180 -177 -286 67 241 -52 -205 110
$$ packed form
2399A01Qq8j55O7R4p2n9O7K04Ok27J6J27j14j83O7J99k5q4M0K50Ml71j5J44l1
2425c0j01q8L18R2j66q4K71m9k77j64J85J39j25j21K86J42j35j90J52J18j80k47
2447b54J66K43k08l8J73K22j82l25J26J87k11j97J43K78O6l55Q6L68j28l17m0
2468a97K50m4k21L2M49o7k79MK34L6l27j51K58J51k20p8K47K19k10k31K39J79
2490B73l18k53K50K57k13j94K16L60l32k68J09K20p4l25J19M42j46k56J65K08
2510B40n0m32l3L84rk90L4M23l5k96j13K87Q3l91j21L45J40k33j44L46K12l83
2532c6k03K48J99l48j27J90L07j47k98L07K37k37l50J22K61j16k28J01L70p9k65
2553i2o9L27J0m51L5L62J02l69j0L26J53m31p2L05N4l57j09L53J74k93j53L15
$$ plain form
2575 110 304 19 -288 -47 204 -39 -266 27 310 69 -207 -29 226 64 -360 -244 205 61 -269 -76
2595 -76 241 172 -219 -178 196 214 -209 -199 97 228 -113 -123 223 267 -142 -217 56 202 -164 -290 83 253 9
2618 9 -175 74 252 -74 -263 -90 222 -93 -227 26 335 138 -231 -32 253 25 -340 -119 218 50 -214
2639 -214 -60 261 127 -161 -132 135 103 -183 -196 114 202 -90 -96 203 205 -105 -273 46 164 -208 -227 91 195
2662 195 -27 -169 33 208 -102 -332 -55 128 -66 -154 25 213 110 -164 -12 154 -11 -203 -108 145 129
2683 129 -160 -83 215 116 -81 -134 63 101 -182 -89 166 147 11 -108 95 201 -55 -195 -12 73 -103 -84 63
2706 63 180 18 -100 -2 105 -125 -191 -70 59 34 -110 41 158 36 -150 -55 69 18 -148 -121 112 99 -19
2729 -19 1 85 77 -55 -154 34 95 -79 -85 117 121 47 -51 29 69 -79 -117 59 33 -27 -85 13 110 -28 -47 -28 2 17
$$ packed form
2575A10J94k85l07K41K51k43k27K93K83k41k76J78K55j62m24J16M49j44l30J93
2595g6L17o9l91M1L74J8m23J0K96J31l41j0L46M4m09p5K73J46l66j26L73J70k44
2618Ij84K49J78l26j89J73L12l15j34K53L09j97l69J99K85k28l65K21L37j68k64
2639b14J54L21j34k88K9K67l2k86j3L10Q8k92oK99Kl10j68L19J18l72j9L18J04
2662A95k22j42K02J75l10k30K77J83j94q8J79J88j03k74J52J66j65j92R5K53j6
2683A29k89P7K98r9j97n3J97L8k83R3K55j9j36j19K03J06k56j40J83Q5j76J9J47
2706F3J17j62j18R8J07k30o6J21J29k5j44J51J17j22j86R5J24n1j66K7K33j3j18
2729a9K0Q4qj32r9J88O1j74oK02Mp4r8Q0M0j48l8J76k6o0n8R8R7j38j9J9L0J5
$$ plain form
2757 17 -99 -52 48 29 5 8 94 67 -98 -72 -2 -25 -115 -60 94 73 0 2 74 3 -51 -118 42 65 -2 -51 26 90 -5
2786 -5 -78 -27 19 -72 -85 -73 74 9 -60 25 12 9 -69 -74 -24 -23 -124 -15 71 69 -4 68 15 -3 -40 -72 42 0 -23 5 78
2817 78 78 25 32 0 19 -33 -44 -39 31 0 -2 10 35 8 -63 -93 -17 -55 -42 -3 49 80 -4 22 -10 -4 -123 -37 8 -14 -38 -7
2849 -7 68 70 -40 28 11 -8 -8 -69 -18 17 -24 33 83 67 -4 -25 -51 8 -33 -70 53 48 19 8 -43 42 39 -103 -57 -28 -11
2880 -11 -38 -46 -16 79 36 14 89 -3 -80 -15 1 24 -7 -2 100 122 -9 -22 -32 39 -118 -91 -16 114 35 35 25 98 6 -65
2910 -65 -59 67 17 -102 58 78 84 -112 -12 103 -24 -145 -32 42 -19 -77 -106 34 69 -99 -54 61 4 -98 -94
2935 -94 79 108 -27 -52 89 103 -101 -114 43 138 -155 -163 106 173 -92 -152 43 172 24 -205 76 197 -32
2958 -32 -224 41 252 27 -264 0 220 -47 -264 -108 172 50 -264 -57 265 154 -194 -103 209 125 -152
$$ packed form
2757A7j16M7J00j9k4LQ6k7j65K6P0k3r0N5J54k1p3KP2p1n4o7J60K3o7m9P7O4r5
2786ep3N1M6r1j3J2J47o5o9Q5j3lp8nN0Jj01J09Q6kp3P2n3j8l7l2J14m2k3K8P3
2817G8%n3Pl2J9n2j1NP0l1kJ2K5k7p1l0P6l8J3L9N2L1q4K6l2Oj19Q6M5k2k4L1
2849gP5Kj10O8j7j9%o1N1L5m1N7N0j6p1k1k6N9m1l7J23nk9j1n1Q5lj42M6K9J7
2880a1k7qL0R5m3k2P5r2p7O5J6K3l1NJ02K2j31j3j0P1j57K7P5J30p9%j0P3r2p1
2910f5OJ26n0j19J60K0Oj96J00J15j27j21J13P4o1n8k9J40L5j68M5J15n7j02M
2935i4J73K9j35k5J41J4k04j3J57R5k93qK69O7k65o0J95J29j48k29K81J21k29
2958c2j92K65K11k25k91K64K20k67k17J56K80j22l14K07L22j11l48R1L12q4k77
$$ plain form
2979 -152 -216 208 170 -215 -147 236 248 -181 -287 137 235 -177 -262 145 285 -119 -261 123 305 -144 -327 27
3001 27 308 28 -370 -29 407 -7 -356 -21 331 52 -433 -109 331 60 -303 -125 337 162 -327 -204
3021 -204 362 172 -302 -252 307 262 -302 -260 262 398 -318 -331 226 346 -238 -390 196 453 -127 -439 103
3042 103 414 -146 -484 32 415 3 -518 12 462 -15 -516 -116 464 117 -482 -153 500 259 -435 -226
3062 -226 478 285 -465 -353 449 261 -422 -368 391 453 -364 -427 313 445 -306 -561 293 508 -234 -572 200
3083 200 606 -156 -604 141 558 -63 -642 33 667 -45 -641 -52 650 157 -680 -226 707 158 -706 -294
3103 -294 607 313 -642 -384 613 395 -612 -489 536 532 -485 -527 563 654 -508 -630 410 619 -418
3122 -418 -744 352 811 -203 -682 228 794 -202 -860 50 824 -80 -853 41 829 103 -840 -139 872
$$ packed form
2979a52o4M24l8l85O8L83J2m29j06M24R8m12q5M07J40m04j42L84J82m49j83L54
3001B7K81k80l98L41M36m14l49L35L52k79m85L24M40k71l63J78M62j75m89J23
3021b04N66j90m74N0N59m5n64M2N22J36p16j3N57J20n84j52N86K57n80l12N42
3042A03L11n60l38N16L83m12n21N30M50m77n01M00N80l47n99L29O53k41o94K09
3062b26P04j93p50J12Q02j88o83N4P59O2q17o3P40J32p51k55Q54K15p42l38P72
3083B00M06p62m48P45M17o21n79O75O34p12n96N89P02m93q37M54R33n49q64M12
3103b94R01k94r55K58R97k18j007J23J025mj017m2J090R1j162j22J040K09j037
3122d18l26J096M59j014m79R10N66r96o58R10P74r04p73Q94P88p26r43P01J011
$$ plain form
3141 872 183 -900 -228 773 305 -744 -373 809 499 -766 -478 703 563 -726 -628 665 676 -572
3159 -572 -750 580 748 -529 -835 449 808 -397 -860 351 931 -229 -924 157 883 -103 -1000 66
3177 66 944 73 -952 -86 1009 221 -978 -275 981 338 -911 -397 964 451 -915 -507 914 603
3195 603 -835 -651 825 710 -736 -780 760 837 -590 -865 611 877 -544 -1001 435 954 -366 -1026
3213 -1026 265 980 -186 -1062 137 1047 -124 -1103 -55 1047 135 -1036 -176 1146 269 -1071 -363
3230 -363 1004 522 -983 -543 978 629 -894 -629 926 751 -842 -822 734 815 -676 -934 633 938
3248 938 -586 -1005 510 1035 -428 -1075 276 1050 -268 -1115 161 1174 -98 -1100 15 1125
3264 1125 67 -1229 -183 1157 279 -1144 -283 1135 373 -1059 -531 1004 596 -999 -650 937
$$ packed form
3141H72o89j083O72J001m68j049L71J182l10j265K88J181j40j289R8J293J1j248
3159e72j78J330J68j277l06J284L59j205m63J211N80j160o95J081P26r86q97J066
3177F6Q78q71j025Q66J095p88j199P03J256o43j249N14J361n13j366M08J421l11
3195F03j438J84J476j15j446m4J540P7j427k75J476K66j421m57J436N19j320o60
3213a026J291P15j166q76J199R10j171r79J048J102r12j171Q60J322q77j340P08
3230c63J367m82j505M40J521l49j523K65J555j75j593K0J556Q1j491k58J567L05
3248I38j524m19J515N25j463o47J351P74j318q47J276J013j272j002J115J110
3264A125j058j296J046J340q78j423Q61J418p62j432N28J535m08j595L49J587
$$ plain form
3280 937 700 -862 -761 822 824 -806 -878 644 961 -653 -1025 516 1019 -464 -1179 374 1090 -290
3298 -290 -1130 185 1148 -122 -1160 80 1185 21 -1178 -164 1114 217 -1138 -345 1114 326
3314 326 -1056 -418 1087 512 -1060 -612 966 634 -886 -721 855 879 -854 -797 784 882 -662 -973
3332 -973 606 993 -537 -1019 500 1133 -356 -1082 247 1059 -161 -1141 65 1068 -61 -1060 -94
3349 -94 1183 191 -1121 -266 1066 267 -1130 -372 1062 505 -1004 -548 998 620 -940 -694 848
3366 848 713 -753 -804 762 849 -638 -868 547 879 -532 -988 459 968 -403 -1049 298 1011 -184
3384 -184 -1087 144 1095 -72 -1081 -36 1058 70 -1054 -165 1072 223 -1056 -373 968 405 -942
3401 -942 -461 910 604 -850 -608 814 663 -791 -733 645 752 -654 -821 592 834 -501 -906 452
$$ packed form
3280I37k37j562J01J583Kj630p2J522L17j614l72J541N03j483p15J553P16j380
3298b90q40J315R63j270j038J240J105j164j199J014J278q97j355P93J459p88
3314C26j382O38J505n75j572M48J578l32j520J65J576K4j733N7J581R8j544l11
3332i73J579L87j530m82J519O33j489p26J329Q12j220r80J206J003j129r99R66
3349i4J277r92j312Q55J332p99j397P58J434n57j509M56J546l78j560K46J542
3366H48j35j466n1J566Q7j487k30J415L32j411m56J447N09j371o46J347P13j195
3384a84r03J231R51j167j009J045J094r88j124Q89J237q49j279O83J341n63j347
3401i42M81J371l06j454K42J422j51j454N8J378J07j406j67J413K42j335m05J358
$$ plain form
3419 452 883 -344 -955 283 952 -259 -944 153 992 -103 -963 -10 939 43 -898 -134 970 217
3437 217 -920 -267 894 343 -810 -367 771 476 -714 -493 699 586 -646 -677 579 654 -604 -721
3455 -721 530 780 -472 -800 455 763 -335 -902 240 844 -206 -838 126 831 -43 -853 -26 878
3473 878 10 -839 -95 785 194 -824 -293 815 287 -715 -375 688 324 -642 -415 619 483 -578
3491 -578 -528 528 582 -464 -623 452 648 -399 -684 376 659 -268 -689 218 681 -241 -726 129 683
3510 683 -38 -670 14 716 99 -780 -109 661 165 -691 -150 612 245 -617 -286 626 309 -586 -372 527
3530 527 395 -545 -431 467 515 -453 -464 439 549 -385 -550 306 465 -222 -535 274 509 -187 -553 129 531
3551 531 -86 -548 51 578 28 -450 -115 511 83 -488 -134 500 198 -503 -259 485 244 -425 -249 397
$$ packed form
3419D52M31j227o11J238O69j211o85J097Q39j095q60R53R49q96r41P64J104p53
3437B17j137O53J161n51j153M43J138k95j190K21J192j13j232l1J256P5j258j17
3455g21J251K50j252l28J255L08j098n67J142O04j050o32R64P05q74q10Q27R04
3473H78q68q49P44Q80n91j018N31J108n28j002L40J063l64r66K27J034j36j061
3491e78N0J056N4j046j59J075J96j047k85J060K83r27m21R07M63r22m85Q55N54
3510F83p21o32O84P02o17q79O71P70m96q56N41P62l67q62L31R12l17q95K14Q99
3530E27j32r40J14Q98M8r68j1R03J10r34j65Q56J59o87l13Q09K35o96l66O82M02
3551E31o17m62N99N27n50m78L35O26m28n71L54O34l02p01K44P44k41o69J76O46
$$ plain form
3571 397 354 -371 -327 318 371 -251 -365 280 397 -256 -461 151 402 -203 -421 149 431 -87 -436 82 461
3592 461 -23 -408 11 425 27 -412 -65 366 52 -389 -115 357 154 -403 -239 361 247 -312 -218 304
3612 304 273 -197 -283 235 313 -259 -294 140 296 -149 -289 116 298 -98 -318 77 317 -68 -346 8 352
3633 352 11 -301 14 302 32 -351 -144 318 90 -261 -75 263 119 -247 -166 266 130 -256 -173 206 246
3654 246 -136 -214 200 235 -178 -192 70 257 -71 -206 55 255 -1 -258 -5 224 -61 -171 -53 174 8
3675 8 -232 -23 216 39 -188 -86 198 47 -188 -104 201 130 -107 -144 146 138 -131 -134 128 193 -127 -95 122 155
3699 155 -48 -174 151 213 -106 -157 46 164 -29 -156 -15 135 35 -179 -50 120 26 -126 -71 127 47 -137
3721 -137 -75 109 156 -104 -37 127 101 -88 -80 64 100 -78 -129 72 112 -108 -107 97 126 -6 -123 75 139 16
$$ packed form
3571C97m3p25M4O45N3o22j14O45J17o53k05O12K51o05k18N70K82n18l49N18L79
3592D61m84l85M19M14l98m39L47M31l14m41K74M72k03n57J64O00j14n59R4N22
3612C04l1m70q6N18P8n72l5M34J56m45j40M05J82l96k20L95K40l85k78L54L44
3633C52l41l12L15K88k70l83K07M62k28l51J86L38j44l66Q1M32j36l86Q3L79M0
3654B46l82p8M14L5m13j4K62J87l28j35K61K00k56k57K53K29k85j10J18K27j66
3675Hk40K09K39j77k27J02K84j51k35Q4L05p1k37l7K90qk69lK62O5l20L2K17L3
3699A55k03j26L25O2l19n1K03J18j93j27J41J50j00k14J29J70r4j52N5J98q0j84
3721a37O2J84M7k60O7J64k6j89QJ44L6j78n1K01M0k20JK04K9j32j17J98O4j23
$$ plain form
3745 16 -84 2 123 14 -147 5 71 -10 -94 -55 96 42 -157 -58 145 110 -72 -97 46 82 -45 -91 78 61
3769 61 -46 -57 37 61 -28 -117 -1 87 -42 -3 -3 13 0 -84 -22 133 3 -79 -78 38 24 -53 -28 64 30 -84 -62 36
3797 36 76 -56 -72 81 14 -55 -29 60 51 -5 -52 75 84 -9 -63 18 51 46 -43 26 95 -5 -62 14 70 -12 -67 0 47 18
3827 18 -55 -56 65 34 -45 -54 27 -48 -35 19 2 16 -8 -91 22 34 -39 -82 22 -4 -5 -87 24 66 -27 -33 11 12 -42 -27 43
3858 43 27 -47 -29 -25 -25 42 -47 9 2 -24 -40 -32 41 -8 -23 41 26 -35 -9 -32 57 -17 -40 3 -52 24 -4 -46 8 -77 -84 -58 37
3891 37 -34 -44 -50 67 -2 -62 39 3 -17 22 4 45 -12 32 -43 52 24 -18 20 41 26 7 -37 25 42 -68 7 -30 -10
3920 -10 -64 -16 -21 35 -36 -30 -31 2 -12 -32 -52 27 -20 16 -13 21 -40 -64 30 26 41 -54 27 60 -5 -6 48 35 -68 10 45 59
3952 59 42 -52 56 30 32 -49 3 -31 40 9 -8 100 5 -95 -3 25 48 -21 -95 1 36 -23 47 38 30 -44 -77 53 79 28
$$ packed form
3745A6j00Q6J21j09j61J52O6q1q4L9J51n4j99R9K03l5j82k5J43L6j27m6J69j7
3769F1j07j1R4K4q9q9J16Q8j29L9%J6j3q4O2J55j30q2JJ16j4p7K5R2l4j14K2R8
3797C6M0j32j6J53o7o9K6Q9rn6m7J27Rr3n4Q1L3nq9O9O9j00n7P6N6q2n5O7M7k9
3827A8p3jJ21l1p9rQ1p5J3N4j7J4k4q3J13J2p3m3J04k6jq2J11M2r3oM4Jn4J5P0
3858D3j6p4J8M%O7q9N6pk6j6QP3m9j5O4j5o1K6k3Q9p4k3M3n5P6k8m2N4q5pK6R5
3891C7p1j0oJ17o9o0J01l6k0L9j8M1n7M4p5R5k8m2L8K1j5j9m4O2J7j10P5l7K0
3920a0n4M8nN6p1OjL3j4k0k0P9m7L6k9L4o1k4R4mJ5r5Q1L3o5jN4j3j03P8L5J4
3952E9j7r4J08k6Kq1N2l4P1l1j7J08r5j00R2K8K3o9p4R6L5n9P0rqp4l3J30K6n1
$$ plain form
3982 28 -61 -5 49 29 -66 -51 35 -13 12 70 75 -6 -51 4 39 20 -43 -12 -7 3 -72 -48 98 24 -72 -43 63 -3 -62 -28
4012 -28 76 66 -17 -47 46 17 -44 9 45 97 -10 -81 58 66 9 -80 -23 60 -34 -95 -2 62 -17 -54 19 58 42 -54 -43
4041 -43 90 12 -104 -7 68 63 -100 -40 78 16 -38 -52 37 39 -45 -62 -23 65 -80 -50 35 62 -61 -69 48 105 -32 -64
4069 -64 56 56 57 -89 52 55 13 -87 14 85 -9 -42 -43 108 66 -87 -25 66 33 -89 -13 104 -7 -74 -86 40 28
4096 28 -17 -84 41 143 -95 -88 -12 82 -38 -4 1 82 -29 -31 54 38 -14 -145 38 25 28 -59 -2 70 24 -46 -38 59 29
4125 29 -98 12 59 22 -6 0 99 24 -59 -51 39 38 -59 -4 30 21 -55 -68 36 57 -23 -54 8 72 9 -31 90 64 37 -38
4155 -38 1 78 63 -95 -69 112 4 -32 -14 65 34 -66 -50 -13 60 -84 3 102 9 -58 -63 40 32 -24 -49 -6 57 -62
4183 -62 -67 -1 64 0 -39 -3 49 41 9 14 108 34 -40 28 105 -27 -46 16 38 26 -69 -8 70 8 -30 -9 35 64 -62 6 35
$$ packed form
3982B8q9N6N4k0r5J5Q6m8K5N8Nq1m5N5L5j9o3L1NJ0p5K4J46p4r6K9J06o6n9L4
4012b8J04j0q3l0R3k9o1N3L6N2j07p1J39Qn7q9N7Q3r4o1R3O4p9l7P3L9j6r6J1
4041d3J33p8j16R7P5nj63O0J18o2n4j4Q9Kq4j7L9Q8j45L0Q5K7j23qJ17N7j37l2
4069f4J20%Jj46J41Lm2j00J01P1r4l3jJ51m2j53O2R1l3j22P6J17j11o7j2J26j2
4096B8m5o7J25J02k38PP6R4j20L4NQ1j11kQ5j6n2j31J83j3Lq7N7P2m6p0QR7l0
4125B9j27J10M7l7k8OR9p5q3QR0jr7N5L4rp6j3J04K1q0l1O2O4o3m0J21k6k7p5
4155c8L9P7j5j58K6J81j08l6J8P9l1j00J6L7P3j44Q7R9r3o7nJ03qn6k5M3O3j19
4183f2nO6O5o4l9L6N2ql2NR4p4p4O8P7j32j9O2K2j2r5O1P8o2l8K1M4K9j26O8K9
$$ plain form
4214 35 33 -35 -2 3 31 -77 -64 -5 72 -20 -74 -54 27 -30 -35 37 51 -42 -44 -30 38 3 -43 10 40 10 -30 -25 67 48 21 -67
4246 -67 61 39 -18 38 73 42 -3 -38 -39 1 -29 -3 3 5 -24 -20 3 -6 6 -34 -15 25 -35 4 -18 -12 16 0 -46 23 47 -40 -11
4279 -11 32 45 -36 -28 14 88 2 23 -9 12 31 -18 -12 -3 22 -20 11 4 27 -79 0 -3 -48 -65 -52 29 -81 -4 3 -28 9 -14
4311 -14 -29 3 24 -3 -54 80 36 -7 18 26 89 -2 -37 10 47 -41 21 -6 30 -8 -15 -37 36 -68 -21 -47 37 -14 -20 -7 53
4342 53 31 -4 69 -37 -10 -39 -17 36 -26 -29 -16 -4 -3 -36 -75 20 -5 -15 -28 -14 2 -40 -16 0 42 40 -9 47 -14 23 -13
4373 -13 15 21 20 -25 17 -34 15 -23 45 -12 9 25 -68 55 44 -108 -121 -18 15 6 23 35 -35 27 -18 -3 56 -5 -17 12
4403 12 -14 -21 -40 -11 -14 19 -41 30 -11 4 24 29 10 -6 16 13 -105 -4 -12 16 37 -62 -23 -18 47 -64 40 3 -48 -6 -28
4434 -28 -47 -45 9 -46 -62 -15 -18 -15 5 -40 -13 -12 -10 53 40 -32 -19 11 -11 23 -27 25 -40 -12 43 22 -5 9 12 46 -5 7 -1 -30
$$ packed form
4214C5ko8L3NK8j08J3N9P7r2n4K0Q1n7nP2J4r3kJ4O8l5m6N3L0l0m0NR2j9k7q8
4246f7J28k2n7N6L5l1m5l5jM0l0K6OKk9MK3rJ2m0J9M0o0L9k2OK8j6m6O9K4q7K9
4279a1M3J3q1QM2P4q6K1l2K1J9m9ORK5m2L1pK3j06P9lm5j7J3Q1j10P7Pl1L7k3
4311a4j5L2K1k7n1J34m4m3K5QO3r1l5M7L7q8O2k7L6l8pk2P3j04M7k6Q4n1oJ3O0
4342E3k2l5P3j06K7k9K2N3o2lJ3J2Jl3l9R5k5j0j3J4J6m2K4J6M2km9N6o1L7l6
4373a3K8Ojm5M2n1M9l8O8n7K1J6r3J23j1j52j3J03L3rJ7J2p0O2m5J5N9o1j2K9
4403A2k6pj9K9lL3o0P1m1J5K0Nj9j6K2lj18J01qK8K1r9L9NO5j11J04l7n1M2k2
4434b8j9KN4n5j6M7lLK0m5K7JKO3j3p2J3L0k2L4n0N2o5K8N5k1k7J4LL4n1J2qk9
$$ plain form
4468 -30 14 -41 -28 19 21 -39 0 -22 -13 10 -45 -10 -33 -23 -5 1 -1 5 -26 29 24 -30 -3 36 37 1 43 35 64 3 10 16 39 30 -32 32
4504 32 6 6 -26 61 25 -8 -34 8 74 -49 2 -13 -49 13 -13 -3 26 18 -83 21 12 35 34 -19 40 25 -36 -34 19 102 -49
4535 -49 -30 13 27 -4 -29 33 54 -19 -52 32 91 -62 -16 53 28 0 -53 36 25 16 -52 12 58 1 -36 1 103 -41 -106
4564 -106 -30 34 13 -64 2 67 61 -63 -50 56 11 -57 -22 59 91 -22 7 54 87 -36 -79 29 103 -80 -86 42 91
4591 91 -70 -104 81 52 -42 -65 20 82 0 -78 15 73 38 -110 20 110 -38 -94 -20 41 10 -81 -21 97 18 -51 -43 72
4619 72 22 -80 -111 95 117 -39 -30 45 96 -63 -19 29 103 -26 -122 45 30 -80 -82 50 41 -7 -160 -12 96 -47
4645 -47 -82 8 100 -13 -75 -67 152 61 -48 -20 114 52 -52 -80 75 64 -89 -101 104 45 -103 -84 115 69 -7 -136
4671 -136 51 113 -84 -83 53 79 -18 -72 34 113 -5 -99 -45 82 -18 -113 -15 137 2 -135 71 70 31 -111 -18
$$ packed form
4468c0M4n5J3M7Ko0L9k2RK3n5L5k3J0J8OkOl1N5nn4K7L9Jl6M2qK9o1POK3ro2O4
4504C2k6%l2Q7l6l3k6M2O6j23N1j5l6O2k6J0K9qj01J04rK3jn3N9j5o1KN3Q3j51
4535d9J9M3J4l1k5O2K1p3l3Q4N9j53M6O9k5k8n3Q9j1ro8O4M6n7l7L7J02j44o5
4564a06P6O4k1p7O6O5oj24J3J06m5o8L5Q1L2j13K9M7L3j23m3J08P4j83oJ28M9
4591I1j61l4J85k9r4k3Q5O2q2p8R3N8l5j48J30R0j48n6P4O1l1r1O0J18p9o9QJ15
4619G2n0j02l1K06K2j56RP5N1j59M4M8P4j29r6J67j5j10kJ32rm8j53J48J08j43
4645d7l5R0R2j13o2QK19r1j09K8J34o2j04k8J55j1j53j2K05n9j48J9J99m6p6j29
4671a36J87O2j97JJ36K6r7n4J06P9j18r4N4J27j00r5R8J52j35j37K06jl9j42R3
$$ plain form
4696 -18 112 48 -88 -52 102 24 -87 -53 126 27 -107 -50 115 93 -96 -129 52 156 -77 -92 20 118 -49 -73
4720 -73 -20 66 -50 -141 -13 104 29 -144 23 87 -45 -135 -26 148 33 -128 -28 129 47 -113 -50 172 78
4743 78 -110 -24 122 32 -64 -56 118 88 -96 -149 109 121 -45 -95 58 104 -22 -131 63 85 -54 -109 13 99 -12
4768 -12 -175 -46 150 39 -106 6 147 27 -156 -50 183 5 -95 -60 150 26 -114 -107 126 96 -102 -33
4790 -33 111 119 -105 -87 92 117 -79 -123 110 108 -82 -127 38 105 -39 -121 32 74 -37 -164 27 119 -51 -140 -34
4815 -34 151 -10 -147 -16 187 49 -166 -34 91 93 -120 -44 149 69 -102 -30 73 38 -82 -44 82 65 -87
4838 -87 -118 57 74 -94 -121 127 128 -63 -166 76 110 -74 -151 53 162 -54 -103 20 134 -78 -114 15 121
4861 121 15 -135 -82 86 27 -75 -109 94 40 -130 -48 100 79 -77 -31 115 106 -153 -119 78 86 -91 -61 99
$$ packed form
4696a8J30o4j36L6J54p8j11L4J79r9j34N7J65k2j89l3J81J04k33j5J12R8j67k4
4720g3N3Q6j16r1J28J17p5j73J67O4j32r0J09J74j15j61J00J57q2j60O3K22r4
4743G8j88Q6J46r0r6QJ74l0j84n3K58J2j66n0J53M6j26j09J94K2j39n5J22Q6j11
4768a2j63J29J96j11j45J12J41j20j83J06K33j78j00L5K10j24j40PK33l0j98O9
4790c3J44Qk24J8J79K5j96m4K33kj90m5J65O7j44q2J53M2j11j27J91R2j70q9J06
4815c4J85j61j37J31K03j38k15J32J25Kk13P6J93q0j71P2J03l5j20L8J26j7j52
4838h7l1J75J7j68k7K48Jj91j03K42L4j84p7K04J09k16m9J23J14k12l6J29J06
4861A21j06j50N3J68n9j02l4K03n4j70Q2J48k1j56M6J46rk59L4J97Qj77L0J60
$$ plain form
4885 99 62 -23 -115 35 68 -27 -69 33 149 -26 -110 -24 129 -78 -178 -25 93 34 -121 -8 114 -19 -116 -47
4909 -47 115 23 -134 -62 148 54 -104 -63 101 74 -35 -60 110 119 -47 -86 66 110 -50 -94 80 94 -96 -81 38
4934 38 131 -14 -131 19 114 -20 -97 5 88 47 -106 23 101 -21 -126 -27 85 32 -95 -34 42 42 -69 -89 46
4959 46 98 -25 -86 148 101 -53 -40 48 82 -84 -90 93 74 -148 -77 -12 46 -76 -125 -13 56 -30 -119 49 98 -32
4985 -32 -103 -32 101 48 -97 -28 96 11 -82 -48 88 -2 -81 -51 103 65 -52 -43 107 33 -49 -39 20 18 -45 6 60 -4
5013 -4 -23 -91 36 29 -60 -101 -6 62 -73 -71 28 58 -57 -71 -10 70 -32 -66 -1 95 -24 -70 -29 -4 42 -72 24 115 -22
5042 -22 -96 19 50 34 -92 -1 21 60 -24 -15 19 13 -52 -73 6 46 -14 -64 18 59 -15 -41 -2 21 -56 -59 -2 117 22 -67
5072 -67 39 62 53 -50 -13 57 0 -51 -4 51 48 -86 11 48 29 -34 -38 66 11 -62 -8 62 49 21 -100 55 69 -24 -76
$$ packed form
4885I9l7q5r2J50L3r5m2J02J16j75q4Q6J53k07j00J53J18n9j55J13J22j33r7O9
4909d7J62r2j57P2K10r4j58M1J64k7j09k5J70Rj66l9J52M4j60m4J74J4j90J5J19
4934C8R3j45j17J50R5j34p7J02Q3m1j53J29P8j22j05R9J12n3j27O1P6%j11k0J35
4959D6N2j23o1K34m7j54J3Q8L4j66oJ83j9k22P1O5N8j22m9J12O9q6q9J68M9j30
4985c2p1P1J33n3j45O9J24q5r3L4J36r0p9L0J54l8j17RJ50p4q2J0N9ko3N1N4o4
5013dj9o8J27pq9m1R5O8j35KR9L0j15j4O1Q0j02l4O5R6j19m6M1K5M6j14R6R1j37
5042b2p4J15L1j6j26R1K2L9q4RL4oo5k1P9M0o0n0Q2M1p4k6L9K3p7lN7J19r5q9
5072f7J06K3rj03L7P0n7n1M7N5lj34R7L7j9o3mJ04n5p3N4P0j3k8j21J55J4r3n2
$$ plain form
5101 -76 38 3 -78 19 -70 63 35 -24 -8 25 29 -20 4 43 17 -33 31 94 -13 -120 25 0 66 -15 33 84 31 -56
5129 -56 27 34 37 -21 -36 44 44 -9 -44 45 9 -50 -46 -1 45 -15 -31 36 15 -14 -71 25 29 -14 -105 63 77 0 -75 30 85 -66
5161 -66 -36 15 42 27 -9 -31 29 19 -52 -33 54 -21 -25 -47 34 64 29 -29 -47 26 -30 -62 -67 -1 5 -74 -1 16 -49 -13 -12 11
5193 11 12 -37 83 -22 1 -17 -10 18 22 -30 9 44 42 18 38 42 36 -17 85 43 -23 -29 -2 -18 11 6 45 -16 24 -23 -57 3 39
5226 39 -41 -18 63 -56 -10 -22 -26 25 -22 -93 -7 2 -6 -23 -2 36 25 -24 50 12 44 12 0 14 -3 4 -42 24 7 29 10 10
5258 10 -29 -84 -19 20 18 33 40 0 20 -15 -21 2 22 -13 -29 38 1 -45 -20 37 38 30 -1 2 32 -30 -18 -5 51 -28 -4 -30 44
5291 44 10 -21 11 -21 25 -16 -20 26 36 -13 28 11 14 23 30 -8 -13 -1 -2 -17 -34 -31 -30 35 -39 -30 -40 -20 8 -62 -25 -25 -27 -33 -30 -4 37
5328 37 18 -21 31 -38 23 -11 -26 -4 43 62 -58 47 22 -7 -17 29 12 -66 -33 -7 -14 -45 -27 10 -37 -7 -27 -4 10 24
$$ packed form
5101g6J14l5q1R7q9J33k8n9J6L3Mm9K4L9k6n0O4O3j07j07J45k5O6q1M8N1n3q7
5129e6Q3PLn8j5Q0%n3l5Q9l6n9MM5M6o0j6O7k1k9n7R6Mm3r1J68J4p7p5J05N5j51
5161f6L0N1K7j5l6k2O0j0p1J9Q7p5mk2Q1L0l5n8j8P3n6l2nO6Op9P3J7o5L6JK3
5193A1Jm9J20j05K3j8PK8Mn2L9L5kk4K0Mon3J02m2o6oK7j6K9nL9o1M0m7l4O0L6
5226C9q0K3Q1j19M6j2mN1m7p1Q6Rqj7K1L8j1m9P4l8L2l2j2J4j7Pm6O6j7K2j9%
5258A0l9n5O5L9kJ5Pm0K0l5oK3K0l5j6O7l7m6K5N7Jql1LL0o2J2J3N6p9K4k6P4
5291D4l4l1L2l2M6m1mM6J0m9M1j7LRPl8nJ2jj5j7LJO5p4Rj0K0K8p0L7%koLK6M1
5328C7j9l9N2o9O1l4j5K2M7J9j20J05k5k9j0M6j7p8L3K6pl1J8L7m7L0k0K3J4J4
$$ plain form
5358 24 -18 -7 51 -36 -9 -33 41 48 31 32 -35 -27 47 -8 -25 34 9 -30 -11 14 41 -3 11 37 14 49 -20 3 -31 -77 -14 -33
5390 -33 -6 -43 36 36 -20 -24 -24 13 -14 -18 -13 18 -61 -32 -70 -17 -29 16 -40 -35 -35 -37 -22 -11 41 -47 40 41 30 8 -18 9 -21 -10 -1
5425 -1 26 -5 12 -41 -47 7 10 -17 -47 -12 -18 -17 6 32 17 -7 -5 -58 -18 9 -27 -25 23 35 -20 -6 -27 -2 35 27 9 28 -38 -21
5459 -21 16 34 -14 -19 27 79 15 -8 -13 1 -21 53 19 10 6 24 -11 -1 -27 -36 -36 2 -22 -16 68 -18 -22 47 57 -15 -72 -42 43 -20
5493 -20 -45 -40 22 47 -28 -5 -8 -26 12 -49 6 8 24 8 4 35 47 -47 54 23 -23 9 5 -8 32 -45 8 7 26 0 -29 -11 26
5526 26 -48 12 -2 -36 -40 -20 -5 14 -15 0 -39 39 -10 -13 -41 46 23 -49 53 29 -33 -65 0 52 14 -15 1 -32 -1 -39 42
5557 42 4 29 21 -11 -18 -92 -25 -41 21 -14 -26 17 0 53 -49 -22 17 -30 26 31 6 -3 -27 44 33 31 39 -8 16 -60 2 -19 75
5590 75 -36 20 8 16 30 39 2 -10 -24 9 -9 -16 25 -58 -74 -14 -20 -33 -83 -23 12 -2 35 -18 -52 -28 12 -4 4 -28 -1 5 36
$$ packed form
5358B4m2J1N8q7K7k4P4Pj7Jo7QP4n5j7N9k5l9J9K5K7m4J4K6k3L5o9K3l4m6O3j9
5390c3K7l7P9%n6m%L7k7mNL1p9K9l8N3j2M5n6N%kJ5J1N2q8Q7Jj1k2k6K7l0J1R
5425aK7l1J7n3oN4Lk7l0L5oJK3K6j5k4Kn3M0K7l6KM8J2n5J4k1K5L7qj8J9o6J7
5459b1L7J8m8nM6N2o4k3nJ4k2P4l4rmJ8l5J0k6r%L8k4OQ4q6mO9J0p2n7L0Q5o3
5493b0k5NO2K5p5K3lj8L8o1N5KJ6j6mL1J2r4J01l1m6L2mj3M0p7N3jJ9k6k9J8L7
5526B6p4O0j4l4mK0J5J9k9J5l9P8m9lk8Q7k3p2J02k4o2l2O5N2l8k9J6l3L1l8Q1
5557D2l8K5ql2pp4O7j6O2l5j2M3j7N3j02K7L9m7N6Nk5rk4P1j1kQm7K4p6O2k1R4
5590G5j11N6j2QJ4Rl7j2j4L3j8pM1q3j6O0oj3n0O0L5j4L7n3l4K4M0j6Ql2K7OL1
$$ plain form
5623 36 -18 -46 -8 22 -33 -1 8 -33 -58 18 -1 -22 21 -8 29 93 -11 25 -29 31 4 -43 -1 1 47 12 24 -28 -34 9 -7
5654 -7 -6 57 -2 24 -55 23 35 -56 5 15 -7 61 -26 6 23 7 55 40 20 14 -38 24 19 -36 -11 10 11 -16 -19 30 71 -52 -17
5687 -17 21 -9 -5 -43 43 35 -1 -6 -11 -28 22 16 -17 43 -22 -76 29 31 83 7 17 30 -2 -7 -34 -35 29 -6 -25 10 13 6 15 27 -4
5722 -4 -78 8 16 -29 -28 37 -29 -30 -69 4 -44 -4 19 -15 -28 -17 36 0 59 51 21 -2 7 8 31 8 -1 -29 32 -11 -2 -48 20 4 -36
5757 -36 41 8 43 -6 3 17 16 -26 3 -7 -5 -30 -14 -52 -26 -10 -16 -28 6 -40 -16 -18 -37 -18 -9 -19 52 -13 -7 9 -42 -13 4 -9
5791 -9 -34 11 -11 -51 -56 13 33 -25 8 -10 1 -26 42 1 1 -12 39 19 43 8 43 29 -22 12 -15 -2 -20 7 0 -37 -23 -12
5823 -12 -11 35 9 9 -15 -7 -24 31 -23 -78 4 43 9 35 13 35 -37 31 -27 20 -5 -52 -48 -11 54 10 29 -12 15 -15 23 21 -5
5856 -5 39 -9 11 -44 -67 8 -44 -30 29 5 60 3 5 10 -28 -68 -35 -19 -42 -18 -21 -15 18 21 33 -17 -6 10 5 -54 1 -44 -52 29
$$ packed form
5623C6n4k8L8L0n5L2Rm1k5P6j9k1M3k9L7O4j04L6n4O0k7m7M2KM6l5J2n2oM3j6
5654gJO3n9K6p9P8J2r1O1J0k2O8q7L2J7j6M8j5k0on2O2nn5K5K1Jk7lM9M1j23L5
5687a7L8l0Ml8Q6ql6nnj7N0ol3O0o5n4J05KN2p6J0J3l2nk7jO4l5j9L5LpRJ2l1
5722dp4Q6Qm5JO5o6jl9P3m8M0K3l4j3J1N3l6N9ql0k3RJK3k3rk8O1m3Rm6O8j6m0
5757c6P7l3L5m9RJ4jm2K9j0Kk5J6l8K6J6oj2L4m6K4kj9J9Rj0P1o5OJ6n1K9J7j3
5791ik5M5k2m0nO9K0n8L3j8J1k7O8m1%j3N1k0K4l5L5j4n1L4k7J3j8K7pl7J4J1
5823a2JM6k6%k4Qj7N5n4n5Q2L9l4K6k2K2p2O8n8M7k5m7ML7O5m4J9m1K7l0L8kk6
5856eM4m8K0n5k3P5n2J4N9k4N5n7KNl8m0L3J6k3K4lOL3LJ2n0J1J6nn9N5m5qQ1
$$ plain form
5890 29 28 64 -19 23 43 -43 -2 -12 -15 -11 -61 -1 20 -35 55 4 -24 23 -38 -2 -49 -35 3 -33 -14 16 26 -3 30 5 -1 23
5922 23 -21 37 -8 -2 51 62 -16 -56 11 12 25 68 -82 27 -33 4 -32 35 -14 -23 34 11 -21 -32 -40 26 2 13 5 -12 10 -38
5954 -38 -48 7 -12 -53 -11 -33 -11 -19 -27 -43 36 44 51 -17 -45 -8 10 -28 17 -14 16 -31 0 57 10 21 -20 -2 -57 29 62 -37
5986 -37 18 -22 -18 -53 14 11 -44 -15 57 -15 -7 4 53 -84 20 -12 9 6 49 12 14 44 -65 -12 18 -87 -7 0 -40 -34 13 35
6018 35 -30 31 8 30 -1 -68 -15 -21 -33 -15 -18 -30 -19 3 0 -2 53 0 17 16 -14 4 11 4 -68 -18 -7 -24 81 -34 -35 16 21 20
6052 20 -15 -48 6 -26 -34 -1 1 -62 -28 22 0 -3 -8 -29 18 -21 40 -11 -3 3 32 -74 -24 4 16 5 7 -24 -23 13 16 -51 -42 53 -9
6087 -9 44 -32 11 -21 -11 -48 29 68 -19 2 25 39 -14 11 -17 8 42 -4 10 36 -28 -16 8 7 -36 -8 -20 -59 -57 43 -15
6118 -15 20 -15 -51 -32 -41 7 47 -1 -25 -20 -59 60 -18 6 -33 -2 -39 -23 20 -76 8 7 -8 -38 35 -33 60 -30 32 51 -10
$$ packed form
5890B9jL6q3M2K0q6M1j0lMn0O0K1n5R0n1k8M7o1L6m7J4L8l6J9L0J0k9L3k5oK4
5922B3m4N8m5ON3J1p8m0O7JJ3M3j50J09o0L7l6O7m9rN7k3l2j1qO6k4J1qj7K2m8
5954c8j0N5j9m1M2k2K2qqj6P9QPo8k8L7J8l8M5l1L0m7L1N7m7J1m1J8n5Q6L3r9
5986c7N5m0Ml5O7ln5K9P2p2QJ1M9j37J04l2K1lM3l7KL0j09N3L0j05Q0Pm0OM7K2
6018C5o5O1k3K2l1o7N3oj2J8lj2J1K2lkN5n3J7jl0J8Ppp2N0J1j7J05j15jN1Nj
6052B0l5l3N4l2qL3Ko3L4N0k2lnk1M7l9O1n1QOK9j06N0K8J2j1Kl1JL6Lo7RR5o2
6087iN3p6M3l2J0l7P7L9q7K1K3J4n3K5k8K5L4m6J4K6o4J2K4jm3K8j2l9KJ00n8
6118a5L5l5l6J9rM8M0m8k4Nl9J19p8K4l9L1l7J6M3r6Q4jj5l0P3o8R3r0O2J9o1
$$ plain form
6149 -10 -4 -30 -36 -51 -14 -8 -26 1 16 13 -18 -13 -51 21 43 -47 -21 14 -22 -17 -32 -13 19 16 15 17 -16 25 -13 -11 -17 -12 -52 38 9 4 13
6186 13 17 75 -9 29 -16 14 -14 -38 37 61 -7 -37 -13 -71 -54 -17 -5 0 16 -37 -8 -25 35 -32 14 -61 10 -30 -11 50 -16
6217 -16 -9 -53 7 0 -13 -31 2 14 -32 -51 -40 24 -2 1 -12 -35 62 33 15 -12 -38 -36 -14 4 -20 -10 -13 51 -75 15 8 21 -28
6250 -28 -60 29 48 45 -69 -24 -34 -44 -33 10 4 -19 -12 5 -21 7 -72 -32 80 -21 -13 13 -22 -39 37 45 4 6 -41 -36 -35 61 11
6283 11 -44 35 47 -29 5 -9 -4 17 -15 -35 15 -14 -45 7 21 -3 3 27 64 -37 9 27 -30 56 5 -2 24 23 13 8 -3 -34
6315 -34 -20 -25 26 -33 -14 -26 -36 -37 -63 15 39 38 -8 -65 11 21 -48 26 19 -31 -19 -6 -24 -38 -28 -7 -14 50 3 11 -5 7 15 77
6349 77 6 25 -18 -36 -47 -49 12 -19 -38 16 -27 -17 4 -28 51 -81 -21 42 25 -10 -31 -40 18 -46 11 -15 -27 -23 -46 -38 16 -51
6381 -51 -11 -12 -43 19 -10 48 22 6 0 -23 5 3 -56 7 36 -12 -29 -30 43 -13 -1 -44 23 -14 24 2 -27 7 -32 -45 41 -3
$$ packed form
6149a0Ok6oj5L7Oj8K7J5ll1Nl8P2K2r0K6L5l6Nj5J9L2ljKl3M1l8KoNm0R0k9nR
6186A3MN8q4L8m5L0k8k4P5K4o8l0K4n8J7L7J2NJ6n3K9j7O0o7M6p5P1m0J9O1o6
6217a6Pm4O0pj3j8L3J2m6j9J1O4k6Lj3k3R7k9j8k7k6KK2J8k4J0lO4j26R0pJ3m9
6250b8l2Q9J9lj14M5j0j0J1M3ok3PJ7k6K8p9M0J12j01QK6l5j7P6Qm1Km7NJR6n0
6283A1n5P9J2p6L4j4NK1l2k0N0k9l1N2J4k4OK4L7j01M6J8n7Q6n1pK6jj0nj1l1
6315c4J4nN1n9J9j2j0jk6P8K4jm6n7P6J0o9P4pn0J2J3j8j4J0K1pO4m7Qj6J2QO2
6349G7p1J9m3j8j1kO1l1j9N4m3J0K1l2P9j32O0O3j7l5k1rN8o4N7k6j2Mk3QN4o7
6381e1M0jl1O2k9N8k6j6ok3K8kn9O3K9m8j7jP3n6J2m3O7l7L8k2k9L4l9j3Q6m4
$$ plain form
6413 -3 -24 26 -13 52 -52 1 -10 14 -60 1 6 -1 -11 -24 35 -14 5 -19 -10 87 50 -11 -19 -1 -22 -11 40 39 -25 -43 19 31 34
6446 34 -74 12 -16 -36 -6 -24 13 45 33 11 30 -9 8 -90 3 27 -36 -64 -18 -19 13 -13 -41 2 14 12 -21 73 2 -68 -26
6477 -26 19 -19 32 -35 22 10 -27 3 45 44 -60 -1 45 -75 -48 -54 26 -15 -16 20 -3 10 -85 -23 58 68 -19 -36 18 52 -18
6508 -18 -22 26 29 40 -17 18 55 -16 -23 63 -20 -28 -40 17 23 0 -48 -29 18 27 -69 6 20 26 -16 -1 16 4 -58 -31 37 12 -13 -13
6542 -13 13 -1 -8 -34 79 32 18 -55 -35 47 -38 -34 6 29 20 6 -17 10 -19 -22 12 30 -46 -38 -22 42 10 -21 -6 21 -1 -52
6574 -52 -17 21 32 17 13 31 47 -32 -2 66 28 -27 4 31 57 -39 -9 35 30 -14 -19 58 47 -19 -21 -17 35 15 16 8 -23 38 -23 39
6608 39 -8 28 -54 -34 -18 6 -33 -9 48 25 -67 -28 49 -5 9 -45 38 54 -18 -77 -36 22 13 -18 20 14 26 -7 75 6 -27
6639 -27 24 -51 5 9 5 24 46 40 -57 20 16 25 -4 13 24 -10 -2 8 7 10 -85 -23 -8 -10 -6 -42 35 21 -67 54 45 29 -33 -43 27
$$ packed form
6413ck1N0l9O5j04N3j1K4p4O1Npj0j3N9m9J9k4RR7l7o1qJ8k1J1N1jo4j8O2J2L
6446C4j08Q6k8k0L0j8L7L2j2k2J9l9J7r8R3K4o3k8M6jL2k6k8M3J2kl3R4p1p0M2
6477b6M5l8N1o7N7j2l7L0M2jj04N9M6j20K7oQ0m1jL6k3J3r5O2Q1J0q7j7N4L4p0
6508a8mM8LJ1n7L5L7p1pQ6q3qj2N7Ok3m8J9M7Rr6P5J4Om2J5J7j2o2K7O8k5k5%
6542a3K6j4pk6J13m7j4p3K0Q2q5MM0K3rj4k3K7k9lL4J8p6QJ6O4l2l1J5K7k2n1
6574e2L5L8J1j5mJ8J6p9L0O8l8n5L1K7K6r6L0M4nm4nP7j1o6kMN2k0Jql1O1o1O2
6608C9m7L6q2K0J6K4l9K4N7k3r2L9P7n4J4n4Q3J6p2n9M1N8rl1L8oJ2l3Q2o9l3
6639b7N1p5N6MmJ9K2or7P7mRk9J7J1l4QJ0jLr5O2J5kMl6P7j4q8J21rj6o2j0P0
$$ plain form
6674 27 23 -37 -33 -26 13 -34 -24 34 65 15 -46 -20 6 23 -22 -8 25 -41 15 14 -35 10 -28 24 40 -27 18 -6 31 5 -85 9
6706 9 10 -27 -14 -49 19 9 -68 -37 21 4 -20 -24 41 38 14 -52 -48 -16 35 -79 2 73 23 11 3 59 11 1 5 9 46 -22 9 -38
6740 -38 16 20 -21 20 1 -35 19 52 -9 -8 -21 37 13 -64 -33 13 6 -45 -10 12 24 1 19 14 -1 4 -55 16 -55 9 -50 -11 -3
6773 -3 -29 -48 -20 1 -32 -60 -36 -34 -62 -48 -42 29 -1 14 -37 0 11 -89 -79 12 1 4 -45 13 25 -2 90 -21 -43 22 13 -18
6805 -18 50 -10 -5 38 -37 -14 -12 39 46 20 20 -27 -8 -70 -9 27 50 12 -35 13 52 -10 -43 16 16 6 -24 -27 5 -43 -26 -2 -19
6838 -19 70 23 -22 4 -23 5 -34 12 76 -13 33 -11 -1 -21 -14 -21 -3 25 -28 19 -7 -32 5 -20 18 72 12 -21 77 21 -82
6869 -82 -15 -17 20 -40 -49 -2 -11 1 -64 -4 -46 -25 7 -11 42 18 -7 25 -5 57 -62 -54 -9 -2 2 18 21 18 -15 38 6 14 10 -6 -50
6904 -50 -30 -48 -17 7 -50 -16 -27 -12 0 1 -68 40 38 -52 -29 39 -66 -12 -80 -25 5 22 35 -5 27 15 -45 -13 -23 -20 26
$$ packed form
6674B7mo0MPL9m7J0N8L1n0o1K6K6J7m5J4L3o6N6jm9M5l8N2J6o7M5k4L7k6r0R4
6706IJl7J3l5O8j0p7L1N8j7k4mO5lk4o6ML2N1j14Q1P1n0j2qN6m8j0MML7o8L1m7
6740c8N4Mm1M1j9l6N4L3o1Jj3N8k4p7L1M6pn1L5K2J2k3J8nj5Nn9P1p1O4n9L9Q
6773ck6j9K8K1l3k8K4Kk8J4OP1l0J5n1L7J1j00J0R1j1Lm9N8J2k7R2j11k2O5rl1
6805a8O8o0NM3p5K3KN1Pk6%m7J9o2O1L6K3l8m7M8L9o2l3N9%j0l0lL2m8J7K4j7
6838a9Q9m7m5K6k7K8l9M6O4q9M6m4J0k0PpJ8K8n3M7k6k5L7k5L8N4o0l3R8n6j03
6869h2O7kL7o0rM7rJ2o5O0m2K1L2j8N3k4k5L2l0O2j19QM5PMJ6Lll3N3l2Qmj6m4
6904e0K0j8L1K4n7L4j1J5J2Jo9J08kr0K3O8j05N4o8N5L0J7J3m0L2j2o0L2j0LM6
$$ plain form
6935 26 22 -11 8 5 36 -18 -26 -21 43 -39 5 -25 -67 -4 30 -46 -14 5 30 -10 -8 26 60 -23 -9 -15 2 -54 12 8 41 -1 -48 -32
6969 -32 -20 0 -34 21 60 -37 -5 6 54 36 0 -46 -3 18 -37 41 -38 -52 -66 -1 -2 -1 -18 -49 -30 -2 26 51 13 51 2
7000 2 -13 -16 -41 -13 -22 -54 -21 13 -24 -8 45 12 -30 39 -11 -1 -44 -4 10 20 40 -36 -20 14 -4 92 11 0 13 -3 -21 -18
7032 -18 -10 -9 -8 60 24 6 25 -26 30 -35 -27 -38 -16 32 -32 -26 30 -39 -34 -7 -62 0 11 -31 18 23 52 -14 39 8 -32 18 -6 -17
7066 -17 -66 -1 28 -20 -18 60 -15 29 -63 -28 35 -38 -18 -38 26 1 -24 -30 33 2 25 12 42 -16 -17 -15 56 -67 -35 -44 13 19 58
7099 58 5 38 10 41 -30 40 -17 -25 -1 -20 18 53 16 12 5 -8 46 -36 -2 3 -2 9 30 -3 35 -13 13 -33 16 29 8 24 -67
7132 -67 7 -17 -21 -14 -6 19 11 -25 27 -13 30 7 54 3 -27 -48 -1 -25 -14 -24 4 -36 -16 5 31 -9 29 -9 -8 10 -17 -11 34
7165 34 -27 -22 11 -55 -7 -47 29 27 -12 26 -44 12 -7 -20 -24 -23 -21 20 16 6 14 -7 55 -10 -22 -13 23 16 -4 4 28 -22 -39 4 0 -20
$$ packed form
6935B6ml3J9lL1n4qNO4q2M4l0m2O3L4p6L2J9K5m0KL4L4q3J4oJ7n6O6mL3m2m7J6
6969c2J2K0l4N5L9r7L2J1M8j8l6m6M3K1n5P8p9j4j4O5jJj7l1J9K8K8K5l8L8m9
7000Bj5lk5K8rl2L3L4l7J6N3l3m2O9n0J0m3M0J4J0K0p6J6L4j8R6q1j1J3j6j8L
7032a8QJJO8l6j8J9n1N6o5Qj1K2M8o4ON6o9NK7n5O2J1m2M9NK9o6N3l1m0N0k4j1
7066a7m9O5K9m8KP8p5M4r2L5O3p3K0k0O4k5k5oO3l1K3j3L0n8jKP1j23L2rN7OL9
7099E8n3L3k8L1p1P0n7qK4j9L8L5l7mpj3N4q2L4NnJ1K1l3L8m8K6m6M9J3k1J6r1
7132f7P4k4mPQK5ql6N2m0M3k3M7n1l0k1M7k4J1j0K8m0K0K1K6m0L8l8JJ8k7OM5
7165C4o1NL3o6M8m0P6kl9L8p0N6j9j3mJKM1mj0Qk1O2o5j2RL6pk0QK4n0j7M3mk0
$$ plain form
7201 -20 -7 -16 -23 37 2 -19 9 -30 -23 -25 -8 4 36 -19 16 7 8 9 23 7 11 25 -8 9 -24 -10 12 13 -21 15 5 -28 7 43 33
7236 33 -28 -19 -27 20 46 12 9 -13 14 -2 -18 -26 -36 -13 39 36 -1 -38 -65 -23 -12 -47 -12 -32 21 44 -32 3 23 -49 9 33 17
7269 17 -23 39 7 3 1 18 24 50 34 18 6 -19 79 36 6 -13 41 10 19 25 -79 -11 -49 -3 -45 -57 -43 -10 -7 2 -2 -19 -54 -1
7303 -1 19 -6 57 -49 18 8 -5 33 25 -27 -9 -6 29 -7 -8 44 -10 27 5 -35 51 -30 27 50 -26 -43 37 -33 -32 9 9 20 0
7336 0 2 13 -66 36 -55 -9 -12 40 -10 -22 3 -33 -24 0 7 -12 -9 5 -27 1 1 22 3 1 -19 -8 -39 -9 44 31 -8 -90 5 -28
7370 -28 -2 44 -4 29 17 -41 -40 8 12 4 9 -41 25 10 61 -16 -20 41 -8 21 7 -29 -6 -54 -15 -7 -13 -14 39 -29 -62 -28 30 -49
7404 -49 -73 40 45 29 -8 -12 27 -18 -20 15 -60 7 -66 -20 -2 -30 -46 -8 -23 -8 28 -9 -10 21 10 -49 -30 6 -12 3 3 12 39
7437 39 22 -29 -13 -29 22 39 52 10 -5 66 -26 23 -19 -33 -60 24 43 42 -10 46 -6 3 -38 5 10 -37 -42 -18 -13 3 -13 8 -54
$$ packed form
7201b0J3rpO0l5k1K8l9PkJ7J2L2n5L5rJJJ4j6MJ4l3J7l3J4K2Jl4L6j0l3L5L6j0
7236C3o1RqM7K6l4lk2K7j6j6qj0K3N2ll7l7k7M2J1l5L5k0N3K3p6L5K0p2N8K4j6
7269A7m0O2l2mkJ7OK6j6j6j2k5R8m3l0j9N4l1ROj04O8l8M6m2j2J4L3LRmj7l5N3
7303aK0k5O3j06O7j0j3L8qn2J8LL5l6jN2n4L7k2m0Q6q1N7K3p6j7Q0p0JM1%J1k0
7336@KJ1p9J02r1M6lN2n0j2K5l6RK4Pj9LJ4l2K8%K1j9kk0J1l1L0N3j3l9q2R5l3
7370b8K6M6m8L3j2n8JM8MqNn0O6j5N1p7mO1m9K9j4l6K3m8L9QojN3o8l3L4N8p9
7404d9k4J13Nj6l7mL9m5kL5p5O7p3M6J8k8j6L8j5J5L6l7jL1j1n9J9L6j8J5%RK7
7437C9j7n1J6j6N1J7J3m2j5P1r2M9m2j4k7Q4J9jn2N6n2Rm1M3Nm7nK4NJ6j6K1o2
$$ plain form
7470 -54 -20 -15 41 -35 15 14 -37 -44 6 -57 14 15 11 38 -24 2 -12 -4 -2 -5 23 -20 -2 -12 -22 13 -27 -1 8 -1 -34 -16 38 -31 -60
7505 -60 6 2 4 -48 11 10 9 -62 -28 29 35 17 18 26 49 -27 -6 12 13 20 19 5 53 -40 -4 -6 15 -14 -41 49 -7 11 10 -5 -36 -48
7541 -48 -32 17 -8 45 48 0 16 26 21 -70 -48 -59 -36 7 19 16 -11 -5 2 -51 -56 9 -59 23 -17 7 38 -39 8 -2 13 54 20
7574 20 4 62 58 18 -22 -13 -26 -33 -17 -36 -36 0 -13 -31 -47 -24 -24 10 12 -5 4 -60 14 -25 -8 -12 40 -34 5 42 8 0 17 12 -28
7609 -28 2 -7 -6 4 -6 -21 57 -32 -9 24 26 68 23 -9 47 -53 -23 36 -12 36 -17 -43 -8 -32 -6 -35 -37 -1 64 -33 -33 4
7641 4 -20 -47 11 15 13 33 -14 43 -14 22 -26 -11 30 17 17 92 16 -55 -28 -6 -12 27 10 25 5 35 16 4 -31 -12 -1 8 -51
7674 -51 -1 26 8 42 41 -64 -29 0 -22 -30 -24 -34 -50 -6 -40 -25 -2 -33 5 20 37 15 -10 -24 -1 -8 -1 -18 -5 27 -5 -2 -10
7707 -10 -4 31 -60 -31 18 -50 7 -21 -51 -31 -46 14 -27 17 33 -13 12 -15 -3 -14 0 -22 -2 50 -19 -63 -36 28 56 11 26
$$ packed form
7470e4L4NN6p6N0jn1pN0o3P1JmK7o2K6j4QKlK8m3J8j0j0L5m0K6Rrl3J8N4o9k9
7505f0O6mKn2N9jjp1L4N7Oj8JQK3p6K1J8JPjj4M8r3L6kK1k9k7R0n6J8jj5l1j2
7541d8J6M9k5N3Lm8J6J0nr1K2j1K3M3J2lk7OPn3nO5o8Q2m0K4L1p7M7j0J5M1l4
7574B0j6N8mm0m0Rj3pJ6j9%L6j3j8j6K3%L4Kj7Ro4P4l9J7mN2p4L9L7l4qJ7nm0
7609b8L0rJJ0j0j5P8q9K3L3KM2m5l2N6j00L0N9m8M8n3k6L5k4K6k9kL6O5r7%L7
7641Dk4k7N8MkK0m7N7n7L6m8J5M1j3%P5p6p1K7K2oL9j7J5k0L0j9j2l5J9J1Rn9
7674e1N0K7j8L4jj05L5K9k2qOj0j6M4l4J5K3l1L8J5J7k2k5j4K3pPj7J3L2l2Lq
7707a0OL5r1K9M9o8N7k8l0K0j5O0m1M4J6m6K5k7J2j1J4k2K0N2o9m4K7O4K8m5J5
$$ plain form
7738 26 13 -22 -41 -41 -1 -26 -75 11 35 4 -95 9 -49 -3 -3 -34 -25 -31 -37 10 29 -34 -33 35 -15 15 -31 43 8 -6 57 14 -13
7771 -13 20 10 -1 3 -45 -36 29 -24 66 33 -62 -17 35 -57 7 -10 -12 4 44 -19 42 -51 15 -23 7 27 9 2 -18 -18 -26 -7 -8 15
7805 15 -19 38 9 9 -26 -1 -2 -6 40 -16 40 1 27 8 19 37 -12 37 -17 -5 6 11 -6 13 15 -8 51 34 -12 -11 -1 22 11
7838 11 -35 -33 -18 -11 -41 -46 -35 -28 -12 23 8 -58 -31 -17 -18 2 -7 -10 72 39 -46 54 -23 16 5 -32 -24 27 -21 -34 -44 -28 -17 -38
7872 -38 -16 -14 -33 -29 19 -12 -53 -9 -14 15 -58 -38 -46 49 -4 1 -7 -55 7 8 -24 -10 -29 48 -4 -23 7 0 10 54 -40 28 61 42
7906 42 -6 -28 -66 2 3 -19 -17 2 4 -13 30 25 -4 -21 -21 -72 -44 -16 -28 -13 19 -54 -36 18 -7 18 22 9 12 -30 -5 16 26 63
7940 63 -2 24 38 -12 10 -34 -28 17 9 -20 30 9 7 32 6 29 -17 14 20 28 19 -44 -76 -15 -3 -86 -38 4 -65 -5 47 -5 -51
7973 -51 -43 -45 17 -14 -32 -13 50 50 -14 52 39 3 -15 -64 -42 -6 -3 -4 43 -9 -5 28 20 -31 26 -11 -31 -5 -49 -64 -1 28 -52 -22
$$ packed form
7738B6j3l5j9%M0k5m9Q6K4l1r9J04n8M6%l1RooM7J9o3JO8n0L0m6P4l5j4O3m3k7
7771a3L3j0j1Mm8RO5n3R0l3r5M5N2r2O4j7kJ6M0o3O1r3O6l8L0K0j8pk0%qJ9jK3
7805A5l4N7k9%l5K5jmM6n6N6l9K6j9J1J8m9M9n4J2J1Nj7J9Kk3N9j7m6JJ0K3j1
7838A1m6KJ5Pl0nJ1PJ6L5j5o6K7J4jK0rlQ2l3q5J00p7L9j1l7QN1m8j3j0J6J1k1
7872c8K2Kj9MM8l1m1M4nK9p3K0qR5n3Nqm8O2Jl2J4j9P7n2j9L0pJ0M4r4O8L3j9
7906D2m8k2l8O8Jk2KJ9Kj7M3nk9j7%n1K8K8j2J5L2p3J8N4k5K5Mj3Lm2K5K1J0L7
7940F3o5K6J4n0K2m4OM5qk9N0k1kK5k6K3m6L1OQro3l2O1J2q3M8M2o9O0N2n2m6
7973e1QkO2l1j8J9O3%o4O6j3l6j8m9K2L6LjM7n2ML3qn1N7l7k0K6m4j5O3K9q0L0
$$ plain form
8007 -22 24 86 -57 -44 53 -44 3 0 21 18 20 -1 -62 15 -2 11 12 12 8 -3 79 40 29 20 1 9 78 -12 -9 42 4 -47 -5 21
8041 21 -37 -35 15 10 -33 -39 -17 15 -4 -3 -9 28 44 22 -11 -83 6 -44 -11 38 -19 11 19 -14 45 -29 22 -3 74 33 30 10 26 50
8075 50 -8 15 54 -12 -33 18 38 -21 24 -1 -21 27 -28 -30 17 11 -24 3 -53 49 21 29 16 -3 6 -28 -10 17 -39 -57 -25 56
8107 56 10 0 63 -1 -25 5 25 27 -45 11 41 19 42 -9 0 -32 36 2 36 6 28 -37 -2 -21 5 -19 -67 -7 -46 -13 23
8138 23 12 20 29 32 -7 -18 6 -7 4 38 -39 48 -12 22 22 38 -4 -63 -27 14 53 -22 24 15 -40 -8 19 51 27 -40 -15 -47 -3
8171 -3 -4 -21 -17 11 -85 4 -34 -22 -15 -1 -19 -7 -35 -6 10 0 17 45 -16 29
$$ packed form
8007b2M6O2j43J3R7r7M7lK1lKk1o1P7j7J3J%mj1Q2l9j1rj9QO9r0LN1l8n1M2K6
8041B1n8KN0nm3oK2L2j9JoL7J6k2l3p2Q9n0L3M9n7L0Ql3N9p4N1k5P7m1lk0J6K4
8075E0n8K3L9o6k1N1K0n9M5k5k0M8n5kM7ol5K7n6J02k8Qj3j9Rl4J8K7n6j8L2Q1
8107E6m6j0O3o4k4L0K0Kp2N6L0k2K3n1Rl2O8l4L4l0K2o5L5j9K6k4m8O0l9L3L6
8138B3j1QRLl9j1K4j3J1L4p7Q7o0L4%J6m2n9L6M1L9p5M6rn5L2K7L2k4o7K5l2M4
8171cjj7MK8r6Q9l8J2PJ4j8J2k8K9J6j0J7K8o1M5
8191B9
$$ Imaginary data points
##PAGE= N=2
##DATA TABLE= (X++(I..I)), XYDATA
$$ plain form
0 0 0 0 0 0 0 0 0 0 0 0 -1 8 -8 8 -9 16 -16 24 -24 32 -40 48 -56 64 -73 88 -104 115 -136 153 -177 201 -227
33 -227 258 -292 330 -370 412 -462 516 -573 638 -709 783 -863 959 -1056 1163 -1283 1412
50 1412 -1557 1716 -1891 2090 -2307 2554 -2836 3162 -3538 3982 -4519 5179 -6012 7101 -8598
65 -8598 10793 -14316 20933 -37673 172985 231486 -145955 -90420 48963 -61325 -310223
76 -310223 -178786 128568 166445 -28507 25309 227972 159351 -156803 -225550 -34962 -593
87 -593 -177559 -126461 173920 275265 60922 -37143 112948 128213 -142782 -279811 -84459
98 -84459 72458 -44663 -104053 111428 267285 85599 -123727 -51178 57728 -88506 -241758
109 -241758 -88891 147516 115193 -20077 71256 228158 106928 -145027 -154093 -2586 -33840
$$ packed form
0@%%%%%%%%%%jRj6J6j7K5l2M0m8N6p2Q8j04J20j37J61j92K19k51K89l30L78m28
33b27M85n50O22p00P82q74R78j089J211j347J492j646J822k015K219k446K695
50A412k969L273l607L981m397M861n390N998o700P520q501R698j1191J3113j5699
65h598J9391k5109L5249n8606K10658N8501l77441N5535J39383j10288k48898
76c10223J31437L07354L7877j94952N3816K02663o8621l16154o8747J90588L4369
87e93j76966N1098L00381J01345k14343r8065J50091J5265k70995j37029J95352
98h4459J56917j17121n9390K15481J55857j81686k09326P2549J08906j46234j53252
109b41758J52867K36407l2323j35270R1333J56902j21230k51955r066J51507l1254
$$ plain form
120 -33840 -175476 -89918 150491 176073 3599 -18352 117363 74762 -156182 -211518 -28211
131 -28211 51948 -61244 -56703 151802 232633 51485 -79995 7038 46802 -115942 -213400
142 -213400 -62194 90002 30678 -34832 87510 186069 49454 -121178 -81502 16647 -57808
153 -57808 -156588 -39598 143855 121402 -2404 30433 134050 51392 -137417 -146231 -9713
164 -9713 2579 -92094 -43435 127981 150896 4859 -46353 43827 32720 -118650 -155055 -8851
176 -8851 75137 -961 -20903 108460 158851 15469 -97945 -36749 14459 -80551 -140779 -17319
188 -17319 108662 59482 -15947 50246 116569 11948 -124578 -90573 11233 -16920 -85286
199 -85286 -4051 133226 114061 -2554 -8933 59330 7855 -123166 -122553 -3691 30159 -31063
$$ packed form
120c3840j41636Q5558K40409K5582j72474k1951J35715m2601k30944n5336J83307
131b8211Q0159j13192M541K08505Q0831j81148j31480Q7033L9764j62744r7458
142b13400J51206J52196n9324o5510J22342R8559j36615j70632L9676R8149p4455
153e7808r8780J16990J83453k2453j23806L2837J03617q2658j88809q814J36518
164i713J2292r4673M8659J71416K2915j46037n1212R0180j1107j51370l6405J46204
176h851Q3988p6098j9942J29363N0391j43382j13414O1196N1208r5010o0228J23460
188a7319J25981m9180p5429O6193O6323j04621j36526L4005J01806k8153o8366
199h5286Q1235J37277j9165j16615o379O8263n1475j31021O13J18862L3850o1222
$$ plain form
211 -31063 -6069 109255 118182 -4507 -60655 56 4242 -92771 -112482 6964 84410 29636
223 29636 -1781 75256 105819 -3546 -97597 -54363 543 -50805 -88444 3843 101583 65594
235 65594 -6406 22313 66911 -5683 -105508 -77364 11162 7374 -39827 10305 105447 87426
247 87426 -11385 -30818 17044 -9626 -94336 -87377 10869 48252 2047 6352 77814 77609 -18777
260 -18777 -68920 -22977 -2547 -57280 -66298 23369 84542 42567 2423 37599 53045 -24018
272 -24018 -91256 -55111 64 -18070 -37654 24383 90528 59192 -8049 -4538 22271 -23087
284 -23087 -86580 -60155 16167 28847 -2928 22231 79967 60372 -19722 -45925 -13967 -20441
296 -20441 -67584 -55747 21598 56286 23068 13346 49907 44954 -25724 -66327 -32035 -5156
$$ packed form
211c1063K4994J15324Q927j22689n6148O0711M186r7013j9711J19446P7446n4774
223B9636l1417P7037L0563j09365r4051M3234N4906n1348l7639R2287R7740l5989
235F5594p2000K8719M4598p2594r9825K8144Q8526l788m7201N0132R5142j8021
247H7426r8811j9433M7862k6670q4710O959R8246L7383m6205M305P1462k05r6386
260a8777n0143M5943K0430n4733r018Q9667O1173m1975m0144L5176J5446p7063
272b4018o7238L6145N5175j8134j9584O2037O6145l1336o7241L511K6809m5358
284b3087o3493K6425P6322J2680l1775K5159N7736j9595q0094k6203L1958o474
296b0441m7143J1837P7345L4688l3218r722L6561m953p0678m0603L4292K6879
$$ plain form
308 -5156 -30359 -32277 29122 72492 40658 43 11636 19262 -30186 -72610 -43296 5452 5036
321 5036 -7591 27410 67349 41814 -12726 -20955 -3432 -23496 -57696 -36462 21497 37952
333 37952 15495 20240 46431 29125 -26792 -48931 -25006 -16892 -35829 -22425 30070 54596
345 54596 28673 8433 19812 13310 -32164 -57704 -30008 343 -3291 -2182 33543 58366 31325
358 31325 -7183 -11119 -8343 -33559 -53956 -28709 13273 22530 14743 29607 46465 23969 -18324
371 -18324 -31581 -19856 -23564 -35772 -15864 25696 40000 24135 17055 22987 7204 -30107 -44686
384 -44686 -25928 -11606 -13505 -1630 30665 45703 25395 3014 801 -5682 -29944 -41654 -20461
397 -20461 6299 11594 12564 28840 37336 15771 -13002 -21042 -18867 -26923 -31542 -10027 20063 28118
$$ packed form
308e156k5203j918O1399M3370l1834m0615J1593P626m9448m2424K9314M8748m16
321E036j2627L5001L9939k5535n4540q229J7523k0064l4200K1234N7959J6455
333C7952k2457M745K6191j7306n5917k2139K3925Q114j8937J3404N2495K4526
345E4596k5923k0240J1379o502m5474k5540K7696L0351l634J109L5725K4823k7041
358C1325l8508l936K776k5216k0397K5247M1982R257p787J4864J6858k2496m2293
371a8324j3257J1725l708j2208J9908M1560J4304j5865p080N932j5783l7311j4579
384d4686J8758J4322j899J1875L2295J5038k0308k2381k213o483k4262j1710K1193
397b0461K6760N295R70J6276Q496k1565k8773q040K175q056m619K1515L0090Q055
$$ plain form
411 28118 20876 21328 22967 4492 -24187 -32750 -21037 -14352 -12673 3415 28419 35755 20781 6600
425 6600 1435 -11246 -31399 -36183 -19656 -1490 6532 15494 30631 33797 15973 -4772 -14225
438 -14225 -19817 -27921 -26999 -8292 13207 21181 22052 24804 21066 2772 -18855 -27015 -23716 -20829
452 -20829 -14652 2977 23147 30038 22700 13440 5516 -8147 -23915 -28167 -19330 -7517 2619
465 2619 14191 25496 26150 13773 -469 -10773 -19777 -26069 -23053 -8916 6843 15921 20803 23302
479 23302 18262 4228 -11544 -20102 -20894 -18037 -10090 4078 17370 23061 20469 12986 2882 -9944
493 -9944 -21264 -24363 -19048 -8911 3150 14771 23247 23791 15239 2853 -9214 -18707 -22588 -19386
507 -19386 -9671 2861 13556 20719 22044 15511 3475 -9645 -19584 -22930 -20074 -11416 1500 13934
$$ packed form
411B8118p242M52J639j8475k8679q563J1713O685J679J6088K5004P336j4974j4181
425F600n165j2681k0153m784J6527J8166Q022Q962J5137L166j7824k0745r453
438a4225n592q104R22J8707K1499P974Q71K752l738j8294k1627q160L299K887
452b0829O177J7629K0170O891p338r260p924j3663j5768m252Q837J1813J0136
465B619J1572J1305O54j2377j4242j0304r004o292L016J4137J5759R078M882K499
479B3302n040j4034j5772q558p92K857P947J4168J3292N691k592p483j0104j2826
493i944j1320l099N315J0137J2061J1621Q476N44q552j2386j2067r493l881L202
507a9386R715J2532J0695P163J325o533j2036j3120r939l346K856Q658J2916J2434
$$ plain form
521 13934 21689 22413 16308 6336 -5028 -15671 -21076 -19586 -11431 725 11912 18999 20312 15156
535 15156 5373 -6141 -16138 -20789 -19081 -11644 -270 10633 17948 19960 15803 6853 -4475 -14605
549 -14605 -19005 -17072 -10140 -276 9208 16251 18280 13688 4633 -5785 -14913 -19135 -17300 -10168 396
564 396 10424 17457 19360 14889 5888 -4374 -12986 -17088 -16153 -10465 -637 9601 16807 18436 13276
579 13276 4390 -5435 -14070 -18533 -17389 -10909 -793 9247 16188 18642 15159 7045 -3000 -12147
593 -12147 -17210 -17031 -11599 -1814 8129 14546 16435 13600 6750 -2731 -12187 -17288 -16219 -11048 -2630
608 -2630 6773 14515 17724 14893 7879 -549 -9218 -15110 -15429 -10340 -2464 5092 11321 15470 13905
623 13905 6212 -3048 -10217 -14114 -14860 -11407 -3030 6409 12446 14676 13368 8078 -609 -9615 -13796
$$ packed form
521A3934P755P24o105r972j1364j0643n405J490Q155J2156J1187P087J313n156
535A5156r783j1514r997m651J708P437J1374J0903P315K012m157q950j1328j0130
549a4605m400J933O932R864R484P043K029m592r055j0418r128m222J835P132J0564
564C96J0028P033J903m471r001j0262q612m102R35N688R828J0238P206J629n160
579A3276q886r825q635m463J144O480J0116J0040O941K454l483q114j0045r147
593a2147n063J79N432R785R943O417J889k835o850r481r456n101J069N171Q418
608b630R403P742L209k831p014q428q669n892l19N089P876P556O229M149j565
623A3905p693r260p169l897p46L453Q377R439O037K230j308n290q687r006m181
$$ plain form
638 -13796 -13174 -10088 -4060 4988 12844 14844 10869 5001 -883 -8405 -14929 -15304 -9544 -1606 5262
653 5262 11331 15987 14629 6956 -1437 -7581 -12101 -14640 -11798 -2865 6229 10426 11980 12343 8484
668 8484 -645 -10129 -13937 -12648 -10404 -5541 3464 12035 14756 11701 7350 2452 -5660 -13422 -13982
683 -13982 -8768 -3319 1179 7472 13921 13452 5702 -1468 -5181 -9156 -13300 -12067 -3566 5042 8409
698 8409 10350 12645 9991 1058 -7532 -9856 -9026 -9603 -7045 1925 10262 11256 7811 5689 3111 -4902
714 -4902 -13028 -12932 -7209 -3061 197 6865 13799 12846 5208 -141 -2685 -7837 -13501 -11678 -2502 4396
730 4396 5586 7946 12343 10102 279 -7806 -8934 -8498 -10399 -7656 2394 10546 10618 8426 8437 5627
746 5627 -4112 -12375 -11020 -6252 -5199 -2989 5369 13258 11340 3768 742 -593 -7179 -13870 -11373
$$ packed form
638a3796O22L086O028R048P856K000l975n868n884p522o524l75N760P938O868
653E262O069M656j358p673q393o144m520k539K842Q933R094M197J554L63l859
668H484r129r484l808J289K244M863R005Q571K721l055m351m898q112p762n60
683a3982N214N449M498O293O449m69p750p170l713l975m144J233Q501Q608L367
698H409J941K295k654q933q590k324Q30n77K558Q970Q337R94l445k122k578q013
714d902q126R6N723M148L258O668O934r53p638n349k544n152n664J823R176O898
730D396J190K360M397k241r823q085j128M36j901K743J0050Q152P2k192J1k810
746E627r739q263J355M768J053K210Q358P889j918p572l026j335o586o691K497
$$ plain form
761 -11373 -2483 2514 3314 7588 13113 9997 305 -5034 -4914 -6919 -11263 -8352 2098 8411 6827
776 6827 6093 8367 5819 -3909 -10684 -8180 -4853 -5656 -3178 5900 12280 9139 3380 2783 1430 -6770
792 -6770 -12902 -8981 -1497 561 834 6606 12366 8190 -983 -4354 -3820 -7171 -11379 -7165 2887
807 2887 7035 5390 6919 10100 5858 -4393 -9391 -6418 -5213 -7796 -4255 5856 11218 7666 3827
822 3827 4393 2001 -6809 -11884 -7610 -2114 -1399 227 7533 12438 7561 241 -1306 -1971 -7521 -11891
838 -11891 -7054 1680 4170 3143 6287 9697 5262 -3488 -6813 -4825 -5484 -7786 -3372 5579 8760
853 8760 5641 4154 5564 2194 -6534 -10121 -5706 -2315 -2774 -288 6928 10576 5658 265 -170 -1639
869 -1639 -7235 -9830 -4702 1723 2931 2920 7141 9472 3879 -3548 -5381 -4185 -6275 -8402 -3163 4918
$$ packed form
761a1373Q890M997Q00M274N525l116r692n339J20k005m344K911J0450O313j584
776F827p34K274k548r728o775K504L327q03K478R078O380l141n759n97j353q200
792f770o132L921P484K058K73N772N760m176r173l371N34l351m208M214J0052
807B887M148j645J529L181m242j0251m998K973J205k583L541J0111N362l552l839
822C827N66k392q810n075M274N496P15J626P306M905m877p320j547o65n550m370
838a1891M837Q734K490j027L144L410m435q750l325J988o59k302M414Q951L181
853H760l119j487J410l370q728l587M415L391m59K486P216L648m918n393m35j469
869a639n596k595N128O425J208j1M221K331n593p427j833J196k090k127N239Q081
$$ plain form
885 4918 7021 4821 4729 5586 1488 -5995 -8196 -4905 -3563 -3706 251 7306 9555 5254 1796 1736 -1147
902 -1147 -7438 -9449 -4706 119 870 2088 6952 8895 3892 -1752 -3006 -3439 -6459 -7746 -2591 3783
918 3783 4761 3857 5567 6245 1447 -5242 -6687 -4273 -4205 -4619 -368 5776 7146 4178 2402 2315 -1211
935 -1211 -6581 -7257 -3292 -494 78 2484 7199 7783 2829 -1304 -2046 -3219 -6322 -6826 -1970 3021
951 3021 3774 3839 5522 5282 775 -4159 -5249 -4300 -4801 -3968 896 5689 6159 4030 3143 2403 -1669 -6435
969 -6435 -6846 -3939 -1904 -598 2325 6189 6610 3146 342 -1079 -3520 -6123 -5749 -1961 1648 2724
985 2724 4028 6034 5235 1247 -2600 -3936 -4169 -4896 -3981 -63 3529 4600 4208 3651 2222 -1192 -4554
1002 -4554 -4951 -3766 -2585 -820 2307 5213 5360 2937 772 -962 -3195 -5066 -5038 -2636 373 2232
$$ packed form
885D918K103k200r2Q57m098p483k201L291J342j43L957P055K249m301l458o0k883
902a147o291k011M743M825P51J218M864J943n003n644j254m33l020j287N155O374
918C783R78r04J710O78m798o689j445K414O8m14M251O144J370k968j776q7l526
935a211n370o76L965K798N72K406M715N84m954m133p42j173l103n04M856M991
951C021P53O5J683k40m507m934j090R49n01Q33M864M793M70k129q87p40m072m766
969f435m11K907K035J306K923L864M21l464k804j421k441k603L74L788L609J076
985B724J304K006p99l988l847j336k33p27R15L918L592J071l92n57j429l414l362
1002d554l97J185J181J765L127K906J47k423k165j734k233j871K8K402L009J859
$$ plain form
1018 2232 3797 5009 3969 1250 -1590 -3421 -4227 -4305 -2844 452 3316 4360 4384 3744 2135 -962
1034 -962 -4148 -5042 -4167 -2743 -579 1937 4235 4962 3548 1309 -981 -3301 -4742 -4440 -2650 -23
1050 -23 2050 3700 4852 4149 1778 -1106 -3342 -4224 -4271 -3440 -914 1948 3690 4269 3590 2098 -175
1067 -175 -2780 -3999 -3715 -2631 -746 1632 3638 4505 3476 1647 -200 -2264 -3945 -4285 -3162 -727
1083 -727 1385 2838 3641 3396 1781 -388 -2458 -3473 -3552 -2760 -689 1711 3202 3744 3197 1971 -101
1100 -101 -2598 -3969 -3749 -2583 -777 1235 2923 3963 3477 1778 -146 -2180 -3451 -3600 -2695 -711
1116 -711 1458 3040 4042 3663 2071 -262 -2412 -3679 -3756 -3214 -1550 811 2713 3781 3335 1863
1132 1863 167 -1754 -3289 -3615 -2969 -1089 975 2502 3537 3524 2115 201 -1773 -3007 -3391 -3064
$$ packed form
1018B232J565J212j040k719k840j831q06p8J461L296K864J044K4o40j609l097
1034i62l186q94Q75J424K164K516K298P27j414k239k290k320j441L02J790K627
1050b3K073J650J152p03k371k884k236q82m7Q31K526K862J742N79o79j492k273
1067a75k605j219K84J084J885K378K006Q67j029j829j847k064j681l40J123K435
1083g27K112J453Q03k45j615k169k070j015p9P92K071K400J491N42n47j226k072
1100a01k497j371K20J166J806K012J688J040m86j699j924k034j271j49R05J984
1116g11K169J582J002l79j592k333k150j267p7N42J664K361J902J068m46j472
1132A863j696j921j535l26O46J880K064J527J035j3j409j914j974j234l84L27
$$ plain form
1148 -3064 -1386 884 2427 3062 2945 2176 760 -1472 -3087 -3028 -2133 -994 470 2229 3414 3044 1537
1165 1537 159 -1262 -2893 -3682 -2785 -844 659 1485 2688 3292 2077 -101 -1807 -2317 -2518 -2816 -1579
1182 -1579 1047 2659 2860 2612 2199 898 -1671 -3333 -2851 -2099 -1707 -297 2108 3761 2974 1286 721
1199 721 -203 -2292 -3710 -2837 -653 620 1079 2585 3780 2382 -172 -1495 -1686 -2543 -3705 -2350
1215 -2350 821 2165 1714 2036 2780 1831 -1426 -3176 -2101 -1340 -1910 -937 1979 3683 2445 825 1131
1232 1131 581 -2299 -3907 -2273 -8 -26 -261 2174 4163 2251 -717 -1160 -457 -1716 -3644 -2024
1248 -2024 1604 2228 967 1612 3134 1656 -2167 -3284 -1212 -1054 -2864 -1665 2416 3869 1460 116
1264 116 1687 1378 -2639 -4377 -1557 780 -455 -764 2626 4771 1762 -1362 -221 696 -2345 -4833
$$ packed form
1148c064J678K270J543O35j17p69j416k232j615N9Q95J139J464J759J185l70j507
1165A537j378j421j631p89Q97J941J503Q26J203O04j215k178j706n10k01k98J237
1182a579K626J612K01k48m13j301k569j662M82P52L92J410K405J653p87j688n65
1199G21r24k089j418Q73K184J273M59J506J195j398k554j323j91q57j162J355
1215b350L171J344m51L22P44r49l257j750J075P61n70R73K916J704j238j620L06
1232A131n50k880j608J634K265j8k35K435J989j912k968m43P03j259j928J620
1248b024L628O24j261O45J522j478l823j117K072J58j810J199M081J453k409j344
1264A16J571l09m017j738K820K337j235l09L390K145l009l124J141R17l041k488
$$ plain form
1280 -4833 -1946 2156 1494 -551 1747 4461 1944 -2676 -2688 168 -921 -3867 -1766 3127 3463 129
1296 129 159 3107 1775 -3519 -4420 -351 754 -2258 -1885 3229 4875 477 -1978 987 1702 -2802
1312 -2802 -4875 -687 2826 284 -1472 2636 5182 715 -3695 -1434 1602 -1725 -5098 -1030 4365
1327 4365 2616 -1426 557 4272 1283 -4590 -3638 1321 394 -3540 -1385 4578 4475 -1127 -1732 2660
1343 2660 1564 -4612 -5167 871 2867 -1536 -2033 3848 5579 -521 -3750 281 2235 -2826 -5496
1358 -5496 299 4767 877 -2260 2092 5414 219 -5351 -2044 2648 -776 -5074 -729 5517 3181
1373 3181 -2623 -726 4368 1161 -5645 -3983 2489 1856 -3539 -1734 5377 4755 -2545 -3289 2477 2279
1389 2279 -4698 -5418 2065 4660 -1235 -2860 3565 5562 -1478 -5417 18 3173 -2488 -5445 1214
$$ packed form
1280d833K887M102o62k045K298K714k517m620j2K856j089k946K101M893L36l334
1296A29L0K948j332n294r01M069J105l012L73N114J646m398k455K965P15m504
1312b802k073M188L513k542j756M108K546m467m410K261L036l327l373M068N395
1327D365j749m042J983L715k989n873R52M959r27l934K155N963j03n602o05M392
1343B660j096o176n55O038J996m403m97N881J731o100l229M031J954n061k670
1358e496N795M468l890l137M352L322n195n570L307M692l424m298M345O246k336
1373C181n804J897N094l207o806J662O472o33n395J805P111o22p300p44N766j98
1389B279o977p20P483K595n895j625O425J997p040l939N435L155n661k957O659
$$ plain form
1404 1214 6213 1303 -3478 1059 5394 -437 -6724 -2412 3775 473 -4859 -481 6604 3537 -3902
1419 -3902 -2079 3999 1035 -6318 -4434 3685 3486 -3267 -1960 5746 4992 -3537 -4843 2273 3026 -4657
1435 -4657 -5572 3053 5881 -1084 -3541 3289 5733 -2291 -6654 129 4300 -1919 -5624 1522 7292
1450 7292 1210 -4865 233 5552 -455 -7232 -2384 5049 1569 -5014 -859 6806 3259 -5043 -3151
1465 -3151 4044 1726 -6288 -4163 4902 4476 -3406 -2799 5349 4874 -4427 -5907 2454 3964 -4044 -5279
1481 -5279 3688 6804 -1147 -4780 2628 5559 -2936 -7414 218 5421 -996 -5511 1781 7866 875
1496 875 -5981 -573 5412 -568 -7749 -2122 6171 2282 -5047 -804 7029 2906 -6081 -3900 4391
1511 4391 1994 -6363 -3783 5764 5189 -3639 -3365 5147 4725 -5000 -6249 2641 4548 -3551 -5067 3966
$$ packed form
1404A214M999m910m781M537M335n831o287M312O187l302n332M378P085l067p439
1419c902J823O078k964p353J884Q119j99o753J307P706p54q529j306P116P53p683
1435d657r15Q625K828o965k457O830K444q024m363O783M171o219l705P146N770
1450G292o082o075N098N319o007o777M848P433l480o583M155P665l547q302J892
1465c151P195k318q014K125R065m26p882O07Q148m75r301j480Q361J510q008j235
1481e279Q967L116p951l633P408K931q495m478P632N203o417m515P292O085o991
1496H75o856N408N985n980p181N627Q293l889p329M243P833m123q987K181Q291
1511D391k397q357K580R547n75q828K74Q512m22r725j249Q890J907q099j516R033
$$ plain form
1527 3966 7002 -1616 -5419 2188 5341 -2929 -7264 659 6285 -598 -5588 1663 7475 443 -6711
1542 -6711 -1086 5583 -213 -7291 -1474 6752 2577 -5246 -1248 6485 2286 -6813 -3875 4870 2607
1557 2607 -5602 -3234 6179 5290 -4036 -3936 4578 4103 -5298 -6107 3168 5150 -3069 -4672 4275 6679
1573 6679 -2270 -5981 1625 5058 -2966 -7051 1150 6698 -190 -5282 1488 7001 2 -7064 -1451
1588 -1451 5289 -67 -6615 -1015 6924 2629 -5184 -1508 6137 1978 -6779 -3834 4901 2958 -5194
1603 -5194 -2980 6219 4959 -4276 -4173 4111 3886 -5153 -5684 3628 5420 -2915 -4502 4029 6099 -2732
1619 -2732 -6222 1562 5089 -2686 -6410 1744 6828 -136 -5480 1005 6283 -644 -7053 -1177 5440
1634 5440 457 -5883 -554 6874 2379 -5350 -1877 5310 1600 -6367 -3440 5058 3362 -4526 -2546
$$ packed form
1527C966L036q618l803P607L153q270m335P923N626o883m990P251N812p032p154
1542f711N625O669n796p078N817Q226m175p823L998P733m199r099K938Q745k263
1557B607q209K368R413q89r326J00Q514m75r401q09R275J982q219j603Q947K404
1573F679q949l711P606L433q024m085Q201N548o888n092O770N513o999p066N613
1588a451O740n356o548N600P939m295p813L676P645m159q757K945Q735j943q152
1603e194K214R199j260r235J03Q284k25r039n31R312J792q335j587Q531K070q831
1619b732l490P784L527p775l724Q154N084o964n344O485N278o927o409N876O617
1634E440m983o340N329P428m495p729L473P187l710p967K927Q498j696p888J980
$$ plain form
1649 -2546 5802 4395 -4473 -4410 3670 3554 -4805 -4977 3882 5415 -2601 -4207 3698 5463 -3042 -6203
1665 -6203 1541 4861 -2478 -5749 1989 6633 -399 -5401 944 5651 -1058 -6701 -802 5466 469
1680 469 -5444 -102 6613 1844 -5381 -1789 4920 1323 -6046 -2839 5225 3220 -4242 -2260 5218
1695 5218 3620 -4649 -4257 3466 3314 -4229 -4098 4001 5073 -2573 -4162 3143 4606 -3269 -5766 1562
1711 1562 4739 -1851 -4849 2200 6023 -806 -5202 646 4803 -1164 -6074 -273 5438 566 -4711
1726 -4711 247 5902 1166 -5394 -1808 4466 979 -5331 -1974 5223 2929 -3878 -2107 4703 2809
1741 2809 -4633 -3805 3305 2968 -3732 -3365 3925 4505 -2628 -3813 2722 3779 -3117 -5000 1633 4438
1757 4438 -1619 -4148 2138 5156 -1019 -4784 442 4173 -1132 -5157 175 5028 514 -4106 108
$$ packed form
1649b546Q348j407q868O3Q080j16q359j72Q859J533q016j606P905J765q505l161
1665f203P744L320p339l271P738M644p032n002O345M707o709n643N899O268m997
1680D69n913N342O715m769p225L592O709l597p369L207Q064k005p462J982P478
1695E218j598q269L92P723j52p543J31Q099J072p646j589P305J463p875k497P328
1711A562L177o590k998P049L823o829m396N848M157n967m910N801N711m872n277
1726d711M958N655m736o560L586O274l487o310L357P197k294o807J771O810j894
1741B809p442Q28P110l37o700L67P290N80p133j185O535J057o896j883O633K805
1757D438o057k529O286L018o175l765N226L731n305m025N332M853m514m620M214
$$ plain form
1772 108 4995 672 -5037 -1539 4059 929 -4518 -1290 4783 2507 -3673 -1861 3923 1907 -4416
1787 -4416 -3203 3205 2751 -3175 -2589 3728 3794 -2656 -3543 2209 3109 -2929 -4237 1974 4049 -1401
1803 -1401 -3384 1983 4317 -1209 -4468 372 3534 -1055 -4220 548 4634 665 -3707 14 4164
1818 4164 274 -4561 -1297 3536 928 -3676 -911 4373 2062 -3320 -1823 3205 1548 -3840 -2714
1833 -2714 3050 2565 -2705 -2216 3250 3032 -2571 -3212 1946 2642 -2576 -3344 2115 3669 -1204 -2908
1849 -2908 1689 3508 -1465 -4056 501 3257 -845 -3442 809 4184 365 -3305 -92 3281 -111
1864 -111 -3942 -982 3256 969 -3017 -487 3721 1495 -3156 -1737 2526 1157 -3405 -2037 2845
1879 2845 2212 -2176 -1687 2749 2317 -2477 -2857 1660 2077 -2138 -2555 2064 3200 -1069 -2471 1492
$$ packed form
1772A08M887m323n709L498N598l130n447L228O073k276o180J812N784k016o323
1787d416J213O408m54n926N86O317O6o450q87N752R00o038j308O211K075n450
1803a401j983N367K334n526l259M840L162m589l165M768M086l969m372L721M150
1818D164l890m835L264M833k608m604K765N284k311n382J497N028j657n388J126
1833b714N764m85n270M89N466k18n603o41N158O96n218p68N459J554m873j704
1849b908M597J819m973k591M557K756m102k597M251L375l819l670L213L373l392
1864a11l831K960M238k287l986K530M208k226m651J419M263j369m562J368M882
1879B845o33m388M89M436m32m794l80M517M17m215m17M619J136m269j402L963
$$ plain form
1895 1492 2734 -1551 -3332 554 2750 -732 -2747 927 3425 -28 -2863 -41 2531 -276 -3362
1910 -3362 -460 3000 722 -2422 -285 3006 907 -2849 -1419 2111 813 -2644 -1293 2513 1871
1925 1871 -1828 -1421 2178 1593 -2248 -2155 1438 1774 -1553 -1747 1888 2522 -1052 -2123 1029 1937 -1367
1942 -1367 -2663 639 2342 -515 -2008 903 2590 -217 -2499 -162 1977 -381 -2608 -85 2563
1957 2563 657 -1879 -197 2287 497 -2429 -1124 1644 580 -2042 -875 2164 1464 -1554 -1119
1972 -1119 1549 1042 -1800 -1705 1190 1545 -1152 -1280 1579 1854 -893 -1744 668 1411 -1067 -1960 593
1989 593 1857 -263 -1433 663 1916 -304 -2011 -149 1435 -255 -1706 77 1989 500 -1500
2004 -1500 -159 1601 155 -1936 -913 1368 650 -1370 -470 1747 1013 -1220 -932 1054 654 -1440
$$ packed form
1895A492J242m285j781L886K196l482k015L674K498l453k835K822K572k807l086
1910c362K902L460k278l144K137L291k099l756J430L530j298l457J351L806o42
1925A871l699M07L599n85l841R3L593L36l327j94L635O34l574j071L152R08l304
1942a367j296L302J703k857j493K911J687k807k282K337K139k358k227K523K648
1957B563j906k536J682K484j790k926J305K768j064k622J167L039p00l018M35
1972a119K668n07k842R5K895L55k697j28K859K75k747q51K412P43k478q93K553
1989E93J264k120j170K096J253k220j707J862J584j690j451J783J912j489k000
2004a500J341J760j446k091J023K281p18k020R00K217p34k233K88J986m00k094
$$ plain form
2020 -1440 -1186 1126 1301 -752 -791 1186 1382 -818 -1503 370 965 -898 -1299 653 1582 -44 -1057
2037 -1057 441 1322 -396 -1534 -101 1080 -77 -1310 112 1610 392 -1124 -196 1053 43
2052 43 -1450 -660 1077 531 -896 -236 1294 740 -975 -803 771 464 -1128 -781 967 912 -490 -550
2070 -550 818 924 -823 -1102 267 678 -538 -817 539 1217 -77 -811 223 820 -494 -1167 -45
2087 -45 814 39 -707 244 1142 228 -891 -334 585 -61 -1036 -281 898 493 -525 -39 937 426 -822
2106 -822 -615 425 235 -718 -364 647 745 -278 -452 468 408 -650 -787 224 487 -283 -463 560 830
2125 830 -116 -489 110 377 -412 -779 -22 605 98 -365 231 691 10 -653 -275 334 -108 -596 -90 564
2145 564 345 -249 -84 519 150 -566 -408 137 157 -285 -185 544 519 -185 -256 183 211 -429 -511 75 386 -39
$$ packed form
2020a440K54K312J75k053l9J977J96k200o85J873N95j863m01J952R29j626j013
2037a057J498Q81j718j138J433J181j157j233J422J498j218j516R28J249j010
2052D3j493P90J737n46j427O60J530n54j715J72J574l07j592L47J748n5j402o0
2070e50J368J06j747k79J369M11j216k79J356O78j294p34J034N97j314o73J122
2087d5Q59p75p46R51Q98r14j119N57R19o46r75P55J179m05j018M86R76n11j248
2106h22K07J040j90r53L54J011R8j023j74R20o0j058j37J011K63p70j80J023K70
2125H30r46l73N99K67p89l67P57O27n07m63N96M60o81o63L78O09m42m88N06O54
2145E64k19n94J65O03l69p16J58N45K0m42J00P29k5p04p1M39K8o40q2N86L11m25
$$ plain form
2167 -39 -114 403 458 -24 -367 -129 159 -205 -460 38 410 182 -60 107 332 3 -454 -266 109 -45 -238
2188 -238 32 444 350 -103 -26 206 21 -337 -353 56 243 -61 -95 324 335 -14 -222 -39 24 -226 -277 75
2210 75 234 117 23 198 271 -54 -381 -135 36 -108 -119 37 337 222 -71 -21 119 -11 -262 -213 6 106
2232 106 -77 26 295 243 -4 -145 -73 -30 -283 -241 57 147 66 54 173 192 -61 -298 -103 -63 -127 -77 38 250
2256 250 138 48 56 83 -82 -245 -180 -61 2 -83 113 255 202 23 9 -69 -96 -221 -125 50 130 11 143 221 122
2281 122 -76 -255 -90 -107 -135 -86 28 184 63 26 109 4 -84 -182 -41 -69 -62 -34 91 206 93 28 -34 -81 -120
2306 -120 -187 -130 23 90 37 107 222 55 -6 -111 -83 -83 -112 17 109 106 135 89 52 73 -176 -185 -129 -60 -82 8 117 194
2334 194 141 29 59 -55 -185 -147 -95 1 43 15 138 148 31 37 -57 -83 -100 -209 -47 86 65 90 105 118 104 -123
$$ packed form
2167c9p5N17N5m82l43K38K88l64k55M98L72k28k42J67K25l29m57J88L75j54j93
2188b38K70M12r4m53P7K32j85l58j6M09J87l04l4M19J1l49k08J83O3k50n1L52
2210G5J59j17r4J75P3l25l27K46J71j44j1J56L00j15k93N0J40j30k51M9K19J00
2232A06j83J03K69n2k47j41P2M3k53M2K98R0q1j2J19J9k53k37J95M0o4N0J15K12
2256B50j12r0QK7j65j63O5J19O3q5J96J42n3j79j4p8k7j25R6J75Q0j19J32P8r9
2281A22j98j79J65j7k8M9J14J56j21l7Q3j05q8r8J41k8PK8J25J15j13o5o2m7l9
2306a20o7N7J53O7n3P0J15j67o1j05K8%k9J29R2lK9m6l7K1k49rN6O9k2R0J09P7
2334A94n3j12L0j14j30L8N2R6M2k8J23J0j17Or4k6j7j09J62J33k1K5J5J3j4k27
$$ plain form
2360 -123 -164 -56 -89 -49 -31 111 183 112 -31 47 8 -132 -143 -126 -25 -42 39 141 187 39 -78 -33 -23 -105 -174 -29
2386 -29 133 80 29 117 170 41 -162 -128 -44 -121 -131 27 125 234 14 49 170 -55 -195 -99 -3 5 -81 30 167
2411 167 167 5 -64 58 37 -186 -217 78 74 -54 5 180 187 -6 -170 21 115 -210 -180 89 217 37 -55 95
2435 95 243 -50 -362 -57 56 -49 -134 68 289 70 -151 59 173 -27 -268 -82 175 49 -128 38 263
2456 263 129 -181 -61 49 -10 -329 -160 231 149 -71 -39 233 149 -105 -174 47 93 -208 -139 161 285 -11
2478 -11 -90 79 158 -226 -223 4 159 -106 -157 145 363 80 -202 21 103 -84 -309 -159 191 46 -237 72
2500 72 313 118 -196 -163 115 -30 -272 -111 254 143 -91 -99 218 172 -217 -208 73 127 -153 -217 201 274 -70
2523 -70 -162 102 164 -131 -282 15 211 -67 -167 115 373 16 -225 -25 155 -57 -297 -68 229 103 -106
$$ packed form
2360a23m1J08l3M0J8J42P2p1j43P8l9j40j1J7J01j7Q1J02M6j48j17M5J0q2o9J45
2386b9J62n3n1Q8N3j29k03L4Q4p7j0J58R8J09k20L5J21k25j40R6R6Qq6J11J37
2411A67%j62o9J22k1k23l1K95mj28N9J75Pj93j64J91R4l25L0K69J28j80r2J50
2435I5J48k93l12L05J13j05q5K02K21k19k21K10J14k00k41J86K57j26j77J66K25
2456B63j34l10J20J10n9l19J69L91q2k20L2K72q4k54o9K21M6l01O9L00J24k96
2478a1p9J69P9l84LK27J55k65n1L02K18k83k82K23Q2j87k25J50L50j45k83L09
2500G2K41j95l14L3K78j45k42J61L65j11k34qL17m6l89RK81N4k80o4M18P3l44
2523g0r2K64O2k95j51K97J96k78j00K82K58l57k41K00J80k12k40K29K97j26k09
$$ plain form
2544 -106 -39 300 138 -321 -173 148 55 -240 -191 243 212 -83 -165 236 112 -273 -260 73 239 -159 -148 230
2566 230 258 -45 -203 60 232 -175 -358 21 223 -41 -156 91 349 -22 -243 -69 203 27 -303 -65
2586 -65 326 108 -216 -67 295 100 -312 -178 146 99 -205 -167 292 223 -179 -176 143 180 -210 -265 110 208 -109
2609 -109 -137 154 287 -69 -258 55 166 -124 -271 0 322 69 -206 16 225 -119 -348 -17 163 56
2629 56 -231 -32 284 161 -194 0 155 22 -272 -197 209 139 -189 -104 260 156 -178 -199 80 110 -199 -225
2651 -225 177 256 -90 -106 172 205 -84 -233 29 156 -105 -194 77 289 11 -209 34 215 -54 -250 -91
2672 -91 146 8 -162 -4 287 35 -139 -65 162 89 -215 -132 165 146 -111 -40 99 99 -120 -138 31 18 -126
2695 -126 -177 126 212 30 -153 130 118 -98 -143 53 58 -28 -130 64 177 -7 -72 21 57 -40 -124 -64 115 16 -68
$$ packed form
2544a06O7L39j62m59J48L21r3k95M9M34l1k95q2M01j24l85J3L33J66l98J1L78
2566B30K8l03j58K63J72m07j83L79K02k64j15K47K58l71k21J74K72j76l30K38
2586f5L91k18l24J49L62j95m12J34L24m7l04L8M59o9m02LL19L7l90n5L75R8l17
2609a09k8K91J33l56j89L13J11k90j47K71L22k53k75K22K09l44k29L31J80j07
2629E6k87J99L16j23l55J94J55j33k94P5M06p0l28Q5L64j04l34k1K79L0l09k6
2651b25M02P9l46j6K78L3k89j49K62J27k61q9K71K12k78k20K43J81k69j96J59
2672i1K37j38j70J58K91k52j74P4K27p3l04Q3K97j9k57P1J39%k19j8J69j3j44
2695a26n1L03Q6j82j83K83j2k16m5J96Nq6j02J94J13j84o5R3L6r7q4O0J79r9q4
$$ plain form
2720 -68 20 183 46 -103 -82 11 11 -109 3 139 108 6 -58 22 38 -106 -127 -30 3 -75 -61 43 78 -36 -74 66
2746 66 25 -55 -139 -36 36 -38 -49 -7 99 52 -128 -48 -1 10 -89 -21 91 87 18 -17 14 56 -116 -85 28 21 8 -37
2774 -37 58 78 22 -43 63 14 -43 -84 -24 54 -11 8 18 70 0 0 -51 10 -42 -94 -2 47 52 4 6 53 76 -24 -46 -11 4
2805 4 48 6 73 47 -42 -34 56 -17 -60 -39 -57 -34 -65 -31 72 52 41 5 0 14 -33 -39 61 36 -83 -18 2 86 -47 8
2835 8 -25 15 -22 -76 27 4 77 14 34 58 -4 -100 -25 -11 4 -24 1 83 45 -32 31 -39 -30 -48 -72 -47 38 -26 -4 53 -4
2866 -4 -15 -44 -48 41 -25 -80 -13 96 39 4 -18 25 -17 -120 -5 34 30 -61 12 91 11 -6 16 56 -42 3 -52 -24 21 -38
2896 -38 39 114 62 5 -28 -16 -11 -26 -143 31 31 7 -25 -26 108 -52 -166 15 87 -13 -146 -28 118 40 -113 35
2922 35 79 -28 -115 -29 124 114 -100 -28 156 120 -91 -68 87 90 -141 -91 97 101 -73 -114 109 153 -85 -281 46
$$ packed form
2720f8Q8J63j37j49K1R3%j20J12J36l1j02o4Q0J6j44k1R7L3p8J4J04L5j14l8J40
2746F6m1q0q4J03P2p4j1M2J06m7j80Q0M7J1r9O8J12mo9l5L1M2j72L1J13pj3m5
2774c7R5K0n6o5J06m9n7m1O0P8o5J9J0N2p0%n1O1n2n2R2M9Nm8KM7K3j00k2L5J5
2805DM4m2O7k6q9QR0p3m3K1j8K3l1L4J03k0j1l6nJ4m7oJ00k5j19O5K0Q4j33N5
2835Hl3M0l7n4J03k3P3o3K0K4o2r6P5J4J5k8K5Q2l8p7O3p0Rj8k4K5Q5o4K2N7n7
2866dj1k9mQ9o6n5O7J09n7l5k2M3m2j03J15L9mr1P3P9q0j7K2M0r8M5n5K8M5n9
2896c8P7P5n2n7l3J2Nj5j17J74%k4l2jJ34j60j14J81P2j00j33J18J46p8j53J48
2922C5M4j07q7Q6J53j0k14P2J84l6k11K3J55Lk31N0J88Mj74m1K23M4k38j96L27
$$ plain form
2947 46 138 -76 -165 -29 183 -8 -217 57 193 -51 -207 -34 210 65 -175 -3 243 108 -166 -21 231
2968 231 67 -272 -80 209 103 -217 -129 251 167 -182 -219 167 138 -233 -154 216 211 -127 -316 176 276 -177
2990 -177 -298 141 233 -171 -268 100 334 -113 -304 60 287 -68 -329 9 281 -39 -324 79 340 30 -387
3011 -387 -113 399 52 -351 -139 394 199 -316 -139 361 216 -364 -271 299 196 -319 -307 289 348 -251 -352
3032 -352 255 352 -245 -374 194 356 -211 -408 150 512 -75 -467 103 448 -98 -540 55 511 58 -450
3052 -450 -91 496 137 -531 -156 490 161 -471 -174 472 309 -469 -280 476 341 -433 -369 367 428 -376 -466
3073 -466 403 403 -308 -455 259 534 -272 -590 279 562 -151 -575 225 663 -93 -669 43 628 -24 -659 -36
3094 -36 742 80 -672 -127 676 129 -708 -274 643 231 -683 -366 671 386 -616 -468 579 491 -572
$$ packed form
2947D6R2k14q9J36K12j91k09K74J36k44j56J73K44j45k40J72K46j35k74J45K52
2968B31j64l39J92K89j06l20Q8L80q4l49l7L86k9l71P9L70nl38j89M92J00m53
2990a77j21M39R2m04r7L68K34m47j91L64K27l55k61L38K72l20k85M03K61l10m17
3011c87K74N12l47m03K12N33j95n15J77N00j45n80R3N70j03n15J2N96N9n99j01
3032c52O07R7n97j29N68J62n67j97N58L62n87l92N70L45n46m42N95M56m53n08
3052d50L59N87l59o68L75O46l29o32K97O46j63p78J89P56j35p74O4P36O1q04r0
3073d66Q69%p11j47P14K75q06l18Q69K83p13m24Q00M38p56n76P12N85o52o35O23
3094c6P78o62p52N45Q03n47q37M34R17m12r14L17J037k85j002J48J047q8j063
$$ plain form
3113 -572 -595 502 548 -517 -580 391 673 -411 -703 291 649 -345 -802 249 806 -196 -770 142 799
3132 799 -124 -842 61 782 68 -773 -66 871 225 -793 -216 824 232 -778 -394 820 432 -716
3150 -716 -490 739 500 -718 -594 666 580 -697 -710 559 682 -526 -764 476 829 -420 -898 328
3168 328 913 -359 -863 206 922 -70 -926 32 998 -27 -985 -110 994 169 -964 -201 965 262
3186 262 -976 -372 955 445 -955 -497 891 532 -816 -622 796 697 -740 -744 651 763 -679 -862
3204 -862 603 822 -450 -911 468 1017 -404 -974 282 994 -220 -1077 208 1082 -48 -1046 -21
3221 -21 1012 74 -1098 -235 1046 222 -1044 -288 1061 449 -976 -483 1001 581 -939 -629 858
3238 858 717 -820 -805 768 827 -716 -897 612 948 -549 -995 534 1021 -437 -997 392 1059 -278
$$ packed form
3113e72k3J097M6j065o3R71K82j084k92R94L58r94m57J051N57j002n74R12O57
3132G99r23p18R03P21p14q41P07R37o46j018N77J040n92j010L84J214l88j148
3150g16K26J229k39j218J24J260q6j277j3J269J23j208k38J240L53j249m78J226
3168C28N85j272n04J069P16r92q56R58R66j025r58Q75J104q25j133P63J166p03
3186B62j238O04J327n10j400M58J388l59j348J94J418r9j437mJ395J12j442j83
3204h62J465K19j272m61J379N49j421n70J256P12j214q57J285Q74j130r98J025
3221b1J033r38j172Q63J281q24j266P56J349o12j425M93J484m20j520L10J487
3238H58j41j537J5J573N9j543j81J509L36j497m46J529M87j458n60J389O67j337
$$ plain form
3256 -278 -1063 186 1129 -119 -1134 80 1188 69 -1089 -150 1117 163 -1141 -274 1102 372 -1095
3273 -1095 -425 1023 519 -1015 -627 979 665 -880 -728 850 777 -803 -853 718 933 -660 -949 566
3291 566 1026 -545 -1124 401 1062 -321 -1141 225 1120 -171 -1156 77 1235 18 -1141 -27 1160
3308 1160 117 -1128 -239 1073 340 -1120 -357 1136 470 -1020 -566 1035 633 -965 -705 841 823
3325 823 -866 -874 814 933 -732 -929 644 911 -546 -1022 441 1057 -403 -1103 370 1122 -264 -1134
3343 -1134 177 1157 -68 -1151 -51 1198 123 -1135 -220 1118 309 -1129 -418 1063 446 -990
3359 -990 -489 974 605 -901 -622 876 704 -832 -810 721 795 -688 -877 658 931 -508 -966 441
3377 441 1010 -417 -960 334 1075 -284 -1025 190 1080 -96 -1088 -1 1032 49 -1070 -141 1070
$$ packed form
3256b78p85J249R43j248j015J214J108j119j158R39J267r54j304Q67J376p30j467
3273a095O70J448n04j534L88J606l14j545J52J578p3j580n0J571K15j593k89J515
3291E66M60j571n79J525O61j383q20J366Q95j291r85J233J158j217j159J114J187
3308A160j043j245Q89J312p33j460P63J493o66j490M54J601m02j598K60J546j8
3325H23j689qJ688J19j665j97J573K67j457m76J463O16j460p00J473P52j386q70
3343a134J311R80j225j083J100J249j075j258R15J338q09j438P11J481o17j436
3359i90N01J463l69j506K79J498j72j536K2J531P4j483j89J535K73j439m58J407
3377D41N69j427n43J294P41j359p41J215Q90j176r92J087J033r83j119R29J211
$$ plain form
3394 1070 232 -1025 -274 1024 313 -975 -419 883 536 -879 -572 908 623 -776 -736 715 672 -645
3412 -645 -840 576 843 -525 -901 503 918 -402 -904 373 960 -294 -970 196 1004 -174 -937
3429 -937 93 951 -26 -970 -106 958 189 -904 -218 892 275 -850 -385 822 442 -794 -506 754
3447 754 532 -689 -621 671 628 -612 -680 563 705 -518 -764 413 764 -362 -894 314 843 -254
3465 -254 -818 193 864 -128 -812 48 866 57 -807 -70 839 161 -819 -256 804 285 -709 -339 717
3484 717 355 -718 -430 582 456 -631 -537 590 538 -501 -571 463 616 -422 -592 375 623 -303 -719
3503 -719 233 686 -240 -697 155 691 -113 -723 80 671 -6 -671 -10 700 113 -666 -171 654 253 -622
3523 -622 -273 605 336 -577 -336 522 388 -508 -389 495 434 -456 -498 355 439 -388 -519 309 536 -272 -578
$$ packed form
3394A070q38j257P51J298p11j288N56J302l47j415L07J480k85j399M0J451m3j317
3412f45j95J416K67j368l76J404M15j320n02J277N87j254o76J166Q08j178p63
3429i37J030Q58r77r44Q64J064p69j093O86J110o17j125M65J207l80j236K88J260
3447G54k22j221O8J292m3j240o8J243J42j223k46J177L51j126n32J208N29j097
3465b54n64J011O71r92o84Q60Q18q09q64P37R09o78r80N63J060n19r94L70J056
3484G17l62j073K88J012j26j087R4J127n2j039p0J034J53j038j70R67K48r26m16
3503g19R52M53r26m57Q52N36q04o10Q03N91o77o65O61P10n87p79M95Q25m01q75
3523f22L49Q78k69r13K41Q58j34q96J19Q84o1q90m2Q53Q4q27j31Q28K27q08l06
$$ plain form
3544 -578 210 554 -145 -577 144 581 -116 -554 54 538 18 -578 -19 591 89 -467 -92 478 228 -517
3564 -517 -177 472 265 -420 -232 432 304 -306 -342 388 347 -358 -396 251 392 -252 -463 243 400 -172 -369
3585 -369 181 408 -125 -467 88 465 -35 -361 -39 423 -6 -330 -51 404 94 -352 -67 391 158 -396
3605 -396 -154 349 216 -333 -234 307 190 -261 -265 267 261 -229 -293 176 298 -202 -317 142 310 -96 -299 67
3627 67 334 -23 -319 7 326 -10 -315 -16 325 90 -309 -89 251 148 -348 -93 240 169 -256 -170 226
3648 226 201 -213 -203 194 149 -178 -225 201 229 -128 -241 112 165 -55 -222 71 255 -48 -238 11 225 37
3670 37 -203 -3 259 26 -248 -3 223 30 -201 -86 236 108 -173 -131 212 108 -210 -133 128 144 -152
3691 -152 -188 89 189 -107 -175 107 129 -123 -215 127 213 -41 -116 -11 146 -1 -136 13 185 21 -161 14
$$ packed form
3544e78P88L44o99m32P21M37o97m38O08M84n20n96N59O10n02n56L75N70k50p45
3564e17L40O49k07o85J88O64j28o10l6P30m1p05l8O47J41o44k11P06J57n72j97
3585c69N50K27n33l42N55L77n00l26L22M62m29l24K79M55l10m46K85M58k33n54
3605c96K42N03j33n49R9N41j17m51mN32om90o4M69J22n00j15M59J68m06k03L66
3627F7K67l57k96L26L19l36l05K99L41k35l99K20L40j03m96K55L33p1m25Q6L96
3648B26k5m14J0L97m5l27m7M26K8l57j13L53N3k20j67K93J84l03j90K49K14j88
3670C7k40K00K62k33k74K45K26j93k31J15L22j28k81M2L43j04l18P7K61J6k96
3691a52l6K77J00k96o8K82K2k52r2L42Q6k54p5J05J57j47j35J49J72j64j82J75
$$ plain form
3713 14 174 103 -106 -44 141 68 -137 -37 110 84 -164 -53 132 85 -62 -103 107 96 -110 -143 62 88 -53
3736 -53 -108 69 98 -99 -194 -5 145 -3 -117 -53 133 -2 -149 -50 129 63 -80 -51 90 17 -101 -92 61 51
3760 51 -83 4 74 140 -61 -75 -3 101 -78 -78 77 97 -7 -93 39 92 -24 -125 10 85 -54 -99 23 116 -8
3785 -8 -95 -45 41 -16 -77 -44 93 -6 -65 6 49 20 -30 -37 38 29 -4 -29 37 51 -5 -69 49 64 -6 -35 56 63 -74 -67 -8
3816 -8 79 -22 -78 60 41 -29 -38 -38 49 1 -69 -29 57 -1 -65 -63 12 22 -66 -67 103 30 -31 -35 50 26 -86 2 19 51 -6
3847 -6 -6 43 36 -57 -28 28 -61 18 -42 4 94 -9 -45 61 44 -55 -17 -42 39 -7 -56 -46 47 -32 12 -24 -38 13 -56 -11 -27
3878 -27 -26 -32 -17 81 -12 -7 19 22 -26 7 15 74 12 -19 18 53 -2 2 -3 -6 0 28 -10 36 48 -25 11 -23 -53 -68 -39 4 13 -19 -60
3913 -60 16 0 1 -12 24 -11 -30 -85 39 -50 2 -67 -36 10 9 -41 31 34 -26 12 5 61 26 -71 29 52 16 -49 53 30 -23
$$ packed form
3713A4J60p1k09O2J85p3k05J00J47k6k48J11J85m7j47m1K10j1k06l3K05K6j41
3736e3n5J77K9j97r5J89J50j48j14O4J86j35j47R9J79o6j43K9J41p3j18RJ53j0
3760E1j34Q7P0O6k01j4P2J04j79%J55K0j04q6J32N3j16j01J35P5j39m5J22R3j24
3785hq7N0Q6n7o1L3J37r9n9P1M3k9n0pP5rl3k5O6J4n6o4J18J5p0k9R1Pj37PN9
3816hQ7j01n6J38j9p0r%Q7m8p0M0Q6n8o4KP5J0q8jJ70p3o1mQ5k4j12Q8J7L2n7
3847f%M9pr3K9N6q9P9o0M6R0j03l6J06j7r9L8k5Q1m6m9J0R3p9M4l6j4N1o9M5j6
3878b7JoJ5R8r3NK6Lm8L3QN9o2l1L7L5n5MnlOK8l8M6J2p3L6l4l0j5K9M3Rl2m1
3913f0P6j6Jj3L6l5j9n5J24q9N2o9L1M6jn0P2Lo0L8pN6l5r7J00K3l6o5J02k3n3
$$ plain form
3944 -23 -23 19 -22 -29 -68 23 36 16 -52 -29 48 43 -67 16 54 40 -75 -71 1 -35 -39 -28 31 18 -10 -9 -48 -9 -95 -54 63 53
3976 53 29 1 -2 38 -23 -44 18 47 8 -116 -15 40 0 -87 2 58 -47 -51 -23 39 30 -62 -11 54 25 -96 -16 73 14 -98
4006 -98 -33 1 21 -92 -13 79 31 -46 -7 26 55 -65 -61 36 89 -23 -49 21 55 -30 -71 -66 45 -67 -93 -30 66 -9 -61
4035 -61 -46 37 25 -132 -53 -22 97 -35 6 -18 71 -57 -6 64 4 -55 -66 39 80 -92 -44 31 83 -88 -49 12 70
4062 70 -33 -40 66 81 12 -95 -25 59 1 -34 -32 57 -23 -39 -3 86 3 -53 -17 70 9 -66 2 55 27 -43 -28 16 60 -62
4092 -62 -41 4 81 -92 -26 81 83 -44 -44 54 62 3 -36 57 103 -57 -64 11 84 -13 -81 -28 67 -34 -92 17 83 -25 -58
4121 -58 -53 38 -10 -45 17 2 61 -89 -24 55 25 1 -13 28 24 -11 -51 77 86 -57 -99 88 47 41 -76 31 66 -14 -87
4150 -87 -24 94 -4 -6 25 78 24 -45 39 49 10 -52 -85 55 -23 -98 -17 -11 -16 -92 13 33 91 49 -87 60 15 5 -71
$$ packed form
3944b3%M2m1pl9R1J3k0o8K3P7nj10Q3L8j4j15MP2l6mJ1N9j3k8Jl9L9q6M1J17j0
3976E3k4k8lM0o1k1O2K9l9j24J01N5m0q7Q9N6j05mK8O2rr2N1O5k9j21Q0Q9n9j12
4006i8O5L4K0j13P9R2m8p7L9L3K9j20MR7N3j12k6P0L4q5m1NJ11j12k6O3R6p5n2
4035f1J5Q3j2j57P9L1J19j32M1k4Q9j28N1P0o0n9j1J05M1j72M8P5N2j71L9O1N8
4062G0j03pJ06J5o9j07P0Q4n8l5KQ9q0j6L6Q9q3n6L6Q7o1p5O8N3k8p0J5M4M4j22
4092f2K1M5P7j73O6J07Kj27%R8Qn9l9R3M6j60pP5P3r7o8N3R5j01n8J09O6j08l3
4121e8NR1m8l5O2j5N9j50O5P9l0k4j4M1ml5m0J28Rj43m2J87m1oj17J07L5q0p3
4150h7O3J18r8kL1N3n4o9Q4J0l9o2l3J40p8p5Q1Onp6J05K0N8m2j36J47m5j0p6
$$ plain form
4179 -71 31 74 -32 -49 47 64 6 -64 9 61 37 -35 18 36 33 -23 18 -16 -29 -29 -14 42 -70 -21 -24 26 58 -8 -60 4
4209 4 -11 -49 -60 81 20 -34 -2 18 89 -54 -47 -15 31 -36 -78 25 64 19 -64 -6 29 -37 -47 -19 78 10 -116 -39 48
4238 48 43 -54 -2 26 51 -17 -45 -6 51 -19 -51 35 11 -46 -63 -15 37 -29 -53 39 48 -68 -44 -33 -9 -14 -37 -11 31 5 -6
4269 -6 14 27 -9 -26 -37 65 2 -6 14 38 -30 -34 25 -15 57 -42 -17 13 78 -44 -1 -23 11 -55 -55 -19 27 1 -7 -6 64 -8
4301 -8 -41 16 -44 -36 4 -21 -31 62 -5 -25 1 19 -30 12 50 21 12 -44 20 -15 5 30 25 43 -35 -30 12 24 3 -9 -8 -8 12 -69
4335 -69 -2 3 19 -64 -26 12 9 -22 -13 78 -1 44 38 -29 47 61 -44 -57 10 -3 1 44 75 -29 -5 22 46 43 6 49 13 15 -26
4368 -26 -27 31 -12 -25 -20 -19 -13 5 -49 36 2 25 5 25 6 -5 -5 53 9 -25 66 -12 -21 13 -19 -2 50 28 0 35 6 -14 -24
4401 -24 63 39 30 7 -2 -12 8 -14 45 -17 -5 19 -16 34 23 -8 -17 -56 -17 31 17 -29 27 20 17 -21 -46 -11 -35 4 8 4 6 -38
$$ packed form
4179g1J02M3j06j7R6J7n8p0P3N2k4p2N3J8ln6M1l4j3%J5N6j12M9lN0L2o6n2O4
4209Dj5l8j1J41o1n4L2K0P1j43PL2M6o7m2J03L9m5q3N8L5o6j0K8R7o8j26P7Q7
4238D8nr7N2K8K5o8k8L9N7p0l2Q6k4n7j7M8N2o6k4R2Rj16K4J1K4nk3K6M2k6j1
4269fK0J3l6j7j1J02o3qK0K4o8mN9m0P2r9K5L0O5j22M3k2L4o6%L6M6k6qJP0p2
4301hl3N7o0QM0k5j0R3o7k0K6J8m9M2L8k9rn6O4l5K0K5nJ8p8NM2J2k1j2J%K0q1
4335f9O7NJ6q3L8L8ll1RR1p9M5oo7P6J4j05j3O7j3MM3L1j04K4K7K4ll7M3l6Km1
4368b6jN8m3j3NJOJ8n4Q5l4K3k0K0j9j1%N8m4l4R1p8rL4l2J7N2k2k8L5k9k0j0
4401b4Q7k4rk3rj0K0k2N9o2J2K4l5N0j1l1rl9L9M8j4m6N6pll8k5L5k4L9MmKm4
$$ plain form
4435 -38 12 11 -14 19 -32 4 21 -4 -24 4 40 17 -25 -4 10 -65 -66 -14 37 -54 -25 -15 12 -20 -15 -14 -12 22 -1 -39 15 10 19 26
4469 26 10 3 -10 26 12 -17 42 12 1 -2 -11 2 -31 74 28 3 70 13 -4 -20 -6 62 -19 -23 -15 75 -24 -40 -28 -6 -14 -48 -4
4502 -4 -14 0 -53 -15 40 11 31 -48 -12 77 22 64 1 -9 6 -33 -5 45 -12 -25 5 22 64 -34 -7 50 -10 -30 39 99 57
4533 57 -60 -12 26 69 -38 -6 42 31 -31 -44 26 69 -9 -78 -12 45 -74 -54 35 66 12 -20 24 120 28 -83 -16 11
4561 11 -1 -62 -20 99 -12 -85 56 73 8 -6 -46 30 24 -38 -44 46 7 -62 -41 64 60 -20 -37 53 94 2 -63 40 52
4590 52 -48 -32 84 112 -44 -37 36 101 -56 -99 12 92 68 -101 22 98 16 -69 2 101 71 -70 -40 61 16 -102
4616 -102 -52 66 40 -117 -30 120 121 -55 -39 70 43 -49 -101 38 112 -40 -116 46 82 -24 -105 54 59 -42 -133
4641 -133 13 78 36 -69 -29 114 -41 -139 31 195 8 -142 1 83 58 -128 -38 71 59 -137 -76 65 76
$$ packed form
4435c8N0jk5L3n1L6J7k5k0K8L6k3m2K1J4p5jN2N1r1K9J0K7l2NJKL4k3l8N4nRP
4469B6j6pj3L6j4k9N9l0j1lrJ3l3J05m6k5O7n7j7j6J4O8q1mQR0r9j6J2K2ql4M4
4502dj0J4n3L8N5k9K0p9L6Q9n5M2o3j0J5l9K8N0n7j3L0J7M2r8K7N7o0k0O9O0m2
4533E7j17M8L8M3j07L2M8j1o2j3P0M3p8o9O6N7j19K0Q9L1n4l2M4R6r2j11O7K7
4561A1j2o1M2J19j11p3J41J7o5j4m0P6oo2oR0l9o9K1J05mq0j7R0M1r2o5J03J2
4590E2j00J6J16K8j56PP3O5j57m3J11Q0k4j69J23P6q2q5P1R9l0j41L0J01m5j18
4616a02N0J18k6j57Q7J50Jj76J6J09k7r2n2J39P4j52p6J62L6j06q1J59Nj01r1
4641a33J46O5m2j05M0J43j55r8J70J64j87j50J43Q2k5j86R0J09j2j96O1J41J1
$$ plain form
4664 76 -40 -89 84 110 -59 -149 119 101 -27 -87 64 70 -41 -94 14 134 -36 -45 58 162 -25 -90 -10 163
4688 163 -14 -125 18 107 43 -106 -25 136 19 -105 -45 116 -3 -152 -106 99 135 -67 -112 102 50 -81 -101
4711 -101 57 124 -60 -80 63 147 -46 -112 123 111 -71 -102 -13 131 52 -76 17 163 -13 -158 10 182 1
4734 1 -129 -12 106 31 -126 -43 127 39 -118 -72 60 107 -98 -39 93 34 -128 -117 2 72 -81 -109 90 71
4758 71 -37 -119 54 141 -44 -191 25 113 -9 -106 44 107 -10 -146 12 92 8 -108 45 121 56 -123 48
4781 48 150 50 -189 -31 102 17 -118 -163 102 119 -74 -108 35 99 -149 -105 62 70 -87 -148 50 90 -52 -133
4805 -133 16 97 -55 -127 16 34 56 -136 -18 143 -28 -117 71 190 64 -102 -79 128 9 -104 -23 90
4827 90 82 -97 -47 86 78 -119 -54 120 87 -131 -129 65 107 -62 -106 62 161 -75 -152 31 127 -32 -145 81 148
$$ packed form
4664G6j16m9J73K6j69r0K68j8j28o0J51Oj11n3J08J20j70rJ03J04j87o5Q0J73
4688A63j77j11J43Q9o4j49Q1J61j17j24O0J61j19j49M6K05L6k02m5K14n2j31k0
4711a01J58O7j84k0J43Q4j93o6K35j2j82l1Q9J44p9j28R3J46j76j45J68J72j81
4734Aj30J17J18p5j57Q3J70q8j57M6J32M7k05N9J32n9j62J1J19P0j53k8J99j9
4758G1j08q2J73Q7j85j47K16Q8j22r7J50O3j17j36J58Q0q4j16J53P6o5j79J71
4781D8J02j00k39J58J33q5j35m5K65J7j93l4J43O4k48M4J67Qj57o1J98M0j42q1
4805a33J49Q1j52p2J43J8K2j92J18J61j71q9J88J19j26j66K3K07j19j13Q1J13
4827I0qj79N0J33qj97O5J74l3k18KJ94M2j69m4J68R9k36p7J83R6j59j13K26O7
$$ plain form
4852 148 -15 -159 22 181 7 -151 -41 122 6 -102 -36 123 -30 -132 -17 148 -47 -117 -14 71 60
4873 60 -155 -146 45 61 -153 -87 115 26 -84 -103 70 24 -160 -119 1 135 -61 -115 53 119 -10 -88 67 100
4897 100 -31 -100 44 87 27 -99 -5 121 50 -117 3 92 33 -51 -51 161 44 -146 -5 106 62 -94 -122 42
4921 42 98 -62 -79 52 41 -89 -101 22 69 3 -124 72 133 -74 -133 29 138 -6 -143 28 90 -57 -126 41
4945 41 114 18 -63 -39 80 -3 -32 -41 90 -1 -100 -113 104 50 -92 -60 33 98 -109 -91 53 93 -98 -115 63 49 -51
4972 -51 -84 50 95 -2 -129 62 61 -31 -110 35 116 -30 -86 55 62 0 -72 27 124 12 -72 -37 99 31 -74 -6 46
4999 46 40 -49 -101 66 54 -50 -17 35 3 -39 -97 12 41 -92 -84 39 83 -50 -54 87 111 -12 -50 57 39 -1 -29
5026 -29 20 99 -13 3 44 82 0 -79 -16 100 -6 -84 -54 91 -19 -61 -27 45 -1 -101 -14 51 21 -58 -72 17 51
$$ packed form
4852A48j63j44J81J59j74j58J10J63j16j08O6J59j53j02J15J65j95p0J03Q5j1
4873F0k15RJ91J6k14O6K02q9j10j9J73m6j84M1J20J34j96n4J68O6j29p8J55L3
4897A00j31o9J44M3o0j26R4J26p1j67J20Q9n9q4%K12j17j90J41J11m4j56k8J64
4921D2N6j60j7J31j1j30j2J23M7o6j27J96O1k07n9J62J09j44j37J71O2j47o9J67
4945D1P3r6q1K4J19q3k9rJ31r1r9j3K17n4j42L2R3O5k07J8J44M0j91j7J78j4j00
4972e1l3J34M5r7j27J91jr2p9J45Q1j46n6J41Po2p2R9R7j12q4L5J36o8j05O8N2
4999D6oq9n2J67j2j04L3N2l2m2n8J09K9j33QJ23M4j33mJ41K4j23l8J07j8m0k8
5026b9M9P9j12J6M1L8q2p9O3J16j06p8L0J45j10m2L4P2m6j00Q7O5l0p9j4Q9L4
$$ plain form
5053 51 -40 -47 38 40 -32 -48 0 106 5 -55 33 55 7 -86 59 62 -30 -41 25 79 -6 -92 -45 6 -13 -91 -50 -8 -5 -45 -71
5084 -71 45 46 -28 -36 47 15 -79 -51 -11 24 -29 -71 1 28 -14 -20 11 78 -1 -8 21 73 21 -74 23 70 -25 -22 28 71 0 -48
5116 -48 29 46 -40 -29 -1 27 -44 -72 -45 23 42 -105 -43 34 37 -9 -87 49 -22 -3 13 -20 1 -72 -29 8 19 -57 -58 -19
5146 -19 20 -27 -14 66 35 36 -46 8 13 -15 -46 5 16 -28 -73 27 45 -25 -22 -20 56 -43 -5 -34 21 21 -13 -5 -42 -9 -49 -11 -6
5179 -6 12 -14 -47 13 33 15 -39 30 56 54 -6 2 23 -10 -18 -19 29 -26 -3 -36 26 -16 49 7 15 -7 -32 -33 12 2 39 -1 52 13
5213 13 -46 15 9 8 -70 -29 1 72 -13 -61 -15 -6 10 -15 10 41 6 57 3 48 -15 21 1 15 37 1 4 -2 15 -8 -18 30 31
5246 31 -36 -30 16 -19 16 -18 13 31 -2 -17 -49 7 -42 -36 30 -46 14 49 -34 -9 -22 0 45 13 54 -43 52 69 24 14 -8
5277 -8 -1 10 26 36 61 26 -9 -2 -25 8 -60 21 -10 5 24 -65 6 -4 36 -48 -31 -5 -48 -77 29 -22 8 53 -13 -28 -34 -3
$$ packed form
5053E1r1pQ5Kp2j6M8J06j01o0Q8K2m8r3J45Lr2j1O6N4q5q6M7N1j9p8M1M2Lm0k6
5084g1J16Jp4qQ3l2r4K8M0L5n3m2P2K7m2oL1O7p9pK9N2n2r5R7M7r5LN0M3p1m8
5116d8P7J7q6J1K8K8p1k8K7O8J9j47O2P7Lm6p8J36p1J9J6l3K1p3M3L7J1p6jL9
5146a9L9m7J3Q0l1Jq2N4Nk8l1N1J1m4m5J00J8p0LKP6r9L8k9N5%l4Ql7L3m0L8N
5179fJ8k6l3O0K0j8n4O9K6ko0QK1l3qjM8n5K3l3O2m2O5m2Qk2k5jM5j0L7m0N3l9
5213A3n9O1ojp8M1L0P1q5m8M6RJ6k5K5L1l5N1n4M5o3L6k0J4K2l6LoJ7k3j0M8J
5246C1o7OM6l5L5l4L1J8l3j5l2N6m9OO6p6O0L5q3K5j3K2M5l2M1r7R5J7m5j0k2
5277hPJ1J6J0K5l5l5Pk3L3o8Q1l1J5J9q9P1j0M0q4J7K6m3k9J06n1L0M5o6j5oL1
$$ plain form
5309 -3 1 -17 30 30 -23 38 23 14 -50 -19 3 -20 -31 -3 27 31 -37 -10 6 -35 -97 -5 -3 -2 -21 -29 -15 3 -12 -10 -5 -2 -24 3 -22 -21
5345 -21 -3 -25 44 -11 -55 -41 -10 5 -39 -23 -12 -34 -48 41 22 30 -19 -7 25 71 -15 25 1 39 -2 13 -40 27 8 28 31
5376 31 13 21 44 -36 -22 -26 -11 -22 -15 -66 24 -37 -20 16 -8 52 -12 11 8 -14 3 9 -7 -26 10 22 -23 8 18 114 33 -8 17
5409 17 41 48 -17 -17 7 -17 -9 44 -28 31 -1 22 -10 -14 17 -12 -10 12 -20 28 33 4 1 -14 15 55 2 -34 31 -33 -22 9 23 21
5443 21 -30 -11 -28 16 11 27 18 -30 33 6 7 -37 23 10 20 -50 -3 30 0 -24 -9 6 18 -13 -31 -30 49 -41 8 2 44 10 22
5476 22 -12 -12 3 -33 9 -21 16 -1 13 56 13 -1 31 -1 16 75 20 5 -20 47 50 6 -47 -7 46 2 25 15 18 -62 61
5507 61 -12 -19 -54 -41 -32 -39 -49 -32 15 43 -29 1 -12 18 -16 -32 -15 -13 -3 -15 42 -29 -6 -65 42 23 -20 -72 -19 -69 25 7
5539 7 -47 0 1 63 13 21 -3 -2 -52 16 -7 -50 -52 -20 35 -15 5 -52 -8 20 -38 -47 11 11 -40 66 29 8 9 22 4 57 -19 -22
$$ packed form
5309cMj8M7%n3O1j5ro4L1K2k3j1K8L0Mo8K7J6m1o2R2KJj9qJ4J8j5KNLk2K7k5J
5345b1J8k2O9n5m4J4L1J5m4J6J1k2j4Q9j9Qm9J2L2M6q6M0k4L8m1J5n3O7j9K0L
5376C1j8QK3q0J4mJ5j1Pn1R0o1J7L6k4O0o4K3lk2J7Oj6j9L6J2m5L1J0R6q1m1K5
5409A7K4Po5%K4k4QN3p2N9l2K3l2mL1k9KK2l2M8Nk9lj5K9M0n3l6O5o4J1L1J4k
5443B1n1J9j7M4nJ6rm8O3k7Jm4O0j3J0p0M7L3l0k4J5J5J2l1j8JP9r0M9oM2l4J2
5476B2l4%J5l6M2l0L7j7J4M3m3j4L2l2J7N9n5j5k5O7Lm4n3M0N3m4K3j0Lq0J23
5507F1p3pl5J3Rpj0J7M7K8p2L0j3L0l4j6J7KJ0j2N7p1K3n9J07j9m3n2N3n0R4j8
5539Gn4M7JO2n0Qk4Jn0O8k3m3kL2N5n0K0n7M4K8n8rN8%n1J06l7k1JJ3j8N3p6l
$$ plain form
5573 -22 7 -26 -22 64 51 7 1 -47 -26 12 -10 -9 -8 -15 -8 -47 -3 3 -20 -10 -13 37 -15 -3 -40 -62 -3 -28 -10 30 5 29 -56 7
5607 7 2 3 15 48 -27 8 9 16 -18 24 6 63 -39 21 57 11 8 -7 7 53 29 -17 -39 -30 19 -2 -3 8 -35 -3 -7 -44 -1 -47
5641 -47 -5 15 7 -11 41 40 4 39 4 77 31 -5 37 15 37 2 -11 54 0 -14 -11 -14 -28 -19 2 36 -13 -30 -82 14 -3 25 20
5674 20 14 15 -29 -14 4 -8 -57 -31 -48 -8 21 -2 10 13 18 31 -18 23 9 8 -2 24 25 30 6 -22 15 39 -26 -16 5 -24 -14 -29
$$ packed form
5573b2K9l3MQ6j3m4om8K1L8k2JJpPl9M4Ok3J0lN0n2J2l7k2N9k5J8M0k5K4q5O3
5607GnJJ2L3p5L5JPl4M2j8N7j02O0L6m6lj5J4M6k4m6k2RM9k1jJ1m3L2ml7M3m6
5641d7M2K0qj8N2jl6L5l5P3m6l6M2k2K2l5j3O5n4j4Llj4RK1L4m9j7n2R6j7K8n
5674B0oJm4J5J8j2m9K6j7M0K9k3J2LNJ3m9M1j4jj0K6JNk4k8L7K4o5J0K1k9J0j5
$$ [...]
8191C1
##END NTUPLES=NMR FID
##END=
