##TITLE=1H_75C4
 aceton-d6
 8 sc, 
 23.11.2023
##JCAMPDX= 6.0         $$ Bruker NMR JCAMP-DX V2.0
##DATA TYPE= NMR FID
##DATA CLASS= NTUPLES
##ORIGIN= UXNMR, Bruker Analytische Messtechnik GmbH
##OWNER= root
$$ XWIN-NMR		Version 3.5
$$ Thu Nov 23 15:21:25 2023 Russian Standard Time (UT+4h)  she@DPX200
##.OBSERVE FREQUENCY= 200.1313
##.OBSERVE NUCLEUS= ^1H
##.DELAY= (6, 6)
##.ACQUISITION MODE= SIMULTANEOUS
##.ACQUISITION SCHEME= undefined
##.AVERAGES= 8
##.DIGITISER RES= 18
##SPECTROMETER/DATA SYSTEM= spect
##.PULSE SEQUENCE= zg30
##.SOLVENT NAME= DMSO
##.SHIFT REFERENCE= (INTERNAL, DMSO, 0, 15.7039)
##AUDIT TRAIL= $$ (NUMBER, WHEN, WHO, WHERE, WHAT)
$$ ##TITLE= Audit trail, XWIN-NMR		Version 3.5
$$ ##JCAMPDX= 5.01
$$ ##ORIGIN= Bruker BioSpin GmbH
$$ ##OWNER= she
$$ F:/spectra/data/she/nmr/H-F/1/audita.txt
$$ ##AUDIT TRAIL=  $$ (NUMBER, WHEN, WHO, WHERE, WHAT)
(   1,<2023-11-23 15:20:17.31 +0400>,<she>,<DPX200>,
      <created by zg, POWCHK disabled, PULCHK disabled
       configuration hash MD5:
       00 E9 B6 7A A2 85 ED C7 34 08 36 98 17 FE 4E 26
       data hash MD5: 16K
       99 8F 29 C3 CC BE 9F 65 03 59 F6 E1 CC FC 87 3D>)
$$ ##END=
$$ 
$$ hash MD5
$$ 6C B8 1F 12 1E 56 90 19 1E FA 1F 34 3D BE 43 9B
##$RELAX= 
##$RELAX= 
##$RELAX= 
##$RELAX= 
##$RELAX= 
##$RELAX= 
$$ Bruker specific parameters
$$ --------------------------
##$DU= <F:/spectra>
##$EXPNO= 1
##$NAME= <H-F>
##$PROCNO= 1
##$TYPE= <nmr>
##$USER= <she>
##$AMP= (0..31)
100 100 100 100 100 100 100 100 100 100 100 100 100 100 100 100 100 100 
100 100 100 100 100 100 100 100 100 100 100 100 100 100 
##$AQSEQ= 0
##$AQ_mod= 1
##$AUNM= <au_zg>
##$AUTOPOS= <>
##$BF1= 200.13
##$BF2= 200.13
##$BF3= 200.13
##$BF4= 200.13
##$BF5= 200.13
##$BF6= 200.13
##$BF7= 200.13
##$BF8= 200.13
##$BYTORDA= 1
##$CFDGTYP= 0
##$CFRGTYP= 5
##$CHEMSTR= <none>
##$CNST= (0..31)
1 1 145 1 1 1 1 1 1 1 1 1 1 1 1 1 1 1 1 1 1 1 1 1 1 1 1 1 1 1 1 1 
##$CPDPRG= <>
##$CPDPRG1= <>
##$CPDPRG2= <>
##$CPDPRG3= <>
##$CPDPRG4= <mlev>
##$CPDPRG5= <mlev>
##$CPDPRG6= <mlev>
##$CPDPRG7= <mlev>
##$CPDPRG8= <mlev>
##$CPDPRGB= <>
##$CPDPRGT= <>
##$D= (0..31)
0 1.2 0 0 0 0 0 0 0 0.06 0 0.03 0 0 0 0 0.0002 0 0 0 0 0 0 0 0 0 0 0 0 
0 0 0 
##$DATE= 1700738416
##$DBL= (0..7)
120 120 120 120 120 120 120 120 
##$DBP= (0..7)
150 150 150 150 150 150 150 150 
##$DBP07= 0
##$DBPNAM0= <>
##$DBPNAM1= <>
##$DBPNAM2= <>
##$DBPNAM3= <>
##$DBPNAM4= <>
##$DBPNAM5= <>
##$DBPNAM6= <>
##$DBPNAM7= <>
##$DBPOAL= (0..7)
0.5 0.5 0.5 0.5 0.5 0.5 0.5 0.5 
##$DBPOFFS= (0..7)
0 0 0 0 0 0 0 0 
##$DE= 6
##$DECBNUC= <off>
##$DECIM= 32
##$DECNUC= <off>
##$DECSTAT= 4
##$DIGMOD= 1
##$DIGTYP= 9
##$DL= (0..7)
0 120 120 120 120 120 120 120 
##$DP= (0..7)
150 150 150 150 150 150 150 150 
##$DP07= 0
##$DPNAME0= <>
##$DPNAME1= <>
##$DPNAME2= <>
##$DPNAME3= <>
##$DPNAME4= <>
##$DPNAME5= <>
##$DPNAME6= <>
##$DPNAME7= <>
##$DPOAL= (0..7)
0.5 0.5 0.5 0.5 0.5 0.5 0.5 0.5 
##$DPOFFS= (0..7)
0 0 0 0 0 0 0 0 
##$DQDMODE= 0
##$DR= 18
##$DS= 0
##$DSLIST= <SSSSSSSSSSSSSSS>
$$ [...]
##$SUBNAM2= <"">
##$SUBNAM3= <"">
##$SUBNAM4= <"">
##$SUBNAM5= <"">
##$SUBNAM6= <"">
##$SUBNAM7= <"">
##$SUBNAM8= <"">
##$SUBNAM9= <"">
##$SW= 18.0517328524113
##$SWIBOX= (0..15)
0 0 2 0 0 0 0 0 0 0 0 0 0 0 0 0 
##$SW_h= 3612.71676300578
##$TD= 16384
##$TD0= 1
##$TE= 0
##$TE2= 300
##$TE3= 300
##$TEG= 300
##$TL= (0..7)
0 120 120 120 120 120 120 120 
##$TP= (0..7)
150 150 150 150 150 150 150 150 
##$TP07= 0
##$TPNAME0= <>
##$TPNAME1= <>
##$TPNAME2= <>
##$TPNAME3= <>
##$TPNAME4= <>
##$TPNAME5= <>
##$TPNAME6= <>
##$TPNAME7= <>
##$TPOAL= (0..7)
0.5 0.5 0.5 0.5 0.5 0.5 0.5 0.5 
##$TPOFFS= (0..7)
0 0 0 0 0 0 0 0 
##$TUNHIN= 0
##$TUNHOUT= 0
##$TUNXOUT= 0
##$USERA1= <user>
##$USERA2= <user>
##$USERA3= <user>
##$USERA4= <user>
##$USERA5= <user>
##$V9= 5
##$VALIST= <valist>
##$VCLIST= <CCCCCCCCCCCCCCC>
##$VD= 0
##$VDLIST= <DDDDDDDDDDDDDDD>
##$VPLIST= <PPPPPPPPPPPPPPP>
##$VTLIST= <TTTTTTTTTTTTTTT>
##$WBST= 1024
##$WBSW= 4
##$XGAIN= (0..3)
0 0 0 0 
##$XL= 0
##$YL= 0
##$YMAX_a= 48017
##$YMIN_a= -42473
##$ZGOPTNS= <>
##$ZL1= 120
##$ZL2= 120
##$ZL3= 120
##$ZL4= 120
##$ABSF1= 10
##$ABSF2= 0
##$ABSG= 5
##$ABSL= 3
##$ALPHA= 0
##$AQORDER= 0
##$ASSFAC= 0
##$ASSFACI= 0
##$ASSFACX= 0
##$ASSWID= 0
##$AUNMP= <proc_1d>
##$AZFE= 0.1
##$AZFW= 0.1
##$BCFW= 1
##$BC_mod= 2
##$BYTORDP= 1
##$COROFFS= 0
##$CY= 11.3945322036743
##$DATMOD= 1
##$DC= 2
##$DFILT= <>
##$DTYPP= 0
##$F1P= 15.7292609196834
##$F2P= 12.9074282941183
##$FCOR= 0.5
##$FTSIZE= 0
##$FT_mod= 4
##$GAMMA= 1
##$GB= 0.15
##$INTBC= 1
##$INTSCL= 1
##$ISEN= 128
##$LB= 0.24
##$LEV0= 0
##$LPBIN= 0
##$MAXI= 10000
##$MC2= 0
##$MEAN= 0
##$ME_mod= 0
##$MI= 1.114404
##$NCOEF= 0
##$NC_proc= 0
##$NLEV= 6
##$NOISF1= 3.799351
##$NOISF2= 2.8
##$NSP= 1
##$NTH_PI= 0
##$NZP= 0
##$OFFSET= 15.70392
##$PC= 1
##$PHC0= -24029.7
##$PHC1= 8.85269
##$PH_mod= 1
##$PKNL= yes
##$PPARMOD= 0
##$PSCAL= 0
##$PSIGN= 0
##$REVERSE= no
##$SF= 200.130013532006
##$SI= 16384
##$SIGF1= 3
##$SIGF2= 2
##$SINO= 400
##$SIOLD= 16384
##$SREGLST= <1H.CDCl3>
##$SSB= 0
##$STSI= 0
##$STSR= 0
##$SW_p= 3612.71676300578
##$SYMM= 0
##$S_DEV= 0
##$TDeff= 0
##$TDoff= 0
##$TI= <>
##$TILT= no
##$TM1= 0
##$TM2= 0
##$TOPLEV= 0
##$USERP1= <user>
##$USERP2= <user>
##$USERP3= <user>
##$USERP4= <user>
##$USERP5= <user>
##$WDW= 1
##$XDIM= 8192
##$YMAX_p= 0
##$YMIN_p= 0
$$ End of Bruker specific parameters
$$ ---------------------------------
##NTUPLES= NMR FID
##VAR_NAME=  TIME,          FID/REAL,        FID/IMAG
##SYMBOL=    X,             R,               I
##VAR_TYPE=  INDEPENDENT,   DEPENDENT,       DEPENDENT
##VAR_FORM=  AFFN,          ASDF,            ASDF
##VAR_DIM=   8192,          8192,            8192
##UNITS=     SECONDS,       ARBITRARY UNITS, ARBITRARY UNITS
##FACTOR=    0.0002768,     1,               1
##FIRST=     0,             0,               0
##LAST=      2.2672688,     0,               0
##MIN=       0,             -42473,          0
##MAX=       2.2672688,     48017,           0
$$ Real data points
##PAGE= N=1
##DATA TABLE= (X++(R..R)), XYDATA
$$ [...]
558C60j81m53j1j43K45j9j44P38r7q31M67M69j61M6J6j00m3m90J94K41l09J37
580f9m0k22L85k33l21N80J46r7J64j45J03k46k09N41J2m93Q3m05o9M73j02R1L03
603B30k50p2%M5M50k36j66L58l34k95L13j75J50R6m02J94M0k74K03J62J21J95
625C53l12n3J59k67O3K29k01K62l19l82M83j1j59K62oo3j05l45M91Q2k28K13k
648A44k11J46l59O6O21k89k02J48n1o0j16N2N20l69l98L40o4q0K33j21K63R3m56
671a50O5J66kL7k55K33K50p21m1N64j54k17K03O1N2l92jN62M7q7j13k27L10o9
695A21o16N04M60o30j94J59K37n3l12M17M02n78o5K32r1K41j91k05N14j54o12
716d14J36K90J71l45j87O52n6p59M28M56j47j26k08J29K18n14l6M40R3j63l38
$$ y = [360, 179, -274, -285, -428, -183, -202, -346, 392, 295, -536, -69, 400, 239, 285, 301, 201, 158, -332, -138, 103, -206, -69, -109, -331, 54, -179, -500, 80, 226, 129, 293, 148, 251, 5, -204, 337, 349, -144, -61, -466, -535, -62, -164, -73, 230, -20, -92, -92, -47, 403, 167, 1, 359, 25, -270, 43, -132, 18, 114, -288, -94, -54, -328, -125, 37, 158, 353, 41, -12, 147, -120, -57, 172, -29, 233, -86, -468, 15, 4, -155, 107, 101, 38, -67, -412, 79, 161, -67, 146, 144, -67, 79, -280, -214, 407, 118, -84, 64, 13, -47, -163, -111, 409, 40, -358, -18, -82, -162, 71, -50, 213, 306, -150, -85, 81, 79, 116, -139, 94, 344, -377, -418, 146, -8, -225, -22, 39, 91, -301, -302, 260, 307, 220, 107, -120, 190, 121, -495, 9, 469, -161, -355, -196, 41, -12, -324, 93, 495, -83, -148, 84, -7, 234, 43, -162, 352, 198, -414, -278, 12, 183, -162, -349, 303, 247, -512, -84, 372, 225, 99, -109, 20, 238, -276, -312, 128, 221, 58, -280]
737b80N0N70m11l40P29J18m54j74P6L80j69m21M36J74m26j33O1K83K46m92L4N28
759C85l44l16J16L19J89n42j09O20k24n65L28K87J42k56l93N36lm41K03L53Lk47
781D1m76L25L94n32J2M29r7j47k62J74N75l52k75M58n2l06j83R0N24j31n42K71
803f2K10l27j05O7N14N0o42J17M61k19k64J82K40Q2n49k15O18p5l32J34J93K11
825B89m16l89O33K44n10J07K20l5j13m42M41M24n17j83L17J8j81j64J60N93l63
846A33m09L60M4j86j51P8N31j53o72K58L44q7j98k4M03L4p20J26N68k45r5m1K10
869A08J59n12j48O23K7k80j9R0K35l30l12N70J86m86j80J30J54o4l30L82L99m30
891b8k68K50J87N0l30J29M64l30n37K95K69l5l12p9M69j13n33K88L94p5q5k08
$$ y = [-280, -230, 340, -71, -411, 318, 436, -18, -192, -116, 264, 95, -326, 110, 284, -142, -275, -214, 69, 315, -177, -143, 385, 41, -275, -159, 160, 349, -193, -302, 318, 94, -471, -143, 144, 286, 30, -363, 173, 170, -271, -68, 285, 288, 41, -435, -110, 284, -248, -236, 193, 96, -51, -313, -139, 436, 84, -191, 267, 215, -91, -274, -184, 340, 209, -333, -62, 148, -179, -284, -217, 297, 347, -295, -178, 283, 64, -200, -18, 222, 304, -245, -460, 158, 83, -249, -115, 78, 289, -127, -516, 117, 361, -149, -42, 178, 143, 30, -412, 29, 453, -64, -247, 70, 88, -93, -257, -97, 496, 133, -276, 84, 128, -58, -209, -131, 400, 247, -425, -167, 177, 90, -108, -132, 271, 305, -415, -289, 279, 34, -61, -102, 108, 267, -245, -393, 230, 257, -23, -42, 48, 283, -47, -359, 211, 397, -89, -269, -139, 15, -49, -379, 3, 402, -28, -296, -46, 141, 191, -139, -10, 454, 124, -413, -118, 151, 116, -196, -275, 194, 81, -452, -164, 230, 155, 70, -138]
913a38L80J49o37O8M28K5l41k21K13K53m76q2N93k2k72r7O4M27k33l70M83J56
935C50m11k21M2L37M5n46L63L02m31j40K79J47J24l31j8M61k77l05K03J19J96
956B88l52k58N51j49m72K62L52k6l08j94M15J38m11J76J64n0r6l10P9M44k90k46
978b93M62J7k59k24J62M26l02l05M98j07k40N5J1L26j2l93J35K27k86k3Q1K21
1000A77J18m83r7N00j79k91K16J07N5k72q4L64m1k37J92N3J9p0l59K50L35k93
1022b0q0J58p2n2k47K45M02l40j39J95n5L7o7p2L81j24m48L07Q8j16k5pL06j33
1046A22l46J53K34k12R9r4O2K15m14m7L64m4j70oK2J25j60q4L34J8k06M8j00J61
1070G4l5l02K41K43k61m9K3L9J06j99J90J64k28j52J09m9K27j13r2J41n0j88J00
$$ y = [-138, 242, 391, -246, -178, 250, 275, -66, -287, -74, 179, -297, -379, 214, 192, -80, -177, -113, 314, 81, -289, 194, 350, -61, -282, -240, 97, 142, -404, -41, 261, -170, -310, -31, 116, 240, -91, -109, 352, 75, -230, -27, 92, 288, -64, -322, 229, 80, -392, -130, 222, 196, -112, -306, 109, 247, -164, 12, 176, 126, 30, -280, -201, 243, -47, -293, 169, 186, -73, -297, -135, 291, -11, -316, 182, 75, -165, -110, -99, 227, 215, -178, -43, 184, -102, -125, -44, 177, 295, -188, -285, 215, 36, -255, -39, 68, 123, -149, -233, 131, 90, -147, 45, 98, 117, 47, -312, -62, 273, -20, -100, 58, -14, -66, -313, -68, 334, -6, -145, 50, -5, 32, -35, -107, 274, 150, -298, 9, 97, -19, -44, -51, 255, 122, -224, -71, 163, -49, 50, -44, 18, 233, -181, -228, 136, 92, -78, -84, -62, 63, -97, -181, 153, 171, -35, 13, -87, 74, 39, -263, -22, 221, -40, -89, -66, -27, 79, -120, 70, 234, 6, -146, -37, -86, 141, 28, -64, 77, 27, -161, -61]
1093f1O4O8l7k33K43O5l58K42J09j00J06j46n9J34j68N8J11j0P4j65j54K83Kj78
1117a10K67J8k20M0n5R3J4p9J64j52j38J51j42l0L41o9k09K30p8j09M3M0J84k04
1141a0r1K36j98j09K18o0J0J22k86L7J48o8J47j09N4J71l66Q2K66k20k3J42j55
1164f2M8jj01J82j4J2N8j98P1J10l06K38J95k83J0R9j52P6n7J10M4j63l7J20o2
1189f3J48Lk19K23m8k93J75J59n2j0m9J07Ql23K06N9o7J51j56n6J48j34n2J90
1213E5Ln4j6j11K28q6j60L25j9j96M0j01J43l1j64J63Q9j94ojL8K49l06L9K77
1238B04k77n4J96l4R8j18j17J21k1j48J97n1O1o4k50L07P2k36R5J56n9k0k37J42
1262c7K20k87l4K44m1p4j94Q5K96j75j71K81m7m5j06rK66J2l33Q9J96k50J1N9
$$ y = [-61, 3, 71, 34, -199, 44, 109, -249, -7, 102, 2, 108, -38, -97, 37, -131, -73, 38, 28, 102, -63, -217, 66, 68, -110, 157, 175, -45, -5, -60, 33, 47, -32, 132, -20, -158, -7, -149, -179, 162, 93, -116, 114, 36, -73, -30, 10, 194, -10, -101, 135, -63, -172, 46, -14, -4, 118, -168, -131, 17, -51, 96, -13, 41, 212, -154, -72, 194, -26, -49, 93, -62, -14, -15, -116, 66, 52, 64, 122, -76, -5, 105, -201, 37, 232, -51, -41, 58, -94, -18, -75, 35, 79, -84, -121, -1, -63, 85, 88, -131, 92, 44, -249, -74, 85, 33, 23, -26, 81, 89, -234, -28, 31, -36, 115, -41, -97, 51, -83, -135, 55, 58, 4, -12, -123, 105, 19, -141, 184, 165, -31, 9, -92, 51, 20, -144, 19, 108, -86, -92, -93, -55, 194, -112, -73, 204, -73, -127, 69, 35, 133, 15, -102, 19, -2, -150, 47, -4, 57, -7, -257, 50, 122, -114, -19, 137, 78, 58, -179, -37, 183, -104, -138, 106, 65, -9, -203, -118, 178, 3, -168, 113, 66, 21, -85, -94, 172, 184, -149, -60, 136, -114, -103, -44]
1286d4J52L3l15M1L10j72j23J65O3O0k84j26L89m2k76J06J57L2k32j95L75J66
1308B40l63LK37Kj55k31K44L76m17j56L27J8j02k80J74M31k85k97K60J87j81j83
1330a51J2M56j48n79L07L19j83j96K3L52N7n77J01M73r3l05l1K68J76n04j38N32
1352A71J18m67j5K48K37m43k46N30K93n30j92K64K83k01m34L64M73m84l87L95
1372b3L16k38m02K46N80l48n70L63M06j24m92M0O35j83o29J91N81n6n28p7N34
1393B22J67p48q9P93M7o26j70N27K64o18l00P69K45o02k86L49N07m25n17N45M48
1414E02n25n16M52N79l23p28M89O27m80n65K45O68m3q16J49Q09k11q26K10P38
1434D35lq21j49R23N3r10mQ37Q3o98l20P56M32q60l28P97K76o75m43N87P09p50
$$ y = [-44, 108, 141, -174, -133, 177, 5, -118, 47, 110, 170, -114, -240, 149, 107, -169, -63, 94, 126, -106, -301, 74, 240, -123, -120, 117, 119, -36, -267, -23, 353, -64, -220, 107, 125, 23, -257, -83, 348, 63, -234, 26, 213, 32, -151, -139, 317, 169, -410, -103, 216, 33, -163, -140, 212, 269, -308, -207, 266, 173, -132, -163, 105, 281, -223, -361, 171, 289, -178, -193, 55, 292, -151, -397, 133, 426, -104, -296, -32, 251, 50, -384, -20, 453, -31, -418, -23, 293, 55, -347, -101, 479, 131, -439, -76, 330, 206, -286, -246, 389, 206, -423, -232, 349, 293, -235, -312, 222, 389, -359, -448, 345, 392, -234, -404, 123, 387, -231, -531, 238, 483, -119, -405, -56, 451, 26, -491, 54, 502, -23, -539, -87, 492, 169, -559, -70, 557, 77, -488, -243, 425, 382, -434, -285, 524, 313, -513, -303, 435, 432, -389, -538, 385, 438, -472, -476, 361, 444, -254, -574, 182, 614, -246, -574, 223, 499, -176, -619, -32, 677, -73]
1456g3n98P93N15o80n81M59Q47m69q62N04P63m17p42K59Q86j21j152L07R91l25
1476C04q26J32Q72Q3j027k20J091J19r43q5Q35L33r39n07J128L40r68l10P87M58
1496F57p97o61Q84P26q65o92P67O54o12q38O35J019o82r61N91Q66l62j042L41
1515c72J157l02j274L67J058k11r17k9J103N3j207j30J180J78j034l24J049M54
1533G99j159n02J203M21j012m34P73O68q66q15R93Q23q66p98O26R77o55j041P06
1552a59J153p56j054N14J100m00j190L62J248m08j181K96J091k3j118j48J274
1569F01J20j373n8J204K30j092m67J187M46j255m08J212M92j016o83R01Q71r61
1587d9q83R83Q68q60r54P05J126p05j162P51J044o44j096M55J247l56j328L96
$$ y = [-73, -671, 122, 637, -43, -624, -165, 682, 213, -649, -145, 618, 201, -541, -282, 604, 483, -669, -362, 629, 304, -522, -390, 482, 565, -462, -682, 409, 528, -415, -500, 335, 668, -271, -778, 350, 690, -278, -588, 199, 657, -140, -801, 83, 809, -56, -748, 19, 673, 61, -777, -142, 877, 195, -766, -175, 691, 329, -713, -372, 785, 483, -791, -424, 634, 423, -494, -523, 580, 633, -574, -704, 476, 654, -380, -704, 345, 799, -360, -862, 341, 762, -250, -684, 89, 757, -109, -924, 69, 892, 26, -772, -146, 831, 176, -865, -159, 994, 238, -816, -302, 798, 398, -792, -430, 818, 410, -771, -475, 616, 593, -525, -673, 601, 721, -652, -710, 494, 724, -368, -835, 352, 798, -457, -865, 347, 839, -177, -860, 41, 912, -49, -932, 51, 919, 59, -895, -190, 936, 231, -931, -180, 864, 220, -876, -421, 826, 470, -858, -462]
1605d62J228k91j187N2J237J92j409l7J281N7j323j22J263L49j272m78J336L76
1623G90j206l65J003O68r88q34R67R32j012q65R35R50q42j086P34J139p34j072
1641h86O70J026l78j234L17J307k67j317L16J150j96j154j7J350K6j342j26J293
1659E38J44j169k28J100M66j272m28J157M94j083n73J026P69j076q52J026Q83
1676I22r14q32Q08Q64o93j113P34J124o20j076M45J118l54j230L73J264l21j198
1694f99J75J104jj219m9J299J36j302j15J092K93j053m29J132M67j227m09J078
1712B73N28q76p71J005P59j020p60Q63Q77p66q95N98J051o43j105O71R66m51j007
1731g03L27J080k61j166K79J182l15j025N3J049J06j204%J167Mj079j88J012L84
$$ y = [-462, 766, 475, -712, -660, 577, 769, -640, -677, 604, 661, -662, -784, 479, 828, -444, -922, 414, 790, -416, -781, 222, 890, -98, -932, 35, 967, -45, -910, 25, 975, 133, -953, -219, 920, 186, -886, -216, 810, 432, -802, -485, 822, 555, -762, -446, 704, 508, -646, -663, 687, 713, -629, -755, 538, 682, -487, -715, 385, 851, -421, -849, 308, 802, -281, -854, 172, 941, -135, -987, 39, 922, 8, -824, -16, 848, 155, -958, -224, 900, 280, -796, -351, 767, 413, -817, -444, 820, 499, -699, -524, 580, 579, -640, -689, 610, 746, -556, -671, 421, 714, -339, -768, 364, 831, -396, -805, 273, 801, -75, -846, 159, 918, -102, -862, 1, 878, 112, -783, -185, 866, 223, -882, -211, 755, 304, -703, -376, 704, 443, -723, -444, 738, 423, -602, -549, 500, 606, -598, -598, 569, 573, -506, -694, 318, 702]
1750G02j057m15J102M18j022m23R60M75p74p47P98P31p89p16P15P86n70r52N94
1769a84R49o21q94N63Q39l17r86K57J032k74r71K42R39j42r07q7J051Rr59q5R69
1790D23J05r25k18R05L24q92l53Q84L60q27m65P31O15p29o04P43N32n96o41N86
1810d2P55n67q21M93Q05m35p50L82O99k09q64K06Q61k19q04J58P29nq75rR75K3
1832D86r11n9Q25J08p07l08Q75K56q48k27P24K75o26m19O45N66p69m86O00N12
1852E12m74n38M15O51m90o34M65N97l43o45K95O51k44p19K18P34j47o09o4O95
1872C26l5p12M9P59j4o48j20O08K26o88k82Q34J13o55j72M92L37m77m24N64L31
1893D12n00l39M25M33l23n44L76N28m33m56L40M34j99n67J80O57k92n16K02M65
$$ y = [702, -355, -770, 332, 750, -272, -695, 265, 740, -34, -781, 17, 748, -41, -757, -42, 744, 174, -778, -184, 765, 144, -750, -187, 652, 335, -651, -394, 638, 364, -607, -365, 574, 432, -475, -562, 489, 498, -461, -546, 423, 528, -397, -615, 290, 614, -278, -631, 253, 613, -214, -679, 52, 667, -62, -666, 77, 609, 13, -628, -42, 713, 146, -675, -182, 623, 188, -562, -180, 519, 310, -554, -348, 513, 294, -510, -352, 377, 372, -503, -512, 463, 486, -425, -484, 341, 449, -258, -566, 309, 565, -283, -510, 214, 489, -137, -556, 89, 655, -114, -600, 0, 512, 38, -500, -85, 566, 76, -558, -93, 504, 161, -484, -189, 462, 218, -501, -283, 451, 304, -305, -369, 326, 291, -421, -372, 387, 373, -275, -395, 213, 439, -249, -531, 303, 416, -239, -411, 81, 418, -59, -483, 81, 412, -88, -427, -2, 431, 108, -436, -60, 468, 35, -421, -81, 353, 154, -413, -233, 424, 132, -384, -182, 283]
1913B83o3m54o7N44O1n82l8O24k8m88j47M65K14m97j58N64J08m83j84L67L42n01
1935a18k37L90K97l73k48K65M03k69m40L40K85k85l11K20M00k08m66J90M68j74
1955A29l20K3L45N8m99k5N35p6l87M0K99Q6l91j08M79N7m00j6L28J05k98k15K88
1978C7K72l39k35L20J25j99k48K60L32k55l41K07K44k05j88J01L34j22l46J44
1998a02K33l8k93O6L02J6l53jL34l5k08p7K52R6l35o7L12Q7k95OJ44J64k59j75
2022b26K58J60k47j09J47J63j00k21J48K50k52j26J35J14l9k27J26J54o3k01O2
2043i4J57N1j79m5K44l0k94Q4K23p2j11n7J70M9j74m7K52m7q2r7Q4K09k36j24
2067a66K49K1j04j19O2J87j01k04J38J27j36m4K6J01qj80J20J58j02j09N0L7J34
$$ y = [283, 220, -234, -301, 243, 304, -278, -316, 308, 280, -208, -355, 110, 324, -173, -331, 233, 341, -142, -326, 41, 383, -118, -355, 35, 332, -41, -289, -24, 379, 110, -330, 10, 295, 10, -301, -81, 319, 111, -355, -165, 303, 129, -191, -168, 177, 235, -264, -289, 246, 170, -217, -177, 122, 208, -183, -291, 188, 245, -155, -171, 157, 262, -36, -251, 37, 309, -30, -265, 55, 180, -19, -267, -7, 325, 70, -271, -64, 180, -25, -213, -112, 222, 100, -246, -102, 131, 93, -200, -134, 168, 184, -169, -170, 164, 129, -79, -156, 96, 192, -143, -210, 102, 189, -106, -100, 44, 208, -51, -226, 32, 192, -55, -164, -17, 146, 46, -175, -27, 223, -29, -155, -20, 94, 55, -172, -46, 108, 45, -156, -94, 63, 114, -65, -110, 134, 104, -190, -106, 117, 45, -66, -123, 47, 96, -78, -125, 127, 80, -2, -99, -15, 194, -42, -166, 83, 104, 0, -119, -57, 130, 29, -175, -37, 90, -46, -90, -64, 37, 29, -151, -31, 127, 25, -84, -34, 3, 137]
2090A37j58n0J58n4r4KM8O6m5j26J35R9k13N5Q0K4j6j92J72J22k28K2N5OKo3N
2117e1O3n8nP1K7k8j01pK03o9j07O8L1pq8K9R7j4j09L6P7m2k1qN8Jj00JJ02no9
2148b5O2K9lq0p6J72n8j7L2o8oJ08j41M1J15q0l2J8L9J5j68J03N0j5n6N2Nn2O8
2177C2q4Q0J5r9K8L7j2P0n5L6J7p2rO2l2L4r8K5N7om4K6k9M0J7p1N2j5q3J16l2
2208Cm4J9j7M0j7n9Q9rl2K8on1J04n9j6M0m9M9L8o5M1L1o4L6J7j28J01m2K1K6
2238B5k6J7L4p2J3K9p7P3jp0Q2r3M3L6j20J25oq6N6j7NR5j05%L3o8j4J09j5l7
2268c2R1j20N3K5j0J0K0l4L5p0Q1j8q8M1Jn5P3Mj7K4p5M7kN5n6L2oj3L9o4Kk3
2300e0j9R9m5k5P6p1O0o7K0O6j7n0P9m4k1Q3o6K0%K3k2m6p5J00j4JJ3ml8j7L5
$$ y = [137, -21, -71, 87, 33, -61, -59, -11, 55, 10, -116, 19, 118, -95, -40, 40, 64, 48, -144, 28, 150, -78, -56, -1, 5, 7, -56, -51, 12, -46, -51, 20, 47, 19, -82, -89, 114, 45, -62, 6, 37, 30, -58, -29, 68, 54, -55, -19, 58, 16, -5, -13, 45, 46, -54, -53, 49, 44, -25, 37, 66, 63, -17, -93, 79, 21, 4, 36, -32, -38, 70, -71, -30, 85, 5, -27, -9, 30, 45, -123, -20, 30, 15, -41, 11, 16, -36, 32, -52, 28, 43, -56, -28, 9, -3, 67, 12, 48, 65, -7, -16, 46, 14, 48, -50, -25, 32, 26, -18, 8, -21, 19, 36, -35, 17, 2, -81, 35, 3, -41, -22, -39, 1, -16, -75, 14, 5, -27, 1, -5, -56, 48, -11, -27, 13, -36, 13, 51, -14, 27, 58, -6, 30, 47, -81, 20, -22, -1, 25, -1, 16, 50, -22, -9, 20, -57, 16, 15, -55, 27, -66, -23, 13, -107, 18, 12, -74, -18, -35, -30, 65, -40, -40, -7, -75, -89, 20, 5, -32, 59, -61, -8, 17, 7, 17, 37, 3, 38, -32, 49, 31, -57, -16, -15, -70, 3, 7, -10, 14, -61, -14, -16, 39, -17, 15, 9, -4, 35, -29, -27, -50, -69, 30, -15, -40, 36, -35, 25, -42, -22, 44, 27, -23, 56, 12, -9, 74, 8, 28, 28, 51, 29, -17, -92, 8, -6, -5, 8, 4, -34, -51, -16]
2331a6L9k5n1L9Ql9Q6m2l5M3l2M6l6m0O7L3n9k5O5j02P6MJ5M0o3nN2r2P3j7m9
2362d2Q1j6J1q4N2k7Qm2Q0L5r3K4MkP4p7j3L1j07O5J7l9N6L0p1N0k4k9P8j2j1
2393GM4o6J5R6j16O7k8l5M0k8K6M8o1j0R4j05k2M9Rl1Pk7L0J8l1L5j6Jk5n6J11
2424D0J8p9l6M5pO2q2k9P9J1k7K9L9l0m6l3J24p4n1M5KK7Rj44J10M6j02K4O3l9
2454fN8j00J0P2p2K2M3n8lJ8m0J09l5r0P4O6j27R5k2N4m2j07P4K9kl7L6pRq0K8
2485c1Q1j0l9%M8j3q7j1K8N2j12Q4J5k1k7m2J22Jk8m7OM0Qn8j2J11j18O3Qj2N2
2516E1o8o8J56k6m2R0j02M4Om6k8J33j62O7j6O8l4k9L7K4j06j0J14k0l0k2J2K6
2544A9k9m1O8J0n5Lj3N4J0k4%LJ7K3j9J4mn%J1j1r9J05J6k2j6m5K3M8n8JJ1N6
$$ y = [-16, 23, -2, -53, -14, -6, -45, 41, -1, -36, 7, -25, 21, -15, -55, 12, 45, -14, -39, 26, -76, 0, 4, 19, 59, -4, -9, 43, -49, 24, 7, -42, 39, 23, 34, -50, 2, -25, -17, -59, 21, 56, -37, -13, -9, -11, 63, -14, -27, 4, -103, -38, -21, -60, -4, 26, -45, 5, -19, -48, 30, 18, 7, 51, -15, 0, 96, -20, 47, 19, -16, 24, -4, 22, 70, 9, -1, 93, -12, -34, 15, 24, -7, 0, -27, 3, 21, -10, 25, 9, 10, -15, -71, 40, 58, -21, -57, -12, -19, 43, -39, -68, 11, 22, -5, 24, 63, 33, -13, -46, 78, 4, -47, -2, 0, 27, 36, -108, 2, 48, -54, -30, 33, -6, 52, -48, -38, 34, -38, -16, 27, -31, -34, -16, -56, 53, 18, -72, 2, 68, -59, 36, 14, 68, 26, -81, -7, 22, 20, -17, 19, 12, 21, -59, -31, 50, 40, 1, 1, 49, 36, -51, -62, -34, 18, -94, -10, 5, -16, -43, -85, 37, 38, 10, -37, -31, 9, 17, -41, -53, 58, -60, 3, 11, -1, 51, -17, -85, 71, 45, 3, 93, -9, 35, 41, -5, -33, 100, -62, 5, -11, 57, 23, -6, 31, 55, -51, -61, 53, 33, 3, -19, -7, 19, -10, -51, 17, 27, -28, -25, -38, 16, 26, 2, 2, 5, 22, 45, 26, 40, 36, 31, 31, 42, 31, -68, 37, 53, 31, 15, -30, -7, 41, -17, -16, -5, 51]
2577E1qj30Q6K8p4J0j5P6n0J0KN7j23N5P7n0n9N5m6J04p8J3O1n6Lnl0R9l3q4N5
2608AL5n7QRJ2Q1q6j6L2Mn8L3l6Q2j01K4M5n3P2m7j2M1K6p8M3Lj6n2N5N4m0m5
2640c7P2kk2rM1n5l9L7%P1m7n0Q0K7n0Kj4O2k6q7P4m5K0J8L4j04O0k2k6L0j5O8
2672D6o4j5M3k5jN7k6ql7K7L7k6m0K0N5j2m5J9mM0j3j1J3k8qKl9N9J1l6M4l1m0
2705c6M2l6O1j8r1J03m3LK1Oq2J47r1n2J21p5NM7m2j2K0l1J7m5Q4p1N4M8m3j0
2735AL3Nq2MR9j09LO0n2P7n1NNL9l3k8n1O6M1o4k4M6j1J5jkK9q2N8Nl5N8p4L0
2769b0O8n3l6P9l8j0J7m6M4k4j2OO0l0MK6k7P0j15M0j8n8Q4k7k6O5m6J1R0o9j0
2800aL6l7k3K3JrOm2M0K2KQo6M4O7j32Q7Nj4j9K9L0ok7Oplj1P7o1Rk0oJ9Lm2L
$$ y = [51, 43, -87, -1, 27, -47, -37, -52, 24, -26, -16, -14, 43, -80, -25, 52, 2, -57, -2, -48, 56, -22, -9, 52, -4, -1, -6, -36, 63, 30, -54, 1, 36, -21, -13, -4, 8, 89, 3, -13, 19, 23, -35, -2, -38, 44, -57, -33, 12, -41, 31, -16, -28, 13, 39, -39, 4, 7, -9, -61, -6, 48, 8, -37, 35, 33, 11, 2, 43, -12, -51, -14, -14, 57, 10, -40, 40, 67, 17, 19, 5, 67, 41, -46, 28, -17, 3, 21, 55, -49, 11, -11, -37, -7, -22, 46, -18, -33, 10, -15, -16, 41, 15, 7, -30, -3, 34, 8, -32, -12, 43, 31, -14, 5, 1, 41, 28, 17, 30, 2, -6, -4, -43, 16, 27, -9, 35, 4, -36, 6, -30, 31, 13, -78, 25, -18, -15, 6, 12, -70, 77, -14, -66, 55, -20, -15, 32, -10, -22, -2, -33, -16, -61, 23, -48, 6, 54, 11, 1, 34, 39, -43, -39, 60, -49, -46, 14, -38, 39, -12, -7, -2, 37, 4, -24, -75, -9, 32, -32, -56, -10, -21, -6, -7, -9, 20, -62, -4, 1, -34, 24, -50, -20, 48, -5, -41, 38, 0, -10, 7, -39, 5, -19, -31, -25, 35, 5, 9, 35, 8, 78, -37, 3, -15, -73, 11, -16, -42, 23, -23, -12, 78, 9, -1, 35, -2, -25, -2, -1, -10, -4, -46, -6, 16, 18, 26, -40, 4, 71, -61, 26, 31, 17, -2, 27, 57, 51, 24, 30, 23, 20, 9, 86, 25, 34, 14, 8, 27, 30, -12, -9]
2837ij1K4%l2ojk1qL7J2n1N4j6L1j3j5%K9k2l7O6M6m4l5J00p5J1J4k7KK4m1K0
2870FK8r3O2J3Jj5Lo3L9j2ML1p2J29p5k9OM5k6N9q7P3l8L5OJ0o1rJ8L4k0K1o1
2903c8L9RK8m8l8O9kq9J04l8k5R6j08L9K3p8R2j5n1L2J%%N5l4k6j8qP8r2O4k1
2935@k0Q7j37M6O0n8Km5O8K2jn2P5k8n8L6n2J03J6q1J7P3r0L5jk2Qm1K8L0j3L0
2967C7q6L8J8m1K5K6J7o0J2j3QrpK3L8j2l5K8P3l8j05Q3k6K6n7N3M4k5%p7M5j3
2999a0j5M1J1o8K3p4P8J1L3j6J0Nm1n2R0J1q7j0J60j57N6k0O5L3j35m4P3O7r1
3028e3K9J4O2l5n5J9J24j54LJ12k0mo0k0J37q8n9N5O4j6j06LJ09j5m4n3M6mk1
3057c0k8J12J2j53K7J04n9M1p0O3K2j06Q2L0j8l3k5JN5k4l5J3O6k9l1MM2j9p2
$$ y = [-9, -20, 4, 4, -28, -34, -35, -56, -64, -27, -15, -66, -12, -28, 3, -10, -25, -25, 4, -18, -55, 11, 57, 13, -22, 78, 3, 14, 28, 1, 3, 27, -14, 6, 34, -59, 3, 16, 17, 2, 5, -58, -19, -31, -27, 4, -68, 61, -14, -43, -37, 8, -18, 41, -46, 27, -11, 24, 30, 40, -21, -30, -12, 22, 2, 23, -38, 1, 10, 38, -10, -48, 21, 19, -70, 34, -4, -29, 67, -41, -2, 21, -57, 35, 20, -31, 1, 2, 2, 2, 57, 23, -3, -21, -29, 49, -43, 21, 0, -20, 67, -70, -24, 36, -22, -20, -65, 3, 25, 24, -28, 47, 19, -39, -3, -55, 48, 64, -17, 0, 73, -17, 18, 17, -5, 3, -38, -10, 20, 7, 37, -49, -11, 7, -34, -9, 17, 34, -26, -14, -27, -19, -28, -35, -12, 26, 14, -21, 7, 80, 42, -63, 20, -6, 20, -37, 16, 60, 35, 35, -42, 3, -10, -25, 16, 27, -41, -18, -92, -14, -3, 30, 14, 24, 29, -12, -64, 26, 37, -50, -60, 100, -57, -1, -21, 44, 77, -58, -102, -29, 38, -53, -24, -10, 52, 17, -38, -19, 105, -49, -46, 66, 46, 42, -18, -38, 99, 11, -48, 7, 71, 55, -51, -48, 61, 46, 2, -51, -5, -9, -30, -58, 54, 66, -87, -60, 44, -15, 26, -44, 19, 41, -65, 17, 47, 29, -4, -29, -28, 27, 3, -32, -19, 47, 18, -13, -9, 33, 14, -58]
3086e8L1Q4j6r4M6R4l8j12M6K6kn4j9J11%l7n5Q0M2r9j0J3Q2q8n8Q0R0j28MO9
3116C0L2n5q3J08M9o5q9P7J02r7p4J08N3j9q5n0N7M5p1k4O9K8r0j9J39o4n7k8
3144g3J20M9r4k0L6J8p1n7J11NK0o4M4O6j16j9O9P5r4l9M0J12q2j10P3L7op3j4
3173e7J60o8r1M1O4Op9o4J28j3p5RR9l5l9r8J66J7q8j01J74K0p0n7P3j6J4p1M4
3202gJ21j12n6rJ22o4j03J18P6n3r0L2J16n0j38L3J39k5j14J2J08j8o8o9J39N4
3228I4j93N4P9M3j59j7J04N6q2mM0Q3p5j39J04J14j40PO2O3p6j15R8J07j12m6
3254e0Q7Rj4j04M5J14q3o2J7O8K9j29O3P3rj56M8Q0J0q6k3J47J3j55k8J20J19
3281A43j38k1L3N4m1j26J25P8j06j31J03J19j17j02J26J16j24q6O5J04n5o7L5
$$ y = [-58, -27, 57, 41, -53, -7, 87, 49, -63, -17, 9, 7, -47, -66, 45, 45, 8, -47, 33, 75, -24, -34, -21, 61, -27, -85, -5, 85, -43, -39, 30, 62, 7, -76, 32, 81, 16, -73, 4, 106, 9, -65, 43, 96, 77, -8, -58, -1, 44, -27, -51, 18, 46, -44, -63, 76, 12, -45, -73, 47, 96, 2, -18, 18, 36, -35, -92, 19, 24, 44, -20, 24, 90, -26, -45, 24, 99, 5, -34, 6, 118, 36, -74, -1, 36, 30, -43, -57, 103, 35, -56, -15, 49, 55, -24, -88, 40, 27, -48, -39, 60, 25, -14, -112, 54, 71, -17, -118, 56, 76, 6, -51, 22, 6, 20, -51, -7, 114, 2, -54, -63, 59, -5, -108, 10, 86, 33, -57, -25, 91, 41, -97, -64, 75, 50, -64, -52, 56, 38, -30, -99, 40, 94, -99, -45, 34, 77, -82, -99, 5, 61, -21, -25, 15, 98, 23, -116, -12, 102, -38, -31, 31, 94, 18, -97, 1, 108, -4, -50, 37, 46, 32, -72, -27, 87, 4, -58, -41, 27, 56, -73, -10, 63, 54, -102, -54, 26, 36, -50, -73, 74, 87, -68, -96, 24, 143, 5, -16, 17, 71, 30, -96, 29, 107, 1, -130, -27, 92, -25, -127, -1, 115, -9, -95, -30, 74, 19, -48, -13]
3304a3J00q8o4J2R3l0j02nJ72ln1r3J30j2j04j2J05Kn5j3j9R5q5p9J72L1j10m2
3332f8O1P8p8q2P9J73j36j07J06N1k4k7j13J15m0j15R2J09nj29oJ04Pj43O5J32
3358I9n8q7LP9J3m6j9R6l2j07j3J22M0j4j87J24K1m5p2R6N4m1q8N6J05n8j00O2
3386CJ11o6j37K9J46o6n1jN4J3r7j3R6j6q7P4K1L9m6m3J13k3j30N2J08L7q7j19
3414h6J09P6j05j01J35K9p9mM7L9k2j23L7P9L0j57J07k0J2m3l3R4m8o9P4M0Jo2
3442d3jN8M9q1O3l4L0oj19J21K8o1j11J46M6j18kO2N1r0n5J1R0m0JK4pj2o4O4
3472@M0j9j02K6J10Mj12k4P5k7Om4O6O6j06l4J42l8n4j9P5lj1p7R0Q4j16k2J7
3501gO1q4K2N1J1l3r3P7L1J7j21M3J05q9j3J2J1M5j24K8M6j5o7M3P9j3n7J6Q7
$$ y = [-13, 87, -1, -65, -53, 40, 10, -92, -97, 75, 72, 21, -72, 58, 46, -58, -70, 35, 37, -18, -31, -50, 45, -40, -119, 53, 84, -26, -68, -7, 71, -7, -89, -10, 163, 27, -80, 26, 77, 53, 26, -87, 28, -12, -127, -35, 74, 69, -60, -66, 38, 45, -98, -33, 99, 41, -46, -43, 36, 49, 3, -16, 80, 48, -59, -72, 50, 90, 76, -111, 13, 34, -11, -83, 13, 67, 26, -62, -6, 99, 41, -59, 3, 114, 48, -89, -60, 86, 20, -31, -32, 22, 35, -62, -75, 21, 5, -82, -8, 13, 52, 6, -37, 76, 53, -77, -25, 83, 120, 33, -86, 23, 99, -6, -107, 28, 57, -22, -26, 21, 60, 38, -85, -48, 31, 61, -96, 11, -9, 3, -40, -73, 21, -27, -96, -22, 18, 19, -43, -44, 14, 63, -18, 45, 11, 41, 35, -84, 37, 65, 4, -107, 39, 85, -33, -35, 27, 78, -12, -67, -56, 34, -6, -5, 19, 12, 0, -64, 0, 40, 21, -81, -55, 55, 59, -53, -77, -2, -29, -23, -67, -1, 65, -41, -75, 67, 29, -25, -44, 31, 28, 17, -60, 30, 114, -2, -24, -7, 54, -30, -8, 43, 54, 21, -72, 5, 36, 53, -68, -25, 80, -9, -22, -10, 1, 46, -78, -50, -4, -19, -86, -43, 36, 23, -34, -18, 69]
3530F9k6p8nL9KL8r0L6Q6q5N0l3P0p3KJ4k0m2L0JN1j9o2Q5Pl7p0K2J27j01m4N5
3562aN0m0l6KP3o3J7m6O8mLm0P0l1n3L0RkJ9p0M4M7m6pM3q2L0J4MMm9M0J5K9m2
3597ak3KO8n3q2M8O2n6P7j21J20Jo4l9P0j6o1R2m5L2J1l7L6k9k2m1R4PJ2k3KP
3629B8n0LN3Jon6M3M8j33J07k9K2l8j1m5L9O1j8k3q7Q7%L2J3J2p8L3J4j6n1J5
3660c0M5j4mM0k1k9k0j1J05j0n9j4L9K3o8nk3L6K4j%M6k7pn9L9j4nmL1k7k1K2
3693b3J4L9l9K3nk3N2l2%k3J4Mj2KK3o1Q0pj5n6O2k7j3K7m9J00j1m7Nl5mL9jj5
3727a4J8k8M2J0k9k7L7j1j0JOK8J2p0K8J3j7O0k4POJ2j11P8l2N6m5K7J4q0P2J6
3759D5k6J3J1K7q1m2J08j22M9j6J2K9k4M1n1l1O1n7j0P2qK3J2j3k3j1M0j2nPK6
$$ y = [69, 43, -35, -40, -1, 1, 39, -51, -15, 71, -14, 36, 3, 73, 0, 2, 16, -4, -46, -16, -15, 36, 17, -45, 40, 47, 10, -60, -38, 89, -12, -56, -1, 49, 9, -27, -25, 48, -15, 2, -44, 24, 20, 23, -17, 53, 22, -31, -1, 8, 6, 25, -45, -1, 46, 0, -7, 36, -46, -16, -2, 2, 6, -43, -3, 12, 41, -1, -24, -22, 46, -7, -89, -41, 21, -35, 42, -79, 41, 42, -22, -61, 9, -7, -68, 24, -21, 11, 22, -15, 21, -8, -30, -71, 23, 30, 42, 19, 21, 28, -22, -19, 34, 35, 29, -27, 16, 64, -69, 38, 9, 31, -7, -18, -63, -24, 37, 19, -4, -91, -4, -4, 28, 41, 53, -25, 8, 22, 6, -45, -30, 15, 1, -3, 37, 16, -13, -33, -44, 61, 51, -8, -22, 17, 40, -28, -33, -56, -20, 4, 3, 3, 49, 22, 15, -44, -5, -19, -24, -28, 3, -24, -45, -23, -9, 30, -9, 14, 9, -14, 38, 6, 6, -17, -3, 1, -11, -9, 14, -47, 33, 26, 11, -45, 17, -10, -23, 4, -45, 55, 44, -3, 2, -33, -37, 2, 1, -14, 4, -24, 18, 28, -1, -28, 9, -2, -12, -11, -5, 23, 35, -35, -7, 6, -11, 49, 25, 32, 38, 50, -61, 17, -15, 41, -4, 23, 37, -43, 29, 45, 19, 32, 43, 70, -11, -53, 55, -67, -18, -34, -22, 7, -17, 24, -27, -58, 3, -54, -64, 8, 0, 23, 35, 22, -1, -12, 28, 16, 11, 18, 44]
3790D4j0K9r0N9n2M7n8J6L0Mj0j9JMJ6l6O2q7L6k8M2m8O8j03R2LRm1jO1q0J8L0
3823Hl9L0k7J2K4L5o8N1j2l0K2l2K3Nn0l1J32r6O9rJ0l2k6P5r9O8j5O4q4Km2O6
3855Dm1K1OM1m2L9k3J4l9J3QjM3m8KnJ3M3l8qm6RK2J6%K5m3M1l0ll6Q9k0p1N9
3890A4k0N2k0k1J4m4k0K3K5n2K0j4PJ8K9J1k7O8n4j2n0P8j8J8nn9K0J18p5k9j0
3921a5N0Mo2RM3p2LM0j8%M1RJ0qp4K5j0M7j0n9P6j9m6K3N5MK6o2k7P0q3M9l5M3
3955B7l6j4M1l8J6L9J0o2L3L3o7M1l7J7M7l6j1KJ4n8M7Qj2mk5K4K6K2n2Kk8LK7
3988aL9n4J5j1L7jJ4j3k6M2o0L2KL4m6Pjk8Q9o0nJ6No6J8M2MK2l0Nj3k7L6l3J
4023a5jl5O6ko1M7R%o4N0l3K8o7N1nN1l8m0N9O6r2L4j0l5L1nK6L1m4L3l9PK0K
$$ y = [44, 34, 63, -27, 32, -20, 27, -31, -15, 15, 19, 9, -10, -9, -5, 11, -25, 37, -50, -14, -42, 0, -48, 20, -83, 9, 12, 21, -20, -21, 40, -40, -22, 8, -31, -1, -28, -16, 8, 43, -25, 26, 14, -16, 6, -26, -3, 2, -48, -79, 53, -43, 26, 17, 27, -5, -31, 44, -55, 13, -2, 62, -22, -20, -62, 4, -37, -16, -10, 31, -11, 28, 5, 19, -20, -7, 1, 0, 43, -5, -3, -8, 5, 48, 10, 2, -44, -35, -13, 3, 3, 28, -15, 26, -4, -7, -43, 46, 26, -45, 14, -6, 46, 26, 5, 19, -25, -45, -22, 3, -49, -29, -43, -36, -18, 11, 22, -5, 63, 9, -3, -53, 25, 7, 25, 20, -39, -19, 99, 24, -5, -15, 35, 39, -23, -14, 29, -43, -40, 0, -18, -18, 23, 32, 42, 34, -40, -15, -25, 22, 12, -47, 29, 10, -36, -13, 42, 46, 72, 10, -17, 53, -30, 19, -16, 27, -9, -23, 18, -20, -4, 35, 45, -17, 16, 49, -18, 23, -14, 3, 50, 14, 3, 5, 19, -39, 8, 16, 4, 0, -25, -1, 25, 47, -5, -3, -31, -28, -1, 38, -16, -1, -12, 25, 24, 38, 25, -1, 41, -19, 13, 15, 49, 3, 10, 9, -19, 70, 10, 5, 21, 26, -40, -22, 20, 24, 46, 16, 21, 8, -19, 17, -16, -15, -16, -51, 15, 13, -48, -1, 8, 8, -56, -6, -39, -11, -78, -27, -32, 19, -19, -59, 0, 66, -26, 8, -2, -37, -6, -11, 15, 46, 2, 35, -4, 3, 23, 25]
4057B5Rn6L6k8rO8q2M5J6q7N7j6M1k7M9o6L1oK3l0nj4mJ7K5l3J8ln3J10k6QL0
4090F3p6M6k8m0Q7l7k4J0r1Q5l6O2Om4m0L3KN7q7M9m3N7npj9Q0j5j04N3M6j9l8
4122a7JQ2m2m5L9rJ2K1n9K6K2n3mKNR0n0J5LPk6l2j3ORK8l0j3RmM6q1R0r9R8j4
4158B0J8l2J7k7j9j3L8J9j9Q7r2O0m3j7K3j4L6k9JJ8l3k0j5Q7Pl9k1L5Pj5J2Q
4190D5j4j11P7J6p0O3j7j5K0k2kK9K2m4J5m4O8L1o7M1m2NO4k0j3ROj0l8J1J6l4
4222b5MP0m3kj6nl7Q6p3M2n4P3Kn1Q0j3o8oK9N5k2l6L6K8l7Rk0j8k1L4j3nkK0
4256Aj1P1Lo3P8p7j3m5N2M1l9K1nl9k9K9K6JJ4k7K2j3Jj9L4m3qL9L0m6L6m0j6
4289c4Q5k3l1L8jo0L0K1rrok3nM4k3n0P7olJ5J9Km2L0J4m1r%KM6n2L9m3j3J2m0
$$ y = [25, 34, -22, 14, -14, -23, 45, -37, 8, 24, -63, -6, -22, 19, -8, 41, -25, 6, 0, 23, -7, -12, -26, -30, -13, 12, -21, -3, -6, -59, 51, 25, 33, 63, -13, 33, 5, -35, 52, 15, -9, 1, -90, -5, -41, 21, 27, -17, -57, -24, -22, 35, -52, -3, -46, 11, 6, -1, -20, 60, 45, -59, -6, 40, 21, -17, -16, 66, 24, -21, 18, 9, 21, 42, -17, 9, 31, -22, -26, -24, -19, 71, 21, 36, 39, 46, 20, -12, -25, -19, -10, 18, -12, -25, -16, -20, 26, -55, 35, -64, 34, 20, 38, 6, 23, -4, -23, -36, 2, 21, 2, 89, -3, 57, 14, -3, 20, 6, 42, 13, 14, 32, -1, -21, -36, 51, 58, 19, -2, 33, 40, 25, 37, 45, 31, -80, -3, 13, -57, 6, -11, -26, -6, -28, -30, -1, 21, -23, -8, -52, 16, 47, -20, 21, -21, -16, 48, 28, 15, 24, 30, 20, -18, -7, 9, -25, -21, 49, 6, 4, -12, -17, -54, 32, -41, 1, -53, 20, 22, -29, 51, 38, -30, -36, -7, 48, 26, -10, 26, 54, 17, 26, 6, -12, -33, 1, -12, -17, -19, 1, -10, 61, 64, 1, 79, 2, -11, -56, -4, 37, -2, 19, 14, -25, -54, -25, 1, 2, 16, -11, 11, -2, -1, -20, 14, -29, -37, 2, 32, -14, 22, -18, -34, 51, 28, -3, 35, 34, -26, 4, 25, 16, 7, 1, -22, -27, 17, -6, -56, 21, 15, 12, 27, 46, 48, 6, 36, 50, 9, 0, 0, 2, 48, -4, 35, -8, -21, -9, -49]
4325d9L0O1k7k3L4m2N2k2M5j6n6L7Mm7nO7j6j4Rk3J1K1k5K3m4orR0p2O1k9l8J4
4358dl6O6o2M5K0j4k6J1j8n6N6Nl0N1J6k7ool1M4k6N4k8j6J3RL1m0M8k2k3Jk7
4391b8N3j4K3p3P8k1L5j11K7qK0L5rm0mL6KOMo2K5L9OoNN8o2j3n0J0J5K2K2J9
4425C9m3j5M6j3k3oJ7Nm0J4L4m4mO7m0m9O5j0mj8J9n8N0jL1k3O2m9n2P6j8l2L4
4458A7Qr1Q6K4o0J0L1m3L5m6rQ6%pk1j12J11J2J8j10P7j6J0K8l6n8P1m3l5J07
4488D4m4J4l6nK5j3J5L5Pn4L4m6L9k0l4L9pK5m4L4J9j17P0J0K7j1L1j3n7J6%J3
4520djL7jK1KQj21j9Q7NK2n0J4Mj8L0m7k7L0L9q5L9qM6J1m1%OK4O7k0o5rN4k1
4555IRJ0J1j23R8J2m4ML7k4j8L0j7o3N0L0l1L2oJ3k0Qm5rP8l6l0L6p5N3J7k4P
$$ y = [-49, -19, 42, 15, -8, 26, -16, 36, 14, 59, 43, -13, 24, 28, -19, -24, 43, 27, 13, 22, -1, 10, 31, 6, 29, -15, -21, -30, 60, -12, 49, 20, -18, -4, -40, 26, -36, 9, 29, 15, -11, 0, -18, -74, -18, -13, -43, 8, 24, -3, -9, -15, -46, -2, -28, 26, -2, -18, -5, 4, 35, -5, 43, 21, -2, -1, -28, 25, 11, 34, -39, 39, 18, 53, -58, -31, -39, -19, 16, 7, -33, -37, -1, 1, 7, 11, -51, -26, 13, 19, 13, 18, 76, 14, 1, -49, -39, -24, -2, 20, 39, -4, -19, 27, 14, -9, -15, 2, 7, -33, -19, 15, -29, -33, 34, -6, -55, 10, 0, -4, -22, -3, -61, -11, -12, 19, -4, 58, 9, -43, 33, 15, -17, 17, 25, -66, 20, 44, -16, -6, 25, -18, 17, -29, -38, 48, 48, 41, 20, -92, 19, 31, 49, -61, 16, 0, 10, 38, 2, -56, 15, -28, -63, 44, 0, 14, -22, -27, -2, -15, 0, 35, 42, -12, 22, -24, 15, -5, -39, 0, -7, 18, -26, 8, 27, -90, -20, -10, 17, 6, 37, 24, -33, -17, -17, -4, -5, 32, 31, 52, 54, 62, -59, -78, 9, 14, 36, -14, 0, 4, -14, 16, -31, -58, -28, 11, -74, -35, -43, 3, 14, -27, -27, -21, 3, 70, 50, -15, -24, 30, 9, 18, 28, 39, -84, 14, 26, -18, -14, 23, -1, -19, 11, -6, -69, -19, 11, -20, 12, 6, 19, -1, 7, -38, -47, 31, -5, -35, 1, -74, -21, -4, -28, -21]
4588b1k7J6L7l2L2O4n4jK4k1k0M9J6o2L1j2p1O8o2L8k7L0K6l0Pk3RO3o4kN6np1
4621c9L9L4j5j6k6J3K9Ll8pK7j7k0O9L5l8k3kj8J4L6pl5j6jM6k9Qm3K3K3K5n5
4654b1Mo2L9K4k3K3mj3M4K5l1r2J16K9o5pJ9pK3j8QqRlk7Q1o4RJ2J3o1N0Rj4m2
4689b5M2l5j3J9Oj8N4o5P9p2K6kOj7RrL8l3L7k3J4m4J3Rl8MN8l1k8M6pRl6K2j
4724fK8k4qk7L0k4P6j1n0N8q2P1j7j8jl8L6pK8p4O1l6lO8o0N2l0M2o2J2L4K8l9
4757Gk5L4Pl3L1k3M8n8j5K4L0n7N6K5n4J4k3M1k0l2NpMP4l4o8QqK4J0m1nO7m4
4791c8N4l4J1l9M6l2LK8L6m1JK0O8p0l1J1L5l5J0k4R9l4Ll4Prm3Q7rn7J5L5p2
4824c3j2L2N7l3k2N1o8P4k2n0PM5J4l0j3m4L0J2m8L0N7q4J2N7klOK6op7P4n8N
$$ y = [-21, -48, -32, 5, -27, 5, 69, 15, 14, 38, 17, -3, 46, 62, 0, 31, 19, -52, 16, -46, -8, -35, -5, 21, -9, -2, -25, -16, 47, -17, -19, 37, 32, -39, 0, 34, 19, 3, -23, -10, 19, 22, -16, -23, 4, -13, -33, 36, 71, 33, 10, 8, -10, 4, 40, 33, -2, -18, -19, 27, -2, 6, -37, -14, 9, 34, -21, -17, -79, -40, -16, -39, -16, -20, -33, 11, 36, 5, -87, 29, 58, -7, -14, 5, -2, 21, 3, 11, 3, 12, 9, -18, 63, -1, 8, 20, 33, -28, 22, 31, 17, -25, 17, -18, -31, -12, -6, -24, 30, -35, 44, -28, -2, -4, 2, -15, -6, -15, 23, -10, 27, 4, 18, -26, -13, -4, -42, -38, 20, -11, -39, 7, 0, 9, -27, -5, -6, 22, -2, -10, -37, -7, -31, 45, 34, -16, 42, -40, 31, 14, -4, -5, -43, -7, -14, 14, -60, 1, -35, -38, 30, -30, 22, -8, 34, -28, -16, 18, 46, 7, -18, 16, 23, -10, 21, -2, 46, -12, -27, -3, 27, -30, 26, 51, -3, 11, -12, 29, 9, -23, -18, -25, -21, 53, 19, -49, -41, -49, -25, -15, -56, -61, 6, -38, 16, -18, -7, -46, 0, -32, -29, -1, 35, -6, -5, 15, 83, 13, -18, -7, 28, -7, 3, -21, 78, 44, 47, 13, 20, 11, -32, 55, 46, -11, 4, 39, -33, -45, -13, 44, 11, -11, 40, -28, 46, 24, -26, -19, 26, 40, 10, -3, -47, -17, -5, -53, -23, 34, -50, -38, 19, 17, 14, 20, 46, 40, -37, 37, -21, -16]
4857a6M6n0J4l4P7mJ1m9K2pJ2jp1L7K2J8m5J1OKJ9n1M4J4m6K1p1O6J0k4l4J06
4889E5j4n4K0M1m3K7n1J1Lmk2P9k0n9M6K4M1p4M4n1qK2K3p7J6OJ3NP4j03L3J0
4921A3mpPp1K3pj4O4K7m6J2o%k0L6kJ8lm4J21j17Q6n9J7N9l2l8L9n9J4k5Rm2O7
4955A6M3p3j9J02n7j5J3q6J7Q4n4J0l4J8L3J2l5L1M3m2k8L0j1nk2N6q2N7Nj8P2
4986F1q1OL2l3m6J1L2j4L9k8J6o3L3LJ0J7k4M9Pl9m2N2Oj2J0K8%m7O8p1J9j5r
5019b5N4l8JN3k1Lo0P3m3oqM0k2K6k0N2m8L4m9k1j4L8k6J6M1m0j1K4L1j5mN1p6
5052a0L5lq5O3k7L9J4l0L5m6L1o8P7j1ll3kl9Q4nJj6k5N9o8M6j6kl6N0l2M1K8
5085D6p5N3n6K7L2m5K3m4M3l5J5l7M2N3p2L0j3N5o3N1o7N4k3qM6l0m3P8q8N6J
$$ y = [-16, 30, -20, -6, -40, 37, 33, 44, -5, 17, 10, 22, 21, -50, -13, 9, 27, -18, -7, -1, 1, 20, -31, 13, 27, -19, 2, -69, -3, 7, -17, -51, 55, 41, -13, 7, 48, 5, 32, -19, -8, -5, -9, -31, 48, 28, -31, 15, 39, 80, 6, 50, -1, -9, 13, 36, -41, -25, -19, -6, -1, 73, -30, 3, 13, 9, 2, 9, -62, -39, -46, -60, 4, 31, -15, -3, -9, -9, -29, 7, 5, 23, 20, -24, 97, -20, 66, 7, 24, 83, 51, 13, 52, -7, 7, -18, -9, -51, 16, 59, -14, -33, 69, 12, -3, 10, -76, -59, 25, -29, -19, -53, -35, -2, 10, -25, 6, 49, 7, -21, 9, -2, -7, -29, 27, -55, 2, 7, -11, 61, -20, -14, 18, -15, -61, -50, -18, -32, 7, -21, -5, -68, -35, -32, -22, -5, -29, 20, 27, -12, -54, -2, 4, -8, 2, 30, 30, -17, 51, -20, -1, -16, -25, 29, -9, -8, 45, 24, 27, -33, 40, -3, -9, -17, 23, 1, 27, 7, 59, 11, 45, -4, -25, -39, -1, -27, -11, 30, -10, -21, 3, 34, 19, 15, 66, -10, 25, 22, -63, 0, -27, 12, 26, -4, 31, -15, 16, -52, 25, 14, 11, -22, -24, -63, 21, 16, 17, 1, -24, 35, -33, 13, -3, -5, -41, 9, -23, 18, 46, -29, 24, -32, -5, 27, -18, 5, -39, 4, -31, -16, -53, -11, 42, -30, 0, -13, 42, -21, 30, -37, 17, -6, -14, 32, 2, -41, 37, -51, 5, 6]
5116Fnkk7J3K6J4orl3J5J5k0k4K1l8Q6m7%l1O7j6K5k6l4k7L3J2M2nl7n0L7j7L8
5150dL4l4J6j4qkN7n4K7Jm4k7P1M1r5M4l0%M4p4M9qq5J44m1k2M4k4mJ8Lm2QJ8
5184Gk3nM5k7L7l0pK2m0L6K7m3oKj0j6L9l0J4j3M0l0k2O3%m8lJ8J7j8rK6M2j00
5218d5L2lL0ql2J0M4j8l2L9Kk8Rl0M4nq4Q7jK0p9L0J3k0qN2oJ4kL2n0l9K4ML1
5253B7kpj01P2K5k5JK9J3l5o3K7K9J8K4m5k2O3m8K2K8p0Q2Op0pJ8kJ6J0j3N8q9
5286c1N4k3mJ9J6m5j5O4m2K1k6l4M5k6JK7j3l7J25o7j2J3o4J3R1p2Mk1P3n6j3
5317c5N4J3K4m7J6J5n4K9j5j9K2j8oP3o5P0m2j1p2P5j3j2Q5o0J9J0m1M4q8Q6n6
5348a9lO8n6l0O2p0Q1Ko1P0rk8J5j0kk3L4L0K8p4PO2p1k5K5k7K2M3n8O4m2l7k6
$$ y = [6, 1, -1, -28, -15, 11, 25, 19, 10, -23, -8, 7, -13, -37, -16, -54, 32, -15, -15, -46, 21, 5, 30, 4, -30, -57, -24, -12, 30, 25, -12, -62, -25, -42, -4, 30, -4, 12, -2, -10, -12, 45, -9, 18, 19, -25, -52, 19, 60, -35, 9, -21, -21, 23, -51, -2, -10, -95, 49, 8, -14, 30, 6, 2, 20, 23, -19, -11, 7, -16, -21, 24, -3, 34, 4, -3, 19, -21, 15, 42, -1, -7, -5, -15, -31, 8, -22, -8, -21, 19, -11, -33, 30, 30, -18, -21, -3, 14, -4, -13, 13, 55, -45, -13, -16, 14, 6, -26, -16, 28, 10, -22, 17, 19, -9, 0, -30, 14, 9, -75, 12, 11, 31, -48, -18, -5, -25, -33, 19, 13, 27, 25, 57, 7, -32, -8, -4, 27, 25, 18, -83, -11, 14, -11, -10, 19, 32, -3, -66, -39, -10, 8, 32, -13, -35, 28, -20, 2, 30, -40, 42, 48, -22, -29, -11, -13, 3, 13, 0, 58, -31, 23, 0, -4, 15, 31, -14, -29, 35, -7, 14, -12, -46, -1, -27, -26, 1, -12, -49, 76, 9, -3, 10, -54, -41, 50, -22, -18, -39, 34, -22, -35, 19, 32, 56, 9, 25, 40, -14, 15, 0, -19, 3, -15, -21, 52, -13, 57, 15, 4, -68, 7, -6, -18, 67, 7, 26, 36, -5, 39, -49, 37, -19, -22, 46, -10, -40, 22, -48, 33, 35, -26, 44, 35, 7, 22, 12, 10, -13, 21, 51, 79, 5, 12, 74, 3, -22, 3, -24, -2, 41, -17, 47, 5, -32, -58]
5381e8ON2J7n4O3o2M8o7N3p1J1J5Q6l8J2k7Rmj4M7Ql0Oj1q2Q5K3Lj1j9M0m3J6
5414In2L4j7pK9L0l0jm2K4N2j07P5L0l5j8K5J9Oq7J02rmj0QK0p3L5KJ1m9L8L1
5447C9j07Q5loL9m0J6Rl6M2k2j6J6j0mrk4L0J3K5o9%L6m9L5N7k4l5k9K9J4KJM5
5481E0l9m5J%mL5j0M2n7R4o8NM3q7M1m2L3k8N8j9k7J4PM7mJo7l5M5R1p0p4MJJ05
5516D1n5j4M3l0l1O4Pm7K8o0Q2QmJ4m1pJ1rj3L3n6K2rN2k9j7N5Qp1k3L1J7k0l5
5550e5P1l8%l0jN8n1P5q0N2K5q4M7j4P6l1rl9K7RK3j1Nn0Q3l3l0l0OLM8n5O0k6
5584A%Lj2km3P2p2M9m0%M5j1J9K3ml3J6k6k2pRJ8L8j1k4MM8o5N5N0p3L2p3O6Q
5619C8p4R1n5j8NL3L2L5q2k3R6n2k3j4nl7Q1o3L3K1k4m5Q2q3J9j3L0j8l5P3Ok7
$$ y = [-58, -52, 0, 17, -37, 26, -36, 12, -55, -2, -73, -62, -47, 39, 1, 13, -14, -5, -9, -23, 24, 32, 2, 8, -3, -85, 0, 23, 26, 15, -4, 36, -7, 9, -43, -9, -26, -33, -4, 26, -4, -5, -47, -23, 29, -78, -3, 27, -8, -26, -1, 18, 24, -63, 39, 30, 26, 16, 24, 44, -29, 6, 8, 19, -30, 8, 39, -68, 17, 14, 8, 47, 7, 23, 32, -4, 38, 16, 0, 16, 6, 2, -7, -31, -1, 12, 37, -32, -32, 4, -45, -10, 47, 23, -12, -41, -12, 2, 4, 5, 50, 11, -34, -33, -33, -37, -2, -12, 30, -27, 67, -1, 4, 47, -40, 1, -41, -8, -36, 22, 3, -24, -10, -3, 44, 40, 41, -26, -61, -16, 75, 5, -69, -65, -64, 41, -14, -28, 15, -15, -46, 18, 25, -22, 6, -54, 28, 36, 32, 46, 5, -2, 9, 0, -13, 20, -36, -14, -23, 29, 0, -17, 38, 46, -25, -48, -17, 0, -20, -55, 16, -22, -22, -52, -53, 5, -46, 29, -51, 1, 26, -58, -11, -25, 51, 20, 11, -28, -1, 8, 31, 20, 25, -25, 58, 25, -5, -35, -29, -26, 22, -33, 27, 1, 1, 4, -8, -10, -53, 19, -53, -4, -44, -44, 1, -10, 9, 32, 28, -5, 11, -15, -37, -44, -35, -17, 21, 10, -14, -10, 38, -27, 28, 78, 5, 37, -36, 30, 38, -36, 55, 0, -18, -13, 20, 52, 87, 5, -18, 78, 26, 3, -11, -16, -53, 28, -35, -2, 19, -5, -50, 32, -51, -32, -45, -15, -33, -68, 5, 11, -16]
5651a6J0K9k1O3k1p6J2O1m4J18n3k7m8M1l1%L7l2kM7k9K1m3m1O5l1Mp8O3j0J1
5682b1J5l4M5mM4j3l5K1l2%J5MK4m2J2P2Lm4jJ7l0j9J3m2K6JK9o8N5qj6J3oL8
5716C2n1L8q8O9Nj9L9q5LL6M8k2j3k3P8k3J5j0m4o2P9k8L0K5k0l1L2L4n6K8m7
5747c1k2P3j5k9k9M0O8m2Jl9km2N2N2j2j2Pk2l5N5rM8q4L3J1J1k3m2M0K5n2pM7
5780A4K9n8QL3j6m5M2jj4L1j5QqmO3k8nO4q6rK1q2L7j9J9m2J11k5k5Ll4K9pL8
5814B7lq8j8J01k9mM3m8M8k1j3j5J6K2j4J9Jj7lk4rM1qJ0k4N3k0J0o9O1j7n3K5
5847b0j1Pm4P7Kk4l7K3J1M5K6j8k1pJj5M2o3L8k8N0j8j0l4N0Rk0J8Lk3l7N9k9
5880Bl4L1j2j4K3j3k6N5n8K6J1j8M9k1qj2l5Q4l8j1N8l7KNLl5N9n2MKO2r2PLN4
$$ y = [-16, -6, 23, 2, 65, 44, -32, -20, 41, -3, 115, 62, 35, -13, 28, -3, -3, 34, 2, 0, 47, 18, 39, -4, -45, 20, -11, -7, -85, -22, -32, -21, -6, -40, 5, 1, 45, 32, -3, 18, -14, -14, 1, 5, 29, -13, -1, 71, 74, 30, 29, 46, 16, -3, 10, -32, -6, -5, 24, -44, 11, 3, -13, 0, -6, 32, -19, 19, -69, 0, 5, -14, 25, -60, -57, -21, 27, 5, -8, -31, 47, 24, 39, 29, -15, -77, 2, -26, 4, 29, 9, -22, 10, 44, -12, 16, -31, -53, 20, 5, -24, -53, -13, 55, 13, 14, -25, -27, -69, -17, 35, 23, 11, 18, -4, -39, 16, 7, 55, -29, 4, 15, 26, 3, -39, 1, 26, -26, -33, 14, 43, -15, -7, 26, 10, -35, 7, 6, -8, 23, 8, 16, 8, 4, 67, 39, 34, 98, 12, 3, 24, -58, -21, -40, -21, -63, 48, 23, -2, 1, -33, -4, -11, 27, 24, -64, -82, 19, -10, -14, 29, -19, 29, 8, -5, -20, -4, 18, 4, 23, 24, 7, 4, -20, -29, 12, 4, 14, -10, 43, 23, 33, -36, 25, 8, -45, -20, -31, -24, -68, 9, 11, -13, -50, -27, -16, 29, 55, 37, 16, 9, 10, -5, 37, -26, 12, -16, 34, 16, 6, -28, 22, 31, 11, 29, 32, 9, -28, 31, 2, -32, -1, -13, -27, -4, -17, -43, 12, -46, -20, -9, -27, 22, 1, -7, -19, -54, 30, -8, -19, 39, 2, 4, 9, 12, -23, 36, -16, -12, -10, 52, -40, -33, -30, 24]
5915B4n8J5L3nol1Jk2P1l0k2k0j1M3J2M3K6r8K7NJ5o3MQ5Njp8J6J0k4L5j6N5j1
5949B9k6k8K2NL5jk3k2L0m0J2J7l3K0j3N4m1pj1M4p6QL8nN2pm4j7j1j4J9K9MM5
5983D4r3M1K7J0o6K4jM8L7l7k1l2JK9L5l4J8j8J7k1O6l7k0j0k2K4J6k4rQ3j09
6014c4K0M6n3QM0ml4l3N5k2J4mL8o4N4k4k2P7l5m7P0j08P1m6l5Q7l9K0l4J9K8
6045InL6rq5R3l9K0o8N7PJ7m0j3K1J5l4K1LmOn2N7k1K8j1n0L4M3n6L7l9K2M2j5
6079B7m7oN1L4rpm1L4j2m1Q%Rpj4PONK3m7j8O2m2Ql0N0Ok4J8m5O0l6kO8j9l4M8
6116D3o9M8J4p4N2J8p0R6k5n4P8m5nRQJ1ml3oL4L1mo8R6j16LL0M1l0rk0KMj1K5
6151@K0l2J0nL9ml8J6J0J9lJ8k0Rn1k4K3L5j4Nm2K5l7P0l6L1r3J05kj7o9K0ML2
$$ y = [24, -34, -19, 14, 9, 3, -28, -27, -49, 22, -8, -30, -50, -61, -18, -6, 37, 63, -35, -8, -3, 12, -51, -47, 38, 43, 42, -36, -20, -10, -34, 1, -15, 40, 29, 3, -25, -3, 2, 37, 36, 13, -9, 21, -19, -7, 10, -23, -3, -16, 38, -3, -10, -21, 23, -53, -45, -7, -12, 40, 33, -11, -28, -39, -53, -34, -5, -1, 44, -49, -8, 19, 29, -37, -13, -14, 34, 71, 34, 13, -19, -18, 11, 46, 12, 30, 12, 29, 8, 74, 37, 17, 7, -15, 9, 25, 1, -8, 75, -34, -14, 32, -21, -13, 27, 23, -11, -44, 11, -11, 3, -1, 37, -27, 27, 3, -19, 58, 23, -24, 46, -62, 9, -37, -72, 15, -24, -4, -38, -19, 9, 4, 40, 31, -54, 39, 0, 20, -48, 9, 16, 33, -7, -20, 1, 16, -18, 3, 6, 2, 8, -44, 13, -8, 20, 9, -41, -7, 36, -20, 17, -22, 0, 42, 27, -20, -26, 25, 59, 50, 43, 2, 36, 24, -17, -9, -9, 0, -7, -21, -14, -8, -3, 20, -27, -45, 17, -25, -17, -47, 3, 9, -15, 3, -42, 18, -18, -20, 48, 29, -5, 43, -26, 22, 36, -38, 14, 32, -38, 58, 33, -21, 57, 12, 7, 16, 24, 35, 31, -2, -8, 26, 57, 53, -15, 81, -35, -32, -2, 39, 9, 0, -20, -18, -14, -25, 0, 20, -12, -2, -7, 32, 28, -10, 6, 16, 35, 32, 50, 30, 39, -12, -36, -13, 22, 8, 13, -29, -4, -41, 29, -7, 24, -69, 36, 34, 17, -52, -32, -28, 4]
6185DK5j0j5N2p1M1J8j01R4p5K6l0N7j3k6M2J1k1J9qK6o2Nn2O2L4J2k4Poo9O9
6217B1nj7j0J4J6m3nO0j5k2l0R7j19L8J2%j1J5qrnM3k2Kj2M9l3On2N9l7oK8J4
6251A3K8m0k3K2%N0o7J7L6k3j0o0K8qJ0K6K1m6M6Pj4K0o6J7j0O1j05P7mK3n2j5
6283d1N9Om1l0L4pm1Q3k1m2N4Qnmj7N3n7lQl5M4m7N2K0j18N1N8m9L6m1J1P2l5
6316A5K8p2L1m3M5m4N4Mm4Mk9L8nL6J1J3k8l5k5L9j2Nj4P2k4J9m9j9P4k1l7K6
6348A3M6m2J0k6r4Q5MQ5j11R1n6j5m7P4k5J2N8r3Q1m8j7L5j7J6l4O8ln2K5p3P9
6379B9m6K7M2ln8K0j1N0l6m9L5mk3M5rL4k0o9L5j2K3j4K4l6K1Om9N1l4K7Rn0M1
6412dk0K6lRj8J3j2J0k5J8m5M4J7k9M4Nm6j1L4l6M5ml0j5L8j0j9J1L6L1n1p3L9
$$ y = [4, 29, 19, 4, 56, -15, 26, 44, -57, 37, -38, -12, -42, 15, 2, -24, 18, 29, 8, 27, 19, 45, -17, -12, -64, -2, 32, 44, 20, 27, 21, -48, 21, 16, -1, -11, 3, 19, -24, -29, 31, 16, -6, -36, 61, -58, -20, -8, -8, -19, -4, -12, -21, -26, 17, -5, -3, -15, 34, 1, 7, -45, 14, -23, -29, -1, 13, 41, 1, -22, 0, 0, 50, -17, 0, 36, 13, 3, -57, -29, -37, -27, -1, 20, -26, 20, 27, 13, 33, -33, -16, -26, 35, -70, 7, 3, 26, -26, -41, 18, 24, -17, -47, -13, -20, -61, 22, 1, -41, 13, 21, 16, 12, -5, 48, -9, -12, -4, -39, 5, -42, 10, 30, -88, -37, 21, -28, 8, -33, -22, 50, 15, 43, -29, 2, -41, 4, -40, 14, 18, -26, -22, -51, -13, -18, 18, 29, 42, 14, -21, -46, -7, -19, -14, -28, 44, 20, 39, -10, -29, 45, 24, -13, 13, 59, 17, 27, 1, -93, -8, -4, 81, -30, 61, 5, -10, -57, 17, -8, 4, 62, -31, 50, 2, -15, 20, 3, 19, -15, 53, 50, -2, 23, -50, 29, -17, 10, 52, 49, -9, 11, 0, 50, 14, -35, 0, -4, -27, 18, 9, 43, 23, -46, -11, -23, 0, -14, 10, -26, -5, 1, -48, 3, -31, -4, 5, -45, -4, -24, 2, -1, 8, -10, 3, -9, 1, -24, -6, -51, -7, 10, -19, 25, 30, -16, -27, 7, -29, 16, 12, -18, -33, 5, -5, -24, -13, 23, 54, 3, -70, -31]
6445c1j4N4j3L4n6P3j15P8l9N6k7K6k6Q1p4n4L3K7J5K5m4K1pK8p6L8J7n6L6j4
6475dN1q0M0k2J6r%j3MK1j8j3K4n4N1m1R0p3j3RO3J4l4l3K7J2p5Q9p0M2j1K2l5
6508b3L2L3n1J7N5r8M1k5M9p8K4Q0l6j0j9K0L8k2l6j7J7M7p6MM2J4J6m5OJk9K6
6540cn2P9m7K4pJ1L6J3m3L4k2J5ppn3M5J9l1j2n1Q0n2O0%n9O6l4l5P2n3k5RpJ7
6574b0L8l1M7k8j6n8O6l2K7rM1j7qj0nKN8l8R0q1K3n3P4r2j6O3k9L2j2M4o0OP
6607CLp2O8J8jl0RJRn7%pR7orJm2oM9l6M7m3J8j8KO6l4qj0L0qk7qN7r4Q6k4j0
6645A4J5J5q0N7l0K1mrJoMk6M8Rl7m7R3j9l7k9N0J4K5o3L1k0M0J3p9RM4mMl4n2
6680f9Q9k7L6o0M7J5o2Rj7mlP2j0j2K1n6J6mMn0lP1J9k5K2l2j4M9K5k3l0m3N8
$$ y = [-31, -45, 9, -4, 30, -26, 47, -68, 10, -29, 27, 0, 26, 0, 81, 7, -47, -14, 13, 28, 53, 9, 30, 23, 51, -25, 13, 30, -26, 10, -4, 47, -33, 7, -15, 1, -8, -8, -21, -17, 4, -14, -27, -3, -57, -6, -47, 43, -30, -43, -34, 29, 43, 9, -24, 3, 15, -60, 29, -41, 1, -10, 12, -23, 9, 42, -9, 8, 63, -35, 6, -19, 30, -48, -24, 56, 20, 10, -9, 11, 49, 27, -9, -26, -9, 38, -38, -34, 8, 22, 38, -7, -1, 0, -29, -3, -55, 24, -23, 1, -6, 5, 41, 54, 11, 45, 23, 38, 31, 24, -29, 16, 35, 4, -8, -59, 21, -31, 29, 29, -30, 36, 2, -33, 39, -14, -39, -30, -37, -20, 18, -13, 34, 6, -10, -68, -2, -34, -7, -16, 25, 8, 0, -10, -15, -13, 45, 7, 97, 16, 39, -14, 60, -32, -48, 15, -14, 18, 6, 50, -10, -4, 3, 6, -66, 2, 20, 19, -11, -2, -1, 8, -49, -49, -56, 41, 35, 26, 27, -15, -21, 28, -8, 39, -4, 14, -4, -2, 64, 30, 22, 12, 42, 34, 7, -1, 56, -38, 48, 24, 14, 29, 44, -36, 21, -9, 12, 8, -1, 0, -6, -2, -28, 20, 29, -8, -55, 38, 19, -18, -47, 3, 17, 42, -21, 10, -10, 30, 43, -36, -27, 17, 13, 17, -17, -69, 20, -7, 29, -31, 16, 31, -31, -22, -39, -43, -46, 26, 16, 4, 25, -31, -15, -19, -15, -65, -68, 3, 22, -3, 19, -13, -27, 22, 47, 24, -6, -49, 9]
6713IpJ9J1k6k4J0L8m9K3Kk1N5o1K0nl4J1k4M2L8J5K2o5m5K0N7o4K5k6J0M2l7
6745a9k7Q5l4k5L0j2lM3l6p5R9lK1k1j5j1k0R0r8K4L9k9K5m7J00l8n8M5l5K1j8
6776bNkm5O5k3j6L0ol1JJ8J8k5J9M2k8j9k6LJ9o4M6J9RJ9k6j8L6p2K9N4j0Mn0
6810b7j3P2o8K5kk4O1K7j06N5Pk8j5oJ5K4L7k2nL8p7K0J2mL3m2J3K8k1k9M6l5
6842a1L9p0J03n5O%L5j6p1M4rJ4o6M5K4k8kK0mj7m4J0M3L8j5l4L0o3M3jM2m5J6
6875Al9K4kK0k5N2Or8OQ8jj3m7O0ok5l1L7Pk1K4Pn6j8P9k5l1jL5p3L0L8%qm9M2
6911a3j8K6Ok2M0J3m0OK5k4L0l5LM7m8KJ0J2k2J2pk4J4J1KlL6p9LP0j03R5Qj2
6945B1m8j7l5J14m6K0k3P6m4K1j7l2K6J2q0N7J3k5O0l0k8m1O7m3N6p5N2M2m6M9
$$ y = [9, 2, 21, 32, 6, -18, -8, 30, -19, 4, 6, -15, 40, -21, -1, -6, -40, -29, -53, -11, 27, 42, 64, -1, -46, -26, 31, -33, -8, -34, -24, 18, -19, -46, 39, 5, -20, 10, -2, -5, 38, 2, -73, 26, 23, 44, 23, 8, -3, -23, 67, -31, -7, 32, 3, 28, -19, 81, 43, -15, 30, -5, 16, -2, 3, 1, -44, 21, -2, -18, 12, 6, -25, -24, -6, 12, -13, 6, 48, 20, 1, -25, -22, -3, -67, -21, -2, 7, 26, 0, -18, 18, -54, -25, 29, 19, 23, -27, -40, 32, -36, -11, -13, -37, 24, 51, -55, 0, 7, -21, -36, -42, -27, -3, 34, 12, 7, 45, -32, -12, 0, -4, 29, -13, 0, 28, 7, -22, 24, -11, 28, -42, 61, 6, 12, 12, 47, 31, -40, 4, -5, 9, -57, -12, 12, -16, -18, 2, -2, -19, -63, -53, -10, 28, 13, -21, 9, -54, -11, -12, 30, -15, 1, -38, -14, -16, 4, -21, 31, 37, -61, -55, 33, 32, 19, -28, 32, 26, 1, -30, 7, 14, -7, 17, 24, -32, -50, 29, 4, -27, -28, 7, -66, -36, 2, 2, -6, -55, -13, -31, -5, 1, -21, 19, 32, -8, -2, 23, -1, 29, -6, -3, 44, -4, -2, 8, 20, -2, 10, 3, -21, -7, 4, 6, 3, 39, -40, -37, 33, -70, 25, 33, 21, -27, -44, -79, 35, -11, 9, -14, 62, 18, 39, 22, -10, 16, 28, -52, 5, 18, -7, 53, 23, -5, -46, 21, -22, 34, -41, 11, 53, 7, 56]
6975E6j16P3j7l2pL2j5K7j9k9LJ7l0J3P6m9k4R2j1l2j6q7P9M7l6K8m8k9O1N3l4
7006B6o5J9pK7QL6r8J03m2K6n1j0K0l4P5k3n0K9O9l9l5l8Q9o6J7K3K5k2q5R0n2
7037c5j3O3l5K4k2M6o4O8k5rrK5o2O7J7r6J27r0K2j7J5Kj0M1j0J9P3j45m0J38
7067F5m6l5J00o0lm9l3K4K6J7J3l4QJ8n6N7k5K9n1oM9m%j2M0q1L4L1l8ppMN3l8
7101a7j4L1J7l3J8Mn4Q3p5N8j5K9j0o7K3L9jj9oK5KmL0m1M0m1N8p0rN8p2O7j1
7134B3k0k6M3j0L7q8O9J3k2l3J7K0l7M9l8m5N5l3M9n3J09j14K7J3l8J1J6J2j8
7163a2j4O6n9lOL8o7Q0MKk6k3M9j8k4j2k0J05k8K4j5n0k6l2J15j05M6j5j1pN2
7194B0m2MJ02m8q5N1J9M6q2P7m4l0l3R2n4j1J6%j0M4o1P5J1j9n2Qn0M5M3L4k9
$$ y = [56, -60, 13, -4, -36, -43, -11, -26, 1, -18, -47, -44, -27, -57, -44, 32, -17, -41, 51, 40, 8, -8, -95, -16, 31, -5, 23, -25, -54, 7, 60, 26, -39, -20, -27, 0, 8, 44, -54, 49, 7, 33, -18, -28, -8, -42, 33, 10, -40, -11, 58, 19, -16, -54, 35, -31, -14, 9, 34, 12, -73, 17, -35, -48, 15, -20, 4, -18, 28, -36, 32, 7, -2, -11, 14, -48, 19, 36, -60, 67, -23, -1, -18, -3, -1, -11, 30, 20, 39, 112, -33, -73, 65, 19, -16, 84, 24, 21, -28, -61, -37, -11, 6, 19, -15, -7, 11, -45, 12, -13, 16, -35, -41, 8, 4, 4, -8, 32, -49, -15, 16, -22, -29, -36, -32, 21, -17, -31, 0, 17, -16, 2, 6, -48, 35, -40, 18, 3, 32, 22, -45, -22, 17, 16, -3, -9, 16, 18, 14, 44, 3, 43, 2, 60, -10, -19, 39, -33, 34, 23, 3, -23, 20, 10, 47, -41, 28, 41, 19, -14, 3, 23, -14, 35, -3, -48, 7, -26, 23, -30, 79, -35, -8, 5, -33, -22, -6, 6, -12, -26, 40, -19, -22, -16, 22, -45, 35, 39, 41, 15, -8, 41, 23, -1, -13, -33, 72, 44, 68, 53, 3, -23, -55, 60, -45, 1, -14, -25, -32, 20, -22, -18, 84, 36, -49, 2, 21, 67, -15, 62, 18, -12, -45, 47, -7, -18, -2, -2, -12, 32, -29, 46, 57, 38, -14, -6, -56, -11, 32, 66, 37]
7225C7k8J8j5M6Qj4j00O8o4J12o2k7J3m7N8j3J8n1M9kln0M1m5N7J9j2j9k5K0K9
7256A6j5k7L5l4J7l7J11p9L7j3j3k4oL8k0K7j0ql0O2l2l1N7m1NJ6jJ6Ll0K6M2
7288E7r2L3j2O1q1L1K3J3o2N1j0j3J2j6PmlL7o5O0rj3n1M5k3l9N3O6l2n8OM5m2
7321b5O5Pj3l6m2N8k5J5j3P6m5k1j3Mk3PQK9Lj7m9R7p1O2o0n2N1O0Pj09J10k2
7353B3Nm1qL0J0k1j4j9Jj0M0l2L8j3pK1qm7ON5m4N0L2l4l6K0O0n2J1J5o3N6j01
7386g7P9J2k4N0n7LoML7J0j8L7l4j2l6J7k8lM4k4j3O5n8L0K2m2P1o6k6RL0k1M3
7419A8K9l8pNK5J8p6L0oK7o9KP1mLl0N3l2mOk7j5ol0P1lMn4Q1lo1rM7l3k9P7J
7456C2n4L8K7l5m1P0k3j1k9P1k9M5k4jm5M6k6n3K2L4kqM1p1J04r0jL4l9N7m7J2
$$ y = [37, 9, 27, 12, 58, 66, 52, -48, 20, -44, 68, 6, -21, -8, -55, 3, -10, 8, -43, 6, 4, 1, -49, -8, -53, 4, 23, 11, -8, -33, -13, 16, 1, -26, 9, -25, -8, -45, 66, -13, 24, 11, -2, -26, -32, 6, -14, 13, 3, -5, -35, 27, -5, -36, 21, -20, -15, 1, 0, 16, 19, -11, 15, 57, -35, -2, -14, 47, -34, -3, 20, 33, -29, 22, 12, -1, 11, -5, 2, -2, -5, 32, -33, 27, 18, 5, -46, -1, -24, -63, -10, 56, 24, -34, -28, 17, -25, 40, 47, 34, -2, -44, 14, -11, 4, -9, 67, 22, 1, -12, -8, -31, -24, -16, 13, 16, -1, -50, 47, -24, 38, -22, -74, -23, 37, 44, -65, 45, 23, 28, -13, -21, 9, 19, -2, -16, -35, -34, -44, -4, -36, 2, -11, -18, 3, -5, -52, -46, 9, -35, 15, 47, 13, -23, -3, 57, 5, 16, 31, -32, 24, -77, 2, 14, -10, 40, -17, -14, -20, -16, 21, 31, 13, 50, 16, 4, -32, -15, -43, -46, -2, -26, -39, 26, -32, -2, 20, -22, 49, -17, -43, -34, -4, -25, 18, 47, 9, 2, 7, 32, 50, -26, 4, -2, 25, -44, -42, 29, 25, 28, -2, 51, 19, 15, 21, -6, -21, -27, -57, 14, 11, 15, -39, 42, 39, -22, -31, 16, -17, -46, 31, 32, -22, 16, 43, 8, -33, 37, 14, 3, -26, 45, 16, 61, 37, 36, -9, 37, 11, -42, -20, 14, 12, 4, 45, -26, 78, -12, -13, 21, -18, 39, -8, 4]
7488Dk6J6MM5m1%k2k6L7j5K4k3M2J9j6l5K0l9J0K4l1K5J1j7PK0l2J9j9M1jNRl8
7522Ak2L8l1QK1n3N9nPMl9N8j8MNLj5q6O5L4m2K3j6L4o0J0j8qLnN1k0j7L7LK3
7558C6r1J03k8L2Kj8n9J7lj0L2j3qK6J0m3O4%j6m2k2J6L5o0J10j00L0l1J9KL7
7589B7m1j3L3k9M5Qm8O4J3q9K4n6Q1J6L8o3o5N0lL5n3O4l2l3L4%l0N9p7N0j4r
7621a4k0K0j0J8kj9J0j4L7k3k3O3l1M8n2J2L4o5K6L1k6j6M1j17R9M1l0n8L1j1
7651b0k5M0J6l7nN1j9J0pO5q7lMl3M1K4j6k9K6J4m3L7N6m4l1M9l8L6l4m4K1Q8
7683F3l0l2NM7q2N6K1n1M0l1o7P2p7J4Q0n9Q8k5m4L1j4M3p4M6l9N3jl7L5p3K2
7714b0m2O8jol5N3n1M6Mom3K9pN1m2kK0Moj7PjP5p3j6RL1k5J6J3n4oM8J6Pk7n0
$$ y = [4, -22, -6, -2, 43, 2, 2, -20, -46, -9, -24, 0, -23, 19, 38, 22, -13, 7, -32, -22, 2, -29, -4, 7, -10, -3, 17, -15, 4, -15, 26, 25, 30, 39, 1, -21, 17, -14, -6, 15, -38, 21, 16, 23, 27, -12, 46, 28, 32, 37, 40, 25, -61, 4, 38, -4, 19, 3, 37, -23, -13, -31, -39, -36, -41, 10, -10, -27, 10, 13, 36, -55, 48, 20, 52, 54, 36, -23, -6, -9, -19, 13, 0, -8, 18, 28, -15, 49, 49, 33, -9, -31, -15, 20, -40, 70, -30, 0, -31, -12, -10, 27, -14, -27, 6, -23, 22, 30, -18, 46, 59, -30, -6, -62, 19, 35, 73, 10, -55, -5, -8, 27, -26, 38, 6, -27, 7, 7, -23, 36, -41, 9, -5, -14, -34, -14, -24, -6, -8, -27, -17, -31, 6, -17, -40, 23, -8, 40, -12, 0, 34, -31, -5, 26, 0, -16, 25, -92, 7, 48, 18, -40, -9, -20, -45, -5, 11, -26, -31, 20, 1, 11, 4, 69, -18, -21, -17, -50, -9, 15, -1, -30, -4, 10, -33, 4, 60, 16, -15, 34, -4, 32, -2, -46, -25, 63, 33, 1, 6, 53, -29, 27, 48, -3, 37, 6, -61, 11, -66, -52, 28, -31, 57, 32, -12, 19, 5, 48, -26, 20, -19, 34, 33, -4, 31, -42, -20, -62, 6, 5, -1, -36, 17, -34, 12, 16, 10, -33, -4, -11, 40, -2, -4, 16, 20, 14, -3, 4, 3, 78, 5, -11, -2, 29, 4, 20, 33, -21, -27, 21, 37, 44, 17, -33]
7751c3N0Nk9kn3KN3RK2Kp2L6rL0j5L3j9N0o9k9M6l2lL8J8o1P4k5k6l2M7M8p6L7
7785A5Oko5M7j0llm9M9j4K2O3n7L0k3r6P6nj0rR7mm6J0k8K4m9K3L0k9k3R5n2M6
7819E6l0qk0k2O5k8j2kL5oj7Ok8o2K8K3L0l9OJ9j0O5m2L9j2k7j9O3q8L1k3M1N1
7852F3q0L7j7J3J7p9M2k2L7l3K6M5p7K6Oj9K0jl0N8%o7O1k1l8K5k6L5JO1m0k9
7884fl9O3l9J1m0L5jN6n1j6J4K5m5K6K9k7K2j2no5Q1K2n6M9k9j8m2N1l7O5j8J8
7916B1L5n0L0m7L0K5J1m0k1O%j8J4J5KK8m4NM2m3n8M5k5O8l7ON5l9j3k7O1n2q
7949b3l0L8K4j8R4j15QO6o0M3o0J4l3J1J9Kk1J8jL2l5M3r6O3J1m3P3l5N8o1JK4
7981A1J5n0j9P0qj4ppK5m4L5L9m4k2jL7j4jnnO1l0n6L0j0lN5j13O2J0j2N6o1L1
$$ y = [-33, 17, 22, -7, -9, -62, -60, -7, 2, 24, 26, -46, -10, -19, 11, -4, 29, 10, 60, -9, -38, 8, -24, -27, 11, 29, -32, 42, 17, -9, -41, 6, 54, -22, 15, 21, 19, -46, 1, -9, -12, -15, -64, -15, -29, -7, 56, -1, 29, 6, -90, -14, -19, -29, -38, 59, 55, 9, 19, -9, 15, -34, -11, 19, -10, -33, 62, 10, 56, 26, 18, -2, -24, 41, 13, 1, -1, 34, 28, 11, 17, -11, -73, -45, -22, 8, -31, -25, -6, -16, 49, 7, 46, 34, 7, -12, 51, -37, -6, -29, 12, 63, -17, 20, 3, 16, 33, -46, -4, -26, 11, -22, 4, 49, -28, -2, 4, -15, 5, 4, -26, 32, 32, -35, 26, 5, -33, -8, -34, 1, 2, 63, 23, -6, -45, 18, -21, -10, -50, -15, -16, 40, -11, -27, -13, 12, -33, -7, 22, -5, 17, 5, 0, -65, 16, 38, -18, 31, 2, -16, -58, -7, -44, 21, 3, 21, 56, 6, 36, -11, 19, 44, 55, 15, -6, 0, 0, -18, -4, 11, 13, 41, -3, 2, 44, 1, -57, -12, -37, 31, -6, 0, 55, 16, 3, -24, 37, -15, -23, -53, -15, 9, -9, 85, -30, -22, 44, -16, 27, -33, -19, -52, -41, -22, -20, -41, -23, -24, 8, -27, 16, -80, -17, -6, -49, 24, -11, 47, -14, -13, 11, 26, -24, -43, 27, 19, 5, -2, -9, 16, -28, 7, 46, 2, -20, -21, 16, 2, 1, -4, -9, 52, 22, -34, -4, -14, -17, 38, -75, -13, -3, -15, 41, -20, 11]
8015A1k3q0N1L0l0K0LpO9m3l2J8J3J4K1Kn9j3KjM1mOm4mL1j0L6m7K7Pm0KP2p9
8050d0J7k0JM8j8l0P4l3l3J29j26P0n0m1N1m1N8J0j3j0j2K2J3N4p6Mkl8Q1j13
8080f4O2L4K3r3K6knk1L0j3Nk1PK0l7j0O1kNNl5K7n2K8JP6l4j5rj9J4K2K3k0R
8115B6K4Lj4l5O8o8l5K9rJ4nm6P3K1p5R4r4L7K9k6k4j5O6n9J7KJM1n7jM3m7K3
8148AMJ6nol2K3l7J7L0J7m1k4K2K6M8q9J6%J7pK8n7n6J22p4kj1M6j2%K8m4P4J4
8182E2n6k1J1J4M5jm4j6j2
$$ y = [11, -12, -92, -41, -11, -41, -21, -18, -25, 44, 1, -31, -13, 0, 14, 35, 37, -22, -35, -33, -34, 7, 3, 9, -35, -39, -8, -18, 18, -29, -2, 5, -35, -33, 39, -40, -23, -43, -42, 6, -12, -42, 32, -1, -34, 95, -31, 39, -11, -52, -1, -42, 16, 26, 13, 3, -9, 13, 26, 80, 4, 8, 6, -32, 49, -64, -2, 32, 55, -38, -12, -14, -19, -40, -10, -23, -18, -39, -32, -12, -49, -59, 2, 0, 5, 10, -25, 2, -50, -22, -21, 55, 21, 6, -3, -22, -8, 14, 37, 17, 26, 50, 53, 39, 4, 72, 4, -31, -2, -11, 3, -2, -48, 25, 46, -29, 65, -29, 8, 37, 11, -13, -28, 38, -21, -4, -2, -1, 40, -17, -18, 25, -22, 1, 5, 21, 16, 10, -22, 1, -36, -19, 11, 28, -13, -37, -15, 11, 59, -30, -14, -14, 3, -4, 24, -33, -89, 33, -41, -43, -54, -8, -20, -20, 8, -36, 38, 52, -4, -25, -14, 0, 45, 44, 0, -16, -28]
8191b8
$$ Imaginary data points
##PAGE= N=2
##DATA TABLE= (X++(I..I)), XYDATA
0@%%%%%%%%%%%%%%%Qj6J6j6J6j6K4l2L2m0M8n6O4p2Q6r4J04j20J36j56J80k00
37a04K24k56K86l18L52l88M29m74N25n80O40p05P77q57R43j040J148j266J399
56G35j551J725j925K156k431K768l187L720m431N435o968R635j5627N4368L462
71D7884p9536J2259L6182j033m9623K1105J2936J101l6810Q915L7068m03j5204
84e159j0335L8534L965l2556L772K3734J0809m8969n600K8744J2406k8796k4480
97c3931L4039N565j7945j1578K6829K3518l1167j2360J6956K9903j7176k4684
109a2031J5270J4782r039l2599J7855K4776j7910k4619M867L2309j0511j8786
121a5636P929K3193k825k8591R800K2819M110k8246q131K7505m77k0805o460K5859
$$ y = [0, 0, 0, 0, 0, 0, 0, 0, 0, 0, 0, 0, 0, 0, 0, 0, 8, -8, 8, -8, 8, -8, 16, -16, 16, -24, 24, -32, 32, -40, 46, -48, 56, -64, 72, -84, 96, -104, 120, -136, 150, -168, 184, -204, 225, -249, 276, -304, 336, -369, 408, -449, 494, -546, 602, -664, 735, -816, 909, -1016, 1140, -1291, 1477, -1710, 2010, -2421, 3014, -3954, 5681, -9946, 44422, 47884, -31652, -19393, 16789, 15756, -33867, -12762, 174, 1275, -35535, -26620, 10448, 10045, -5159, -15494, 23040, 27005, -5551, -1779, 21955, 32764, -16205, -21805, 6939, 19345, -9451, -33931, 108, 5673, -12272, -23850, 2979, 26497, -4670, -17030, -74, 29829, 12653, -12031, 3239, 18021, 8982, -23617, -5762, 19014, 1104, -23515, -18648, 13661, 3150, -15636, -7707, 15486, 12661, -15930, -6130, 16689, 20799, -7447, -15578, 11927, 11450, -9355, -15815, 10044]
135A0044M247k5636o433J9558J4954k2804r793J7973J1067j3775j5330K1140J3406
148A8618j7783j7201J5880J9681j4794j6124P068J7267j0890j8925J2321J7259
160A2377p374k1867O140K1554k309j7112K786J9350m836j7762J362J9566K698
173A4573k2175m723J7180M508j7166m798J6938N238j7020p781J9283R752j5219
186a410r309J3298J1247j2562j0945J2293J1331j3829j3229J0329J2591q116j5038
199a3349P184J4482n998j2858P004J5210n029j5231K775J7065k154j5821J559
212e161J2101j371j4304r8J4642J798j4499l783J4273M262j0673m742J2031O285
226A0761j3982n797J2171P615j1366q860R533Q125q560r938J0079Q881q788q847
$$ y = [10044, 14291, -11345, -17778, 1780, 16734, -6070, -15863, 2110, 13177, -598, -15928, 5212, 18618, 835, -16366, -486, 19195, 4401, -11723, -4655, 12612, 1722, -17203, -4882, 12377, 5003, -16864, -10724, 10830, 8521, -8591, -5805, 13545, 8709, -9053, -7691, 11875, 14573, -7602, -12325, 4855, 9363, -7803, -12601, 4337, 9575, -7445, -15226, 4057, 13809, -1410, -10719, 2579, 13826, 1264, -9681, 2612, 13943, 114, -13115, -2786, 9805, 1689, -13349, -6165, 8317, 2319, -10539, -3535, 11675, 6646, -8585, -5810, 11255, 9101, -6720, -5161, 6940, 5569, -8735, -8833, 5809, 7607, -6892, -10675, 3598, 7860, -2813, -7555, 4476, 10761, -3221, -9018, 3153, 10768, -598, -9458, 75, 8200, -360, -10298, -219, 8662, -126, -8973]
240h973O531J2023o481j1179N161J0875m111j0968M262R858k450j2329J491J3244
254F954j679j0298q13J0522R07j0555m69J0681K066j2084k380R537L803p913n193
269f914R518L631q685m362Q227O413p835o309N927P486o756p203O789N775m832
284H70q029M928Q561m612p581L331Q396l081p158J803P625r59r430J902Q149o01
300D114p972j235Q091O89p277j009Q246J015p772j502O341L958o577l339O265
315B036K249n692l542N677M121m947n173M536N354m819l894L750M723l100n901
330d622L533N458k816n299K335M895j691m907N73N829j175n499J132N030K25n488
346b487p45N291R81n163o62M971L83m350j697M767K572m618j941L691J689l489
$$ y = [-8973, -2442, 9581, 3100, -8079, -2918, 7957, 3846, -7122, -2860, 6998, 4548, -7781, -6290, 6954, 5275, -5023, -5836, 4686, 5593, -4962, -5431, 5250, 7316, -4768, -7148, 2389, 6192, -1721, -6914, 2604, 6235, -2450, -6812, 1415, 7828, -7, -6316, -389, 7097, 341, -6862, -73, 5702, 870, -7159, -2231, 6330, 1718, -5863, -2532, 5864, 2783, -4375, -2572, 5053, 4094, -5336, -3434, 4715, 4114, -3858, -5093, 2998, 3687, -3590, -4599, 3647, 4662, -3110, -4612, 1729, 5687, -890, -4229, 2036, 4285, -1407, -4949, 728, 4849, -98, -5271, -735, 4619, -200, -4094, -344, 4379, 1279, -4622, -1089, 4369, 1553, -3746, -1411, 3484, 1793, -3114, -2541, 3288, 2113, -3386, -2254, 2776, 3001, -2487, -3232, 2059, 3040, -2123, -2785, 2186, 2569, -1781, -3478, 1289, 3861, -757, -2698, 993, 2682, -807]
362h07k162L366K945l395l656L232K993k419k553J967L453k285l616K442L466
377B971j835l030J179K728p07l700P31L452r31k866L44K892M74l256m39L683M18
394B108k974k80K470N62k832j236L203J107l119j102K036J088j632j304K248J920
410B263k376j618J864J696j026j914Q53K036j636k283J603J880r53j792M53K239
426A289n89k179R39J817m32j322k13J374N64k198j92K018R2j602o91J484R34j796
444g03n14K187L17j823k98Q77P88q46j050J379P10j246p13N52J191j58j469N83
462b36J409j266j100J066J080l10j440K01J118n18p94P52N52p8o10n62J278M90
480A032j402n6R30J74j132n11J210K76j383K68J233l34n56j39K03Q37k08m47M68
$$ y = [-807, -2969, 397, 3342, -53, -3709, -477, 2516, 97, -2456, -489, 2964, 679, -2937, -495, 2971, 1136, -1894, -715, 2013, 1306, -2394, -1663, 1789, 858, -2008, -1664, 1228, 1702, -1554, -1993, 1690, 2108, -866, -1146, 1324, 1886, -946, -2182, 1021, 2128, -991, -2093, -57, 1031, -601, -1905, 343, 2263, -113, -1731, 133, 1829, 803, -1111, -258, 1778, 142, -2141, -538, 1342, 389, -1403, -950, 1289, 700, -1479, -540, 1277, 845, -477, -690, 684, 1248, -950, -1142, 876, 968, -634, -1325, 159, 1093, -703, -1217, 970, 1287, -536, -834, 43, 831, -15, -1065, 314, 1024, -222, -935, -383, 808, 650, -819, -236, 1173, -93, -1193, -127, 953, 643, -797, -596, 522, 4, -790, -38, 514, 436, -174, -736, 542, 1032, -370, -426, 504, 678, -454, -965, 245, 521, -862, -594, 639, 305, -251, -390, -187, 650, 442, -5, 463]
499D63l1n26n62L13J160n47j394P37O91q64J03O57L65l23o38M87N23m19j67k3
519EO7M26p72m83R41j72o74M04N73L4p59j04J008K4n31N13j84m03Q4m17L06N60
541D46o06l22K30J91ml14M27O09p07l04Q12m34j86L14n9J80p5n02QJ53J28N7j50
564a08L28J12r04L14Q43m80q0J22k07K0j82J39M14l12kJ36l17K43J9m71M48K48
586C23l93P2j16j2K1j81M95K11o21P6P8p8M40O1k96J72l37k34J87k3K59r3l51
609c40L82o0k93M21L4k6K42l53L9J98l75J31K42j86K0l30k22L85j31QL79j11K9
632H3J9l27M84K07l56lQ7k84j08j55K07K78l37k2J98j64J97j5j2N39j05n20K52
655A43R5k16o3%K95k68n87M49J67k94L04l6Q2J91m11j8M28j04K4j42J4K15o00
$$ y = [463, 432, -94, -656, -343, 817, 270, -1124, -387, 304, -560, -457, 200, 565, 242, -396, 91, 614, 195, 28, 5, 72, 498, -274, -757, 184, 12, -662, -258, 315, 349, -410, -514, 494, 518, -13, 500, 316, -87, -3, -420, -114, 446, -160, -482, -252, -61, -65, -379, 48, 657, -50, -354, 458, 24, -162, 152, 93, 273, 198, -304, -296, -143, -15, 42, -108, 220, 332, -572, -258, 585, 105, 25, 147, -60, -40, -222, -83, 331, 19, 17, 153, -164, 79, 98, -373, 75, 323, -70, 2, -114, -126, -105, -286, 209, 420, -201, -125, -47, -125, 315, 376, 80, 252, -85, -319, -132, -155, 104, 11, -340, 42, -18, -311, 110, 144, 118, 360, 7, 46, 244, -131, 0, 242, 56, 76, -254, -476, -91, -222, -214, 165, 54, 83, 102, -225, 259, 466, 110, 107, 194, -90, -198, -353, -146, 132, -205, -227, -29, -193, 4, -11, -23, 516, 411, -109, 143, 238, 22, -41, -41, 254, -14, -601, -152, 15, -279, 25, -11, 71, 262, -149, -167, 261, 157, 181, 39, 53, 268, -332]
678c32k10P92j38m40K63k2J9k2j45N41J34m32Rj31K13R9m77K65N17o22l43M23
700c9K28j63j97K30L76n42k10M40j38J59K5l19K77N6n79J52N04qk93k70M90O0
722B39o77K77O10l07k58j03Q9K13k69p2N86l3l54j02j9N69k25n22O19J96o93j15
744c51L26K28q3m45L37K54n88J0L37J59K04l96j85N28k23n70M38K34k5l77k28
765d16N90n7o20M19M17j41j80l21L83L11n28O3M83k53l14k39K18N28m16k06M83
786B04j5l39n1K00L94j53n46M30J42m20p9J80L21k5o00J67M77m16q9K21K48L6
808B87n60K7N75k26l38K29K15n9l82k40O92K1m00J84K24q6k40l01M89K78n36o
830a53K91r7k01k49L27N61n41k56M43J01k02j18J31M75l45o43L52K55k40n7J9
$$ y = [-332, -542, 250, 112, -328, -65, -87, -68, -90, -235, 306, 440, 8, 17, -114, 99, 198, -279, -14, 503, -119, -462, -39, 189, 26, -171, 59, 435, -107, -317, 123, -15, 144, 169, -150, 127, 183, -396, -244, 260, 252, -41, -311, 179, 239, -438, -161, 449, 142, -116, -219, -130, 83, -186, -258, 328, 295, -59, -161, -180, 389, 164, -358, 261, 457, -236, -351, -25, 203, 120, -325, 12, 266, -322, -312, 25, 184, 388, -8, -193, 335, 112, -458, -20, 214, 189, -188, -416, 174, 117, -503, -84, 333, 192, 12, -309, 74, 385, -143, -80, 403, 150, -164, -403, -185, 343, -73, -279, 204, 189, -150, -201, -1, 393, 240, -306, 124, 266, -154, -233, -53, 268, 243, -357, -190, 287, -129, -218, 3, 251, 287, -273, -246, 329, 103, -235, -6, 209, 150, -232, -472, 220, 241, -159, 25, 249, 163, -77, -378, 111, 389, -147, -153, 138, 41, -160, -409, -82, 479, -62, -318, 125, 226, 24, -94, 37, 512, 167, -476, -124, 131, -109, -166, -147]
851a47L32K9o97K28N70k25j59J08K18P9o65L5O93k30l72J15NK15l98j78O88R7
873C41m83L7J95J20j46l27M99K59o29j71K63N7M1l87L28L66n22l00M74J64Lk52
895g0k7N05k65n77M29L07k03j44j83L65Nn65K91M51j97j53j31K21K30n60N2N91
917C72j09l38j14J57L25l83k15N88L5n28k6J50K33K3m40L76J72m35j47L19J88
938B03L6n20K11M40m84j96L93J89j22k75j03M05j40l85L14J74O9k59k70M92J34
959C06n40K14L20j38k47j75L10K06m14K2L57k66j08k9L1M74j92l56L47J19l68
980a27p5K13K46j55m52L53J64m11R0J85J02Q4m25Q0L55j35j88J90L9M1l39j34
1002b99N61k18l55K54Q2m0j21r1L69P7l58J56L1No4j86J47L63l15k44L04r0o6
$$ y = [-147, 185, 214, -483, -255, 315, 90, -69, 39, 257, 336, -329, -294, 399, 169, -203, -88, -83, 132, -266, -444, 244, 341, -142, -105, 90, 210, 64, -263, 236, 495, -134, -305, -42, 15, 56, -331, -3, 363, -159, -459, 15, 179, 182, -70, -97, 408, 143, -434, -5, 302, 99, -45, -228, 137, 142, -423, -132, 319, 122, -31, -162, 59, 289, -271, -219, 372, 263, -75, -189, -32, 293, -90, -305, 283, 318, -210, -236, -86, 147, 170, -270, 106, 278, -157, -304, 15, 203, 239, -281, -70, 370, -114, -310, 83, 272, 150, -125, -228, 177, 37, -348, -34, 140, 209, -50, -320, 172, 306, -234, -20, 300, 162, -85, -260, 50, 256, -158, -136, 221, -45, -153, -182, -151, 323, 131, -225, 122, 241, -127, -202, 11, 257, 102, -350, 3, 167, -244, -154, 31, 133, 217, -208, -128, 227, 92, -96, 94, 133, 174, -165, -299, 262, 44, -311, -57, 25, -15, -136, -227, 142, 219, -139, 17, 48, 53, -11, -197, -50, 313, -2, -246, 58, -32, -98]
1025i8n4J37L24l04j75K82m4p9O9r9K33m5m23K06K09j90No6K65j1l74J01L76k64
1049a9K5Q3j27J50k16j55M30k8l01J06l3O4k6j77L89K4k81L9K5J7J22k03M3L55
1073C06m11j65K66pN9o6l6L27k90j52L09p9nJ32k70Q6J19l36J88R4JJ3k40J72
1097A5J51l28J32K59k25l4M7j47J61l6j00J76m9n6jj86K61J32l24K55J12l02K5
1120f2M4R3O3j81R0lk52K28M5j25K87n7l66K82j2j83J03P0J6J0k15J53L6j95K43
1145A12p3j28K21k10r4K46J1q1Nl0M5j71j7L42j84q3K20j98K8J08n8P9N8j35%
1170A3j05k1K03k11O0K87l14j03J84l0N4J9j1J01j64n7J65l3rL3j79J11L9k69
1194b37J84J33j02NK5M8O3k12J10J85j61m6jj34K05k5j70K18m1j51L5m6J74P8
$$ y = [-98, -152, -15, 309, 5, -170, 112, 68, -11, 58, -41, 192, 147, -276, -70, 139, -51, -46, -112, 153, 142, -232, -131, 245, -19, 6, 89, -38, 112, -104, -259, 171, 143, -158, -52, -85, -21, -47, -224, 165, 189, -92, -53, -28, -11, 111, -92, -49, 306, -105, -270, -4, -11, 48, -18, -54, 273, -17, -169, 140, 61, 56, 188, -82, 4, 123, -213, -25, 69, 70, 83, -157, 15, 166, -162, -30, 229, 4, -30, 17, -130, 31, -5, -105, 71, 22, -34, -35, -221, 40, 172, -152, 103, 215, -87, -62, -18, 75, 138, -43, 47, 44, -208, 20, 65, -60, 227, 170, -196, 86, 74, -109, -6, 64, 80, 90, -125, 28, 64, -131, 112, 39, -89, 132, -78, -172, 74, 85, 4, 9, -21, 24, -147, -164, 178, -6, -89, 131, -67, -39, 69, 11, 90, 148, 13, 13, -92, -113, 90, -121, -61, 226, -88, -191, -7, -37, 17, 36, 25, 126, -38, -95, 70, 37, 28, 61, -118, -7, 32, -237, -53, 80, -22, -17, 8, 56, 119, -93, 17, 202, 41, -5, -6, -140, 65, 40, -130, 88, 47, -104, -69, -115, 59, 137]
1218A37k23K29J7k28K5L8jJ64j92lJ07j75l7R9O4J10j92o9K84r4k43K64n0P2q7
1243A6j08J51j0k89K57J32j59l4p2Q7J92k66rK74q1j59l7O2J99j38j37K95q3j52
1267f9k4L6K04m2l64K74J04k07q0J49J81m1l14R6L32l10NJ13M9Kj92r6L05p9k63
1292b31K69P3lj82j88M06O6l47J03J34l0k07j13L17K78m25o6K61n8j43j17J73
1314c0L31l53j77L25O0j88j20J40L20j91m31L28K08k37j01O7L06j09m74J45N08
1335C27k33l19J90J88P1m65L1N29q1m14J2K90L9l70j50N60J62n60k7L33R8l11
1357a00k25M42L49o31j94M03K39k56l56L80L71m31m63M84L13k66l45J63N28k49
1377A56o68M02M64k02l91O4M96j21n91R7P37k33n19k9N80J00o59r7Q09m6n79j98
$$ y = [137, -86, 143, 160, -68, -43, -5, -6, 158, -34, -37, 70, -105, -142, -43, 21, 131, -61, -130, 154, 60, -183, 81, 31, 103, 16, -92, 59, 49, -240, 17, 149, -10, -44, -116, -29, 163, -103, -112, 162, 81, -78, -115, -53, 146, 8, -129, 166, 83, -69, -93, -57, 147, 105, -259, 15, 119, -88, -168, -19, 162, 121, -193, -97, 235, -75, -70, 43, 92, 94, -98, -194, 111, 32, -231, 38, 111, 108, -74, -262, 144, 210, -137, -34, 100, 70, -137, -250, 67, 345, -80, -146, 115, 57, -86, -203, -30, 301, -52, -229, 96, 156, -32, -152, -12, 308, 117, -314, 14, 222, -15, -116, -49, 257, 148, -326, -181, 327, 94, -225, -35, 153, 224, -241, -210, 319, 238, -176, -164, 126, 165, -205, -355, 205, 367, -193, -220, 113, 211, -100, -325, 117, 466, -165, -359, 44, 283, 27, -329, 51, 422, -9, -472, 12, 325, 59, -286, -123, 405, 156, -512, -110, 354, 152, -239, -175, 321, 200, -391, -294, 443, 210, -309, -338, 242, 342, -317, -414, 395, 349, -230, -428]
1399d28N38K65n58l05P42K01o66j97M30M64m91n14N81M91o21m17N01M45k96o34
1419d69L19P19m84o18M29O05k11p33Q6Q31j48p98K16P43j35o91k02Q84J58r49
1439d48J1Q29L9p13k68O95M10p73l57Q64K34p16m43O87N89o42p10P21N90o25n76
1460f02N55O91m36r11N51Q23n41p33L43Q26j84j016K03J067k20r76K21Q52k6r64
1480d77r0J052N5r96m2Q78K25r48m36J111M31j035m43R47M30q35o10Q55P56q55
1500b7p51Q22O12o19p86O20R92p14r44O04Q99m37r30L73J010k33j307L97J069
1519F50k56r63L5J036Q5j140j68J303Q9j077k38R65M01j086m19J175M49j135m72
1538g66R33N58q72p73R86Q30r59q14Q18P94n96r98O21J181p34j096O43J064m12
$$ y = [-428, 110, 375, -183, -488, 254, 455, -211, -408, 22, 486, -5, -519, 62, 553, -68, -485, 16, 461, 165, -469, -150, 569, 85, -533, -104, 501, 290, -443, -357, 474, 326, -472, -256, 487, 352, -339, -541, 343, 501, -448, -437, 392, 431, -282, -550, 145, 555, -218, -575, 289, 523, -193, -636, 51, 640, -2, -712, 9, 599, -26, -602, -47, 644, 208, -703, -152, 671, 130, -603, -260, 566, 382, -634, -431, 636, 416, -560, -339, 513, 487, -477, -567, 485, 540, -456, -498, 380, 605, -343, -779, 332, 763, -272, -715, 232, 662, -173, -783, 72, 828, -27, -778, 44, 656, 37, -749, -129, 863, 149, -795, -191, 708, 271, -659, -286, 724, 491, -816, -419, 650, 394, -569, -534, 502, 587, -553, -721, 582, 671, -406, -644, 321, 722, -364, -783, 392, 841, -294, -766, 167, 725, -147, -920, 66, 896, -63, -877, -59, 735, 139, -859, -238, 943, 209, -887, -244, 820, 408]
1557D08j110K57J246l02j279L05J112n9j136r1J277J0j276m7J262J36j119l82
1575g88J171L98j237l71J260M08j085n57R04P34r01q45R44Q67r00r21P77J029
1593H87o61j182P68J113p21j060N21J080l24j207K60J232l00j166K15J192Q0j346
1611f19j24J424N6j344k2J165K06j140m74J247M95j230m00J012N84r75q39J085
1629A07Q88j035q68R84Q59q55j008O79J230p75j124O88J131o53j044L85J186k09
1647E66j310K23J281k36j166M9J214J12j408j11J383J08j202j76J103L84j234
1664d20m34J194N02j075n23R45O89j010q85J129Q68j036q37Q70Q28o88j034P17
1682b00J130p36j040N52J098m15j155K84J280k73j376L01J195k0j182q8J231J40
$$ y = [408, -702, -445, 801, 499, -780, -475, 637, 578, -558, -649, 628, 638, -638, -685, 577, 713, -406, -788, 383, 781, -456, -827, 433, 841, -244, -801, 103, 837, -64, -909, 35, 902, 2, -919, -142, 887, 226, -956, -188, 925, 204, -856, -335, 745, 421, -786, -526, 706, 406, -760, -545, 647, 727, -619, -743, 681, 737, -607, -629, 536, 742, -398, -872, 375, 870, -360, -760, 252, 836, -139, -978, 107, 995, -40, -908, 76, 935, 80, -928, -249, 981, 206, -918, -230, 901, 248, -796, -411, 775, 566, -744, -521, 760, 524, -642, -593, 621, 733, -675, -786, 597, 705, -497, -673, 430, 814, -420, -854, 340, 842, -233, -756, 189, 878, -132, -1017, 112, 980, -56, -893, -23, 805, 117, -917, -200, 930, 194, -846, -294, 804, 389, -766, -482, 798, 525, -851, -550, 645, 625, -557, -645, 586, 726]
1700G26j355q8J187K31j113k71J064M49j166n41J168M95q83p45R56P39r28q13
1718h88R87P88q51q34O82R69o55j082O59J018n68r76M36J031k95j183L69J101
1736G08l39j074J90J134o0j187%J220Mj194o3J117L01j055m45J056M41j081l47
1755f74Q90N20p51p94Q36P69q70o93P89P54o49q95N33R70n63r83O30Q52m34r31
1775f94L51R72k27j072L35Q97k06q83N1R04J28j083j1R91Oq49k22Q97L84r68m01
1796g00R92L03q61l40P97N49p43p39Q85N38o64o30O04O14m76q50N54Q34n42p17
1816e92M11P15k90q31K37R58k31r26K33P71o5q08p6R77or30k6Q64J5p00k25Q20
1838B95L08q51k66P22K70n62m06O09M61o88m85O81M66n77m66M19O51n39o32M70
$$ y = [726, -629, -717, 470, 701, -412, -683, 381, 830, -336, -877, 291, 786, -97, -842, 114, 853, -75, -888, 99, 887, 36, -798, -116, 853, 198, -884, -225, 793, 225, -751, -315, 716, 421, -762, -393, 708, 369, -705, -515, 619, 559, -628, -628, 592, 596, -598, -661, 456, 757, -298, -743, 313, 754, -327, -674, 216, 736, -15, -809, 27, 796, -74, -767, 22, 776, 127, -768, -235, 735, 172, -811, -181, 671, 237, -694, -343, 629, 402, -670, -335, 562, 356, -527, -476, 428, 556, -527, -538, 453, 459, -390, -612, 285, 669, -299, -700, 292, 595, -266, -606, 191, 740, -3, -742, 143, 681, 17, -613, -9, 605, 129, -721, -167, 667, 125, -592, -181, 534, 244, -587, -350, 608, 377, -549, -316, 455, 390, -418, -494, 483, 477, -453, -479, 385, 400, -300, -525, 295, 603, -248, -514, 208, 478, -84, -490, 119, 580, -108, -593, 88, 554, -23, -489, -70, 581, 42, -590, -120]
1858a20O68l85o28L04O53l04p45K86P80k89o40J54N72N7p26o6P98J3p09l8N88
1879B23J75o36k54P49J56o50j98N90K89n02m05N10M43n83l38N01L86l94m65L35
1899f8N03l28n38L31N93l79m32O1O53j90o00K32N32j66m54r7N81M5o03N5N66p1
1921B26m68o6M93J62n26j51N00J26m38j89L31L62l83m08N02K64l94k19K68L78
1941C70k81m39K41M80l21l84L08L11j23m56J11M79j34l79O6L94p0l92p1N42rm28
1963a85ML62O3m50p9M37J57m84k4L43M8k74j45K55K39l63k55L54K03k00k47K29
1985a2K63j94l86L19K27j97k23J44K56j64k77K08K49r7l27Q5K72Q3m01j7M44l7
2007B18l33J1K01L5k43j41M49j4l60K4K38M4j68j92K78K01l00j66K70N3o6k36
$$ y = [-120, 548, 163, -465, -161, 492, 188, -557, -271, 509, 220, -420, -266, 306, 363, -363, -429, 369, 382, -327, -365, 223, 398, -238, -492, 257, 413, -237, -435, 155, 444, -58, -463, 47, 490, -93, -431, 70, 456, 62, -403, -68, 435, 107, -431, -100, 493, 114, -318, -257, 396, 206, -394, -162, 370, 204, -250, -347, 234, 279, -324, -269, 297, 226, -242, -308, 185, 347, -179, -330, 170, 296, -142, -331, 0, 362, -21, -429, 73, 337, -57, -276, -8, 370, 89, -350, -109, 371, 50, -334, -26, 285, 162, -294, -183, 296, 162, -217, -151, 243, 173, -219, -290, 252, 243, -185, -181, 181, 244, -206, -285, 152, 309, -175, -199, 144, 192, -82, -227, 28, 267, -96, -351, 3, 206, 6, -241, -12, 251, 57, -329, -10, 217, 20, -203, -59, 197, 33, -244, -36, 213, 116, -211, -126, 146, 229, -172, -189, 255, 218, -115, -104, 97, 132, -111, -252, 197, 183, -177, -153, 85, 129, -39, -231, 47, 248, -52, -218, 52, 105, 39, -197]
2029a97J22K98k27k51K97J8l4j55J3K92j51k52J91Q3l0q6K1K09%k86k0L13r1j33
2053e6k8N9J69k09l5J90N6j57p8R3J08r4j90K47N6j73q2J16R9o3j61J32P5j09
2077c5r0J38%M5j45RJ63m9j78J46M2K7j21o6K43n5j66J10J8K5j5j51R3J24k10
2102i8O4J42j24P4k16J52J11q0j25J23kq8j9O4J01p9o4J09L0j13L9rM6J6k00R8
2128d8P6J8j07K9K1J20j74pJ46o1%o2Q5k1pr7J15N4q7n3N7L1nj15J32k6n7%O4
2157B1m8Q1j12mJ48j20L5k8KK5J2m0P7k2p0M7Qk4L9lPKq9M6N4o0N4pJ0ro0j1L6
2190cK6ql7kM9l1OJ8l5j2J9l0J2L7q1R3J0o1N2j9p7R9J0n2O4p5K4k3l3J37p0p0
2222f3J17j05J9K5Lm3J28j26nN0k8J01k2o7OM2q3P0Om7rrJ5K2l9J07j6m8j4K2
$$ y = [-197, -75, 223, -4, -255, 42, 60, 26, -129, -116, 176, 25, -227, -36, 47, 17, -69, -48, 161, 161, -125, -145, 168, 77, -56, -84, -25, 144, -65, -100, 90, 146, -11, -89, 4, 112, 18, -172, 75, 131, -42, -124, -8, 91, 28, -133, -1, 74, -35, -125, 13, 13, 58, -87, -78, 85, 36, -142, 4, 46, 73, -48, -114, 129, 74, -92, 18, 36, 61, 46, -105, -12, 112, -98, -34, 108, -16, 58, -158, -6, 105, 25, -100, 23, 21, -67, -86, -22, 79, 0, -64, 45, 75, -38, 1, -8, 38, 54, -146, -48, 28, 46, -61, -32, -11, 109, -65, -72, 74, 13, 13, -49, 36, 15, 8, -89, 26, 80, -7, -60, -3, 28, 23, -92, 40, 14, -43, -43, 21, -27, 54, -58, -62, 86, -34, 1, -27, -25, 0, 12, -28, 49, 27, -43, 4, 12, -12, 27, 24, 31, 33, -56, -10, 44, -16, 38, 31, 41, 32, -28, -39, -3, 23, 15, -22, -24, 25, -6, 0, 18, -17, -29, -10, -40, -28, 9, -72, 21, 31, -30, 22, 3, -74, 25, 35, -17, 47, -28, -4, -27, -60, 77, 7, -63, 54, -51, -32, -7, -4, -47, 81, -45, -50, 0, -28, 73, 51, -16, -10, 32, -51, 19, 25, -22, -31, -40, -25, -3, -42, 65, 49, 1, -13, 9]
2252Il1O5r8PP9l3J5J1j06J24l9m2J15r1%K8l9N6k4jM5o3m3J09r4jQ1p7O7Kn4
2283b3K8Pq5P4K5n9K8j8mP6m2jN6r1lK1m3N2l1N7J9o3JQ8j16O9K9j35J32n4oP4
2315F2k7m4P0j30J8N4m2P6jj4J0m9oO6o3J6L0m4M8j6o7J43l2r0O2p0K3%Pj6R0
2346F4r2M0K1o8M8k6j5R0o0pK3L2m8K1l3N0j6o9K4j7pP1k6o2J55j41M2N9m5Kj1
2377al3N5p2J8J23p1lm6j1Q9k2o5P7ln0P7j19mJ08p0P8Ql8j4Mk3Q9n4p7N8M3o5
2409a4JL4l4K1k8j1L2Rj7k2J5L9l9QM0j9m4O0OOo4n9J21m6p4J31k0o1R9n6rj9
2441a4OK2O5j11J1pM9j0m4pN6K1j7Pm2Q5n2j0K9Jp8N3q5J14p2k9J07Pj5q1O1l4
2473a4P4j11J9O1l1L8Rnj3n1n8J54p0Jk8M3l7L4k5M9k7l1j4N3l8N3r0mR8n0OJ1
$$ y = [9, -22, 43, -55, -48, 31, -2, 13, 24, -82, 42, 3, -39, 76, -15, -15, 13, -26, 30, 6, 5, 50, -13, -56, 53, -41, -42, 39, -38, 29, 31, -23, 5, 12, -73, 1, 26, -33, -5, -23, -27, 49, 7, 6, 62, -29, -32, -11, -54, -2, -33, 24, 43, -20, -19, 69, -47, 22, 51, -84, 48, -6, -12, 62, 35, -9, 61, -69, -51, 3, -39, 37, 36, 22, 32, -17, -23, 43, -20, -4, 26, -18, 30, 14, -53, 90, 58, -32, 30, -40, -17, -17, -10, -26, 64, -28, 12, 33, -35, 13, -13, -28, 62, 2, -5, 18, 50, 2, 23, -10, 40, 24, -45, -21, -38, -45, 26, 0, -62, 93, -48, -6, 53, 8, 10, -1, -34, 21, -51, -33, 90, 19, 16, -30, -41, 48, 26, -39, 38, 35, -15, 62, -57, -61, 47, -23, 55, 63, 25, 11, 15, -8, 81, 27, -50, 8, 51, -14, -13, 21, -13, 8, -20, -31, 1, 10, -7, -29, -14, 25, -14, -6, 34, 15, -29, 31, 37, 43, -21, -80, 41, -5, -79, 52, 32, -29, 70, 14, 5, -14, -8, 14, 79, -32, -21, -28, 21, 11, -33, -40, 16, 37, 20, 27, -15, 70, 18, 8, 37, 38, -40, 13, -72, 42, -30, -59, 48, 55, 40, -41, 20, -14, 60, -51, -32, 29, -2, 36, 45, 40, 27, -24, -82, 72, 2, 3, -25, 18, -19, 15, -10, 39, 12, -19, -33, 20, -18, 35, -55, -59, 39, -11, -5, 6]
2505FO9j9l3n1Q6l7p1L9L8pmJ2Qm1l4N1j0O2o9oR2l1j26Q2M1p8J4K2pl2j9l1O7
2538a7L0m8P7k8Q2r7o1J14n5l4K1K0K2Ok1n0R2n9j4K2L2K7n7l2O3rr8M5qO0Mn1
2570b2L0j0m5P2K2m8J6KkL9r3M9M6m9j7j8JR7p7J5N2kj26M9J3J5K3q8QL7K3J3
2602B5J6%j5n8J6K9l0jJ8J3j1k2j9N8k9n1J02p1M4qpl8L5l1L1L5o0N1n6M7K3j03
2634f7J09%p5M9o5R3L0q4o8Q4J9l6j8M9j4L1j9JOm4J09j19L5J0m6K0jQjJ7k0K3
2666A6o5N7L0k4n3J31l7j7n0j7K9j3j5O4qp6J18q4Q4l9q6O1mq9J65o6K5l8J6j5
2696@Jj8J9l4K9L7j2p3L5Q2j17J10o6Ok3RM1N6r6j0k2N2jk0K8k5M5m6Mk1K8LO
2729GNj5M1l2j5qJ6j3PN3q9N7l8j0K9L7q3N8m2M9j7j0pm2J9J9L7l2OK8q6P0K9
$$ y = [6, 75, 56, 23, -28, 58, 21, -50, -11, 27, 20, 16, 28, 36, -5, -39, 12, 2, 64, -5, -11, 81, 50, -76, 6, 47, -31, -17, 5, -2, -34, -53, -84, -17, 13, -35, 42, 14, 96, -1, -62, 52, -3, -37, -16, 4, 26, 32, 11, -39, 53, -6, -20, 2, 34, 61, 4, -28, 35, 26, -72, -27, -35, 25, 29, -22, 8, -2, -47, 25, 47, -1, 15, 17, 15, 54, -39, 10, 56, 7, -10, -28, -27, 70, -7, 8, 60, 58, -68, -19, -6, 9, 32, -56, -48, -11, 12, 25, 41, 41, 26, -32, -16, 13, -17, -18, 0, 13, 2, -20, -39, 19, -10, -61, 41, -30, 14, 6, -1, -39, -4, -35, -4, 31, -29, 22, -34, 13, 36, -67, 42, 42, -33, 16, -49, 44, 74, -10, -78, 6, 25, -11, -29, 20, 6, 37, 18, 19, 25, -19, 90, -29, 6, 16, -30, -10, -11, -3, -4, 13, -7, 16, -49, 8, 38, 14, -39, 92, 55, 38, -12, -29, 0, -13, -28, 36, 28, -48, 70, -14, 70, 31, -55, 6, 2, -87, 78, 12, 37, -1, 15, 0, 1, -17, 2, -32, -3, 34, 22, -51, -16, 66, -51, 59, -7, -1, -24, -15, 26, 82, -14, -24, -46, 6, 5, -15, 13, -12, 33, -13, -9, -30, -2, 1, 7, 12, -3, 38, 6, -9, -17, -1, -14, -7, 46, -43, 14, -24, -34, -5, 32, -51, 7, -35, 14, -3, -13, -20, -62, -43, -24, 13, -19, -13, 15, -71, -1, 28]
2762B8j8K5q0N2J0q1P1pm7P5m2K6K9m0K9K1m9%j3o5J00j1j8J5k0O0k3k8m3QN6
2793B0pk9k6M7l4l6N6%J3Jk5M0mm8J8J2l3P7r2P3j4Jp4O8o9J02Rm5mm9O6L4p0
2826b2K7j2l5OO5n3K5Rl4K9l0MM3Ko8M2k2K2J1j7L6m0j9O7j6m9M0o1N7k9L1Nm
2859A0j8L6k2n3L1L1l8M8rJ4m1Pr0R3j2L4l6L4Pp2M7N4n4L4q3j5Q3k3O0Lk3m6
2891iM9rn4M6j2lk0n0M6Ok1N8Lk4K7q3R4r1K9M3lp3O7M6j21J10m1k9L7k5m5R9
2923D7n3J0j4K3J2n8Q1j3m5K2OlpJ1J6n4J6k5P3k0lK6q6L6R5j13J1JqO4o5oL7
2956A4Ql4J0L9l9K0j7L9j4l9L8k9L7q7J1K0R6p6o3J25l3qj09Q7K8p1J5R2n5k5
2986b0j4M6M1n8m8R2l0l3M7oM2Or4K5M9k4j03P9M5Lk6kO0n5Kp0MJ09q9k9J07r6
$$ y = [28, 10, 35, -45, 7, 17, -64, 7, 0, -47, 28, -14, 12, 41, 1, 30, 51, 2, 2, -11, -76, 24, 13, -5, 10, -10, 50, 27, -1, -44, -36, 20, 13, -16, -42, 5, -29, -65, -9, -9, 4, 5, -20, 20, 16, -32, -14, -2, -35, 42, -50, 23, 9, 10, -64, 4, -65, 37, 46, 1, -3, -52, 14, 48, -22, 5, -7, -42, -36, 29, -24, 1, 10, -24, 5, -25, -21, 22, 24, -44, -2, -24, -2, 9, -8, 28, -12, -31, 36, 20, -29, 11, -50, 7, -22, 9, 14, 10, -8, 28, 6, -47, -16, 15, -23, 25, 16, 30, -11, -4, -94, -1, -13, 21, -15, 19, 26, -46, 1, 55, 1, 35, -48, -63, 20, -3, 57, 60, 37, -9, 40, 31, -23, 23, 11, 8, -12, -62, -16, -10, -31, 27, 30, 6, 33, -50, 44, -47, -18, 25, 22, -51, 16, 62, -59, 51, 10, -19, 18, -7, -52, 47, -6, 4, -10, 13, 25, -33, 48, 35, -10, 12, 18, 15, 8, 19, 35, -19, -3, -28, 45, 25, 22, 48, -38, -2, 93, -20, -9, -8, -16, 48, -17, -23, 14, 22, -12, -2, 37, -2, 18, 1, 40, 26, -13, 25, -4, 33, -54, -43, -23, 73, -3, -66, 59, 26, 18, -91, -4, 24, -47, -32, 60, 5, -20, -34, 12, 53, -5, -53, 39, 9, -24, 23, 17, 59, 65, -29, -4, 45, 21, -82, -3, 42, 45, 19, 17, 77, 22, 24, -46, -42, 67, -22, -51, 56, -40]
3018d0K2rP0J8p9j2L7N9n1k7pJ0l1qJ3Q8k7k9L2m0L5p0QJ04q5q2J25m0N8q5L5
3049hQ5r5k3oJ13j01L5m2M1P4n1o8R7j2l4l8J4N7o3k8N8qk0l6J4J14j49L1M5N0
3079D6m2m7RP2Ko2JL9k1l8J4R3l9q9l6J75j5r3jN6M3j08QL9N5p6n4Q4L9r9KJ1
3111c2J21j40J8N8M2m2o9O2L1m1p2L9N3K0j18L9R8k2j53R1P3mn8m0Q3K6j38K1
3139e4R5lo4J8L8L6n1n8Q9N3j00Rk7K7J4j03O8J08q8j00J37K7m6r7O1J52p7j59
3167i5Q1P7m1p8J7J00o0m7P2j8J02j80J2J37K8j60k0J34mj01k4R1M8j36pJ22J5
3194F5p6n8N3J21q8q8Q3J16q8j32Q5J22j16o7lJ21k9o5N7K9k0m5l9J31q7m4N2
3221a0R9k3q8p4J88j9r9N3N5M8j62l4J47J1q0p8J27Qj42k5J15M7j13L1P7jn4k8
$$ y = [-40, -18, -27, 43, 61, -18, -30, 7, 66, 15, -12, -19, -9, -40, -48, -35, 53, 26, -3, 29, -11, 24, -46, -38, 66, -19, -101, 24, -16, 42, -43, -8, 77, -18, -41, -47, 66, -35, 0, -42, -1, 73, 22, -46, 51, 39, 5, -33, -19, 38, -25, -53, 5, -3, -23, -59, -45, 69, -80, -49, -4, 46, 4, -43, -34, 38, 40, -22, -21, 18, -3, -41, -27, 66, 27, -62, -98, 77, 62, -31, -32, 24, 67, -41, -33, 6, 61, -15, -69, 15, 54, -45, -43, -32, 89, -51, -33, 25, 67, 25, -44, 18, 49, 8, -64, -25, 28, 48, -70, -31, 67, 45, -108, -17, 56, 52, -6, -46, 37, 63, -75, -54, 41, 38, -26, -8, 30, 66, 15, -43, 46, 99, -1, 8, -19, 8, 22, -81, -13, 95, 7, -93, 44, 71, 25, -72, -11, 141, 64, -95, -14, 63, 22, -56, -39, 61, 1, -46, 26, 8, 110, -70, -58, 79, 107, -53, -73, 61, 57, -44, -68, 23, 71, -65, -72, 50, 65, -11, -69, -16, 105, 17, -71, 12, 128, 40, -92, -7, 115, -1, -68, -71, 50, 21, -44, 13, 42, 22, -23, -62, 69, -18, -62, -10, 89, 66, -22, -96, 92, 73, -26, 27, 82, 130, -32, -66, 81, 92, 12, -66, 61, 69, -73, -98, 17, 64, -49, -18, 59, 58, 4, -24]
3249b4N2Q2q9j56Q2J24o3o2J08K2o1o7O3O8p5p9MJ02O5j26m3J66n7o5J8L3L6p0
3277a2q3J65J7j71MJ65N8j37j03J04J06r8o0K3M9mj06L8J09m0n7j6J46m9j51P5
3303b8Q6m6o4j9O1P1j09mJ06N5j55OM3rj8q1J44O3j38RQ1K2r8qM8P4j04n4N0J35
3333A19r1j04N3J08l9j33P1J02j8j03P2K5jq1l8Q7M0j24M2R0m8n8k9J56j9j25
3359d6q0J96N5j63m6L2J24n7k9P7L2o5q6O9P7j76j8J30M0j09K6LP8m7r8OJ30k6
3387B9o4m8J55k9p9pJ02l6k7k0Q7j0j40M3J04Oj44N6K6O8p5p3J69j4p9n5N7R6
3415I8k8j01PJ34j34n5J13M7q5p9lJ47n7j37J22L9j2r5L5J01mj19K4P4K4j14O
3442e2O8K9q4K9O3m3kp0J14j7r3M1M0Oqj11O8%N6r4NJ23o5k7k4J29p6j09J13K9
$$ y = [-24, 28, 110, 21, -135, -53, 71, 8, -54, 54, 76, 15, -52, 11, 79, 4, -75, -71, 31, 96, -30, -73, 93, 36, -29, -11, 22, 58, -12, -95, 70, 87, -84, -80, 85, 143, 6, -97, 7, 113, 15, -45, -22, 27, 23, -83, -45, 64, 24, -33, -49, 97, 48, -103, -28, 58, 12, -52, -71, -10, 61, -48, -52, 54, 109, -46, -40, 3, -6, -24, -105, 39, 102, -36, -27, 54, 76, -22, -30, 18, 92, -12, -66, -16, 119, 28, -76, -23, 85, 46, -87, -16, 86, 68, -35, 37, 62, 61, -20, -58, 29, 69, -55, -13, 77, 29, -29, -58, 98, 79, -46, -126, 70, 125, -38, -84, -52, 72, 15, -14, 63, 95, 30, -56, 13, 90, -86, -104, 26, 66, -43, -17, -14, 64, 17, -81, -75, 55, 29, -35, -83, 72, 43, -36, -43, 59, 23, -4, -24, 63, 53, -87, -44, 60, 66, -78, -22, 4, 72, -3, -76, 93, 79, 0, -55, 2, 98, 70, -31, -24, 110, -24, -79, 34, 81, -4, -83, -86, 61, 4, -133, -11, 28, 16, -79, -44, 57, 53, -66, -42, 32, 56, -58, -52, 16, 45, -39, -10, 53, 10, 8, -62, 52, 35, -58, -17, 23, 29, 21, -90, -22, -22, 34, -60, -55, 68, 3, -24, -48, 81, 5, -104, 9, 38]
3472C8O3j43pJ55p3o7K6Q7p2m3J1J18q8l7J5M3j1m1j0P6l4Qj3R8n9m4M0l2K3Q
3502C5j19Q0P0j07J1M0K9j3p4oJ45j10olj6Q8r7j4Q6j3p7Q3K6l1j6j4P1l3o1N9
3532A3K0k9orK2J2l6l7N1K5q9J8L1J04j22L3M9k8p8m8J42L8p8l7QJ1k0OO3MN2
3563H5q7k7M5L9o2p5R9K6l3m8R4n7k9P3l7K2kr1J10pl8oQLL2j5l4L0lm7J3N6m2
3596ek5N1K1j01N6j2P3m4K4k2M4l4l6JL7j5K7m7RLJ4l0N0l8j7J5%N5k1n8N1%n6
3629c0O5n3N8q1M9k8Q6p3OM0rl0Nj0KK6j0n3M4J2k4k0L9M5p8N8n8M2m7J6M6o6
3661c1K7k2K1J7k4k1J9M8Mr0R6l5m5L5k5O7p0OJ16n0n4J6J4m1P9n4l5M5L5q7M6
3692GJ3l2J0mN4j06P8J7l1M8q7l6Q0L3l2Rk3L4k2m4P3n0NP8l1n5n4M8k1M3Qj5
$$ y = [38, 101, -42, -49, 106, 33, -34, -8, 79, 7, -36, -25, 93, 5, -32, -17, 26, 15, -26, -36, 40, 6, 14, 1, 99, 40, -4, 36, 4, 27, 35, -84, -4, 66, -41, -30, 10, 39, 26, -48, -54, 91, -19, -25, -28, -44, 44, -53, -67, 19, 6, -71, 12, 38, 7, -9, -23, 48, 15, -46, 13, 33, 4, -2, -11, 11, 23, -13, -50, 1, 26, -63, -45, -14, 90, -32, 1, 50, 22, -56, -104, 38, 76, -2, -39, -31, -20, -40, -34, 29, 33, 85, -2, -29, 16, 55, -7, -82, 17, 43, 10, -38, 56, -1, -30, 43, 6, 28, 26, -65, 45, 38, 0, -6, 2, 5, 37, 22, -12, 18, 15, -32, -19, 37, -5, -30, 21, 42, -59, -3, -15, 58, 14, 38, 16, 60, 26, -10, -9, 28, 13, 40, -7, 2, 5, 19, -11, 39, 1, -16, -1, -1, 54, 33, -25, 26, 26, -30, 35, -18, 40, -41, 8, -20, 66, -7, -1, 39, 30, 0, 5, -5, -3, 23, 13, -40, 4, 16, -8, -28, 11, 56, -22, 36, -22, 20, -27, -11, 35, -31, -4, -26, -5, 12, -12, -33, -14, 34, 38, -52, 44, 9, -36, -1, -26, 41, -29, -23, 93, 43, -11, 5, 19, -22, 57, 3, -32, 13, 48, -39, 7, 20, -12, -2, -6, 48, -58, 20, 37, 6, 54, -33, -69, 11, 44, 12, 21, -2, 32, 10, -34, 39, -11, -6, 72, 41, -14, -68, -20, -41, 2, 10, -5]
3724eMm5O1pq9J27n8j5J0N5q2P9o0L2M5p2QM0k9J8k3j1J9J8o0nJ02m4K5n4L9k2
3756AJ8K7o8Kj1N3m0J4k2J2L3k4m9N8l0K2j2k1K5pk8P4j4K2Or4Q0J1q8L9N1J5
3788E5m9j1qpM7k6lk6K6o3J17o7j1R5k9l0M8j19N8J8o7K2j0R0m1k7k8K5j8M8j2
3819ck8K2J6LL3k9K0p1Q6o8qQ2o9N1kj6M2n0q9L1L0j4O2kqn7M4k8K2j1j1n0N3
3852a7J5M1o5K8KrJ1J2n5M3p3O8J7r8J04jL3n6l5P7Lm9k0K4NN0k0k6nm2P8n9O7
3885D8o9R0l7k5ql3Q5n2PJ3j6j6L0m4K6l1J9Jk7N1j5k1J8L3l6j3J4M8Np7P7j9
3917B6j8n7M1nN3p1PK9L8o4%L1j4K5k8Jmk0OL2J2%m3RL9J1k2l5j5k0J04n3j2Q7
3951G0qn4J5%l2K1N3n6j1Qk1k5L0L6k6m1L5J6o4M8L7l6j0L5lJ7m2J6l0j0J4k2
$$ y = [-5, -1, -46, 15, 8, -81, 46, -12, -27, -17, 38, -44, 35, -25, 7, 52, -20, -12, 28, -1, 17, -6, -17, 2, 20, -40, -45, 57, 13, 38, -16, 23, 1, 19, 46, -22, -20, -31, 22, -18, -4, -26, -14, 19, -5, -54, 4, -26, -4, -16, -37, -12, -19, -47, 27, 13, 35, 41, -53, 27, 38, -50, -11, 40, 55, 6, -5, -13, -20, 27, 1, -2, -28, -2, -65, 52, -15, -26, 69, 40, 10, 58, -61, -3, 15, -52, -30, -40, 50, 9, -18, -46, -21, -39, 9, -3, -31, -9, 7, 10, 43, 14, 34, -37, 49, -19, -27, 55, -14, 37, 35, 19, 61, 11, -78, -47, -17, -31, 31, 29, 21, -36, 8, -20, 2, -9, -20, -70, -17, -2, 39, -26, 2, 4, -5, 6, 18, -37, 6, -67, 1, 18, -80, 24, 23, 56, 0, -35, 42, 45, -4, -24, 0, 5, 55, 35, 9, 4, -38, 40, -19, 48, -21, 69, 32, 7, -1, -34, 51, -1, 6, 19, 3, -13, 17, -27, -1, -32, -13, -12, -39, 12, -3, -24, -6, 27, -9, -22, -8, 40, 45, -32, 45, 26, 8, -49, -8, -13, 40, -31, -24, 5, 43, -21, -21, 10, -4, 21, -7, -6, -10, -30, -24, 8, 20, 20, -23, -14, 25, 36, 14, -21, -36, -56, 48, -5, -17, 70, 62, 8, 23, 23, -9, 12, 65, 9, -2, 6, -15, -40, -10, 26, 0, -41, -6, 10, -54, -6, 31, -5, -15, 20, 17, 34, -8, 8, -22, -32, -18, -40]
3983d0M8l6J4lJ3L4o5N5k9J0N4l0o5jQ3o4J0rL6j3l1P8o9Q%j6J4L0l6j5K3k7K8
4016a1R1p2j5k6JkNL0K2o0O0m5J2J5q8P9m4O9l0kM3j04L1J11n0opj9l3O1j6Pn5
4049d8K5L3l4N7n4K4K0p5QnJ4k4N3nl9M5KPk0K2%l2N3k0j8MK0J2Rp5P4j8K9k5
4083A9o9K9pM3n0RJ6j9jJL2k2O4m7nK1l7N4q1Q2r3J1KP8k4j7K3J1km2lJ3OJ1l4
4118b8M7lJ1J0j0j5l7K8L3n7J5l6N1J1l1L8m9j1J8L7j0Jk0j4L0J5Pn6PJ6m1K5
4150a8lj2M2RNk4nkk4O2n3M2m9N2m8J2jqN1l7K0K2n4PM7q1L1K6k3J0J4nPnk2o
4186b1K9Mk7L8p6O1KK8%Po7L0kj1J8n2K9O6p8J0j7K7j3No1J28k5Km1N0m1j2QM
4220BK8j3M1r7O4k2K7j9K1Ml0K5j2k9L4k1L6J6j04P8o3K6K2m4M8JrJ5k2J3rK0
$$ y = [-40, 8, -28, -14, -17, -4, 30, -35, 20, -9, 1, 55, 25, -40, -41, 42, -22, -12, -21, 15, 2, -29, 49, -20, -12, -12, -28, -14, 16, -20, -35, -12, -39, -11, 80, 8, -7, -33, -32, -34, -29, 1, 23, -37, 23, -22, -10, 5, -83, -4, -48, 21, -9, -11, 32, -72, -41, 70, 20, 14, 7, -12, -45, 16, 0, 7, -48, -23, 10, -24, 33, -21, 3, 23, -52, -44, -49, -35, -59, -6, -11, -50, -5, -3, 4, -16, 6, 6, -26, 27, 7, -11, -7, 13, 25, 34, -41, 33, 15, 44, 19, -50, -21, -28, 15, -35, -26, -10, -29, -30, -29, 3, -19, 45, -2, -7, 14, -23, 31, -50, 32, -61, -50, -48, 30, 6, -11, 12, 23, 21, -21, -24, -11, -5, 6, -28, 19, 16, 27, 37, 27, 12, -25, 3, 36, -21, -6, -42, 9, 20, -11, 27, -22, -33, -15, 22, 12, 13, -7, -21, 9, 24, 31, -25, -18, -2, -43, -18, -21, -33, 9, 18, 23, -1, -6, -8, -32, 30, -23, 19, -30, 22, -26, -14, -15, -23, 28, -9, 11, 33, -21, -14, 33, -48, -17, 9, -14, -4, 10, 5, 12, 7, -15, -21, 8, 12, -15, 23, -53, 8, 10, 38, 38, 45, -22, 8, 6, -5, 13, -39, -10, 56, -22, -12, -29, -2, -15, -10, -71, 57, 32, 34, -7, 43, 2, -10, -2, 2, 30, 17, 58, -39, 25, 3, 30, 11, 32, 36, 6, 31, 19, -10, 24, 3, 39, 55, -49, 29, -34, -8, 14, -30, 18, 19, 10, 25, 3, 16, 7, 27]
4252B7qj3QJ0J1q0K8J9k0J6l0M8j5o1K8J4M9k4oj4nJ7m%NK2qm2M4j4Pk2kpL6m4
4288c0J5QO8o6j9RK4j2L7l3n4K2K3N0q6N2M6o1OJ7Lml7mj0P2j4qK7j4o3J9k9M2
4322dl3O0p1J20j07P2k5p4LP4ol7j1L5pM9j0Oo2L8L9j4l8qM6m3Jj8M2m6K2N3m1
4355En1R0m2o4K1M0PjK9rk5oK5l9K6k0J5J1pj4lJ5K0npm2J1J16o3r9N3mM5l8J0
4390@k4LK8k7M5l3JQj6L7K3n7n8J6R0j3K3p8M9J8j2Nk8J5l4J0PN4k5k9J0K2J0
4423D0j00R4j7k0OK0j9K5o4N0n2J1m6K1L3KK0K8K2q3J8J7L5k1j1j7j6N3o4M1M2
4454D8k6Qk3L2rl0j6J0N2l4j2K8rRl3J5QPQo3Q0n3k2J3k8K8J0M5o6OOjm5O2m7
4489d2J16j06RP3l9l3L4j6ro5N3L1j2%qk7M0k8J1K2k5K3l5K1LkK5K4p8L8P1q6
$$ y = [27, 19, 6, 14, 24, 35, -45, -17, 2, -18, -2, -32, 16, 1, -60, -32, -18, 31, 7, 1, -13, -18, -1, -5, -5, 0, 22, 14, -28, 16, 2, 9, -13, -15, -22, 14, -30, -15, -7, 61, -5, -24, -15, 9, -3, 34, 1, -53, -31, -8, 42, -44, 8, 54, -7, -1, 16, 19, 15, -22, -26, -36, 36, 22, 14, 41, 27, -36, -17, -46, -4, -37, 23, -48, 72, -35, 37, 12, -62, -59, 15, 9, -28, -39, -4, -11, 38, 28, 34, -28, 10, 49, 35, -3, -11, 35, -8, -7, -25, 17, -29, -7, 46, 5, -46, 44, 2, -62, -41, -1, 6, 5, 34, 25, 0, -6, 19, -20, 6, -14, 1, 12, 5, -9, -12, 3, 23, 18, 11, -31, -20, 96, 33, -66, -13, -17, 28, -10, 0, -24, -21, 7, -20, 25, -8, -7, 1, -15, 22, 45, -12, -70, -54, 36, 23, 46, -32, 17, 35, 23, 28, 0, 15, -19, -9, -2, 52, 27, -2, 8, 30, 40, -60, 34, 17, -3, 3, 23, 4, 29, -35, 15, -37, -26, -72, -51, -18, -16, 4, 32, 54, -29, -11, 6, 41, 20, 9, -8, -24, 29, -35, 6, 48, 22, 30, 7, 39, 30, 0, -16, -6, 46, 12, 0, 28, 19, 28, -5, 10, 18, 25, 33, -30, 50, -3, -25, -12, -40, -12, -2, 43, -23, -17, -11, -12, -57, 5, -42, 74, -32, -23, 50, 11, -22, 12, -4, -13, -78, -25, 6, -6, -6, -14, -41, -1, -29, -18, 4, -21, 2, -33, -12, -9, -11, 14, 38, -40, -2, 69, -17]
4521a7L1m0J8K2o5N0k1ON1m2J2N2r2Q5j9pL0J4p1j1O7k5l3N3m9l2j7J03qr8L1
4552b2j5M3m8N0m0M6n3L5k4L2k6P3n2k0L2KL1n9J8lN0k2J3m1K7mlo1M5N2rn3o
4585a2k9L8j1l0O4L0Jo0K8k6n3P4j8M4k6LL5l1l3M8k2Jj7j3ok1J4O4k3k7jM9m7
4618a3K0kj7k1M3N9n3k9K1l7K6L1J7L5j09M0j0Mo8LN6Pj8J6l5M5N4l4K4p5O3q
4650C5l0K1p8M8l1k1L7Lk7M3j3jj7P8k8l1O5k6p4L1L1J9n1Plo1J26l1jj1m4L7
4682BJ4nj5K9m3J9MqJ5q5J7J3J4oL2Kk2j7L9J2l1J4k9Nk4O5j7k1j2L6L8Ql8KM
4717A1l7N6J7m1n0N4m2K3L8kk9K6k8k0O4ml8j4KOK3L%K2j00K8O2k5j4L9n1j3N2
4750A8l2J7J3j4K5l8k6O9m0k4PML8j9L6n1N1o3L0j7mK1K5L4k7k4k7J6j1RoM8n2
$$ y = [-17, 14, -26, -8, 14, -51, -1, -22, -16, 35, -7, 5, 57, -35, 50, 31, 24, 54, 68, -3, -14, 53, 28, -5, 48, -1, -33, -50, 53, 45, -53, -22, -37, 6, -42, 8, -32, 14, -39, -4, -28, 4, -22, 51, -1, -21, 11, 13, 44, -15, 3, 0, 50, 28, 41, 0, 27, 23, 20, -41, 4, 56, 47, -6, -12, -41, -3, -14, -44, 20, 50, 51, -9, 19, -7, -60, 14, -4, 40, 14, 17, 52, 21, -12, 36, 14, 15, -2, -15, -21, -42, -28, 36, 13, -14, -15, 34, -13, 7, 5, -12, -33, 10, 69, 16, -13, 8, -29, -3, 28, 45, 80, -29, 11, 1, 5, -63, -60, -4, 3, -15, 1, -34, 11, 65, 31, 55, -20, 43, 35, 5, 26, -52, -4, -35, -56, -19, -16, -43, 0, -13, -14, -31, 47, 19, -12, 53, 27, -47, -16, 15, 34, -17, -10, -13, -74, 52, 21, 20, 9, -35, 2, 16, 11, -4, 25, -18, 1, 5, -3, 12, -73, -56, -43, -29, -35, -3, -1, -23, -40, -1, 11, -20, -6, -35, -30, -54, 11, -6, -27, -39, -3, 35, 43, 5, 7, 11, -26, 30, 47, 6, -44, 10, -32, -9, 29, 27, -2, 24, -4, -24, 40, 36, -2, -16, -14, -8, 15, 18, 18, 40, -60, -32, 30, 5, -9, 30, -21, -34, 18, -14, 3, 16, 2, 27, -11, -37, 32, -8, -32, -25, -21, 17, -2, 34, -17, 34, -29, 1, -16, -20, 1, 26, 60, 33, 9, -18, -2, -13, -4, -10, 38, -14]
4783a4j4K5j3K6L4Nm4qJ6l4QM5k8o4M1O0mK5o6J8j6k6N1l8K4K2mn3M8l7KOL6p6
4817d7j6J05l1M1n4L4j4n0K8j6M7m4O5n7n5O4J4K7o8J0MJ0OL6qL7o0oj1K8j4K7
4849C2m5j0K8J4L5m3PJl0L1n4O4j4l5K1l1k7L4l2M8K1k4pn4M4j0N0J3n7M0J9l5
4881fM3qJ7o4O1j1n8N5j7k1N3l4jJ0L3J4j37O9NrJ6jm8N0m3L2LL9j4n1M7K4p8
4914c0L6k1K3K8j08P2l4n1R9J6j8L6q4lM1J5J1j3jj9QJ05j16Ml8P9l1K4l0l1K9
4945blN2n0J2o8R5n7M3m2rL3OK2k7k4j8M0j9k6L3M1k8j3l6j1M8OJ6J8K6m1m7L4
4978DJK1j0k6J1k9N3Nm4K3k2M2m2Ll2J3L9J4o5L4N6j9k5J6n2Q3m6NN1n6j7L0k
5011A7M5q2P9n5n5Q8o2kK6n9P4%J2Rj6LJ7o8J1M7p7lO7k4N0n8JO9j10JL2J8J5
$$ y = [-14, -28, -3, -16, 10, 44, 49, 5, -3, 13, -21, -13, 32, 4, -60, -19, 41, 37, 62, -4, 14, -2, -28, 23, -15, 9, 31, 27, -26, 22, -15, -13, -7, 29, -47, -63, 42, 11, 52, -2, 32, 18, -32, -4, -20, 27, -17, 48, -9, -64, 0, 14, 41, -27, -17, -13, -3, 3, 39, 31, 68, 8, 2, -9, 19, 5, 32, -13, -23, 5, 19, 54, 11, 18, 19, -11, 20, -34, 30, 16, -19, 2, -29, -56, -22, -54, -6, 15, -9, -16, -70, -26, -36, 14, 27, -30, 10, 29, -6, 37, 29, 46, -18, 43, 32, -26, 29, 12, -9, 44, 10, 9, 19, 52, 66, -71, -2, 3, -6, 10, 9, -39, 11, -32, 0, 3, 42, 28, -23, 24, 48, -30, 6, -15, 8, 36, -72, 0, -34, -85, 14, 30, 12, 48, -36, -39, 2, 17, 28, 15, 14, -5, 3, 108, -8, -4, -42, 37, 6, 30, 0, -31, -2, -5, 47, -3, 9, -59, 36, -21, 22, -20, -29, 4, 10, 32, 5, -19, -37, 3, -16, -42, -9, 32, 4, -9, -45, -56, -8, -2, 14, 32, 58, 17, -30, 4, 5, 26, 16, -10, 1, -28, 25, 30, -14, 9, -13, 29, -13, -10, -42, -29, 10, 24, -41, -7, 49, 30, 5, 21, -31, 52, 6, 11, 62, 6, -11, 19, 17, 62, -20, 59, 4, -51, 37, -25, -27, -1, -60, 14, 14, 26, 35, 19, 22, 39, -29, -18, 29, -48, -51, 16, -8, 42, -16, -15, 54, -56, -55, -23, -5, 10]
5044A0Jl7O5m2K1n4M4N0q0JN1J6om4P3l5o4O0n9O5j7k0m8O4j0j%n0K0Mj6k1NO1
5078GJ1KOL5j24M5LL1k9J1L5m0J8J4nj9J7m1J3O2p1L8J0j3Rlk6K9o0N4mJ1J5J4
5112E5l4j2J8m1P4m4m0k0K8k1J1P3o1M3r6L5O5o6NN8Jn3J8k0K3Q1o7j8m0O3m0
5143b2%K4j3K4m5N1J8o3K7ok0N3m7j5L3k1k5J9LL9J2o9N7q0J33l7l0n1M7K5j2
5174Ik3J2JL3m4J8l9L4M0l2K1Rr4M2M9j02J6P3m7P0l2km4Q7k4J0k3p7O7Qk2K2
5206A6k2Jl1L7pK3l4pPL2J0q2L3j7M0J2J3Pp2J04p8K9k7LK3l7L6m8K9kN8k5k2
5239BJ4k7L%M2n0j9K0k7K3pK9J8J1m8OK1oo9M0M8j01N6M7n4Q5p0K5K2on8J4L2
5272A6l9O9o8J8L2j6Pj3pJ3J1%On2L6j7j9K8k1M4Oj2l1KJ2n4K0L4N5n5k5M7k7
$$ y = [10, 11, -26, 39, -3, 18, -36, 8, 58, -22, -21, 30, 46, 40, -4, 69, 34, -30, 30, -29, 36, 19, -1, -49, 15, 5, 4, 4, -46, -26, -22, -38, -59, -54, 7, 18, 20, 26, 61, -63, -18, -15, 16, -13, -2, 33, -7, 11, 25, 20, 1, 18, -23, -10, 52, -19, 19, 29, 16, 25, 22, -4, 25, -35, 19, 15, 26, 41, 55, 21, 9, 27, -14, 60, 16, -24, -44, -16, -37, -26, 47, -14, 29, -67, -32, 33, -33, -28, 30, 31, -22, -4, -24, -1, 80, 13, -5, -45, 18, -22, -22, 2, -11, 13, -32, 19, 37, -26, 1, -5, -25, 28, -19, -34, -1, -22, -47, -28, -25, 14, 26, -43, 14, -66, 67, 30, 0, -51, -4, 21, 9, -14, -2, -1, 32, -12, 6, -33, 1, 41, 9, 30, 39, -55, -13, 36, -66, -50, 23, -24, 46, 14, 12, -32, 55, 31, 41, 18, -59, 8, 16, -6, 16, -6, -5, -36, 1, -6, 17, -17, -24, -17, 15, 25, -57, -24, -41, -1, 11, 24, 31, -41, 63, -15, 14, -13, -10, 13, -24, 12, -36, -7, -9, 49, 24, 2, 16, -11, -8, -8, 34, -16, -35, -15, -42, -19, -26, 3, 21, 32, -16, -10, 11, 5, -64, -24, 24, -77, -21, 26, -28, 57, -13, 12, 34, 28, -30, -16, 16, -23, 46, -22, -4, 28, 12, 19, 6, -1, 12, 23, 23, 29, -23, 13, -4, -23, 5, -16, 28, 34, 22, -9, -7, 5, -49, -29, 5, 60, 5, -20, 27, 0]
5305@J8j0l6P0k3Km9Q6k9K2k3Pp3O6p7M7j6K3K2k4k4K2m4J6P2n8K2L6k5m1jOM
5338a2L5m5K6k2QJ3k1L6m5N7k8lQpk7J1J2j8N8m2M1mp2P0j9J8l1k9QK7l2RL6J6
5372C2j0j1Pk5lM3k2l1PJ6j9K0K2o0qQ5p2K8n8O6q6J0P8PL6j10J05m9j8k0P5n1
5404a6L1o3JQ3lL2m0nOj0j6r7J14j0J1Kn5K2K0N9r5L0oj1Pj9k2O4k9l0N2PqL0
5438C6rPl3k7J6J5l0J0pM6Ml1J1j1P3r0JL7m1JNQ5r2LM2OK6q7N7m8K5m2M4Qm2
5473c2L2L3m4M7m4M3n3L7nJ7qrpJ8K5j9m4k6O9l3N0l5N0n2Nn4K0M7nK0j6k2kl6
5507c3P4l3K5mm1k3J6J6Ko5J0K1K3N2k2k6j4M5M4n8k1rO4l8N0Pn2J2On5O9j3j5
5540A4j7k7L3m4M3p1O3K5l7P1j3n0n7P7pO2n9L2j0o0L7m0L3J7Ok3KN5o0k3K5K5
$$ y = [0, 18, 8, -28, 42, 19, 21, -28, 58, 29, 51, 28, 35, -38, 28, -49, -2, -18, 5, 27, 3, -21, 1, -43, -27, 45, -13, 9, 45, 20, -21, -22, -16, -12, 23, -22, 4, -18, -10, 3, -18, 18, -27, 30, 2, -1, 7, 0, -27, -16, -4, -22, 36, -6, 35, 31, -41, 29, 10, 28, -3, -32, -24, 3, -29, -20, 16, 32, 22, 11, 18, -7, -10, 33, 11, -20, -13, 3, -16, 4, 26, -34, -42, 43, -29, -1, -59, 7, -79, -69, 9, 16, 52, -58, 47, -2, -20, -40, 35, -16, 15, -48, -47, 36, 33, 65, 25, 20, 26, 16, 0, -97, 17, 7, 18, 20, -35, -13, 7, 66, -29, 1, -5, -16, -9, -28, -50, 14, -15, -45, 7, 14, 6, 36, 27, 34, 1, -26, -10, 5, -25, -15, -22, 24, 28, -3, 8, -3, 70, -20, -19, 18, -23, -22, -17, 68, -24, -21, 21, 27, 53, -34, 23, -25, 0, -42, 2, 10, -32, 0, 33, -11, 36, -8, 35, -18, 19, 14, 31, 23, 14, 7, 25, 50, 31, -13, -39, 30, -3, 47, 12, 62, 10, 15, -39, -19, 28, 23, 43, 27, 5, 3, -33, 41, 8, 33, 29, -12, -35, -19, -3, -1, -66, -56, -35, -12, 40, 18, -8, -22, 23, 67, 9, -12, -21, 43, 5, 55, 62, 10, 22, 28, -27, 42, 29, 14, -3, -30, 3, -41, 2, -69, -6, 19, -18, 53, 40, -10, -67, 10, 3, 65, 6, 38, 28, -32, 5, -35, -2, 15, 21, -2, 0, 55, -5, -28, -3, 22]
5572B2J1l2J2MJ6l8J2m7Ok9J02k8n4Q2m7K9om2M8k8L1k7mLM8j2q8M8k4J4J1M1
5604C4p8M0pN1m0K0K9k2nKjj7j1l7Q8j1o6N0%j4j4M4j9m1L8k4K7p0M7P1l9pl2
5637a4JK8J4j5k3k4R2j06OK0Oj2J6L1j3m0L5Ol9N0n5O6l2pj8K8m6J7N7j6Rn6J04
5670G0j3m0k5m0K4K4k1M4m3K4l9N6j7l1K1K6p2K3N3m9L8Jqm3j0L6L6j3k2J5k5
5701b0L4j0k4P8l8l7LPoK7lk3K8Jj9k1L6LJ8m8o2M9k3J13q0J3j9o5Q2Ml8K0M5
5734B5l3rk8O5k9K9jPk4lM7n2mP2l9Mq5J00l9NK5n5N2p8OL2k0K8JN7n4lJ1L3m2
5769AK3N1n1kK9n8k2M3oqnM6j2j0M8p1L0mMq0P0J9l2k6M7j1J0l5M6Oq0O1lr1J05
5804C2k0n3O3J9k2k9KM7o1%J07n9lo1Q3j04J01m3L3ml3j1LJ04o1l9L0jK2m4L4
$$ y = [22, 33, 1, 13, 17, 33, -5, 7, -40, -34, -63, 39, 11, -43, 39, -8, 21, 15, -27, 21, -7, 24, -3, -7, -4, 44, 32, -56, -8, -32, -18, -7, 34, -44, -4, -11, 40, 0, 20, 49, 27, 22, 24, 23, 6, -5, -42, 46, 35, -31, 19, 19, 5, -9, 35, 16, -25, 13, -11, 16, -54, -7, 64, 25, 18, -14, -13, 15, 29, 14, -9, -33, 59, -47, -41, -21, -15, -27, -11, 20, 7, -33, 2, 8, -31, 19, -36, 30, -2, -9, -27, 1, -45, -28, 29, 13, 22, -34, 70, 57, 17, -8, -48, -24, 0, -21, 23, -20, 4, -35, 21, 4, -27, -6, 20, -52, -29, 24, -25, 13, 14, 6, -37, -47, -11, 25, 12, -10, 5, -20, 14, 4, -20, 58, 20, -17, -14, -7, -13, 14, 11, -12, 16, 17, -2, -23, 13, 16, 34, -14, -76, -27, -50, 63, -17, -4, -23, -88, -6, -2, -40, -20, 25, -8, -17, -45, 20, -9, 20, 19, 26, 2, -1, 46, -6, -10, 62, 23, 27, -58, 42, 3, 8, 33, -22, 30, -48, -42, -10, -30, -2, -1, 56, 2, -1, 10, 43, 1, 24, 75, 24, 22, 51, -7, -29, 14, 8, 0, -5, 41, 29, 19, 67, -4, 26, 22, 26, -54, 16, 35, 3, -23, 24, 13, 23, -12, 34, 40, -40, 21, 18, -73, 32, 12, -41, 22, 41, 19, -10, -8, 39, -22, -22, 85, 26, 23, -38, 45, -59, 42, -1, 32, 28, -5, -16, -13, 91, 30, -9, 21, 20, 42, -2, 32]
5835C2k8j7qN8o2M8j5m2O9l3j9L4L5o1K4J6m4lNO1l2KRm4N9j8k2k5M8Ko8R2p2
5868a9J0M3m0O4j6k2j2k0Rk8K0M3j1m7K7kL0JKm0L4p4J2M6K1mo3O4l2oL2J5k3
5901A4OM2j0j7k7K8pj6J0j3kJ7L3p4jK1qJ4m0K5ol1K5K1j7K3J8k1J7p2J03q6O4
5934C3m0K8%pk0J3M9o9jJ3J7p0K0M0kN0l6k9O8l5m2P1l7p6L7K7mk7Q7j11M1M0
5966B8k1j1nKn0k6O4QK0J0n0N0j8l0L8j4j0M3j1%l5j7P0m7J3L0Rjk7M4j9l4j7
5999a4J9o3N8j4J2j7P8n8K3jj4k6K2ML3J5q9Qm%R4q2M0l4K8l0M5k9oP2p0mQkm0
6034c8L0K5J3%q1O2J9o1L7mk1N4n0l6O9K6n5MK1Nk4J7j0K8j9l6M2n8P9m3kJ8K1
6067C2q1N0J7qK6L2k1n7M0k1M8l4J5l6PLrLJ5k1K0j5Oj6J1n5P8nJ6n7O1j5m8l
$$ y = [32, 4, -13, -21, 37, -25, 23, 8, -34, 35, 2, -17, 17, 52, -9, 15, 31, -13, -16, -11, 50, 18, 20, 29, -15, 44, 26, 4, -21, 27, 29, -39, 53, -19, -9, 34, -6, 58, 42, 20, 8, -12, -3, -31, -11, 32, 21, -26, 1, -1, 29, 30, 32, -8, 26, -48, -36, 10, 31, 27, -36, 28, -4, -10, 22, 37, 14, 20, 62, 52, 35, 8, 36, 29, 13, 23, 10, 8, 25, 58, -16, -17, 4, -4, 10, -30, -5, -11, -42, -17, 4, -13, 10, 28, 7, 24, -48, 55, -31, 33, -7, 21, 21, 14, -6, 7, 56, -13, -14, -1, 16, -54, -34, 6, 4, 54, 18, -11, 57, 22, -20, 51, 14, -62, -25, 2, -2, -29, 58, -53, -12, 28, 7, -4, -9, -7, -57, -83, -19, -11, 9, 19, -31, 19, 1, -29, 9, -5, -15, 28, 17, 17, -18, -35, 35, -12, 1, 31, 40, 39, 12, 56, 37, 3, -14, 5, -58, 0, -14, -2, -19, 59, 1, 24, 23, 9, -17, 5, 9, 42, 57, -32, -24, -28, -28, 66, -16, 24, -10, 18, -12, 33, 4, -2, 70, 0, -4, 4, 2, -38, -8, 17, 30, 30, -51, 11, 30, -31, 6, 2, -19, 35, -15, -51, 18, 44, -11, -7, 14, 19, -5, 12, 2, 30, 11, -25, 17, -41, 38, -5, -7, 11, 32, -49, 1, 18, 10, 36, 68, 47, -10, 30, 9, 57, 23, 38, 2, 9, 12, 3, 6, 21, 0, 20, 5, 11, -5, 6, -49, 29, 24, 40, -17, 44, 29, -19, -22]
6101b2N7m5kJ1j4M3jm0M9j8J0l3k7L1J6m4k3Q8k0j6L0J9l5m5L8n7N5J0l9O7n3
6132a0K0k1K9m5K6j0j7O1m3o6J12j9Rl6K5JJ2mpm1LK8j9N2k0l2J0M3j1l6j2L6
6164A8K8k0Ll6J3K2l7pk1M2m7Q4j6M4r1J8J4k6j1K2k2j9K7j8M2K5j2J0l3J2J3
6195B1ojj5K6J9l8N2k2m6k4j7N0k4N3q0J24k9p8J3M6K4m1j1j5L4kJ0l2J6nL7l
6227C6j7m0J1M3rkj8Jl5J5N6l2L9k3k8mL4lj8l4M6N7l2p0K1j8j7M4nJ2m5K5L3
6260B3o5O6j1L3k8m1K4j8N3l5m4O3l2M0m4M9k8K5L9o0l9L1m2J8L6Km0N4Pr0M5
6291ij8Q8lm1j5j3k1P8l7l2J1J0J6l9M4l0L2lRn8K9J4j4J5L6k2Lk6l8P9n6J8N
6324A2J7J7m7J3Oj9K8Qk6rLJJ7j0K3m1k3KJ0M2k4j0L0p6N9N6o3lL5j9o1R4Rn3
$$ y = [-22, 35, -10, -12, -1, -15, 28, 27, -13, 36, 18, 28, -5, -32, -1, 15, -29, -52, 36, 16, 0, 30, 49, 14, -31, 7, -50, 5, 15, -24, 43, -10, 10, -11, 18, -27, -1, -11, -28, 33, -10, -76, 36, 17, 26, -10, 15, 16, 28, 24, 17, -24, -21, 7, -12, 40, 20, -12, -2, 41, 30, -6, -18, 18, 46, 26, 29, -7, 6, 28, -9, -16, -37, 5, -42, 42, 26, 70, -21, -3, 11, -15, -26, -4, -26, -45, -18, -36, 6, 31, 19, 29, -4, 8, 21, 15, 14, -1, 25, 44, 6, 58, 36, -10, -34, -51, -1, -25, 28, -52, 72, 43, -35, -22, 24, 48, 7, -4, -19, 15, 13, 23, -9, 7, 2, 39, 36, 19, -21, -10, 33, 24, 22, 4, 5, -30, -15, 41, 9, 48, 25, -3, -7, 27, 24, 6, -28, 18, 75, 43, -27, -6, -24, -41, 3, -2, 10, -35, -10, 23, -42, 24, 13, 46, 18, -23, 1, -17, 36, 1, -43, 20, -12, 28, -16, 33, 5, 30, 69, 9, -30, 1, -41, -23, 13, 15, -25, 29, 36, -54, -9, -27, 61, 58, 17, 2, -11, -32, 46, 9, -23, -12, -2, 14, -25, 19, -11, 21, 18, 27, -31, -2, 12, -2, 13, 49, 27, 30, 4, -34, 45, -11, 7, 12, 29, 46, -1, 12, 18, -1, 27, 35, 9, 0, 3, 4, 21, 11, 34, -7, -30, -28, -18, 24, 0, -10, 20, -56, 3, 59, -4, -7, 28, 9, -52, 42, 51, -2]
6358bj2rpQKP8m0kJ3ln2L4o2N5k6lK3l1L1k3M0o4J18j6j15O8L4j5l1k1K4L1k8
6391cK0M2j46J13k6K4kj7l2onN6n8L6L1J7j1qo5N4K7q8Q6o6N2L4m1n8L3J6k8M9
6423C0p2Q8n2N3m2j3RL3m0n4L1K7l4J5K4J5k5J2l4m2L3P5jm0rM8k0l2Q3o9L0m0
6455a3M6l6J1j3J6rp0P2mj6j3N8J5p3O5k0N5q5j7L1J2j1J7Ql3K3qQk7K1l0MN0
6488C4kk8l3L6J5Lm3M0oJ0m4n4N2MK5om4Q9j1l9J9k4m1k2J01o4JpK7O0j11O9o3
6521e7J58r7N5o5k8K3k7N4j1J5K6p2J03r2kl9P6No6M7Kl4K8M7q2J8L4j4J9Ll9
6552a2J4k2M4jl1KmO6p5pP3j6j8K9l8j6K0Pq0R0j8Pll2R1k3jqpm4OK5j8kM4o2
6588b0K1o1R0Nk9m3L0l5L4K0j9M8q6K2M2jl9k6P1Rk5K5p0j9O5N2n8k2N4q9O8m3
$$ y = [-2, -14, -23, -30, -22, -20, 58, 18, 16, 29, 26, -26, 8, -54, 1, -25, -28, -5, -36, -5, -28, 12, -52, 66, 50, -65, 3, 37, 22, -9, -30, -6, 25, -3, 17, 59, -87, 26, 0, 24, 22, 5, -27, -33, -38, 18, -40, -4, 27, 44, 33, 25, -40, 14, 41, -47, 39, -27, 25, 59, 18, -40, -7, 9, -19, 30, -42, 46, -6, 47, 5, -8, 1, 34, -6, -60, -29, -2, -36, -21, 3, 18, -7, 5, -29, -71, -38, 37, 36, -4, -13, 35, 15, -17, 66, -3, 27, -13, 33, -3, 8, -5, 11, 2, -68, 4, 0, -16, -29, 29, 44, -29, 36, 16, 71, -14, -31, 0, 12, 1, 18, 26, -7, 16, 8, 16, -11, 10, -20, -16, 34, 32, 4, -29, 7, 22, 25, -18, 22, 16, 26, -18, -72, -20, -16, 9, 3, -41, 48, 37, -2, 17, -7, -48, -70, 31, -33, -32, -39, -12, 48, -63, 6, -57, 101, 4, 59, -6, -34, -11, -38, 16, 5, 20, 46, -26, 77, -15, -17, -56, 20, 25, -41, 6, 8, -26, 2, 49, -33, -15, 19, 5, 24, 27, -12, 2, -20, 24, 23, -8, -6, -10, 56, -19, -26, 47, 31, 13, 42, 4, -12, 8, 15, -65, 25, 7, 14, 11, -21, 70, 47, 46, 38, 31, -13, -7, 18, 0, -2, 42, -20, 1, -60, 30, 35, 6, -37, -7, -42, -8, 12, -7, 41, -45, -23, 19, 18, -21, -47, 24, 33, 8, 33, -37, -56, 9, 61, 3, -19, 35, -54, 14, -29]
6620b9N8J5q9K5QM2K3L3m9p5j0M9M3m3LjOj1J1k4J9n6J1J5l1R9%j9j2n8L5O3r6
6653d5J02p2J2J1QL3k8k0Rj5N0l9L5l8J0j7N6q9kL4J5m3P5m8L1l3j0N0qm5J4K9
6685B2m5JM3l5%K3N2r3L0L3l9K5m4k5P9Jl3N7p0K0qNJ7k9J8K6l0J3m4L8n4J7J3
6718a6k6kK3MQnJ7J7j3k7L9j0l2L0l5M0K6j2m6J6qJ9L5n4J9L0n9k1M3K4k9l2Q3
6751D6m7j7M6k8k5Q2n4M3l3k2K2k7mPk8l5P4oJnl2L2J2J7j3MJ5j8J0m5J0KL0J1
6785B5p5L3kP4o6O0o6l4Q0m7K9Ol2LnL7Rl5J7%qm9M2k6M4l7Nk6K9l1P3l0N3n5
6819enR2j07M5j9j6k5Q3l8oLpP3p8KO7qn7L9n8O7m5j4K1N5r9J12o9j8L1k9K4J9
6852C0l1QL9j6m4J1K3k7lL5K1p0N2j5o0M7K7k7J1K5m1K8QJ1j2k6KK7l4L0Qlj4
$$ y = [-29, 29, 44, -45, -20, -12, 30, 53, 86, 37, -38, -48, 1, 44, 1, 4, 3, 9, -2, 9, -15, 4, -52, -41, -26, -57, 42, 42, 23, 11, -47, -12, 51, -45, 57, -15, -3, 8, 16, 49, 21, 1, 10, -5, 45, 6, 41, 3, 13, -4, 52, -37, -39, -5, 10, -33, 42, -6, 25, -8, -18, 32, 24, -21, -7, 22, -23, -22, 21, -14, -14, 9, 61, -32, -2, 31, -8, 17, -27, -52, 27, 28, -5, 52, -18, 2, -6, -1, 16, -13, 5, 31, 1, 14, -30, 8, -46, -29, -16, -42, -44, -21, -17, -9, -14, 3, 20, 7, -20, 19, 9, -23, 7, -28, 12, 38, 26, -20, -4, -12, 7, 42, -12, 7, 37, -22, -43, 0, 24, -5, -37, 46, -1, -18, 28, 0, -25, 57, 3, 46, 13, -9, 13, -14, -18, -11, -39, -74, 0, -6, -5, -10, -42, -10, 2, 19, 6, 10, 25, 7, 17, -28, -18, -16, 14, 25, -50, -17, -19, 55, -11, 49, -17, -51, 29, -18, 11, 17, -15, -12, -17, 20, 29, -6, 11, 11, 3, -46, -4, -30, 14, -23, -18, -44, -15, -46, 27, -3, 50, -5, -10, 82, -25, 20, 1, -15, -40, 43, 5, -1, 2, -5, 68, -10, -8, 59, 51, -6, 33, -25, 42, -3, -17, 4, 59, -40, 72, 3, -15, 16, -13, 11, 30, -1, 7, 46, 30, -14, -3, 20, -7, -10, 25, 46, -24, 28, 13, -47, 0, 27, 0, 11, 36, -5, 23, 31, 42, 30, 4, 6, 33, -1, 29, 37, 34, 20]
6885B0L0m8n9J10j10L4%lM1J2m0L8n8K7rk0K7K3k6lJ0lO7r8L2L3nRm0mL7nm8L9
6919A0M2l0K0m2m7N8kJ1q1O7M1j8k2j5J7N9n2Jn1k5J38o6m0K4O5q3K7J3k1k0n3
6950g5J08o7K2kj2M8M0r3K3P2j08R3q6J1P6m9L2qm2M1n6N4k3J9P3n9J6l7m2L5
6980Dl7J8O3n0j2L8K1k2m7R5p9KK4j3K3lJ5q7N4Ql7Q3k0l4l6J0j8O2l1N3m0o7
7012f0J25lj5Qn9m7L5L2j5n1J36j00Q2q0m0M1l2N8J0k5l5L5k5K0jL6m1nnj8J1
7043b8k0K3M2j4L4j7k7lqK0J9n6lP4k8mm3O0k9N3n3mJ9k7kNQ6l5n0j3J6k6L8J4
7077A3k0n2N5kJ6K1l5l0P2qkPnJ9m7L9o3j0OM9l9O4l2K1o4N8J8q3N3Pp0Q9k2J1
7111C4m4m2N9p4J27n0K0l4lK8NkRl9l8N8o6K4N2%p%n2J1M1Ok1k5J6m7M9K8J6n3
$$ y = [20, 50, 2, -57, 53, -57, -23, -23, -26, 15, 27, -13, 25, -33, -6, -15, -35, -8, 15, -11, -14, -4, -7, 60, -38, -6, 27, 22, 31, -9, -13, 24, 19, -29, 10, 52, 22, 42, 0, -47, 11, 9, 20, -61, 6, 47, 29, 7, -8, 9, 68, 16, 17, -34, -59, 79, 13, -27, -3, 62, -21, 6, 19, -2, -22, -75, 33, -34, -12, -14, -26, 22, 62, -31, -8, 64, -44, 49, -37, -26, 50, 1, 33, 25, -17, 24, -32, 22, -1, 18, 91, 32, 48, 11, -31, 4, -33, -15, 48, -2, -14, 24, 45, 23, -24, 71, -8, -6, 18, 5, 28, 25, 40, -47, 7, 15, -22, 61, 41, 7, -29, -19, -37, 25, -6, 47, 7, -60, 65, 62, 47, 55, -4, -51, -16, 16, 1, -50, 86, -14, 68, -12, -52, -11, -43, 15, 25, 0, -35, 0, -25, -5, -6, 30, -11, -16, -21, -39, -28, -48, -25, 17, 3, 37, 20, -7, -10, -18, 2, 21, -35, -38, 36, 8, 4, -39, 21, -8, 45, -8, -12, 7, -20, -22, -17, 69, 34, -16, -29, -13, -39, -1, 13, -7, -59, -4, -6, 10, 31, -4, -34, 38, 30, 28, 35, 30, 49, 2, 41, -22, -32, -26, 23, -16, 48, 16, 37, -27, 31, 49, -34, 19, 26, -44, 45, 23, 34, -10, -52, 7, -67, 60, 10, 30, -4, -7, 21, 26, 24, 33, -6, -44, 14, -52, -28, 24, 24, 17, 17, -35, -24, 17, 23, 2, -23, -7, -54, -5, 23, 39, -14]
7145a4M5pr1J07n1P2j00M4j4jj7k1M5j4m3K6nk6N1qL1pK5j5J8l6K2qn4P7j0k1
7177@l9Q7k2k5k2Pj0M6k7L9l8Kj4M5n2PML4n8j1K8RJ9l2%K8K4m4Q9ol7l8L9L1
7211F3o3jj2j0K1oK2k8K1l0J2l1P6L1o1o3L3O5o5J4QJ2o0R2n1J4nmk5%O5Rj0l5
7245bM0l8l0O4l0J4J1o9J4Q0j08N3J2nN2n7M1qo3M3rJ1p4M5l1P2M8o0l1j4K8l5
7277c6QP9k7jj8k5J2K7J6l4N6n3Jk5M2k5O8p2P1l6n6R9o0JM6m1l0L7q8O9k1PK9
7310B0qk1K9L4o4K9o7N3o8P0K4n0M8m5N1o9N7K0m0l7M8J5m0k3LL2jL6p3PP6m5
7342ALn4J4N4o0%O6n1K9m8P8n6K0lRNOK0k8J3l4P5j04nQ1p5J8M1k7J4K0o1L7L2
7376C0p1M6l3K2j0j0J9K5j6j5M6j8m8O5k9JpJ4K8k4p6L0K6J6J4J8o3lM3j8jPk5
$$ y = [-14, 31, 24, -67, 40, -11, 61, -39, 5, -9, -10, -27, -48, -3, -17, -60, -34, -39, -65, -14, -22, 9, 2, 27, 12, 30, -6, 16, 8, -46, 31, 21, 0, -39, 48, 26, 1, -21, -14, -24, 22, -5, 34, -4, -2, -16, 29, -23, -16, -12, 22, -36, -47, -19, -10, 9, -23, -23, 5, 29, -15, 74, 68, 31, -7, 32, 63, 0, -1, -13, -23, -2, -8, 14, -14, 7, -23, -11, -42, 34, 65, 4, -59, -26, 39, -26, -12, -4, 8, -52, 40, -11, 3, -2, -6, -31, -31, 34, 43, 33, -2, 38, 0, -30, 34, 4, 18, 29, -40, -26, 54, -54, -1, 11, 6, 58, 1, 42, 34, -29, 14, 5, 16, -58, -13, -44, 28, 76, 16, -15, -29, -1, -36, -28, 51, 24, 23, 5, -20, -8, 19, 35, 1, 57, 4, 5, -20, 22, -3, 65, -7, 64, 28, -28, 71, 11, 12, 58, 17, -13, 24, -64, 5, -16, -9, 20, 12, -9, 20, 54, -10, 19, -48, 5, -63, 7, 31, -19, 29, -16, 35, -34, 23, 43, 3, -34, 14, 29, -11, -34, -31, 1, 0, 36, -37, -30, 46, 1, 4, -50, -36, 18, -42, -42, 24, -27, 2, -46, 32, -24, -4, -7, 2, 7, 13, 33, 5, 18, -16, 59, -45, -50, 31, -44, -26, 15, -12, 2, 22, -39, -2, 30, -41, 5, -28, -6, -16, -26, -7, 18, 2, -13, 33, 15, -33, 32, 3, 4, -3, 11, 39, 15, -61, -31, -5, 11, 25, 43, -20, -23, 20, 2, 1, 8, -17]
7409a7j7O2rJj01P7qj3M4m3M1j6j9MM7n2L1%Pj1J5l0K9m5K3%n8rL5K5P4o5rl8
7443d5M8l1L0k8N3l5m0Q3l2j5q6J18l0O6nq5O9n6nK3K5N5j29Q8k7j1nlRK1Pk4
$$ y = [-17, -34, 28, 19, 20, -81, -4, -12, -25, 19, -24, 17, 1, -18, -14, 33, -19, 12, 12, 19, 8, 23, -7, 22, -23, 0, 0, -58, -67, -32, -7, 67, 2, -7, -45, 3, -28, 2, -26, 27, -8, -48, 35, 3, -12, -98, 20, -10, 56, 51, -34, 35, -21, -26, -3, 22, 77, -52, 36, 9, -2, -7, -10, -1, 20, 27, 3]
$$ [...]
8191B7
##END NTUPLES=NMR FID
##END=
