##TITLE=11H_6C1211
 D2O
 8 sc, 
 15.11.2021
##JCAMPDX= 6.0         $$ Bruker NMR JCAMP-DX V2.0
##DATA TYPE= NMR FID
##DATA CLASS= NTUPLES
##ORIGIN= UXNMR, Bruker Analytische Messtechnik GmbH
##OWNER= root
$$ XWIN-NMR		Version 3.5
$$ Mon Nov 15 10:41:25 2021 Russian Standard Time (UT+4h)  she@DPX200
##.OBSERVE FREQUENCY= 200.131346
##.OBSERVE NUCLEUS= ^1H
##.DELAY= (6, 6)
##.ACQUISITION MODE= SIMULTANEOUS
##.ACQUISITION SCHEME= undefined
##.AVERAGES= 8
##.DIGITISER RES= 18
##SPECTROMETER/DATA SYSTEM= spect
##.PULSE SEQUENCE= zg30
##.SOLVENT NAME= D2O
##.SHIFT REFERENCE= (INTERNAL, D2O, 0, 15.7039)
##AUDIT TRAIL= $$ (NUMBER, WHEN, WHO, WHERE, WHAT)
$$ ##TITLE= Audit trail, XWIN-NMR		Version 3.5
$$ ##JCAMPDX= 5.01
$$ ##ORIGIN= Bruker BioSpin GmbH
$$ ##OWNER= she
$$ F:/spectra/data/she/nmr/H-F/1/audita.txt
$$ ##AUDIT TRAIL=  $$ (NUMBER, WHEN, WHO, WHERE, WHAT)
(   1,<2021-11-15 10:40:11.81 +0400>,<she>,<DPX200>,
      <created by zg, POWCHK disabled, PULCHK disabled
       configuration hash MD5:
       00 E9 B6 7A A2 85 ED C7 34 08 36 98 17 FE 4E 26
       data hash MD5: 16K
       98 0A 06 FD B6 FE 1C 06 71 8B 3B 0A 0D 48 4E 1F>)
$$ ##END=
$$ 
$$ hash MD5
$$ 7D 5F 10 C8 47 51 E7 72 FA ED 22 7B B5 DD 72 94
##$RELAX= 
##$RELAX= 
##$RELAX= 
##$RELAX= 
##$RELAX= 
##$RELAX= 
$$ Bruker specific parameters
$$ --------------------------
##$DU= <F:/spectra>
##$EXPNO= 1
##$NAME= <H-F>
##$PROCNO= 1
##$TYPE= <nmr>
##$USER= <she>
##$AMP= (0..31)
100 100 100 100 100 100 100 100 100 100 100 100 100 100 100 100 100 100 
100 100 100 100 100 100 100 100 100 100 100 100 100 100 
##$AQSEQ= 0
##$AQ_mod= 1
##$AUNM= <au_zg>
##$AUTOPOS= <>
##$BF1= 200.13
##$BF2= 200.13
##$BF3= 200.13
##$BF4= 200.13
##$BF5= 200.13
##$BF6= 200.13
##$BF7= 200.13
##$BF8= 200.13
##$BYTORDA= 1
##$CFDGTYP= 0
##$CFRGTYP= 5
##$CHEMSTR= <none>
##$CNST= (0..31)
1 1 145 1 1 1 1 1 1 1 1 1 1 1 1 1 1 1 1 1 1 1 1 1 1 1 1 1 1 1 1 1 
##$CPDPRG= <>
##$CPDPRG1= <>
##$CPDPRG2= <>
##$CPDPRG3= <>
##$CPDPRG4= <mlev>
##$CPDPRG5= <mlev>
##$CPDPRG6= <mlev>
##$CPDPRG7= <mlev>
##$CPDPRG8= <mlev>
##$CPDPRGB= <>
##$CPDPRGT= <>
##$D= (0..31)
0 1.2 0 0 0 0 0 0 0 0.06 0 0.03 0 0 0 0 0.0002 0 0 0 0 0 0 0 0 0 0 0 0 
0 0 0 
##$DATE= 1636958411
##$DBL= (0..7)
120 120 120 120 120 120 120 120 
##$DBP= (0..7)
150 150 150 150 150 150 150 150 
##$DBP07= 0
##$DBPNAM0= <>
##$DBPNAM1= <>
##$DBPNAM2= <>
##$DBPNAM3= <>
##$DBPNAM4= <>
##$DBPNAM5= <>
##$DBPNAM6= <>
##$DBPNAM7= <>
##$DBPOAL= (0..7)
0.5 0.5 0.5 0.5 0.5 0.5 0.5 0.5 
##$DBPOFFS= (0..7)
0 0 0 0 0 0 0 0 
##$DE= 6
##$DECBNUC= <off>
##$DECIM= 32
##$DECNUC= <off>
##$DECSTAT= 4
##$DIGMOD= 1
##$DIGTYP= 9
##$DL= (0..7)
0 120 120 120 120 120 120 120 
##$DP= (0..7)
150 150 150 150 150 150 150 150 
##$DP07= 0
##$DPNAME0= <>
##$DPNAME1= <>
##$DPNAME2= <>
##$DPNAME3= <>
##$DPNAME4= <>
##$DPNAME5= <>
##$DPNAME6= <>
##$DPNAME7= <>
##$DPOAL= (0..7)
0.5 0.5 0.5 0.5 0.5 0.5 0.5 0.5 
##$DPOFFS= (0..7)
0 0 0 0 0 0 0 0 
##$DQDMODE= 0
##$DR= 18
##$DS= 0
##$DSLIST= <SSSSSSSSSSSSSSS>
##$DSPFIRM= 0
$$ [...]
##$SUBNAM2= <"">
##$SUBNAM3= <"">
##$SUBNAM4= <"">
##$SUBNAM5= <"">
##$SUBNAM6= <"">
##$SUBNAM7= <"">
##$SUBNAM8= <"">
##$SUBNAM9= <"">
##$SW= 18.0517287032376
##$SWIBOX= (0..15)
0 0 2 0 0 0 0 0 0 0 0 0 0 0 0 0 
##$SW_h= 3612.71676300578
##$TD= 16384
##$TD0= 1
##$TE= 0
##$TE2= 300
##$TE3= 300
##$TEG= 300
##$TL= (0..7)
0 120 120 120 120 120 120 120 
##$TP= (0..7)
150 150 150 150 150 150 150 150 
##$TP07= 0
##$TPNAME0= <>
##$TPNAME1= <>
##$TPNAME2= <>
##$TPNAME3= <>
##$TPNAME4= <>
##$TPNAME5= <>
##$TPNAME6= <>
##$TPNAME7= <>
##$TPOAL= (0..7)
0.5 0.5 0.5 0.5 0.5 0.5 0.5 0.5 
##$TPOFFS= (0..7)
0 0 0 0 0 0 0 0 
##$TUNHIN= 0
##$TUNHOUT= 0
##$TUNXOUT= 0
##$USERA1= <user>
##$USERA2= <user>
##$USERA3= <user>
##$USERA4= <user>
##$USERA5= <user>
##$V9= 5
##$VALIST= <valist>
##$VCLIST= <CCCCCCCCCCCCCCC>
##$VD= 0
##$VDLIST= <DDDDDDDDDDDDDDD>
##$VPLIST= <PPPPPPPPPPPPPPP>
##$VTLIST= <TTTTTTTTTTTTTTT>
##$WBST= 1024
##$WBSW= 4
##$XGAIN= (0..3)
0 0 0 0 
##$XL= 0
##$YL= 0
##$YMAX_a= 252410
##$YMIN_a= -212242
##$ZGOPTNS= <>
##$ZL1= 120
##$ZL2= 120
##$ZL3= 120
##$ZL4= 120
##$ABSF1= 10
##$ABSF2= 0
##$ABSG= 5
##$ABSL= 3
##$ALPHA= 0
##$AQORDER= 0
##$ASSFAC= 0
##$ASSFACI= 0
##$ASSFACX= 0
##$ASSWID= 0
##$AUNMP= <proc_1d>
##$AZFE= 0.1
##$AZFW= 0.1
##$BCFW= 1
##$BC_mod= 2
##$BYTORDP= 1
##$COROFFS= 0
##$CY= 11.3945322036743
##$DATMOD= 1
##$DC= 2
##$DFILT= <>
##$DTYPP= 0
##$F1P= 2.36226072786647
##$F2P= -0.459571619588291
##$FCOR= 0.5
##$FTSIZE= 0
##$FT_mod= 4
##$GAMMA= 1
##$GB= 0.15
##$INTBC= 1
##$INTSCL= 1
##$ISEN= 128
##$LB= 0.24
##$LEV0= 0
##$LPBIN= 0
##$MAXI= 10000
##$MC2= 0
##$MEAN= 0
##$ME_mod= 0
##$MI= 1.114404
##$NCOEF= 0
##$NC_proc= 0
##$NLEV= 6
##$NOISF1= 3.799351
##$NOISF2= 2.8
##$NSP= 1
##$NTH_PI= 0
##$NZP= 0
##$OFFSET= 15.70392
##$PC= 1
##$PHC0= -15423.81
##$PHC1= 8.600809
##$PH_mod= 1
##$PKNL= yes
##$PPARMOD= 0
##$PSCAL= 0
##$PSIGN= 0
##$REVERSE= no
##$SF= 200.130013532006
##$SI= 16384
##$SIGF1= 3
##$SIGF2= 2
##$SINO= 400
##$SIOLD= 16384
##$SREGLST= <1H.CDCl3>
##$SSB= 0
##$STSI= 0
##$STSR= 0
##$SW_p= 3612.71676300578
##$SYMM= 0
##$S_DEV= 0
##$TDeff= 0
##$TDoff= 0
##$TI= <>
##$TILT= no
##$TM1= 0
##$TM2= 0
##$TOPLEV= 0
##$USERP1= <user>
##$USERP2= <user>
##$USERP3= <user>
##$USERP4= <user>
##$USERP5= <user>
##$WDW= 1
##$XDIM= 8192
##$YMAX_p= 0
##$YMIN_p= 0
$$ End of Bruker specific parameters
$$ ---------------------------------
##NTUPLES= NMR FID
##VAR_NAME=  TIME,          FID/REAL,        FID/IMAG
##SYMBOL=    X,             R,               I
##VAR_TYPE=  INDEPENDENT,   DEPENDENT,       DEPENDENT
##VAR_FORM=  AFFN,          ASDF,            ASDF
##VAR_DIM=   8192,          8192,            8192
##UNITS=     SECONDS,       ARBITRARY UNITS, ARBITRARY UNITS
##FACTOR=    0.0002768,     1,               1
##FIRST=     0,             0,               0
##LAST=      2.2672688,     0,               0
##MIN=       0,             -212242,         0
##MAX=       2.2672688,     252410,          0
$$ Real data points
##PAGE= N=1
##DATA TABLE= (X++(R..R)), XYDATA
0@%%%%%%%%%%%%%Qj6J6j6J6j8K6l2L2m0M8n6O9p7Q8j04J20j36J56j78K00k26K53
36A33k83L18l56L97m40M89n42N98o62P32q08Q91r82J081j191J312j445J595j762
55i25J952k170K420k713L060l478L994m649N513o703Q449j1256J6468k9198J13603
70I4367J58043k12026N3653m7635k37410O9699J02331q2809J34361J02771q7906
81D7439P0124J316k36832j0510N9588q7764J42964J93864p4324j9380k534j54893
93g0942n4698L5104j623Q2291Q7013M823K6312j6191j12709n6294j7157l1357
105a25428O4624J07124O0616L4526n9887r0471m4731p8841J2822J20936J5577
116A6867K4490Q7959n0480p1453K608r2638o2974Q7751L7943M9665J32332n0464
$$ y = [0, 0, 0, 0, 0, 0, 0, 0, 0, 0, 0, 0, 0, 0, 8, -8, 8, -8, 8, -10, 16, -16, 16, -24, 24, -32, 37, -40, 48, -56, 64, -72, 84, -94, 106, -120, 133, -150, 168, -188, 209, -231, 258, -284, 314, -348, 384, -424, 467, -515, 566, -625, 687, -758, 837, -925, 1027, -1143, 1277, -1436, 1624, -1854, 2140, -2509, 3004, -3699, 4750, -6506, 9962, -19236, 94367, 252410, 40384, 94037, 46402, -191008, -121309, -18978, -101787, 32574, 135345, 47439, 117563, 118879, -117953, -128463, -68875, -156639, -13675, 180189, 105865, 86485, 83951, -70942, -125640, -90536, -92159, -9868, 77145, 81968, 108280, 92089, -20620, -76914, -94071, -125428, -60804, 46320, 106936, 141462, 81575, -8896, -53627, -132468, -119646, 1290, 16867, 41357, 129316, 78836, 7383, 9991, -82647, -145621, -57870, -19927, 29738, 162070, 111606]
128A11606j14820J6597r5779p9034J36645K9057k3970J33124R49j03743K5539
139C6171n8220j21770O2430N7258l803J25611M1527j07848k110m3094j24466N5819
151h2495O9953k1849R0641O2964o9613j6168k2459r7028j1657M3425J4642P6582
163C6938O9952l1978k3672l8796r3255j1558L5626J6106O4877N2827l131j0403
175F3533m7580n9373k4219j7186K5050P5146M0992J5958J4259n5045p5015j4661
187e8141k0994O182Q1463L4797J2822L6627n4184o6878j789m5919j3668Q2819
199f863L5422J2960N4481l0026q3517j4635l1180l1650P1628M9595N218N2781
211H4214j4756p2061j0186l7508m4749N3677M8676J4970N4373O865o7073l2123
$$ y = [111606, -3214, 13383, -82396, -161430, -24785, 4272, -19698, 113426, 114375, 10632, 36171, -22049, -143819, -81389, -24131, -27934, 97677, 139204, 31356, 29246, -13848, -138314, -82495, -12542, -34391, 56250, 119214, 49601, 33433, 10974, -86054, -97711, -54286, -39644, 36938, 106890, 74912, 51240, 12444, -80811, -92369, -56743, -40637, 24240, 77067, 73936, 63533, 15953, -43420, -67639, -84825, -59775, 15371, 56363, 72321, 86580, 31535, -43480, -58141, -79135, -72953, 8510, 43307, 56129, 92756, 38572, -28306, -30095, -76014, -89682, -6863, 28559, 41519, 96000, 65974, -17543, -32178, -63358, -95008, -23380, 26215, 31433, 84214, 69458, -2603, -12789, -50297, -95046, -41369, 7307, 22277, 76650, 83515, 16442, -15681]
223a5681k4301m3048K6750N1841K0890M5661J5414m4061k6920m0217m7425K0777
235f0320M0383K6738M4951K3314k6514l7114l6033l6032n614K4456L9174N1196
247D8585J9241j7722j9213m5437m6882K405J5785K5833M7314K7893L589j8845
259D2546m7986m0171j2975Q43K8968N5698K8052m065l205l2464n2225j8098n44
272e5626J6684M5424L5462J8863l153m1603m1085j9714j3114J0984M3712L7707
284C4541J4521O960j9081m6495l3246j5822P474L7679L3762K6675J4720k4865
296C6823l7050k6339k5592n471K9390M0328K8133J5676o580l5611l7153k4589
308d8035o630K1488L0089L1974K7601o310k7831k9222l3217j7536J4062L3684
$$ y = [-15681, -39982, -83030, -56280, -4439, 16451, 62112, 77526, 33465, 6545, -33672, -81097, -60320, -19937, 6801, 51752, 75066, 48552, 11438, -24595, -60627, -66241, -41785, -2611, 48585, 67826, 50104, 30891, -14546, -61428, -59023, -43238, -17405, 29909, 57802, 61391, 42546, -5440, -45611, -58586, -57743, -28775, 26923, 54975, 50910, 47705, 15241, -36984, -55082, -55626, -38942, 6482, 41944, 60807, 57654, 16051, -25034, -44748, -57862, -46878, -3166, 34541, 49062, 56022, 36941, -9554, -42800, -58622, -51148, -13469, 20293, 46968, 61688, 36823, -227, -26566, -52158, -57629, -28239, 12089, 40222, 55898, 49318, 13707, -23446, -48035, -54665, -33177, -3088, 28886, 56487, 50177, 22346, -6876, -40093, -57629, -43567, -9883]
320i883L2724K2578P880j8921l5032l1388j9366N257K2942L1499L5648J0725j7987
333C6676k5743l1417k7406m349K3417L2847K5044J9839n10k9121l3695k5541r424
346d9383J1899K6386L5748K3699k992j8463k8163l0646j8565P013K8760K8159
358A3452K3403J2908j3520l0397l1619j8536J453J3955L1540L4584Q694r244j9068
371A7605l1681k7532n156J6107K5125K9049K0833k174j7587l0201l0249o726N799
384c6788J8312L7246K2559j287r287k4598l3991j6520O552J6240K6546K9590Q266
397D2840r011j9620l2362k0004j836Q174K9279L2099J0683l066j5149l0490k8122
410c6585m313J1968J6497K8744K3792j623j3811k1923k7618j5665K821J9066K8060
$$ y = [-9883, 22841, 45419, 53299, 34378, -654, -32042, -51408, -46151, -23209, 8290, 43938, 54663, 36676, 10933, -20484, -47890, -52239, -28822, 4025, 29069, 48908, 48398, 19277, -14418, -39959, -49383, -37484, -11098, 24650, 48349, 45357, 26894, -1269, -31915, -50480, -43467, -14707, 13452, 36855, 49763, 36243, 5846, -25773, -44309, -42856, -28901, 2639, 37223, 45917, 36673, 17605, -14076, -41608, -46764, -30657, -5532, 23517, 44350, 42176, 24589, -5612, -35861, -42587, -36788, -18476, 18770, 41329, 40042, 30755, 6157, -27834, -44354, -37802, -21562, 4984, 34574, 42840, 33829, 14209, -18153, -38157, -39993, -31819, -2540, 29559, 40242, 37176, 22027, -8463, -36585, -40898, -28930, -12433, 16311, 40103, 38480, 24669, 2746, -24872, -40537, -37716, -18650, 9410]
423I410K4412P258j1010j9210k9863k3074P829J4441J5325L1610J5681j3146j4835
436A4828j9011k7946j0300J4464J9887K5932K2988m399j5613k0201l2870q170
448d0411J6917Q937K1089K9785R8j5628j1219k3155k5414J930J7790J9939K7782
461B8440J2712j1517j6756k6944k3316M353J3487J4215K4279J7465o026j6124
473A4268j3623k2451j9294J0486K2021J8407K2807Q112j8231k4328j9711j4197
485c5734M271K1295J6292J6152J4794j3359j9135q514k5372j2541K3677J7548
497f26J4553K6157k626k9850j7109j5438j4503J7505K3079Q518J9621L929k2166
510A1044p462j4711k7738P873K2030R524K4777J8647k0488k4693j2476j8770j309
$$ y = [9410, 33822, 41080, 30070, 10860, -19003, -42077, -34248, -19807, -4482, 27128, 42809, 29663, 14828, -4183, -32129, -42429, -27965, -8078, 17854, 40842, 36443, 20830, 629, -32241, -40411, -23494, -14557, 6532, 36317, 36415, 20787, 9568, -13587, -39001, -37071, -19281, 658, 28440, 41152, 29635, 12879, -14065, -37381, -33028, -19541, -5326, 18953, 36418, 30392, 14268, 645, -21806, -41100, -30614, -8593, 9814, 32621, 40733, 22502, -1826, -21537, -35734, -31463, -10168, 6124, 22276, 37070, 23711, 4576, -3938, -29310, -41851, -18174, -626, 13927, 40084, 37458, 7608, -9501, -24939, -39442, -21937, 1142, 9660, 29281, 33210, 11044, 3582, -11129, -38867, -30994, -8964, 560, 25337, 43984, 23496, -1197, -13673, -32443, -33752]
523c3752K3324J4647J3496J4108q920j3564j1211k2810j0330J3236J6430J7173
535A1827K0264M207k1633k3273j1895j0573K914K3284J9521P002M714m402k0257
548A700j6841q131p555J2391K5111J1097J3364K710l0884k0415k340j2708R418
561b3083L3107P735rJ2152j5219k6224k459j1098o583K7692J6394O330J8026j5329
575B1432l1428l824j0962r581K8352K1094j868J2981L71k7910j0495m512j4326
588c0676J2350K1724Q564J6717J757k3995j4454j1311j3209J2175K3593R549P587
601B0371N876j1940j8339j1413p726L22J0406J8417J8894J766r479j1564k0517
614a4926j2342M938R028J7387J6044R02j54q737k5271r654N830l185J2043K8558
$$ y = [-33752, -10428, 4219, 17715, 31823, 22903, 9339, -1872, -24682, -35012, -21776, -5346, 11827, 32091, 36298, 14665, -8608, -20503, -31076, -28162, -4878, 14643, 21645, 26359, 21957, 1700, -15141, -23272, -30827, -18436, 6675, 17772, 31136, 33846, 2962, -17453, -19793, -32501, -23083, 10024, 17759, 17750, 29902, 14683, -11541, -14000, -25098, -31681, -3989, 12405, 18735, 36761, 21432, -9996, -13820, -24782, -34363, -6011, 15083, 13215, 26196, 26567, -1343, -11838, -16350, -30676, -18326, 3398, 11962, 28679, 30436, 6441, -8013, -19324, -32533, -20358, 3235, 12784, 20371, 26247, 14307, -4032, -15445, -23171, -22849, -12443, 5974, 24868, 26634, 17155, 5591, -14926, -27268, -22330, -13302, 4085, 20129, 21031, 20877, 12140, -13131, -22785, -16955, -20140, -8097, 20461]
628B0461K501o325K397k1144k1688K681o52J1275K7279L844j849K954k3444k0039
642b1749P416l555j628K6981J3336m365O282j1794k5895n222k716L812K4665J1303
656A6871K20O473j2792k2083l380l344m102J6674J8678N272L734o646j7932j1760
670a4117q516J051J6111J1338R423R991q624j6096j0050j0847j727J1554J2260
683A751J2743P825o415q730r264j7756m272J2737O300J3248J8354o481j3086p229
697b75j6589n877J0062N561J2265J5478l120n702l713k0619j2561J0346M483Q725
711a536K2183J492j0977l931j4906j2625M025K984R814J8468L425l592j727j6505
725c408j6774L031M005M691J8149R889k991l586j2909j3710l435j424R091J7565
$$ y = [20461, 22962, 16637, 19034, -2110, -23798, -21117, -21769, -10494, 16785, 20629, 18780, 21734, -1710, -21749, -14333, -17888, -19516, 7465, 20801, 16436, 22718, 10924, -14971, -20193, -22909, -19097, 5568, 16871, 17091, 23564, 10772, -11311, -14691, -18035, -22137, -5463, 13215, 18487, 22221, 15575, -2357, -14117, -22633, -21582, -5471, 5867, 15290, 25281, 16657, 561, -9489, -20336, -22063, -10509, 1751, 14494, 22319, 15904, 7174, -2090, -19846, -24118, -11381, -5081, 8167, 26521, 20040, 6954, -275, -16864, -22741, -12679, -7118, 5147, 20625, 17505, 11803, 8090, -12529, -25090, -14744, -10261, -1536, 20647, 22139, 11162, 7231, -7675, -20300, -16275, -13291, -3477, 14991, 18416, 14824, 13097, -3408, -20182, -17151, -13146, -8455, 9694, 19583, 16592, 13006, 97, -13613, -17048, -18472, -9381, 8184]
739H184O291J473Q41j2565j5452m387j317L707J4287J1644N345J47j2368j2553
753f723n851p169M671J5849P392O005N344r117j3219q176o944J389J1263J0243
767D957R599N415q660j0787o856j1588j000J3003P721Q349R423n103j0781q378
781d686j0106l014P030Q649J1064R503l292q519p062j2615o136Q142P111Q001
795D070J1592J261o723q794j1588o050J666O006J2145J1031N73m215n306j2170
809f502r856K020M989P590J2253N900j974p582j2097p171j677J198R363J2112
823H566M940Nk771r948j2566m179L135O916J0409Q082K811m136j0398p934m993
838a2061l489N872J1945Q408L638j139p537j1393p600m23M254P768Q543O718J264
$$ y = [8184, 14475, 15948, 16789, 4224, -11228, -15615, -16932, -13225, 1062, 12706, 18051, 18198, 5830, -6723, -12574, -19743, -15072, 777, 8169, 14174, 19518, 10401, -2818, -10994, -17938, -16549, -5286, 4957, 14556, 19971, 11311, 524, -6332, -17920, -18920, -5917, 1804, 10153, 19576, 14473, 3692, -4686, -14792, -17806, -10776, -2127, 8937, 18440, 15148, 6629, -433, -13048, -19184, -11042, -3931, 4070, 15662, 16923, 10200, 1406, -10182, -16232, -14566, -8560, 3585, 14616, 15189, 10974, 5668, -6502, -16358, -14338, -9349, -1759, 10494, 16394, 14420, 6838, -5259, -12430, -14107, -12909, -3546, 8566, 13506, 13511, 10740, 792, -11774, -15953, -12818, -5902, 4507, 12589, 15400, 11264, 866, -7068, -12061, -15550, -9678, 2267, 10675, 14313, 13174, 5637, -5756, -13356, -13779, -9525, -1757, 6786, 13504, 14768]
853A4768p520r368p071o029J677J0130R927N373J271l116q923r815m071K92M712
868g763R565Q979M291l539r020q055o356k303N584R668O927L481J585n547j1492
883c995o683k046J205Q339R794N978O50o151p831o536n854K52Q408Q667M791M154
899A3142j361j0579q807l250j358M467Q650P747M621k710o515o560q058l779N448
914h902Q789O409M808J526o040r081o085k835J376M922Q566Q708N5m802n055r391
930g032o443K660N797P076O833K462j717n691r056n570N34J422O175J1731L050
945A2231l548j871q511r526K34K640M859R231M638k25k070q026q631j123L03K132
961g263J0763P228j431p8n231j1091l853J086K892Q007O893K459o89n747p847
$$ y = [14768, 7248, -2120, -9191, -15220, -13543, -3413, 6514, 11887, 13158, 10042, 1119, -8696, -12767, -12475, -7763, 1802, 10781, 15072, 11533, 2513, -5542, -11898, -14201, -8617, 1051, 7978, 11459, 13044, 7497, -3995, -10678, -12724, -11519, -3180, 6614, 12592, 13242, 7091, -740, -7276, -13130, -12878, -4470, 4197, 8988, 13142, 11781, 1202, -7605, -10855, -12213, -7746, 904, 8651, 13272, 10562, 4047, -2513, -10571, -14350, -8902, -113, 6296, 11104, 12630, 6590, -2491, -8576, -11411, -10035, -5113, 3453, 12161, 12216, 7414, 2359, -7032, -13475, -10815, -5018, 2058, 8891, 11353, 9636, 3945, -5111, -10681, -10147, -8725, -2550, 9181, 12231, 8683, 6812, -1699, -11225, -10991, -8351, -3492, 5739, 10377, 10152, 8082, 56, -8575, -9698, -9395, -7263, 3500, 10728, 9297, 9219, 3988, -7103, -10956, -9870, -6978, 1029, 7922, 10381, 9692, 3945, -3902]
976c902m280j929P47P635Q396K720Q39l177q549o769k723K226O086N565O320K519
992A1724n603n976m550n697n36N968O242N504L777k292n422o225p686j46O387
1007d531K975O709P745m776o045j883p484m357N005M294M934P481L3m732l574
1022A794q682n414N753L029L161J0395J052o686j717n449p992J352N029L948O746
1037F319L862k678l431n902p440J22L181K769Q111N941k547m048m556o325l456
1052a0078K524N638M570M037K891k569o280n450l769p76M015O764N528K862k417
1067G490o293m068m482l309O020O141J278N437K012p503m988k256n054J048P386
1082a141M373M453K912o122n624k607o475J350Q849J661K566O237l749p279j638
$$ y = [-3902, -8182, -10111, -9364, -1729, 6667, 9387, 10226, 7049, -1500, -8269, -10992, -8766, -2680, 2885, 9205, 11724, 6121, 145, -4405, -10102, -10638, -4670, 1572, 7076, 10853, 8561, 3139, -3086, -10772, -10918, -4531, -1556, 5153, 12898, 8122, 2077, 194, -7290, -11647, -6642, -2348, 2586, 10067, 10100, 5368, 1794, -6888, -12302, -6549, -3520, -359, 10036, 11088, 4402, 2685, -2764, -10756, -9404, -4375, -427, 6319, 10181, 7503, 4072, -1830, -9270, -9148, -5967, -3198, 4913, 10854, 8307, 4259, -297, -6622, -10078, -7554, -1916, 2654, 6691, 9582, 7013, 733, -4717, -8486, -9262, -5247, 1517, 7045, 9907, 7490, 1197, -2871, -7353, -10662, -4642, 1499, 2777, 8214, 10226, 2723, -2265, -4521, -9575, -8527, -1141, 3232, 7685, 10597, 4475, -1149, -3756, -10231, -8881, -32, 1629, 4195, 10432, 6683, -596, -2234]
1097b234m010l950M800O300L902M680j145o484l915n034l115N622N259J951M545
1112G172J703n250n143k342l534j361N514O448L534J927k123o076n716l025P43
1127g529M385N247K892K066K34n585n139j049l468J01Q153N007J124K072l589
1142D922q155l453l85L30N701N433Q68K086j707p097k307j551l610M647P524J785
1158E031K172R35o857o654j074o15K177O558L373J216N50m449m621k066l140M64
1174g000O182M838K013J666k143p248m735M8M67L023N888L271L3j649l496m565
1190c407l038m32K384N525M484Q30L85l400p647k508J391J97M212O565J078j751
1206D868j140m337n041o63O93K971O089K469L33k47o142n797K16K06J441O250
$$ y = [-2234, -6244, -10194, -5394, 906, 4808, 9488, 8343, 1859, -2056, -7090, -10205, -4583, 676, 2627, 7172, 8875, 3625, -1518, -3860, -7394, -8755, -3241, 3207, 6741, 8668, 6545, 469, -5247, -8272, -7529, -3144, 2103, 4995, 7061, 7295, 1710, -3429, -4478, -7946, -7845, 308, 5315, 6439, 8511, 4922, -3233, -6686, -7071, -6741, -1040, 4393, 5261, 7347, 5640, -1457, -3764, -5315, -8925, -4278, 3246, 5031, 7203, 8138, 1281, -5373, -6447, -7062, -4885, 1673, 5046, 6262, 6812, 2363, -2258, -4324, -7464, -7000, -818, 4020, 6033, 7699, 5556, -1692, -6427, -6379, -5912, -2889, 2999, 6270, 6303, 4654, 1158, -3407, -6445, -6877, -4493, 1032, 5516, 6346, 6731, 3331, -4316, -6824, -5433, -5236, -1024, 5541, 6619, 4868, 3728, -609, -5650, -6313, -5620, -2649, 3440, 5909, 6242, 5995, -147, -5944, -5728, -5522, -4081, 2169]
1222B169M159q27q99k292n470l026J21J496M729M344J615N27l666n943k484m35
1238e882O37M096N165J950p34j373l696m924j856J315L054L957L739J568k495
1253D521m345l484k608o8K609M127M376R70j545j979m570m508M81K834K207L936
1269B954L940j146l513k849l914k045J633L205M745K944r08j244k913n245j950
1284f306J914J716K890M958J657k655l069l651l048j64J995M362L871M57q6j532
1300C309n022l824Q3J470K444M391L317o77k818l289l086j809J19L372M465J991
1316D436Q83n80m078m371j761N81K092L200L780J831j639l072k965k920j595K248
1332c930M367K681J826N95k906l995k875j125J221K526L650L367P7k591k763l032
$$ y = [2169, 6328, 5501, 4602, 2310, -3160, -6186, -6065, -4569, 160, 4504, 6119, 6646, 2980, -2963, -5447, -5882, -5245, -1149, 4016, 5966, 5232, 3859, 163, -4761, -6617, -5302, -2248, 1709, 5448, 7016, 4521, 176, -3308, -5916, -5984, -3375, 752, 5128, 6098, 4553, 2574, -1996, -6504, -6023, -3189, -982, 2954, 6894, 5748, 2235, -614, -4528, -6573, -4940, -1735, 3010, 5954, 5046, 3802, 889, -4356, -6306, -4392, -2676, 214, 5172, 6829, 4174, 1105, -2546, -5594, -5758, -3763, 599, 4470, 4927, 4841, 3309, -1713, -5537, -5454, -3984, -1540, 2851, 6168, 5491, 2673, -616, -3702, -5511, -5392, -2020, 2445, 4436, 5319, 4739, 661, -3710, -5471, -4890, -2798, 402, 4182, 6013, 4374, 1302, -1663, -4583, -6178, -3930, 437, 3118, 4944, 5539, 2633, -1362, -4237, -5362, -4141, -1615, 2035, 5402, 5479, 2888, 125, -2907]
1348b907k821M97L585K971K359J992j235l601l473k282k7J713L108L977J679j389
1364D146k259k872l422j472K316L340K417K564P39k709l707k675j183K95K358
1379b124M043K814K44j625k719l176k703K21L160K594K250K345o52l588l254j807
1395c977j044J124L869L365J373l18k204k924k934j672J562K983K380K602J309
1410E494k341l815k275j362n44K636L955J934Q09n35k820l435k242j96J961L142
1426C66K717J629j48l088l421j262j308J08M087L285P46P94j076m374k979k31
1442d155K05K230L756J660O59o80l725k532r07j612K109M885J468L58R21l038
1458A602m660o48L5R4L424L255Q90L90k206l611j553j378n0L884L260L28J037
$$ y = [-2907, -5728, -5231, -1646, 1325, 3684, 5676, 4441, 840, -2633, -4915, -4942, -3229, -121, 3856, 5535, 4146, 1887, -985, -4407, -5879, -3563, -223, 2194, 4758, 5497, 2788, -919, -3594, -4777, -4482, -2124, 1919, 4733, 4977, 3352, 633, -2543, -5246, -5025, -1865, 729, 2979, 5324, 4672, 1084, -2170, -3977, -5021, -3897, -28, 3337, 4710, 4392, 2188, -736, -3670, -5342, -3780, -797, 1583, 4185, 5494, 3153, -662, -2937, -4299, -4843, -2207, 1748, 3682, 4491, 3956, 1136, -2299, -4541, -4737, -2776, 366, 3083, 4712, 4564, 1476, -1945, -3207, -4515, -4407, -320, 2965, 3711, 4505, 3429, -945, -3924, -4155, -3950, -1720, 2036, 3696, 4355, 3675, -50, -2582, -3489, -5101, -2992, 1893, 3361, 3719, 4640, 1602, -3058, -3706, -3671, -3577, -153, 3102, 3992, 4382, 2176, -1435, -2988, -4366, -4416, -532, 2728, 3056, 4093]
1475D093j57m344l289P2k78J233M192K608o8j006k357k820j588l31J132L241K680
1492C013O47N31j398m960k389J248J56J829M668J093j892j71j942l927m01P66
1508c129P07L983K654p26J57k544n105j7J526o79L614M396j618j055L40m249k748
1525d493J645K6J597M391O18m83j04m325l355J245N5J139N254J331k393K63j503
1542I08m322k71J289p5K670L417L72o13j948l936j828R20Q59K728L742j09j878
1559A925j30k199l595M24J835J22K510L797p25k207j341l479j944K233J680K239
1575A145L376j136k395L27k826l268K450J269p46M531K769l178j093j465m585
1590d825M39L086P82L040K197k830q68j82m305o94L005o29J549N001p05k761k62
$$ y = [4093, 3936, -408, -3697, -3625, -3903, -2670, 1522, 4130, 4062, 3056, 699, -2121, -3709, -4040, -2908, 333, 3013, 3660, 4191, 2793, -2167, -4556, -3308, -3152, -1323, 3345, 4438, 2546, 2375, 433, -3494, -3895, -3129, -2422, 1561, 4215, 3489, 3646, 1102, -4003, -4020, -2494, -3173, 441, 4837, 3219, 2164, 2504, -1745, -4493, -2848, -2822, -1225, 3166, 3784, 3301, 3197, -1128, -4483, -3238, -3183, -2044, 3210, 4541, 2148, 2411, 908, -3414, -3685, -2396, -2471, 199, 3616, 3988, 3375, 1427, -2509, -4337, -3417, -2558, 170, 3912, 3803, 1925, 1795, -404, -3999, -3575, -1740, -1618, 892, 4689, 3964, 1757, 416, -3063, -5007, -2774, -1094, 1145, 4521, 3385, 990, 1317, -1509, -4777, -2327, -1058, -1804, 2727, 5496, 2318, 1225, -240, -4825, -4386, -1300, -518, 2522, 4719, 1889, 1021, 839, -3466, -4160, -1155, -1784, -235, 4766, 4061, 1300, 1038]
1607A038l199k934K113K099J443K971K64k144p31k066k742R58J524K71K979K770
1623D614j472k048j259k986j752K548K777J173J835K30k577j662j130j777O30
1638b856J900J008K647K031k431k321q45l267n80M354J544K45K709j074l489l32
1654g57j271j992J986J847R29L194J61l498p92j654l264K378L578k26J915J890
1670D424k966k202l11k122k73K382J432J842J846j577k056j095k745p87K963J815
1686E70R60K021j70k841j816o76j155L11K289K018J215O01j171k299k118j361
1702c622M80K509J993R28J074p32l112j230j92j528J113L341J089N12P73k193
1718A203k851r06o78P77K836J310Q11J159k242k827j07j250q23L195K254J8J159
$$ y = [1038, -2161, -5095, -2982, -883, 560, 3531, 3795, 1651, 920, -1146, -3888, -2930, -1406, -1135, 1844, 4614, 3142, 1094, -165, -3151, -4903, -2355, 422, 1595, 3430, 3660, 1083, -579, -1709, -3486, -2856, -956, 52, 2699, 4730, 2299, -22, -867, -4134, -4714, -360, 1184, 1429, 4138, 3064, -425, -757, -2028, -4020, -2034, -187, 742, 3936, 4097, 599, -193, -1847, -5111, -2733, 845, 619, 2534, 4424, 1458, -744, -1055, -3177, -3450, -1068, 364, 2206, 4052, 2475, 419, -676, -3421, -4208, -1245, 570, 1530, 3551, 3381, 540, -1276, -1952, -3107, -2796, -507, 1511, 2726, 3327, 2156, -143, -2261, -3622, -3142, -633, 1360, 2288, 3362, 2630, -482, -1712, -1904, -3432, -2319, 1022, 2111, 2623, 3396, 1203, -1648, -2554, -3232, -2455, 381, 1691, 2502, 3661, 1419, -1408, -1515, -2765, -3588, -393, 1861, 1879, 3038]
1735C038l01l012j819n81m00J679K311J167J269o80k727j220p81j369J292K771
1751F37J184O87N24j432k649j588j83O33J508K018J661j2j545j624j526j281J90
1768b798J755K212J181J88p8j781k671p48M53L77J901K467N14q03j145j904j658
1785b538k55O22J921K136M61K47n32k739j849J52N6J025K621J433l30n79j449
1802D03k130j004Q8J262K156J214N54O4j911k257p00k33L86J970K151O33l70r71
1820A305j845j744o25Q67J657J411J270O56j317k006j281q41k7J289K090J542
1836B401R7o82j118j928j558K42J384J170J569J354n22j749j500j205n56N84J590
1853d27K072Q45l54o21j519k185o23J008J032J288J829M40j207j482j430j044
$$ y = [3038, 2737, -275, -2094, -2675, -3075, -1396, 915, 2082, 3351, 2671, -56, -1276, -2057, -3426, -2134, 637, 1821, 2508, 3032, 1600, -1049, -2637, -2820, -2187, -679, 1339, 3000, 2988, 1443, -181, -1707, -2988, -2798, -1043, 1169, 2350, 2538, 2460, 679, -1992, -2740, -2287, -1910, -9, 2458, 2972, 2169, 1024, -880, -2538, -2793, -2171, -250, 1886, 2347, 2594, 2062, -677, -2526, -2374, -2318, -1293, 1328, 2761, 2431, 1852, 403, -1727, -2731, -2643, -1381, 775, 1989, 2543, 2607, 696, -1561, -2261, -2494, -2108, -138, 2013, 2646, 2276, 1305, -540, -2284, -2909, -2042, -385, 1026, 2296, 2952, 1635, -371, -1652, -2493, -2520, -1231, 859, 2401, 2498, 1816, 698, -1230, -2788, -2546, -1162, 8, 1577, 2931, 2409, 660, -840, -2045, -2601, -2017, -427, 1645, 2490, 2136, 1515, -4, -2189, -2812, -1804, -772, 516, 2345, 2785, 1578, 96, -1334, -2378]
1869b378j02J006K067J554J38l54r13k038j531K66R27R32J790J405m76j368j398
1886d73j315p46M17J648J749Q60R5n62j493k005p22O95Q16J268J938N31j149j203
1904C49j202j402l71J284J677J183P74j91j137j727j420n6P71P98J709J622m31
1921B230j309q78j434j339O06J743J133J058O18p33j555j536q24L18P25J203J779
1938A805P59r66j070q99j712p31J551J475P77J231J34j490j529r45n00L74J098
1955f38J325J451K22j280q90j137j787M11J989Q12R06J253q23j909q63p13n29
1972b200R45J308J173J055l64j265q20j541j095J344J539O47J296N47j688j525
1988f44m71q58m1J437J199R39O24o29j207j265j367pJ468J231Q52J109l97j933
$$ y = [-2378, -2480, -1474, 593, 2147, 2285, 1931, 1018, -1020, -2551, -2285, -1358, -426, 1364, 2769, 2293, 925, -473, -1788, -2534, -2117, -469, 1280, 2140, 2235, 1673, 180, -1825, -2547, -1852, -1036, 232, 2170, 2701, 1552, 349, -853, -2255, -2626, -1342, 335, 1518, 2292, 2101, 964, -763, -2183, -2239, -1468, -670, 1039, 2661, 2230, 921, 43, -1391, -2730, -2124, -381, 752, 1810, 2428, 1695, 140, -1396, -2220, -1902, -1177, 26, 1805, 2564, 1598, 528, -371, -2083, -2814, -1263, 212, 989, 2220, 2354, 864, -665, -1610, -2110, -1736, -638, 687, 2138, 2360, 1080, 190, -947, -2734, -2323, -334, 478, 1384, 2637, 1814, -95, -958, -1671, -2200, -1255, 53, 1226, 2281, 1917, 652, -168, -1709, -2804, -1460, 79, 726, 2022, 2569, 881, -644, -1115, -1973, -2014, -577, 622, 1561, 2185, 1556, 349, -916, -2283, -2290, -822, 409, 1261, 2370, 1973, 40]
2006D0r05l87q81N36J762R09M92N29p98j709j098o84K55J616J262P54O56j108
2024A241j957k40m53q48J382J748Q4O88O57j784j720m46n68P50J976P63O52J19
2042B044j787j160P6j043r7K066Q86Q9J109m20k263r17l21k54J320J591O52N07
2060B078o94j609o89m63o64R78J733L04M63P11j258j921n54j87P4J522J718L40
2078A882l38p67j282q22k05j9R98J390L42M76L25j843j736O6j05K28K174J296
2096B060o48j84n90j684m90J87LJ371J150J11N69n09k280p02L70n18J092K354
2114A662J0n74J91j342j469M8J08N56J375O80L21J82j467j563q9j64J3J940J386
2133A804m12k24k91j515j066K36M90O86J052Q42J14p38j304r82j62n5P82J709
$$ y = [40, -865, -1252, -2133, -1597, 165, 1074, 1566, 2095, 1297, -412, -1510, -2194, -1939, -323, 939, 1693, 2349, 1241, -716, -956, -1409, -2257, -875, 873, 957, 1645, 2302, 518, -1202, -1648, -2216, -1466, 510, 1273, 1925, 2044, 257, -903, -827, -1870, -1967, 99, 985, 1074, 2183, 1763, -500, -1417, -1738, -1992, -672, 919, 1571, 2078, 1384, -225, -914, -1377, -2041, -1063, 670, 974, 1437, 2148, 890, -1031, -1585, -1772, -1698, -176, 1542, 1882, 1544, 777, -505, -1327, -1532, -1551, -553, 837, 1179, 1655, 1980, 137, -1599, -1533, -1638, -1410, 764, 2060, 1412, 1228, 638, -1046, -1536, -1349, -1346, 25, 1175, 1286, 1855, 1346, -934, -1636, -1266, -1784, -692, 1662, 1672, 1098, 1289, -53, -1522, -1474, -1366, -810, 565, 1245, 1566, 1748, 281, -1282, -1371, -1535, -1522, 418, 1804, 1392, 1168, 877, -638, -1704, -1468, -978, -292, 760, 1602, 1716, 978, -326, -1308, -1470, -1525, -743, 966]
2151I66P96n19k67n05j647p19Q06M22N17J430N78o71p12j107r39N9L52J017J539
2170A396J83n92j6j020j680K06P48M1J231J368l91o57o76j249n25L04N75J270
2188E16J025k58j62m61j594p95O21K62N38J529N69o24o57q45j012k98N41R97R74
2207H66M33P7l66j139j145k07L63M67J038J157J03q60o99o41j021l0J079Q00N87
2226H62O74j63r66j052o87m9N01O54J060Q35l88q50m33j015q43P58J027M87Q35
2245A247L16p02r34q14m70J05N45Q97J137K54p34n08q21j059P4R35N88O42P55
2264A453j4r27r50o59k98K35R11J136N32k73m26o96r89n10L76O83P21P85M82m92
2284A080j186o71l46k61N05J218P09R8k4n25j106p69o3N18P60O80P02J06r21q90
$$ y = [966, 1762, 1243, 976, 471, -1176, -1895, -1089, -667, -150, 1280, 1858, 1187, 475, -632, -1571, -1512, -1160, -143, 1396, 1579, 987, 971, -49, -1729, -1523, -775, -734, 497, 1865, 1474, 817, 141, -1108, -1633, -1329, -754, 516, 1541, 1283, 1121, 660, -934, -1729, -1108, -846, -308, 1221, 1790, 1166, 509, -336, -1348, -1646, -1105, -108, 866, 1299, 1376, 1010, -129, -1274, -1481, -1118, -651, 387, 1544, 1647, 787, 88, -553, -1574, -1604, -525, 275, 862, 1536, 1373, 407, -645, -1332, -1381, -880, -226, 834, 1669, 1281, 431, -2, -1017, -1860, -1102, -75, 412, 1247, 1563, 861, -73, -887, -1357, -1252, -707, 190, 1327, 1581, 847, 339, -482, -1541, -1467, -532, 56, 698, 1453, 1439, 512, -438, -1097, -1395, -1160, -249, 887, 1419, 1146, 720, 24, -965, -1475, -1099, -416, 305, 1090, 1572, 1080, -106, -777, -1123, -1384, -879, 339, 1048, 1146, 1122, 597, -509, -1278, -1341, -823, -63, 617, 1319, 1425, 504, -386]
2304c86l51n40o1J040J066K78J58k14q97j027m18K67O23N44Q78N78n41r22n54
2323d79n29m51N42J159O52J50J24m75j042q41j9L91M49Q32Q63m6o99o80n76n87
2343a262J1Q34J001L60J79m9p85j106l91K38K57O45J065L31l65n82p50o12l16
2362a297L72R83O34K83J87l36j105p56OR2L71J044P46p3m48o12o82n77o4P46P98
2383C12M58L56k5p88j000l32N3R3P56J006K97k97l94o42p60m09N14P21M99N42
2403I60K78m73r08o55j78l5L64J014P45p5l12m08p82p82J70O33M80O14N20j20
2423A050p01p99l77j75M6P72R63L03j83k77n61r87l29N21M85N07O51K59m00p64
2443Dn93l38j94M69R27O41R5k76l49q11p05J84M08L40P00O33p1o95n70n03m57
$$ y = [-386, -737, -1277, -1338, -298, 768, 1046, 1204, 990, 93, -934, -1352, -1085, -462, 82, 960, 1538, 997, 75, -479, -1008, -1459, -917, 242, 894, 1044, 1168, 693, -349, -1190, -1209, -818, -369, 463, 1326, 1280, 581, -99, -675, -1262, -1251, -417, 584, 944, 1123, 1074, 289, -817, -1208, -970, -713, -68, 997, 1328, 963, 381, -369, -981, -1297, -925, 58, 692, 975, 1162, 826, -279, -1035, -1029, -937, -566, 478, 1224, 1151, 703, 91, -591, -1168, -1232, -486, 312, 770, 1126, 1101, 313, -687, -1019, -966, -873, -117, 889, 1186, 889, 495, -147, -907, -1316, -802, -81, 418, 960, 1238, 765, -143, -798, -976, -1011, -647, 367, 1112, 1037, 725, 317, -465, -1247, -1077, -444, 36, 650, 1170, 1050, 349, -450, -827, -1002, -956, -184, 779, 1082, 899, 622, 61, -926, -1255, -734, -249, 258, 909, 1168, 768, 4, -589, -927, -1121, -652, 275, 916, 1011, 735, 386, -425, -1130, -946, -538, -198, 502, 1135, 1064, 369, -201, -704, -1161]
2464a161J96Q12P00L54M6k79n62q77l21L40L01N65Q01K49m57n99m14n71l41O22
2484e96P57N18K70l6m42q97n50J31K01L64P00O07l8n94l92n11o80J37Q75O08K90
2505G22K48j45q01p31p8l4K39O34O31L97l06n57l87o58l77N73P94L72K49K83n60
2526E08r71k43p8m6N45O28N45M7m08m33n32o41N7P26O19K45L81l9q96n38j23k06
2548h53K01O18O80L13k20l07n72o87j93L76O33M23L36K68m51q01l42j28j42L61
2568d87Q64M89j24n7m02q36m11J36L51O38M32K59Oo44o85j36j17j41P05R02qm3
2590F91Mq61p14O3J45M69N93L17J79k45p35m05q0k99K37J020L92j43J96m53r38
2611e67k84J33K05M97N52L18j04m91m88l23k26m0O07P63J31O4p1p14p39p6K87
$$ y = [-1161, -965, -153, 547, 901, 947, 668, 106, -771, -1092, -752, -451, 114, 915, 1164, 707, 108, -306, -877, -1218, -596, 161, 679, 949, 913, 471, -426, -976, -845, -644, -280, 420, 1027, 989, 395, 3, -508, -1188, -1051, -176, 432, 722, 970, 825, 24, -707, -785, -819, -580, 54, 685, 1082, 776, 219, -168, -826, -1203, -630, 164, 536, 785, 1068, 508, -463, -706, -784, -830, -285, 343, 888, 935, 527, 94, -438, -1079, -1022, -296, 323, 568, 949, 910, 14, -524, -647, -853, -652, -34, 646, 959, 739, 432, -140, -827, -1020, -644, -11, 412, 748, 1016, 565, -236, -578, -706, -848, -487, 377, 866, 742, 685, 283, -553, -964, -828, -477, 161, 593, 852, 858, 214, -471, -607, -724, -865, -160, 742, 734, 691, 695, -166, -880, -817, -672, -203, 390, 707, 886, 641, -94, -499, -579, -878, -641, 379, 771, 628, 824, 371, -567, -851, -718, -513, -16, 536, 854, 750, 259, -229, -552, -778, -818, -211, 552, 683, 747, 676, -38, -777, -853, -566]
2632e66K58M50O58J0l90k61m50m49q9K70O34N85J18o8k73p85n66K53K68R6P68
2653D71M72m19j39k65p21k48K00L60O15M18Lj61m69p82j40L60l9M70Q35j36k82
2674D03j8n93o12JL49M12N36L15l2l45o97m64J63M0J73Q07L60k25j48k62o00m49
2696h86J97N03K78M40L62k74o04m81j64l5J41N66N05J42j73k45k50o82l13N56
2716d17L41K62O34M0n81m59k83k12P6L64M87M06L5l08j46n30o70L42M54O5O00
2737E00M57m15m88k65l73j52K84M37M67K47j91j84k69p27j49M44J53L54O30K2
2757G82m42m18k65l22l7M46M91K93Q9j03k27o07l96J49K33K57N44K95j17n02l07
2778a64k22l70J65O10L56J20J29j36n61m62o5P5K73L98M53K31m30m53j43m11j93
$$ y = [-566, -308, 142, 800, 810, 420, 159, -291, -740, -829, -559, 75, 660, 778, 710, 437, -348, -914, -661, -393, -297, 471, 943, 524, 385, 120, -601, -849, -649, -289, 326, 744, 747, 586, 117, -665, -805, -445, -484, -14, 821, 685, 403, 385, -208, -820, -819, -470, -58, 478, 793, 761, 416, -281, -745, -582, -542, -369, 438, 798, 573, 425, 163, -437, -886, -689, -186, 92, 532, 894, 620, 16, -465, -629, -664, -523, 43, 548, 690, 517, 272, 22, -660, -973, -417, -76, 186, 820, 860, 279, -180, -463, -675, -599, -235, 252, 658, 693, 385, 239, -291, -961, -619, -165, -100, 500, 957, 542, 54, -211, -584, -736, -452, -15, 452, 699, 508, 324, 55, -672, -821, -377, -224, 130, 760, 782, 340, -78, -343, -665, -702, -256, 235, 528, 617, 514, 287, -320, -716, -567, -334, -77, 467, 762, 645, 143, -164, -386, -756, -591, 19, 375, 495, 624, 488, -73, -535, -600, -525, -252, 146, 599, 830, 400, -53, -196, -607, -800]
2799h00N42M51J15K60R4m39n43k08j20K00L85L94M38j37m89j68l32m04K05N22
2819c4K53K49K18j50o27l55r9k0K52L96M35J43k79k32k80n02n8L59L71L07K18
2840E65Q8m05n13j71r4mL57M80L43j12j83k65n12k24J44L51L15K26K49j09n35
2861ik97j22j56J26N79M22l4p4j13n11l83j8K52L21K35K89J97m59m39j11k02j11
2883f18L98N79J35n3L5l48n35j96J23K66K65L15L15j85m60k57j72j99J43N18L49
2904D18LP1p8n78l69MJ47K37L49L52K5l04l42k36j62j25L08N17J63K2J02l30o00
2927d06j47J45Q3K52N01K28k48k11l04l08j34R6M40L90K5J16q6n00m19L1R8M5
2949c13M93M36j50j94j21m02k90M9K34M01J93R9O3k41n69k38K15m0J63O72J13
$$ y = [-800, -258, 193, 308, 568, 662, 223, -320, -528, -648, -448, -63, 331, 769, 632, 143, -25, -357, -761, -556, -34, 219, 468, 686, 536, -91, -446, -545, -565, -313, 83, 518, 661, 382, 150, -130, -632, -690, -331, 40, 347, 565, 653, 248, -265, -436, -530, -534, -177, 303, 646, 534, 351, 86, -426, -650, -506, -155, 160, 386, 635, 526, -9, -306, -428, -584, -458, 121, 543, 509, 435, 322, -189, -572, -590, -338, -17, 218, 507, 704, 245, -194, -305, -507, -618, -220, 359, 494, 441, 476, 128, -407, -603, -480, -214, 51, 366, 681, 496, 36, -221, -393, -592, -449, 69, 418, 421, 492, 414, -164, -533, -529, -382, -145, 204, 556, 581, 277, -65, -301, -463, -588, -280, 237, 400, 422, 524, 194, -406, -553, -408, -325, -73, 428, 656, 408, 197, -107, -415, -549, -453, -13, 377, 402, 518, 432, -68, -487, -456, -358, -313, 180, 616, 466, 272, 151, -251, -541, -492, -258, 143, 336, 435, 498, 257, -312, -550, -335, -375, -212, 460, 573]
2970E73k96%k48m58j38J99K39L09K65P5j26l59m69k3J47o6M79N13k08k02K4l89
2992a59m33J31K81R4L29L16j21j99l74l68P1Q0J02N70K44k96j02J5n18k80L46
3013b71J12R6N26J36l25j78l51k39J15R9K88M40M5k62j9j96n89P3M13r7K44N78
3035F38j74l44j08l41k49K21K41K64L23m8k80%l32m18L22J78j03N64L55m32k64
3056A3o3m28j19M48K20J34K76j45k08r2l77j87L49N3J08N97K2n10j17m9n60J56
3078d79N49L1J52K63k42k45j52l07k5K94O5K71N39l15m91Q8k67m57N14M12j53
3099D5K72K11l71k55o7k72RL25J14L65K60m29k89L9m43q7O30J31j23L67M5n09
3121c2j19kl37R5M10J34L21O3m40j55j71l45K69N02q4K3L74k28m63R0j13l81L40
$$ y = [573, 277, 277, 29, -429, -567, -368, -129, 180, 445, 520, 394, 35, -434, -457, -310, -376, 103, 616, 408, 206, 230, -159, -592, -461, -180, -86, 243, 559, 438, 239, -135, -503, -432, -352, -250, 320, 564, 268, 166, 181, -337, -617, -271, -159, -63, 463, 599, 274, 96, -255, -494, -379, -280, 8, 448, 493, 231, 212, 16, -573, -500, -87, -184, 60, 638, 464, 120, 12, -329, -578, -357, -116, 148, 471, 423, 143, 143, -189, -607, -285, -107, -210, 354, 709, 277, 13, -50, -478, -597, -149, 71, 205, 481, 336, 128, 36, -341, -528, -179, -126, -18, 579, 601, 91, -26, -75, -635, -479, 70, 101, 253, 516, 274, 29, -123, -430, -455, -161, -96, 175, 714, 399, -92, -4, -271, -728, -214, 198, 45, 317, 528, 157, -98, -165, -437, -428, -103, 11, 376, 636, 207, -82, -43, -486, -573, 57, 188, 65, 432, 477, -32, -151, -153, -490, -395, 15, 149, 470, 533, 93, -62, -233, -578, -309, 193, 109, 132, 506, 278, -185, -95, -208, -589, -249]
3144b49M51O2K00n8m00j77j76j26L42L14q6J87K58m80l05J86k81k39N81K90n4
3165B40J69r4m40k06l9j1L51K04o7L18k1n17m0K9m21J38O13R7m7J71k32m50o8
3188c23L1J7L18J27J02J82k87l04J0j47k28L93M07o1P3J09m40l48P0LQ2K60K20
3211B66M7m2k23j87p4j77k3M42K71j07J66p9m90j84J92m7P1M07J16r7k1k10k31
3234b14r6o4J84L85R5p5J88l31l99N9R1j15K46M09o3j10Lk53k61j1J4L05K23J7
3258B27R4k8m07k31J33m4J3L92K28j57Lr3l20j61J7J92K31J05J33j4k13k83p7
3281b60L6k2J52L79M7j47Kj34l55n3J79J19J12K17J26k11k23j81m8J9M7K53K80
3304C34j05q4O4k99l06J19J73J4K44K45j39j93j22j53p4j7J97L14O9r0N6j85l75
$$ y = [-249, 202, 264, 464, 406, 6, -171, -347, -473, -131, 183, 97, 284, 542, 62, -243, -57, -338, -577, 4, 294, 240, 409, 315, -125, -331, -370, -381, -30, 174, 107, 425, 404, -113, -153, -124, -545, -407, 206, 303, 256, 427, 195, -255, -323, -292, -275, 43, 170, 272, 454, 167, -137, -127, -274, -502, -109, 298, 237, 310, 419, -21, -369, -299, -296, -214, 46, 266, 313, 271, 48, -139, -213, -390, -413, 29, 300, 193, 359, 280, -210, -394, -202, -249, -178, 229, 345, 248, 227, 17, -214, -310, -374, -190, 195, 290, 215, 403, 72, -327, -268, -177, -292, -46, 363, 300, 190, 193, -60, -321, -332, -318, -13, 210, 227, 321, 293, -114, -345, -212, -256, -243, 149, 377, 220, 223, 130, -190, -351, -334, -142, 89, 194, 327, 313, 100, -183, -260, -224, -246, -94, 285, 332, 185, 187, 53, -302, -355, -176, -57, 55, 272, 398, 187, -36, -217, -265, -246, -199, 54, 334, 229, 145, 209, -90, -396, -277, -104, -90, 154, 399, 260, 67, -55, -208, -282, -299, -102, 212, 281, 191, 247, 62, -313]
3327c13l5K04M4Q4L17P7k30j53r9j56o7J31L06J09k5N0p6l11j53O4Q7K8K34K36
3351C53m3k60r1p5k08oL16J69JJ08Rk21k66p1R4O1P7K79J47k00j63Kk03k00K10
3376a81K72J5J10P9j48k34j68K9N8J7K19K85j12j69j6j39k63N2K61O6P6J67j7
3399B59k06k12o0mJ4J67K69Q7j31j03m7k61j04J83K01nJ88P2j56k37r1j8m4Q2
3423a57K72J24Oj04n2j49l10Q4K30N3Q7K22j6k99j38L2j46j2K73J73K6L3j32p8
3447B2k30j07J88J19N5J49J67k30k29M6j09j62K06K25K9P9qj45j88j66L7J40J18
3470FO4K11ol04m4M5k46k5L50P9qJ01pk64j39l7K8J23Q4J50J67j49k45K3p1k34
3496c48K06K89l8K9J87j59l31ml8K9J74J19P2M6j98j00M2j83j01K86J70j13J69
$$ y = [-313, -348, -144, -100, -16, 301, 378, 148, -5, -104, -260, -327, -196, 110, 219, 194, 244, 168, -143, -296, -232, -145, -117, 117, 353, 310, 50, -41, -116, -324, -330, -14, 155, 156, 264, 273, 52, -214, -285, -191, -130, -53, 226, 373, 173, 10, 12, -191, -391, -181, 91, 106, 216, 295, 147, -87, -255, -226, -168, -151, 68, 353, 241, 72, 56, -83, -346, -294, -33, 33, 109, 276, 259, 53, -159, -219, -223, -209, -42, 227, 314, 183, 80, 33, -228, -332, -149, 52, 47, 235, 307, 151, -86, -177, -195, -239, -157, 115, 239, 245, 141, 89, -60, -370, -286, -56, -3, 84, 306, 290, -9, -147, -115, -261, -273, 0, 173, 199, 232, 100, 22, -208, -315, -127, -8, 47, 196, 363, 133, -96, -50, -159, -321, -115, 110, 139, 218, 210, 65, -123, -289, -252, -112, 6, 70, 281, 275, -29, -73, -28, -274, -299, 51, 130, 122, 223, 216, -48, -187, -224, -196, -73, 11, 161, 328, 179, -66, -43, -114, -348, -142, 147, 109, 138, 325, 166, -165, -169, -207, -178, -4, 115, 187, 233, 35, -65, -23, -206, -307, -21, 149, 36, 205]
3519B05J03l71j60R4p2M0K26R2K6m6r2j00n0j57P9K77J0m4K46p7m51N4Q1j49J64
3544g2K91l0j08M0p9j68k3p3R8K12l1J44J27l12k91J74l5j23L01K26j60MO2k11
3568c7j02k6k4J58J52jJ48l1l50j01J51j38L6L87j0j87J28l4k49m4M6j3J19J36
3592A14R8Qj39k40l5J13j30J67L12k14m6J99j88k51Q9M8n7J60K33m1r8j14j45
3615a57L0nm0K68J25k20J33N5k82j38J77o2n5L42J00j75k0r8j73K6L0R0K05l8
3639A18p5J36j01k86M3J32j60J37L61j04j54K6j54j38P5Q9J09P1nJM6k07j76J54
3663f2k7p5K75J90k00o9K8j64j39J63Q4QJ06J9pn4j95o7J01r3J02K93j2j70Oj7
3689B4k47J5K29l3j3J84j9n5q5j11ql1K6K07J55q9r6N1j72k02J92J26j04J34J38
$$ y = [205, 308, -63, -223, -129, -201, -161, 65, 157, 183, 137, 45, -55, -105, -262, -183, 94, 104, 60, 306, 229, -222, -168, -87, -236, -72, 219, 189, 81, 121, 42, -126, -149, -222, -124, 88, 57, 201, 328, 16, -275, -101, -136, -259, 42, 268, 108, 112, 174, -37, -139, -165, -189, -31, 121, 120, 268, 237, -113, -214, -63, -201, -165, 222, 212, 25, 153, 119, -130, -174, -128, -141, -22, 114, 212, 220, 81, -159, -194, -81, -211, -44, 268, 54, 8, 207, 19, -232, -143, -95, -152, 8, 241, 200, 102, -12, -157, -127, -132, -172, 96, 221, 1, 134, 189, -93, -231, -54, -116, -171, 171, 271, 96, 76, -22, -195, -169, -139, -49, 156, 118, 43, 179, 78, -208, -165, -33, -193, -56, 305, 201, 47, 73, -81, -219, -144, -55, 54, 125, 120, 121, 167, -40, -216, -62, -89, -164, 111, 301, 101, 32, 60, -104, -243, -80, 4, 12, 118, 137, 130, 76, -119, -186, -85, -178, -76, 217, 205, 35, 41, 24, -223, -208, 21, -12, -25, 159, 140, 85, 0, -111, -119, -150, -124, 83, 238, 149, 53, 104, -68, -270, -78, 48, -56, 78, 216]
3714B16r2j21n6m8p0J7J48J48N9j23l6nk27j1K16m5k8K10O6j47j04lq3p3J46J40
3740I4O1k8m7j7j13j52J06P9l9J04J64n5j73Lkj97O4J78O3L8j5Jj46j33J3J25
3766b4j4K5J16J17j78q4N4j55o3J82R7K7KL2n7j63m0M5K8J5J21R8l8j49J9l7j49
3793a73N8J51M6k2O4L6j77j15P5ml4J00J33J4j55K2k3j21n8J27J23l6L3J08j29
3818D3j69N0J5l9J0J86O4n9q0kp9r3K5J45K3j5J18K4k13m8N6o4kJ25J20n5n1Q
3846D3n6j11rP4Q8l8J26M3j06j28J7%n6K2J96M1j13L9k3j27n2M1R2J7J2J56p2
3873A16j01o0lo6oJ38J55j21j1Q4j66j00K0O6J4K6J60Kj08o8j5o6k4O6J86n4k0
3900D4O5m5j64k4R6k2J8J34L6o2p8Rn6p1NJ66M7p8P1K1j13j24P0J3oL2J64k3p9
$$ y = [216, 124, 3, -53, -101, -171, -154, -6, 142, 201, 78, 42, 37, -190, -201, 15, -30, -58, 152, 218, 71, -33, -36, -119, -192, -46, 94, 155, 127, 80, 63, -50, -202, -96, -17, -56, 48, 212, 157, -16, -13, -15, -212, -148, 30, 93, 131, 116, 117, -29, -162, -149, -24, -38, -13, 103, 220, 42, -42, 12, -143, -206, -24, 73, 100, 102, 134, 77, -86, -126, -81, -53, -38, 83, 181, 143, -6, 13, -24, -173, -115, 36, 82, 60, 124, 160, -17, -132, -57, -61, -95, 5, 138, 152, -3, 19, -4, -125, -183, -56, 67, 31, 64, 172, 43, -126, -76, -61, -100, -90, 96, 160, 101, 21, 19, -60, -153, -128, 17, 40, 25, 143, 167, -46, -94, -38, -102, -104, 21, 141, 86, 35, 43, -13, -124, -133, -59, 29, -9, 117, 160, 54, -74, -57, -57, -113, -91, 105, 146, 33, 72, 49, -78, -130, -89, 3, 20, 32, 188, 116, 15, -45, -48, -114, -120, 18, 173, 52, 41, 125, -41, -141, -121, -55, -41, -15, 145, 147, 39, -29, -44, -110, -134, -68, 118, 64, 44, 109, 64, -100, -124, -28, -50, -32, 102, 138, 76, -2, 7, -49, -120, -115, 51, 98, 20, 91, 112, -1, -125, -55, -42, -48, -16, 148, 125, 46]
3929D6n0op2o9J26R4m4J2P6p0j31l9R7n0nJ68N8o5p8Mp6p3O6J43%j0P8m3j00o9
3959h2M7Jr1J12J45l0o4on4j01k8J54N3l2L0P1q8j33L5M2j28P2J89J2r8J7k9j19
3987a03m6J04O1rK9P2Oj43k5P8p2m6J20R8m1m7L7q2j14L5J02kj7J00lr2n7L0k5
4016e2p4N9J44Mn5M5l6j51j2J35j4qO0O4o2r8K6Ro7rJ30Q4o2k2N9j29j16Q4J02
4045C8m0OQ1Qo8l0L1q9m6O7J15j8mK7k4j85L5J02j3n9J24L7r4j5M5o2p7O2P2N1
4075G7k5K5K7j28j04P6O9p0M4J25p3o1N0lj37K4Q4K3K3L8J1j04r2K0Q0k0l2J20
4103F7L3j26M6L1j11p6R0K6K1M7O0p7j01k4O7L0p1P0J14r3l9R1n9j15K7P6OJ5
4131B5O5Nj02p6JO2K0k6J23j7j05O5M3j51m8Q4K1oJ13L6j40n5M4qk0L1N3L5r5
$$ y = [46, -4, -10, -82, -151, -25, 69, 25, 37, 113, 43, -88, -127, -30, -80, -85, 83, 141, 76, -2, 2, -74, -147, -81, 62, 62, 52, 130, 87, -13, -82, -35, -34, -125, -13, 132, 102, 38, 32, -22, -123, -151, 3, 56, 24, 54, 125, 37, -96, -61, -19, -147, -75, 114, 126, 28, 45, 16, -103, -149, -45, 16, 7, 36, 108, 114, -29, -54, 24, -48, -94, 26, 124, 83, 36, 73, -9, -123, -88, 14, 12, -5, 95, 92, 0, -57, -27, -52, -126, -67, 77, 81, 26, 71, 35, -116, -128, 7, -7, -15, 45, 109, 47, -51, -25, -16, -83, -92, 38, 122, 60, 38, 97, -32, -148, -64, 38, -2, 4, 85, 93, 25, -5, 26, -63, -109, -42, 73, 55, 51, 78, 54, -131, -96, 6, -7, -66, 58, 95, 1, -14, 31, -31, -108, -46, 26, 77, 52, 77, 104, -24, -128, -52, 17, -53, -9, 116, 43, -18, 32, 29, -108, -84, 0, 23, 46, 84, 95, -9, -101, -81, -1, -21, -53, 67, 100, -26, 20, 51, -60, -136, -46, -20, 1, 48, 108, 31, -70, -94, -27, 3, -68, 2, 116, 23, -16, 75, 16, -99, -72, 4, 10, 25, 90, 95, -7, -83, -82, -20, 0, -26, 97, 80, -25, 40, 83, -68, -116, -32, -11, -17, 96, 132, -8, -63, -19, -27, -47, -16, 37, 72, -23]
4160b3J0R2q3j03L1J40q7QJ62l6j49J9J0m8lQ2M1l9k7O8%j51l1J28mm9J35M7j39
4189Al7J9%p8P9N0Pj5K5Qk1j63L3O3j9O4J12o2j29N0L3j08PJ15kl6L1O7o5j01
4219g2pP9k4nJ04L4j36l5N5j6q7P1R4p1K0P8o1p1k3M4MoO9M8k9j00M8M1j45J2
4249h7J20j9l4J15nq9l9K5l4nN9Q3J2q3o8Q7p3r0J46L9j06Q1M1k5j50O3K3n8J3
4278e8J05M5p6k5K4pq8K2J00k9mO2Mj05m6Q8o1k8R8M2l5l3M3Rj30K0R7%n0O2K5
4309G1o7p6N9Pq6O0J16m0m4J7K5r6j5M2J9j5M2L9K8j53L5N4o7k1J22J2m1j1N4
4338G0p9p8O8L4k6KP0M0q9n1L0k6q6J04O4j3m7Q1l1j06NQ8l7j3P1O8o6q9M9l3
4368b6o4L9P6M4q3M0L8p1o9J07m3n2M8J02l8p3L3Kl9m8O0Q0p1L4O8p6j18N6P2
$$ y = [-23, -13, 79, -4, -107, -76, 64, -23, -15, 147, 111, -38, -19, -9, -57, -60, 22, 63, 24, -3, 65, 65, -86, -117, 11, 7, -42, 93, 140, 1, -36, -17, -17, -95, -16, 34, 41, 26, 51, 59, 38, -125, -92, -29, -48, 16, 128, 66, -63, -13, 20, -88, -81, 34, 32, -4, 27, 94, 29, -72, -79, 0, -24, -29, 75, 109, -27, -62, -7, -23, -110, -39, 55, -16, 4, 82, 21, -50, -73, -29, -25, -31, 38, 86, 57, -43, 5, 46, -99, -87, 33, 14, -20, 95, 90, 1, -38, -13, -47, -52, 7, 90, 102, 19, -49, 38, -35, -125, 21, 60, -46, 35, 76, 51, -99, -36, -13, -71, -58, 47, 92, 16, -9, 15, 8, -80, -58, 42, 13, 9, 71, 75, -30, -76, 12, -49, -77, 21, 63, 28, -5, 38, 47, -83, -63, 34, 34, -16, 46, 71, 4, -72, -13, -6, -92, -32, 84, 44, 0, 17, 42, -54, -69, -27, -8, -23, 19, 58, 86, -67, -32, 22, -45, -66, 56, 68, 27, 16, 70, -9, -87, -19, 15, -11, -9, 61, 101, 12, -39, -9, -35, -121, -17, 47, 34, -13, 68, 37, -69, -64, 24, -13, -26, 45, 113, 47, -42, 7, -26, -90, -51, 25, 69, -14, 26, 64, -7, -76, 31, -12, -64, -16, 86, 48, -25, 8, 10, -29, -77, -17, 63, -8, 26, 94, 18, -100, -44, 28]
4397B8n3l2Q4O2r0oK4n7l0K5Q1Ro1O3K1r5n7P3Pl3L5R8m2r5Q1k3o3l7J15k1%L1
4429D2M1p1o1NM2l3k0J12j7p8O5K1j04n2J08J8l6M4K0l0l5j4J2J0l0L9L1k8qN7
4459E0m7j00O6P1p4K7P9Ro5m7oK8l7K0O2Rm6J6L5q0n2O6L8o7Q9N9j14l8N7l6k3
4490e1jO7lk0JL2K3j12K3P5n3j2J15Jj20K8J9r9M1R2k1k4J7K4k7n1m0O4J8m6N8
4521A8R8j31l8P3o2o0J16K9n3JL7%n3K6l2L5l1pR2Nj20K7R0j55QJ85o6o5O9K3
4551E9q3ML5n0j9L3N6M5n0p2P0l6j29J44Q2j19l2J43p8p8Q7oq1M7O9JKp6l6Q6
4581A8q7mJ19Oj15Q6P9j27%Q9r3n2J20J5j7Nm6j3Jn9O1Q5p7n9J47n1j18P9M0j48
4611a16O0J48m7n0O1p3o5M0j0O5J9p6K8Q8j35MJ21p3j05J56M3p2L4Lq4j4M1j6
$$ y = [28, -25, -57, 27, 89, -1, -7, 17, -40, -70, -45, 36, 45, -16, 47, 68, -27, -84, -11, -4, -37, -2, 96, 54, -41, 40, 17, -46, -83, 32, 11, 11, 42, 83, 12, -49, -44, -2, -35, -55, 57, 40, -38, 27, 48, -56, -108, 0, 18, -18, 26, 46, 16, -19, -33, -21, -11, -41, -2, 29, 1, -7, 50, 3, -97, -31, 40, -34, -7, 72, 81, 16, -31, -37, -9, -46, -26, 36, 45, -1, 15, 50, -30, -82, -16, 22, -45, 44, 103, -11, -49, 8, -28, -51, -52, 15, 12, -8, -7, 25, 48, -64, -41, 34, -19, -31, 84, 85, -35, -7, 12, -87, -46, 46, 25, 1, 18, 42, 15, -36, -76, -12, 6, -40, 18, 116, -15, -53, 20, -42, -102, 14, 43, -10, -9, 28, 28, -25, 1, -31, 4, -27, -34, 58, 63, -57, -30, 60, -95, -87, 98, 32, -33, 36, 59, -24, -20, 15, -35, -54, -21, 35, 80, 30, -42, 28, -8, -137, 7, 89, -30, -62, 81, 3, -75, 12, 6, -75, -28, 41, 42, 44, -32, -68, 18, -69, -73, 46, 52, -63, 23, 102, -25, -25, 64, -29, -81, 39, 54, 37, 42, -4, -17, -16, -75, -14, 71, -6, -65, 82, 31, -87, -8, 32, -116, -56, 92, 45, -5, 56, -17, -82, -42, -52, 13, 32, -44, -16, 72, -63, -59, 62, -11, -116, 40, 83, 11, 45, 48, -36, -50, -9, -25]
4639b5M5om1N1Qn3K5K6j43M5J45j4j16J20o1j42R0Q0p8K3M4j3L7l3k8J9nq1J02
4668B1P8j12j5J26j39n6J17Jp2O8L6k9JQn3K2k8j9J32Oj17O4J4j42O1Q5q2o3J41
4697E4k9m6M1qq2N2n8M3J05p2l4O7n5q7J13O4j43L8J26r7KN8m1n9M9LPK8j5K5
4727D9j9r8%R9rp5P9J8j03P0M7j08k4P6K4m6N6Rj6k5k3L2k7l4J3J19o1n9J07n3
4757A8r7M5P5p2K5J02o6o2%K3J9%o5O5L7n1k0Q3o1r1P8L9r4Q7P6r8l7M7Mk7j7
4788c5K8K6jj1M5n9m3lJ13p7rJ26m7q5JM7k0m7L4M6%k3J7ql3m5Q6kn9L6O2o9l6
4821d5O7k4o2K6O1l8%M0K2p8m4O8J3oj0N5Jo0JM6j02OR9km8K4N5m7n6J8J8k5J
4854b6N6O2p0l6KJ4r3P4O3o7M3M1j7j13L1Nj3jN2L9l2oNKo3K2N8jo2M0O5p0l3
$$ y = [-25, 20, 14, -27, 24, 32, -21, 4, 30, -113, -68, 77, 63, -53, 67, 6, -136, -46, 34, -44, -21, 23, 10, 47, 14, -14, 5, 0, -81, 21, 99, -13, -28, 98, -41, -97, 20, 21, -51, 17, 53, 24, 25, 33, -20, 2, -26, -45, 87, 93, -24, 40, 54, -88, -27, 58, -24, -87, 54, 25, -21, 20, 12, -70, -18, -76, -33, 72, 0, -34, 33, -22, -109, 4, 68, -75, -37, 89, -8, -6, 52, 11, -48, 1, 4, 11, 39, 24, 49, 30, -68, -68, 31, 22, -53, 26, 44, -59, 11, 58, -50, -74, 2, 26, -20, 36, 45, 29, 4, -19, 13, -14, -48, -35, 84, 23, -36, 71, 18, -79, -34, 41, -31, -6, 96, 30, -32, -32, -9, 10, 10, -55, 10, 47, -4, -24, 59, -2, -93, -15, 24, -70, 17, 93, -5, -42, 5, 9, -18, -35, -7, 19, 18, 7, 52, -7, -50, -53, 60, -17, -26, 100, 53, -32, -31, 16, -4, -51, -17, 29, 29, 6, 23, 15, -18, -63, 23, 21, -38, -2, 60, -9, -45, 22, -2, -64, -38, 23, -15, -15, 25, 47, -31, -75, -7, 6, 0, -10, 45, 46, -14, -13, 33, -69, -63, 36, 34, -14, 10, 65, 18, -38, -20, -2, -27, -26, 30, 92, 22, -14, -12, 2, -91, -17, 46, -21, 22, 63, 46, -67, -36, -31, -44, -45, 7, 46, 14, 8, 13, 15, -48, -26, 32, 31, -31, 9, 74, 4, -29]
4887b9M3k1l8L7O0l3qpK6n5k7M0K1oj9N4Rq4J6K6r5O2Q4j6m5%L3n8j7LN8Kj5L4
4921C5J1n1j7K9j4o3P6M0l0l8Q0m3o7L4L6LnK9K0n0p5M1L4p5NO1L3m1L5K5j06
4952d8jN7l6J0K4K2nl2oN2p2j6O3O2p4J2O7r2o3N6J4jJ6K8ml6j7N0k5m5K2O3l8
4985Gm6R0k0r9RR3n6l2O8M3n3l5M6j5m5J8J2O8o1J9O5o3p6N1M0o0J6Q4m3n4O0
5016C1J4o9j3J2M4mlJ2mo9kQ1k3o0P2L3o3rN8n3n4Q3k8JJ2J5K0l9n8L8M0n8L9
5049dP9q0p0J31Lj10L1M0l1k4N8J6n3Mj7J1Lk9N4L6q2K7P1r2n7Q4po5R3O1j00
5080a9j3J7knk2M2N4l3m2P0j5q5j2J28j03rJ42m7r4N0j6J0j4K2Qmj7LO8n1j09
5111i8J17k2p7J08N4r7n0N4ml1O0J7l2L6k3j4Rj2l4O5l7l9J06Kj07O3K6p8j2Q8
$$ y = [-29, 14, -7, -45, -8, 52, 19, 11, 4, 30, -25, -52, -12, 9, 3, -16, 38, 47, -37, -21, 5, -90, -28, 56, 40, -5, -5, 28, -30, -47, -44, 14, 16, 1, 35, 46, -5, -22, 7, -7, -70, 6, 46, 16, -22, 58, 15, -52, -18, 18, 21, 16, 45, 65, 15, -60, -19, 15, -60, -55, 6, 39, -2, 33, 58, -48, -49, 8, -28, -18, 6, 28, 23, -9, -15, 37, -35, -51, 12, 74, 0, 12, 79, -13, -76, -20, -6, -7, 9, 37, 33, -3, -20, 30, 5, -40, -18, 45, 7, -39, 51, 31, -68, -59, 34, -22, -54, 14, 57, 4, -31, 15, 0, -45, -27, -15, 53, -8, 11, 76, 13, -63, -12, 28, -32, -16, 68, 25, -29, 31, 45, -24, -37, -25, 19, 15, 12, 24, 20, -49, -51, 30, 7, -53, 19, 52, -11, -20, 38, -15, -69, 14, -14, -13, -1, 14, 34, -5, -63, -25, 15, -43, -4, 75, -5, -75, 56, 59, -51, -20, 20, -11, -35, 23, 39, -14, -10, -27, -16, -13, -42, 12, 48, -34, -7, 64, -28, -85, -1, -8, -73, 20, 81, -19, -32, -15, -17, -22, -44, -2, 52, 19, -23, 47, 32, -53, -65, 63, -40, -49, 93, 46, -48, 2, -14, -4, -18, 4, 12, 8, -9, -6, 62, 11, -98, 19, -3, -80, 28, 82, -15, -65, -11, -15, -46, 14, 31, -1, 35, 12, -2, 7, -5, -39, 26, -11, -50, 56, 58, -49, 14, 40, -38, -50, 38]
5141C8%r9R1Jj5J2q3L1Rj0M0P9j03n5Q2oq8P2M7q7KP0k1k0Kl2L7j5%M0J5p6K4
5174a8O4r3k8J16l0q1J25Po3oK1n4j5N2N3j5j5m9M5j5l3K2P0j06J0Q0mp2L8K5
5204C1q2J3N8k3J9k4jK1m2j0Q0m0n0M5O2o5l9O5m0n5R9L0m0K9qm0prO8l1o0K3
5236b3M6J5n9lM5j08K1J25m3m0M1Ll3roM0l9oN6L4q7nO2n9l2P7M7m1n2P8k5o8
5268d8N0K9m5pPK3K0m9L4nm0nJ03m7l9L0K5p5j4Q0n6k5M3L4j6n2N1ko3K2L8Jj1
5301iJ0M1m4n0O5j1l4J5N8J5m6L1kp7lL5J5J5k8M4kq7M9Ll5qL3O4m8l3K8l0k5
5334e1K9K0Jj7L3%j4m7L0L0o3M3N0nn1K5L2q1MO9%m2K5J4qo5M5J7l4k5N2K4l8
5367BJ5K3m9l6N0L1q0K0Q2l9m4J8mOm0M4L0l8PM5k3j8k7M4l1k6N2J8o6L6J9j4
$$ y = [38, 38, -61, 30, 31, 16, 28, -55, -24, -15, -25, 15, 94, -9, -64, 18, 12, -76, -4, 43, -44, -42, 28, 7, -13, -11, -43, -6, -21, -21, 19, 34, -42, -18, 46, -47, -75, 41, 11, -70, 55, 62, -1, -7, 14, -40, -55, -3, 50, 35, 20, -29, 16, 1, -32, -10, 60, -46, -36, 44, 40, -32, 6, 31, -51, -38, 20, -3, 16, -8, -9, 12, -30, -40, 40, 0, -50, -5, 57, -8, -47, 18, -22, -77, 22, 52, 12, 41, 33, -7, -14, -23, 45, 14, -46, -23, 23, 38, -21, -24, 21, -87, -66, 59, 16, -24, 17, 20, -13, -22, -28, 12, -27, -33, 23, 57, -30, -35, 27, -32, -64, 13, 60, 19, -33, 45, 20, -48, 2, 31, -14, -21, -14, 9, 29, -20, 14, 9, -31, -36, 67, 20, -19, 11, 36, -39, -53, 27, -29, -54, -11, 23, 7, -45, 6, 4, -59, -37, 1, 2, -9, 1, 42, -2, -52, 13, 2, -32, -17, 41, 56, 10, 41, 39, -38, -41, -6, 9, 24, -4, 40, 38, -49, 0, 3, -32, -40, -7, 57, 9, -24, 4, -26, -51, -22, -2, -1, -18, 15, 15, 1, -46, -16, 14, -49, -6, 44, 39, -12, 13, 45, -36, -32, 37, 37, -5, 20, 34, 26, -39, 6, 23, -11, -36, 16, 40, 2, 17, 40, -9, -45, 5, 36, -44, -24, 58, 19, -25, -7, -11, -5, -45, -1, 29, -9, -2, 43, 20, 2, -25, 19, -12, -38, 14, 32, -34, 2, 21, 7]
5399Gj8QK6j1j2K9j8k4k4J2K7j9ON2j6o6M6Kl5l9R2l7NMQk4J2nK9k5k2R1l2n3
5433b4J9K1k4l6J3P1m2K2M2j6o4qM9l3j1K6K0k2l9K6K5n4%N8l2mJ8J8k4k7M4l
5465Ij2oM7No5mM6l2j7M6J6m6PM5l2l9rP5o0J9K4Qj1k6M8k3p0N3PjJ2JK3q8K9
5500b1J4k1k6P1j6K9m1J3Jm3J1O9l8l4Q0j7k1l4M2l2m9O4J4J6k8POl9lL3K6n0
5532a7K2M2m5o3M6M9p6j1P2l1mPJ2j0n4L6L5k6k4M9J1k4k1N7l6p1O6L6l3J5jJ7
5564B5l5j9N3k0l8K4M7mn3L3j3p5K6N9j2k7K8J3o2J4K8J0j7J7PJ5p0L0L6l2n6
5595f8Q5K4n9J6N2m7n7Q4l6j7L8l5N6k6l6O0m0n3K0O4km1N4Qr7L2L7Jn6N2j1j0
5627hqJ3K8m6k2J7M3n0L9O9o6r3P4J0k2J2M9l4l0L0Jl0RoN2j2k7M1ro0M5K6k6
$$ y = [7, -11, -3, 23, 12, 0, 29, 11, -13, -37, -25, 2, -17, -11, 41, 25, -41, 5, 7, -28, -67, 25, -12, -7, -3, 5, -19, -7, -12, 17, -8, -30, 61, 29, -24, -5, 16, -8, -44, -31, 40, -2, 20, 62, 46, -18, -26, 23, -10, -21, 5, 25, 3, -36, -10, 15, -39, -39, 19, -13, -17, 1, 19, -5, -32, 12, 9, -3, -9, 38, 43, -22, -26, 20, -12, -29, 17, 33, -13, -6, 39, 7, -32, -41, 34, -26, -7, 17, 25, 14, -12, 36, 13, -57, -4, 3, 2, 14, 15, 38, -50, -21, -7, -28, -54, 17, 1, 30, -11, 2, 3, -40, -29, 40, 2, -32, 48, 31, 10, -24, 18, -14, -63, 1, 15, 31, 3, 10, 16, -23, -26, 7, 33, -17, 5, 47, 2, -61, -15, 34, -42, -53, 19, -12, -16, -9, 3, -7, -61, -25, 10, -16, -40, 9, 20, -4, -25, 32, -4, -75, -9, 27, -6, 9, 8, 25, -10, -29, 24, 4, -34, -10, 37, 33, -20, 13, 0, -75, -49, 10, -2, -29, -1, 12, -50, -36, -8, 2, -15, 2, 9, 24, -46, -16, 20, -12, -68, 17, 41, -18, -2, 50, 3, -54, 30, -6, -23, 15, -20, 36, 10, -26, 34, -6, -59, -39, 25, 23, -18, 36, 44, -53, -21, 16, 17, -39, 13, 2, -8, -16, -3, 25, -21, -43, -26, 17, -33, 6, 75, 9, -84, -10, 0, -22, -10, 39, 5, -25, 5, 6, -24, -15, -21, 31, 19, -8, 33, 24, -36, 9, 35, 9]
5660Im0M5L0q5L9N3o6k3%kN7n3O2J3n9MJ2jj3l9R5k3m8Q4j8p2NL1rj4M7J9l0l1
5694b1nM6j2o9P8Jn8N2K3k0o1qO2l2J5L9m6l9N2J5J3p8L5K7j6j9O4j8p7K5N7l9
5726a4k2J08j4r1M5j3Pk1KL8j9j5L0J2o4OLN2p7O0K6n7J1J8rl4MM1j0l0K1K6k1
5759ak8k3N8l7J4N4j1m9PM8o0k2P3j3m3M0M4l1k4j1L7l3kN0k0j9l1O2k6n5K6L2
5791Fk8J4L6j9l0l2O1k2m2K6N8m9KK9J6n5mO0j3l5L0KNk0J0Rl1j7O0J1m8J5K5
5824C0m0l9M4J8m6N7kJn5K4M1j3n9N7ll8J1J9mn3M0J0j3JL0K2k9l9L2On9L1L7
5857A9ml7M5Lm2J3L5l9PJK5ml0J1J5l3PM1n6J4JK3J2n9M1jm3lP5j6k3j9L7k4K
5892fK9l9j8M8K7j7n4K7qjnL7L0k4m4L7J7r8N8K8j3m9L8O0p4j2L5Lm4M3J7Jp1
$$ y = [9, -31, 14, 44, -41, -2, 51, -15, -38, -38, -40, 17, -36, 26, 39, -20, -16, -4, -5, -18, -57, 38, 15, -33, 51, 33, -39, -34, -3, -12, -26, 21, 40, 10, -21, -26, 20, 8, -61, 17, 18, -40, 12, 35, 15, -46, -54, 8, -24, -9, 30, -16, -55, -3, 12, 25, -53, -18, 9, -7, -26, 38, 20, -57, -32, 25, -14, -36, 72, 58, -33, 12, -1, 6, -15, -13, 25, 6, -9, 21, 33, -31, -25, -22, 30, -47, 13, 39, -18, -7, 11, 2, -32, -28, 13, 3, -27, -6, 20, -1, -29, -52, 6, -31, -17, 37, 26, -23, -16, 32, -28, -50, 23, 10, -33, 7, 51, 20, -4, -15, 22, -11, -13, 37, 17, -2, -33, 29, 3, -52, -26, 6, -22, -8, 28, 9, -21, -53, 8, -14, -56, -30, 28, -21, -19, 10, 26, -29, -33, 27, 14, -21, 9, 11, 16, -4, 6, 15, -16, -33, 27, 38, -10, 5, 30, -10, -49, -5, 13, -33, 24, 22, 23, -32, -8, 33, 20, -39, 18, 15, -23, -12, 7, 3, -50, -10, 0, -13, -12, 18, 40, 11, -28, 4, 10, -49, -18, 19, 15, -22, 23, 26, -16, -3, 32, -7, 0, 1, 26, 22, -8, 3, 18, -15, -8, 33, -23, -9, -8, 15, 27, -32, 9, 8, -35, -38, 37, 21, -2, -21, 16, -8, -6, 23, -16, -34, 14, 41, 24, -30, -3, -11, -12, -17, 20, 50, 26, -18, 19, 36, -62, -4, 24, 11, -38, 0, 60, -14, -26, 9, 12, -32, 11, 28, 29, -42]
5925d2M3J5m9k1M7K2ql7O0k1l1L5j0j7K8jL1l6K0J1l1oj0L0j0l8O0j5l8J5K1k3
5957fj5J6J6llK2l1pk0L6Qj6MN7n5rLJ1l4jL8nk8J6K6o4J8J4L3l1J5P1n5m1L9
5992A9jj8k3M4M6r3OO2n8Kl1N8kn2P7m6j8J5rL3o7N6N4n3l1Q1j5l3jPj3j2M2J1
6026C7m1kkJ0qj4N8j0n0M9L7o3M%Pl4L9M8o0j3oj9K6j3J6M7n0j4L7Jo3K8M2l7
6060a3%O4j2n7L5j9qpPL4k0j0K3K2m5l6L7Po1Q4L6o3K2lj5l8J3L9jk9%K6mk7j0
6095b9N6l3l4Q4k3o3N2L0n0j1O5n2k5M3%K3j0n3K9pqL4K0l3k3L6No6L8N4j08P1
6127A2L7n0%opqj9K8J9L8n7K4J6o6QP2n4k4N6Oj8l7M8k6j8JK5L4j1k8J3j6j7N8
6161C3J0o4j8Q6Nq1K5L0m2OL5k7J9j1k2L2o1K2L9k6k4L3N2o9NM3n4l3Q6mj4J3
$$ y = [-42, 1, 16, -33, -54, -7, 15, 7, -30, 30, 9, -22, 13, 3, -14, 14, 13, 44, 8, 28, 39, 8, 2, -8, 22, 12, -26, 34, 19, -19, -4, 17, -6, -21, -5, 11, 8, 5, 27, -4, -11, -31, 5, 13, -3, 1, 58, 3, -6, -3, 8, -26, -27, 11, 6, -22, -6, 20, -44, -26, -12, 21, -10, 5, 76, 21, -20, 19, 18, 0, -23, 21, 67, -26, -20, 42, -16, -14, -45, 13, 11, -41, 36, -10, -28, -13, -22, 11, -56, 0, 54, 1, -30, 51, 36, 3, 2, 9, -4, -16, 26, 37, -4, -6, -8, 2, -6, -20, 38, 28, -22, 27, 64, 1, 5, 5, 12, -22, 17, 65, 5, -8, -14, -33, -7, -20, -4, 43, -7, -21, 16, 17, -46, -18, 24, -13, -13, 51, 39, -18, 17, -2, -10, -17, -10, 24, 4, -6, 17, 39, -6, -42, -5, 2, -59, 25, 61, -2, 20, 17, 2, -36, -23, 16, 15, -14, -14, 12, 8, -19, -29, 27, -6, -40, 44, 21, -42, 10, 40, -10, -21, 44, -8, -33, 10, 10, 33, 23, -30, -1, -8, -16, 18, 38, 5, -18, 18, 23, -43, -5, 49, -59, 12, 49, -1, -1, -7, -14, -22, -41, -13, 6, 44, -13, 11, 27, -39, -31, 41, -13, -37, 19, 25, 7, -30, 18, -8, -26, -25, 0, 34, 23, -5, 8, -8, -25, 33, 43, -21, -39, 47, 52, -29, -4, 26, -16, -10, 25, -2, 17, 6, -16, 16, -45, -23, 16, -10, -34, -1, 51, -18, -13, 30, -24, -57, 29, 25, 11, 24]
6193B4Qjl5J7lJ0k6j6M8J9p2L0M6r4J3P2Pm9K7lm6KJ2Lmk4L3M1j6l2N3m4o0P1
6227A1J6m5J3M2m2k1M9k0k5L4npJ7m2N7k3n1L6J7Lm2L8M9p4j1P2n1lK2j8Qj2K
6260fL6n3J0L9ol5oN2j7n2N8l0LrJ5K4j6L8l6J1n2L2mJ4k5P4j5m5KL9l1n0K9L7
6294B5k8k1P1n3k1J6OJ4l3J7K8m5K7J8k6j6NM5k6k5M0j6pj9K4Pk8K5K1j4k0M1
6326C2Rk7n8O0J9n5L9L1m4l7L0L3m5MO8n4j1oR%k6pP5o7K9K0j1l7J0M1j6k4N7
6359D1pm3J2jmRj2K4kk8L6J5l4j5L6k3k0J6K8l5j3L4j6ol5L5J5l8M0J1l0k4LN4
6393B3n6J2O3j6m9L5Nk6k0L2Pj1pO6n5kj0K0Ln4P4K0n3Jj0K4l4n3R4K5p5K6K2
6426B1j2k5J5J7n7L0K7pj6j1L4k7j1K3Lm5J6L0J6l1QK1l8lN9oj9QJ5k6m9K8K4
$$ y = [24, 32, 31, -4, 13, 10, 20, -6, -22, 26, 45, -27, 3, 49, -45, -32, 40, 47, -2, 25, 22, -24, -22, -10, -7, -11, -35, -2, 39, 23, -9, 44, 0, -60, 11, 27, -18, -5, 37, -5, -26, 23, 3, -22, 12, 7, 0, 17, -25, 32, 9, -42, -6, 11, 14, -28, 10, 59, -15, -26, 46, -5, -8, 14, -4, 4, -8, -6, 30, -23, -13, 26, 20, -15, -21, 31, 14, -38, 20, -10, -7, -16, -1, 23, 7, 45, 9, 20, -32, 0, -4, 10, -15, 59, 44, -1, 1, 40, 9, -41, -12, 25, -3, -24, 47, -6, -27, -11, -5, 9, -24, -7, 21, -24, 3, 21, -5, -21, -16, 29, 3, -22, 18, 2, -5, -24, 0, 7, -21, 4, 25, 11, -9, 32, 41, 14, -44, 16, 35, -20, 19, 50, 6, -31, -1, 32, -13, -9, 59, 5, -6, -12, -3, -3, -29, -36, 39, -28, 1, 21, 10, -27, -17, 24, 8, -16, 41, 34, -9, 3, 2, -2, 7, -5, 19, 17, -11, 25, 40, 6, -9, 27, 4, -16, 0, 28, -7, -20, 14, -2, -8, -43, -8, 7, -31, 9, 20, -10, -34, -31, 23, -33, -21, 42, 26, -23, 12, 17, -9, -29, 3, 10, -1, -8, 58, 3, 1, -9, 11, 14, -40, 34, 54, 1, 2, -8, 16, -18, -71, 23, 48, -27, -1, 21, 9, -16, -1, 16, -41, -11, 16, 9, -7, -18, 16, -11, -22, 1, 4, -41, -25, 5, 21, -10, -2, 19, -19, -22, 37, 31, 12, 20, 35, 9, -40, -12, 12]
6459A2%j7K3j0kk9N4m4k7M6NJ4k8K2k4Rm6M5Ml8L2K7j0lj9Oj1lJ7j8M4njj7l3
6494b5N9J0n9OK5M6m4pql6J4M6oj2JK0j6pk0J0Jk3QL4rn8J10o9m4N3J1k1j1N8
6528C7k1k9K1Plrj7N3jm2K8ol9ML3k4mM8K5n0l2L0j8j1N1l3K6n2L3K3m1k8%N0
6562Ik2PK7Kn3L6jm1K3KLK9j6K4k2Rl1L0pj3K9J7p0J3N7m0lpM5k9j5M3l6l0Qr
6598c2L9pK0K2m1k0K8k9MoL8J2o7N6j2k0J7jJ6j6J1L1j2k2j8K2rl8O3J5n9RN1
6631D5n4l4N0j2K7j1k2K4k4oL4lk1k3O7k9n3O6pn0K5K8k8j0L2L9p6L1J5j6L9o2
6663a9JM5l5L0K6l1k6J9pm2J6P0m8LL1k8%k6J4L3j4m2M0no7K7L1l0lN6rj4J2K2
6697C0n6K0J8j3j0J5K9rJl3RK9q4O4M3l9k2M0j8l7J4NJ3j7K8j4J9j4j5K9m4J7
$$ y = [12, 12, -5, 18, 8, 6, -23, 31, -13, -40, 6, 11, 25, -3, 19, -5, 4, -42, 3, 7, -31, 1, 28, 18, 15, -4, 2, -9, -12, 5, -13, 31, 26, 25, 8, -25, 34, 44, -15, -9, 16, 62, 18, 11, 3, -33, -19, 27, 21, 9, 10, 30, 14, 7, -13, -3, -2, -25, -17, 17, 8, -50, 60, -9, -53, 0, 11, -10, -21, 37, 16, -13, 8, 15, 12, 3, -14, 39, 38, -4, 24, 18, -21, -17, 16, -8, -12, 36, 61, 11, -21, 9, -9, -20, 31, -2, 24, -28, 5, 28, -13, -41, -41, 9, -13, -6, 21, 23, -30, 6, 5, -36, -13, -11, -8, 21, 5, 29, 7, 16, -15, 15, 8, -5, 24, 41, -29, -16, 41, 1, -2, -9, 36, 7, -8, 35, -1, -31, -23, -32, 7, 0, 20, 42, 1, -19, 9, -20, -16, -22, 16, 28, -39, 17, 5, -15, 2, 1, 17, 1, 12, 43, 31, 9, -9, 13, 4, -34, 29, 44, -15, -6, 45, -9, -43, 7, -5, 22, 11, -11, 13, -11, -17, 17, 14, -7, -30, 37, 8, -45, 21, 14, -36, -11, 17, -11, -21, 11, 50, -26, 5, 20, 4, 43, -19, -18, 27, -8, 22, 48, 17, -9, 10, 3, -39, -23, 47, -1, 2, 33, 5, 5, -21, -7, 26, 12, -30, 10, 5, -62, -35, -4, -34, -37, 19, 10, -4, 8, 30, -26, -6, 12, -1, -11, 4, 33, 24, 25, -8, 1, 30, -54, 10, 53, 14, -8, 32, 14, -23, -9, -4, 9, -8, 20, 6, 25, 11, -4, 25, -19, -2]
6729bMJj0LL4m1oL3j7j6L1K9m6qL0m1K6l9M4L9n0j4K0llJ5K4m5PM2m7KjMj5oM5
6766B3k5K5j8rJ6jm5K5K7o3L9J5lj0pJ2k0JPRqJ1L5j3m4J2L0j5NJ9j4qk1K6k2
6801im2N7Qn9M5J1pPj9K1l8j3M5j1RpK8%p4L3K0lRK4l0mNk0K0l7M1J8kk6kK4n1
6838b9j8P6j6k6M5oln5K1K3m3J9J0j6j7J2K9%k9K4J8m4pM5j2QQrk9J4J4mM2l1
6872A4J8j4l9K1J5mMkL4k5k7K5j4k9J1M3nk7J6qk6rLK2J2j7K9rj8J8lj3kKkj8
6908b4M4nl9J5NPL1m3M8l7lJ8%Rk2%NjJ1J0l7j2PJ5KrJ1J6l4J4J8j9j3PLrk8P8
6946C9%o5J4RPoQJ1J6k6J0oMqMJ1qj3K7k8%MK3l3jJ5K6m6J9LNm5K0L0qm1J8L7
6984B6m8M0J2m5J6MK4l6KL6k9pK3krJ3J0Nm2QMJ7nkQpj7J7Nj1j0K1Mk0k7L0Rk6
$$ y = [-2, 2, 3, -7, -4, 30, -11, -17, 16, -1, -17, 14, 43, -3, -11, 19, -22, 4, -35, 9, 48, -2, -16, 4, 1, -2, 13, 37, -8, -1, 41, -6, -4, -5, -1, -16, -22, 23, -2, 23, 5, -4, 12, 11, -34, -9, 18, -45, -6, 9, 6, -4, -11, 1, -19, -18, -11, -2, -10, 1, 36, 23, -21, -9, 21, 6, 11, 30, 16, 8, -13, 13, -9, -51, 6, 14, -45, 0, 11, 4, 11, -8, 13, -25, -38, 7, -4, 5, -2, 26, 26, -48, -15, 5, 2, 11, 35, 5, 1, 6, -14, 6, -31, 10, 28, 26, 0, -2, 22, -29, -47, 29, 13, -13, 32, 26, 23, -32, -11, 12, -31, -12, -2, -18, -35, -23, 6, 6, -23, 1, 19, -25, -32, 13, 1, 9, 17, 8, -21, -7, 7, 3, 45, 14, 32, 18, -21, 0, 15, 11, 15, 13, 47, 22, -5, 20, 6, -23, -12, 31, 26, -1, 15, 7, -19, -28, -25, -3, 9, -8, 21, 12, -6, 12, 9, -4, -6, -4, -6, -24, 20, 15, -24, -9, -4, 3, 34, -9, 39, 2, -1, 17, 17, 26, 4, 4, 9, 8, 19, 29, -8, -20, -13, 2, 4, -5, 6, 22, -12, 2, 20, 1, -12, -5, -2, -11, -39, 39, 39, -26, -12, -3, 4, -2, 6, 17, 33, 7, 17, 11, 15, 7, 11, 22, 14, 1, 28, 0, 0, 4, 27, -6, -7, 8, 34, -12, 7, 10, 15, -30, -10, 20, 12, -29, -11, 26, -22, 18, 30, -15, 1, 5, 29, -7, -5, 31, 2, -5, 18, 16, 7, 20, 30, 35, -7, 1, 5, 22, 17, 15, 23, 16, -1, 16, 21, 10, 0, 21, 25, 5, -22, 8, 17, -9]
7022ikk4J3%L8rJ1qlqj9J5L1l2j9M2mrQJ7ok4qQLj0L0J4o4L2LQp0Q1kk1Rj0J9
7061B1l1j2J6J0j8j4L5l0MJ7rLk7N1l2kRM2k8Kk4M1lmpL8n7LN6n3lL7j5l9K3R
7097Ij6j9J8K7j6j3J3j3j3qK6K2m4K0K1%nK0m3%j6L8j1kkL1Rl6K1mj5j2J3K5k8
7132ckL6l2k9N8j4l6J9K5qn9L4K3j7oLRJ1j3Rpm1K5K2l6M3K3om4j7N8k8J1k2K8
7167A7J2l1%Jok4N0k3j1M4pl5%L3j0k4K1lNk6J0J4ll0K4Nk3MJ0mlPL5m0J7j3K4
7204A7j1J2Jk1l3JK5L9n5K5J5k7pN0l0J4mnj7J6L5l9j1j8L2Rm9lN8l8k2L9J8l0
7238a4J2J1J4l6M0j6k6pJ6NRj0K0M2n2j0K8nnk4K8l0PK8Oj5j6J3mlJ5Kj0j9J4
7273HQj3j1LJ3j2QJ3k4%MKm5K2O9o2J4oKK3j7K5Kk5K7Jm2rL0mpj4L7Qo9M7J3l6
$$ y = [-9, -11, -35, -22, -22, 16, 7, 18, 10, 7, -1, -20, -5, 26, -6, -25, 17, 13, 4, 12, 29, 23, -1, -9, -1, 2, -8, 22, 36, -28, 4, 7, 15, -55, 26, 24, 3, 12, 2, 21, -10, -22, -6, 4, -14, -28, 7, -23, -19, -2, -11, -8, -35, 16, -16, -18, -9, 33, 5, 7, -17, 24, 21, 17, 10, 48, -9, -6, 50, -3, -6, 31, 16, -23, 0, 9, -7, -26, -8, 19, 3, -10, 3, -10, -23, -31, -5, 17, -27, -7, 14, 14, 9, 29, -14, -14, -30, 8, -3, -5, -7, 24, 33, -3, 18, 14, -1, -13, 0, 25, -3, -5, 31, -1, -30, 28, 14, -22, -3, 22, 14, -45, -11, 12, -5, -11, -8, 1, 12, -1, 8, 1, -40, -15, 7, -29, 14, 37, 31, -13, -30, 28, 0, 11, -11, 17, 29, -2, -2, -1, -7, -31, 19, -4, -15, 29, 22, -13, -13, 20, 10, -14, 7, 4, 9, -17, -7, 7, 4, -26, -2, 3, -20, -16, -6, -10, -13, -6, 29, -11, 6, -7, 17, 6, 18, 19, -2, -35, -34, -9, 30, -25, 0, 15, -12, -19, 31, 1, 15, 11, 6, -11, 5, 40, 1, -10, -28, 4, 13, -36, -39, 19, -19, -41, -2, 16, -14, -2, 9, 23, -13, 27, 11, -15, -22, -6, -1, 8, -2, 18, 60, 8, -2, 26, 21, 16, -8, 20, -10, -3, 25, 31, 16, 0, 13, 9, 6, 21, 23, 13, -6, 8, 16, 3, -8, -5, 8, -4, 4, 17, -7, -7, -3, -1, -46, -24, 45, -17, -3, -9, -7, 16, -1, 24, 26, 1, 28, 29, -13, -22, 8, 4, -3, -17, 20, 28, -41, 6, 19, -17]
7311a7K5l4K4NqRLj0K5l2Nj7KK3j5j2N7m1Rj5J8K1m0L9kj7k0J6mJ5k7K4Qn0N2
7346A9K2l9j2OK3j9QllLm7M6k5lK6Mk5RL7k5j1nM5k6j8J9K7l1PK8o6qM7j3lJ5
7382IQk1K4k5KJ0j8L4l6L9l0%J4m0LN2k7RPLql2MK4l0K8Mj1j1ML6l7nJ6J2J0k0
7419AK8J4n0J0rqoM7k0%l1K4Mn3L6Lk3L3Qj0ll4N4l8j0J3OrK9mJ3l0LRk2K5RK
7457A1Rk9NLk1J0K4K5k0pJj6LJ2j5QJ7pJ3k9Nkk4QlO5n0Qkj6j1ML6l1JQK1j2n
7496cK5k5lQj9N3m5NK4k5j4L7k6jLL7Ln4N0k9Nj0Pj9J1PRk9J4QQl8J6Moj0L1k
7534Gn2L7PlNpKj1j9L8j8MNK3%k0RJ9l3kQJ8j2qqJ3j0MNj8J2j1M8j8l7J0L6m5
7572b2jK6lj5L5Mj9k9K2Oj1k6M6j1l3M6nk4rM2k5NjL4k7%j8Mjj2J4K6k6Nj0K2
$$ y = [-17, 8, -26, -2, 3, -5, 4, 7, -3, 22, -10, -5, -22, -20, 3, -12, -24, 33, -8, 1, -14, 4, 25, -15, 24, 22, 5, -15, 1, -3, 12, -15, 9, 17, -33, 19, 41, 2, -10, -4, 19, 0, 8, 5, 2, 5, -42, 4, -21, -24, 2, 6, -19, -10, 27, 2, -9, -14, 31, 5, -13, 6, 33, 2, 9, 37, -29, -37, 10, -3, -6, 9, 17, -4, 20, -5, -3, 7, -11, 23, -13, 26, -4, -4, 10, -30, -27, 25, -2, 7, 14, 17, 9, -23, -19, 5, -25, 3, 7, -4, -15, -11, 25, -12, -17, -1, 11, 21, 1, 29, 43, -7, 3, -6, -14, -20, 27, 7, 7, -24, 0, 4, -49, -13, -10, -33, 0, 8, -2, -5, -39, 15, -23, -33, -20, -14, -23, 6, 2, 15, -15, -12, -3, -25, 0, 9, 11, 20, -9, -4, -1, -22, -12, 12, 37, 17, 10, 11, -5, -2, 10, -5, 3, 20, 13, 26, -3, 2, 0, -24, -16, -19, 46, -4, 4, 2, -14, -25, -21, 15, -16, -15, -7, 14, 2, -3, 22, -3, -6, 2, -17, 36, -9, -4, 20, -5, -19, 18, -8, -9, -6, 31, 34, -20, 30, 1, 6, -4, 3, -16, -5, 2, 11, -18, -4, 4, 12, -26, -10, -6, -12, -22, 9, 7, -45, -8, -1, -4, 1, -6, -4, -15, -34, 4, -14, -10, -5, 18, 18, -2, 7, 26, -7, -9, -1, 17, 5, -3, -11, 2, -8, -4, 1, -17, -5, -16, 32, 14, -23, -13, 23, -22, -23, 3, 0, -15, 20, 24, 5, -24, -2, 4, -7, -33, 13, 2, -31, 15, 10, -14, -23, 19, -6, -1, -2, 32, 5, 5, -13, -9, -10, -22, -8, 18, -8, -3, -13, 9]
7608Im1J5L1mm8L5L1m3pJ7J1j9J0K0pm9N8k3rJ4j4K2j4lN7n6KNK0l4j2K9J2Ql8
7643a5K9l9J9K2j1j0qJ9Mj8NJ1j4k7L0J9k6l0O7n8OM1m3oL2%K0nk1J6j6mOL9j3
7678B1k5K4m1J0M6l6J7l7M8kj3k2kkLrM5j6k5L5l1%l6L9K0k1KK5k1pJ9j7Lj1K2
7713EK0rj2Oj2Ml8N8nl5M2j9NPJ1m4mK1Omj8J7J4J3m4J7J8o8M1K0l8OJ6k0RoL
7750a7L0M%j6Kj9J2Nm5KN8K4o0N1k5pJ4mrK1J4j4ol2K7j1mk6K8K7m2PJ8k3pNK1
7787Cl5K9k5J7Rj8K0K1m2M0k9K4k3J4J7j3l9M6Mk4J7%j6j4P3o2nLJ0MJ3J3j9l2
7821a9J8NlllRj7PK0j7mjK2n7M6nj0M7l6KK2k0MJPJj1%K7k3JJ8kj5j2K3n9K5N0
7860C8l6l6K3L9n0j6O0k2lk7N4j0l3L0RJ4n5K8j0K3jk4L2k0l4L8l5K8j6J8Mk0
$$ y = [9, -32, -17, 14, 10, -38, -3, 28, -15, -22, -5, 6, -13, -3, 17, 10, -39, 19, -4, -13, 1, -13, 9, -5, -8, 49, -7, -5, 0, 20, -14, -26, 3, 15, 23, -15, 14, -25, -6, 16, 5, -5, -13, 6, 10, -8, -3, 8, -6, -33, -3, 16, -10, -40, 27, -31, -25, 16, -27, -33, -1, -1, 19, 14, -7, 9, -7, -11, -5, 34, 21, -4, 20, -21, -11, 35, -1, 16, -21, 27, 25, 12, -10, -12, -14, -11, -20, 25, 9, -16, 19, -12, -12, -48, -9, 11, -10, -8, 17, -4, -11, 8, -9, -6, -17, 5, 25, 16, 4, 10, -2, 2, -36, 22, 17, -18, 24, 5, 10, 17, 28, -16, -20, 1, 7, 3, -15, 2, 16, 29, -15, 2, 20, -48, -7, 13, -25, -19, -3, -23, -14, -20, -17, 13, 17, 17, 1, 3, -16, -4, 1, -44, -42, 16, 40, -20, 31, 6, -1, 13, 9, 0, 21, 35, 21, 15, -17, 10, -1, -5, -31, -3, 24, -18, -11, 7, -16, -23, -18, 3, -32, -3, -28, -11, -2, -20, 0, 21, -21, 19, -10, 14, -9, 5, 22, 9, -30, 16, 20, -4, 13, 13, -3, -17, 56, -6, -11, -8, 2, 6, 19, 32, 13, -19, -1, 4, 1, -2, -5, 4, -13, -6, 14, -3, -7, -8, 14, -43, 3, -2, -12, 35, -1, 1, 23, 3, 7, 8, 15, 16, 5, 5, 32, 9, 10, 28, 26, 11, -1, 22, -37, -12, 38, 2, -34, -11, 28, -22, -38, 22, 0, -3, -30, 24, 14, -19, 11, 20, 34, -21, 7, -3, 20, 19, -5, 27, 7, -27, 11, -24, 4, -12, 6, 10, -10]
7892a0KK2j3J9lmJ0j1pj6RJ1j5OQOOmj7J5j4k2OK3k0j4N7l6KJ4Lj9kJ1nJ3LJ2
7930B6j3JMOk3j0M3j3m2K2J7j5l1M8k1Nk4QRljLkk2L1pJ5Pk7J9ppjK7k9K2Jk5
7968iL6rj8k2M0j6J1j9K7LqrJ5rRj2j1qk6J6K7k2ljlMJ1rK4k9K4j0lj5J4K5j2
8005CpNJK1k7K1k0J5nNjKJ1l3QQK5k6JK8k0k8K2nK4k6mRpk3j9M8k0PO%lk5O5l8
8045bj1L0ol7L1j6L1l3J5J3j2k0L0nJ4Ok0J2k3j3L1l0M4j4k8J0j1lJ0j5L0lnn
8079eK7j0k4K3j0j7J8J9jj0m8J3L8Pk0jK8k9K7Oqpj8LqM6l1qRKQk4J9j5qKqM0
8117B5Jm7J6J1k6J5RNk3L0j3Qj7j8K0qK1J2jml0mK3J1k4PrJ3KlOqj4RJ5Qj5J0
8155A3k2JK1j4k1K9nk1L2ol0oK3J1qqM6l9J7l5J3K8m2K1L1j5m0L2K9k4LNj1K0
$$ y = [-10, -8, 14, 1, 20, 17, 13, 23, 12, 5, -11, -2, 9, -6, 0, 8, 14, 20, 16, -1, 14, 0, -22, -16, 7, -13, -27, 30, -6, -4, 10, 13, -6, -8, 3, -2, 11, 14, 26, 13, 14, 18, 24, 1, -9, 34, 21, -21, 1, 18, 3, -28, 20, -1, 4, -20, -12, -3, -6, -7, -4, -6, -28, 3, -4, 11, 18, -9, 10, 3, -4, -5, 22, -7, 15, 16, -9, 27, 18, 0, -22, 18, 2, 13, -6, 21, 24, 16, 7, 22, 13, 22, 10, -1, -9, -35, -19, 8, -14, -17, -18, -21, -17, -6, -15, 9, -20, 4, -6, -9, -24, -10, 15, 3, -4, 1, 2, 23, -4, 17, -3, 12, 7, 12, 11, 13, 24, -9, -1, 7, 32, 6, 7, 35, 15, -13, 9, 4, 28, 2, -2, 7, 0, -23, -42, 6, -14, -7, -1, -1, -4, -29, 36, -2, -13, 17, 11, -26, 5, -11, 20, -13, 2, 15, 3, -17, 13, 8, 22, 28, 8, 20, -3, -16, 15, -15, 29, 15, -13, -3, -14, -17, -7, -22, 8, 5, 0, -5, 22, 12, -12, 11, 1, -16, 2, 21, 20, 10, -38, -25, 13, 20, 0, -1, 27, -2, 25, 31, 23, 16, -2, 1, -7, 39, 8, 0, 9, 11, 19, -5, 14, -1, -9, -7, -15, 25, 26, -21, -5, 6, -20, -5, 4, 9, -14, 16, 3, 11, -6, -24, -4, -12, 9, 21, 20, 16, -14, -18, 5, 16, -8, -1, -10, 3, 5, 2, 8, 0, -14, -5, 10, 18, 3, 13, -9, -8, 13, -1, -22, 7, 2, -19, 13, 7, -23, -29, -6, 5, -3, -11, 35, -4, 13, -22, -9, 19, -23, -2, 29, 14, -26, 6, 35, 11, 14, 19, 8, 28]
8189B8pj7
$$ y = [28, 21, 4]
8191D
$$ Imaginary data points
##PAGE= N=2
##DATA TABLE= (X++(I..I)), XYDATA
0@%%%%%%%%%%%%qJ6j6J6k4L2l9M7n6O7p5Q8j05J29j52J76k01K28k66L03l44L92
34B08m42M98n60O30p06P86q76R77j086J203j330J471j626J794j977K177k399K643
52A385k912L211l544L918m340M824n382O031o802P732q884J0356j2303J5023j9115
67a0802K6068m1006J29839r7260j18393R3072j93760R7214K00248n3597L0484
78F2107J14838j48816l6516K2972j81646r661J89258k1075P3975J62821j32722
89I5535j40428J6368j01165k2341J22434M9753M9812O3348n1994n0911l5258r6363
101a01210k9623O3228L3129P1681R4239n520n3612q7685r7516Q78J6103M6869
113d9039J35044J9984n1634L0940o2000j09948J7364j2067k4116J22820P7510
$$ y = [0, 0, 0, 0, 0, 0, 0, 0, 0, 0, 0, 0, 0, -8, 8, -8, 8, -16, 16, -23, 24, -32, 35, -40, 48, -57, 72, -80, 96, -105, 123, -143, 160, -184, 208, -234, 264, -296, 334, -372, 414, -462, 515, -571, 632, -698, 773, -853, 941, -1036, 1141, -1258, 1385, -1527, 1684, -1860, 2058, -2282, 2542, -2840, 3191, -3611, 4121, -4763, 5593, -6710, 8313, -10802, 15266, -25740, 104099, 6839, -111554, -18482, -212242, -115028, 85220, 31623, 62107, 176945, 28129, -8387, 14585, -167061, -176722, 12536, -8539, 65436, 228257, 95535, -44893, -28525, -129690, -152031, -29597, 20156, 69968, 133316, 81322, 30411, -4847, -101210, -130833, -67605, -34476, 37205, 131444, 125924, 72312, -15373, -112889, -112011, -95908, -49039, 86005, 105989, 54355, 85295, 23295, -86653, -69289, -81356, -105472, 17348, 94858]
124I4858j4418M7304p0634j63105K1102R957m4624J50347Q0593p9799N7735j040
136H8276j52349j338J6853p7385Q4697J19899k3219M1541J6705j50857m3373K7198
148e3352o7685P0220J28108k9444J9690M0159j07054n9430J2700m8948J7570R5813
160A8347L0562K8558K9864p4850p0798j7433m5573K2388Q8623L0569K9685K1988
172I1930n0741m9438m0014l7732J7279L6569M3098O5458J4283l9861l0239n5279
184c4687o1285K1976M1330K5997P2688K4253m4040j0118n2396p1987K6655J8582
196d3032O663Q7564L6985l8771R18l9397r0814K032L3323K001P2932N7739l5812
209E2331m462k4070q5639n053K0124j0649O6259O4497j6073j58j7056q2070l2116
$$ y = [94858, 80440, 127744, 57110, -105995, -84893, -74936, -119560, 30787, 111380, 31581, 89316, 88276, -64073, -65411, -48558, -125943, -41246, 78653, 55434, 96975, 113680, -37177, -80550, -53352, -121037, -50817, 77291, 47847, 67537, 107696, 642, -58788, -46088, -95036, -77466, 18347, 48909, 77467, 107331, 32481, -38317, -55750, -101323, -78935, 9688, 40257, 69942, 91930, 41189, -8249, -48263, -85995, -68716, -32147, 10951, 76409, 90692, 50831, 20592, -34687, -95972, -73996, -32666, -6669, 66019, 90272, 46232, 36114, -16282, -88269, -61614, -43032, -36369, 51195, 88180, 49409, 50327, 10930, -79884, -77852, -44529, -42528, 30404, 88143, 52331, 47869, 23799, -61840, -66893, -46769, -57418, 8841, 73338, 57265, 57107, 40051, -42019, -74135]
222g4135K1390O30M2154O7123L428m185j1611o5528l5075j992q214M6358O2296
235D2639J2904N376j0070n2892m5584j2997J578K6957M7923L5352J8704j4446
247E5444n0566l4821k3804j7124L4559M7015K4522K5479j533l4533l7785l9527
259e2674j5910K4300L4504L5999L8115P77m0441l0045k7213l3453J1069L8026
271a6946L0727L6832J3340k0947l1477m5585k9188J1994K3020K9424M1912J9939
283F3045j8382k6725l0564l9291r995K2634L2267M1865K2248p283j7684m0090
295g955l9178n398Q914K1519M1923L3575J902j9204k9917l9512k3568P208K3816
308b5875L6835L0798R233m402l0224m2018k0601n137J2440L6696L8082J7018p050
$$ y = [-74135, -52745, -52115, -9961, 57162, 60590, 56405, 44794, -20734, -55809, -57801, -66015, -19657, 42639, 55543, 60919, 50849, -2043, -47627, -60624, -59046, -32089, 15834, 51186, 69890, 55444, 4878, -29943, -53747, -70871, -36312, 10703, 35225, 60704, 59171, 24638, -13147, -52674, -68584, -44284, -9780, 26219, 64334, 65111, 24670, -5375, -32588, -66041, -54972, -16946, 13781, 50613, 63953, 43006, 11529, -34056, -63244, -51250, -28230, 1194, 43106, 63045, 44663, 17938, -12626, -51917, -61912, -39278, -7011, 34854, 57102, 49819, 32135, -7955, -47133, -52531, -43617, -22098, 19825, 53400, 55302, 36098, 6181, -33331, -56899, -49691, -25875, 10960, 41758, 50991, 46589, 16365, -25653, -46254, -51391, -38951, -2255, 35827, 52845, 45795]
321D5795k1643l3674l3210j0159J1755K9019L4866K1770Q121j6964l9817k9925
333c4066j3569N70K3117L7757K9551M548j1200k3039l7490k5077J161J8575L1146
346A984K9307J7830k833k9008l3130k2494r730R899K9190L5752J8667k646j4190
359B8598l0312l2744j4085P631K5983K8212K3887J3867j6703l2657k4728j8971
371d2022m210K0576L2960K5582J1253m354k4902l0806k2112r434J7025K8972K2390
384B0918K3073K177k7370k6291k1435j7119P178K9320K7275J7880Q969j4415k9831
397C29k3472j8296p2K3395K4058K4808J6680j3078k6386k3324k1609p853J8522
410b6298L0207J9881J3849L258k2939k8845j8442j1036O608K3920K7330K0139
$$ y = [45795, 24152, -9522, -42732, -52891, -41136, -12117, 22749, 44519, 52640, 35676, -4141, -34066, -47635, -47065, -23948, 13809, 43360, 47908, 36708, 13669, -23821, -48898, -47737, -29162, 1984, 31291, 49121, 46288, 17280, -15850, -38344, -48074, -38175, -8985, 26767, 45434, 42788, 28598, -1714, -34458, -48543, -40912, -14929, 13283, 37170, 51037, 34334, 1677, -23051, -42022, -46232, -25656, 7304, 32886, 44139, 39785, 14883, -15923, -38035, -47469, -30444, -1472, 20918, 43991, 46168, 18798, -7493, -28928, -46047, -38869, -9549, 17726, 35606, 44575, 30160, 329, -23143, -41439, -41511, -18116, 5942, 30750, 47430, 34352, 7966, -15358, -36967, -44820, -26298, 3909, 23790, 37639, 40897, 17958, -10887, -29329, -40365, -33757, -9837, 17493, 37632]
422C7632L739j5672k7728k2914j4070j197K6387K9320J0859J1937k909l1635k4437
435b0688r281p869R684L0892K4169J0250P17k2768l0008j4626j1430R331L4750
448C123J7085P342J1622j6527l1877j3414q194n968J9781L1421J5939P558p002
461C0889k9296k3626j2839l790K2321K7598J2101R171p09k2211k5427j0464m756
474c1038M51K4630K9876Q954M32j0923l0086k4019l697P938J9188K6622J2182
487C0510k456m400k2150k5885j246k644K229L4089K2702k304K610j5842l7797
500b2584j2907P217N356K4781K7435k046l096o671l0100j1831K428r326J8195
513a3149L4127N635K557Q07l1556k9872R50M369J1363L0153J3734m179k405j8150
$$ y = [37632, 41371, 25699, -2029, -24943, -39013, -40210, -13823, 15497, 26356, 38293, 35384, 3749, -20688, -29969, -37838, -28154, 2738, 26907, 37157, 37874, 15106, -14902, -29528, -40958, -31627, 3123, 20208, 27550, 39172, 22645, -9232, -22646, -30840, -36808, -17027, 14394, 30333, 37891, 30889, 1593, -22033, -34872, -38662, -16341, 11257, 23358, 32529, 31820, 9609, -15818, -26282, -31038, -30587, -5957, 23919, 32873, 33305, 22382, -7704, -31723, -35420, -27482, -8294, 18328, 30510, 28054, 23654, 1504, -24381, -25627, -28271, -26042, 8047, 30749, 28445, 31055, 15213, -22584, -35491, -28274, -22918, 1863, 29298, 27252, 24156, 17485, -12615, -24446, -22018, -31344, -13149, 20978, 26613, 29170, 29977, -1579, -31451, -30501, -26132, -14769, 15384, 29118, 24939, 22534, 4384]
527D384k1728n000n649M309K5945K0348N894P25j2598k9124k0355L593J0104J4273
541d879K4644J2556q922j2141j2432j8883r574Q244R987J6844K3344P30r993r840
555I685l0270j6829J6302Q582J2530L0270J204k0017k564j4106k5504O356J1401
568a2960K490K7363J6392j2960k807j7525l2894M558J3407J747K7507K0761j6187
581A8892p547m177k7845q627J3769J320J4989K5058r83m519q160k8545j2656O744
595b2287L844J8602K5107J053r570o361j6342j7282r15P450J1205J5755J3021
608B3280M846j1918k1144j2184q564N39J8691J6738J0725N613j1688j4063r927
621i056j6746p66K0287Q902P778J9501o240k3393m963j2233j4683J6224J6203
$$ y = [4384, -17344, -22344, -27993, -23684, 2261, 22609, 28503, 29228, 16630, -12494, -32849, -29256, -19152, -4879, 19765, 32321, 23399, 11258, -1174, -20057, -29631, -21387, -11400, 5444, 28788, 29518, 19525, 9685, -20585, -37414, -21112, -12530, 0, 30270, 31474, 11457, 8893, -5213, -30717, -24361, -12960, -10470, 16893, 33285, 20325, 17518, -7, -32901, -28343, -14936, -13189, 14318, 35079, 18892, 11345, 7168, -20677, -29304, -15535, -14215, 774, 25832, 24849, 20330, 12170, -16375, -29031, -22287, -18443, 159, 25266, 26319, 16749, 10388, -5954, -23236, -24151, -16701, -5496, 10259, 23280, 28126, 16208, -4936, -17120, -25684, -25145, -6454, 10284, 21009, 26622, 14934, 871, -9056, -25802, -26568, -6281, 2621, 10399, 29900, 23660, 267, -4696, -16929, -31612, -15388, 815]
634H15Q977J9044m442k0051n087j6046j4601J8462J3123r5K0401Q870j9827p966
648A577q828k1083M635J6365R083J9734N933j5651o572j1833j9078M853J2770
661h095M038J5598J4831p110j1293j1076j6396l922P232J0494J8410R050l778
674A7983l251j4466j8669k618L464Q029J7117J1038J654m017j4379j3779m364
687a6258m778N037K1200J0090K002N847j4432k1870l431l179K660J9106J0132
700A2126L604N673j1254j5981m054r783l998K0456J3798K145J0726o208k2371
713e121o504m845m768J3862J2455O438J0339m745j5719o860r969q900J2837J5225
727C725M700J0250K349j4834j0905q935p423P125J0251J0389J3465j164j1145
$$ y = [815, 9792, 28836, 24394, 4343, -744, -16790, -31391, -12929, 194, 99, 20500, 29370, 9543, 1577, -7251, -28334, -23699, -7334, 1749, 21483, 27416, 11765, 5193, -6640, -25718, -20865, -8095, -4057, 11541, 26372, 19262, 7969, -3107, -19503, -23425, -16193, -5699, 12711, 21761, 17983, 14732, 266, -18403, -21021, -17557, -9528, 7589, 18627, 20281, 16264, 1885, -11894, -16258, -21036, -15999, 5201, 15291, 17293, 23140, 8708, -13162, -16593, -19772, -17112, 1994, 12126, 15730, 21403, 10149, -5832, -9886, -19669, -23667, -3211, 10587, 12732, 23458, 17250, -5121, -11625, -16470, -21238, -7376, 5079, 11517, 21856, 17111, 1392, -5468, -15437, -24337, -11500, 3725, 8425, 18675, 21024, 6190, -4715, -13650, -21073, -13948, -3697, 6692, 20157, 18993, 7848]
740G848o709j1408j0893N138J0493Q217J2043N566o769r403j3386j0032L659N338
754a0298R169J6366L196o153l829j2313j3107k84M805Q507J3832P278j043m806
768A1320j3421j2564n67N36N904J7274P539j808m72j0913j4536l763J84N255J3081
783C049R490L550l55j0659j3570m740k731K071J4713J0541J874K529o308j3507
797d053q149m260K435J0372R990Q127L243p995j1601o494o143k186J0188J1406
811D880N871N373k261j0832j0275q042k67P713P711R105P559k847q878p584q188
826a0962o249M394J1339R167O348Q09o322r489j0108l810L659M840R110J0922
840A3648K134n677q093r300p425r3P933R353P339L843j514o334j0645q378l92
$$ y = [7848, 1139, -10269, -21162, -16024, -5531, 2686, 14729, 20295, 13526, 4123, -9263, -19295, -15636, -10298, -1129, 15237, 18433, 12280, 8451, -3862, -16969, -17253, -12448, -3941, 9891, 17169, 16126, 11320, -2101, -14665, -15232, -14696, -8792, 8482, 16021, 14213, 13741, 2828, -11708, -15471, -15287, -10032, 3049, 12539, 16089, 15734, 5075, -8495, -13235, -15966, -13895, 818, 11359, 13233, 15762, 9454, -4053, -12202, -16462, -14027, -3655, 6335, 14462, 17705, 9710, -1891, -8385, -14528, -16714, -6526, 4880, 10751, 16124, 13863, 3031, -7244, -15286, -15553, -7840, -129, 8976, 16535, 13688, 4810, -2774, -10962, -17211, -12817, -1478, 7689, 14037, 14846, 8524, -965, -11073, -14883, -11224, -6384, 2726, 13648, 15782, 10105, 2012, -7288, -14713, -14806, -6873, 2480, 9819, 13662, 12148, 5814, -4831, -13209, -13601]
855a3601L245P582J1789O185k535o673p754q070m911L499P902P658P472K732m427
870A0093r361j0158m223J744N217R391Q833J848m144n541p691r125j038O678O909
885e68Q512O239j895o827r364p176j016K182O127J0356O528j608m193n994j0479
900i176n514M543N977P027P811K272l214p930q874l910q60L228R945R120J865
915A2310k710m861q513p778n95M400O433O991N344K030o188r966n088l632j08
930a1931Q825R049M355J201l881p070o773n354N3O857O481N145O549k289j0519
945F98n114m555m688O315Q887M669N161m36p005n994o197m459M477P030M147P249
961A0185L211q066o211m271p420J330Q406N805N954K825m147o073o719n481O70
$$ y = [-13601, -10356, -2774, 9015, 15200, 12665, 5992, -1762, -9832, -14743, -11244, -3342, 4316, 11788, 14520, 10093, 732, -9426, -13649, -11905, -6688, 2703, 11536, 13384, 9240, 3699, -3992, -13117, -14155, -7477, -568, 7944, 14183, 12288, 5461, -3903, -11079, -12095, -9913, -3786, 6570, 13098, 11490, 7297, 1303, -9176, -14690, -10147, -4170, 2857, 10668, 12940, 9726, 1796, -7078, -10988, -11848, -8620, 1325, 10445, 12310, 9600, 4739, -3774, -11552, -12147, -7747, -1314, 5677, 11021, 13051, 6863, -3103, -8191, -11823, -11931, -3106, 5943, 10298, 11499, 7618, 548, -6225, -11579, -11526, -4669, 1812, 6957, 13506, 11217, 698, -4416, -8971, -13659, -7344, 1543, 6212, 11373, 10937, 3932, -2062, -8259, -12718, -8241, -1211, 2936, 10185, 13396, 5330, -881, -5152, -12572, -11242, -2836, 2969, 8923, 11748, 7601, 1528, -5191, -10672, -10002]
976a0002M682M972P256N287l145n869n445p149k336M248O715P222L296j48k984
991F600q685o644l48O59M063Q510N332J89k292o281p270l359j005M503J0025L725
1007G722P51J990q015r684J08j178k37Q900O577J137J672m112q946l732k697n28
1023a0272R708O873j21M286k305j1391l282n16l131N429Q988L020J672q13p046
1038A099n940k992k419M390P911L234L661J382p498p268k781j839J719O503O742
1053E904K476r20k136n501o732k385J748M153O173N655J181l148n924o926k184
1068h566J367J666P426O925j924r66j096q943n097K535P54L640Q637K793j874
1083G277j899p660o465J514K23L562J0279J394l295J551n260q911K60J840R5O692
$$ y = [-10002, -5320, -348, 6908, 12195, 9050, 3181, -2264, -9413, -11749, -7501, -786, 6436, 9732, 9584, 6600, -2085, -8729, -9077, -8418, -4355, 4155, 9487, 9676, 7384, 1103, -6167, -9526, -10531, -6028, 3997, 7722, 8473, 10463, 2448, -7236, -7128, -8306, -8543, 357, 6934, 8071, 9743, 5631, -3315, -7047, -9744, -10272, -564, 6309, 6188, 10474, 8169, -3222, -6504, -7020, -10151, -4722, 4266, 7286, 8958, 8145, 1099, -4841, -7833, -10252, -5862, 2049, 5283, 8944, 10326, 2828, -4440, -7221, -9060, -7341, -838, 5904, 8380, 7460, 5324, -177, -6909, -9294, -7546, -3393, 2780, 8435, 9616, 6468, 544, -6382, -8566, -7199, -5533, 1893, 8818, 6894, 5928, 4832, -4111, -9208, -6673, -5919, -2279, 6358, 9151, 7277, 5378, -2282, -8747, -7233, -7010, -3448, 6831, 8225, 4930, 6481, 1221, -7690, -7430, -5590, -5495, 1197]
1099A197P056n0j470m211q114k664Q77J418P549O208j253p18j586o926m971R61
1115f697J547K159O622N354j049l425m847o105k592K080M948N729L745m50k656
1130D363k966n610m021K471K052K208P862L329m231k977m328o848j15N124L586
1145a01M861L787k922l049k757o475r37L659M69N041P262j393l683k072o505m933
1161i748L387M448L357N322J050l632k742m677l901J276J658K851O538L065k398
1176E854k941l927o065j776M599M196L218L932J5m076m105l388k130N36L411M495
1192A848M303J590l184l726l725n291M97N980K939K919L962k168n659k688k526
1207d929k359K774M439L239L922k96m330k831m754l631L962M497K172M319J552
$$ y = [1197, 8253, 8203, 6733, 2522, -5592, -8256, -7379, -5961, 1588, 7796, 6543, 5825, 4239, -2687, -7658, -6697, -5150, -2991, 3631, 8985, 7936, 4511, -336, -6441, -9033, -6953, -2005, 3724, 7469, 7019, 4363, 1397, -4213, -8234, -5763, -3711, -1503, 6359, 9688, 5457, 2480, -1848, -8696, -8811, -3687, -101, 4760, 8547, 5625, 2576, -181, -6656, -7593, -3934, -3465, 1576, 8838, 7445, 3762, 1690, -4815, -9748, -6361, -1913, 1444, 6766, 7816, 4184, 1442, -3235, -7136, -5860, -4202, -1351, 5187, 8252, 5854, 2913, -1014, -7079, -8855, -4256, -60, 3158, 7090, 7105, 3029, -1076, -4464, -6594, -6058, -2647, 1848, 6151, 7741, 4557, 831, -2894, -8185, -7688, -1708, 1231, 4150, 8112, 5944, 285, -2403, -4929, -7288, -4514, -75, 3164, 7086, 6790, 2460, -371, -5125, -8756, -4794, -297, 1875, 6194, 7746]
1222G746m609m088k158l243j49M088L752L731K079k292l293m234m564O37L758
1237b839L086L815L019j433m165l268k717k221J585M537L995K403L32k137m698
1252g06m473j076J191K922M284L230J233k246m517k973k328j281L553N257K195
1267D265J080N17l815n351j838n35J098M378M032K321j38l996l651k176k571R72
1283e408M946L273J478J860j389n339l718j211J42K868M031L400J435k525l294
1298E49k362l494j257L396M058K549K132J96l649m569k412m95J359K859L981L157
1314E998p37k684k605l881k462J536L554L409K357J034j215m025l820j455J15
1329d881J601L922M272O84j680k074l865l303p5K025L350L214J818L87k757m403
$$ y = [7746, 3137, -951, -3109, -6352, -6501, -2413, 1339, 5070, 7149, 4857, 1564, -2670, -7234, -6597, -2839, 247, 4062, 7081, 5648, 1483, -1785, -4502, -6723, -5138, -601, 3394, 5797, 6129, 3992, -706, -5179, -6255, -5064, -2142, 2142, 5372, 6605, 4359, -158, -3131, -5459, -6740, -3187, 2070, 4265, 5345, 5862, 2047, -3304, -5142, -5677, -4579, -201, 3831, 6152, 6014, 2018, -1633, -3809, -6380, -5408, -462, 2811, 4289, 6149, 4760, -579, -4297, -5508, -5366, -2498, 1533, 4933, 6368, 3843, 549, -1813, -5307, -6564, -3168, 890, 3439, 5571, 5767, 2118, -2451, -4863, -5358, -3999, -1140, 2841, 5998, 5261, 2577, -28, -3909, -6371, -4835, -1281, 2128, 4485, 5519, 4304, 279, -3541, -4996, -4881, -3280, 642, 4914, 5598, 3918, 1844, -2021, -5324, -5399, -3374, -24, 3190, 5008, 5395, 2638, -1765]
1345a765k524o40M09K899M575K191o01j091l101m124j682P83K675L386K645J496
1361E531j168l893l286j564o39J414M163L654N88o18j746m062l179k66J715K669
1377f87L042K637K66k671l503k695j230L16K642M284K137k98o13k609m255j995
1393e232R51J879K718L632J552j661k782l046k280m01J145L367L619R70k89j304
1409B838l749l634l29J660J810L263L158l63k181k297l077k002M63K427L427K644
1425D058O11j181k463l540k434R63J702J720L881K141j953k057k116l649j107
1440e424K584K596K390K557l92k289k184l301j413J792J245K625M287j45k877
1455B051j233k856l517J363L103J407K705K075j750k228k669k937K91J709J665
$$ y = [-1765, -4289, -4929, -4520, -1621, 2954, 5145, 4544, 3453, 352, -3772, -5454, -4671, -1996, 1390, 4035, 5531, 4363, 470, -2816, -4380, -5019, -3605, 558, 4212, 4800, 4182, 2436, -1626, -4805, -5071, -3356, -687, 2355, 4992, 5258, 2587, -916, -3611, -4841, -4525, -1883, 2401, 4538, 4240, 3627, 1018, -3237, -5232, -4281, -2402, 316, 3948, 5500, 3839, 1057, -1989, -4269, -4670, -3525, -158, 3461, 4431, 4142, 2838, -911, -4545, -4874, -3214, -1404, 1859, 5017, 4654, 2473, 176, -2901, -4903, -4440, -2013, 1414, 4058, 4669, 3488, 1025, -2515, -4949, -3986, -2284, -564, 3317, 5458, 3505, 1448, -668, -4317, -5424, -2840, -244, 2146, 4703, 4311, 2022, -162, -3463, -4876, -3084, -1839, 786, 5073, 4928, 2051, 818, -2038, -5555, -4192, -1089, 318, 3023, 5098, 3348, 1120, -1549, -4486, -4195, -2486, -821]
1470h21L765K299j999j848j295l681j933K634K424J659L066P13k760k833k203
1485b813j386N92K014K408K657J155j714k050k004l602n76L866K379J190K784
1500D900o10m246j654p21k196J216L383J430K269J176l192k274j728l262J541
1515c968M388N94J777K878l281l834K46k198j646L872K297P14K790q22l436j210
1531h39k719j985L522K792P49L179K9m761j478j88k738J001L722R19J415J904
1547D524j711k984k053k227J55L252K429J654J681j808l826q88o62j808J819L743
1563A290O34P32J844k374m131r88q52p0L985K814M30Q90k341l996O5m45j759L420
1581h52L318j118J902J610m973k934M96j946J624N117Q15K18O13l965k499R64
$$ y = [-821, 2944, 5243, 3244, 1396, 101, -3580, -5513, -2879, -455, 1204, 4270, 4983, 2223, -610, -2813, -4199, -3607, -1593, 815, 3472, 4627, 2913, 863, -1141, -4743, -5319, -1453, 926, 2116, 4900, 4290, 44, -1610, -2331, -4527, -3311, 72, 1502, 3771, 4947, 1755, -519, -2247, -5509, -3968, 420, 1014, 2791, 5669, 2388, -1446, -1200, -3398, -5044, -1172, 1125, 1839, 4629, 3807, 371, -839, -3558, -5543, -2021, 771, 1520, 4699, 4728, -33, -1511, -1699, -4437, -3436, 286, 1205, 2620, 4524, 2813, -171, -2224, -4451, -4296, -1044, 1385, 3039, 4720, 2912, -914, -1802, -2464, -4272, -2453, 1290, 1924, 2656, 4500, 2126, -2005, -2993, -3845, -3915, 70, 2884, 3314, 4204, 1863, -2133, -2068, -2513, -4272, -852, 2466, 1348, 3250, 4860, -113, -3047, -2551, -4497, -2873, 2244, 3059, 3277, 3890, -75, -2574, -1610]
1597a610j935O5M686Q01l89L039j780n048l93n65j213L671L539J18N98j066l623
1614a105j263k47r79K148L100K52J039J047l064l381m86n13K30L723L226m02o92
1631B633j069l217j598O77J75J576K803O53L85K09l468l181N45l31P00M952J788
1648D232k171L32j439m128Q3J213n30K604K750l72N83r46m417j150R58j048K889
1665e57M526j093r40O57l447k793J226K13O05L261J346k23j0k577k917p4k74O50
1683b421L885K024r04j32j276l351j290J082P61J215K531J216o69j262k015k178
1699b784o79Q12K031K763J325q34j017j531k885n93J766L65J371L207N5j786p32
1716H54k203k376P62J593J526K559N75j332o39k280k692J083J193J75L064K049
$$ y = [-1610, -3545, -3480, 1206, 2007, 1618, 4657, 2877, -2171, -2564, -3129, -4342, -671, 2868, 2986, 3584, 2518, -1105, -2368, -2615, -3594, -1446, 1654, 1906, 2945, 3992, 928, -2453, -2939, -3452, -3222, 501, 3727, 3325, 2633, 1564, -1653, -3251, -2574, -2399, -823, 1980, 2633, 3018, 3227, -241, -3422, -2877, -3208, -2508, 2444, 4232, 2061, 2393, 954, -3174, -3091, -1878, -2408, 196, 2946, 2574, 3157, 2211, -2206, -3356, -2398, -3446, -557, 3969, 2876, 1936, 2593, -854, -3647, -2421, -2208, -1603, 1658, 3004, 2781, 2771, 194, -2723, -2797, -3071, -2421, 1464, 3488, 2584, 2452, 1176, -2175, -3465, -2383, -1622, -407, 2124, 3340, 2671, 1409, -606, -2784, -3463, -2651, -620, 2143, 3468, 2634, 1617, 86, -2799, -3392, -1626, -1261, 110, 3317, 3372, 1586, 854, -1349, -3725, -2963, -1370, 156, 2715, 3290, 1958, 1319, -961, -3653, -2570, -1377, -1202, 1862, 3911]
1732C911j772j008q63k833j030J497J258J971J981k92q83j579k789o72J143L55
1748a605J836K727J20j287r43j787k119j49J632J795J607J044o6j545k348j402
1764b490j68M07J554K223J461k69j429j325j667j642O60K158J317J238J256r57
1780B327k362j494r92l10J354J809J672J106r13j492j165k090q64J862J601J040
1796A089J759K10j998j694j142j112M61J716J730J619R8j179j174j961j525P13
1812b390J464J191J720J117q98j809j530j241m35R78J922J832O49l54q00j947
1828e31j963j82Q55J193J763J499J43j328j809j208r49p5J545K175R85K29j19
1845B223j651k251q66K54P96J623J643J046n04j757j405j039r68P42K230J470
$$ y = [3911, 2139, 1131, 268, -2565, -3595, -2098, -840, 1131, 3112, 2820, 1937, 358, -2431, -3103, -1960, -1605, 231, 2958, 3078, 1791, 848, -939, -3058, -3207, -1575, 220, 1827, 2871, 2805, 1260, -1088, -2490, -2658, -2251, -697, 1526, 2987, 2718, 1289, -36, -1703, -3345, -2685, -527, 790, 2028, 3284, 2327, -35, -1529, -2521, -2831, -1477, 332, 2004, 3110, 2197, 705, -460, -2550, -3414, -1552, 49, 1089, 2848, 3058, 1060, -634, -1776, -2888, -2427, -711, 1019, 2638, 2736, 1557, 383, -1578, -3103, -2390, -926, 265, 1985, 3102, 2204, 395, -1135, -2376, -2811, -1833, 89, 1921, 2570, 2216, 1416, -531, -2494, -2676, -1821, -628, 1135, 2634, 2777, 1449, -360, -1568, -2517, -2592, -1047, 1128, 2113, 2342, 2223, 572, -1679, -2545, -2291, -1495, 128, 1771, 2817, 2313, 556, -849, -1888, -2856, -2114, 116, 1586]
1861A586M77M23q52k173j501l92L68J194J698J538M27j326j519j139j223k73J612
1878a075J884Q46O53Q9j706k042q66m9O05J497J759J017m49j291j327j301r10
1895b666N57J873J443O45O03o44k163j435l07l2Q65J997J500Q2o67j193j602j097
1913b241j90J176J704R62P01L34j508k064o83k12k4J564K157O04l60n93j496j617
1931a786o01M75J397J364Q46O31m39j909j526k23l29M07K241J648k43k46p95j986
1949a074j214K17P85J221J322P11J52q70j934j044j06k80J191K550N73n73l0j382
1967B15k169k05O80M70J439J386J81k58j173j807n71j34R7K003J901j86k12m29
1985A228k081j450N70M96O46J697R28k58n10j328j405n23k7J036K021J042k40
$$ y = [1586, 2063, 2486, 1634, -539, -2040, -2432, -2064, -870, 828, 2366, 2793, 1467, -52, -1191, -2414, -2687, -1075, 809, 1655, 2308, 2397, 691, -1351, -2217, -2266, -1661, -164, 1595, 2612, 2163, 872, -455, -1756, -2666, -2109, -236, 1207, 1852, 2455, 1811, -352, -1787, -2094, -2126, -1261, 736, 2236, 2318, 1651, 458, -1144, -2241, -2431, -1255, 449, 1411, 2112, 2446, 938, -1126, -1809, -2021, -2045, -481, 1676, 2280, 1920, 1327, -169, -1786, -2387, -1912, -515, 849, 1695, 2326, 1887, -22, -1548, -1771, -2100, -1693, 548, 2196, 1953, 1707, 912, -1074, -2288, -2071, -1286, -65, 1257, 1968, 2120, 1250, -684, -1728, -1834, -2114, -923, 1627, 2200, 1627, 1597, 215, -1954, -2159, -1479, -1009, 430, 1816, 1997, 1739, 566, -1241, -1812, -1946, -1849, 154, 2055, 1869, 1657, 1228, -853, -2303, -1733, -1237, -591, 1106, 2034, 1776, 1266, -62, -1467, -1990, -2017, -981, 1040, 2082, 1842]
2002A842l18j111k026n52Q60K88R30J806L58p82n16j173j550k47P68J120J687
2019A384Q19n40n86j438j853L47J003LJ384J717o44p60q3j774j500P53Q85J117
2037B34J810P6r31o36j725j014J003L23K69K080P29j124j44p54k196l22J202O71
2055d49J386J276m45q06j111j547j52P28K96J161J627k54q48j97j297j639L65
2072a906J140P73J326J031p40j413j070q04p5Q40P48R76J003l37p71l72j587j290
2090b528J121J246M93J511O16j745j143l57j021J33J284O13R75P80q44o28p02
2107a96j840j50J645M80P54J740o36j854l18p15j040R70J156O06R83O1q17n47
2125B82j368j108Q34J049M31J413Q37j444j178l41r19l45J119J199N91M57l1p93
$$ y = [1842, 1524, 413, -1613, -2165, -1305, -1017, -87, 1719, 2077, 1295, 779, -394, -1944, -2191, -1423, -303, 1384, 2203, 1663, 1077, -361, -2214, -1867, -864, -861, 523, 2240, 1596, 836, 753, -1021, -2521, -1768, -883, 234, 2044, 2120, 1189, 553, -1172, -2186, -1183, -860, -591, 1489, 2218, 1094, 950, 196, -2000, -2322, -1120, -449, 937, 2213, 1768, 962, -149, -1696, -1848, -1120, -824, 337, 1964, 1710, 862, 665, -632, -2271, -1906, -766, 7, 1333, 2364, 1624, 211, -859, -1663, -1738, -898, -150, 826, 1829, 1492, 721, 349, -1238, -2528, -1407, -161, 332, 1843, 2459, 714, -429, -786, -1807, -1674, -390, 223, 1198, 1978, 1134, 506, -196, -2036, -2186, -541, -61, 693, 2433, 1797, -57, -375, -1090, -2130, -1160, -4, 602, 1585, 1646, 829, 282, -1086, -2194, -1360, -311, 120, 1533, 2370, 926, -252, -593, -1512, -1857, -738, 461, 1052, 1509, 1478, 685]
2143F85j184j037k67P49R11Q78J095M4j427r57l51q38j9J596J002J28N80j49j501
2162f2j006m28j36R12J103P53P77n08j473n17m73q79Q24J665K23M57O57j148j423
2181f82m48m34K10J180Q90P12L06j012r78m20r38j30J432R15K69P81j87j427r59
2200i20l42k24M85J171J009L83l44p56p98q87m84N97J132P17N78L13p04j379p25
2219a178m2p7N96J426P12k02k16p29j234n92J41P44R48P14L98k6j020j244k47
2238a128j33o8J277J304Kj02k91j185r79q3L21P19R33O24L05m53j315p07j94k50
2258a403O94J369N32n0j9o50j193p03J17M91Q05R35O16k58r71q37n01l38K18J015
2278a31R39L79L6l21r55j143k47M82M85Q14R92J33o99o93o44p46p0P38R50P31
$$ y = [685, -499, -1536, -1803, -1054, -143, 735, 1830, 1874, 447, -510, -861, -1699, -1718, -122, 880, 1008, 1588, 1439, -62, -1068, -1496, -1632, -720, 383, 1136, 1913, 1405, -68, -585, -1058, -1937, -1113, 552, 775, 1232, 1889, 741, -682, -1130, -1564, -1354, -174, 716, 1428, 1734, 722, -256, -676, -1614, -1744, -312, 603, 872, 1653, 1466, 39, -920, -1262, -1486, -1001, 170, 1179, 1562, 1218, 462, -336, -1223, -1707, -1110, 22, 739, 1317, 1630, 926, -453, -1178, -1220, -1297, -701, 725, 1437, 1235, 1019, 290, -944, -1536, -1395, -651, 297, 1011, 1409, 1383, 363, -881, -1128, -1261, -1329, -52, 1252, 1254, 1152, 861, -324, -1303, -1386, -1065, -346, 587, 1211, 1516, 1063, -252, -959, -1153, -1403, -709, 660, 1192, 1142, 1123, 473, -720, -1423, -1306, -815, -10, 925, 1541, 1283, 312, -525, -1026, -1364, -1146, -131, 808, 1187, 1223, 902, -53, -1196, -1443, -961, -476, 338, 1330, 1463, 764, 71, -573, -1319, -1389, -651, 299, 1030]
2298A030K43j65n35j169p50K73K75M54J149P08l86o92n28q43n31L76Q81Q61L99
2317A050J08j53r44j100j57K26K89Q61J032J65o06n26o64p91j88O67R65N24L54
2336A112J73o64j149n50j2J78N21J055O99k13o14n05p66o58K57R19O49L88N22
2355A342k90j046p52l29k7L48Q21R57K93m97m50o19q79k31O72P21M45O61J67p64
2375E43q76m94k55J10N24R95O23j20l51n07q62o17K33O93N41O15N44l27r17o29
2395e34l65k15K20R39Q57J24r8l41q15q00j99M91N63N20P45J78o98p90m33l37
2415i88j24O48J024L47R6j15o12q92n25J38N42M42P14N81k76p66o09l65m34K29
2435i45J032O08J70J33l11q46p24j98K83L90O74P86J39n29p11n03m14j36O19Q58
$$ y = [1030, 1273, 1108, 573, -596, -1346, -1073, -798, -344, 805, 1513, 1127, 435, -93, -936, -1467, -1091, -210, 651, 1050, 1158, 1005, 61, -1039, -1196, -970, -681, 180, 1212, 1377, 771, 245, -419, -1210, -1398, -731, 234, 758, 1112, 1285, 621, -528, -1078, -1090, -912, -391, 664, 1363, 1150, 536, 31, -735, -1393, -1136, -217, 432, 820, 1342, 1052, 6, -746, -1075, -1102, -754, 67, 1024, 1317, 820, 370, -249, -1128, -1359, -687, 34, 479, 1140, 1307, 543, -333, -827, -1082, -972, -448, 547, 1170, 1050, 699, 192, -670, -1287, -1054, -361, 180, 795, 1339, 1012, 95, -534, -899, -1114, -894, 45, 902, 1026, 928, 587, -228, -1028, -1227, -736, -173, 347, 1092, 1270, 572, -218, -651, -988, -1112, -464, 560, 907, 1003, 888, 276, -616, -1141, -1003, -461, -19, 695, 1276, 1000, 234, -375, -740, -1174, -945, 87, 695, 865, 998, 687, -159, -883, -1081, -798, -408, 266, 1052, 1191, 662, -49, -552, -966, -1102, -483, 375]
2455C75K72K71P7o21r01m48N2K26N50R09L98k47n43n75n27l75K10Q59N18K90K72
2476A042k86q18p21q7K7K17R05P32J0l43m92o13n85q5O75O25L31L78O6n38q23
2497c83m54j1k7N76R94L79k37l69m66p30m21M42N43L79N26K58k40p01p28j65k4
2518h59J52Q79P92K1m02k18o67q14J79N50L23N43M51l8m34o98m58j31n3N04R54
2539E76M34k32k50l49q79l82M31L38L82O21K97j95o48n68l31j98L06P51O24J57
2559H85k18k43o07p49L4M39K96M42O17Q8n77n31l35n18N6O78N92M48O8l14l79
2580A72o84m80K94L86K13O15O01l75o85j54o25m27O69N79L75L74j21l63m62o17
2600g15j59L65K27L72Q20J52p29k89l50p22J20P12M27M06J84j73m69o37l22M2
$$ y = [375, 647, 918, 995, 374, -527, -975, -923, -697, -147, 762, 1160, 913, 370, -205, -732, -1107, -897, -38, 480, 770, 1042, 756, -62, -783, -870, -843, -626, 279, 1011, 1021, 678, 186, -427, -1012, -1097, -422, 203, 534, 912, 978, 440, -383, -837, -848, -875, -299, 695, 1074, 837, 468, 2, -728, -1149, -707, -164, 215, 741, 999, 759, 58, -670, -835, -859, -707, 172, 964, 985, 583, 365, -302, -1116, -937, -387, -64, 479, 930, 892, 458, -240, -698, -829, -882, -378, 576, 1010, 778, 528, 179, -700, -1082, -651, -313, 69, 690, 987, 792, 144, -424, -755, -953, -647, 104, 728, 885, 667, 424, -183, -932, -898, -459, -163, 279, 896, 984, 407, -124, -459, -977, -921, -243, 349, 797, 865, 551, 172, -512, -992, -698, -312, -99, 516, 1117, 742, 57, -97, -722, -1149, -480, 99, 474, 848, 727, 364, -98, -715, -874, -509, -282, 90, 910, 1062, 333, 44, -306, -1028, -908, -196, 231, 637, 821, 648, 179, -458, -780, -738]
2620g38K68L30O07N34k83n02k69o19l70M16O96L89J66K45l43p55k83j33r1L69
2640c66N69N04J93l20n04l94m76j70O48O83K4L76J38q25m94k0l51M9O82M73L43
2661G62L6m51m67m23m05K12Q04J91J86N33m34p85o1k65l23M46O88L49J75q3m62
2682B23n45m03j28N26M62J44M95N3o90l94j65l02m8N84O88J45Jo9n48o43k16K53
2704e77M10L16M28K28k79m78m23j48k31Q9Q54M55j24J87k50q21l85J40J61L45
2724a03M99K92j9k77n57k42j70k53N43P92K0P1R8o76o29j9O0J99M68M44J57j33
2746E65m36m49j14l23J40P87K73M3K49l08p06l61L4J07K75N42L79n7k66l44l38
2767c08l42q9N15M79K09K37q1m67n80k18J70L7L58O47J32k44k16l08m79k12L17
$$ y = [-738, -470, -140, 467, 1001, 718, 216, -53, -672, -1042, -626, 70, 459, 625, 870, 527, -228, -511, -644, -735, -366, 203, 707, 900, 580, 76, -318, -794, -964, -316, 367, 391, 767, 905, 80, -414, -434, -785, -736, -54, 419, 762, 798, 347, -120, -543, -948, -736, 68, 259, 445, 978, 544, -241, -302, -567, -890, -444, 244, 593, 768, 685, 223, -322, -725, -853, -327, 135, 279, 774, 827, 137, -257, -422, -724, -772, -188, 500, 645, 646, 577, 29, -614, -830, -577, -167, 149, 577, 805, 526, 48, -375, -523, -754, -665, 189, 644, 520, 707, 457, -364, -749, -609, -448, -103, 396, 688, 669, 392, -165, -407, -577, -830, -287, 505, 525, 596, 694, 18, -611, -630, -570, -371, 97, 541, 698, 565, 129, -320, -434, -757, -617, 170, 443, 486, 735, 427, -279, -640, -606, -499, -224, 318, 697, 640, 374, 30, -308, -650, -739, -224, 255, 464, 701, 620, 153, -427, -645, -475, -438, -80, 567, 699, 455, 239, -69, -548, -760, -443]
2788d43M12L09L05P7j96n58n25Q5N8Q6O89M25j68k13j49m65m25J03L20L64L75
2809D66J69ol82o58r8M6q5M47O21P9j24j28l63n05j84K54L18L60L13J04j74n59
2831h9l02p4j49K56N65L70J5j67j85m78m23J06K63K45M04K94k7m01m21j97k20
2852f15O1N06M30J60j1j60k91n77j53K41J99L06M35J63l34l89j76l24j11L42M03
2873A05L18J17q5j37n37m25J34K13J34M03M38j27m18j62k84l68J62M50L37J88
2893D56N4o0l68n33p7J66P0L26M85J46l35k39j49m92j13L42M14K27J76N3k36n47
2915b34k45%J05K01L69M08n5l52j27l12m27J45M51K73J45K37o7m79l14j35q5J92
2937c06K91M36K00k49k36j63m03k32L56L60R9K75K42m25m53j00j73j8L46L29L12
$$ y = [-443, -31, 278, 583, 660, 464, -94, -619, -534, -476, -390, 299, 724, 556, 343, 194, -271, -696, -593, -273, 91, 466, 635, 629, 247, -411, -509, -463, -548, -101, 520, 599, 475, 347, -16, -521, -705, -451, -133, 227, 540, 644, 470, -89, -391, -465, -614, -358, 207, 577, 592, 425, 240, -238, -661, -555, -292, -47, 357, 651, 624, 223, -198, -395, -615, -554, -48, 382, 542, 531, 371, 80, -497, -650, -409, -210, 96, 531, 694, 360, -29, -205, -529, -640, -298, 105, 423, 540, 455, 318, -219, -644, -510, -297, -163, 240, 678, 551, 133, -29, -313, -681, -519, -69, 268, 456, 510, 450, 82, -451, -528, -362, -292, 34, 519, 665, 330, 91, -58, -550, -663, -321, 93, 320, 496, 549, 313, -234, -479, -479, -374, -173, 196, 604, 549, 197, 70, -242, -669, -524, -73, 200, 345, 582, 515, 36, -278, -413, -498, -306, -15, 421, 621, 372, 136, -27, -430, -662, -306, 54, 153, 428, 670, 245, -208, -308, -481, -499, -153, 176, 488]
2958D88%k09j78l13l96N4M41K22Q3M23p2n86j91o5k42J19M55K97J12J5k02l09
2980e4l12k22J96M29Q0K38L69m23n14Lj72k11L55N09M4P2J02l79l53k03j07K91
3002b62L83R1K96L0n00l05N4j94j45N69L32q9K39n1n67k75l3l2L27L51J42J56
3024E17j13m67j89Kk97J59O47M0o4L53l37n65o4k9nL68M17O3j0k02m42n7k3k20
3048e18M01M33j39K27J99o44m13J56r0K2N69K96j50Rk62l37k3j07l7N22J83q6
3070B11L18j34o58j97J85j89K17P00j9k28Q5l11l59L6l0J50L88J40K2K09l60o59
3092d83J30J10k17N06N83l33j18J36m55l25J91J6P6M81J08l2J6m99l91K40r1N
3114c46P17J82m25J06j1n57j24K63p9J78M62O6q9j15m91k00J71m9K87N35j27k44
$$ y = [488, 488, 279, 101, -212, -608, -554, -113, 109, 192, 615, 543, -43, -234, -299, -541, -422, 33, 330, 442, 457, 255, -54, -366, -588, -392, 37, 117, 355, 724, 301, -213, -210, -382, -593, -238, 271, 315, 387, 489, 110, -243, -446, -553, -262, 121, 212, 508, 538, 38, -267, -213, -407, -552, 17, 349, 260, 499, 448, -119, -394, -427, -459, -132, 219, 361, 517, 404, -63, -252, -250, -547, -388, 259, 299, 235, 588, 251, -314, -378, -407, -412, -44, 373, 436, 426, 224, -218, -275, -298, -518, -117, 316, 177, 404, 603, -41, -454, -298, -388, -366, 203, 499, 349, 358, 96, -241, -264, -371, -408, 114, 297, 211, 529, 395, -263, -460, -275, -464, -247, 453, 434, 206, 291, -20, -379, -343, -373, -223, 165, 305, 327, 536, 176, -483, -353, -243, -460, 46, 629, 296, 178, 314, -141, -466, -275, -259, -183, 298, 406, 374, 390, -109, -500, -260, -351, -346, 371, 553, 128, 234, 223, -334, -458, -195, -274, -96, 366, 432, 343, 228, -263, -463, -292, -341, -54, 481, 354, 110]
3136A10J72k39n24J67K18k04L50N18j66j70j46m23q0J42P5L38L52k13j51J30l95
3157a39m07L32R0j70N62L13l44j11j16m27r2K83J72L12J79k60j8k1n15m2L30j63
3179b52J51O05pl75j0k20m24J92K93R4K70N2j40m7k60l54J91J04q0L92L48k36
3201B87k29L5l51k71K93K38P0K37M7j53j93k26j42R7O8J41L62J87l16j35m3m43
3223d40k9M10J05M5K72L0l15j56j39j33O4K02J87L31m3l03rk53l28K12L55j0J23
3246A78K95k40l07l3j99q4J91J90K18J83j52j25j34l63n4L30J26K7K77R1l00k04
3268h9k1k11k9K42K73J52l1m7j56k74j73O8K15R3J53K35p9l43r3n2k01R8L17J91
3292B38%O6q8k75k24j8P3J81J09J95J10k35j96k6j32j84K75L05K9N3J02k64l13
$$ y = [110, 282, 43, -481, -314, -96, -300, 50, 568, 402, 232, 86, -337, -417, -275, -200, 138, 490, 277, 126, 256, -139, -546, -214, -124, -294, 268, 581, 237, 126, 10, -417, -509, -226, -54, 258, 437, 177, 159, 138, -377, -419, -89, -252, -101, 504, 497, 122, 112, -108, -532, -340, -47, 47, 317, 369, 229, 182, -78, -432, -241, -137, -217, 175, 523, 287, 58, 93, -258, -529, -236, 2, 72, 309, 356, 203, 10, -216, -358, -261, -193, -52, 310, 497, 181, 46, 3, -440, -469, -59, 46, 91, 363, 393, 78, -78, -217, -350, -286, -84, 103, 434, 391, 88, 79, -174, -502, -290, 65, 55, 178, 473, 233, -74, -107, -306, -390, -199, -9, 209, 392, 240, 115, -19, -382, -436, -106, 20, 47, 324, 415, 115, -89, -110, -321, -350, -108, 165, 317, 286, 239, 83, -191, -364, -296, -81, 12, 165, 400, 321, -22, -115, -167, -368, -270, 47, 238, 238, 304, 216, -59, -283, -301, -228, -47, 62, 257, 367, 132, -64, -90, -222, -406, -131, 174, 203, 256, 358, 94, -219]
$$ [...]
8191a8
##END NTUPLES=NMR FID
##END=
