##TITLE=1H_6C1111
 CDCl3
 8 sc, 
 12.11.2021
##JCAMPDX= 6.0         $$ Bruker NMR JCAMP-DX V2.0
##DATA TYPE= NMR FID
##DATA CLASS= NTUPLES
##ORIGIN= UXNMR, Bruker Analytische Messtechnik GmbH
##OWNER= root
$$ XWIN-NMR		Version 3.5
$$ Fri Nov 12 10:44:30 2021 Russian Standard Time (UT+4h)  she@DPX200
##.OBSERVE FREQUENCY= 200.1313468511
##.OBSERVE NUCLEUS= ^1H
##.DELAY= (6, 6)
##.ACQUISITION MODE= SIMULTANEOUS
##.ACQUISITION SCHEME= undefined
##.AVERAGES= 8
##.DIGITISER RES= 18
##SPECTROMETER/DATA SYSTEM= spect
##.PULSE SEQUENCE= zg30
##.SOLVENT NAME= D2O
##.SHIFT REFERENCE= (INTERNAL, D2O, 0, 15.7039)
##AUDIT TRAIL= $$ (NUMBER, WHEN, WHO, WHERE, WHAT)
$$ ##TITLE= Audit trail, XWIN-NMR		Version 3.5
$$ ##JCAMPDX= 5.01
$$ ##ORIGIN= Bruker BioSpin GmbH
$$ ##OWNER= she
$$ F:/spectra/data/she/nmr/H-F/1/audita.txt
$$ ##AUDIT TRAIL=  $$ (NUMBER, WHEN, WHO, WHERE, WHAT)
(   1,<2021-11-12 10:43:00.62 +0400>,<she>,<DPX200>,
      <created by zg, POWCHK disabled, PULCHK disabled
       configuration hash MD5:
       00 E9 B6 7A A2 85 ED C7 34 08 36 98 17 FE 4E 26
       data hash MD5: 16K
       0B 79 D0 3C E9 7B F0 9E E9 AA FA 31 2E 62 38 03>)
$$ ##END=
$$ 
$$ hash MD5
$$ 67 CC F5 12 99 4E C7 52 98 BD A6 2C 75 C8 9B 2E
##$RELAX= 
##$RELAX= 
##$RELAX= 
##$RELAX= 
##$RELAX= 
##$RELAX= 
$$ Bruker specific parameters
$$ --------------------------
##$DU= <F:/spectra>
##$EXPNO= 1
##$NAME= <H-F>
##$PROCNO= 1
##$TYPE= <nmr>
##$USER= <she>
##$AMP= (0..31)
100 100 100 100 100 100 100 100 100 100 100 100 100 100 100 100 100 100 
100 100 100 100 100 100 100 100 100 100 100 100 100 100 
##$AQSEQ= 0
##$AQ_mod= 1
##$AUNM= <au_zg>
##$AUTOPOS= <>
##$BF1= 200.13
##$BF2= 200.13
##$BF3= 200.13
##$BF4= 200.13
##$BF5= 200.13
##$BF6= 200.13
##$BF7= 200.13
##$BF8= 200.13
##$BYTORDA= 1
##$CFDGTYP= 0
##$CFRGTYP= 5
##$CHEMSTR= <none>
##$CNST= (0..31)
1 1 145 1 1 1 1 1 1 1 1 1 1 1 1 1 1 1 1 1 1 1 1 1 1 1 1 1 1 1 1 1 
##$CPDPRG= <>
##$CPDPRG1= <>
##$CPDPRG2= <>
##$CPDPRG3= <>
##$CPDPRG4= <mlev>
##$CPDPRG5= <mlev>
##$CPDPRG6= <mlev>
##$CPDPRG7= <mlev>
##$CPDPRG8= <mlev>
##$CPDPRGB= <>
##$CPDPRGT= <>
##$D= (0..31)
0 1.2 0 0 0 0 0 0 0 0.06 0 0.03 0 0 0 0 0.0002 0 0 0 0 0 0 0 0 0 0 0 0 
0 0 0 
##$DATE= 1636699380
##$DBL= (0..7)
120 120 120 120 120 120 120 120 
##$DBP= (0..7)
150 150 150 150 150 150 150 150 
##$DBP07= 0
##$DBPNAM0= <>
##$DBPNAM1= <>
##$DBPNAM2= <>
##$DBPNAM3= <>
##$DBPNAM4= <>
##$DBPNAM5= <>
##$DBPNAM6= <>
##$DBPNAM7= <>
##$DBPOAL= (0..7)
0.5 0.5 0.5 0.5 0.5 0.5 0.5 0.5 
##$DBPOFFS= (0..7)
0 0 0 0 0 0 0 0 
##$DE= 6
##$DECBNUC= <off>
##$DECIM= 32
##$DECNUC= <off>
##$DECSTAT= 4
##$DIGMOD= 1
##$DIGTYP= 9
##$DL= (0..7)
0 120 120 120 120 120 120 120 
##$DP= (0..7)
150 150 150 150 150 150 150 150 
##$DP07= 0
##$DPNAME0= <>
##$DPNAME1= <>
##$DPNAME2= <>
##$DPNAME3= <>
##$DPNAME4= <>
##$DPNAME5= <>
##$DPNAME6= <>
##$DPNAME7= <>
##$DPOAL= (0..7)
0.5 0.5 0.5 0.5 0.5 0.5 0.5 0.5 
##$DPOFFS= (0..7)
0 0 0 0 0 0 0 0 
##$DQDMODE= 0
##$DR= 18
##$DS= 0
##$DSLIST= <SSSSSSSSSSSSSSS>
$$ [...]
##$SUBNAM2= <"">
##$SUBNAM3= <"">
##$SUBNAM4= <"">
##$SUBNAM5= <"">
##$SUBNAM6= <"">
##$SUBNAM7= <"">
##$SUBNAM8= <"">
##$SUBNAM9= <"">
##$SW= 18.0517286264689
##$SWIBOX= (0..15)
0 0 2 0 0 0 0 0 0 0 0 0 0 0 0 0 
##$SW_h= 3612.71676300578
##$TD= 16384
##$TD0= 1
##$TE= 0
##$TE2= 300
##$TE3= 300
##$TEG= 300
##$TL= (0..7)
0 120 120 120 120 120 120 120 
##$TP= (0..7)
150 150 150 150 150 150 150 150 
##$TP07= 0
##$TPNAME0= <>
##$TPNAME1= <>
##$TPNAME2= <>
##$TPNAME3= <>
##$TPNAME4= <>
##$TPNAME5= <>
##$TPNAME6= <>
##$TPNAME7= <>
##$TPOAL= (0..7)
0.5 0.5 0.5 0.5 0.5 0.5 0.5 0.5 
##$TPOFFS= (0..7)
0 0 0 0 0 0 0 0 
##$TUNHIN= 0
##$TUNHOUT= 0
##$TUNXOUT= 0
##$USERA1= <user>
##$USERA2= <user>
##$USERA3= <user>
##$USERA4= <user>
##$USERA5= <user>
##$V9= 5
##$VALIST= <valist>
##$VCLIST= <CCCCCCCCCCCCCCC>
##$VD= 0
##$VDLIST= <DDDDDDDDDDDDDDD>
##$VPLIST= <PPPPPPPPPPPPPPP>
##$VTLIST= <TTTTTTTTTTTTTTT>
##$WBST= 1024
##$WBSW= 4
##$XGAIN= (0..3)
0 0 0 0 
##$XL= 0
##$YL= 0
##$YMAX_a= 786159
##$YMIN_a= -785912
##$ZGOPTNS= <>
##$ZL1= 120
##$ZL2= 120
##$ZL3= 120
##$ZL4= 120
##$ABSF1= 10
##$ABSF2= 0
##$ABSG= 5
##$ABSL= 3
##$ALPHA= 0
##$AQORDER= 0
##$ASSFAC= 0
##$ASSFACI= 0
##$ASSFACX= 0
##$ASSWID= 0
##$AUNMP= <proc_1d>
##$AZFE= 0.1
##$AZFW= 0.1
##$BCFW= 1
##$BC_mod= 2
##$BYTORDP= 1
##$COROFFS= 0
##$CY= 11.3945322036743
##$DATMOD= 1
##$DC= 2
##$DFILT= <>
##$DTYPP= 0
##$F1P= 2.36226072786647
##$F2P= -0.459571619588291
##$FCOR= 0.5
##$FTSIZE= 0
##$FT_mod= 4
##$GAMMA= 1
##$GB= 0.15
##$INTBC= 1
##$INTSCL= 1
##$ISEN= 128
##$LB= 0.24
##$LEV0= 0
##$LPBIN= 0
##$MAXI= 10000
##$MC2= 0
##$MEAN= 0
##$ME_mod= 0
##$MI= 1.114404
##$NCOEF= 0
##$NC_proc= 0
##$NLEV= 6
##$NOISF1= 3.799351
##$NOISF2= 2.8
##$NSP= 1
##$NTH_PI= 0
##$NZP= 0
##$OFFSET= 15.70392
##$PC= 1
##$PHC0= -15511.87
##$PHC1= 12.60081
##$PH_mod= 1
##$PKNL= yes
##$PPARMOD= 0
##$PSCAL= 0
##$PSIGN= 0
##$REVERSE= no
##$SF= 200.130013532006
##$SI= 16384
##$SIGF1= 3
##$SIGF2= 2
##$SINO= 400
##$SIOLD= 16384
##$SREGLST= <1H.CDCl3>
##$SSB= 0
##$STSI= 0
##$STSR= 0
##$SW_p= 3612.71676300578
##$SYMM= 0
##$S_DEV= 0
##$TDeff= 0
##$TDoff= 0
##$TI= <>
##$TILT= no
##$TM1= 0
##$TM2= 0
##$TOPLEV= 0
##$USERP1= <user>
##$USERP2= <user>
##$USERP3= <user>
##$USERP4= <user>
##$USERP5= <user>
##$WDW= 1
##$XDIM= 8192
##$YMAX_p= 0
##$YMIN_p= 0
$$ End of Bruker specific parameters
$$ ---------------------------------
##NTUPLES= NMR FID
##VAR_NAME=  TIME,          FID/REAL,        FID/IMAG
##SYMBOL=    X,             R,               I
##VAR_TYPE=  INDEPENDENT,   DEPENDENT,       DEPENDENT
##VAR_FORM=  AFFN,          ASDF,            ASDF
##VAR_DIM=   8192,          8192,            8192
##UNITS=     SECONDS,       ARBITRARY UNITS, ARBITRARY UNITS
##FACTOR=    0.0002768,     1,               1
##FIRST=     0,             0,               0
##LAST=      2.2672688,     0,               0
##MIN=       0,             -785912,         0
##MAX=       2.2672688,     786159,          0
$$ Real data points
##PAGE= N=1
##DATA TABLE= (X++(R..R)), XYDATA
0@%%%%%%%Qj6J6j6K4m0N6o4Q0j04J27j58J91k24K64l14L77m47N20o05P01q08R31
30D99j067J215j385J575j783K011k260K534k838L172l536L931m364M839n356N921
46C108o537P211p951Q760r649J0631j1715J2919j4262J5768j7475J9425k1676
59a1443K4306k7424L1202l5890M1883m9848O1017p7945J06953j70076N48420k62966
71A78189l60901Q73549o26230k06770P56460k44525o62962M55193k06716m99204
81e43917O35996K39947p71309J95021L45749n91488n898O45480j90849k05695
91b46963K79250j44173j82525L22072K2784j12796K24515j5022k28968J32539
101E0713J07397m9817J01724J3548j01372L1234j03427r1485J82789l1735j70283
$$ y = [0, 0, 0, 0, 0, 0, 0, 0, 8, -8, 8, -8, 16, -24, 32, -32, 48, -56, 71, -87, 104, -120, 144, -170, 207, -240, 280, -325, 376, -432, 499, -568, 647, -738, 837, -946, 1065, -1195, 1339, -1499, 1673, -1863, 2068, -2296, 2543, -2813, 3108, -3429, 3782, -4169, 4591, -5058, 5573, -6142, 6777, -7485, 8283, -9192, 10233, -11443, 12863, -14561, 16641, -19249, 22634, -27214, 33803, -44142, 62811, -107265, 441155, 178189, -182712, 690837, 64607, -142163, 614297, 369772, -293190, 162003, -44713, -543917, 92079, 332026, -439283, -244262, 101487, -490001, -495899, 149581, -41268, -246963, 32287, -111886, -294411, 27661, 50445, -62351, 162164, 147142, -81826, 50713, 158110, 108293, 210017, 223565, 122193, 153427, 50000, -41485, 141304, 109569, -60714]
112f0714J60113o4210l11971J86440J49518k97171J26131K39365l64482m7567
122b84548L66689j95649q2077M30829j72788l20681L94824J2194l94103L63405
132A18095K40688m87171O7749L41839l47860m6652M05507k38810k11884L46618
142A88119j46933k96994L74914O7131l89945J78033J88056l34186L3012K58669
152A19876j94508m9623K03545j63087q4716K50372o4954j53480K00259K5655j81799
163i2460R3141R0863q5077M4368K5445q6745O0218L1705j12596M6660P5204j08045
175a7319k0268N4650n4715K3048M0048r7960L7383R3569j35362k0021J69865p0641
187B277r5901J34441k2352j02650J25898L111j25068J29553M4037j91445P9069
$$ y = [-60714, 99399, 35189, -276782, -90342, 59176, -237995, -111864, 127501, -236981, -284548, 82141, -113508, -195585, 235244, 62456, -258225, 136599, 148793, -245310, 118095, 358783, -128388, -60639, 281200, -66660, -113312, 292195, 53385, -158499, 188119, 41186, -255808, 119106, 186237, -203708, -25675, 162381, -171805, -138793, 119876, -74632, -124255, 79290, -83797, -168513, 81859, 16905, -136575, 63684, 89339, -92460, 681, 91544, 6467, 50835, 76280, -10465, 49753, 81458, -31138, 15522, 90726, -17319, -37587, 17063, -37652, -14604, 25444, -72516, -35133, 58436, -76926, -96947, 72918, 2277, -93624, 40817, 18465, -84185, 41713, 44824, -80244, 49309, 93346, -98099, -19030]
198a9030J45032j61492j1275J61453j11599p1126J47016o5591q9978J56485k9239
209E0656j60596J22582O0077j61100N6229J08191j22825m566R7632r1760r519
220e4999J24657p5976o8805J27099j5519j07108Q2837M6861q1291K6785L0672
231C5213n9804L3281L4917p2147J8930O5063o3142k9500N9672j3865k6517K6307
243H408j5520o813L3143l3324k3615N7163o172m6354L2947J1010l0859K5772K481
256H267l1921M0250J3190o0675K1866N1316m4926j6067M2327j9298j3798K8777
268A9308k7755j0086N2147k8491m9953N7561K0607o1788J1061L8723k5430n122
280i218J4800j9655J4153K2594m4830m171N8580j9912m7539L6251K3194l2561
$$ y = [-19030, 126002, -35490, -46765, 114688, 3089, -68037, 78979, 13388, -76590, 79895, 50656, -109940, 12642, 72719, -88381, -32152, 76039, -46786, -51352, 46280, -45480, -54999, 69658, -6318, -75123, 51976, 36457, -70651, 12186, 59047, -22244, 4541, 35213, -24591, 8690, 43607, -28540, -9610, 55453, -7689, -37189, 22483, 8618, -17899, 8408, -7112, -13925, 19218, -14106, -37721, 19442, 13270, -33084, -137, 10873, -19986, 5786, 8267, -23654, 16596, 29786, -30889, -9023, 42293, -2633, -18700, 23627, 4329, -9469, 19308, -8447, -18533, 33614, 5123, -44830, 12731, 33338, -28450, -17389, 21334, -4096, -9218, 5582, -14073, 80, 22674, -22156, -26327, 32253, 12341, -35198, 1053, 24247, -8314]
292h314p25J6317k820N675n922j8997K0554J9264l0528j0156K8495l567k1573
305a2297N252Q379R86k403j2916K121J9742m792j6864R835J2308p666n394L659
319e0M644N313o806j3342J0549J4149j4967j2251J3936P456j1307p792P163J1363
333H058l149j4014K197J7283j143j7158J712J6225j781j4953j821J2258M854j3858
347e290q023J3784Q532j3392p980J3641R147j0429p407R317P301m953o301L18
361a735P317L079j1117p456J2138P232j5867o794J6108L016j2553M86N866K880
375B600L716q805p394J8964O432k6313n93K8158p805k4331J1308J3286r543l473
389c793j345l83J5147l461k3938J3869K6991k2473j9653K7711R896k6255j649
$$ y = [-8314, -9039, 7278, 4458, 10133, 4211, -14786, 5768, 25032, -5496, -15652, 12843, 9276, -12297, -7045, 1334, 2320, -83, -12999, -10878, 8864, 4072, -12792, -2957, 9351, 1685, -3709, -50, 4594, 9907, 3101, -10241, 308, 14457, -510, -12761, 1175, 8631, -2676, -10468, -3305, 8058, 4909, -9105, -6908, 10375, 9232, -7926, -6214, 10011, 8230, -6723, -8544, 3714, 8568, -5290, -13313, 471, 9003, -4389, -12369, 1272, 10419, -10, -7417, 1900, 9201, 4248, -2053, -1735, 5582, 8661, -2456, -9912, 2226, 9458, -6409, -13203, 2905, 5921, -6632, -6146, -280, 2600, 6316, -2489, -9883, 9081, 15513, -10800, -11393, 16765, 8960, -15371, -4063, 9223, -320, -3793, -5138, -5521, 9626, 6165, -17773, -3904, 23087, 614, -19039, 8672, 18568, -7687, -9336]
402i336J5259k792l273j347p915P962J0592j6536p753K3326M783k4305J034K2391
416A2090m643j3826Q168N888o500P28l38p419P989R455j8374r417K4410J601k5985
431a6173R350K1136j6344r526J5677j966m014J1866j0832j3054K4291K851l1612
444a8350J4288K8995k9443j8488L0739J397j9768J3958M362j7079J1071O027k1705
457a3996J3728K5874k8450j8013L0988j054k6188J7550J5922k1542k634J0404
469B589j3703L717K4540j3147j8598K1846K072k7697J2598K7459j4162j3597R439
482C356p035p286J7248Q3j2015J6076m10l4350P393L5699j1639j7397J9858r62
496H619k5277N932J5111j359J0296j072k8358L385K2771j6595n291L4223l722
$$ y = [-9336, 5923, 3131, -142, -1489, -9404, -1442, 9150, -7386, -15139, 8187, 12970, -11335, -10301, 12090, 7447, -6379, 1789, 7677, 1177, 1905, 1567, -5852, 2137, 11592, -6782, -16199, 8211, 9812, -16173, -6823, 14313, -2031, -11557, 4120, 2154, -1860, 10006, -826, -13880, 10411, 13262, -18350, -4062, 24933, -4510, -22998, 7741, 9138, -10630, 3328, 7690, -9389, 1682, 7709, -13996, -268, 25606, -2844, -20857, 10131, 9077, -17111, 439, 16361, -5181, -7815, 2589, -11114, -7397, 17143, 3996, -14602, 7244, 9316, -18381, -5783, 21676, 7514, -6083, 3356, -3679, -10965, 6283, 6366, -5649, 10427, 10017, -24333, -16940, 18759, 7120, -10277, 9581, 8619, -16658, -10726, 4385, 3026, 13322, 12250, -16108, -12723, 10048, -6547, -11838, 22385, 18663]
509A8663l7086L816J7245o391O870J2591j2878o064M276j5487J163L2350l86k6180
523g498L455O527j6474K721K1517P85p246j419j3561o953K1143R702j3038M759
537D420Q636k1738j3055K2005J3277q020R85k773j5501L814J0523q156J0108J9647
551B4172k4831k5133K5200J0446k1412J4157J9811k5496j0891J5081j0900L175
563f621K9607j6882k4868K7134n72l5012K5050L1760l2060r090K5023k0593j1612
576a8736L5162p576k3444K8826q30m1293J9971L1831k8899o011K8605j7424j8883
589a8701K4386j859j6110K3610K271l2919J2123K5202k3429j0018K9510k057k5409
602a3400Q383J3272j0623O2R541r032k389J3048r011j3440J9891R037k7571L04
$$ y = [18663, -18423, -14607, 2638, -3753, 3117, 15708, 2830, -3234, 1042, -14445, -13282, 19068, 18682, -7498, -4043, 2484, -13990, -11269, 10248, 11033, 3787, 2368, -11193, -18146, 2997, 12699, -339, 4420, 13056, -8682, -21737, 268, 13545, 5525, 6510, 3737, -11764, -7950, 2573, -5583, 4525, 24172, -659, -25792, -592, 9854, -11558, 2599, 22410, -3086, -13977, 1104, -9796, -6621, 22986, 6104, -18764, 8370, 7798, -27214, -2164, 29596, -2464, -11554, 13469, -7124, -18736, 16426, 8850, -14594, 14232, 13402, -27891, -7920, 23911, -4988, -10999, 17606, 182, -18701, 5685, 3826, -12284, 11326, 13597, -19322, -7199, 18003, -5426, -15444, 14066, 12009, -13400, -5017, 8255, -2368, -2306, 7235, -1797, -4186, 8862, -149, -13589, 6302, 15339, -12232, -11928]
616a1928K9255j3471k2651K3592P584k5367R956J5567k1807M248K1830k5198r385
629a7775L6748j0901l1339L1606J1778l9887J1503K8631k8123j993L1049k4543
641c246j7701L6674p436l1596L1861J5010m0871N375K8679k2893n096K7462j4221
654B001j5293K1922p188k0899K5767J2578k9508J827K1649j5532j1156K0229L427
667I824j1856K776R0p762O303P452p361j156R133n807j3986Q405J4413q790q102
682f424J0810r31j3194O663R278q485L445Q077j6405l899K0881o806j4868J9448
696G590M750k3689M914J4986j2453J791J3760j4780n454J9048j1397j4105K4579
709I540M178k5581O946J4864j4958j816J3547o688k914Q612j0133n144J7545k920
$$ y = [-11928, 17327, 3856, -18795, 4797, 12381, -12986, -3030, 12537, -9270, -5022, 16808, -8390, -17775, 18973, 8072, -23267, 8339, 20117, -19770, -8267, 20364, -7759, -9752, 21297, -3246, -20947, 15727, 8291, -23305, 8556, 23566, -17305, -11930, 16749, -6144, -11240, 16222, 2001, -13292, 8630, 1442, -19457, 6310, 18888, -10620, -8793, 12856, -2676, -13832, 6397, 9824, -2032, 744, 834, -6928, -625, 6827, -534, -1690, 7443, 1636, -12350, -3945, 10468, 1678, -6424, 4386, 3455, -9739, -3076, 6202, -2283, 1162, 9239, -7166, -11065, 9816, 3010, -11858, 7590, 12340, -11349, -6435, 8551, -3902, -2111, 11649, -3131, -8585, 10463, -934, -15039, 9540, 13718, -11863, -4917, 9947, -5011, -6827, 6720, 32, -2882, 5730, -4403, -9547, 7998, 5078]
723E078j4602J1349P099j4207n44J0096k197j914J791l585P58M341m857j841P129
738C894n70n814J6K189J478K6l637J642M264m182l442M637J080j916R11k072l77
755a873N440l311o311P903M780j0445j16Q546l297l494L160j094N20L326n944
770b210j889R504k128r839N957O154p622j737N596j686m77J167l856K192N316
785D442n795l211P545J3o326K750L134k866Q17M60l154L505K210n914K80N330
801C220k229l434K374Q09l73K36k208o2M272j624m959L582L807m221k154K810
817a54J715n96k370p13M181N36n119M16N354r31m622J109L346m11k475j142K312
834D36K258l391k409M067J392l772p90K688P78j536j207L60K216L7k954O14L180
$$ y = [5078, -9524, 1825, 8924, -5283, -5827, 4269, 2072, 158, 1949, -1636, -878, 3463, -1394, -3235, 3894, 3324, -2490, -2474, -285, 1193, 1219, -2418, -776, 3488, -694, -4136, 501, 1581, -335, 576, -1496, -1873, 3567, 256, -6055, 1848, 6628, -3817, -3933, 4613, 1316, -2178, 982, -112, 408, 3734, -2210, -4099, 5405, 3277, -6562, -605, 5549, -2073, -3810, 1786, 100, -377, 790, -3066, -874, 4442, -1353, -4564, 2981, 2994, -3332, -582, 2552, -314, 503, 963, -2191, 1314, 3524, -2390, -2110, 3220, 991, -2443, -69, 740, 367, 603, -1605, -1667, 2605, 981, -3978, -396, 3411, -810, -2964, -154, 1561, 965, -1405, -2118, 2063, 2599, -2520, -2104, 3250, 2319, -2303, -1194, 2152, 1741, -734, -1876, 436, 2694, -697, -3106, 961, 2353, -1419, -2209, 479, 1257, -279, -1486, -1126, 1090, 1127, -1827, -1213, 1967]
851A967j040k592J042J657j44m72j382N26K400r01k964J356L239j855l164J834
867d93K346j296j643j58J707J008k437j554L079J651l397j842M159J356m116m89
883b119L567Nj903j97Q69J031r6k161m40L708k40m682J830L679k720k238K851
900G44q9j576J459j100j303K881K36m018J569M087l105k670L496N25k086J005
916E5J36p35J923o12l121K100L712l209l211M332J468m479o41M061J19k960j7
933a079J188m33K88j11j344K139J878m822j320O169l46n748L669L896n647j537
949c160N323j858j551M713k686m628N702O35o925M998N319p476k215O584l393
964f18l061O937j173n909N340N09q128M735P688p365k823P370k940n789N741K781
$$ y = [1967, 927, -1665, -623, 1034, 890, 418, -964, -438, 1962, 1061, -1903, -547, 2692, 837, -2327, -493, 1853, 557, -1086, -1244, 463, 1471, -966, -2520, 559, 2210, -1187, -3029, 1130, 2486, -1630, -2119, 1448, 1453, -450, -647, 222, 1253, 1157, -1004, -1444, 2264, 2024, -2658, -828, 2851, 131, -2107, 744, 655, -921, 538, -562, -1865, 1016, 1252, -2766, -1197, 2890, -215, -2885, 611, 1136, -950, 55, 191, -544, 1379, 767, -2354, -254, 3458, 249, -2962, 1370, 2838, -1641, -2282, 1779, 1898, -1062, -1079, 109, -324, -36, -147, -1491, 648, 2526, -2296, -3616, 2553, 2207, -3541, 128, 4024, -1623, -3160, 2163, 305, -1246, 3467, 781, -3847, 1855, 2490, -4435, 563, 5882, -1594, -3809, 2775, -618, -3679, 3258, 2085, -3824, 1516, 2025, -6103, -1368, 6320, -1045, -3868, 3502, 562, -5227, 514, 3295]
980C295l984K343N35n669J914N189m145j261O164j810p311K154N669k670j710
995a297L872r57m610J487J771j595K405K611n110k179N057j465m162O639L038
1010E505p861j51M871m416m29P466l038n291N655p18p714N975O779p885j410O373
1026C711n180l566P412o27m252N652j368p620M730N622o836J00P438m542n811
1041e137N525J488l401K844R42l720J294J383l371J309M653k584l878L031J156
1056A534l058J57K875j70j925R1K82r56Q39J230j305k38K109j475k542K570J861
1073A879k651M2K725j737j513J877p04r91L225q17l361K685J425m509O98M329
1089B602j704k163J984j079j183J655k07m90K757j224l993K131K216k204N95K673
$$ y = [3295, -689, 1654, 2189, -3480, -1566, 3623, -522, -1783, 4381, 2571, -4740, -2586, 3083, 413, -1297, 2575, 1618, -2992, -1505, 266, -1329, 1076, 3687, -1423, -3602, 1455, -10, -4172, 2467, 5505, -2356, -2507, 2364, -2052, -2481, 4985, 1947, -3344, 2311, 1593, -6121, -146, 6633, -1252, -2662, 3711, -1469, -5035, 2377, 1750, -2502, 3150, 1782, -5838, -1108, 4514, -2322, -2222, 5216, 674, -5137, 388, 1876, -1525, 1319, 2261, -1459, -165, 1218, -2153, -844, 3809, 1225, -2653, 378, 1534, -1524, -1367, 1508, 1338, -587, -496, -214, -1170, -331, 899, -406, -644, 1465, -10, -2552, 18, 1879, -772, -730, 1995, 258, -1255, 622, -82, -1073, 2152, 1335, -2026, 659, 2084, -2425, -1727, 2602, 898, -1265, 719, -360, -1543, 112, -95, -585, 2172, 948, -3045, -914, 1302, -902, -307, 2366]
1105B366j549j911M03o23J303K398j478j290J461j667k185L203J656j732L37l89
1121C03k431R40K060j067M02K058k708k506K107J129o07J871k45k356K83L65j343
1138a745K144K859k222k747J620L62j786J168K694o66k022p89J9M45J282K75o15
1155B76N2Q8k744J91L747K54k846Q16J383k784m56L091J29j287J382j211k345
1172b264K586J325k828J781K286l637j370L257o15j664K613j72l241J817J235
1187A109l357J715L315l192j936L491o24k613K030J623j973L89P44j922P29K334
1203A862k036j190L245o73l256J456K557j810j308K036j49j641P62L48q72J004
1219C35L16j705K61K049j485j378K267O47k292L39J680j311l92J528p68q26J700
$$ y = [2366, 817, -1094, -691, -1314, -11, 2387, 909, -381, 1080, -587, -2772, 431, 2087, 355, 692, 303, -2128, -1188, 872, -195, 207, 2265, -443, -2949, -842, 287, -320, 1551, 1306, -1050, -767, -402, -1745, 399, 3258, 1036, -1711, -91, 271, -1515, -347, 2347, 1681, -341, -1130, -1111, -666, 616, 891, 276, 328, 416, -2328, -2137, 1610, 1864, -982, -166, 1217, -1567, -2023, 1068, 1197, -90, 1292, 81, -2264, 322, 1647, -1181, 600, 2886, -751, -2121, 1136, 521, -1143, 1470, 1298, -1943, -126, 1109, -2248, -533, 2782, -410, -2346, 1145, 521, -2092, -62, 1561, -412, -23, 721, -1201, -472, 1862, -174, -1364, 1881, 1208, -2048, -592, 1965, 155, -1153, 883, 734, -907, -145, 203, -669, 335, 651, -1054, -793, 1256, -229, -1607, 660, 1307, -985, -646, 1034, -277, -669, 859, 91, -735, 965]
1236I65l99k026J567J497k067k34J779p84j315J471k12q51J258o04j440J389J021
1253A015k108N6K232p02j827R16J123p54l02O72n1k1j3o83K77J245p54j292J410
1272D39P81j694j52J224j48o76j8L25j37l2j0m86M63O16r13k77R51J13p22P5N50
1293B72j51o2j03j39M09M97r73j33J216j64j052J28R46k20o30k21O18J30p32l09
1313f73O69P82q79q96R69R28j282m64R75J61m68m98O60N75m48l43J30O94k50o96
1333c54J55O86p9p42L33K71n5k48k65L61J4l5m97J93M97j50m08Q6N02Pm18m09
1355e55O63J20l47k76N53M60m78q85J002M60o80o48Q09O28r07n53O58L66l05o94
1375f09P8R67k14j025M10P43k19o20o0Q88k9p24J62N26K65m35l91K84P55n46m45
$$ y = [965, 566, -1460, 107, 1604, -463, -697, 1082, 298, -1017, 454, 242, -609, 649, 45, -1395, -6, 1015, -1093, -1037, 1195, 493, -1334, -418, 705, -49, -351, 321, 270, 249, 236, -447, -170, 1075, 321, -971, 439, 1220, -474, -626, 598, 450, -226, -244, 81, -56, -88, -98, -584, -121, 495, -418, -695, 256, 369, -353, -278, 272, 121, 59, -44, -183, 226, 723, -250, -383, 833, 669, -383, -255, 691, 471, -159, -380, 238, 368, -364, -673, -4, 778, -101, -997, -28, 900, -382, -846, 129, 290, -178, -676, -16, 559, 111, -232, -102, 592, 342, -354, -199, 487, 408, -334, -1, 270, 215, -33, -298, 63, 77, 42, -455, -262, 235, 85, -323, -237, 265, 272, -146, -555, 108, 228, -119, -395, 158, 618, 140, -745, 257, 717, 37, -611, 198, 826, -81, -634, 24, 390, 85, -609, -531, 436, 222, -803, -393, 350, 131, -489, -549, 339, 310, -414, -252, 274, 539, 104, -287, -3, 752, 206, -239]
1396b39K36N84l73o08L02M31j1n14j43M55K78n75n50Q06N85p34p64P09L11k56
1416g0o06O05P03l54r02n8J224l9r39L27Q81m11p42J15P70n5m96j87K24K41n07
1437b76m48P76O98q99p67P78J86m82k0P29L2m32p1l51M59Q74n71p60P55M38j203
1458e55RJ329j74n96j82Q5j61O29j53p97R59N06j747l80J943j66j579P58J110
1477H38j361j90Q66k95N77M52j282l51J729p52j675J868J269k099m02J432l98
1494B26r75J254Kp99P12r4j363Q87J572j858o96J816j54j764Q02J106r01L1Q46
1513F50j172j25J731j226j317K326Q19k766K33K291j319j303J908K21j585R55
1529C21j34j510J616J026k327J64K804j938k563K856J138k418O47J359j971jJ857
$$ y = [-239, -3, 581, 208, -400, -98, 333, 322, -192, -335, 120, 398, -177, -727, 79, 664, -70, -834, -125, 186, -70, -676, -71, 632, 278, -624, -682, 542, 503, -436, -109, 772, 361, -381, -266, 504, 449, -47, -234, -10, 231, -276, -724, 52, 750, -149, -916, -138, 48, -434, -454, 275, 307, -125, -196, -547, -88, 786, 215, -545, 210, 648, -555, -546, 783, 609, 13, -169, -84, -245, 384, 231, -566, 393, 899, -848, -1228, 715, 549, -1030, -272, 838, -523, -713, 153, -142, 435, 887, -395, -746, 983, 231, -1444, 424, 1693, -406, -808, 624, 226, -749, 505, 507, -292, 420, 326, -1037, -150, 1422, -436, -1132, 684, 530, -1234, -432, 674, -227, -196, 650, -522, -647, 1084, -142, -1459, 867, 1686, -1080, -847, 1444, 125, -1178, 730, 951, -634, 321, 187, -1323, 293, 1319, -1008, -844, 1960, 22, -2541, 315, 1453, -965, -318, 1041, -930, -931, 926]
1546I26j387l32K729j231k785K264J418k724O30K833k042j737J631k26j146K312
1562A133J18k634J158J351k480l16L253k46k727J165R76j980N55J721j017j33
1578a03J334j791j719L122Q13k823J171K188k807j479L073P0j710J579j97k394
1594a673J340J234k258J409K347k700k058K749M08k333J822J501k365k04J156
1609C75j235K11K336r76k083J783P99k742R44K280j221j022J078m10j085J542
1625E74r3r93R80O74k750K14K504n81j781J530P58j829j90J126Q1j53O02q96k56
1644d79J128k83j703J670J195j923o55J669j93j218Q28O00q85L14J73j290P72
1661b80J213j079p95J655l79j544P48J027o37J08M05q36K22P36j175r0J714j03
$$ y = [926, -461, -793, 1936, 705, -2080, 184, 1602, -1122, -492, 2341, 299, -1438, 193, -33, -1179, 1133, 1251, -1383, -225, 1126, -1354, -1670, 1583, 1337, -1390, -225, 751, -1229, -674, 1047, 30, -103, 1231, -560, -2279, 843, 1656, -1167, 4, 2192, -615, -2094, 979, 1049, -661, 918, 721, -1673, -333, 901, -1357, 52, 2399, -301, -2359, 390, 798, -1535, 287, 1788, -577, -781, 375, -860, -649, 1687, 711, -1372, 411, 1210, -1532, -588, 1692, 471, -551, 527, 117, -968, 574, 481, -512, 468, 1142, -1608, -1394, 1110, 529, -1252, 278, 1036, -793, -983, 143, 224, 71, 673, -223, -479, 649, 366, -1337, 333, 1528, -395, -1050, 619, 426, -792, 36, 636, -249, 65, 238, -1052, -280, 933, -146, -941, 714, 335, -1209, -461, 566, -71, 37, 442, -394, -172, 564, -611, -701, 1013, 910]
1679I10j563M23P84l08o67L34N15j1n03m45M68N11m17n19N39N33p89p49R01P58
1699G05n45p41M50M56m94j87L98L64q7m59j73L74K99l92l59R31j24o22k99N48
1719D3L46j75k07m26O25o1o50K2P75Q1n86l75O82K38m14l22M65O73q44o72Q99
1740A17O48o47m85M85J81q1p03M29M53J98j002p9J050l57r20L52R96n10m88J89
1760a74kL66l8n91K03P80n86p45Q50M38o07j85L88R3Nk94l1J93L71l05o28M81
1782a8O22o91m97N72M09n19k49J78N95k86o75J34Q20j01p63j49J143j2j039J43
1802c83R04j10p61J22O83J16q04mK88M61j74p90M44N99o36n52N22K16l88L6J11
1823a00K3K59l05l91N31L96m72m50N84L82m45m30L98M39l64k82K63J54K99r22
$$ y = [910, -653, -230, 554, 246, -421, -87, 428, 417, -86, -531, -63, 448, 31, -488, 51, 584, -205, -954, -53, 705, 160, -581, -131, 325, -169, -356, 42, 406, 319, -140, -313, 61, 360, -32, -391, 540, 416, -206, -505, 43, 389, 214, 7, -419, 206, 145, -505, -483, 292, 373, -213, -588, 94, 332, -82, -404, 61, 734, -110, -782, 117, 765, 118, -367, 118, 299, 218, -485, -56, 397, 595, -407, -486, 564, 207, -713, -361, 635, 125, -363, -174, -176, 190, 152, -439, -236, 544, -42, -787, 63, 501, -106, -291, 97, 190, 195, -99, -130, 63, 434, 129, -499, -18, 604, -87, -584, -12, 397, -122, -371, -193, 402, 116, -559, -425, 395, 294, -469, -618, 525, 513, -526, -383, 521, 411, -350, -228, 455, 571, -233, -237, 51, 512, 338, -452, -8, 591, -45, -597, -75, 141, -247, -211, -100, -77, 182, -123, -514, 17, 413, -59, -509, 75, 457, 12, -418, -20, 419, 55, -227, 36, 190, 489, -433]
1843d33R3P00Q6p23k10P54K33q97J1N37K60m95m93N54M70m00n68L57N22l2o36
1864c10J43P26l62n58L69K60p6k53j21L44K86m57k76K75M32n85m65N96M24m96
1884a04j17m9L17J28m06j86L58O60o54n61Q28L41p16l26R38P8o56k58N09K40k18
1905A46k68j67O95j46q48L14Q61n21o63M32M17k05l22K06J10J04j47m37J11Q35
1925E07l93o20O25N72p94l76O66J82m60J96j68j03N34l25m90M10O46o99p44J076
1945B42K60p35j98N89J95l49k64m1N62P8m69l06R22Jj157M43J081m96q26M16M83
1966D31m08j11Q2j7M16r4o58J68O72j75r69P68M32r98k77Q54p7j38J92l05J81
1987c1K86j48q07P43O94p39k95M60P5m76Q5L11J85P8n10m52N11M13n97k99R29
$$ y = [-433, -340, 360, 446, -277, -487, 267, 500, -397, -386, 151, 411, -84, -577, -23, 447, 47, -521, -164, 358, 326, -310, -167, 559, 197, -361, 8, 268, 192, -61, -182, 162, 448, -9, -285, -10, 422, -163, -628, -32, 392, -104, -221, -270, 47, 175, -231, -417, -59, 601, -53, -614, 214, 555, -161, -487, 451, 529, -127, -385, 124, 364, 146, -122, -289, 406, 260, -588, -274, 587, 66, -597, -165, 252, 47, -275, -69, 41, 145, -2, -439, -328, 507, 114, -506, 119, 691, -103, -479, 187, 369, -91, 105, -63, -166, 368, 43, -447, -37, 609, -90, -834, 242, 502, -233, -431, 158, 353, 4, -260, -301, 261, 339, -130, -436, 486, 487, -670, -227, 854, 358, -468, -52, 431, 23, -88, -6, -23, 393, 299, -359, -191, 481, 306, -663, 105, 537, -461, -738, 116, 39, -99, 93, -212, -31, 255, 107, -700, 43, 737, -2, -297, 163, 238, -238, -153, 158, 343, 421, -89, -541, -30, 383, -214, -513, 416]
2008D16J14j012l01J158k8m57NL56k15l09k4K08O68k64n52j30M99J24o86M92R06
2029I68n41r45J83M15j94M38k09N4k47k57j39L30N30K8p32J6M18m61k56Q87L51
2050F37l14m72j80M5M01K13l70L10L21p92q07J151Q24q22l78N89k92o29L71L50
2070A56P5J27m80o81N82N99o87O0J133n42j274M51Q62m60J06M78o07j84M95m61
2090b52m35J188K19j047l9R31o46m61J029J22q71L28l7p75P05O79j005kJ381j109
2110i7j075J275Q67j359L7J055o27n34Q35l59l10R73n59r79Q89Q20j574J16J659
2129A053n79j328J063K95j151L84Q11p81nR16j014p27J477J87j392P98R02j317
2147d08k70J204l55o46J053k38j072Q54N71j299K18J633r43j170R38L40q07N10
$$ y = [416, 530, -482, -783, 375, 347, -110, -105, 251, 36, -273, -297, -89, 579, 315, -237, -367, 132, 256, -430, 62, 968, 427, -518, -335, 80, -114, 324, 115, 169, -78, -335, -474, -144, 386, 414, -318, -302, 116, -345, -601, 286, 637, 323, -149, -329, -284, 117, 330, -40, 270, 591, -201, -1008, 143, 967, 145, -233, 356, 64, -565, -194, 156, 231, 358, -122, -803, -221, 378, -309, -249, 884, 342, -932, -481, 381, -79, 27, 505, -102, -286, 209, -252, -687, 501, 720, -327, -366, 565, -81, -542, 487, 609, -262, 66, 29, -746, -41, 638, -367, -369, 1012, -97, -1172, 103, 970, -389, -352, 703, 76, -458, 377, 18, -292, 681, 122, -857, 32, 852, -722, -606, 1053, 474, -854, 209, 504, -647, -263, 548, -233, -238, 678, -336, -1063, 414, 601, -791, 7, 909, -408, -678, 526, 171, -475, 578, 340, -732, 122, 693, -606, -388, 1245, 302, -868, 70, 410, -397, 113]
2165A13O32r09P7M79j064O8J617p86j021J074L28j498J67J784q00q56J015k05
2183B15r73R70K3o30P40N49j332l81J297j60r40R17L71j135J26M44m77L68O58
2202F50o95p69J214k20p62M86P73o29o87N95J95m62M97j8l64N23j14q81M80J028
2222H40p65o49Q38J14j008L67P30m01l19K54k81J02N58n67r3M80J77p69J07Q10
2242E25n36k82L69J52k68l1Q1j73K81K23m30j47M70p5m61K56K91k32j87J62J05
2263I3q0L5k86J23L92q8n95L05M90k71l82J03M24k39q0R8J53j53k34J43J35K0
2285A06l33KL76L73o24j06L06J78n67L15M4n4j68j05j2M03n3j81r0L53J6k68r8
2308a87J69k2P2R4k59L44l7l91K78K17K1n12L40Q1k4l82J09L86j31k37k62M93
$$ y = [113, 745, -164, -87, 392, -672, -604, 1013, 227, -794, 280, 608, -890, -723, 1061, 261, -595, 420, 215, -758, 212, 235, -395, 345, 894, -438, -819, 478, 318, -622, 295, 666, -469, -343, 101, -376, -8, 650, -45, -814, 400, 180, -582, -96, 677, 48, -639, -44, 151, -311, 186, 168, -196, 327, 213, -668, -188, 840, 75, -574, 264, 378, -630, -263, 467, 66, -253, 1, -280, -178, 380, -187, -280, 200, 377, -392, -285, 525, -11, -293, 76, 228, -40, -71, 10, -163, 118, 341, -89, -236, 234, 159, -302, -46, 245, 13, -174, -12, 93, 13, 48, -238, -115, 277, 189, -406, -101, 389, 118, -264, -161, 263, 24, -56, 42, 195, 42, -192, -49, 86, 106, -227, -225, 151, 524, -100, -206, 100, 278, -289, 26, 70, 16, -152, -257, -269, 134, 81, -100, -190, 163, 179, -89, -187, -18, -40, 32, 126, -133, 211, 174, -217, 61, 278, 299, -213, 127, 208, 184, -198, -89, 297, 166, -71, -333, 160]
2330A60Om54Q2J01K60k20j86N09N5l60n2K37N1J16o42N49R5k68k93K07J58J62
2352B73l96J39L6j24N2j12L14%l42l0J32K68j68q4p8L12L8m22J70K12J2k39k01
2375b38L16J38l82J79J74J32m10j12K79J44j54k81N2L12k8m32J79M15l56jj2J37
2397E1J5j2n9J83k87K9l08N22K11n03J8L66k50j05Q0O5j47K40jk73K47K14k31
2420F5m18M14L1m50P1K66J43k63N5QK33L7k47k83N43O5n51J93M22l28m55N07L98
2443D56n16j4J16j98P3o3k13K52M65k28n31M43R1l35N8M51j05n85N18J0k94K97
2465A48J62n01J12L90n16k52O98Q3n78M05l7l71J49L05m02J83K46k76m23O03K24
2486C52o47K26N10o16l44O96j33k61M43q6n40L10L65l56P6P71o41o90O62J98n19
$$ y = [160, 166, -288, -206, -105, 155, -65, -251, 258, 313, -47, -99, 138, 189, 305, -337, 212, 307, 39, -254, -47, 111, 273, -123, 16, 52, -72, -20, -132, 182, 182, -160, -190, -58, 210, 42, -42, -120, 192, 230, -192, -22, 190, 202, -37, -238, 78, 216, -166, 13, 187, 319, -91, -203, 76, 220, 66, -215, -163, 149, 121, -311, -132, 283, -73, -74, -86, 51, 66, 54, -5, 178, -109, -80, -388, 134, 345, -158, -140, 226, -24, -129, -49, 16, -131, 109, 108, -165, 82, 296, 65, -353, 61, 92, -358, -287, -21, 122, -141, -86, -78, 155, 192, -55, -338, 205, 270, -281, -88, 334, 6, -449, 58, 456, -60, -74, 42, -156, -83, -146, -359, -107, 358, 130, -401, 42, 133, -202, -144, 307, 202, -383, 135, 145, -149, 148, 310, -191, -79, 311, -205, -457, 241, 324, -254, 151, 114, -257, -108, 197, -205, -22, 224, -52, -475, 128, 352, -295, -69, 441, -175, -519, 177, 44, -217, 226, 140, -400, -90, 275, -81, -5, 766, 125, -565, 97, 295, -224]
2507b24K90P18p98j78L82m89k27R65r2p66K06L87p05K96O86j45m71K94j02n09
2527d82L31N20o02K39N79q00m58J076K13r99N20K14o01l73R47j99j39N11n39m99
2547e41P48rq33M48P92n42p16Q67j56m86L70N93o63j78N56m00k58Q61j71n47L22
2568E7M31q97Q5R40m46j97L73k45m80L50M01p35K61N90o31l65Q11l20l09L43L10
2589C27m35j16M37l93p6O86k53m19M44J30p89K02P68m64l28M99j50n15K27N19
2609C01l52R4L83p91j57O88n2m05O67O2p39P2L13j33j15O84k39o52L51N5l38L79
2631G6M73l64n36L86j20k88L29L34j27k60K11m44K7N83k03j99K49o6n80J30O55
2652B66M4m00K66j25m46J13M92R0oj1n57o2K88K93l75L16K08o18k00M45N3q6L26
$$ y = [-224, 66, 784, -14, -192, 190, -299, -526, 439, 347, -419, -213, 174, -531, -235, 451, 306, -165, 129, 27, -482, -151, 369, -233, 6, 585, -215, -673, 403, 616, -383, 137, 351, -250, -623, 324, 125, -14, 497, -42, -541, 207, 198, -635, -187, 605, 63, -653, 214, 58, -428, -58, 535, -128, -306, 250, -150, -408, 453, 282, -265, 57, 488, -409, -324, 616, 170, -27, 346, 101, -379, -29, 372, -363, -102, 488, -143, -508, 303, -17, -326, 17, 327, -108, -224, 213, -180, -256, 430, 177, -242, 202, 332, -457, -255, 513, 49, -279, 220, 70, -445, -218, 301, -51, 43, 426, -365, -522, 166, 114, -291, 376, 438, -301, -229, 84, -49, -164, 520, 281, -371, -20, 35, -303, 76, 549, 185, -351, 35, -85, -373, -44, 290, 163, -97, 114, -330, -303, 280, 77, -122, 127, 61, -519, -389, 266, 310, -90, 176, 51, -395, -282, 210, 300, 294, 283, -274, -336, -48, 245, -130, 186, 394, -224, -424, 21, 74, -12, 314]
2675C14j32m21q0L71k28Q7M11r6o04K07J86r2J67K76k17j78o5j67P5K90P4j83
2697en4M51m53m05P01N6m44K11J6k50R6J92n6l6J93k71k44L35O9m89L27M20n02
2720a42j03L60P2l28K20J73k97j7L44l06j02K28P7l33J29J82l48P3K14j59m4L8
2742f9O9k03N01j88m01L20K06k24k63L47L5j16N8Q5j92k6J45L2r1J95k42k73M30
2765A35jm24K57K70l31j15K93J4m00K34J9k44L12J2j54M7L22k10l9j8J97k46O1
2788im0m0L6J09j08k0K57j26j81P1J28K0j68N9J3o1m0j5J54m9K2j02J49j5p0j45
2814a71L09k0j48jJ91K6m57L06l3Nl2n7K32j83J11j96n0K60p2p3J22r3j50K05
2838C1j50R5J05j20k1p1J25J85j41j79J05K52k78Q7kk0r0N5J40j46k2p9J46o0
$$ y = [314, 182, -239, -319, 52, -176, -89, 322, 226, -378, -171, 15, -77, 90, 366, 149, -29, -94, -261, -186, 104, 178, -5, -59, 392, -61, -466, 235, 291, -153, 58, 74, -176, -80, 112, 56, 20, 213, -58, -302, 33, 102, -387, -60, 360, -142, -245, 115, 187, -141, 79, 252, -45, -62, 282, -24, -126, 102, 179, -154, -25, 157, -191, -118, 96, -63, -107, -69, 0, -203, 298, 110, -291, 29, 235, 11, -252, 95, 130, 14, 72, 157, -35, -61, 84, 116, 25, 220, -22, -295, 135, 134, -290, -33, 237, -94, -209, 84, 98, -302, -68, -49, -293, 19, 31, -123, -76, 246, 36, -3, -21, 176, -70, -9, -49, -89, -53, 56, -52, -72, 185, 59, -122, -51, 77, 97, -71, -12, 1, -60, -100, -115, 39, -10, 12, -90, 59, 44, -26, -171, 138, 118, -30, -31, 160, 186, -271, 35, 2, 7, -25, -82, 150, -33, 78, -118, -168, 92, 20, -53, 69, -24, -174, 31, -119, -24, 81, -39, -60, -131, -6, 179, 38, -141, -36, 216, -62, 25, 23, 3, -87, -32, 108, -38, -60, -139, 7, -53]
2862e3Lj78K00J74k14j56K50J1j31j31J93NJ05j56J22j7l4L1q8K08J6l07J96Q2
2886A31k37j2K74r7k50K51p8rM5m9j45J13l2N0jn6J28l6R8L8l67L53Kj33K7M3
2912E1N6k06L8K63k08j51J58J55k00M6j59K31J03k1k09K14j59k16J56J74j7l03
2934b04Q1J55j45J6J41j83o6J81o7O0M9qL9J23p8j36j88M18l32J69K0kn8k6J97
2959A56l38J83J39j85k39K77J06j68J79j09j22k0Q8QoL39j73j42mlq7J81J30O9
2983B59m00J19J22k85K37K42k33r1P0j58QJ54J31j23o4N2l27Q9L12q4m9J62q2
3006F1j85J70K13j51k91L33Lm27J59K60k05J43M7j67j45J24P3j90L39P1l86k3
3028a74M54m35j06L53r7n9mJ68k66L0J57n8P1J60j39l87M41Q7l10J53J96l37j99
$$ y = [-53, -50, -228, -28, 146, -68, -224, 26, 37, -94, -225, -32, -27, 78, -78, 44, 27, -7, 24, -64, 144, 160, -147, 49, 131, -106, -118, 156, 59, -191, 60, -18, -27, 18, -31, -176, -63, -95, -45, -46, -102, 26, -10, 88, 126, -241, 112, 114, -19, 8, 51, 107, -99, -61, 202, -6, -157, 1, 156, -44, 2, -157, 74, 177, 156, -53, 161, 2, -214, -58, 116, 99, -204, -123, 32, -113, -97, 44, -139, -205, -24, -91, -31, 18, 10, 49, 172, 94, -42, -230, 188, -144, 25, 45, 43, -15, -41, 156, -182, 1, 140, -45, -284, -7, 99, -69, 110, 1, -121, -141, -53, -45, -51, 288, 115, -27, -31, -34, -121, 60, 190, 259, -141, -22, 100, -185, 52, 294, 61, -30, 40, -118, -110, 44, 175, 52, -12, 40, -287, -198, 114, 30, -19, 143, 61, -124, 46, 259, 108, -183, 150, 153, -274, -115, 145, -60, 83, 130, -37, -182, -58, 15, -175, 164, 235, -151, -174, 280, -155, -261, 92, -5, -64, -68, 100, -166, -136, 21, -37, 34, 194, 55, -332, 109, 196, -114, 39, 235, -102, -301]
3051c01M09m1k96M00N1o30K77K80k33j65M98j38l50K43J32l78P3L75l29PL31k80
3073f5k67M86J94m42J87K21n01j53O27r9l18M64j11o32K17N44l84o7M96l57m54
3094d14M60R9k73J12O54p24l32M88jj39N02j32o72J35M62l87J5N43j90m66J97
3115f3L7k28M52J28m43l8N25n51l30N41L01n16K00L89p53p3N64r3k50L77%n40
3137c64J09N30m15L6O37o76k74M49J44m19L31L25n51k24M84j85l47Q77m00j86
3157a19P0J50l08j8N04l61j24L08j61l09M28J54k94p7M05k90l27M96L9l67K38
3178C7K34n41J55K36k53n3L19k5m48K48K99m37M5N63m82j61L58N3l45K25L05l31
3200AN2Q1k65K1L23k7l31J41N7k06J21J64k15J3K29j36l14K12K35k17K01N3j31
$$ y = [-301, 108, 67, -229, 171, 222, -408, -131, 149, -84, -249, 249, 111, -239, 4, 136, -242, -169, 206, -123, -116, 215, -65, -332, 154, 348, -94, 93, 314, -187, -340, 287, 188, -130, 334, 223, -409, -192, 352, -32, -99, 397, 40, -414, 46, 145, -128, -16, 638, -86, -418, 70, 69, -70, 432, 300, -372, -237, 225, -162, -147, 396, 206, -260, -63, -26, -254, 198, 326, -117, -155, 370, -181, -511, 30, 331, -185, 15, 404, -349, -422, 142, 49, -201, 176, 176, -364, -255, 275, -140, -104, 533, -143, -417, 32, 176, -243, 88, 413, -138, -362, 122, -63, -410, 467, 67, -119, -49, 101, -207, -225, 279, -82, -206, 102, -59, -368, 60, 214, -80, -157, 248, -42, -369, 127, 166, -201, 37, 271, -270, -115, 121, -132, -185, 134, 109, -339, -91, 208, -229, -184, 379, -103, -264, 94, 147, -198, 27, 332, 1, 53, 134, -131, -110, 213, 186, -145, -4, 53, -153, -32, 132, -83, -70, 159, 23, -291, -79, 156, -61, 140, 193, 62]
3223F2k35K6R3k4O3J65o4j89L2N0O5P7j36j35P2K97l36k0K76j69j2o4J00j68P2
3248a02J28m4L6M4j10k4Q5j16R9j5R0k66J81J16k14J37R4K6k15J03l5J3q9K02
3272A24q8k38J64j7K1q3J08p8J58k66K67MK1j94r0K11J47k53N5J60K5j85J95j34
3296C4m8nJ49k15K24j57o0J16Q9j22K3J32k87J21j69J53Qq1J18Q2k69J6J85M3
3320H0k11J30M6q5ql8L3J12r7J48p6N9O7k61O3J37j14P1J3r7O5N2J01k68j42K94
3346G4n5j03K8j7N1M8jo1K5J18l01K24j08K06k4l5k63J68k6K01j16p4r1K70j93
3371e5m2J68j6j33l6Q4L1J12m6j73K64N3l39J15R4j25P8m7J36q4Oj15K09j12j20
3396i3j1J1N2Q3M0p6M1j06J3j58J31q1J83j4m3J23k03N9p2K43r3M5j48K70k41
$$ y = [62, -173, -147, -54, -78, -15, 150, 86, -103, -71, -21, 44, 121, -15, -150, -78, 219, -117, -137, 139, -30, -42, -106, -6, -174, -102, 26, -18, 18, 62, -48, -72, 13, -103, -4, -19, 71, -195, -14, 102, -112, 25, 119, 145, -70, 33, -2, 11, -78, 124, 36, -202, -38, -55, -34, -117, -9, -87, 71, -195, 72, 76, 97, -97, -187, 24, 171, -82, -27, 133, 158, -27, 168, 34, -14, -19, 130, -85, 139, -18, -78, 38, 127, 5, 28, 160, -127, -6, -175, -22, -14, -95, 23, 105, -164, -148, 37, 80, -131, -1, 45, -40, -48, -86, -53, 59, -38, 110, 34, 93, 160, -101, -38, 99, -15, 56, 69, -28, 37, 89, 190, -78, -220, 74, 19, -84, -56, -73, -22, 26, 25, -36, -11, 107, -194, 30, -78, 128, 104, 69, -194, -26, -52, 149, 33, -41, -132, 138, -55, -97, 71, 55, -78, -114, -30, 1, 113, 67, -106, 158, 211, -128, -13, 81, -44, 34, -13, 123, 39, 45, -70, 139, 27, -93, -104, -93, -41, 42, 82, 6, 47, -59, -46, -204, -73, -154, 29, 15, -28, 95, -108, -49, -121, 122, 29, 74, -74, 196, -45]
3421d5K44k99L1qJ43r6K59k20k24K02K3o5j13L05j06j20j25M29k31p2P1m6n3k1
3445a37J31j89K30P7j1j57K10k08OR7J36j34M6q2m0j9J48n4P7j2l4j07l3K74l08
3470i3O8O7j46K9J26J3k54J71O3q7mK74j95o5K16q3m3j25J19N4j21R9m9j6J05
3495A23j65j24K22pj96Q0J73j58K1J89j58N2j36P2j31J29J57k64J66R1k3l71J53
3518a05J98q5n7K25l1l83L78j30M2j72K55j88j6K10j17j90K44J09j78j3L2j38
3540a10o4L61j62o8J23j24L1J00O8j33j35K50p8j23M5Q1L1j35m2q5k1L65j43j50
3564a18K82n1l32J27J34n3M6K45j89l16K77q1p5K52N4l18J45n4q5K8J34mO1m1
3588F8j4l6m5R1j84N9N1j2j62J73K20k11o5K58k45k94M71j45l6R0J14k84N2j2
$$ y = [-45, 199, -100, -69, -77, 66, -30, 229, 9, -215, -13, 10, -55, -168, 137, 31, -89, -214, 215, -16, -88, -17, -63, -116, -137, -6, -195, 35, 112, 101, -56, 154, -54, -48, 49, 185, 51, 97, 15, -25, -44, 104, 50, 127, 115, 81, -26, -59, 215, -93, -25, 42, -104, -75, 51, 64, -190, -19, 44, -43, -47, 227, 32, -33, 183, 100, 57, -68, 51, 105, -16, 83, 34, 18, 123, -42, -166, 56, 49, -147, -67, 106, -52, -31, 158, 0, 52, -84, -12, -143, -14, 143, -121, 45, 136, 113, -258, -105, 93, 8, -49, 176, 145, -238, 140, 10, 52, -120, 135, -53, -69, 141, 24, -166, 78, 187, 9, -4, 28, -110, -174, 187, 25, -43, 80, -44, -13, 87, 155, 22, -113, 137, 59, -64, -19, 62, 93, -42, -84, -169, -190, 175, 32, -118, 164, 113, -219, -92, 42, -11, 35, 280, 91, -225, 52, -29, -104, 148, 202, -116, 29, -25, -110, -82, 52, 48, 109, 68, 54, 18, -27, 64, -120, -61, -10, -22, -184, -11, 209, -2, -67, 191, -54, -348, 123, -22, -58, 32, 146, -138, -86, -98]
3612i8Q9O3M0p2j61J40j15J85m1l3K7o0j6K03m3j09K50k55k90L86n9k64L29qk35
3637a47K95j45j35N2J65j83m2L55p3j66mK1LL1J73k12J3j07K40k05J28J78j28
3660A07q2J41j86m3j2O9l6r4K27j37k22M17l3p8j1k28J29J35J37p8j02J16j82
3683d6j26J70m1M7j29L62j97k01J66j1k27L24j64k6P0J77j30j9J33O9k90J3L41
3706B65k49J8J77k46P7P0k24J75jM5l6l5N7k11o3L28j06j0J45j32p8Pq7M8M1K36
3732B11j79j52K43j07q1l1J86Ro5O4J3j64M9O1k13K30j39L6j05J68o0n5q1Q8K8
3757d6Q1J04k86K26n9J21k30J76n5m1M9J8p0q3K03jj50O0j37J34j48K53o9o5J38
3782A23k23J70n9P5j24K2O6k4p6m5P9n1J15r3P9J2P6j11K6J74j58j2J42n7j72
$$ y = [-98, -9, 54, 94, 22, -139, 1, -114, 71, 30, -3, 24, -36, -52, 151, 108, -1, 249, -6, -296, 90, 31, -233, 96, 88, -147, 148, 3, -132, -80, 85, -98, -140, 215, 142, -24, -28, -7, -4, 27, 200, -12, 1, -106, 134, -71, 57, 235, 107, 25, 166, -20, -63, -75, -6, -42, -136, 91, -46, -268, 149, 116, 38, 27, -201, -72, 63, 200, 122, 20, 136, -46, -172, -2, -43, 4, -125, 237, 40, -161, 5, -6, -233, 91, -73, -99, -29, 148, 18, -1, 132, 201, -89, -76, 265, 16, 34, 211, -35, 42, 112, -112, 63, 62, 107, 71, 36, 93, -118, -181, 147, 41, 31, 176, 44, -34, -27, -114, -66, -25, 211, 32, -120, 123, 16, -65, -96, 90, 99, 34, 98, 111, -53, -4, 57, -156, 74, -65, -29, -134, 34, -26, -81, -162, -74, -46, 35, 139, -147, 79, 20, 141, -89, 87, 32, -9, 40, 58, -12, -95, 108, 107, -43, 17, -120, 14, -134, 119, 50, -15, 123, -100, 70, 11, 86, -38, -16, 50, 26, -50, -95, -16, -67, 48, -45, 34, 46, 122, 11, 37, 211, 53, 41, 183, 126, -46]
3807d6J50K5r4l4j0J0q4K28k11M0k2j25J5K32j60J1Q8p0J37l7q9P6j22J83k7j22
3833e8j15J24qN8J11j21r8K04j52J47n5P1j29On3J0P7n4o2J59k48J04q2Q1K00
3858A17k29J20oR7n2j27J41k16J76L8R9r1j03J17j32R9L5r2O8k26J34R6k33K07
3882C7j27J74k8o1P5j06j46J01J70k76K45o4Q4j08K9J2n6K03n3K2k14K24o0q9
3906a2K1N5N3k57j3J34J09q4M2R1j05p7J59q8k3K26k63j1J20m5q0kJ52j38J73
3931A37j50j23J16L6J26j65L7l6J1J10j73Mn2J92n2j3O5pJ3m6l0M9o5M5r9R6P7
3958A03k67K18m6l7J7j79K08J34k38j22M5J14l3K38l6k01J75k4j82rK42q2k45
3981b07M27k34N5j6j26J17M9NrMo2L3j63J74O7q5pJ87j91l4p1m0M9J9L4j00P1
$$ y = [-46, 104, 129, 35, 1, -9, 1, -83, 145, -66, -26, -48, -173, -158, 74, -86, -75, 13, -57, 80, 43, -46, 30, -92, 91, 64, -58, -173, -49, -57, 1, 112, -9, -107, 97, -55, 92, 37, 108, -21, -15, -68, -58, 19, -35, -97, 62, -186, -82, -164, -83, 117, -112, 8, 2, 99, 47, -80, 61, -155, 21, 59, 158, 67, -36, 81, -51, 48, 83, -9, 59, -167, -33, 63, -170, 37, -90, 84, 56, -5, 70, -36, -182, -81, 89, -187, 58, -6, 78, -30, -1, 11, -45, 158, 105, 127, -87, 137, 77, -12, 9, 64, 117, -140, -153, -19, 90, 6, 48, 139, 34, -43, 116, 28, 5, 231, -32, -43, 77, 32, -48, -50, 102, -36, 137, -13, -136, -20, 16, 142, -23, 14, -22, -11, 99, -74, -70, -122, 70, 18, 5, 70, 63, 76, 30, 0, 49, -16, 29, -70, 26, 103, -164, 54, 8, -29, -12, -191, 17, 151, -87, -209, -164, -50, -83, 155, 119, -82, 93, 69, -113, -122, 120, 38, -207, 220, -14, 41, 25, -101, 16, 65, 70, 61, 65, 3, 36, -127, 47, 114, 29, 22, 209, 18, -16, -87, -127, -78, -59, -25, -125, -54]
4008e4Q1j57J15J6n7j49J31R4O6j05j0o8J86j34J82j76j09J80k45K53m7j5K1k6
4032b7pk2j20P8m8J82K7j55J3J23j38O7J43p0p7K4m7J04k8p5N2J50q1J42j75J29
4058A64j6j00m5M4j8j94K95j85l2N9J00r5j2J12O1j51M8L8j78J62K0j40Q7L5L1
4083I0j57L26j97jj01o5J50lr3n0J28k4M9j5j24J46j34N8J6J20m4j7r4p9L00r
4109A76k27mJ53o7k12J97J5k7m7P8J7j24K78j60m9J2nK7m5j0n8j67K12l1R3n1
4135b6P7J0k8k9N1l1j24L6J6L9K08l22j67L07L1k15J15l9J21p9J10q0k7J66j56
4160c6n5R9p9J24l1N8k50R9Q9L5l9j3K9mp0J40j26J40n0L9j53J79L8j28q7J08
4186E6p2O5k1p3M9k03J15o4J57j43M2J46o0J5q8P6n0MJ13L0k0j50J52k7j37J19
$$ y = [-54, 27, -130, -15, 1, -56, -205, -74, 20, 86, -19, -29, -97, 89, -45, 137, -39, -148, 32, -213, 40, -7, -22, -1, -27, -34, -56, -176, -98, -146, 36, 63, -92, -79, 44, -94, -27, 116, 46, -31, -7, -54, 50, 22, -53, -1, 149, 68, 210, 35, 164, 148, 48, 3, 47, 29, -165, 130, -55, -87, -28, 72, -23, -35, 77, 138, -13, 35, 73, -105, 57, 77, -63, 24, 59, 90, -67, 259, 62, 61, -40, -105, 45, 42, -51, -101, 27, 3, 52, 37, -87, 59, -75, -17, -1, 119, 75, 58, -36, -115, 185, 176, -51, -55, 98, 31, -181, 16, 31, 4, -43, 35, 52, -72, 206, 46, -3, 9, 4, 31, -14, -24, -82, -249, -37, -68, 25, -26, 51, 61, 33, 4, 55, 24, -100, -64, -48, -9, 199, -123, -290, 17, 48, -167, -52, -91, 30, -49, 61, -19, -46, 120, -36, -91, 8, -71, 53, 22, 80, -170, -71, 18, 53, 14, 1, 30, 26, -44, 96, -30, 110, 60, 99, -54, 125, 163, 35, -52, 56, -16, 49, 28, -45, 4, -199, -84, -148, 9, -134, -92, 54, -6, 9, -79, -3, -53, -49, 64, 94, 74, -76, 76, 49, -88, 31]
4212C1j27Q2NO8j73R3P5R1k59J33j38J40N5K5j65M9J92j02j01J01j43J53r6QJ8
4237A5Q4l8r7N9k30K41j25J39k5M8j91K99m5j47j2J64k62L20k64L9k0k5M5m2P3
4262Cp9Q7O9p0J9J43j98J68p3o3P1J4j63J07q7OJ87m6j81J51m2qJ2l9OQ6O5k40
4290i5L7J52k56N0J55n5O3k5J42k47J80o1j6J47k32J18j25J56m0J9k2O8R7o4k3
4315A23p7J7j45Q7Rm9k3l7J36m1q9o0K4j8J73m1k1N6n1j2O3j06J9J40n6m6J37
4342A12o7j77Q7J67j25J03J6j80Q1q5O5J39k46J96j26J39k2k3j38O1J08j42L4
4365b3k1J10l2O0q9l5M1P1P5k69R8n3Q7k8R1j53K40q3n4m8o5J62p8j27j0K87p4
4392H0j80J77m1L8j06R9j24p5J89r9k1J20k4j7l9j14K68o2K8j4r0l1K00k17r7
$$ y = [31, -96, -14, -9, 59, -114, -21, 54, 145, -114, 19, -119, 21, 76, 101, -64, -15, 177, 75, -26, 75, -68, 85, -11, -3, 15, 99, 61, -36, 23, -207, 34, -91, 48, 23, 71, -120, 179, 134, -13, -25, 139, -123, 197, -67, -28, -48, -73, -28, -70, 3, -76, 11, 80, 10, 29, 172, -26, 142, 69, 6, 77, 91, -72, 35, -52, -46, 141, 95, -86, 65, 23, 15, 27, -12, -6, 80, 145, -95, -58, 94, -162, -112, 43, -12, 51, 26, 168, -79, 101, 40, 24, 171, -61, 57, -68, 88, 48, 67, 45, 113, 210, 146, 123, 46, 63, -82, 5, 14, -35, -58, -95, 41, 0, -89, -149, -125, -143, 30, -11, -32, 24, -27, -39, 24, -82, -63, 77, 21, -25, 112, 45, -132, -45, 122, -3, 100, 116, -64, 17, -68, -3, 136, -110, 86, -40, 99, 77, 54, -84, -23, 85, -57, -23, -44, 66, 34, 94, 5, -30, 11, 82, 157, -112, -14, -67, 20, -8, 83, -70, 170, 87, 33, -15, -80, 82, 4, -123, -133, 154, 80, -100, 77, 36, 74, -32, 67, -57, -132, 57, -42, -63, 57, 33, 16, -23, -137, 131, 69, 97, 83, -7, -38, 162, -55, -152]
4417a52L8J79p6O1l6j1r6J51O5k18R0J88j60%j3K3o6L6J5j10P5R0k6j23J30j48
4443i4M0J55k1j09n0q2J85J0j40P1P2j26J16j24jJ41j40J72L1q9o6J09r0P9N3
4468A02j74K17r2k70K09R3k50N8mO0J15Rj6o3p0Q0M2p2J8j9moQ2j47J62j26n9
4495a25K17l3L2k17Q4l7J36j18J7r9J06mk04L09o3m7P7R1k82J21o9j8K7J6J47
4520F4qL0R5j56P1J19j23j16J68q5P7r5K5l8j35J53Q9k14K28j45k1R5p0J4n9N3
4546A6JQN2j58J34j14q6J11j5l3M9N3q2J04k26K35m1k9j04L6K1J54j06J05j49
4571f4R1j57k7J45J93j84L7K7j15l8J12k6q9K9N7Q3j32J67m5j4K2m9q5l4K41l41
4597a96J29P3J30j0j45j35J84Q7m6kk12J48J4p4q2K5P8N4k0n4Q4l4p6J03N9j66
$$ y = [-152, -114, 65, -11, 50, 14, 3, -93, 58, 123, -95, -5, 183, 23, 23, 10, 33, -33, 3, 18, -92, -17, 73, 47, -76, 54, -94, -54, 101, 80, -29, -79, -161, 24, 34, -106, -35, 37, -89, 27, -97, -98, 43, -97, 75, 106, 17, -49, 60, -30, 49, 102, -72, 145, 53, -217, -8, 85, -165, -107, -111, -51, 64, 73, 57, -6, -76, 4, 46, -26, -8, -27, -31, -37, 45, -102, 60, -66, -125, 92, 59, 91, -126, -42, -79, 57, -61, -44, -143, -37, -41, -245, 64, 1, -46, 31, 122, -160, -39, -108, -126, -99, -83, 64, 56, 86, 181, 25, 96, 215, 92, -24, 144, 59, 136, 41, 66, 28, -107, 46, 135, -79, 149, 4, -17, 78, 8, 22, -37, 16, 17, 25, 77, -81, 53, -61, -147, -36, -51, -84, -35, 18, -64, 40, -186, 49, 8, -21, -125, -89, -68, 86, -20, 85, -64, 27, -130, -157, -12, 181, -3, 34, 61, -54, -92, 20, -6, -95, -66, -9, 74, -58, 109, 64, 50, 72, 23, -62, -96, 145, -196, -67, 6, 136, 126, -19, -154, 30, 117, 71, 69, -143, 5, 19, -55, -137, -112, -34, 20, 0, -54, 30, -4, -80, 23, 82, -84]
4623h4L9J20j28J3j13J23j10J61Pj22O4l7%J55j80J83j04j21Q9R9j96Q2J44L9
4647A23j14j57J83K7j91J92m2l2Q2l1j02R2RJ8l8j46J58j90J06K30m3l32J04K09
4671A15r0p9Q3j15J48pQ2j57M3o0J7K7P2J09q9R0r4l4J3o6pnJ94j85r6M2J76j55
4699b8K8J28j96Q2j7q3l0K05q3Q5n8o2J5ko5J08o7J59n5j93K3K2J19njn2P3k5
4727B5q6J9j5J0J8k8K12k52J79p9J34m6k08K26J2k61J31o0J10np6j5Q5o9qO0q7
4754g4J48J3j64J15O7m7q2N7j98J01P3L1j17jm4R6J33j24K3L2J63k93J08J22j23
4779A5j29J97j16k09K67n3n5J00J21j81J67k28J72j8mj16PJ85r8M4N5j30o4J03
4803C2o8J54j87J10L1l2J99n4n4j52jlL3j6n2Q3j8j2L7j35N7n2J35k8k85L67j82
$$ y = [-84, -45, 75, -53, -40, -153, -30, -140, 21, 28, -94, -30, -67, -67, 88, -92, 91, -13, -134, -45, 54, -142, -60, 84, 123, 9, -148, 35, 62, -129, 63, 21, -11, 71, 40, -62, 30, 39, 57, 19, -127, 31, -159, -53, 177, 134, -198, -94, 115, 25, -54, 29, -86, 62, 55, 137, -20, 23, -37, -20, 7, 79, 188, 99, 189, 95, 61, 74, 8, 1, -4, 190, 5, -91, -49, 127, -28, 0, 128, -68, 14, -3, -86, -116, 89, 6, 91, 33, -29, -14, -16, -81, 27, -40, 119, 64, -129, -106, -84, 35, 30, 29, -23, 50, 25, -61, -42, -57, -47, -29, -57, 155, -97, 82, 3, 137, 91, -117, 109, 121, -140, -9, -69, 41, 36, -40, -55, 30, -39, -47, 13, -74, 74, 87, -77, 38, 105, 58, -24, 33, -165, -64, 9, 40, -77, -78, -122, -26, 107, -17, 6, 38, 201, -92, 16, 138, 15, -114, 83, -33, -242, 25, -28, -83, 17, 138, -43, 124, -104, 68, 50, 46, -70, -63, 122, 24, 68, 123, -7, -71, 32, -36, 118, -69, 41, 72, 40, 239, 185, 131, -21, -22, -25, 8, -8, -60, 23, 5, -7, 30, -105, -48, -100, 35, 7, -278, 89, -93]
4830i3N4J00j97K47L4J9k05K25j31j39J35M3m8j01J9j9J02O5o7J48k38J08k6p0
4854c5Q0j6N0N4j83pJ15j06l2P2K2o2kM5l2o4K08r1N1l6j36J65r1J00o6l0Q1J17
4882A71j41n1R8n0k3K6j85K29j74J9Rk0L3k3JJ69k69O9J37P7j31K10n4j67M3o5
4908f2K27l2j87J37j0o2J32k73R4N1j22K28K3k52%J62n1J18q5K3j09p0J6J29l9
4933a4O4J39p6k78J45P9j58J62j64O5P2Q5j04jQj19j29K68l1j14M1n4J74Qj38
4958g0J0J35kj37L7j20J15J08j08RJ51j39j14J13J35j17M4J11j83P6j34J84r5
4981IJ11o7r3M7j7J65j01K7j94K20n0m3j3o1J31l04L57o4q8n6K6lL9J13l2j4j13
5008f8o7J58q1Rr2o3K00O1Q5o0j10O7j49Q0l5k0M6k0m7J69k92K15Q7k5j88K24
$$ y = [-93, -39, 61, -136, 111, 145, 164, -41, 184, 53, -86, 49, 92, 44, -57, -38, -57, 45, 110, 43, 191, -47, 61, 35, -35, 45, 29, 79, 133, -50, -57, 58, -48, -80, -8, 14, -48, -50, -5, -37, -101, 107, 16, 67, 31, -105, 60, -31, 69, 3, -27, 54, 171, 30, -21, 77, 27, 4, 30, -155, 74, -100, -81, -72, -92, -59, -82, -81, 88, -181, -112, 25, 102, -29, 181, 127, -40, 3, -62, 165, 133, -54, 83, 73, 11, 143, -130, -36, 15, -107, 121, 144, -108, -108, 54, 3, 121, 36, 59, -50, -120, -104, 25, -14, 50, 189, 113, -165, -20, 59, -99, 63, -101, -36, 36, 121, 17, 16, 24, -95, -224, 44, 13, -101, -60, -114, 60, 68, -70, -60, 75, 73, -64, -27, -147, -32, 76, -32, -23, 128, -11, -125, -12, 123, 6, 50, 161, -22, 54, -80, 104, 9, 120, 53, -40, 7, -10, 155, 54, 81, -113, 107, 57, 14, 1, -60, 71, -233, 124, 60, -28, -84, -58, -61, -22, 91, 59, 45, -68, -135, 23, -58, -49, -141, -204, -4, 57, 142, 82, -28, 39, -110, -30, -65, -85, -39, -59, -106, 63, -229, -14, 73, 48, -140, 84]
5034H4r8J07p5j05J99j49R8j25K17K9k27L2O9r0M6l4j88J40j57J77kJ25j56o1
5058a44J56O0j62JJ0k5J01j2K9J5j0j43L22p8O0n5k15l1J67P3k50J64o4oK0j13
5084a30R1J60l84K97o4N2p5J79k32K85k26J5L1j17J80j26J00k3k7MNp2R8j83K34
5109G2k6q9K2l7j3J67j99J66j45P6p6m3N6O1N0k7k8J32k84k6J02K92j32j16J72
5134A27k36R5J5j54J78p3n7J91Lo4Mo5J05p4m5J73k14p3J82P3j64O2J50j53Q3
5159F9l7j38JJ37j55J74j03k0K7K05j01m4j0KJ27q4p6J31j50P5J1N5J23k65M0
5184fj44J95Lj31J2q2K31k19J46mo3J38j24K2%j31J11lJ81q8k28K31m1p1M4L7
5210A6J05j99n8J79q7j0N2pn2Q6J3K0o6J53j23j20J09L09k86p2R9j21J2N6n6Q
$$ y = [84, -14, 93, 18, -87, 112, -37, 61, -64, 153, 182, -45, -13, 56, -34, 12, -22, -210, -70, -227, -50, -52, 73, -83, -144, 12, 72, -90, -89, -79, -104, -3, -15, 14, 29, 19, -124, 198, 120, 180, 125, -90, -121, 46, 119, -131, 33, -31, -37, -17, -130, -39, 121, -263, 34, -30, 22, -53, 126, -106, 179, -47, -32, -1, -118, 62, -64, 36, 13, -14, -10, -5, -77, 21, -162, 72, 46, -43, -21, -58, -71, 96, -103, 63, -82, -6, -82, -125, -69, -8, 42, 15, -13, 119, -165, -191, -89, 203, 71, -45, 127, -109, -14, 1, -153, 25, -48, -105, 86, 89, 25, 29, -36, 69, -5, -50, 123, -91, -164, 18, 91, -73, -11, 139, -14, 69, 32, -106, -105, 32, -123, 51, -52, -72, -45, 160, 59, 15, 5, 7, 134, 50, -26, 105, -45, 30, 41, 96, 219, -46, -6, -150, 45, 48, -83, -71, -153, 78, -141, 5, 1, -62, 76, -48, -26, -26, -157, -46, -49, 132, 44, -184, 47, 6, -65, -21, 16, 121, -78, -136, 43, -44, -54, -2, -9, -61, 25, 38, 58, -8, 145, 22, -98, 11, 320, 34, -38, 61, -60, -48, 8, -48, -40]
5236d0m4O8nm6J99k26J22n3Q7n8l0J16n0j18J29j47K33k0p4J3p6R0j29J26o9J18
5262A16j08M8l3n6L2j4M7K3k2j7K6m7k3j03N7J58j74m6K32n5j85O3Q2L4o9Q0J24
5289A70n2j3j40J4N6j14N5J23Q0l50K11J04m0j43J23m1N0q6J29k35J89j79M5N2
5313HJm9P3K33k19m5J73j55Ln5Km4p2R4J6J82k73J40j87J77m0J7r6k9K20k05J39
5340Ik3K4M5o7j43POK15J7M6l02J73OO6J34j25k72K01k8r0O2QM6kL2q0J36m4k6
5369C1o2j0R1m8K2Q1K3q0p9K8m1n7M3J07j43Q9J68j73j25J50q3P7o2j29K24k8
5395A4p1LJ63j67J03J15j78J5Q0O7j53j15J69n9J73N6k38K23j87j65K2M7J14L3
5419F4M0j66LP0j79J61p6J18n9M5l1N0l23K44J77j97J4J39q7m3j4j08K17p8O7
$$ y = [-40, -84, -16, -21, -67, 132, -94, 28, -25, 62, 4, -26, 90, 40, -78, 51, -96, 137, 117, 43, 56, -20, 70, -59, 67, -2, 116, 8, 56, 23, -33, -1, -15, 32, 55, 33, 16, 42, -5, -28, -131, -74, 84, -90, -136, 96, 41, -144, -81, 1, 35, -34, 46, 170, 118, 105, -35, -21, 35, -79, -24, 99, 179, -171, 40, 144, 104, -39, 84, 43, 93, 7, 136, -99, 90, -89, -44, 8, 9, -40, 33, 266, 47, 2, 175, 20, 23, -32, -30, -74, -146, -52, -36, 146, -127, 13, -174, 3, -37, -20, -116, -145, 75, -130, 9, -14, 10, 55, -12, -155, -148, -142, 73, 90, 136, -166, 7, 13, 79, 213, 88, -184, 17, -11, -101, -39, -31, 15, 13, 45, -35, 101, 57, 31, -31, -41, 50, 2, 24, 105, 128, 48, -31, -3, -44, -101, -58, 49, -94, -5, 163, -10, -135, 15, -68, 9, -53, -182, 42, 14, -57, -54, 109, -58, 45, 160, -18, -3, 77, 144, -9, -124, 45, -14, 159, 215, -23, 200, 13, -152, -130, -83, 31, 64, 104, -62, -59, 11, -168, -7, -83, 35, -24, 21, -10, 40, -283, -39, 138, -59, -45, 94, 7, -36, -50, -158, 59, -19, 48]
5444D8j19O3L4P6J07l38m0K82r0r7J30j12J72j39m5p2J31J9j05P1Q0j08J00m4
5468DJ84k10L3K5L9q4J0q4l2R3J47j98P7L2M0j38N8n9R5j05o1R5j0J32k12J9J06
5495dq1J37o0Q8l3j04K25j43Pr8R0Q5j3q6lJ33o4m1kP4j73MJ45ll4j09q4J06l4
5524g5O1j73K68o5n3j40J80K12j77j13j01J43J6o4O6J70j20k6M4K2j09M0J24N1
5548A81j16l7nr6l2J30m5L0k6k9L1M0j18J21o9P8Q1k05p7L1K24j01J27Pj09j6
5574@j28J5N6J21j68K5Q1q1Q7N9p2o2M6m6Q%L4J03k6Lq1M4Q4r9k0j08J89J18q5
5603I7n7j00J78k42K71j03Lo0KLM2J3r2K6j62L6J42Q1qk27N2RJ29m2j08Q0l2n6
5631a25J18o0qJ31r6J27j86R0N0q1n5L9J28Qj8l5p1J45j58N9O4j70K36j15j69
$$ y = [48, -71, -8, 26, 102, 209, -129, -169, 113, 23, -74, 56, -56, 116, -23, -68, -140, -9, 10, -95, -24, 56, -52, 48, 4, 188, -22, 11, 36, 75, -9, 1, -83, -115, -22, 125, -73, 4, 36, 76, -62, -4, -63, 32, -73, -134, -39, -49, 83, -129, -110, -4, -85, 52, -8, 80, 47, -57, 168, 25, 32, -66, 24, 109, 96, 10, 7, 140, 76, 35, 33, 107, -66, -62, 83, 80, 46, -63, -147, -41, -75, -14, -187, 81, 16, -37, -177, 3, 215, 38, -75, -176, -33, -17, -81, -15, 155, 35, 9, 53, 75, -34, 6, 130, 181, 65, 28, 23, -73, -105, 25, -20, 10, -16, -45, -14, 26, -92, 29, -40, 38, 119, -86, -163, -132, 92, -9, 118, 125, 16, 0, -128, -113, -57, 64, -104, -79, 2, -79, 8, 67, -5, -67, -21, -67, -59, -59, -25, 78, 52, 55, -26, 18, 102, 3, -17, -125, 64, 182, 97, 40, -60, 118, -124, 147, 44, 47, -13, -11, -8, 34, 47, -45, -19, -181, -145, -3, 78, 70, -157, -105, -96, 33, -9, -117, -37, -69, -125, -7, -67, -75, 56, -40, 87, -99, -9, 41, -40, -95, -56, 72, 80, 62, 27, -44, 101, -57, 2, 66, -104, 132, 17, -152]
5656a52K78j95Pk3j0J43O0n5N2P2k92K35k21M5J34j78J93m2k9j29J39j4q4J6K01
5681A51j95J61k62P6J83k93K71j30j4J11m9j55J39r1Q8O1K1j11M9J17j81J02l9
5704A0lp2J62j24j42M5J83j60K83r3L8j44N5L4j39K6PP8Pr0N2M2m8j5j98K66o8
5731hN2j13P2N1q9J38n2J4j09K28k25M8k0L2J61k25J58j46J3N4n8J70l42J42J21
5756F7J3n8j51K4J95j84J88Q9j67Q2l2p1J03r8qJ56j18L5j73K97k53Q1J37j36
5780A8j4K08k99J5J19j90O8pP7Km2Q6O7L8j28kk9q3O5QN9K2j37J6K9m1J25o1j7
5809b8j3J12j67j3K64j24LM1r4mO9r5K44j85j91K17k4J66j30l9N2p2O3j03m2J55
5835F2l2o3m6K6ML6L1m7l5J36q9l9O1j11K94k08P4j08J25q9J17K3k20Q8K0J26
$$ y = [-152, 126, -69, -62, -85, -95, 48, 108, 53, 105, 177, -115, 120, -101, -56, 78, -100, 93, 51, 22, -107, 32, 18, -66, -50, 151, -44, 117, -145, -69, 114, -179, 92, -38, -52, 59, 10, -145, -6, -97, -9, 52, 73, -38, 11, 128, -53, 49, 10, 7, -65, 97, -27, -169, -124, 59, -101, 182, 89, 127, -17, 38, 72, -67, -41, -34, 44, 51, -39, 13, 55, 7, -8, -206, 60, -8, 44, -69, 3, 54, -35, 103, 51, 65, -44, 184, -41, 7, -13, 19, 180, -45, 113, -33, -20, 34, -24, 146, -196, -54, 67, 80, 22, -129, -105, 90, -94, 94, 183, 16, 98, 66, -5, 98, 0, -8, 148, 30, 65, -108, 189, -64, 17, 154, 18, 4, 212, -87, -72, 47, -143, -75, -82, -5, -3, -45, 41, 108, 146, 18, 16, -13, -96, -31, -23, 36, 58, -79, -63, -34, -75, 50, -11, -28, -41, 71, -96, -109, 155, 31, 34, 75, -19, -23, 46, -49, 195, 10, -181, 36, 12, 178, 48, 9, 61, -11, 52, -51, -93, 62, 30, -33, -79, -53, -49, -13, 18, -29, -64, 72, -17, -56, 5, -106, 188, -20, 54, -54, 71, -18, 99, 122, -98, -10, 10, 136]
5861A36j54K21k25j21K28o0j12Oj14J41M8lJ03k6K7r1n7m9J45R1p3n7J15j16q4
5886h1J47j70M0m1K29k08K3J70J1k2j13oO3K1m8p3kP2p3pL5m4J40k23Q2J98r1
5913B9joK6M2k78J00O8P3Q9k13J45l4j41J72j0j56J00J02k19K57j80R0Lp2j04
5938a18q0J89o1Q7r7j01OK75Pk33R0O3j6j1j74K01J13j12Q3j77q4J70p1k0j5J20
5964C4K7j30R4jp9ON4N8l7J04n9n3L4j2l3j18L3K07k22N2K44k31M9q3m8O8K1Q2
5992F1r1P0L0j55J08J6j9kj3j6R7n7M0K1L8j01M5p7l6J11p6m9j0J07M0j58N6K1
6020AJ15j55p5J43L6J7l8k1K17k18J18K3k59J69o2j28K79k95J3Q3L4N0j47J67
6044F7j69kq4J09M4J0Nl4l9mJ9J22n6J23j43Q2j5k1Nr5P1J02o4Q9j23J26p0l7
$$ y = [136, -18, 203, -22, -143, 85, 25, -87, -81, -195, -54, -6, -9, 94, 68, 95, 4, -53, -102, 43, 134, 61, 4, 119, 3, -81, 66, -104, -64, -105, 124, -84, -61, 109, 120, 98, -15, -21, 42, 63, 15, -58, -60, 12, -61, -68, -33, -77, 63, -160, -78, 120, 29, 28, 22, 48, 90, -188, -88, -20, 53, 142, -71, 74, 40, -101, 71, 61, -95, 5, 107, -112, 145, -35, 55, 58, -14, -118, -198, -9, -70, 17, -80, -181, -175, 100, 107, -126, -36, 27, 11, 0, -174, 27, 140, 28, 111, -66, -150, 20, -51, -71, -86, 34, 61, -69, 25, 24, -55, -49, 5, 63, 26, 130, 71, 18, 52, 40, 7, -111, -78, 129, -93, -41, 203, -28, 21, -62, -110, -42, -21, 61, -30, 40, 70, -85, 23, 39, 20, 18, 5, -11, 86, 29, 69, 90, 128, 27, 72, -5, -41, 70, -6, -55, -65, 42, 82, -76, -20, 1, 116, -39, -114, 29, 65, 82, 44, 23, 240, 22, 140, 163, -96, 73, 11, -117, 162, -133, -120, -37, -3, 47, -100, 67, -102, -104, -188, -79, -35, -25, -20, -54, -93, -97, -78, 44, -12, 111, -32, 50, 35, 14, 19, -76, -5, 97, 33, 122, -1, 125, 55, 18]
6072A8Q1o0m3J1j34J17r9j1J54k1n4J51j46M6J05j62J38l4j19l1J45n4j10K43
6096A31p8O9k11J12J85j90n1j9J32K2j44J79j84L6R8Lj47n0J13j31O3j27K54q7
6120b2q1J19n5O2J32j76J41J11j57k13J82Oj06J63j15P4lJ16j90J04j35j39K69
6143H7p9n9J79j81N3j6K5l9NL1o7j02J17K8J08K9n0J6L9k06n5Q9J40j41O8Q7k67
6170a61K30j25J03j32J23Q9n1j0j67J82p4p8K8Q9o4lJ52j95M2l9J30P2o2l6o0
6195a7P0j16m0J26K02j51q5o2O6l2kJ05J3k32J95r6j05J47n8J11R5q5j45K02L5
6220A41J7j45k6J2k6J59k15N6j9n7L27k79J47j25j5P5L3N6j97J34j83J88k11P9
6244g4n2Q3J23J21j29k5j07L9q9J66r6m1p8L78l05K09p4qkp3N0N7J74k40O7j43
$$ y = [18, 99, 39, -4, 7, -127, -10, -109, -120, 34, 13, -41, 110, -36, 10, 115, -47, 91, 57, -62, -93, 52, -2, -112, 131, 53, 122, -89, 23, 208, 18, -33, -52, 80, 102, -42, 137, -47, -11, 87, 90, -57, -107, 6, -125, -62, -189, 65, -22, -103, 16, -39, 23, 155, -21, 120, 231, 74, -139, 43, 49, -57, 106, -9, 65, 62, 178, -12, 92, -43, -182, 87, 8, -51, 128, -53, 0, -16, 9, -30, -25, 6, -61, -163, -46, -18, 90, 119, 69, 85, 124, -82, -137, -48, 92, -49, 19, 106, -161, 69, -56, 47, -85, 38, 127, 76, 66, -101, 81, 7, -71, -43, 46, -18, -21, 131, -64, -22, -61, 69, 141, 79, 43, -17, 53, -63, -103, 23, 225, 74, -11, -73, -7, -39, -41, 64, 77, -155, 40, -56, -161, -14, -72, 39, 134, 49, -96, 106, 141, 158, 13, -13, -1, -27, 132, -83, -27, -46, -103, 224, -55, 92, -33, -48, 27, 60, 116, -81, 53, -130, 58, -153, -74, -126, -43, 80, 201, 72, 47, -60, -21, -110, 56, -40, -81, -159, 219, -86, 123, 49, 41, 39, -34, 16, 73, 247, 7, 74, -69]
6270f9Q9k4P7Lj68J0Q1p0j1O9J03j16M8r9K39j54k4J61k81L01j44N4j10L46k19
6295I2oj73J85j47o4PJ00j9Lr8k8M5K60j35q8O0L1L1N5q2o2L4j5J06k32J44j17
6322a13Q5m5%O3J8j13J64o2O8K0q0J24j56NL9q1j8M0K6O3j63K3K1Q3p1J95j27
6349HK1M8n7L5r0m1J58N6r2m7k9K47l72O4J34l01K18L6J26j44m4J02m7p1J5J3
6375e4N9N9k8o9K6J19l15J88k7M3p1J28j47J5K59k64J36j19P1l5L6j57K42l05
6399b10J00J57%j51J35n7j9J19j7r4K07j66K1j43J34p7J4j1j11K38J12j09J14
6422A86r8k37K59k79J30R5r7j6J57o7j11N3O8l3j96P1R1o0N6O4M2p0p0R9k7j13
6448a03K38j49l6L0l1J48r5M9J3j29K51j73M7r3m0l2Q7N2j54J56k51J21O7K40
$$ y = [-69, 20, -4, 73, 76, -92, -82, -1, -71, -82, -13, 90, -26, 22, -77, 162, 8, -16, 145, -136, 165, 21, 75, -35, 311, 92, 86, -87, 98, -49, -113, -106, -6, -25, -22, -120, -148, -103, 157, 22, -66, -6, 25, 56, 111, 29, -33, 1, -14, 92, -140, 4, -113, -28, -73, -73, -10, 8, -105, 59, -3, 65, 85, 5, 129, -27, -22, 17, -64, -82, -42, -16, 47, -116, -93, -72, 11, -60, 135, 8, 29, 77, 20, 55, -35, -76, 82, 138, 46, -1, -30, 217, -155, -91, 43, -258, -40, -4, 122, -22, -66, 36, -11, -82, -67, -54, 5, 64, 36, -33, -7, 112, -203, -15, -42, 1, -70, 58, -89, -74, 185, -79, 57, -62, 9, -26, 10, -147, 95, -210, -110, 47, 47, -104, 31, -26, -45, 74, 57, -37, 170, 4, 25, -118, 16, -61, -47, -58, -169, 69, 181, 72, 186, 88, -149, 110, -169, -39, 56, -41, -57, 100, 33, -78, -25, 43, 10, -186, -115, -24, -84, -28, 36, 78, 8, -62, 37, 10, -103, 135, -14, -50, -20, -51, 97, 2, 51, 64, -65, 186, 13, 60, -33, -73, -105, -18, 34, -120, 36, -215, -94, -27, 213]
6472B13l40J07L6o0J61k09J82n9m2M2J24k05k8j7L4j2j1J9J67m8p1Q5j02J35q
6497I3j05r5J17q1J13r6K14l8j00k5j9j33J97JL9j02Mr4K13k42n0L10k09J60p5
6522cl4k6P6j10K52j65R9j3o3R9j73P6P0j13k4J84q3j61N0P3J77j11p0J07o9j48
6548a03K96j72JJ21k42L1J31j10K6Q3ol9q2O8j19J22K47l90o8J75m3O3Q7j67k
6573i2P4O0j87J66O2o6R3k13J07l2N9L5j58J53P2j85N5j7n7J16k5p2J65r3J35
6598A55k29N2N6pj49LJ36Q3j76J04k42K17p2J15J9j19mJ70j13j18K42p2J34j33
6622E2k34J69m9m7J79j37K29k55j28K55o0Q3J4n3k0Q4j04J0n1Q3P8L0j24l1L4
6647GJ21r5r2L7M7J55j64N7R0j73N5JJ04r4n3jN3m6n8kJ2n0K38j85J25k71L2R9
$$ y = [213, -127, -20, 16, -44, 117, -92, 90, 31, -11, 31, 155, -50, -78, -95, -61, -73, -84, -65, 102, 54, -17, 68, -34, 101, 93, -12, -107, 10, -71, 42, -54, 160, 122, 22, -3, -22, -155, 42, 43, 82, -20, -16, -110, 103, -139, -189, 121, -88, 72, -3, -37, -63, 13, -97, 155, -10, 89, 76, 13, 112, -61, 15, 85, -28, -52, 132, 49, -112, -62, 11, 188, 77, 7, 114, 45, -103, 193, 21, 22, 143, -99, -68, 63, -47, -21, 62, 56, 17, -65, 3, -116, 6, 253, -137, -205, -30, -73, -10, 77, -90, -92, -18, 42, -145, 21, 83, 17, 110, -103, 4, -28, 31, 66, -92, 61, 133, -52, 3, -14, -71, 45, 20, -52, 113, 20, 155, -74, -22, 34, 27, -122, -119, 17, 100, -76, 28, -214, 3, -69, 46, 65, -54, -58, 112, -1, -119, 123, 51, 185, 52, -182, -13, -62, -109, 70, -67, 162, -93, -221, 34, -26, 57, 71, 18, -2, 82, -22, -12, -63, 20, 98, 128, 4, -27, 7, 128, 33, -59, -22, 25, 180, 16, 73, 163, -10, 45, 46, 150, 56, 3, 2, 55, 9, -49, -51, -39, -89, 149, -36, 89, -182, -150, -51]
6675e1n8j3L16k36P1j85K42L2j80N3j00K29r9q2jP2M9j01J6J24j76O7P1j51N6
6700c5J4M0o7nj2Q8j21R3J28k67J74n3J35k36J35J7J16k09K22j93k3n6K01j18
6724c2R0j34J70m9j21J77L8j30L2r7P7j2Ln8N0K4j8K27j48J3j24M8N9q4L8n6m
6751b1K43l27J45J4Q2j45j2r9j1J38p6Q9o5Q5k00P2K08r1k0p0m7J21j39m7K37
6776F4j32q4N8m6J32J10j63m1K47j24r3Q5q2O2p0p6J57p7J81k3l4k05N8j7K9N6
6802b8j7R5j09K5K7R3j89J13q6Q4k0J53j17j1m5n4J96m8k6k3j5J03%l1q4J8n1
6829d7P3j04J61M5j10O8r5k8p1J29J09k51O6NnP7j9Lj59J0J41L2MK3J16j83LL7
6857C0p2J31j94J44l0l8J41k71J94J4j61J64n4K6j06J41j70J57n6o4ON1q3K41
$$ y = [-51, -109, -122, 194, -42, 29, -156, 86, 118, -62, -9, -109, 120, 21, -61, -62, 10, 59, -42, -26, 98, -78, -11, 60, -91, -35, -21, 19, -48, -53, -65, 23, -98, -5, 123, -144, 30, -23, 112, -124, 11, 28, 144, -65, 157, -36, -59, -115, 86, -32, 58, -76, 94, 45, -76, 101, 139, 9, 41, -56, 21, 9, 12, -46, 4, 28, 10, 237, 89, 102, -22, 26, 85, 1, 39, -17, -21, 222, -105, 40, 54, 136, -9, -21, -120, -131, 7, -69, 20, -45, 40, -160, -88, 120, 29, 9, -61, -108, 13, -126, -173, 64, -68, -152, -94, -140, -8, 102, -61, -102, 145, 21, -72, 13, -69, -7, -77, -153, 4, -73, 108, 85, 51, -154, -96, -113, -84, -28, -45, 50, -59, -34, -7, 86, -103, 10, -76, 8, -12, 141, 24, 13, -32, -86, 110, 62, 36, 13, -2, 101, 101, 70, -14, 4, -47, 26, -78, 83, 128, 18, 86, -9, -37, -108, 21, 130, -121, -55, -50, -55, 22, 3, 6, -153, -143, -2, 30, 34, 57, 173, -10, -7, 30, -42, 89, -105, 39, 9, -29, 112, -159, 35, 49, -112, 52, -2, 24, -82, 59, -111, 46, -10, -74, -68, -17, -100, 141]
6881A41j56j2k6J46p9q2J52q3j38P4Q4K5j8L4o9J50j38k5M6k27K42l5N8p8N8q0
6907c6K7k4J10p2j0l2k0K8K3p5L9rM0r8J02Lj10J09ROk9o9M0O6K8M9j60Q4pr8
6937h6qO1P3J11l31J37p6P4LO2q1nJ40q7K57l10K13j90J15r1L4l4R6K7j94J29
6963C9j31J57r9K47j79l0J3n3J97j65km0N2j60L1%Q5j43J90J17j71j2Q1%M1j26
6989f1K23l06J02L2N5q7J4J34j55m3J45j39K7J64j06n0L6J57o9J8j86J17r5J19
7013D6l6o9Q9j4p1P0N1j8l8j24J23j79K36k1L5j41j8J58q2R9k9r4L6m7p7R2J29
7040A06j2p6rJ98r6j53J19k2j15m3K37m8O2l6p5j02J06m1kn6J1J66j91Km8J71
7066E3o7l9J47lj05qo0n1P0l2J30j28J34r3J31j67O8J06kJ9k69J43P7m7o0J04
$$ y = [141, -15, -27, -53, 93, 14, -68, 84, 1, -137, -63, 21, 46, 28, 62, -7, 143, 5, -20, 26, -201, 41, 6, 64, -14, 44, -36, -9, -33, 77, 5, -5, -37, -57, -29, -6, -81, -42, -51, -11, -109, -7, -4, -114, -5, 4, 10, -19, -88, -48, 18, 46, 95, -65, 19, 12, -86, -94, -33, 40, 151, -180, -43, -119, -45, -42, 20, -61, -66, 74, -13, 244, -66, 147, -43, 72, -19, 15, -19, 77, 104, -90, 39, -92, 65, -34, 213, 34, 4, 17, -36, 161, -4, -6, -46, 6, -154, -123, -123, -38, -181, 9, 126, -45, -57, 24, 24, 65, -61, 162, -144, -42, -10, 45, -42, -28, 106, -49, -92, 53, -86, -59, 105, -1, -51, -15, 142, 73, 91, -95, 22, -73, 46, 10, -59, 30, 16, -55, 15, 66, 48, 10, -114, 9, -170, 66, 45, 80, -61, -79, 79, -3, 96, 67, -27, 9, -38, -115, -23, 106, 94, 18, 9, 207, 111, -42, 77, 55, -60, -103, 134, 86, 148, 112, 37, -65, 41, 0, -2, -58, -47, 119, -72, -70, -118, 53, -14, -53, 94, 91, -14, -22, -82, -133, -63, -95, 35, -93, 41, -52, 79, -88, -20, 86, 84, 103, -166, -23, 54, 7, -53, 51]
7092E1j12K8K5o4M3P7j33J12R4l8O8l6r5l2P1p8J63k19O0Q0Q5k99pJ34j02K73
7118A49j60o3K3J8M8n4N9J0j8N9M8j53Pq2K3P8p7R8k9l2K6J59k34L9O4P2l4L6
7146H0j47J01J03J23k41m9m4J00o2R5q3J38j54R9j4k3Qj0j40K81j48o4J61k21
7170a11J17m3J89k55J72q9R1j25MP4o0P6j02m2J20m3J5r4J49o7J19L0k33K43k03
7195f8oJ03j06Q6R0m9L3j00j9J17j72J34p5j27P8%O8l8j8P8k9kP6j05J8R8j43
7222g8PJ29r0M0J8o1J24n1o3O1K7J0p8N7j00J75j24Nkpj50N5J77n7n8Q3j99J55
7250EK0J03j54j07M0K08j82J65m3k38J56M8R1j41M1Q0n7J2Q1j01M9j05O1k18L23
7275A37r6J04m2l2p3lj25Q4O7OJ23j37m7J28pJ5n4k8r4l2J95Q3q2k6Q4j40j0j05
$$ y = [51, -61, -33, -8, -72, -29, 48, -85, 27, 121, 83, 151, 115, 20, -12, 59, -19, 144, -75, -15, 65, 150, -149, -156, -22, -124, 149, -11, -74, -51, -33, 15, -39, 20, 30, 12, 71, 119, -34, -27, -109, -86, -8, -85, 13, -16, -48, -22, 137, -97, -58, 6, 78, 44, 80, -67, 34, 137, 260, 19, -30, -74, 26, -36, 59, -24, 114, -40, 59, 45, 22, 30, 20, -120, 161, 13, -51, 110, -111, 6, -37, 152, -103, 69, -20, 71, -54, -50, 24, -36, 40, -62, -104, 16, -27, -12, -106, 43, -24, 95, 125, -108, 135, -68, -74, 29, -77, 9, 99, 50, 83, -17, -36, 81, -91, 43, -32, -159, -81, -81, -13, -51, -69, 9, -20, -22, 54, -51, -33, 65, -78, -71, 58, -32, 8, 26, -35, 89, 38, -25, 36, 63, 73, -5, 52, -48, 127, 3, 8, 6, -1, -151, -96, 81, 24, -34, 49, -150, 5, 25, 128, -26, -133, -93, 115, -67, 98, 55, -183, -27, 21, 112, -29, 12, 92, 35, 47, 128, 27, 76, -29, 32, -186, 137, 41, 145, 103, 71, -2, -5, -130, -46, 21, 27, 150, 13, -34, 94, 87, 102, 48, 20, -74, -106, 89, 172, 90, 64, 148, 8, -2, -107]
7303a07R4n3L2Jp8J20n2j69J07Q6mJ97n8k91J42Q9j5j47M5P3K0n5m2Pqk6NJ15
7331B8M1n8q5R0j11k0J76j44J41n2L0R5k07J78r9J09k72J29p0J57J46k97N8m7
7355h4K13o8j06LK2J04j08J18p6P4l9L7j76M7L7j28Q8k0J06j13J71p8J49j02m5
7380B6J7j65J05J60o2j13K4l1J82l8j10o4K07j1j0k62L68k53J37k62O9R8Q5n4
7404D3q1R0j08N4n4j0Q5M0j12J35j47q1J06R6p5p4L4n1j9K40p3o2j9M8j09K78
7430A74j77l9M8J3m5J15j08J15J12j27o3q6J26J9o%j00nQ5j47j22K62Jj40K24
7455A29j26M1j1KO7P5l38J17M4p9P8K1j61P5K04j36N4m0k37L41j0o5j26P2K74
7480B65l29O8j30L74k05J8n3J31j74Qo8K60k85J68m6k7po3J99j53qO2J7r5R9n9
$$ y = [-107, -13, -66, -34, -33, -111, 9, -43, -212, -105, -19, -23, 174, 116, -175, -33, 56, 41, -106, -61, 12, 32, -23, -65, -58, -66, -92, -87, 28, 69, 11, -74, 16, -95, -115, 61, -83, 58, 6, 36, 131, -76, 102, 3, 112, -160, -31, -101, 56, 202, -95, -37, -84, 129, 61, -45, -42, -20, 84, -24, 94, 18, 92, 53, 90, -86, -39, -2, -130, -42, -62, 44, -69, 102, 24, 173, 71, 26, 43, -122, -17, 143, 81, -32, -8, -39, 143, 105, -5, -69, 138, 127, 117, -145, 223, -30, 107, -155, -86, 12, 97, 43, -38, 52, -56, -2, -56, -66, 19, 59, -53, 82, -65, -146, -40, 56, -19, -93, -59, -110, -129, 111, 38, -24, -43, 5, -104, 174, -3, -42, 6, 19, -26, 89, -19, 96, 208, 81, 18, -68, 58, 77, 71, 71, -29, -34, 51, -96, -218, 44, 45, -95, 129, 3, 44, 33, 35, 102, 177, -161, -44, 0, -79, -1, 20, -141, -66, 138, 2, 56, 16, -221, 120, 110, 45, -81, -9, 265, -64, 4, -126, 248, 43, 61, 8, 139, -35, -27, -95, 165, -120, 48, 2, -25, -32, -95, 104, -49, -57, 5, 22, -73, 26, -33]
7506c3J30o6OMj01J04q2J2J6j08J26Q6j07J2r7J49L6p2o6R0p3K7R2j6M0j1j40
7533d2N2Q8j7q7K44k13p7K36k86K7J62j65q5L22k19J9J5J31k40J45K10k55n0M2
7557d3k8O5K37k97L9p1J25k4j55J89O5j2p6j7P0j05L1o3K5P8k1J01j15Q8j24J8
7583b0L4o6P6m7n2J52j78M5J81k29k24M06q6p2J69l11J43l5K45j84J41k7O8j76
7607d7J09j75J56L3j43K28p5j19p3K09p4r4J28R9k52J89j93l5K03P9k21j51L72
7630A53k05O1K1l3J92l22R9J29j05m1J41n7J31k26J43q4k1O6q3RJ34j39P5K0k09
7655a51N9K94r1j67q6J67J1Kj09J27o1M0p2l1J34j26p2K79J1j89J8n9K69k64J63
7680I6j28j48J48L4j2q5J28l5k39K55M6J1k23J88k5rM6l7N1j54J09Q7O7j92J30
$$ y = [-33, 97, 31, 37, 41, -60, 44, -38, -26, -10, -118, 8, 94, -13, -1, -98, 51, 87, 15, -51, 39, -34, -7, 85, 69, 109, 98, -42, 10, 98, 81, -6, 238, 25, -52, 184, -102, -75, 87, -78, -163, 159, -60, -41, -26, 105, -135, 10, 220, -35, -85, -43, -71, -6, 231, -66, -27, -98, 27, 3, -152, 37, 102, 90, 14, -3, 67, -38, -7, -70, -45, 33, 12, 113, -2, 86, -38, -20, 14, -52, 24, -23, -75, 77, -101, -56, 125, -104, -328, 78, -8, -80, 89, -222, -79, -114, 131, -53, 88, 61, 129, -47, 62, -113, 43, 76, -67, 161, 86, -33, -106, 103, 29, -65, 63, 162, -90, 99, -94, -129, 74, 153, -68, -219, 153, -52, 9, 30, -3, 189, -133, -34, 95, -10, -51, 90, 33, 164, -62, 81, -3, -24, 42, -41, -32, 102, -37, 38, 58, -151, -92, 202, 111, -56, -142, 25, 36, 38, -71, 56, -5, 35, -37, -68, 66, -60, -132, 147, 158, -31, -13, -72, 197, -67, 96, -32, -180, -32, 2, -10, -95, 33, -2, -241, 14, 60, 71, -152, 36, 11, 2, 48, 11, 62, -92, 17, 104, 171, -21, 109]
7705A09j48J43j45L9J54r1j23K02l74K31N9k4j3j37M7M8J22j26j0N9K4j06r8K24
7729F6J27k39J5K04k2Lj37o4mK08l30L06j53N0N4n4l4j02J21l6J00j15L4M5j40
7754i7NL5j59L64j57R0k07J90j14p8J76j33K5O4OPKj71J15M0pl0P2o5L7n4p8R0
7782c2K4L0J33j94J24Lj41M1J03p0j22N0M6J18m4Mq6M0m5n1LJ10j3j33J45J97
7808B40l86R0k5N8j01J56p5J2J53k1j41j0k7K28J8k07K4jO7L8M8j96J77k14J58
7833F3j70j45K54r6J21j9l1KJ19k12J55oj43K3N1L8K08j83R5n8n0j15L1R0j5q2
7859g5lN2J08j14n0J31L8j38L8j26K10K1j92M6l9J67J9j80P1N4j6O7j75J61j21
7884d6L3j57J28m0j69K82j20J27j71K60j44j2M1nP8p7q6M8O6pj97K78N3j99N2
$$ y = [109, -39, 104, -41, -2, 152, 61, -62, 140, -234, -3, 56, 32, 19, -118, -71, -23, 99, -27, -37, 22, 46, -60, -158, 66, 193, -46, -31, 173, 151, 154, 17, -47, -51, 157, -173, 133, -20, 30, 84, 30, -4, -106, 15, -21, 79, -36, -2, 43, -97, -92, -57, -216, 148, -9, 81, -126, 64, -50, -128, 48, -85, -60, 4, 10, 17, 19, -152, -37, 3, -4, -34, 38, -27, 10, -44, -122, -32, -8, 22, 155, -39, 85, 88, -53, -12, 91, 21, -101, -51, -5, 113, 69, 73, -13, 27, -18, -69, -66, 44, 31, -102, 43, 240, -146, -56, -81, -23, -124, 32, -43, -31, 122, 101, -40, -50, -77, 151, 169, -38, -14, -15, 52, 90, 138, -58, 119, -95, 63, -107, -252, 2, -94, 27, 8, -23, -21, 98, -114, 41, 35, -108, -85, -34, 4, 212, 29, 124, 66, 16, -99, -68, 22, 7, -75, -78, -26, 82, -32, -82, 49, 87, -51, -13, -139, 71, 92, -100, -54, -93, 74, 93, -87, -16, 38, 22, 89, -86, 75, -46, -13, -170, -42, -82, -251, 31, -89, 38, -133, 127, -17, -29, 12, 7, 85, 8, -78, -30, 36, 29, -168, 110, 163, -36, 16]
7909A6r2P6K3q7O6n4J88p8n2j3L8O0j79R9M9j01J4L3Op0l9J46j24mJ01J57j56
7936B3P5rk37J49R6p9m6p1R3K0k6j6l9M3J4k7M2J4l8Q4n9p3O9J42k07P5LO6k4
7965E7m6P3j39qJ21j06J23Kj29Q0J7n1J9J74k00Q3k4R3j85j37K32J78k47l9O3
7990Dj65K42l5j60K71k60J37J17k49J48j64J70j4j10J15j00L07l29J39j07K38
8011A95k99J26O7j65J20r6K03j20q4l4L0J16J0l0l2MN0o5k0O5qj44P5K5j32J77
8037C4K9q9Nr5J91j67J13j1R6l5j19P3P7q0J09j17m2L1j40O7J22k14K53r6P2K7
8063I4Nj78M1K3M7n8k16K53pJ56k29K43k31Q5K2M1k46P3J7L07j79k38K68r1r3
8088i1J01n2n0J08L1p7K0n0K7P2j18m1K09p5l2K6J0QL5n7L0jr4J44j30lK1K4J25
$$ y = [16, -76, 0, 23, -64, 2, -52, 136, 58, 6, -7, 31, 91, -88, 11, 60, -41, -27, 6, 12, -58, -97, 49, -75, -79, 22, 179, 23, 98, 89, -148, 1, 97, 18, -28, -99, -6, 14, -12, -28, -67, -24, -10, -37, 5, 19, -19, 65, 6, -67, 2, 144, -63, 12, 15, 81, 57, 11, 84, -55, -63, 58, -48, 75, 77, -52, 28, 45, -6, 13, 187, -13, 70, 46, 139, -46, -183, 49, 227, -20, -59, 4, -161, 81, 46, -114, 157, -103, 34, 151, -98, 50, -114, 56, 42, -68, 47, -53, 254, -75, 64, -43, 195, -104, 22, 89, -76, 44, -52, 151, 31, -53, -87, -57, 59, 69, 39, 7, 11, 61, -4, -24, 41, 33, -111, -36, -11, -143, 34, 63, -26, -21, -116, 75, -92, 21, 10, 106, 71, -48, 25, 102, 22, 131, 14, -28, 3, -137, -70, 52, -162, 91, -5, 67, 94, 99, -79, -38, -15, 32, -26, -242, 11, 4, 160, -69, 174, -57, 28, 50, 91, -155, -82, -65, 242, 63, -175, 93, 2, -91, 10, -42, -92, 16, 47, -30, -10, -60, -33, 39, -79, -120, 89, 14, -18, 8, 18, 26, 61, 4, 34, 33, -61, 83, -47, -50, -29, -5, 120]
8117A20l74K66J8J3J41k17rOJJ64pj84QP2l3J40p2r6m3P3O3k17J82k0L3l5M7O0
8145A00j64Q9o8J3l0J8L4K5k4M4k30J89J21j0j60j37J91j1lj86Q4R6O5j34J01
8170A3n4o4J82J7j5j25J23j26J69j04M5j03q4L22q2j76m2J16%l0J36
$$ y = [120, -254, 12, 30, 43, 184, -33, -42, -36, -35, 129, 122, -62, -54, 18, -15, 125, 53, -43, -86, -13, 50, -167, 15, -5, 28, -7, 40, 100, -64, 25, -43, -30, -60, -42, -8, 17, -7, 37, -193, -4, 117, 107, -53, -190, 1, -10, -13, -199, -115, -19, 46, -88, 13, -41, -105, 77, 94, 79, -46, 77, -49, 120, 16, 61, -42, -126, 196, 114, -62, -104, 12, 12, -18, 118]
8191A18
$$ Imaginary data points
##PAGE= N=2
##DATA TABLE= (X++(I..I)), XYDATA
0@%%%%%%Qq%%Qj6J6k4L2l6M4n6P0q2R6j16J39j63J88k17K54k93L37l86M39n00
32b66N70o45P27q15R13j023J141j273J414j569J740j924K127k350K592k855L145
49A649l464L814m204M637n116N656o269O970p779Q722r843J1198j2875J5011j7830
64i723K1732k7491L6812n4257R7172l80562m69595J079200j45760m40437P79834
75D86925J9754p78181M18139K50613m82912M66942M04879q00107o4923N32230
85D53359m71848k24453O22074j77610n05771K03291k1514k73913K66027J06707
95b3651k34840J15541N4012k36892J20058K19914n7324N1136P3159r4507M2028
106B8634L1875n2048J72727N1334k00146Q9511N4044k64654J23981K49998k72157
$$ y = [0, 0, 0, 0, 0, 0, 0, 8, 0, 0, 0, 8, -8, 8, -16, 16, -20, 24, -32, 38, -44, 52, -64, 75, -88, 100, -117, 137, -156, 181, -205, 234, -266, 304, -341, 386, -429, 484, -539, 602, -671, 743, -826, 914, -1010, 1117, -1233, 1359, -1496, 1649, -1815, 1999, -2205, 2432, -2684, 2972, -3297, 3673, -4106, 4616, -5227, 5971, -6904, 8107, -9723, 12009, -15482, 21330, -32927, 64245, -316317, -785912, 293288, 147528, -292909, 486925, 506679, -271502, 146637, 397250, -85662, 381280, 786159, -13948, -78871, 453359, -18489, -242942, 379132, 201522, -304249, -100958, -122472, -396385, -130358, -23651, -258491, -142950, -88938, -325830, -205772, 14142, -43182, 7954, 81113, -13394, 28634, 60509, 8461, 181188, 232522, 32376, 121887, 175931, -88723, 35258, 285256, 13099]
117A3099m0685K61132k94617j85426L78842q9653k58181L26201n8577m20055L00001
128f7919J87357m15791J95482L47555m50283q0066M64212k01960j79171M32851
138B32267r1095l24610L24934L9459l43432K84665J92129m19082N2963K95525
148B43723k90131q6076L08345j44241j79007K04580p7476j62928K24856R884k15303
159a63774J47939R4405k02903M8895J49676r6258j3294O7301p2055K6237P6398
170F2567q7804J3079J06118q4943n0057R1024k3704j9403N6753o9011j0669J02545
182H6495r4109o8692J58961l2828j50619J05026L3915j32855Q1528O0543j36974
193h9609O7865R6042j70577K0663J85810j24964p9350J77968n2619j21648J45883
$$ y = [13099, -27586, 233546, -61071, -246497, 132345, 42692, -215489, 110712, 52135, -367920, -67919, 119438, -296353, -100871, 246684, -203599, -283665, 180547, -21413, -200584, 232267, 141172, -183438, 141496, 180955, -162477, 122188, 314317, -104765, -51802, 243723, -46408, -132484, 175861, 31620, -147387, 57193, -20283, -183211, 41645, 51529, -163774, -15835, 78570, -124333, -75438, 74238, -22020, -35314, 31987, -40068, -13831, 62567, -25237, -12158, 93960, 9017, -41040, 49984, 26280, 6877, 63630, -5381, -16050, 86495, -7614, -76306, 82655, 49827, -100792, 4234, 38149, -94706, -13178, 47365, -89609, -21744, 74298, -96279, -75616, 110194, -14770, -94120, 83848, 31229, -90419, 55464]
204E5464N782j27370J20854L1731j74207P9659J16719j54332j295J42715j02002
215f282o1852J18665n1248o0105J16777l7984j06365J08146K7161j24110N6804
226b0393Q1713q9201o443O1592m8555M076N5633n6076p331P5808m3931m8328O7337
239B5901O216m6023K4066K958k1765K6664j4317l3209M7759Q704n7581K1164K9312
252A9849l6847R003J9156l2912J9575K6074n3773M949O0870l5245l4348M8085
264A4436k440k9993K8576o254k2173M3622q044n4700M5567L6988o3688m354N2158
277B9701k2366k2922K2368j0417k704K3321l0937j5625N4415p822n5546L0385
289h149L6566l6289r691K6189k824m447L05j3713J3529K1314k6893j5853L0700
$$ y = [55464, 61246, -66124, 54730, 86461, -87746, -8087, 108632, -45700, -46995, 95720, -6282, -68134, 50531, -717, -60822, 55955, 17971, -88394, 19752, 46913, -77197, -20393, 61320, -27881, -34324, 27268, -21287, -17211, 38422, -17654, -24985, 50823, 6892, -41436, 25901, 32117, -13906, 10160, 13118, -8647, 18017, 3700, -29509, 18250, 26954, -30627, -9463, 19849, -16998, -7995, 11161, -21751, -2176, 23898, -29875, -24926, 35944, 699, -33649, 14436, 11996, -17997, 10579, 4325, -17848, 25774, 17730, -36970, 8597, 45585, -18103, -22457, 29701, 7335, -15587, 6781, -3636, -6340, 16981, -13956, -29581, 24834, 17012, -38534, -8149, 28417, -7872, -17563, 8626, 5802, 1355, 1660, -12053, 1476, 22790, -4103, -19956, 10744]
302A0744K582k5823N587J4886l238m258o715J700J7062l405j9463P430J4353r989
316A453q698N550M208K48n386j0262Q450J4834j2857j3403J5654J0096j1922o357
330h392R876J0063m308j2736K622J5539k085j8151R54J6162k773j6311k32J3163
344C391L290j3141o751J4078Q897j3467p800J4258R128j1675q262J0211P339p530
358A966o718K045O475R02r250n210J1822P611j3728p167J6656N000j4702p26R662
373D638L93r33n635o551J3549P123k3846m236K7728m023k7118J0580J9670j1196
387A43o927N236J260Q691j90k0160Q642K6494j8985k4187K5280J4556k8698n640
401a4485K1183j978r600J497l384M632J0425j1710r337K0772O754k4284j762K4002
$$ y = [10744, 13326, -12497, -6910, 7976, 4738, 480, -6235, -4535, 12527, 9122, -10341, -2911, 11442, 1453, -7245, -1695, 2513, 2761, -2625, -12887, -4437, 10397, -2460, -15863, -209, 9887, -2035, -8392, 1484, 11547, 7239, -5497, -2875, 12664, 10579, -7572, -6618, 9544, 6771, -9540, -9772, 3391, 6681, -6460, -13211, 867, 9764, -3703, -11503, 2755, 11883, 208, -8054, 2157, 9496, 1966, -4752, -2707, 3768, 4670, -4580, -9790, 2032, 9643, -4085, -11252, 5404, 10404, -4298, -5024, 4638, 5031, 4098, -1537, -8088, 5461, 12584, -11262, -15498, 12230, 8207, -18911, -8331, 11339, 143, -6784, -1548, -288, 8403, 8213, -11947, -3305, 23189, 4204, -19983, 5297, 19853, -8845, -14485, 6698, 4720, -4880, -3383, -6767, -2135, 8290, -3420, -12757, 8015, 14769, -9515, -11277, 12725]
415A2725k888j8329O460R604q281k784L570m409L791Q867j2904j0121K1962O588
429A3851k5741M249K4523j3437j5825J6901L639j1097P175l769j4076J7712R271
442A3376k9314N594L1472k3147k4289L2313J0495k5809P397J2468j7009L917J3254
455A0718j6889L400K4801k2605k4192L1155Q554k9530J0650K1414k1630r742J7125
468C229n366l034K0906q942k3718J7591J1017k5120O545K8927j4827k2216J1546
481c462L072q349J4420M816j6196P173N915k6117M941L8356r484k8308J5276O927
495H980k4191N226K2393m069l195o32k2154J307K8290q501j4026K6174q47l8330
509b3575M450K9718m099l819J0185j2342j1938R506l893m45K6063j075l2483Q10
$$ y = [12725, 9837, -8492, -2032, 7572, -709, -3493, 77, -4332, -541, 8326, -4578, -14699, 7263, 13851, -11890, -7641, 16882, 3445, -12380, 4521, 8160, -2937, 4238, 469, -13607, 4105, 13376, -15938, -10344, 21128, -2019, -26308, 6005, 16500, -9309, -1912, 10556, -6453, -2536, 10718, -6171, -2771, 22030, -575, -24767, 6388, 14942, -14588, -3938, 17476, -4154, -13896, 3229, -2137, -5171, 15735, 6793, -16925, 666, 11683, -13437, -6892, 22035, 7208, -15008, -3462, -390, -8739, 5681, 10497, -5699, 1474, 7389, -18728, -13787, 24569, 15085, -13223, 2053, 8980, -15211, -9985, 12408, 8339, 5144, 4512, -17642, -16335, 11955, 3454, -10572, 15602, 14755, -23575, -19125, 10593, 6494, 2675, 12860, 518, -11420, -1914, -5807, -6252, 19811, 18736, -13747, -12937]
523a2937J6248r714J16K1115j621j6653k627l995k105K0005J0282j8231m225R251
537D909j4176j0282K4167J5098j5873p195J405r657L896J5890m396q29J3476j9290
551b857k4497K6464K0158k2996K254K0474k2828j7071K2182R07o118K2108j0693
564G487l0840K2115J3778l1595J4269L5502l0589k2657K9815o273j8716L1140
576A3436K807l1948J8552J1646l7184J1621L9400k5669j9928K9745p224k5080
588a9826K3182R289k1641J3448R217l0760M968L0780j8298j7609K7606L261k8621
601a5004N596J9909r675n957J0459n015o460J1579k951j3655J4657J2129k4379
614h767n134K9345p059k6834J9148J6025k6200J587K1821j7259o502K3285j5206
$$ y = [-12937, 3311, -6403, -6287, 14828, 13207, -3446, -6073, -10068, -12173, 7832, 18114, -117, -4342, 4909, -9267, -19549, 4618, 19716, 3843, -3352, -1947, -11604, -7708, 8182, 3786, 2957, 16433, -2857, -27354, -890, 19268, -3728, -1474, 19000, -3828, -20899, 1283, 2190, -3928, 18180, 7487, -23353, -1238, 12540, -19055, -4786, 30716, 127, -22530, 7285, 1012, -17704, 13436, 16243, -15705, 2847, 14493, -22691, -11070, 28330, 2661, -17267, 12478, 5254, -19826, 3356, 12645, -8996, 4452, 13669, -17091, -12123, 18657, 359, -17250, 10356, 13617, -15004, -9408, 10501, 826, -5131, 5328, 313, -6147, 5432, 2481, -11174, 3483, 15612, -8767, -13901, 15444, 8385, -18449, 699, 16724, -9476, -7889, 13932, -3327, -9829, 13456, -1750]
627a750j7073L2787j64l6443K2141K2773l7997K93L6786k1109j6215L1576j2284
640C321k6140L2960O204l5981K0828K4235l9275m590L6813j5240j7361K7131n738
653G167k3693J9450M535k2614J8134J7399k9792n586K6346r323j6399J9965P146
666A2735j7477j46N770n769M299Q667p167m944P845k351j1720P848J5054q458
680D186j2089R162L460j2431M419J2460q089l905Q628j0832o595J9848q12j8952
694a1542J3739R927k3216N96K0910r158o411J3959r030j0931J8280k671j7184
707a2732J9082R499k6913J632K1037j2127p880J5543l300r429Q362l941p325J4881
721F389J564j7446P649J1196j3823l595J3079j126o247K277j124r98M933k711
$$ y = [-1750, -18823, 13964, 13800, -22643, -502, 22271, -15726, -15433, 21353, 244, -15971, 15605, 3321, -22819, 10141, 16345, -19636, 1192, 25427, -13848, -18438, 18375, 3135, -14226, 12905, 7167, -16526, 2924, 7459, -15155, 2979, 20378, -9414, -15000, 11346, 2023, -14376, 5589, 12735, -4742, -4888, 882, -4887, -588, 8079, 912, -4032, 3813, 1462, -10258, -2410, 12644, 4186, -7903, 1259, 4719, -7712, -3293, 9167, 1078, -2827, 5801, -5031, -11626, 8222, 7410, -11542, 2197, 12124, -11092, -10496, 10414, 1256, -5155, 8804, -226, -11157, 7123, 4452, -12732, 6350, 15849, -11064, -9432, 11605, -522, -8402, 7141, 3841, -5588, 2774, -1167, -8492, 6389, 7953, -9493, -1844, 9352, -4471, -8066, 5013, 3887, -2360, -83, -1207, -2205, 2728, 17]
735A7l248O519M23p034P76M175L07n57k627N09M007l133m152M717K340l606l43
752i10J31j143M017j071o315N430O099r553k481R879j460o276L867J051j563K658
768B360l347k965Q012L02j0278M186Q386p297m094P070l21l200J808k004J09N004
784C731m182m597O986J657p351J624M848l117r91J985k211J468L147m852r48O052
800C249j485m368K649J985j493k12r42n43L626q95n014K665M459m209k932L432
816b8J929j660j884k77L324Q21m788k20N520n51m973J147M071q03k656m97K177
833F52K201l043k469L820K016m117j153L354N26j917j132O07J804j16k616j52
849a735L260n70l211J026K291n51r06p08M65J972m20k740J182L174j545l117J746
$$ y = [17, -3231, 3288, 3711, -3323, -2547, 1628, 1935, 1378, -1249, -740, 3267, 134, -4018, 699, 3039, -567, -910, -779, -1922, 2095, 1024, -5291, 139, 6238, -3315, -5796, 4083, 2623, -3653, 214, 1265, -298, 2360, -987, -3952, 4060, 4362, -5916, -1730, 6656, -641, -4735, 2335, 2014, -1186, 622, -1382, -1273, 3731, -451, -5048, 1938, 3595, -3756, -2132, 2716, -401, -1392, 593, -1618, -150, 2997, -1855, -2803, 3249, 1764, -2604, 45, 2030, 537, 325, -617, -1160, 2466, 1571, -3443, -778, 3681, -528, -3460, -28, 1901, 241, -1643, -1920, 1404, 2225, -2563, -2783, 2737, 2186, -2787, -1640, 2431, 1628, -1028, -1525, 652, 2853, -190, -2659, 1161, 3177, -940, -2093, 1261, 1787, -130, -1262, -655, 1149, 1033, -1583, -1735, 1525, 955, -2256, -1230, 1061, 510, -396, -1104, -639, 1333, 913, -1827, -645, 2529, 984, -2133, -387]
866c87K787j459k118O23J725M00k392j253K812J673l348k057M031J472m387q39
882b717M086K64l027j11J751N37m79j401l52L025J84m036J091M349k514l013L140
899G77R21k142O69J15j453J991R93l913O60M284k687l574L678J478k941M23J017
916B96q37Q03J08k529J501L743l000l445M150K223m496q23M404M08l368l38J863
933F63j40l83K67r57J048J432l677j815N999M65o359K176M942n034k655N871k33
950A610l567L416m80m989M484K921o427K437O476o774m080P638o99n133N510J061
966C404p109L207L601p192K264Q513o561n534P276p0o683M688M522m902m39K256
982A241m198P03N956l026l133N197m23p121K256O986k421l883L279J12m680J340
$$ y = [-387, 2400, 941, -1177, -554, 1171, 1571, -821, -2074, 738, 2411, -937, -2994, 1037, 2509, -1878, -2717, 1369, 1633, -1394, -1505, 246, 783, 304, -1097, -1449, 1576, 1760, -2276, -1185, 3164, 650, -2363, 777, 1698, -444, 225, 340, -1113, 878, 1871, -2042, -1382, 2902, 215, -3359, 319, 1797, -1144, -721, 296, -541, 262, 370, -2159, -658, 3085, 85, -3360, 790, 3013, -1483, -2306, 2098, 2506, -862, -1200, 663, 523, 140, 407, -550, 498, 1930, -1747, -3562, 2437, 2902, -3457, -1281, 3661, -1373, -4028, 1843, 1610, -1957, 1459, 979, -4010, 474, 3395, -3032, -595, 5881, -893, -4973, 2665, 1966, -3167, 2343, 3404, -3705, -498, 3103, -4089, -1825, 6688, 127, -5407, 1869, 1799, -4884, -196, 4326, -576, -1015, 1241, -2957, -2254, 3702, 676, -2457, 2740, 2317, -4804, -2548, 4438, 2017, -1866, 1413, 1525, -3155, -1815]
998a815L724j401K45J835m043k858N303O16m498L856L747p491k001O927j976k747
1014b577O432j455p045M580K626p072M076P808p711m327P459k365n092O947J763
1029D047o339L151J260p077L188P363o214k905P578l076p114N720L894m597P97
1044c24K269l781K14K808k049rM205k003m548K946K350k872l10L130m36k493j9
1061i22J275n72j15J345q32r78J652p71k546K158K404k768p79K808j257k055K029
1078G6M04j371K213K10l643J872K329l704%M620j395l380J740M80j548J375R04
1095A182j381J517o06l810J954L356k314q95K604j421k542J126R39N31J770j361
1111F49k322J739k86j792K822K181k512r30M15j539R93K474j039o99J205j923
$$ y = [-1815, 1909, 508, 753, 2588, -1455, -4313, 990, 1606, -2892, 964, 4711, -2780, -4781, 2146, 170, -2577, 3855, 2400, -4645, -65, 2561, -4511, -435, 7373, -338, -4665, 2794, 429, -4663, 2284, 4047, -2292, 859, 2119, -4958, -1770, 5593, -621, -3526, 4052, 976, -6138, -418, 3476, -1121, -324, 1945, -1836, -1622, 1186, -863, -872, 3333, 1330, -3218, -272, 2078, -794, -1104, 2026, 1590, -903, -922, 353, -219, -334, 1011, 179, -799, 853, 82, -2464, -306, 2098, -670, -1449, 1359, 102, -1953, 76, 480, -891, 1322, 1532, -2111, -239, 2090, -1614, -1614, 3006, 1611, -1769, -29, 451, -1097, 278, 1182, -199, 1318, 712, -3098, -1144, 2212, -102, -997, 1607, 186, -2356, -1230, -291, 240, 2010, 649, -1673, 66, -220, -2012, 810, 2991, 479, -451, -36, -1575, -582, 1892, 853, 154, 1359, -564]
1127e64k545K796K189j485M11R8k696K62J608n92R62K154k188l112J494J910j226
1144e24O65K176j164k484n5J004R47R42l33j134l99L62j283rL465R8l627J65J991
1163H03k006o39L399pk361O56p7j815J940K125k704K25K452k835j912L860O28
1180A732k639J707P14l185J045K426k603Q3L699k987k783L344J022l092J320K064
1196A867k219q17J414j224J71K325j432j820K470M26l244J125L150j691j971K076
1212F06N16j894M18J131p75M85M65j505n0J649r02j523J700J156k487k07K176
1229I59j129q76J641k98j357J510L0j878J154J667j733q83K096l53j492J158O43
1246H59j095P18M8j521J037J412k093m35K265n23k041P41J722j333n42R23q7j38
$$ y = [-564, -3109, -313, 1876, 391, 802, 900, -1796, -1534, 74, -518, 444, 2598, 410, -2702, -1208, 702, -524, 141, 2317, 1153, -1331, -1386, -382, 565, 1507, 1174, 40, -359, 3, -1280, -1289, 2176, 2274, -1353, -1188, 803, -1203, -1842, 1557, 1550, -811, -155, -232, -2047, -107, 2018, -686, -461, 1991, -844, -2756, 1104, 1732, -907, 800, 1514, -1671, -626, 1800, -803, -720, 2979, -8, -2791, 553, 1575, -1517, -197, 1867, -352, -1169, 245, -979, -808, 1517, 85, -1735, 735, 1161, -2083, -958, 2192, 501, -1470, 606, 1122, -772, -354, 777, 2, 487, 952, -553, -603, 1046, 144, -1379, 321, 1477, -1010, -1217, 959, -170, -1046, 595, 297, -1060, 450, 480, -1398, -244, 1423, -310, -1193, 903, 550, -942, 216, 859, -236, 482, 530, -991, 46, 1458, -635, -1070, 1195, 672, -1369, -628, 1094, -239, -781, 142, 55, -83]
1264h3k2m55K45J213o49j372J145J178j478n61J437K24j010n1O27jq6l02j62L92
1284B29L47p06m73J109n1j062R9O79p8k63o6K3K23K72o66j32Q54J80j113J94J191
1305G90k35r94K55N83K53p47l25P27M28p19q15R18O46j138k74Q21L64p89l87O28
1325a0K18j90n89K44N97l16m37R3Q70j13p69K32O05p5k88p7L85K25m71m41L10
1346CL44M4q73L23M94j97m47n4O18J24p72j05N29L73n19o58P92O96p20p83R95
1367B07M89n62o51O18O89n58p50K03R34k5j198K98J004l16q21q7Q42j76o22K8
1387d54L63K25l33l37M65L51m08k32K52N59l87m06J07O54J34n22k84M48K80m41
1407C4m89Q16M18q25o72N25O22n84m21M64N51l68q62L00Q98k2r80J70Q22j70q85
$$ y = [-83, -105, -560, -315, 898, 249, -1123, 22, 1200, -278, -839, 598, 822, -188, -239, 388, 387, 301, -1, -163, 229, 576, -130, -603, 506, 455, -607, -508, 171, 93, -170, -236, -213, 10, 282, -384, -516, 338, 518, -595, -401, 790, 555, -439, -184, 399, 652, -95, -420, 307, 735, 16, -799, 119, 765, -373, -647, 174, 538, -251, -638, -10, 208, 18, -571, -327, 270, -46, -483, -390, 480, 367, -402, -170, 435, 360, 72, -5, 380, 605, 134, -307, 3, 347, 391, -482, -159, 335, 138, -309, -363, 255, 379, -393, -498, 31, 404, -115, -773, 19, 715, -5, -788, 207, 696, 134, -517, 101, 790, 232, -518, -315, 619, 594, -604, -306, 698, 382, -439, -526, 316, 140, -482, -454, -91, 134, -199, -536, -71, 280, -128, -360, -108, 451, 64, -342, -235, 419, 553, 31, -253, 195, 475, 34, -455, 361, 779, -46, -718, -193, 429, -155, -576, -112, 439, 71, -791, -491, 407, 385, -595, -425, 397, 227, -658]
1428f58M00Q93j60n85j84L90L77m11k72P27K63p39q18Q31M22n57j83M73j26m53
1448c70r7l1L96N68k76q83M07O53r10k9J276j8j090o5M63j84N13J2p19Q22N75
1469A013j640k85J839J42j941M63J387j347n95J161O3k48L30q56o24J701k52j583
1487a272J214J651k145r21J957Q9j218Q92M06j022L72M53j213P43J444j232j525
1504a327J851N15k138P13J353r47m12O24m78m68J414n54j494J855J035k794j99
1521a451K924q36j969J776P34j716K63P21j181Q21J567k140o64K795j222k740
1537b318K464J879k728j87K006j603j010K197m46j041J902n16k933J838K122k351
1553g25j51K822j624j970J744N49j156J179Q18k488qK247j751q93L202m2l250
$$ y = [-658, -258, 635, 475, -110, -294, 96, 473, 62, -210, 517, 780, 41, -777, 54, 476, -81, -264, 209, 83, -370, -467, -498, -102, 466, 190, -693, -286, 367, -543, -572, 704, 686, -404, -469, -6, -190, 323, 335, -384, 438, 1013, -627, -912, 927, 1069, -872, -409, 978, -369, -964, 197, 260, 12, 342, -514, -1138, 563, 311, -1272, -58, 1593, -552, -1473, 484, 573, -645, 247, 653, -369, 3, 456, -757, -14, 1430, 198, -1327, 524, 1039, -1099, -386, 967, 20, -392, 232, -246, -714, 700, 146, -1348, 507, 1542, -1252, -1451, 1473, 637, -1332, 444, 1178, -538, -275, 446, -735, 86, 1653, -487, -1151, 1644, 422, -2318, 146, 2025, -703, -890, 1116, -487, -1497, 700, 254, -787, 1115, 599, -2334, -496, 1626, -725, -876, 1946, 322, -1648, 96, 645, -511, 668, 1486, -1002, -1010, 1237, -514, -1407, 1795, 1753, -1497]
1570a497N49J607j354j10K105q49j225J126r44j234K665J292l216J66K608k364
1586f75j673L195R97k348M92Q37j907N59J800j687N2K405k178k421K986J243k694
1603a017Q32J862k219r80J973p21n60K342p21k605J601J270k273M98K683j236
1619G29j988J237K12q81J139N17j294M84O64j768k94K575k28k284Q56J453j813
1636f84o14J760M1q11L76m53l41J035K40j611J249J313j906r28J833M51j593O75
1654C2P96r00j23O02r37L27J210q83j163J705P8j824O21J274o59m67M13k39l08
1673d45R01p36m90J443N2j720L66J418n26p82N86M98k29p25m1M30O42m84m92M30
1693I6N67q41n52P62Q43o49p36K19O05m94k88M24L46l33m05k49O09L75l18l18
$$ y = [-1497, -948, 659, -695, -805, 1300, 451, -774, 352, -592, -1826, 839, 2131, -1085, -919, 1689, -675, -2348, 847, 1844, -504, -12, 825, -1082, -523, 1277, -410, -358, 2047, -131, -2552, 434, 1677, -1017, -185, 1677, -542, -1522, 451, -270, -830, 1512, 791, -1814, -213, 1057, -1216, -718, 1965, 729, -1259, -22, 190, -691, 448, 965, -329, 155, 819, -949, -1243, 1332, 1104, -1180, -324, 1129, -684, -1298, 462, 503, -308, 68, -385, -726, 309, 549, -1062, 187, 1500, -406, -1334, 499, 950, -643, 32, 828, -72, -195, 407, -530, -203, 1007, 124, -1039, 666, 744, -1080, -459, 815, 156, -311, 102, -137, -445, 456, -280, -770, 673, 725, -995, -629, 789, 263, -519, 67, 565, 336, -389, -430, 0, 642, 158, -334, 96, 663, -178, -730, 32, 875, 226, -510, -291, 314, -180, -468, -44, 302, -31, -436, -685, -76, 299, -19, -337]
1713c37N62K42q16n0N94L16l52l17J26J19J82o45K03O64p0q29j63P95K07o59k33
1734d61M19O28r29m73P10O07n37m44O04J24k39l54K29O95L0r89p8J098o3j097
1754e20M08Q55n63n72J88M00L8k40k02L8O06n30o17N79P56o88l74N69j06l8k40
1775b53O3K51L03k74q94Q56O88p31m56O40N51o61l99L33M93n06k87K70L29n3p33
1796d70K6R78j78r79m6J024J6p78K5P45j45m42M1K37K75j39n43J82Q85n32o40
1817d58L59O98m59l51L03M1O1j91l09m1O59l68l77L45N79n32n28P06J43k47m17
1838c84J49N67N5p02n9P06K80q18j57Q05J38q44r7O08J47o64j14L82M66m95m30
1859d61M37M40l97p72N35O79o40l36M19L04j77r1l6K78N3j32m76M41L69m74k98
$$ y = [-337, 225, 467, -349, -399, 195, 511, 159, -158, -32, 87, 269, -376, -173, 491, 421, -408, -571, 224, 431, -228, -461, -42, 586, -343, -816, -106, 501, -36, -480, 124, 248, 9, -345, -116, 579, 609, -380, -458, 640, 577, -520, -112, 743, 180, -392, -204, 196, 234, -6, -208, -170, 436, -94, -711, -132, 624, -64, -438, 131, 25, -13, -253, -190, 61, 364, 90, -804, 52, 740, 9, -447, 193, 744, 83, -316, 17, 510, 4, -283, -13, 316, 263, -470, -444, 534, 356, -623, -669, 355, 371, -407, -382, 363, 218, -224, -183, 54, 329, 190, -353, -171, 714, 182, -458, -99, 599, 140, -211, 92, 133, 194, 3, -306, -347, 312, -56, -433, -88, 491, -41, -569, 137, 280, 33, -384, -235, 332, 387, -315, -374, 332, 612, -206, -363, 442, 580, -264, -361, 247, 394, -270, -384, -2, 464, -31, -461, -24, 416, 19, -753, -218, 461, -179, -515, -96, 208, 31, -60, -96, 182, 235, 103, -373, 68, 437, -37, -335]
1880c35M30N34o49k65K43j5K81k76k46L78M16o19m76P58L44r32l17J014Q6o25
1900b71j48M36M32k83m18n1O87J90r47K01Q87l69q85L57P01m19m46K66L27m41
1920a94K8r2j41Q20k51p82N93N76q53k10O51L2k63j64L56j85K48K2m32K67N90
1941F16o38o97P78O65q03m17J028p8p07p1K22J45L06n26l66P07L50j115j3J166
1961E52k03r96N14N41m64j63M75j42K23j77m16J28P22k37r20O54N75q78k78O75
1981A85k17r7J52r5j31M68k43o07N64N10k57q71P40J72n30l4M96L02l49m26j93
2002d61N14N99n20m58P08P0j030P0R23J18o30l16N19k46k74J19O27P5j87o59j86
2023f25P44L8l89L03M35m40p58M00O67j05p1Q0l26j01p9p7M95L84j52q53LN72
$$ y = [-335, 95, 629, -20, -285, -42, -57, 224, -52, -298, 80, 496, -123, -599, 159, 503, -429, -746, 268, 354, -271, -419, 17, 449, 166, -252, -303, 384, 574, -373, -172, 715, 346, -539, -182, 519, 100, -346, -80, 247, -194, -166, -258, -399, 421, 170, -612, -19, 557, -296, -506, 145, 177, -86, -250, 106, -79, 169, 191, -241, 26, 616, -22, -719, 59, 724, -79, -496, 532, 454, -253, -324, -102, 43, 349, -177, -543, 164, 514, -601, -614, 552, 349, -647, -133, 408, -56, -219, 256, 114, 337, 160, -256, -128, 594, 357, -563, 91, 666, -212, -490, 185, -32, -129, 23, -72, -203, 265, 22, -585, -21, 489, 232, -639, 101, 273, -257, -291, 205, 507, 158, -268, -461, 53, 652, 132, -326, 382, 452, -578, -508, 415, 533, -97, -413, 106, -140, -414, -295, 332, 407, 220, -439, -625, 119, 157, -232, 71, 506, 66, -692, -292, 375, 270, 199, 279, -47, -148, -227, -304, 191, 575, 423, -430, -427, 145]
2045A45j85k12M56L23n96m84M5M99K38J63k59j46L57o21n18R50Q79q58o29P01
2065B48k20n76L63Q12j23k29k76n95L08J003o65k91P26j57j264M45J045n70j74
2084a90N85m91n64N70K00n07Q32L96j320m3R16j93p51J025L00j037O3L67n27N38
2104A69O53r44l76J151l01j541J196J102j438l93J135l01p06R10k88l64P63j47
2122B80j143O31J182j393l77J814k99j556O83R14j021Q6P53n73m21J003n79q21
2140h37J423K31j423K74R59p74p29J269j16o04O18j71r12P55Q59j466K90J402
2158A048q20j590J358P07r73J61Q20p02l19O90n09m46J299l15j229Q96M76j259
2176g07p5J700n93j059O94J62p87O12N95o18m5O57j020l00J365J34j117N08N24
$$ y = [145, -40, -252, 204, 527, -69, -553, -508, -9, 229, 392, 133, -13, 344, -277, -795, 155, 1034, 176, -453, 248, 28, -548, -185, 627, 504, 275, -1, -596, -288, 715, 50, -241, 485, 328, -936, -491, 554, -16, -190, 395, -96, -660, -90, 110, -397, 435, 831, -489, -532, 384, 191, -560, 465, 765, -272, -209, 158, -369, 169, 822, -122, -498, 653, 352, -1189, 7, 1109, -329, -722, 413, 112, -594, 316, 28, -336, 427, 280, -863, -232, 950, -443, -820, 994, 695, -861, -178, 736, -285, -199, 554, -19, -440, 563, -16, -837, 586, 817, -606, -332, 627, -147, -876, 393, 277, -327, 291, 120, -792, -37, 822, -644, -354, 1048, 228, -1362, -4, 703, -270, -109, 711, 9, -310, 380, -129, -575, 724, 409, -820, 76, 552, -707, -782, 918, 325, -734, -40, 122, -665, -53, 542, -76, -121, 536, -484, -784, 581, 715, -402, 106, 630]
2195F30r44l1Q27l71k08P44m52q49O30L43o61K8J072p80p21P78K05n45L53L63
2215D11o55K88J07o04J79J098m43j046P34M34p12l2P22k56n58L76j84j04L71J7
2235A43l46L22J96p26M3P44j74n66J86M45m62J2J26O4J25P3k90m36O40K3n00L06
2257e2M29k94k05L8K02l0m4k32R5K79M5n72L57L92m87k49L45K72l02k21J10L03
2279A79j39j01K2P0K45k93j85L93J67n03j9L97P3n04J80K70j38j25k60J31L10
2300A70j78p0j48L56k0l23k3L37M0k84k11K58K14o8q1j34L75j60j64J0K90J94
2322C80m75r2M82j97j33j14M80j46k94J9l4K32k52JJ69J36l17l20M88J38k93p0
2344b12K92R2j41j26J68j8J35k06p0K44J52k29l1L9J01k49l8K54j95Jm7o4K09
$$ y = [630, -314, -345, 482, 111, -97, 647, 195, -654, -24, 319, -342, -314, 758, -22, -743, 35, 240, -305, 48, 411, -244, 44, 151, -453, -274, 824, 381, -665, 69, 503, -209, -241, 481, 225, -333, 43, -141, -245, 126, 143, -203, 119, 315, -411, -368, 376, 202, -364, -178, 267, -195, -183, -57, 7, 132, 205, -85, -521, 119, 142, -358, -52, 377, 83, -122, -84, 118, 88, 44, -188, -93, 186, 231, -341, 16, 408, -79, -328, 17, 289, -13, -234, -124, 179, 40, -61, -39, 31, 276, -17, -202, 191, 358, -145, -164, 233, 306, -198, -18, 252, 114, -11, -271, -140, 170, -8, -78, -226, 130, 110, -213, -236, 101, 141, -143, -354, -96, 118, 50, -31, -165, 210, 50, -114, -104, 186, 380, -95, -187, 295, 98, -35, -149, 331, 185, -109, -90, -124, 108, -144, -143, 26, 162, -155, -475, 13, 151, -142, -212, 80, 172, 31, -95, 73, 55, 190, -16, -86, 158, 310, 81, 50, 89, 190, -59, -97, 157, -38, -37, -84, -148, 61]
2367F1l2j96N9K41j62q3j82M38J05k88j15L26l6l9j22J14J93q0l58J84M34m15
2389D7k61L10J05j85k35J25K05pn04K64K55l5r9k22K63J93l14j32L42o1j29J36
2411F1N5m5j39J53j45o2L94k58o5J46J17m19j1K58l8k55K25k24K89k6j7j94L16
2434A16p1n43L36N62m72k88L79K28l62j73N45k93K4J7r0L3L48k25n01N21K50m82
2456a41NO49n09l75M40L0k87L09Q8n63J00N06k82j58L61K23n19n3M29l19M5K39
2478B18j14l39N61l99m26O55L63q23J56N45m20n76N27K42l22K07J1l61N7L83l23
2499a78o7P61m94o52O24L04n50J29O78p01k95O36j17j89N71N9q79K25M18n56l8
2520c11O99j10o66K33L23o77M11O93q10j53P18m11o53R45K58q26K55M08n01m01
$$ y = [61, 29, -167, -108, 133, -29, -112, -294, 144, 249, -39, -154, 172, 136, 97, -25, 89, 282, 202, -156, 28, 462, 47, -214, 96, 201, 16, -219, -94, 111, 104, -400, -136, 119, 84, -15, -237, 26, 219, -95, -227, 115, 54, -75, 61, 116, 71, -68, 85, -60, -122, 272, 14, -51, 95, 212, -207, -218, 40, 2, -253, -28, -252, 37, 11, -6, -200, 116, 45, -498, -162, 400, -72, -360, 19, 247, -115, -288, 257, -36, -12, 5, -85, -52, 296, 71, -430, 91, 341, -141, -136, 513, 4, -371, 69, 99, -188, 121, 209, -354, -254, 252, -30, -188, 173, 396, -123, -176, 253, -66, -21, 218, 104, -235, 326, -73, -499, 156, 519, -304, -148, 397, -23, -599, -72, 170, -152, 55, 66, -295, -238, 145, -178, -245, 516, 22, -630, -6, 298, -252, -123, 555, -146, -441, 195, 78, -111, 460, 519, -360, -135, 283, -273, -311, 388, 278, -388, -155, 168, -509, -98, 595, -215, -368, 350, -61, -714, 231, 489, -337, -82, 326, -175, -576]
2540e76J074j78m67L98j45o93M26P15o68j06Q62n63r67Q51M53p84L04Q11r28j97
2560c78O02l22l22Q86o7p93J88L77m77K7J022m06n43L86Nn87N44L11o18P9N49
2581D63l63o37O84L82q00j5O63n61j16M38j94j33M40j15o73N82L43p73J03R09
2601F27m11p54O70J96o85L94M36l52j79K93k92k43O27j38n06M11K87p98j39Q34
2621B78j64k78M31k05m41R4M37k90L9O30m87n36L85L00l28R2L87l49k71K62r2
2642a06j20O56j13m23O7K00n53n2P13R8o15k6N15n63J07N24k14j31J1k02k7L22
2664F8L74l44LK53m51l33P09L0l65J20K35p22k8O61j22j3N3j51m29J98K69r3N8
2687b0K78L1n68K92L4j27J47K38l77j88M00j86k83N09K95n47K4K53k62k90K10
$$ y = [-576, 498, 320, -147, 251, 106, -587, -161, 554, -114, -220, 642, 79, -888, -37, 416, -368, -64, 747, -181, -378, 224, -98, -420, 466, 399, -394, -206, 171, -306, -279, 743, 337, -206, 180, 185, -402, 142, 453, -165, -86, 463, 100, -537, 147, 529, -271, -286, 377, -184, -300, 138, -56, -189, 251, 136, -537, 45, 388, -385, -282, 627, 216, -538, 132, 328, -357, 37, 473, 121, -58, 235, -57, -300, 327, 189, -317, 94, 381, -417, -556, 278, 114, -164, 267, 62, -379, -285, 152, -138, -99, 531, 44, -492, -107, 193, -135, -43, 344, -5, -276, -14, -106, -226, 430, 317, -106, -39, 161, -392, -444, 269, 367, -248, -274, 241, -322, -215, 309, 95, -36, -25, -227, -254, 68, 442, 98, 101, 354, -97, -430, 279, 309, -56, 64, 299, -423, -451, 210, 88, 75, 128, -23, -452, -254, 15, -78, -20, 258, 289, -279, 13, 47, -80, 67, 305, -72, -260, 140, -46, -329, 180, 475, -72, -48, 205, -57, -347, -137]
2708a37J66k83K29N9j09J2K19k11l9K71o5m02L09K51m64L66M8l41L1K51k5j90
2730e4J91j8j90j4M00l87j18L65k60o8K23j4l01M80N8o91K06M41k78k42J77K81
2752A87j76k4Q1j46KL9m8j21L38o8l74K48L60k00j91K92p5k62J16J40j56J47L8
2775A47j27j31K19j97n6J81L1k25J23K30k26jN2M2j45rJ43j61J74J27k87P5L48
2798C27l32r4L61N9l38m3J61k14J03j97J79p3K26l23K49Nl0q4QJ85k6m1o8j3R2
2823G9n7j49K18kn2kq5J19k17nJ09N8P8qN5o0k35J82j94J37J53O4k84L8n4N1J34
2850G1j22MJ93j65m2j97K51O5p2o4j1J55k41K09K8j34j2P6J07oj87J61R5q1j08
2875b7M9o3R9Kk15L39l14N3J33K28n01J48J50j83j83L61M1j12R7l1L8j78J49M0
$$ y = [-137, 29, -254, -25, 34, -75, -63, 156, -55, -94, 177, 112, -290, 19, 270, -194, 172, 220, -121, -90, 161, 136, -54, 137, 119, -71, -85, 315, -72, -190, 175, -85, -153, 70, 56, -245, 235, 293, -398, -192, 249, -29, -271, -94, 187, 11, -13, 68, -78, -76, -37, -85, -206, 132, 64, -310, -62, 298, 98, -93, 199, 124, -138, -22, 118, -38, 109, 147, 20, -111, 108, -89, -145, 36, 67, -158, -35, 195, -31, -32, 20, 62, -83, -92, 51, -110, 64, 191, -96, -21, 327, -5, -99, 262, 321, -17, -60, 101, -113, -10, -207, -28, -101, 125, -198, 51, 56, 26, -58, -50, 135, 109, 68, 0, -13, 79, 22, -127, 91, 89, 37, 35, -50, 69, -148, -153, -44, 14, 92, 84, 139, 79, -156, 26, -168, -31, 122, 186, -98, -60, -114, -63, 71, -51, -47, 146, -19, -61, -258, -7, 58, -14, -78, -89, 66, -175, 34, 62, -72, -84, -8, 99, 93, -94, 67, 162, 81, -27, 22, -41, 58, 60, -155, 184, -130, -77, 56, 284, -217, -69, 81, -102, -285, 76, 117, 5, 102, 71, 109, -69, 80, 120]
2899A20k38J55q7J28q3j49J5L36j16j77k0K49j41m8r9K19n0k52K24l6J41l9J00
2922A52R7l11O7j0m1R4Om6lJ67m81O7K01jl2J93j59n8O9pj0Q0L02l23o3j64L44
2949A30j62Q0j8o2K3R2j30jL43k19j59L02j53l58K68J53j83q5J05l0j06K11O7
2972A08l5L1n2l62J16K11j25o3L02j21k79L07K00j81r9L22k65k38K45j33m8L52
2994A93r7j19j4J10j33j47L13O9l11J14J30l27PM24l43o4L28j46j36L1L39j42
3016G9j84K91l00j07J93J11l67L28J48k67j34L52N0l58L39j82l55J84L93j72j03
3037f1J90n5k88K14j1k46K51K81m69J57L35j32m09L46K03m36K58J22n23J49L79
3058B55l16j35M60o9p10L16L60k22j18M17j51k37J62j3m00N82K31o20L1N34l32
$$ y = [120, -118, 37, -50, 78, -5, -154, -139, 197, 81, -96, -116, 133, -8, -56, -155, 64, 14, -238, -14, -50, 91, 52, 152, 249, -62, 5, -5, -46, 48, 54, 8, 5, 172, -309, -242, -41, -42, -74, 119, -40, -98, -29, -36, -46, 34, 336, 13, -50, -214, 130, -32, 48, 30, -32, -9, 83, -47, -48, 295, 76, -83, 219, 66, -292, -24, 129, -54, -139, -34, -64, -170, 41, 108, 73, 104, 52, -310, -194, 17, -108, -171, 131, 10, -269, 38, 238, 57, -42, 280, 15, -223, 22, -111, -159, 193, 96, -23, -37, 73, -60, -207, 106, 175, -136, -22, 108, -219, -212, 212, -131, -195, 133, -13, -149, -118, 221, 79, -105, 186, -114, -221, -28, 83, -284, 44, 192, -75, -209, 143, 193, -165, 174, -8, -363, -179, 214, 42, -61, 129, 74, -214, 0, -11, -257, -6, 275, -194, -37, 298, 166, -243, 103, 306, -130, 128, 250, -273, -124, 255, -61, -196, 264, 195, -515, -199, 161, -61, -179, 238, 87, -150, 12, -1, -401, 181, 412, -208, -177, 357, 25]
3079B5k62M71J2m00J14J16l36j8N37j78j99M49l51m28M86M42p25K09L32l01n14
3100e19O41p6l26N28J75q19o1P01l92j8N30l0n60R4K28k53Q1N40n87j82M35o6
3122F4m81O81J0l81oJ31k25r7M38J15l44N2L08p14K99M41m42j4M58l88m45O24
3144H4P5j22P7K27m73j73N77j22r6m4M7l12O7K22j67K1M03k28l93L04K64o67K54
3167a75M93n12pL02kl88M89L96o71k07M95l93n4M93n9l33L00Mm70L72L53n20M2
3190e2K42j97k60J53M2k2J75K67m48k9J21J03j59J18J43k60J19J17k02j25J30
3211b4J7j68K15k8j44n0L70j54j12L92l53j20K67P3k85N9K35k40j84K83m0M9O0
3234A18q6j40L4K09k11p8M16j62l68J99K24j11o0K88k16k21K15k59J30L4o9J38
$$ y = [25, -237, 234, 246, -154, -40, 76, -260, -278, 259, 81, -118, 331, -20, -448, 38, 480, -245, -36, 296, -5, -519, 122, 46, -280, 248, 423, -396, -457, 244, -148, -166, 364, 334, -226, -132, 96, -157, -76, 464, -123, -305, 130, 64, -417, 264, 274, -107, -113, 18, -207, -304, 134, 249, -95, -43, 265, -449, -150, 291, -151, -165, 293, -95, -540, 84, 159, 37, 114, 341, -132, -305, 272, 150, 54, 10, 57, -255, -188, 34, -133, -112, 291, 63, -330, -26, 238, -429, -175, 318, -194, -201, 101, 99, -289, 200, 596, -75, -282, 213, -180, -234, 259, 200, -133, 167, 171, -299, 73, 426, -94, -52, 190, -7, -267, -114, -72, -94, 81, 348, -100, -129, -8, 95, -64, 54, 197, -63, 56, 173, -29, -154, -24, -7, -175, 40, 12, -132, -182, 188, 34, -78, 314, -39, -159, 108, 181, -104, -45, 190, -50, -234, 49, 9, 58, 118, 32, -108, -74, 135, -76, -154, 262, 100, -268, -69, 155, 44, -16, 272, 56, -165, 50, -209, -79, -45, -114, 24]
3256B4o9Q9j54J9K36k83lK11l9k31M3L70k12j32J74P1j06o3J58j1j29R7k35J99
3280B4Mo1M3j1J6l19K01L8K9j37K55j40O5o2O5J14k72K01j6Jn3Pl1K01k88j8J32
3307a2P9k4j22J87j68J56j23Q1j7P4P4k33J08p7M9%j85P0J26N9L6j97J55j47J03
3332E2q1r0K43j66j26J05Q1j74L64k09L1m3J01o6q7J49j09pJ9P3j45P5O3q6j7
3357e0K75l15O1K15p8k56K45M7j57j53L42o7j30M1J7Mnn8j3o2M0N4O6K7m6n0l
3384iJ61j76q4K8l9J05M7J6J5o1N2Q5n3r4l2j76L43q4l5j7j65K21K0q1Q3j03j9
3411e2J19j51r3J82j02QO0L8j41R9R8kj75K25k4Q1Mk73nJ77K5j12m4Q2N7k10J01
3438b8K51j57N5m4j57jOJ05p6J10n2j05J8K63m06J62J8Mn6J04l9l4N0N0q8K7J36
$$ y = [24, -45, 44, -110, -91, 145, -138, -141, 70, 31, -200, -157, 213, 1, -131, 43, 114, 8, -55, 103, 92, -37, 60, -175, 24, 28, -33, 10, -1, 15, -304, -103, -65, -36, -173, 82, -58, 7, -55, 10, 124, -148, 53, 37, 38, -15, -8, -39, 162, -126, -144, -12, 67, 43, -79, 108, -60, 96, -27, 54, 37, 111, 185, -48, 60, -17, 32, 32, -153, -83, 43, 102, 138, -59, 96, -51, 52, -29, -119, 124, -42, -168, -63, 18, -156, 208, -1, 30, -13, 88, 22, -65, 84, -25, -32, -13, 60, -85, -10, 53, -33, -50, 225, -90, -29, 186, 108, -148, 97, 144, -13, -166, 176, 109, -21, 20, 37, 41, 36, -22, -35, -97, -57, -3, 63, 90, 44, -6, -9, 152, -24, -108, -80, -119, -14, 33, 49, 64, 3, 55, 140, 87, -7, -39, -215, 128, 44, 9, -8, -173, 48, 68, -13, 70, -33, -52, 67, -84, -177, 5, -97, -89, -29, 9, -132, -33, 65, 63, -112, 113, 89, 170, 174, -99, -104, 73, 98, -14, -58, 24, 81, -129, -28, 223, 66, 121, 77, -80, -81, -75, 30, -46, 64, 12, -93, -75, 188, -218, -56, -38, -34, -90, 14, -25, -59, -9, 41, -47, -20, 116]
$$ [...]
8191c8
##END NTUPLES=NMR FID
##END=
