##TITLE=1H_6BnPO706
 CDCl3
 8 sc, 
 9.06.2022
##JCAMPDX= 6.0         $$ Bruker NMR JCAMP-DX V2.0
##DATA TYPE= NMR FID
##DATA CLASS= NTUPLES
##ORIGIN= UXNMR, Bruker Analytische Messtechnik GmbH
##OWNER= root
$$ XWIN-NMR		Version 3.5
$$ Thu Jun  9 13:56:40 2022 Russian Standard Time (UT+4h)  she@DPX200
##.OBSERVE FREQUENCY= 200.131
##.OBSERVE NUCLEUS= ^1H
##.DELAY= (6, 6)
##.ACQUISITION MODE= SIMULTANEOUS
##.ACQUISITION SCHEME= undefined
##.AVERAGES= 8
##.DIGITISER RES= 18
##SPECTROMETER/DATA SYSTEM= spect
##.PULSE SEQUENCE= zg30
##.SOLVENT NAME= DMSO
##.SHIFT REFERENCE= (INTERNAL, DMSO, 0, 15.7039)
##AUDIT TRAIL= $$ (NUMBER, WHEN, WHO, WHERE, WHAT)
$$ ##TITLE= Audit trail, XWIN-NMR		Version 3.5
$$ ##JCAMPDX= 5.01
$$ ##ORIGIN= Bruker BioSpin GmbH
$$ ##OWNER= she
$$ F:/spectra/data/she/nmr/H-F/1/audita.txt
$$ ##AUDIT TRAIL=  $$ (NUMBER, WHEN, WHO, WHERE, WHAT)
(   1,<2022-06-09 13:55:06.67 +0400>,<she>,<DPX200>,
      <created by zg, POWCHK disabled, PULCHK disabled
       configuration hash MD5:
       00 E9 B6 7A A2 85 ED C7 34 08 36 98 17 FE 4E 26
       data hash MD5: 16K
       75 3B B1 7E 2D 9A 69 2C 7D 9A C5 09 5C B9 94 04>)
$$ ##END=
$$ 
$$ hash MD5
$$ 19 E9 61 63 37 86 6E 6E 07 28 AB 00 B8 47 F7 FD
##$RELAX= 
##$RELAX= 
##$RELAX= 
##$RELAX= 
##$RELAX= 
##$RELAX= 
$$ Bruker specific parameters
$$ --------------------------
##$DU= <F:/spectra>
##$EXPNO= 1
##$NAME= <H-F>
##$PROCNO= 1
##$TYPE= <nmr>
##$USER= <she>
##$AMP= (0..31)
100 100 100 100 100 100 100 100 100 100 100 100 100 100 100 100 100 100 
100 100 100 100 100 100 100 100 100 100 100 100 100 100 
##$AQSEQ= 0
##$AQ_mod= 1
##$AUNM= <au_zg>
##$AUTOPOS= <>
##$BF1= 200.13
##$BF2= 200.13
##$BF3= 200.13
##$BF4= 200.13
##$BF5= 200.13
##$BF6= 200.13
##$BF7= 200.13
##$BF8= 200.13
##$BYTORDA= 1
##$CFDGTYP= 0
##$CFRGTYP= 5
##$CHEMSTR= <none>
##$CNST= (0..31)
1 1 145 1 1 1 1 1 1 1 1 1 1 1 1 1 1 1 1 1 1 1 1 1 1 1 1 1 1 1 1 1 
##$CPDPRG= <>
##$CPDPRG1= <>
##$CPDPRG2= <>
##$CPDPRG3= <>
##$CPDPRG4= <mlev>
##$CPDPRG5= <mlev>
##$CPDPRG6= <mlev>
##$CPDPRG7= <mlev>
##$CPDPRG8= <mlev>
##$CPDPRGB= <>
##$CPDPRGT= <>
##$D= (0..31)
0 1.2 0 0 0 0 0 0 0 0.06 0 0.03 0 0 0 0 0.0002 0 0 0 0 0 0 0 0 0 0 0 0 
0 0 0 
##$DATE= 1654768506
##$DBL= (0..7)
120 120 120 120 120 120 120 120 
##$DBP= (0..7)
150 150 150 150 150 150 150 150 
##$DBP07= 0
##$DBPNAM0= <>
##$DBPNAM1= <>
##$DBPNAM2= <>
##$DBPNAM3= <>
##$DBPNAM4= <>
##$DBPNAM5= <>
##$DBPNAM6= <>
##$DBPNAM7= <>
##$DBPOAL= (0..7)
0.5 0.5 0.5 0.5 0.5 0.5 0.5 0.5 
##$DBPOFFS= (0..7)
0 0 0 0 0 0 0 0 
##$DE= 6
##$DECBNUC= <off>
##$DECIM= 32
##$DECNUC= <off>
##$DECSTAT= 4
##$DIGMOD= 1
##$DIGTYP= 9
##$DL= (0..7)
0 120 120 120 120 120 120 120 
##$DP= (0..7)
150 150 150 150 150 150 150 150 
##$DP07= 0
##$DPNAME0= <>
##$DPNAME1= <>
##$DPNAME2= <>
##$DPNAME3= <>
##$DPNAME4= <>
##$DPNAME5= <>
##$DPNAME6= <>
##$DPNAME7= <>
##$DPOAL= (0..7)
0.5 0.5 0.5 0.5 0.5 0.5 0.5 0.5 
##$DPOFFS= (0..7)
0 0 0 0 0 0 0 0 
##$DQDMODE= 0
##$DR= 18
##$DS= 0
##$DSLIST= <SSSSSSSSSSSSSSS>
$$ [...]
##$SUBNAM2= <"">
##$SUBNAM3= <"">
##$SUBNAM4= <"">
##$SUBNAM5= <"">
##$SUBNAM6= <"">
##$SUBNAM7= <"">
##$SUBNAM8= <"">
##$SUBNAM9= <"">
##$SW= 18.0517599122864
##$SWIBOX= (0..15)
0 0 2 0 0 0 0 0 0 0 0 0 0 0 0 0 
##$SW_h= 3612.71676300578
##$TD= 16384
##$TD0= 1
##$TE= 0
##$TE2= 300
##$TE3= 300
##$TEG= 300
##$TL= (0..7)
0 120 120 120 120 120 120 120 
##$TP= (0..7)
150 150 150 150 150 150 150 150 
##$TP07= 0
##$TPNAME0= <>
##$TPNAME1= <>
##$TPNAME2= <>
##$TPNAME3= <>
##$TPNAME4= <>
##$TPNAME5= <>
##$TPNAME6= <>
##$TPNAME7= <>
##$TPOAL= (0..7)
0.5 0.5 0.5 0.5 0.5 0.5 0.5 0.5 
##$TPOFFS= (0..7)
0 0 0 0 0 0 0 0 
##$TUNHIN= 0
##$TUNHOUT= 0
##$TUNXOUT= 0
##$USERA1= <user>
##$USERA2= <user>
##$USERA3= <user>
##$USERA4= <user>
##$USERA5= <user>
##$V9= 5
##$VALIST= <valist>
##$VCLIST= <CCCCCCCCCCCCCCC>
##$VD= 0
##$VDLIST= <DDDDDDDDDDDDDDD>
##$VPLIST= <PPPPPPPPPPPPPPP>
##$VTLIST= <TTTTTTTTTTTTTTT>
##$WBST= 1024
##$WBSW= 4
##$XGAIN= (0..3)
0 0 0 0 
##$XL= 0
##$YL= 0
##$YMAX_a= 152771
##$YMIN_a= -154127
##$ZGOPTNS= <>
##$ZL1= 120
##$ZL2= 120
##$ZL3= 120
##$ZL4= 120
##$ABSF1= 10
##$ABSF2= 0
##$ABSG= 5
##$ABSL= 3
##$ALPHA= 0
##$AQORDER= 0
##$ASSFAC= 0
##$ASSFACI= 0
##$ASSFACX= 0
##$ASSWID= 0
##$AUNMP= <proc_1d>
##$AZFE= 0.1
##$AZFW= 0.1
##$BCFW= 1
##$BC_mod= 2
##$BYTORDP= 1
##$COROFFS= 0
##$CY= 11.3945322036743
##$DATMOD= 1
##$DC= 2
##$DFILT= <>
##$DTYPP= 0
##$F1P= 2.36226072786647
##$F2P= -0.459571619588291
##$FCOR= 0.5
##$FTSIZE= 0
##$FT_mod= 4
##$GAMMA= 1
##$GB= 0.15
##$INTBC= 1
##$INTSCL= 1
##$ISEN= 128
##$LB= 0.24
##$LEV0= 0
##$LPBIN= 0
##$MAXI= 10000
##$MC2= 0
##$MEAN= 0
##$ME_mod= 0
##$MI= 1.114404
##$NCOEF= 0
##$NC_proc= 0
##$NLEV= 6
##$NOISF1= 3.799351
##$NOISF2= 2.8
##$NSP= 1
##$NTH_PI= 0
##$NZP= 0
##$OFFSET= 15.70392
##$PC= 1
##$PHC0= -18033.41
##$PHC1= 15.20074
##$PH_mod= 1
##$PKNL= yes
##$PPARMOD= 0
##$PSCAL= 0
##$PSIGN= 0
##$REVERSE= no
##$SF= 200.130013532006
##$SI= 16384
##$SIGF1= 3
##$SIGF2= 2
##$SINO= 400
##$SIOLD= 16384
##$SREGLST= <1H.CDCl3>
##$SSB= 0
##$STSI= 0
##$STSR= 0
##$SW_p= 3612.71676300578
##$SYMM= 0
##$S_DEV= 0
##$TDeff= 0
##$TDoff= 0
##$TI= <>
##$TILT= no
##$TM1= 0
##$TM2= 0
##$TOPLEV= 0
##$USERP1= <user>
##$USERP2= <user>
##$USERP3= <user>
##$USERP4= <user>
##$USERP5= <user>
##$WDW= 1
##$XDIM= 8192
##$YMAX_p= 0
##$YMIN_p= 0
$$ End of Bruker specific parameters
$$ ---------------------------------
##NTUPLES= NMR FID
##VAR_NAME=  TIME,          FID/REAL,        FID/IMAG
##SYMBOL=    X,             R,               I
##VAR_TYPE=  INDEPENDENT,   DEPENDENT,       DEPENDENT
##VAR_FORM=  AFFN,          ASDF,            ASDF
##VAR_DIM=   8192,          8192,            8192
##UNITS=     SECONDS,       ARBITRARY UNITS, ARBITRARY UNITS
##FACTOR=    0.0002768,     1,               1
##FIRST=     0,             0,               0
##LAST=      2.2672688,     0,               0
##MIN=       0,             -154127,         0
##MAX=       2.2672688,     152771,          0
$$ Real data points
##PAGE= N=1
##DATA TABLE= (X++(R..R)), XYDATA
0@%%%%%%%%%%%%%%qJ6j6J6j6K4l2L2m0M8n6O5p3Q8j04J20j36J53j73J97k22K50
36A33k82L16l53L93m37M85n41O00o62P32q08Q93r86J084j192J314j450J598j765
55i28J955k168K412k692L023l420L902m504N281o328P826j0163J4357k4258R5527
70G9822P2949j22712j02995q1191J9897Q0994J19710P2860L6q5940j08383p7164
82a32117N413P0452R6730O0226l25n9783p4637m8606Q495N1945O1584K7686j9091
95D7972n2242m4175p406L6668N2512L3856j0503m9244n9665l0866K0106O3411
107D24O8792L0963k9462p3727p4428l1763K8647P3370P7211L8044k3344p1475
119A3252p7958l8922K1306O5611O9920L4594j6310n3458n8422k9809J3264M4808
$$ plain form
0 0 0 0 0 0 0 0 0 0 0 0 0 0 0 0 -8 8 -8 8 -8 16 -16 16 -24 24 -32 33 -40 48 -56 64 -72 81 -92 105 -117 133
36 133 -149 167 -186 207 -230 255 -286 314 -348 384 -424 469 -517 567 -625 689 -761 837 -928
55 -928 1027 -1141 1271 -1421 1602 -1818 2084 -2420 2861 -3467 4359 -5804 8553 -15705 79822
70 79822 152771 30059 -72936 -154127 -134230 -53236 66474 139334 139370 53430 -54953 -132117
82 -132117 -126704 -56252 40478 100704 100379 40596 -34041 -82647 -74152 -22207 39377 67063 47972
95 47972 -4270 -48445 -55851 -19183 33329 67185 56682 7438 -52227 -83093 -62987 424
107 424 69216 100179 70717 -3010 -77438 -109201 -80554 -7184 70027 108071 84727 13252
119 13252 -64706 -103628 -82322 -16711 53209 87803 71493 18035 -40387 -70196 -56932 -12124
131a2124M6387J9217j6183l7449l2475o755K0601L2458K1019m065k6423l0986
143b6778j4420J2716L3622L3076J1106k0340m0120l5472r238K3629M2815L7354
155D7950J0570k2586m3630l8912j1490K2200M1702L6133R888j9415l5705l1238
167c4533r702J5497L0632K7119P598j4806k5992k0420k945J4465K1453J4822n21
180B2667j5261j9490j1396M475J7163J8729P762q146j8811j7256n222R865J8627
193C706J6126M691j0060j7819j5501l797J0172J7100J3032J878r789j4675j1038
206a5974o87R404J3916R537p00j0938j3878p804L616J2571J3301O056m963j3238
220B19j4125o331N122J4156J4674O837m617j3360j4071p214K789J0748J2836P905
$$ plain form
131 -12124 34263 53480 37297 -152 -32627 -39382 -18781 13677 34696 30631 4208 -26778
143 -26778 -41198 -28482 5140 38216 49322 28982 -11138 -46610 -55848 -32219 10596 47950
155 47950 58520 35934 -7696 -46608 -58098 -35898 5804 41937 51825 32410 -3295 -34533
167 -34533 -44235 -28738 1894 29013 36611 21805 -4187 -24607 -27552 -13087 8366 23188 22667
180 22667 7406 -12084 -23480 -19005 -1842 16887 24649 16503 -2308 -19564 -24786 -14921 3706
193 3706 19832 24523 14463 -3356 -18857 -22654 -12482 4618 17650 19528 9739 -4936 -15974
206 -15974 -16661 -7257 6659 16196 15496 4558 -9320 -17124 -13508 -937 12364 18420 13457 219
220 219 -13906 -20237 -15115 -959 13715 20552 15935 2575 -11496 -18710 -15921 -5173 7663 15568
234A5568k97p754j0821p701j437N042P236N076J228j592k513j757l48L47j226
249i49k503k818p88L929P260P122J814n273j0276j0163n002L653J0984J3378R247
264A9615l68j0051j4844j2240l397P056J3504J3595P401k454j0604j3286r839
277a5912j830N885J0190R485N307j46m291o843p116n317j406K722N950P820O622
292A1120L165k430p960j0728q742k353N209J1594J2926Q219k20r564j4809j3165
306a7738n176N698J3579J5101R469j86r537j4057j2491n117L968J0938J2318Q507
320A5276K196n156r207j0095p046j361M661Q933R153O277Q15m388q430r520o815
335a4707j067N557J0051J0783O778o20p583j2087j1433n403L770J0912J3164R258
$$ plain form
234 15568 15271 7517 -3304 -11005 -12442 -7400 -164 4912 6140 4548 2035 278 -70 277 -949
249 -949 -3452 -6270 -7058 -3129 4131 11253 13067 7794 -2482 -12645 -17647 -13994 -3010 10368 19615
264 19615 19247 9196 -5648 -17888 -21285 -14229 -725 12870 20271 17817 7213 -6073 -15912
277 -15912 -17742 -11857 -1667 7818 13125 12979 8688 1845 -5271 -10588 -11994 -9272 -3322 4498 11120
292 11120 14285 11855 3895 -6833 -15575 -17928 -12719 -1125 11801 20020 19800 10236 -4573 -17738
306 -17738 -22914 -17216 -3637 11464 20933 20747 11210 -2847 -15338 -20455 -16487 -5549 6769 15276
320 15276 17472 12316 3109 -6986 -14032 -15393 -10732 -1799 7354 13631 14446 10058 1628 -7892 -14707
335 -14707 -15774 -10217 -166 10617 17395 16775 9192 -2895 -14328 -19731 -15961 -5049 8115 17373
349A7373J374o853j1708j1680o407J222Q509J1867R955M044l903r260j0647p972
363a4086j729M833R103R837N930j71n746q659p757m270Q21N546Q427P464L586
378A3129k495o332p954o328k030K743O610P724N191Q06l584o407o525m330m61
393a0243L817O483O834L851o49m931o946o058k867J713N514P101N768J489l593
408G283o308o664m119K42M559O710O106K358k494o050o235l297M40L591M957L565
424D644J393j487l146l174j787P6J506J586J250P43J88l02m85n08p64j000j159
441b426m41O75K253K512J656m47k664l460k590J48K568L716K876N62k525l877
457a464k926j98K177L749K260L06k183l210k570o0K791L878K478n82l717m568
$$ plain form
349 17373 18747 11894 186 -11494 -17901 -16679 -8170 3697 13652 17696 13793 4533 -6114 -14086
363 -14086 -15815 -10982 -1879 7958 13888 13717 7971 -688 -8445 -12715 -11894 -6348 2079 9543 13129
378 13129 10634 4302 -3652 -9980 -12010 -9267 -2657 5067 10258 11064 7480 1073 -5452 -9782 -10243
393 -10243 -6426 57 6891 10742 10093 5162 -1784 -7842 -10709 -8996 -3482 3619 9387 10876 7283
408 7283 975 -5689 -9808 -9566 -5007 1703 7809 10167 7673 1623 -4612 -7909 -7469 -3878 1079 4644
424 4644 6037 4550 1404 -1770 -3557 -3481 -1975 -389 861 1604 1792 1490 1005 497 -267 -1267 -2426
441 -2426 -2867 -2192 61 2573 4229 3782 1118 -2342 -4932 -4784 -2216 1500 4376 4938 2413 -1464
457 -1464 -4390 -4588 -2411 1338 3598 3904 1721 -1489 -4059 -4119 -1328 2550 5028 4446 729 -3839
473c839k675R59M220N515L299r38m824n953l827N89M782O344M125k11l863n586
489a883m382q47K843M827L734J092k220l241k431m23J643K014N48j076j738r90
505b530J460L596L054L18l736o045n150l14N097Q217O992J627m893r451r026l844
521a4628L872R890J0435N666k108q930j0728o948m8P065R682P367J560m689p622
536a64o182j803K422M330L582J172r04q84m63M73O27j204l067l816j535K336O485
553A405O875L852k251p935r850o706K72P901J2362R801J660p306j2642j1569m110
568a8241N105J1301J1729O354k057q967j0776o632l6N473P597N824J513k067l972
583B148l881j782J90N92K33l32R56K661L746K919l03m455p042o000j930M541R276
$$ plain form
473 -3839 -6514 -5555 -1335 4180 7479 6541 1717 -4236 -8063 -7474 -2692 3652 7777 7566 3703 -1883
489 -1883 -6265 -7112 -4269 558 4292 5384 3164 -77 -2508 -2931 -1288 726 1274 198 -1540 -2530
505 -2530 -1070 2526 5580 5898 2162 -3883 -9033 -9347 -4250 3967 10959 12586 7693 -1758 -10784 -14628
521 -14628 -10756 -866 9569 15235 13127 4197 -6531 -13479 -13527 -6462 3220 10587 12147 7458 -164
536 -164 -6346 -8149 -5727 -1397 2185 3357 2453 1569 1106 1579 2206 1002 -2065 -5881 -7416 -5080 1405
553 1405 8280 12132 9881 1946 -7904 -14610 -14338 -6437 5925 15726 17386 10080 -2562 -14131 -18241
568 -18241 -13136 -1835 9894 16248 14191 5224 -5552 -12184 -12220 -6747 850 6674 8187 6120 2148
583 2148 -1733 -3515 -3325 -2733 -2500 -2832 -1876 785 4531 7450 7147 2692 -4350 -10350 -12280 -7739 1537
600A537R464M437l550j0218j1263o620J598Q660J1563Q738J494o538j0780r591
614a1069l344L905Q462Q669M051j108n057o544m437l95K850L332K486M57k45j3
630B000Q68m8j299l171l308j884J246M625O157M325Q2n340q056o539j357M675
646g024P964Q215L479k616p531q952n505J158O398Q225N629M54m534o404n229
661f273j232K446M698L995J268j631k660j778l29Q43M36K10q90r05q1J494K815
678B426J996j92k853m189l182J6L165N085M164Q92l063n367n073j705K749N354
694B23N019J791k138m356m518j864J269L650M021J693j386l243k927q92J572K579
710D93K294L25j841k769k060M44K486L197J362r29l024k876j256J218K898K700
$$ plain form
600 1537 11001 15438 11888 1670 -9593 -16213 -14615 -5955 5608 14346 15840 9302 -1478 -11069
614 -11069 -14413 -10508 -2046 6623 10674 9566 4509 -2035 -6472 -6867 -4017 -685 1801 2258 2013 2000
630 2000 2868 2820 1521 -1650 -4958 -6842 -5596 -971 5186 9511 9593 4253 -3803 -10342 -11699 -7024
646 -7024 940 9155 12634 10018 2487 -6465 -11970 -10812 -4414 3811 9440 9894 5360 -1044 -6273
661 -6273 -7505 -5059 -361 3634 4902 3271 611 -1167 -1496 -653 -217 -7 -897 -1802 -1883 -389 2426
678 2426 4422 4230 1377 -2812 -5994 -5978 -2813 2272 6436 7328 4265 -1102 -6175 -7880 -5131 223
694 223 5242 7033 4895 539 -3979 -5843 -4574 -924 3097 4790 3404 161 -2766 -3658 -2086 493
710 493 2787 3112 1271 -1498 -3558 -3114 -628 2569 3931 3002 -22 -2898 -4154 -2936 -38 2662
726B662J062j023k750k398q00J236K434J954J18j297j924j278M0J634K296Q96
742B862r97k747k580m72J932L576K763P20k394l861l891q42K176M593M171J380
758F389j757m424m294j763Q23L635L834K282j25k554l201j911k98J273J862J325
774A096M68k88n06J11n8j78j067j588j302P9K237L263K670K95k432m222m074j718
792g214K157M834N096L090j017m351n853m176m83L539N362M630J813j702m293
807A432m545k777M42K600L373K590Q41o46j552j543j689j130o05K08J446K049
823D94K514J677j68k484l618l609j501J755M346M959L080q6l962n555m936j310
839h404K648N363N678K688j142m298n074l533n41K400M030L718J596l12k080k651
$$ plain form
726 2662 3724 2701 -49 -2447 -3247 -2011 423 2377 2495 1198 -726 -2004 -1964 -330 1966 2862
742 2862 1865 -882 -3462 -3934 -2002 1574 4337 5057 2663 -1198 -5089 -5931 -3755 838 5009 6389
758 6389 4632 208 -4086 -5849 -5026 -1391 2443 4725 4600 2046 -1155 -3066 -3364 -2091 -229 1096
774 1096 1564 1276 770 881 823 645 -422 -2010 -3312 -3233 -996 2267 4937 5232 2800 -1422 -5496 -7214
792 -7214 -5057 -223 4873 7963 6946 2595 -3258 -7434 -7917 -4378 984 5614 7427 5725 1432
807 1432 -3113 -5890 -5448 -2848 525 3115 3956 3310 1758 215 -1474 -2604 -3209 -3001 -1555 494
823 494 3008 4685 4517 2033 -1585 -5194 -6695 -4940 -594 4365 7445 7359 3397 -2158 -7094 -8404
839 -8404 -5756 -393 5285 7973 6831 2533 -2541 -6074 -6615 -4215 -185 3533 5129 4817 2737 86
855H6k549j407o8J399J914K231J993P06n75k162l502k716j010J262L691M247L069
872F609j0l196n093m483j460K064M932M948K850p18l616m744l485o20J903L675
888d44L353J862m78j957k639k057r33kJ294J673J710J401L98n97j616k222k099
905c353q79Q27K613L276K293K28k175l935l364j256J483L450L838K291m56k752
921B129l532k573o05J472K757K744J090n10j515k082j325j14M16Q18Q37P42M67
938A216L5J58n16r62j447q99J85J133J956J887L67j194k175k141r10P71J988K275
956A727J146j97j576j895j588j48J290J725J378J3j022j331m04k10Q95J021P7
973I01n10r12n07L67R22P62M27p33j065q24l64N55J334P84N22n62j123q40j90
$$ plain form
855 86 -2463 -3870 -3938 -2539 -625 1606 3599 4305 3730 1568 -1934 -4650 -5660 -4398 -707 3540 6609
872 6609 6599 3403 -1690 -6173 -7633 -5569 -637 4311 7161 6443 2827 -1917 -5402 -6022 -4119 -444
888 -444 2909 4771 4293 2336 -303 -2360 -3293 -3295 -2001 -328 1382 2783 3181 2584 968 -1254 -3353
905 -3353 -4232 -3405 -792 2484 4777 5005 2830 -1105 -4469 -5725 -4242 -792 3046 5337 4881 2129
921 2129 -1403 -3976 -4581 -3109 -352 2392 3482 2972 1457 -625 -1950 -2064 -1648 -830 7 749 1216
938 1216 1251 1409 893 -69 -1516 -2415 -2230 -1097 859 2746 3113 1919 -256 -2397 -3307 -2536 -548 1727
956 1727 2873 2676 1100 -795 -2383 -2531 -1241 484 1862 1875 853 -478 -882 -1092 -197 824 901
973 901 391 -521 -1028 -661 261 1023 1450 717 -348 -1172 -1536 -981 353 1137 1659 1097 -26 -866 -1056
992a056M55R10O00O9o89q01k86L67Q48Q37n3p54j491q50R7J245J844J327r2j434
1012A093k382j652M1J554K190J716O36j140k032j907j138M55J719J832J428O9
1028B482j113j401j240k60K8P69P66M75L93J16K55k08p94j042j126n03P08J519
1046a76K304J114l47j691k609k030m80J053K725K902J395k97k452l275k240m68
1062d572J780K962K602J333o54k267k451j759l10J287J706J634J179J17r96j177
1078D14j342j120k90M38J004J669J326Q97m32j471k165k093o52P44K435L094J994
1095D450Q8j955l702k869r87J248L143L391K071m24k121l269k828n64R56K769
1111f03K578J725j33j482k081k004r67M18J486J262J290L65M42r65q80j321j135
$$ plain form
992 -1056 -601 309 909 978 289 -512 -798 -431 417 1254 1201 447 -1044 -1894 -1797 -552 1292 2619 2527 1093
1012 1093 -1289 -2941 -2900 -1346 844 2560 3196 2056 24 -1883 -3021 -2566 -847 985 2413 2482
1028 2482 1369 -32 -1272 -1532 -1504 -735 31 506 899 1015 1270 1062 268 -774 -1900 -2403 -1695 -176
1046 -176 2128 3242 2895 1204 -1405 -3435 -3915 -2862 -137 2765 4160 3863 1411 -1864 -4104 -4572
1062 -4572 -2792 170 2772 4105 3451 1184 -1267 -3026 -3336 -2049 -343 1291 2470 2587 1591 414
1078 414 -928 -2048 -2338 -1900 -896 773 2099 2996 2564 1093 -1072 -3165 -3817 -3073 -638 2456 4450
1095 4450 4538 2583 -1119 -3988 -4975 -3727 -584 2807 4878 4454 2333 -936 -3764 -4328 -3372 -603
1111 -603 1975 3700 3567 2085 4 -2000 -2967 -2549 -1063 199 1489 1854 2296 1331 451 -870 -2005
1128b005p63M37J466K275J664O24j191k672k553j679O26K246L130K385N66j438
1144C118l150l091j495O28K636L165K146J65j790k646k307p60O86J714K015J109
1160B143j5p79q26r78r54L4N5K98Q36Q66R35L29m70j244j553j256j57J191J775
1179B30J922R62m61k040k257j694P1J690K442J937M05j155k072j731j014N44J420
1196h01J646J075R5q97j227p86k75K87L44N71M24r1M5PJ64l27l58n54n56K96O78
1217b40R44P12M7o41j132r43m53O33J111J113L43m13p83r06o99K10Q04O91N65
1236I63K6q80n99k20L03M52N05Q9l12m30m38j97L65Q58M06j45o64o21j73j3M61
1257b64N68K95J98m03l76m61q7J66J71L9L59J63r8R8j74n4j84l17j47j63K67M47
$$ plain form
1128 -2005 -2768 -2331 -865 1410 3074 3698 2507 -165 -2718 -4397 -3771 -1525 1605 3990 4556 3118
1144 3118 -32 -3123 -4618 -3990 -1354 1811 3957 4122 2332 -314 -2621 -3381 -2695 -981 1034 2143
1160 2143 2128 1349 523 -455 -1409 -1375 -1320 -1022 -186 680 1615 1944 1474 230 -1323 -2579 -2736 -1545 230
1179 230 2152 3114 2653 613 -1644 -3338 -3267 -1577 865 2802 3207 2052 -20 -1751 -2765 -2221 -801
1196 -801 845 1920 2015 1118 -109 -895 -1170 -883 -539 32 456 365 410 417 581 254 -104 -658 -1214 -918 -240
1217 -240 704 1416 1463 822 -310 -1253 -1706 -1073 38 1151 1494 1081 298 -608 -1307 -1097 -293 398 963
1236 963 989 109 -490 -710 -407 45 550 639 327 -103 -541 -738 -373 485 891 746 82 -539 -712 -725 -264
1257 -264 304 599 797 394 18 -443 -530 -364 -193 -154 205 368 270 368 194 140 -44 -361 -508 -671 -404 43
1279D3Q28M34l96p51q58r16K23Q20J286R65N0o88j092j007p05L10Q11J126R67
1298A450M65o20j098j118n49JO56R52Q31M01l5n84r07m85m79l16O11O95R87O36
1318A494J74o18j161j304o53K28J076J719R79M52o37j543j700r23K26J148J540
1335D97J666M10p93j413j783r03L76Q70J328Q85P29k90q19j108o24o60K53L36
1353a043R62J033P92J81p83j187j315o80k91J202J529J548P73n74j547k240j287
1370b927Q7J408J866J906P16q01j878j835j080J07J244J690J221L00l88j079j151
1387e94q62j46L49Q05O79N97N28m77m8p48q28q45j97N06J272J098J364k09j307
1406I37j795j447m36R69J882J939Q44n37j505k161j234J4J335J622J372N10o19
$$ plain form
1279 43 871 1305 909 158 -700 -1616 -1393 -573 713 1678 1728 1040 -52 -1059 -1764 -1454 -643 483 1450
1298 1450 1915 1295 197 -921 -1470 -1469 -813 139 970 1371 1336 752 -155 -640 -1119 -1435 -824 -129 858 1494
1318 1494 1668 1050 -111 -1415 -2068 -1840 -764 955 1934 2386 1749 206 -1494 -2417 -2191 -1043 497
1335 497 2163 2573 1780 367 -1416 -2319 -1943 -1073 255 1140 1869 1579 760 -348 -972 -1632 -1379 -1043
1353 -1043 -81 952 1744 1925 1142 -45 -1360 -2040 -2331 -1129 400 1948 2721 2147 600 -1640 -2927
1370 -2927 -2840 -1432 434 2340 3056 2255 377 -1458 -2538 -2431 -1187 503 1724 2024 1636 557 -594
1387 -594 -1456 -1602 -1253 -448 231 828 1356 879 831 83 -745 -1590 -1787 -1281 -9 1089 2453 2244 937
1406 937 -858 -2305 -2741 -1772 110 2049 2893 2356 851 -1310 -2544 -2530 -1195 427 1799 2309 1690
1423A690j238j371o94J21O95R57O41J27m31j7k18j35k75m60l03K8M28J007P32
1442A284K26n16j075j214n53L40J291J327J017j11j139j482j027n15Q23J459J207
1459A342P29o94j256j024p55M07Q71J093L73j55q36m83l25N03M09K50l03n41o6
1478d61J16M02M52L35k62o45o60l60N2R62P57O00j58q91r76p37K27Q77J009O51
1498A290j30q88r60m91K22Q43Q10K92l59o81q61p0N10Q19N77J25o28q59o98l2
1518a169M41J081P21K36o80j107o57j55Q48P13Q77Kn75r11n65O1N64O06K95j53
1538D73m19p05J28N55L95L55j35q09o99k42K40R52J047L53k46j263j358n97M88
1557a487J386J365Q88k50j369j612r22J26J171J386R75l7q22j151q49k1N63Q45
$$ plain form
1423 1690 452 -919 -1613 -1492 -797 160 801 928 497 480 262 127 -148 -608 -911 -883 -455 552 1284
1442 1284 1510 994 -81 -1295 -1848 -1508 -217 1110 2127 2016 877 -605 -1632 -2147 -1324 135 1342
1459 1342 2071 1377 121 -903 -1658 -1251 -380 713 1086 931 95 -388 -713 -210 199 449 146 -395 -461
1478 -461 -345 57 509 844 582 -63 -723 -1083 -1031 -69 688 1288 1130 239 -737 -1474 -1247 -370 639 1290
1498 1290 1160 272 -688 -1179 -957 -114 696 988 629 -52 -913 -983 -473 346 923 1048 420 -439 -1137 -1169
1518 -1169 -728 353 1074 1310 630 -477 -1134 -1289 -441 272 1149 1151 576 -335 -900 -839 -275 331 626 473
1538 473 54 -651 -523 32 427 782 647 -162 -861 -1103 -863 89 1136 1489 1243 -20 -1378 -1975 -1487
1557 -1487 -101 1264 2152 1902 533 -1079 -2001 -1875 -704 682 1657 1620 798 -353 -1202 -1223 -660 185
1575A85M83j58l12j98j85K22L72O2l40o39n68J31R37J118P08j48j361j699q81
1594b271J9J632J714J401J34j315j952j647m21J130J612J815O09p58j436j504
1610a238n53L65J033J062O64l72o49p51j98L90L37J79m91m68n9M09R23P60K53
1629A596q86j485r99n00J055J649J474O27q75j564j853j012N22J785J853J200
1645B587j58j386j929j254j95J193J458J232J62q35j170n49n6K72P87N8J63m53
1663g3j45O8O65J05J7n73q00n12K7Q92J310P98j77q77j561j033m16J082J785J419
1683B001K72p21j508j649k85L75J373J221O27l73j121j114k75K58N49N53N04l
1701F84n15k62j68J57L60K3k92l28k15j18O47P25L49k48o12r13o25J61J040R70
$$ plain form
1575 185 668 510 198 0 -185 37 409 471 131 -508 -1076 -945 -8 1110 1818 1670 309 -1390 -2271
1594 -2271 -2252 -620 1094 2495 2629 1314 -638 -2285 -2706 -1576 36 1851 2460 1702 266 -1238
1610 -1238 -1791 -1426 -393 669 1333 961 312 -439 -637 -247 90 269 -222 -690 -749 -340 583 1343 1596
1629 1596 710 -775 -1774 -2274 -1219 430 1904 2531 1656 92 -1761 -2773 -2251 -466 1387 2587
1645 2587 2429 1043 -886 -2140 -2335 -1142 316 1548 1710 875 -295 -844 -900 -628 159 217 380 -73
1663 -73 -218 -150 515 620 637 64 -736 -1248 -1221 -329 981 1779 1602 725 -836 -1869 -2285 -1203 582 2001
1683 2001 2273 1552 44 -1605 -1890 -1515 -142 1079 1706 1333 212 -902 -1177 -919 -370 183 687 684
1701 684 169 -93 -261 -104 256 279 -13 -341 -556 -674 -27 698 1047 799 187 -726 -1351 -1190 -150 820
1721H20N80o3p30j078q44j42O71R43J002P6m86q30q07K7K21O21N35K50k68m45
1741E3o04n3M26K47L66j82l31l00Q5K94K63K01M3k67m73k88M5L47L78K86j8j09
1763D09n83k73k36L40L89O08N7m10m39j70k03M01L20K53om65k19q1Q0M23K76q
1785D63k32l47l81k18M37M30L74N4j7n25l87n14M67PP97K52l7l11m44l14J5p8
1807e09M26L08Kj14M6R1j74j49j61j21O4K1L10K35K04M8m27m08j11j22J02N30
1829I1L81J16l1k23o28m43j19L54O48L77J47K9l94m90m08j95K72K87O49J14L68
1850I02m32l20m56l64J45J49M26J66M28J19k45o35j23m86p8K68O05N77R9K8n93
1871A80o68m27L0M03O11M34K98j65l46m21n02j15%M74L48K62M55k98l93m90m15
$$ plain form
1721 820 1400 1337 607 -471 -1315 -1457 -786 157 1159 1235 749 -81 -888 -861 -640 -19 516 766 498 53
1741 53 -551 -604 -178 69 435 253 -78 -378 -293 1 264 465 508 241 -232 -520 -475 -128 250 536 518 409
1763 409 -174 -447 -683 -343 46 654 711 301 -138 -308 -511 -110 210 463 457 -8 -227 -308 -228 195 471 463
1785 463 231 -116 -497 -715 -278 152 526 580 563 38 -349 -863 -396 -389 408 660 623 312 -132 -446 -431 -509
1807 -509 -83 225 227 113 159 250 76 -73 -234 -355 -291 -270 40 275 479 527 100 -308 -419 -541 -439 91
1829 91 472 588 557 334 -294 -737 -856 -502 146 523 670 699 305 -185 -593 -788 -516 -229 420 534 902
1850 902 470 150 -306 -670 -525 -376 50 216 644 763 518 -117 -240 -726 -804 -536 69 646 745 773 180
1871 180 -488 -915 -885 -482 129 563 861 696 350 -71 -573 -688 -688 -214 134 396 851 553 160 -330 -745
1892g45J05R6N61M92K76j07k29n29m02l58P6L97N95N98N3k23l41p50l40j66N91
1913c50N27N39m1l2l62l67m96j22M2L04P47n5J87j16k22l09l48r2P0L59K64K11
1935C38L60r3m57l13n48nJ93O12M13L04j70m78l96n00l6N26L63J91K96J61o03
1956A58l03l99k1K24K98L32Q1J20l60j55j20l4j09J3J39L24M6J30k1k76j75m41
1978e49K7P4M21K39L32J25l26l93m20q6K28K53L79N17k72n03k25k25m2K22M98
1999B74Q4j2j87k03p7M0J96j83K98l15j7L8k5J46LRk9j68nN1J73J79J46l9j99
2024A78l84j62n6K40K66M36k23j97l20k16J78M19j1L27k45k42q8j48J5M21J50
2045C38Mm2m69k81p9N4O77J39Q2j40l45n23n2L05M76L64J2k56m11j87p6K92J60
$$ plain form
1892 -745 -640 -544 17 509 785 678 449 -80 -482 -840 -764 -367 228 826 879 656 315 -435 -775 -941 -350
1913 -350 177 716 675 643 281 -86 -582 -704 -662 -358 389 334 521 405 183 -126 -474 -566 -496 -137 127 338
1935 338 698 605 148 -165 -713 -718 -525 87 500 804 634 156 -240 -740 -776 -250 113 304 600 761 158
1956 158 -145 -544 -565 -341 -43 289 370 490 130 -25 -145 -179 -288 -275 -136 188 234 364 343 67 -108 -549
1978 -549 -522 -448 -27 212 544 669 343 -50 -470 -556 -328 -75 304 821 549 46 -179 -404 -446 -224 274
1999 274 358 346 159 -44 -121 -81 115 -68 230 -85 -102 -64 -89 57 60 69 40 -128 -133 -82 91 270 416 377 178
2024 178 -206 -368 -424 -184 82 518 295 98 -222 -438 -260 159 148 475 230 -12 -100 -248 -233 188 338
2045 338 342 300 -169 -450 -529 -475 202 341 423 283 -62 -585 -637 -332 144 508 520 264 -147 -334 -410 -118 42
2068D2J68L4r4l01j59K24J77K66j04k16k18k31J43K37N83J50k04p31k08l78M3
2089g77P15O21K57j0o08p25m53K25M60N54M48l6k91l53m34l71L97M37K68J43l69
2110I8j09l9j22R1J62J33l86k16J95K40J44M13j12k47p48k13N8M20P10K98J21
2131H91m18o82m83p0K35O07L84M44j54o61m89l12K3K73P31K13p2k15j39k65j97
2152c56J03K63n2j17J51L17j70K93k14j33k88j93r4J13P24R4N1r1l97m58k92J28
2174f18M97L98L67J58l91o26l24l02K29M39O12K10j91k42k83l03l5J61K81P4P6
2195A87J01k08Q7l07N7J5j90P4K2J53K87n1L00m11j71k13j00j9L90K26K07R8l68
2218A66l59m91J52K26L63M17J12j21n12j90l96K41J15N32J52K8m23l1k63Q3K07
$$ plain form
2068 42 210 244 150 -151 -310 -86 91 357 253 37 -181 -412 -269 -32 551 701 497 -234 -442 -820 -777
2089 -777 -62 559 816 806 198 -527 -980 -755 -295 259 707 671 380 27 -407 -778 -381 56 324 467 98
2110 98 -11 -50 -172 -81 81 214 -172 -388 -193 47 191 604 492 245 -503 -716 -658 -238 472 770 891
2131 891 473 -209 -692 -762 -527 80 464 908 754 93 -396 -708 -685 -412 319 532 460 245 106 -159 -356
2152 -356 -253 10 -42 -159 -8 309 139 432 218 85 -203 -396 -490 -377 347 441 492 401 4 -454 -746 -618
2174 -618 -121 277 644 802 411 -215 -539 -841 -612 -173 439 649 458 216 -67 -370 -405 -244 37 111 187
2195 187 288 80 167 -140 -83 -68 -258 -184 -162 -9 278 227 527 116 -55 -268 -368 -387 3 229 436 534 166
2218 166 -193 -684 -532 -306 57 474 586 465 -47 -237 -633 -392 -277 255 407 435 12 -19 -282 -199 8
2239Hk2J66n8j28MNJ23K7l1k34Q2k27J48M6O9L57o9j24m36J70j26J45K97j9J62
2264C35l51k72k1n9J91J97M39j55j99j31j53P3j7J1J99R9j13p1k47K00N1j33J62
2287C5R9j31k33K10j51K00J64L5K0m03q7k9J9K58J88j7j40R7k62Q4J0J85j01j6
2311C4j05l0n7J25J00K31k29j23P0j77j17M11J0K51j81n8j72m13O8K06J07L68
2333C19K15k50l44j52l25K31M58J45p6N6k28q1j75r9K94R5Q0R1l19J51k8l7n9
2356c8k9j41J96j71m0J11L66L7m6j12l68k81L01K30J39K07K3j92l18j73k12J9
2378d92M97Q7M65q7m25k92k35P2K40K82K17j82J6k26j19Om9J80J00M6q1j0M4M9
2402A03r3J30k42r7j25k2L77J98J14o5j73m29j28j64K51O75K55jo5n64l23k53
$$ plain form
2239 8 -14 152 94 -34 -30 -25 98 125 94 -140 -58 -285 -137 -91 -22 335 266 142 -294 -124 -250 -105 192 173 335
2264 335 -16 -288 -309 -368 -177 20 459 304 105 -26 -179 -106 -123 -112 87 186 73 2 -245 -45 6 -127 35
2287 35 134 3 -230 -20 -171 29 193 228 248 -155 -242 -271 -252 6 194 177 37 134 -128 -44 -34 151 50 34
2311 34 -71 -101 -158 -33 67 298 69 -54 16 -161 -278 133 143 394 213 155 -17 -430 -362 -156 -49 319
2333 319 534 284 -60 -212 -537 -306 152 297 221 277 49 -32 -207 -306 -12 83 163 254 -65 86 58 21 -38
2356 -38 -67 -208 -12 -183 -223 -112 254 291 245 133 -235 -516 -215 15 154 361 384 192 -126 -299 -511 -492
2378 -492 5 92 557 470 45 -247 -482 -410 -170 112 329 147 163 -63 -182 -176 -225 -45 55 101 20 10 54 103
2402 103 10 140 -102 -199 -324 -346 31 229 343 278 105 -324 -452 -616 -365 310 565 564 499 -65 -388 -641
2424f41J73M25L20J18j03j17j45l40j16K42J29K14L9j39j5N8m1j50P2J18j25k20
2446b44K35j8K80p9rk04j60j66j2L89L67K9j46j36l12k70J14j25N66J34L33l5
2468E31m08k90l02J11R5M44j05K95j15k93k0p4J77J37l7m6k08o9J95K9J35j69
2490A3m8j22j69L16k7R4K28j19j63j35k30J37J32K99J23M0j92k67k31K0K49J10
2512E8J46J0q7l31j20J54p5K51j5N2N4k35J20J17k10K09j5Pp8j31jJ59R8J9j48
2537Ho7j15j77L52K63j21j8j79n5j0j17J31R2J59J05k24O8j61K5O0J99j97O8j6
2561G3j17j5q6K33P5J67k32j32n0j90K92kQ5J13L1k66r2m2j43L53J0k1Rk9j06
2586h2J1P9J94l45K33k05M5R0J8m0J42j4p4l61K47j70J04L61K5N6l84n3l25J85
$$ plain form
2424 -641 -468 -43 277 395 292 175 30 -310 -426 -184 -55 159 198 59 44 102 61 -89 -17 101 -24 -244
2446 -244 -9 -27 253 174 165 -39 -199 -365 -377 12 379 408 262 126 -186 -456 -342 -467 99 233 566 531
2468 531 123 -167 -469 -358 -263 181 76 371 256 -37 -57 -131 46 183 146 100 -108 -177 18 47 182 13
2490 13 -35 -157 -326 -10 -37 57 285 166 3 -132 -362 -225 -93 206 329 369 177 -90 -321 -301 -52 58
2512 58 204 214 127 -204 -324 -170 -245 6 -9 43 97 -138 -18 99 -111 98 83 90 12 -119 -120 39 137 156 8
2537 8 -59 -174 -351 1 264 143 125 -54 -109 -119 -236 -105 -13 146 251 27 95 -66 -41 19 218 21 89 73
2561 73 -44 -59 -145 88 163 330 98 -34 -84 -274 18 16 101 214 245 -21 -113 -155 -298 55 65 44 53 24 -82
2586 -82 -71 8 202 -143 90 -115 -70 20 38 -2 140 126 52 -309 -62 -232 -128 233 258 314 -70 -123 -448 -263
2610b63K77P2P3Q5j56k62R0p2J2K01J85j11j45NJ10o0j67P4K32k45o9L9m7K11
2634F9J45o1j95k6q0r8J48J21K93n5j09k13k49pP4L14J14J98p7l53j46n5p9K25
2658a02L08Q5j35j56j49j73O9M29k52K29j79r0J44J10l1l5j26n8j14j08K19J76
2680F1J02P8q7j47l65j48J24K85K82L09r5j30m81j79M4L07J34K4K79k72k16j65
2702b56M5J97r8K44j14RJ92j71J14k91J39p7oj0j8J74O9M4M8j28k47j9r5M4L64
2727A53M1Q0j17l35k4j93Q8K08N22r6j33k93l7n6KK02j5J94o2M1j46j27J19j15
2751i9J85r9r8K06j77L2K00k3M0j38j55r5Q5Q5J56J55j24j02j22k35l2K87J98
2774A30N8R8r7k05j38p8J43r6L72K9o7k16j47K26j25J16J44n1k2j00P4j22K7K68
$$ plain form
2610 -263 14 86 159 244 88 -174 -84 -156 -144 57 242 131 -14 -9 101 41 -126 -52 180 -65 -134 -95 -142 69
2634 69 214 153 -42 -68 -148 -246 -98 23 316 261 152 -61 -310 -317 -243 71 185 383 306 -47 -193 -248 -327 -102
2658 -102 206 291 156 0 -149 -322 -253 176 -76 153 -26 -116 28 138 107 72 -54 -112 -226 -334 -115 61
2680 61 163 241 154 7 -358 -506 -382 -97 185 494 399 269 -212 -391 -347 -40 94 118 397 125 -91 -256
2702 -256 -211 -14 -112 132 18 27 219 48 162 -129 10 -67 -73 -83 -101 73 142 186 234 106 -141 -160 -255 -211 153
2727 153 194 274 157 -178 -202 -395 -307 -99 423 327 194 -99 -136 -192 -190 12 -3 191 129 170 24 -103 16 -99
2751 -99 86 -13 -111 95 -82 -50 150 127 167 29 -126 -221 -136 -51 105 260 136 34 -88 -323 -355 -68 130
2774 130 188 286 189 -16 -154 -232 -89 -185 187 216 149 -67 -214 12 -113 3 147 96 74 -26 48 -74 -47 221
2798B21jj06j32j03OR0m3J73p6p1k9N8J4o8j08J36K8K60k77k28K64j06P9J16m9
2823D8R7k93K2P7P7r1K60p4j06j27N3j32K56J65j16j95Q0l9j40K08L0O6K14p7
2847B63k35k2k25K37r3J97J48k06j47q8J43q1Q5l0J05M6j27k4Q3J14j77K17j99
2870a6J28l24K3J65P1K56m5j36k11L2j04J13J8K62M3k94N2j34j51J09O6J38J15
2893A76J0k05l0Lp8K85j57P6j8j26O3p2J47j40J14k54J58j09J83p8J56l6J12k01
2917b1k6j72J67K53j64R1r7J55l01n3n7J88J00P3Q2J0k35q3l2j60J85J28J57p5
2941A13q8j05l3O1K7O5j01j2J38p6p2K31k26jK26k35K8J63j22J34m9K7j7j29K6
2966b7q9j4L21q5j87K36j48j18p0Q5J01P4N5mo0j07J36j65K3m4J74j11m4J57o6
$$ plain form
2798 221 220 114 -18 -121 -115 -25 -68 105 29 -42 -71 -13 1 -67 -175 -39 -11 249 -28 -256 8 -98 -19 97 48
2823 48 145 -148 -126 -49 28 -63 197 123 17 -110 -57 -189 67 232 116 -79 1 -38 -178 30 60 126 340 263
2847 263 28 6 -219 18 -75 122 270 64 -83 -171 -28 -109 -24 -54 51 97 -30 -54 29 143 -34 183 -16
2870 -16 112 -212 -189 -24 47 303 258 122 -89 -57 -161 -48 -30 232 275 -19 33 -101 -252 -143 -77 61 176
2893 176 186 -19 -49 -46 -124 161 4 80 62 -64 -1 -73 74 -66 48 -206 -48 -157 26 -52 104 68 180 -21
2917 -21 -47 -219 -52 201 37 128 31 186 -115 -168 -225 -37 63 136 218 228 -7 -90 -122 -282 -97 31 188 113
2941 113 25 -80 -113 -52 -25 40 -61 -73 65 -11 -83 148 -78 -79 147 -88 -60 103 -19 115 66 93 76 -53 -27
2966 -27 -116 -130 191 106 -81 155 7 -111 -181 -96 5 79 134 130 70 -37 99 -66 -43 -87 87 -24 -68 89 23
2991B3r9J31kn5l1J7O6j1l7O0j88j6k31J90J87J91j48J65k74Q4q1M8m9J21j0k
3017D9J59k27L0k5k51J74O7q3K93j98%Nj61K65j76J00p0O2Q4Q3o6J41k68k7j4
3042e4R8o4M7J02j91o8K79r9J00o5j60r6jK50j60J33qJ70j62k7j40LM2R4o4Q9
3068D8P7p1k45O5Q5K9Q8K0j86K26j19R2m7j85L7J16M4p4j66J45P2P0p9o1k9N7
3094IJ5n1n6qJ79J46k91j20j16J24K13O6j03n4M0j8k1L7mnQ0j14O9j70M4Q8R0
3121F9j89N2l9J53j66O1K10m7Q5l54N4J14j4O8M2M3m1q0j20N8j93K38J65j91K7
3146Ej30K9j1Q6n9J02j76J93K0o8m4j07K52j19K01r0Rl5k04J11J57n0k07J99j60
3171i6J61j9j7R5r9r0j9P8m8L6p1J75J5J16j72q1q9j06Q7K24J29l4j70K6Mj9r
$$ plain form
2991 23 -76 55 53 -2 -33 -16 50 39 2 62 -126 -142 -373 -183 4 195 47 212 -62 22 -59 -11 -60 61 51 49
3017 49 208 -19 11 -14 -265 -91 -24 -107 186 -12 -12 -7 -168 97 -79 21 -49 13 97 180 114 255 -13 -40 -54
3042 -54 44 -20 27 129 -62 -130 149 50 150 85 -75 -171 -172 78 -82 51 43 213 51 24 -116 -113 -71 23 -41 48
3068 48 125 54 -191 -126 -41 -12 76 96 -90 136 17 109 62 -123 -86 30 74 0 -166 -21 51 121 42 -19 -48 9
3094 9 24 -27 -83 -91 88 234 -57 -177 -293 -169 44 110 7 -47 -7 -25 -46 -9 -13 -18 62 -52 17 -153 -109 -21 69
3121 69 -120 -68 -107 46 -120 -59 151 104 189 -165 -111 3 -11 57 99 142 101 21 -99 -41 -234 4 169 -22 5
3146 5 -125 -96 -107 -21 -80 22 -154 39 59 -9 -53 -160 92 -27 174 84 93 58 -146 -35 122 72 -135 64 -96
3171 -96 65 46 29 124 25 -65 -84 -6 -54 -18 -89 86 101 217 45 -36 -125 -231 -144 80 209 175 5 31 35 16 7
3198Gr5J22J37k74P0J7o1R5j33J69j29K7P3qOj4M6j53N1k52L18k17K93Nk0N1m9
3225H2j37j27J16K19J14k73J32p1p3j30Q3l9J97j17j4L1N5j29j52K63L4j49J81
3248I6j21J10k38L37j23J7j06Q5Np5J82m5Qo1q2m5j04L0LJ89m1J33j16k04L42
3273A76q4l21K34K89l72R8rL0L1k26J79%P2j54R5j83Q5L8%K29k60J35r8q7J8J46
3299F1J49r1pj67o9%l2K36L5K2q1j63J66j03k1Mp4J72J41j70j88K10j90R3J38
3324G1P2j94%M4N2q3J19J18k44O1n0m0PK39n0q3l8n3O1k2q0J13M4K4r0j68j5K14
3352B9M9j48P6Qr6O7Q9j29K3J03q2L3j12M0k4J38q8J31j09l2o8J58j02M1PK2l
3379B1M7r9Kr4j1O3J48M5j31J12k03K74k8j06j33P5N5o0J48k32J61j96M6J09N5
$$ plain form
3198 7 -88 34 171 -103 -33 -16 -77 18 -115 54 -75 -48 25 17 23 9 55 -98 -47 -299 19 -198 95 100 80 131 82
3225 82 -55 -182 -66 153 267 -6 126 55 -18 -148 -65 -104 93 -24 -38 -7 48 -81 -233 30 64 -85 96
3248 96 -25 85 -153 184 61 78 -28 57 62 -13 169 124 132 71 -11 -56 -160 -130 -127 62 21 154 38 -166 176
3273 176 92 -229 5 294 -78 20 11 41 72 -154 25 25 97 -57 38 -145 -60 -22 -22 207 -53 82 -16 -103 -85 61
3299 61 210 119 112 -55 -124 -124 -156 80 115 137 56 -107 59 -44 -65 -61 -135 37 178 8 -180 30 -160 -67 71
3324 71 143 -51 -51 -7 45 -38 81 199 -45 16 -34 -74 -67 172 122 39 1 -52 9 -13 -93 20 64 88 -2 -170 -185 29
3352 29 78 -70 6 14 -82 -15 74 -55 -32 71 -11 22 -90 -50 -74 64 -24 107 -2 -34 -102 56 -46 -5 2 24 21
3379 21 68 -31 -29 -123 -134 -71 77 122 -9 103 -100 174 146 40 -93 -18 37 -23 125 -107 54 -142 -96 13 68
3404F8m7l0j7m5J05o8P2Q2j07K2o3J81r4J8o8J13J4l77K06O9K7n3J56Mp6k8k9
3431C5j33k0J27RJ96k12OJ8n6Q4oJ4p6J11j35q%j13J76J3j40J31J08k68MN8J39
3458F2J9k8j34J41K0j04p7P9KM9j6j67J74j6l9J50j07J35k16K6k24J50o7J44J52
3483A08p7NQ2k9j41Q9j78K68p4o0o0kk6R7R5M0r5k5Q0jm1mn6J33M9j84k31J82
3511e6j12Q1K63j37J50j62PrR2J6l1L7k53o2J64j29J4L24j45k3j02P1l3P7Q4R5
3537B21k03M6j33O5o2l3P0J63j12O6k40J72j55R3J63r3Q9k16J35J3r0Q1n2M9r
3562B8O3j91K3nJ06P3N3j51l0Rm0k2J88rN9j56p1k4J37j39L4J75l2j16N5j49K21
3589H9M1q5R6j37p5J11j85J5K77Oj36jQ3j37O7n2J60p3P3j17j42r3J38J73R4j02
$$ plain form
3404 68 21 -9 -26 -71 34 -34 38 120 13 35 -28 153 59 77 9 122 136 -241 -35 34 61 8 164 168 92 64 35
3431 35 -98 -118 9 18 214 2 8 26 -30 54 48 62 -14 97 -38 -46 -46 -159 17 30 -110 21 129 -139 -135 -77 62
3458 62 81 53 -81 60 80 -24 -101 -22 -20 29 13 -154 20 4 -35 115 8 143 -73 -47 -271 -121 -188 -44 108
3483 108 31 36 118 89 -52 37 -141 127 53 -7 -67 -69 -95 2 97 137 42 17 97 96 55 51 -5 128 177 -7 -238 -56
3511 -56 -168 -87 176 39 189 27 34 25 117 133 102 139 -114 -176 -12 -141 -127 197 52 29 -73 -2 -35 42 126 221
3537 221 18 64 -69 -4 -66 -99 -29 134 22 88 -152 20 -135 -42 121 28 117 -99 36 49 -41 40 -12 37 28
3562 28 91 -100 -77 -82 24 97 150 -1 -31 -22 -62 -84 104 95 154 -2 -73 -97 40 -99 -65 110 78 -38 17 -132 89
3589 89 130 45 141 4 -71 40 -145 -130 147 153 17 16 99 -38 29 -23 137 64 137 20 -122 -215 -77 96 190 88
3615H8p7j09OK3J19k06J54Q0N8k04N5j14J53J54j81P2K16k77M9l81K61J95K5o9
3639I0j81K3j52N6J91J57j14l6M2k85K04j48J61K53m3k55N3j88J12N6J87L3j7
3662A99k71Mk3j66L81o1R4j79K9K6k76J00J86L6J53j24k98J15N4j43J65J71k26
3685e4J65j08k4j17J31r3J83k2q3j6k29K72J56j09r2Q3p0M3j7k6R5j18J33r9j11
3710a27J30j71M1K30o6K06k73p8J0O0qJ23J7N8J8k10J8N8k52L57q6pj40Ll7J54
3736B8%O8Rj52J5O4K0l5j32O4j17K20M9k76L9K03L6K7r7Q5j07r1rj89M50O9j37
3763A04k21J28k2j45J58M3NL5j01j70J74j65L00l7j28K0mK0o0P6o6K99j97j11
3787f5j51L35j53N3p8P4R2p0j46O8o7M1J59q0j3j15m5l5J39K07j22P0J02l80J18
$$ plain form
3615 88 11 -98 -92 -69 50 -156 -2 78 136 -68 -13 -127 26 180 -1 71 287 10 59 -322 -61 134 159 90
3639 90 -91 -68 -220 -164 27 184 70 34 76 -209 -5 -153 8 261 218 -37 16 -172 -60 -4 183 216 199
3662 199 -72 -68 -91 -257 124 63 157 -22 7 33 -243 -143 43 79 232 108 -190 -75 -21 -164 1 172 -54
3685 -54 111 3 -21 -138 -7 -100 83 61 -22 -38 -267 5 161 52 -40 43 -27 16 -1 -27 68 -50 83 -16 -127
3710 -127 3 -168 -127 103 37 243 -30 -108 -98 -38 -46 77 94 152 170 -40 -22 36 -216 141 55 48 -92 -89 -126 28
3736 28 28 96 105 -47 -32 32 52 17 -115 -51 -168 52 101 -175 -136 67 103 130 33 118 11 -80 -89 -278 172 241 104
3763 104 -117 11 -11 -156 2 45 50 85 -16 -186 -12 -177 123 86 -42 -22 -26 -6 -66 10 -56 243 46 -65
3787 -65 -216 119 -34 19 -59 15 107 37 -109 -41 -108 -67 92 12 -1 -116 -161 -196 -57 150 28 98 200 -180 -62
3812f2j85K24j11K12P3j45j01Q0q1J06Q6o0J61j48k35N5M5M4o6P6N0O1n7n2j10
3837a40J56j02J20M8q3J27q6k08J5J72j45J19j18J11k09J96L2R5j87Ln6N4J50
3860F4j77K87l16L20j38r5k3K4J83k36n0L35k93p2P7Q4J16J1L6p6Qk20k3R9J33
3885E8j20J5K7K0k51J20J30q3lL28j35j04n2J46j04L1J02j91O7o6o7J30J08lK6
3910A29q9j41J80j59N5J1J20j66k8J78j78M2P2m4Q4k1pJ95l07o8N4K54p4k29L8
3935i9J2N0O2P8j37J17l1k3qj3q7L4k7J11mj12N7m5L9M6L3j16Q1J5j19O0P7q4
3963c3j16K01q0K5n7K5K7o1J79p5o5j14J47J5O5O4j45o8K4P5p8N5j31j2K33q9
3989A1J0O4r6K21n9j38J60j04Lj47l2J03J1m1M7L1j05L5k2J7l7J83j6k07K03j18
$$ plain form
3812 -62 -247 -23 -134 78 151 6 -95 -15 -96 10 96 36 197 49 -186 -131 -86 -42 -108 -32 18 79 22 -30 -140
3837 -140 16 -86 34 82 -1 126 40 -168 -153 19 -126 -7 -125 -14 -223 -27 5 100 -87 -84 -140 -86 64
3860 64 -113 174 -142 178 40 -55 -78 -54 129 -107 -157 178 -115 -187 -110 -26 90 101 137 61 69 -151 -174 -75 58
3885 58 -62 -47 -20 0 -251 -131 -1 -84 -87 241 106 2 -50 96 -8 23 125 -66 1 -65 -132 -2 106 103 129
3910 129 40 -101 79 -80 -25 -14 106 -60 -88 90 -88 -46 26 -18 66 45 38 233 -74 -142 -88 166 92 -137 -99
3935 -99 -87 -37 25 103 -34 83 52 29 21 8 -79 -45 -72 39 35 -77 -20 -65 -26 20 53 -63 18 33 -86 -26 51 -33
3963 -33 -149 52 -28 -3 -60 -35 -8 -69 110 35 -30 -144 3 18 83 147 2 -66 -42 33 -45 10 -121 -133 100 11
3989 11 21 85 -11 210 151 13 173 69 72 -75 -107 -4 7 -34 13 44 -61 -26 -48 -31 -68 115 99 -108 95 -23
4015b3J44m4J9j93J9R8r1n5K6R3ln8J91k47K2J31L2K4N4j80l1Q5NKJ6J4p2O7r1
4044d6kJ9J79l13L49j98j35J55j43K66j39O8o7M4J02j50L8MQ4j79J05K9j64PJ30
4069D3K5q1m6P8j22J24J49j73J28j32Q9j67O9l6J10j05J68j35j55K39j35%K05
4092A40l3qk02J22p0J47Q8k93J53nk5q9LJ47k6Kk1m9J21P7j20j34r2P2J26M1n0
4119B2MM0n0L3k8J19k64R0j35J07R1j80J15Q1P3j16p9Q8l1P9%J2j22J34q9K8L7
4146E9mp5%J89k52j4J83k24J80O4qj51M8R0m3J04o1j57l7J1J75j66J20k05K32
4171E8j91K85j65k17M14q0O0j32j45P3M6J68j23n8J33j65J21o2N1k64K08K8j03
4194f0P8J4p8k7J47p9J12m1n1j80J43L2j00L15j57o1J2k9r0J25r6J50M5j04J24
$$ plain form
4015 -23 121 77 96 -97 -78 20 -71 -126 -100 -7 -10 -68 123 -124 -102 29 61 85 139 -41 -72 13 18 20 36 50 -22 45 -46
4044 -46 -48 -29 150 -163 186 -12 -147 8 -135 131 -8 60 -7 37 139 -11 27 31 115 -64 41 70 -94 -87 43
4069 43 68 -13 -59 19 -103 21 170 -3 125 -7 82 -85 -16 -52 58 -47 121 -14 -169 70 -65 -65 140
4092 140 107 99 -103 19 -51 96 184 -109 44 39 14 -75 -72 75 49 51 30 -19 102 179 59 -75 -167 -95 31 72 22
4119 22 26 66 16 49 21 140 -124 -34 -169 -62 29 -151 -36 45 118 2 -77 11 -20 59 59 71 -51 83 -6 22 59
4146 59 55 -20 -20 169 -83 -97 86 -138 42 106 98 -53 -5 85 42 146 85 -72 -109 -98 77 -89 31 -174 58
4171 58 -133 152 -13 -230 184 104 164 32 -113 -40 6 174 51 -7 126 -39 82 20 71 -193 15 43 -60
4194 -60 18 32 -46 -73 74 -5 107 66 15 -165 -22 10 -90 225 68 7 19 -10 -100 25 -71 79 124 20 144
4219A44j52Oj06k1N71o18M7J19p8R1J65J0m5j1q3q9O4q4J57o6q3L14j78q5Q3p2
4245@j85K17j9P7j67O9l7m7J81q8Q2r7q1l9J47KL9K0j14k7Lnj01L17k61J24j01
4272i1Q5j69K9R1J12N0j07m6n7K64k33P5J27j7o4j32r4J30K0j80J62R5P9n7j01
4297b9J5l2o9J62n6r4J71j33m5kJ27O6r2Rm0O1p9O5k7J9R0n1l1j28J98k13L6J64
4325F2J66q0k25k4J70m8m3J71k01l3L8K7k4k78L96N2r0l7m1J13j08P2R1j49J53
4350A30k24J19oO9M6j67J18p0Jq3pO5r2K02Lj89J04n2j38J94K1l0P0j26J19j81
4376a04J63R8j81l1J23p5N1o2o9m0k5K70n5l3j95RR0RP3M4m3o8J6j14J14j4n5
4403a04N4N9k0p0m0NJ73n7kj44N1N7j39K41o7Q4P2n7j72J03j59K28o0j11K20q0
$$ plain form
4219 144 -8 -2 -108 -129 442 -176 -129 -10 -88 3 168 178 133 122 39 -50 14 -70 87 21 -62 252 74 -11 72 0
4245 0 -185 32 13 90 -77 -8 -45 -92 89 1 83 -14 -95 -134 13 15 54 74 -40 -67 -64 -69 -170 147 -114 10 -91
4272 -91 -6 -175 -146 -55 57 107 0 -46 -103 161 -72 3 130 113 49 -83 -177 -47 -27 -207 -45 50 129 72 -29
4297 -29 -14 -46 -115 47 -9 -103 68 -65 -110 -112 15 81 -11 -2 -42 19 -60 5 -22 -3 87 36 5 -123 75 -138 -102 62
4325 62 228 148 -77 -101 69 21 -22 149 -52 -85 -47 -20 -44 -322 74 126 36 -1 -42 71 -37 35 126 -23 130
4350 130 -94 25 19 88 134 -33 85 15 16 -67 -74 -9 -101 101 104 -85 19 -33 -171 23 44 14 84 -42 77 -104
4376 -104 59 157 -24 -55 68 -7 44 -18 -87 -127 -152 118 63 30 -165 -156 -66 -57 16 60 17 -51 -35 -149 -35 -49 -104
4403 -104 -50 9 -11 -81 -121 -116 57 0 -2 -146 -95 -38 -177 64 -3 81 153 96 -76 27 -132 96 36 -75 145 65
4429F5p4j32L2J94o7p3j5l3J30rL0M5Qj93rm5O5N2r0J36L0P6k83K13n6J44q5M
4457F0OK9J3j75J01J40j91r5J80j11J50j18M6o0Noo1J87k12O1P8OK0M3lr6j44
4484a47R3r5R1P5Kr8R6K4j22N1p9J40joj7K5J02O1k51J23R6j82n1J89j93N6Q8
4511G0j29J11q0lm5l4J49Jk31J75K04j27q9O3L5j4j87O1q3Q8K43l42L9J79j2p4
4537c2j56J95p0N3n2p4M9O9J1J22k8j76j5J04K15k98J37k57J57O2k1l5J3nJ57
4562A25k41P2NJ33j72K20l07K29J2j85J99j39M0p4J59p1P1q5JL3J05k7j48J87
4586A42p8j26P7p1J71j79J1J18j14p7J17K1q1P3Q3k9o4O8q3K77j53n2n1j07K64
4611A57r6K7j48K47j53l8p8J95r0r7J56p8M3J0k36L15j21j01R8m4Q8L3j34p4R0
$$ plain form
4429 65 -9 -141 -109 85 18 -55 -70 -103 27 18 48 93 101 -92 -101 -146 -81 -29 -119 17 47 123 -160 53 -3 141 56 60
4457 60 66 95 108 -67 34 174 -17 -112 68 -43 107 -11 35 -25 -20 -26 -87 100 -112 -51 27 33 53 96 93 -3 -147
4484 -147 -54 -149 -58 17 19 -79 17 41 -81 -30 -109 31 30 24 7 32 134 195 -56 67 163 -19 -70 119 -74 -18 70
4511 70 -59 52 -28 -31 -76 -110 39 40 -191 -16 188 61 -28 35 70 56 -131 -70 -153 -65 178 -164 -125 54 42 -32
4537 -32 -188 7 -63 -10 -62 -136 -87 -18 -7 115 87 -89 -104 0 215 -83 54 -203 -46 16 -5 -40 -27 -32 125
4562 125 -116 -44 -39 94 -78 142 -165 64 76 -109 90 -49 -9 -83 76 5 76 -9 -8 25 130 103 -45 142
4586 142 64 -62 15 -56 115 -64 -53 65 -49 -126 -9 12 -69 4 87 58 -6 62 -21 256 103 51 0 -107 157
4611 157 61 88 -60 187 34 -4 -82 113 23 -74 82 4 47 57 -179 136 15 -86 12 -32 56 89 -45 -119 -29
4636b9P1rQ5Kk29nJ17j5K5l4R6O8j54j5j35K51j23l3J31J20m9k12K11j21L1m8
4662cN8Q4q1r3r0K87n5n8m3J08j12J2j00M8NJ83p4q4o1J29n1K3j02P7l5o1K1J59
4690I1k24O7K60k29j13J87q9J6q4J29O4p7J22k36L4J53p1j02J51j34J86j32oN7
4714B0j75J06q8J68J18j74Np7J50q0L8Q1N9M9j87j62J89o8P2j35O3J58k61J5N5
4739f1K70k40J37K8Ok24q4O9l4K03j1R9j67j9J4k2KJ46j29K60k66K2%l6K28j60
4765C1K2j40q8K83Kk84J93P0j25J7L5q1K3O3j4O3J48j87j18J01p1M4M6K3p0n7
4791g1P3j50K47j73J09O5m7j84J31Q9l6k4J4J6k6j12r1J91K12j31m1p1N5q1n1
4816h7J1K02K7j54j3p9n4J02N7k6R9J61j77k02J63Jp3J90q5j08J94k22J10n9K9
$$ plain form
4636 -29 42 33 118 120 -109 -114 3 -12 13 -21 75 143 -11 -26 -161 90 -33 -66 65 185 136 -76 135 14 45 -3
4662 -3 55 139 58 -35 -125 162 107 49 6 114 2 14 -86 -38 -33 150 76 -8 -69 60 9 32 -70 7 -28 -89 -68 91
4690 91 -133 -66 194 -35 -148 39 -50 -34 -118 11 75 -2 120 -116 -82 71 0 -102 49 -85 101 -31 -37 20
4714 20 -155 -49 -137 31 149 -25 -20 -97 53 -27 11 92 151 200 13 -149 40 -28 44 -91 -28 130 -131 -116 -61
4739 -61 209 -31 106 134 140 -84 -168 -99 -133 70 59 158 -9 -28 -14 -36 -34 112 -17 243 -23 -1 -1 -37 191 31
4765 31 53 -87 -175 108 110 -174 19 89 -36 -19 16 -65 -42 21 7 70 218 31 -87 14 -57 -13 33 56 -14 -71
4791 -71 2 -148 99 -74 35 100 53 -131 0 89 53 29 43 59 33 -79 -170 21 233 102 61 -10 45 -36 -87
4816 -87 -76 126 153 -1 -14 -93 -147 -45 12 -14 85 246 69 -133 30 31 -42 148 63 -45 149 -73 37 -22 7
4841GO8j16J08j41J25L5j22J14j47n3K13n7j65R4o3J32n8J60k34M4P8k14L04P6
4865A88q8j68p0J51k0r7J88J4P4k26J04j23m1R9pK7J4N3o2Lj64RL8J29j57J26
4891fj47J42k79L21j89K33M7j44O8j08J1Q7k7N4k2K2j03j17J92J0j8j36J72m9
4915A4J43k11P9L7j28nJ36p1Op0J30o1J28o4l9l9k3L3R7p5L4R7o5q1Lj16J71p2
4943a2O5N7l10K81K2j64o7K42j19J9k9P4nK6pj87J14k9J56k15L8j2J9k4J06l2
4969GP3j49J60P8k35J70L4j11k8n8K5j4J8N6P6k7m4M0j4m3l6R7o3K5kj65J50o
4997A4j39J89R5k00J87j18m6L1R6m9q1J19j20O7j61J93j4r6j8M1J35j22J38j26
5021A5N0R6k54K56j22j82J2J70m5jO1Rj10m4J38L0q1o1o9Q7l5J32j45l1J77NK0
$$ plain form
4841 7 75 -41 67 -74 51 86 -36 78 -69 -122 91 34 -131 -37 -100 32 -26 134 -100 -56 22 -192 112 188
4865 188 100 -68 -138 13 -7 -104 84 98 172 -54 50 -73 -114 -15 -22 5 19 72 10 13 -151 -142 -104 25 -132 -6
4891 -6 -153 -11 -290 31 -158 75 122 -22 46 -62 -51 36 9 63 41 63 -40 -157 35 45 27 -109 63 14
4915 14 157 -54 25 62 -66 -71 65 -6 0 -70 60 -1 127 63 24 -15 -38 -5 92 17 51 148 83 2 5 -111 60 -12
4943 -12 53 110 -200 81 103 -61 -128 114 -5 14 -15 59 54 80 73 -114 0 -29 127 -88 -50 -62 -43 -67 39 7
4969 7 80 -69 91 169 -66 104 138 27 -1 -59 -34 -48 -30 26 102 75 31 71 57 14 -22 75 12 37 35 -130 20 14
4997 14 -125 64 159 -41 146 28 -18 13 109 60 -21 98 -22 45 -116 77 63 -33 -51 -10 125 3 141 15
5021 15 65 161 -93 163 41 -141 -129 41 -4 -5 56 65 -45 -89 49 79 -2 -63 -132 -45 -80 52 -93 -124 53 58 78
5048G8k9p4NJ10m2j13J19j00pR6K0O9j21r2J93q9p3n6Q1j1J00r8Q1nk2K47j04
5075A63j70n4L0O8M7j65J78j68J35R8Jk55J00o3P0k10K14k1J15k88J63L6n8R9
5099F5Oo7p2mj4R9r7P9r4Q8O1p2K1Kk1J7p2KJ06M0j45K2R7p7j53K37p0mq2O1J34
5130I3r4j8L0M8J7n6q5N8K11k21K1M9J6k5n4J05n2p4J25n9K8q9K4l8o8K11p7N3
5158G9l7j52KM5q9J25K22k04j4O0j64J71Q4q2j60J70r9%J33j78O7J4J1K6j50J14
5184fK4n2K1L3M3o9j1p1R0qP4k9j97R7j15N3J30J16k89J03M6j75L33j27n3L2n
5211a2O5j05l8J47j17k2J63q9J56l1j05j1OJ23k15K6K96l08J90j18n5r8K06l7
5235A7q3Q6n5R0k06J29J06j07q6J70k00K67k93P6J94j59k9J0J3K31j39j32J70
$$ plain form
5048 78 49 -25 -20 90 48 -65 54 -46 -53 43 63 132 11 -81 112 23 -50 -106 -25 -36 64 -34 47 42 20 267 163
5075 163 -7 -61 -31 37 84 -81 97 -71 64 162 163 -92 8 -55 15 -195 19 -2 113 -175 -12 24 -34 65
5099 65 71 4 -68 -72 -86 13 -84 -5 -99 -11 50 -22 -1 1 -20 -3 -75 -73 33 73 -72 -50 47 -30 -183 54 -16 -20 -102 -41 93
5130 93 -1 -19 11 59 76 20 -65 -7 204 -17 4 53 69 44 -10 95 43 -31 94 35 63 -26 -2 -40 -108 103 26 79
5158 79 42 -110 -108 -63 -152 -27 195 -9 -23 37 -127 44 128 46 -114 56 -43 -43 90 -88 -21 -7 4 30 -120 -6
5184 -6 18 -34 -13 20 63 -6 -17 -88 2 -6 68 39 -158 -61 -176 -123 7 123 -166 -63 -17 -192 141 14 -39 -7 -12
5211 -12 53 -52 -90 57 -60 -82 81 -8 148 117 12 1 7 130 -85 -59 237 -71 119 1 -54 -152 54 17
5235 17 -66 20 -35 55 -151 -22 84 -23 -109 61 -139 128 -165 -89 105 -54 -83 -73 -60 171 32 -100 70
5258G0p0N1r1O0q7O3o8PO3q2K18k21lJ95mm9m1o6J03k27K29l3q8k5K3k5l5J1J76
5287E4k2j4Ko6l2j19K22j09J08J5J27j54j1Nj53K53j14J9J60k55R1Kpj89P0K12
5313I5j20r0N3K8J23j92J03l7k0K9r8J48l8K0J73k95lK09K2j69J76j79Q1NK9j8
5339C5r9J3o2J84r1Q4n0O6qj60P0o5R6L3j7P2o4o1q0M1O2jj13K06j6k4k0L5J02
5368A68n6q2j80K80j79J57j17j15J13j29R9j5J99j26p2O8m9n8Q8n3O3k9j53J27
5392e1R4j06l2J2Q8o3Q3P3R2q8%q3N2r2J54j83J11r9O4L8n6j10O6N7J7n5J58l59
5420b18L29o9m6N2Oj41KO8M9O6q7j66J17Q2k8K6j12J04j52J63o4j54J54J35k8
5445H8k3pl9k6r4J33j01Q2N1j2Rk61K61J4l6j12Oq6J86p3j06K65k65K52j25J23
$$ plain form
5258 70 0 51 -40 20 -67 -4 -72 -65 -2 -84 134 -87 -90 105 101 52 11 -55 48 -179 50 17 -71 -96 -73 -98 -133 -122 54
5287 54 32 18 20 -46 -78 -197 25 -84 24 39 166 12 1 6 -147 106 -8 11 171 -84 7 9 2 -187 -117 95
5313 95 -25 -115 -62 -34 89 -103 0 -37 -57 -28 -126 22 -16 4 177 -118 -121 88 110 -59 117 -62 19 24 53 35
5339 35 -64 -51 -113 71 -20 64 14 80 72 -88 -18 -83 13 46 29 101 37 -24 -104 -63 -1 -2 -115 91 75 51 31 66 168
5368 168 112 30 -150 130 -49 108 -9 -124 -11 -140 -41 -56 143 17 -55 13 -36 -94 -6 -59 4 -25 -178 -51
5392 -51 43 -63 -95 -83 5 -58 25 98 190 102 102 19 71 -21 133 -50 61 -38 26 64 8 -102 -36 21 38 -17 141 -218
5420 -218 111 42 -4 48 54 -87 -85 -17 32 98 11 -155 -38 44 16 42 -70 34 -118 45 -19 -173 -19 116 88
5445 88 65 58 19 -7 -101 32 -69 13 64 52 61 -200 61 75 39 -73 -67 -153 33 -40 -146 119 -146 106 -19 104
5471A04j54q2K24j25K8j0Q2j30J85j90J29P9K3k54J16j13O0M4k7j5OK06k71M2
5495d3R2l9J9mq7P1L2q6P0j57K03q2N6J11k6j90L7m6K36j84Qj2j74J59J00q5j10
5522a31J41q7J68j25o1K06j15o3m8J69j28kK8K53m17Q6J58l1k4M3r7J74j97J86
5546H6nk95J86R4r7L0n4J76j04Q3k76K03p7J86qk58K93j55ko9K04l12K42q6J09
5571I4o7P6j10Lo0O0N1K3Mj48j21J38N3k5J02j01R2j5mj08L3O1J2j11k4j4lJ71
5599F2j23J17k6j9o1J9pn5m8J24o8o9J73O0Rj48J52j25J52jj56Kq5Q5J08j38L7
5626b9K08j31k4q2J83j98l9M6o4J4M1J09q6J08o8J4j6J16p0j99K94m19K61j99
5650b30J71Q6noM4j00N1o7J93j45m6om7J20M5j55N7R0J45k55P8k9k26L34j92l2
$$ plain form
5471 104 -50 -132 92 -33 -5 -15 67 -63 122 -68 61 140 163 -91 25 -88 -28 16 -11 -26 -20 186 -85 -43
5495 -43 49 10 29 25 -62 9 41 -45 25 -132 71 -11 45 156 130 -60 -23 -69 167 -17 -9 -21 -195 -36 64 -21 -131
5522 -131 10 -77 91 -34 -95 111 -4 -67 -115 54 -74 -76 -48 205 -212 -126 32 1 -23 20 -77 97 -100 86
5546 86 81 -214 -28 66 -31 -1 -55 121 17 100 -176 27 -50 136 128 -130 163 8 6 -63 141 -171 71 -15 94
5571 94 27 103 -7 -4 -64 -4 47 70 74 -74 -195 -57 -4 -29 73 -28 64 49 45 -63 -30 31 43 -68 -92 -106 -109 62
5599 62 -61 56 30 11 -50 -31 -38 -93 -141 -17 -85 -154 19 79 88 -60 92 -33 119 118 -38 -36 -121 -36 72 -66 -29
5626 -29 179 48 24 -58 125 -73 -112 -66 -130 -116 -75 34 -52 56 -12 2 -14 102 32 -167 127 -292 -31 -230
5650 -230 -59 27 22 16 60 -40 11 -56 137 -8 -54 -60 -107 13 58 -97 -40 50 195 -60 18 -11 -237 97 -95 -127
5676a27K09j81K06Q5l17K12l67K97q6K84n9m2k29K30j41k1j1LnO1j56K27l3j05
5700f6l5Q1J60k16J11K6j48R8l7L3l7p9K01o1k0r1J49j11M7jJ4J2l5r5Q1l7m4
5727a00O1J13j10N8j55K4J16j7N6m5R5K8k3k3M2j21L5j54J22J4j01L3O7k2J75
5752A68r5k17J6J29j0Pp9J45L3k40K34j45M3Mn1k6P6k20L03l1M2M0j7j6q3K5q1
5779d6Q3r1J5M2j33J86l0j20L3J95k58J69roM0q7O3N1j12o6M1R8m6L9L7j52j27
5806a91K16k7O4k0o6N5K0m9j6j55L8K60o9mJ05k54o5N3L6J76k22J37k1l1J59j40
5832a1j9J80l12J39o9K90j79q6j72K13p8O7j5K00k26n7q0J73L7j4L1L0K6j66J18
5857B0o6J06q6M1j46M7O2M7j49J11m5J48j99M4O2L1j32L2O3j03J03J38p2N3o9
$$ plain form
5676 -127 82 -99 107 192 -125 87 -280 17 -69 215 156 114 -115 115 -26 -47 -58 -55 -60 1 -155 72 39 -66
5700 -66 -101 -20 140 -76 35 61 -87 11 -26 7 -30 -109 92 31 11 -80 69 -42 5 4 18 30 -5 -100 -19 -56 -100
5727 -100 -39 74 -36 22 -133 -109 7 -10 46 1 96 124 101 78 120 -1 34 -120 2 16 -85 -52 15 -7 168
5752 168 73 -144 -128 1 -9 -2 -81 64 97 -143 91 -54 -11 -7 -58 -84 -8 -228 75 44 86 126 109 93 10 35 -46
5779 -46 37 -54 -39 3 -130 56 26 -94 -61 134 -124 45 36 30 70 -17 46 97 -15 -81 -40 58 12 51 88 -64 -191
5806 -191 25 -2 62 42 -24 31 51 2 -14 -169 -131 129 60 56 161 -93 -158 -105 -69 107 -115 22 1 -30 129 -11
5832 -11 -30 150 -162 -23 -92 198 19 -67 -239 -26 -104 -37 -52 148 -78 -135 -215 -42 -5 -19 12 42 68 -98 20
5857 20 -46 60 -26 15 -131 -84 -22 25 -124 -13 -58 90 -109 -65 -3 28 -104 -72 -9 -112 -9 129 57 110 41
5882D1j23J72j39Q6J33j68qJ77k14J8M6J6j61n5K12j23J2J82j36J79r4p2N5j65
5906a29N9M1l9R4Oj6mq2o4L2J74j36j2O2j3J34r3N0n0j07j8J56r9N2j03J34J39
5933A68j92l8J29J28l78J11J46j49Q4Q3j00p1N4nL1o8m3q1Q2L9l1Q5J7J64k45
5958h0P1m7J27j66K22k09j6PQ6L9J1r2K29k48J35J1j02MO7L6L8Qm5j06LJ05j53
5985f5N7rk6j0j14J46L0R2j53J56l04K37n2J2J5N1Pp7JJ35j33M5r1J3M6l4j6p5
6013a16O1j37K64r2J32J1k73J12J16J6j91K6O3l5Q4k26J64L8j01P4P2r6O8j19
6037h5J52j33p3P2o6J79Lr0J57k21J85m6j54J29L0j1O7m0q1j4k3K23j80k46M48
6062A82l21J38K7j33L7K9m4K60k49j29J9J80O3P6k50K90n0k07M4Q3p7r6N0R8O5
$$ plain form
5882 41 -82 90 -49 37 170 2 -6 171 -43 -25 21 37 -124 -179 33 -90 -78 104 -32 147 53 -19 36 -129
5906 -129 -70 -29 -68 26 32 16 12 -70 -134 -102 72 -64 -76 -14 -27 107 14 64 14 -93 -111 45 -54 -2 -105 29 168
5933 168 -24 -62 67 195 -183 -72 74 -75 9 92 -8 -79 -25 -30 1 -67 -110 -191 -109 -70 -101 -16 1 165 -80
5958 -80 -9 -56 71 -95 127 -82 -98 -91 -5 34 45 -47 182 -66 69 80 -22 -18 49 85 123 131 86 -20 -17 88 -65
5985 -65 -8 -17 -43 -53 -167 -21 9 101 -52 104 -200 37 -15 -3 12 63 70 -7 -6 129 -4 41 -50 -37 9 -25 -41 -116
6013 -116 -55 -192 72 -20 112 123 -150 -38 78 94 -97 -71 -8 -43 41 -185 -21 17 -84 -10 62 -34 34 -85
6037 -85 67 -66 -139 -67 -133 46 49 -41 116 -105 80 34 -120 9 39 28 95 55 -26 -40 -63 160 -20 -266 182
6062 182 -139 -1 26 -107 -70 -41 -85 175 -74 -203 -184 -4 59 135 -115 175 125 -82 -38 45 -32 -128 -78 20 85
6087H5j63J41j24k4j9l4J31L9Q3L5j94J87j88K1j7nk0J94j46j08J23j38j9K83
6111A23j6p5j78J20J20o0J10j75j9jp3M6K04k53J34j13L5M1K3rQ3M3k63J66m6
6136c3M9j23J71q6p4Q3J26J1j97J40o4q7K63j14Kk62K41o1M1L1o0J03j06o2L4
6161c4J03o2o0l0J16j67K42j72K12j11j47R5L9k2j02J7n5K05M4j06j1q6J08kk
6186A2N8kq4l6J3L9k9PJ93j28J9K6m0j10q4J10R9k2j16L4QJ5R3Q6j12o7j00K49
6214A31k9r2Q2m4j2j58J79j36Q2j8pJ46j19L0n8j28K33L5j28mJJ21r5l9K8k11
6240b10K83p5j7j61L1K53q2o2j04J62M7p%n3J9nM0j37J02K2Q8j95l0pJ89j87O5
6267c1J09j25J21q7L7j23J12J57j13j47J58r4MJ42j4Qo7k6J83l89k6K85L6j54
$$ plain form
6087 85 -78 63 -61 -85 -104 -138 -7 32 115 150 -44 143 -45 -24 -41 -46 -66 128 -18 -126 -3 -141 -160 123
6111 123 107 32 -146 -26 94 34 144 -31 -50 -51 -124 -78 126 -127 7 -106 -71 -30 -7 -16 67 110 -153 13 -33
6136 -33 16 -107 64 -22 -96 -13 113 124 -73 67 3 -84 179 65 67 -195 46 -15 26 57 -3 100 -6 -68 -34
6161 -34 69 7 -53 -83 33 -134 108 -64 148 37 -110 -15 24 2 -100 -83 -138 67 111 5 -6 -92 16 14 12
6186 12 70 68 -16 -52 -39 0 -29 -22 171 43 62 88 48 -62 -146 -36 63 41 -75 -41 -33 -18 75 161 49 -18 -118 131
6214 131 102 10 92 48 36 -122 57 -79 3 -15 -22 124 5 35 -23 -151 82 117 -11 -15 -14 107 12 -27 1 -210
6240 -210 73 -2 -19 -180 -149 104 22 -40 -144 18 65 58 58 5 24 19 59 -78 24 46 134 -61 -91 -98 91 -96 -31
6267 -31 78 -47 74 -13 24 -99 13 170 57 -90 68 -26 -22 120 106 114 47 21 204 -185 -211 74 110 -44
6291d4jJ92q5p6jL5l6P5Qk14K49o0j26J08j41J72N5j44M1p3J10M0j32O8j3K0j23
6318i6O6K6n6J00r2J69j31O1%j93J20J74j42j2j14J06K3P6q4K1j09J8N3m9o0k
6344a27J95j44j4J21M0p0m7M6J68k60Q4o0J4J09j03J22j52l7J50j12R8m2oKJ17
6369I2j17n1J65m2M8l29L40r7p8J21j47m9J75j18J73m5l1j25j8L6P8m8J24j98
6393a41N0J59K2m3n3m9jl5Q7J31j95P5l1J02q3j3n5M6Q2p1q7J46R1%j28j5j73
6420a82J88J8J17pj04K0o7J05K4k34Q5Q7Rj22O8j11J72n8K0L1M0J16j30K3j53
6445d5j31J78q0J31M4k10K8Q5Jj31J59M7r2q1K38j23l4j4J27p6n6M9K6j4PJ1O0
6472A04j53K0M1O4Q3p3k5j18J42n0j42K83k45Q9k0M0k7j19l6J26l1K56j38j02
$$ plain form
6291 -44 -45 147 62 -14 -15 20 -16 59 67 -147 102 42 -84 24 -117 55 110 -34 7 -66 44 84 -48 20 7 27 -96
6318 -96 -30 -4 -60 40 -52 117 -14 47 47 -146 -26 148 6 -6 -120 -14 9 85 1 22 -87 -69 -16 -65 -125 -127
6344 -127 68 -76 -90 31 71 1 -46 0 168 -92 -8 -68 -54 55 -48 74 -78 -115 35 -77 21 -21 -27 -25 92
6369 92 -25 -76 89 47 95 -234 106 9 -69 52 -95 -144 31 -87 86 41 10 -115 -133 -97 -19 -67 57 -141
6393 -141 -91 68 90 47 -6 -55 -56 -91 -4 127 -68 7 -24 78 -5 -18 -73 -27 55 -16 -103 43 134 134 6 -9 -182
6420 -182 6 24 141 134 30 50 -17 88 112 -122 -37 50 59 -63 5 -106 66 8 28 59 99 215 85 108 -45
6445 -45 -176 2 -78 53 97 -113 -85 0 1 -130 29 76 -16 -97 141 18 -16 -30 97 21 -35 14 40 26 33 44 104
6472 104 -49 -29 12 76 159 86 61 -57 85 35 -107 176 -69 20 0 40 13 -106 -142 -16 -47 209 71 -31
6496c1p4K11j90R0J47Q2k60K01j08r8mm8K73j79J94k75J02k17J35k1J24O3j66
6519d9J5r2O8pL9N7j49J77j22M7k4p8L46k47N6j05N7l6j7n5J4J56O6k16P3J50
6545A24k8j08n6j4n6O2k8L7R1Ql2q5K08r2k26J7J53Q0k07J3P8p4K27q3j3J81j84
6572gJ44q3k57J54n9J98r1J38j05q6J38k65J94j97J76KR6n2j4l7j16N6O0qL1j20
6598a10J9J19o4j4J44j16L8n0N6q9J02r2K12j05J8m8Q9J14k33N1j00K3l3J80j32
6623b1o9Q5J13j61P5k0L8k19K37j48L3j36J31K94k70j06J1K36K4j70J45j44m9
6646i1J78n5J20k76K76q4j27M6K7l9j8QJ04r9J70k41L5J25j1NJ2q8K0M4qj5m4
6673b6k0KP0m3K2rl1J29%kj57n9J55M2J1O5p5k4n0J48r8j43L7K14j69L3O1m4l2
$$ plain form
6496 -31 -105 106 -84 6 153 235 -25 176 68 -30 -34 -82 191 12 206 -69 33 -184 -49 -70 54 117 -49
6519 -49 -34 -126 -58 -65 -26 31 -118 59 -63 -16 -40 -118 228 -19 37 -68 -11 -47 -64 -119 -105 51 117 -99 -26 124
6545 124 96 -12 -68 -82 -138 -76 -104 -67 24 32 0 -85 123 31 -195 -178 -25 55 -152 -139 -61 -135 92 9 -4 177 -7
6572 -7 137 54 -203 -49 -108 90 -1 137 32 -54 84 -181 13 -184 -8 -6 90 38 24 -13 -129 -73 -13 -21 10 -110
6598 -110 -91 28 -36 -50 94 -22 16 -34 22 -67 35 -57 155 50 68 20 109 223 -10 41 -59 -36 -69 111 -21
6623 -21 -90 -5 108 -53 22 2 40 -179 58 -90 -57 -193 -62 232 -38 -144 -133 103 127 -43 102 -42 -91
6646 -91 87 32 152 -124 152 68 -59 -13 14 -25 -43 -35 69 -30 140 -101 -66 59 48 53 65 -23 -3 41 33 18 -26
6673 -26 -46 -44 26 -17 5 -4 -35 94 94 92 -65 -124 31 73 84 149 74 50 0 148 50 -93 -56 158 -11 22 83 39 7
6702GJ7J50j89J1n2J14l6N9o5j23J71m7O1j56j75L90j09K6k2P6k49J86l7r0J95
6727A13k3L3r2O6m2j33J56j6J2j25NN7O7j22L7o9M0O9J2J5j65R3j15J14J99j49
6753C7p2Lr4J32o7L0J48j26p3J74k07J29r5J49P1k51J40n2K54k35M3j17O9p3J53
6778G0k06J53Pl6K1M7k7r0l4M7N9n2L6L6M6M5l7k07Q9J6K10j24j37j6R2J57j00
6805F5q5J24j85M4K7Q9J4J38k64O2J7oj48O2J02j37j4Q1Nj07J48j08nJ10j05L2
6831d4M9j47J46k32J62l0P8q0J1J99j36j15J68n0J63j22k6M3k6j36J73M2l0m5
6855A5M5j21Q5j9o7K2J05p8K9K7j10N0nL4Lp5m1J11j02jM8P2R1j38J97j85O6q3
6883b5J26j08j12J49j20J59j22j5J73k85J92k4m5j02J31n5Q8J10k41J69j81J87
$$ plain form
6702 7 24 174 -15 -4 -56 58 22 81 16 -107 64 17 78 -78 -253 137 28 54 32 108 -141 45 8 -82 113
6727 113 90 123 31 97 55 -78 78 62 74 -51 -46 11 78 -44 -7 -76 -36 33 45 60 -105 -12 -127 -13 186 37
6753 37 -35 -32 -126 6 -61 -31 117 -9 -82 92 -115 14 -81 68 139 -112 28 -24 230 -5 38 -79 -10 -83 70
6778 70 -136 17 24 -12 9 56 29 -61 -95 -48 11 -41 -5 31 77 122 85 -122 -33 -17 193 69 -68 -84 8 165 65
6805 65 -20 104 -81 -37 -10 79 93 231 -33 29 46 40 -108 -46 56 -81 -95 -14 -9 -116 32 -76 -81 29 -76 -44
6831 -44 5 -142 4 -228 -66 -96 -18 -98 -87 112 -24 -139 29 -21 142 20 -6 37 11 -125 48 90 60 15
6855 15 60 -61 24 5 -62 -40 65 -13 16 43 -67 -17 -22 12 15 -60 -101 10 -92 -93 -45 27 118 -20 177 -8 58 -25
6883 -25 101 -7 -119 30 -90 69 -53 -68 105 -180 12 -12 -57 -159 -28 -83 5 115 -126 43 -138 49
6905D9K5j56R8o8J19rq0n0P4J2L8o6O6j21J17r6R8o4j50K21j16O4j5p2J19jN1
6932H7k10Q5K13k57N4N9N0o6Mk9J33j99K2K6R1L4K0k8k4k68J48R9n2m4J84j78
6958d6m2O5N8K04k84j4M2M8N0j75K3R5Jj13K4J38o4j10J10P1o1J05j05M1p1N8
6984D8j97K34M0N5j51m2Qj73J89P6l4p9j9R8j03J23n9P8J37k03n1j19J39J18k44
7009a31J29M0Q6j65p8j3K43k19J03k3J2N8R2j3j73J37j30O7q2J7J11j75N5J05
7033E3o5K63k97Q1m9l5l3K3J76o9q3J01K6r5Q5J4j36J01j56J78j03M5j01O6n7
7058f7R5n9p3J70Q5j60K4l8N9Q2j93P1o3O5j15K09n6k8J82p8j10J03l7k26J40
7083a8J03k85L6K23m6j04Q3o1J70n1l1j3NO8k01K89k87K10L2m8n5o7j4Q2l2p3
$$ plain form
6905 49 74 -82 16 -52 67 58 -22 -72 2 14 52 -14 52 -69 48 -48 50 -14 -164 57 -59 5 -10 -82 37 36 87
6932 87 -123 -38 175 -82 -28 31 81 15 19 -10 123 -76 -54 -28 63 97 117 89 65 -203 -55 44 -8 -52 132 -46
6958 -46 -88 -23 35 239 -45 -59 -17 31 81 -94 -71 24 25 -88 -64 74 10 -100 10 81 20 125 20 61 -10 48
6984 48 -149 85 125 180 29 -13 -5 -178 11 87 53 -26 -45 53 -50 73 14 92 229 26 -25 -144 -5 113 -131
7009 -131 -2 38 124 -41 -119 -132 111 -108 -5 -28 -16 42 134 121 -52 85 -45 22 -60 -43 68 -107 -52 53
7033 53 -12 251 -46 35 -14 -49 -82 -59 117 48 -35 66 92 -3 82 96 -40 61 -95 83 -20 25 -76 -10 -67
7058 -67 28 -31 -104 66 151 -9 15 -23 36 118 -75 -4 -67 -2 -117 92 36 8 190 112 2 105 68 -158 -18
7083 -18 85 -200 -164 59 13 -91 -8 -69 101 50 19 6 11 79 -122 167 -120 90 122 74 19 -48 -62 20 -12 -85
7109h5J57j35J1O1M5k27O2J49q3j1l1R4Kj4o4qQ2O5oj09K21l99K90K3r8j11P1
7136d8J45j05l9o8J60j71Q2J00K7j07R2j12q4J64J38j92Q8k74R1L7O5J09q9j10
7160a01J38j8ol8K5J44j50J44j74Q1r3J52j38m2J54j19Q6j45N4P2J35j19n9q6
7184a03l7P6k6P5RR4mjj16J18Ok62J33N4J34j88r0J49N7j2r7R4j88J95j42L5J51
7211A14J8j05J44k47J39r9J82j48J7j57J65J00j40J18j74J21j70J94J1k5k55L01
7233A04j0j74L2j03J30m6J16L3o9n4lL4jL9n9QR6j27N0O5j72K03j30Q7l0q5J6
7260e0K1N8M6J06r4j48O7j37J55P4j73J2J09q6j10L6L3L3J24l9j19k2J19M1k0
7285C6J1j52J85n9j84K57k8Lq2L8j04m4J6No8K95n8l5p2J32j9j9n0rq0J01p1J12
$$ plain form
7109 -85 72 -63 -52 9 54 -173 -111 38 -45 -56 -87 7 9 -5 -69 -77 5 70 64 -45 176 -223 67 90 -8 -119 -48
7136 -48 97 -8 -47 -115 45 -126 -44 56 83 -24 68 -44 -128 36 174 -18 70 -204 -113 -76 -11 98 9 -101
7160 -101 37 19 13 -25 0 144 -6 138 -36 45 -48 104 -34 -76 78 -41 45 -100 -46 26 161 42 -17 -103
7184 -103 -140 -64 -90 -15 -6 88 84 83 -33 85 91 -171 -38 16 150 -38 -128 21 78 66 -31 63 -125 70 -72 -37 114
7211 114 132 27 171 -76 63 -36 146 -2 15 -142 23 123 -17 101 -73 48 -122 72 83 58 -197 104
7233 104 94 -80 -48 -151 -21 -67 49 82 13 -41 -44 -10 -11 28 -31 -23 73 -54 -4 61 -111 92 -38 49 19 -66 -50
7260 -50 -29 29 75 181 87 -61 6 -131 24 98 -75 -63 46 -40 -150 -114 -81 -48 76 37 -82 -104 15 56 36
7285 36 47 -105 80 21 -163 94 66 69 -13 25 -79 -123 -107 -102 -170 125 67 32 -40 92 73 54 4 -5 -85 16 -55 57
7313E7k69K61J9n7j44R1J16j24N5r5Q5j00j1m0Q2Q2J36j90l5J19k02J59J9k6n5
7338f7K06l0j71O2k0n7K38M8k86L8J11j46n7J20L8k37K98N6J7k27n1K42j43J14
7362I6m1r0P2K3N4N4j53J92j05p7r2O9j21O4NL8J07j59L3l3O9o5N0J66k06m0J74
7389H4m2P3j12j7r7Q8j40K86k88M7N7J48m7l4N1j59K5O9J70j53m6l4O9M2j2mJ8
7416D2O8n9j36Q8Q8j53%j5K19j23J0k0r6K71j62o6K1L3J43k86K50m6N2j81J33
7441G5n1r7m9K01r7m7P3L2l7l1J24q2m1J58q4J4Q6k33J06j30J38j94J62NO0n3
7467Hl0j2n0K33j2k29k2m4K30j09o1k1P3K8J6j04R7J02K53k88o3r2Q2p9R7l9j1
7494d7K3m0J7j01K56j18K05j24o9K0M4m0j7j32J84r5j1J02n4J3L9j39J17J39j51
$$ plain form
7313 57 -212 49 68 11 -133 -42 74 -50 5 -90 -5 -105 -116 -156 -74 8 144 -46 -81 38 -164 -5 14 -12 -67
7338 -67 139 109 -62 0 -20 -77 161 209 -77 -39 72 -74 -131 -11 27 -210 88 144 161 -66 -117 125 -18 96
7362 96 55 -35 37 60 114 168 15 207 102 25 -67 2 -119 -55 -50 -12 95 -64 -31 -64 5 -60 -10 156 -50 -90 84
7389 84 42 115 3 -14 -111 -23 -163 123 -165 -118 -61 87 40 6 57 -102 -77 -8 162 9 -37 -71 -2 40 28 24 42
7416 42 110 51 -85 3 91 -62 -62 -77 142 19 29 9 -87 184 22 -44 -23 10 153 -133 117 71 123 -58 75
7441 75 24 -73 -122 79 -18 -65 8 40 3 -28 96 14 -27 131 47 61 147 -86 20 -110 28 -166 -4 1 61 8
7467 8 -22 -34 -84 149 137 -92 -114 -158 72 -37 -98 -119 -46 -18 -2 -106 -9 93 346 58 -5 -97 -15 -94 3 -36 -47
7494 -47 -24 -64 -47 -148 108 -10 195 71 2 22 66 26 9 -123 61 -34 -45 57 3 16 55 -84 33 172 21
7519B1L4l0o6N6n2N6M1j17J07qj17K0J8J89m5n6J0p3kJ9RK4q4P0lj6Q7j53Q7m
7549B2p6j32K32J25k43l1J41j22K4J36J2J2k9q1kr9P9qJ67k12O9p3R7M6k3j22
7575i1m0J1P3J25Q7j97J22k1j23J24o5m7J26j03oL35k99j6l9J52k00J69m4rkJ29
7601A51p2n5j71J01J75k18RJ80m2p3R2j31J36j12l6N5j15J02M4K4Nj12m1j21K86
7626F1p9K7O3m4M5K5j35j4J26j98K00o6j44J07n3J7O6ll2r7P5K5k6J14P1k66K19
7653H4Lj56J79k61P5j9L37k85k8o1J06L5j01J61k71K83j13M5j07q6J92J7J8j08
7677f1P8p0J02R8k32J07l7J52j53j80J39n3J01j10L46k95J79j22M2n0NK8l5p1
7701i2J75j41N5o7J92Rj26M5j03o3J31j45J51oj14J51j33n8J05L0jM2N8l6MJ1
$$ plain form
7519 21 55 25 -41 15 -37 19 60 -57 50 42 -75 -55 -37 152 107 51 61 -12 -14 5 14 38 -46 24 21 5 92 -61 26 22
7549 22 -54 -186 46 171 -72 -103 38 -84 -60 76 88 100 71 -10 -12 -111 -32 -40 127 -85 -16 -89 8 54 31 -91
7575 -91 -131 -120 -47 78 165 -32 90 69 -54 70 5 -42 84 -19 -25 310 11 -5 -44 108 -92 77 33 24 22 151
7601 151 79 24 -147 -46 129 -89 -80 100 58 -15 77 -54 82 -30 -66 -11 -126 -24 20 44 49 -63 -104 -225 61
7626 61 -18 9 72 28 73 98 -37 -51 75 -123 77 11 -133 -26 -79 -62 4 1 -31 -128 -53 -28 -54 60 131 -135 84
7653 84 87 -69 110 -151 -76 -95 242 -43 -71 -132 -26 9 -92 69 -202 81 -32 13 -94 -180 12 29 47 -61
7677 -61 17 -53 49 147 -85 22 -15 137 -16 -196 -57 -110 -9 -119 227 -68 111 -11 31 -19 -14 14 -21 -92
7701 -92 83 -58 -3 -70 122 131 5 50 -53 -116 15 -130 21 15 -99 52 -81 -139 -34 -4 -5 37 95 59 63 74
7727G4N5j08n2J12N5k04jl4RR2L8J30k88J45j9Mjq1j03K42l9J63k92J67p5Q5l3
7754D1P7L3k77J08Q4p8J22j34K14k37R3J1j24o3K6J98k15q5K0O8n6K25j92J10
7778c1l2J09m6L6J3J2L7k96K13J34k71m9K48p2j00K19p8q0J42o8kJ06j82O9o8
7803c7J13q1j29J32kj29J25m0kJ12j03M7k23O9N1k4J35n4m3J36L0p5P0j69n9K20
7829G0j01L4j6m2p7M7M1J31j16mM6q%p1J67j14K85l00M8j50P5J34j14L0p8L12
7855B29j83j16J36J0j67N7J69j94j38L09k7m8p5K13k68M1Mm9K51j74j5J90j55
7878@m7j06R5R1j34P3l3J78j04N8j82P5M8j25K1n3J68O9k93J73K5n0L7J98j66
7903A6R9j46J9j2K66k08n1J15j31J6N0r1m3J83k02N7o7L8J51j95L02j70Rj72K19
$$ plain form
7727 74 129 21 -31 81 136 -68 -69 -103 -94 -2 36 166 -122 23 4 8 7 -74 -177 65 26 189 -103 64 -11 74 41
7754 41 118 151 -126 -18 66 -12 110 -24 190 -47 46 57 -67 -130 -104 94 -121 -206 -186 -118 -174 51 -141 -31
7778 -31 -63 46 0 36 49 61 98 -198 15 149 -122 -171 77 5 -95 124 46 -34 108 40 38 144 -38 31 -37
7803 -37 76 -5 -134 -2 -4 -133 -8 -48 -50 62 -41 6 -217 -148 -97 -121 14 -40 -83 53 83 8 78 -91 -150 70
7829 70 -31 3 -13 -55 -132 -85 -44 87 -29 -33 13 5 5 -66 101 -13 272 -28 20 -130 -55 79 -35 -5 -83 229
7855 229 46 -70 66 76 -91 -34 135 -59 -197 112 85 37 -38 175 -93 -52 -48 -97 154 -20 -35 155 0
7878 0 -47 -153 -58 33 -101 -28 -61 117 13 71 -111 -36 12 -113 -92 -145 23 92 -201 -28 -3 -53 -16 182 16
7903 16 115 -31 -12 -24 242 34 -17 98 -33 -17 33 -58 -101 82 -120 -63 -130 -92 59 -136 166 -4 5 -167 52
7928E2K0j17O5P3N7j73R0q9Kl3Ll5j6OJ16r4Rj3rO0O8N9l0j5l7j62P9K07O0l54
7958a51K26Q3j14n2O6J4J21j99p0Q5l6J44j47K09p8n1l5J38j42K58j95j3j92K15
7982H4j62K07j57j6m8J47M0j93n4K49j14r3Q3N9N3n3R5j12J20j40KJ63k43J04
8006B1j0m6q4R0m3R4J4j19K12k10J62Rj47J70j08m4J93q4o7j15K74k87J74k87
8030b38K42J22p9J83j54p4l5J16r4lm1J10j3j41J72Jm4j65J69j50L5R9L2pR0k42
8056a09J77J11r4l7M8k02j58L62K09l64K41j05P2o0n9j8J04j47P4qK6r4M4J22
8080A35j64Q0q8N1K1q2J9R1J1j7j32Q2p3Q0N7j15J74j34j10J71k9l8j8Q8j85K41
8106A16m9n4j10J36j26J52q5l3K0L6M7p1J68j12j5j88K29j4j26J18j32J35ooL9
$$ plain form
7928 52 72 -45 20 93 150 -23 67 -22 -20 -53 -50 -85 -101 -95 21 -73 -64 -77 -86 -26 42 101 71 56 19 -143 -64 143 203 -151
7958 -151 75 158 44 -8 58 72 193 -6 -76 9 -27 117 -30 179 101 50 15 153 11 269 74 61 -131 84
7982 84 -78 129 -28 -44 -92 55 95 -98 -152 97 -17 -110 -27 32 85 32 127 15 135 -5 -3 160 -83 21
8006 21 11 -35 -119 -29 -72 22 36 -83 129 -81 81 90 -57 113 5 -39 154 70 3 -112 162 -125 49 -238
8030 -238 4 126 47 230 76 2 -33 83 -11 -14 -55 55 42 -99 73 74 30 -135 34 -116 -81 18 50 43 133 -109
8056 -109 68 179 85 48 96 -106 -264 98 307 -57 184 79 151 91 32 14 118 -29 45 37 63 -31 13 135
8080 135 -29 51 -37 14 35 -47 -28 63 74 57 -75 7 -66 14 71 -44 130 -4 -114 57 28 -10 -28 60 -125 116
8106 116 67 13 -97 39 -87 65 -20 -53 -33 3 50 -21 147 35 20 -168 61 47 -79 39 -93 42 36 30 69
8131F9p4o9o0N4J14n7J9om8NL2KJ33j98rK48k3j93L2l3j42K04j36J67j75J19O7
8158D2o9J00r5M1J18j99R8l5K1K3Ql2o9%L8l8R2J03O0j48j01nJ58r0n5m2J67l6
8186E5j66K22j87Q5M0
$$ plain form
8131 69 -5 -74 -134 -80 34 -23 -4 -10 -58 -53 -21 -19 114 -84 -93 155 132 -61 -29 -62 -204 0 -136 31 -144 -25 42
8158 42 -27 73 -22 19 137 -62 36 1 22 45 53 21 -48 -48 -10 -48 44 147 207 59 -42 -47 111 21 -34 -76 91 55
8186 55 -111 111 -76 9 49
8191D9
$$ Imaginary data points
##PAGE= N=2
##DATA TABLE= (X++(I..I)), XYDATA
0@%%%%%%%%%%%%%%%%%%Qj6J6j6J6j6K4l2L2l6M4m9N7o6P4q7R7j06J20j36J53j71
40i0J91k13K37k62K89l20L53l90M30m73N21n74O32o97P71q52R44j052J173j314
60f96J485j690J946k276K716l340M294n961R724l3755J2477P4136R971l4687o8580
75c4236l8511R999N8465N8417K4387l2441o6008o2894j4028M5622Q5748P1346
87A05866J2803n9018r5522p7501j2184N9668R9309Q0963J7965n5930r6802q3969
99a04352k3221M8683R0439P7811K1706m2953p7340o5524j7877L5001O3231N2409
111E8013J1264l3991n2901l4755N149L7808M1323J6744j8231m0070l5218o389
123e1254K9397M8174L6056j618m1314n6494l6598O077M5605N9957L9721m007m5827
$$ plain form
0 0 0 0 0 0 0 0 0 0 0 0 0 0 0 0 0 0 0 0 8 -8 8 -8 8 -8 16 -16 16 -20 24 -25 32 -34 40 -47 50 -56 64 -72 81 -90
40 -90 101 -112 125 -137 152 -168 185 -205 225 -248 273 -301 331 -366 405 -447 497 -555 618 -696
60 -696 789 -901 1045 -1231 1485 -1855 2439 -3522 6202 -27553 -15076 59060 69031 34344 -34236
75 -34236 -72747 -62748 -4283 54134 78521 46080 -19928 -82822 -96850 -51228 34520 105866
87 105866 118669 59651 -35871 -113372 -125556 -65888 33421 114384 132349 76419 -20383 -104352
99 -104352 -127573 -78890 11549 89360 111066 68113 -9227 -74751 -92628 -57627 5604 58013
111 58013 69277 35286 -17615 -52370 -47221 -9413 31910 48654 30423 -9647 -44865 -51254
123 -51254 -21857 26317 62373 60755 19441 -37053 -73651 -67574 -21969 37988 77709 73702 27875
136B7875o2012m2379J551M3773O0181M1026j49l9260n3231l6547q96L2672M4622
149A7226L0648J52k7805l6150k2576M393K5463K8057J2341r351k3514k1776n832
162b8724J4113K4884J9255J76k0347k7289j6832N115K3884K8178J5688o127k4978
175F996k9363j6269O592K5153K8277J4878o580k3407k5490j3009N793K0193K2737
188A6501J1901n662j8613j9897r186O737J7763J7088N876q282j6826j4775m201
201b1576R160J6753J4174K430j0338j6697j2375r14J0269J4665J0601J051q357
214H846j3232r818j202P419J0995P516J29o340p840m213J549N774N666J385l722
229B912p194m754J485P416Q861M413l763j0602j1017n115M336J1840J3176P775
$$ plain form
136 27875 -34137 -76516 -74965 -31192 28989 70015 69866 30606 -22625 -59172 -60068 -27396 17226
149 17226 47874 48026 20221 -15929 -38505 -34112 -8649 19408 31749 22398 -1116 -22892 -28724
162 -28724 -14611 10273 29528 29704 9357 -17932 -34764 -29649 -5765 22413 38101 31974 6996
175 6996 -22367 -38636 -32044 -6891 21386 36264 29684 6277 -19213 -32222 -26429 -6236 16501
188 16501 28402 22740 4127 -15770 -24956 -18219 -456 16632 22508 14226 -2600 -17375 -21576
201 -21576 -12416 4337 18511 20941 10603 -6094 -18469 -19383 -9114 5551 16152 17203 8846
214 8846 -4386 -14204 -15406 -7987 3008 10524 10653 4313 -3527 -7740 -6191 -417 5249 6634 2912
229 2912 -4282 -9036 -7551 -135 8726 13139 9376 -1226 -12243 -17358 -13022 -1182 11994 19769
243A9769k579j1926j4922r832K20R691J4462J1443L056o295j2318j1926o239K500
257a4896R310J0458O623O72l972n895n704l423j159J083K613L960M513M242K191
272A0616k263o462r042p042j361O291J1275J1589N945k826j0602j4540j1222k215
286b1859Q473J5123J4138O682m039j2402j4879j0263j567P899J3026J2113N714
299A8159k343p897j0346q524l972J632O404Q898P954M154j190n835q883q621n099
314a5509Q25P296J1088J0128M753k953j0019j3266j0413k857O833J3640J4088
327A3634P947k308j0914j4246j1309l420N521J2240J2887Q268j9p606j1606j0557
341a1488n505J565P566J0716R176M046k824p988r576p591k627K781P320R423P908
$$ plain form
243 19769 17190 5264 -9658 -19490 -19270 -9579 4883 16326 19382 13087 769 -11157 -17396 -14896
257 -14896 -5586 4872 11495 12167 8195 2300 -3404 -6827 -7986 -6903 -4290 -330 4183 8425 10616
272 10616 8353 1891 -7151 -14193 -15554 -9263 2012 13601 19546 16720 6118 -8422 -19644 -21859
286 -21859 -13386 1737 15875 22557 18518 6116 -8763 -19026 -20593 -12694 332 12445 18159
299 18159 15816 7919 -2427 -10951 -14923 -13291 -6887 2011 9965 14119 12929 7094 -1789 -10410 -15509
314 -15509 -14684 -7388 3700 13828 18581 15628 5609 -7657 -18070 -20927 -14094 -454 13634
327 13634 21581 19273 8359 -5887 -17196 -20616 -15095 -2855 10032 18300 18281 10675 -931 -11488
341 -11488 -16993 -15428 -7862 2854 12030 16076 13252 5264 -4312 -11903 -14530 -11749 -4429 4994 12902
356A2902K412l914q523r757o977j579N123R618J0403N762r07p043j0186q516l775
371a4957K671P668R672P469K372m208q725r382o087j82N654Q733Q458M377j346
386A2187o749q810o856k222K961O657P803N579R52m227p237o984l497J148M807
401d488O240M979K168j586m680n116l719j068J684L658M011K990J282j202l435
416A718l942l078j415J547L182M231L455J180j544m234n107l220p8L531N099M423
432E748J851j871n237n121k703J192L954M734L003m5k744l510l077n20J754L172
448E80K400J53j811k599j573L57K212K387J144r29k771k654j018J739L683K891
464D191N92k384l643k701o28K135L206K741O42j902l051k108J08J716K583J458
$$ plain form
356 12902 15314 11400 2877 -6880 -13857 -15436 -10313 -695 9708 15470 14563 7520 -2666 -11182 -14957
371 -14957 -12286 -4618 5054 12523 14895 10687 1962 -7420 -13507 -13689 -8035 698 9156 13533 12187
386 12187 5438 -3372 -10228 -12450 -9489 -2832 4971 10550 11502 7275 38 -6946 -10443 -9295 -4488
401 -4488 1752 6731 8899 7313 2633 -2483 -6202 -7270 -5586 -1928 2083 5073 6355 5153 1718
416 1718 -2224 -5302 -6717 -5170 -1988 2243 5698 6878 5334 1100 -4007 -7227 -7305 -3774 1325 5748
432 5748 7599 5728 491 -4630 -7333 -6141 -2187 2547 5550 5505 2761 -749 -3826 -4346 -2592 580
448 580 2980 3133 1322 -1277 -2850 -2493 -281 2106 3250 2321 -450 -3104 -4122 -2383 1300 4191
464 4191 4783 2399 -1244 -3945 -4573 -2438 768 3509 4151 2249 -802 -2910 -2802 -1086 1497 2955
480B955q71k415k229l83J878L200K789l4l564n007l699M97M805O782M701k96n287
497C822p694o196r26N055Q585P511K096m283q579p773l207K718P068P638M130
512I965j297n193o380l674J85L172L941K206j96j683j019L91J178O37j433l274
528b474l526r20L430O543O084K059l936q647q718m550L132R403J1223P037j280
543A4860r240j2372r097p93P545J1923J0078L038n066j0047r624m332K675P205
557c247P263L941o45l411m191k681n30O25P69l7j03J076K752L790K261j362n582
574F88p431n201K33O409J0234Q559K476o437j1563j1301m744M792J1397J2063
588A0174P034j786r274j2056q455p72O655J0014P943K528l267o527o381l437O66
$$ plain form
480 2955 2084 -331 -2560 -2943 -1065 2135 4924 4890 1326 -3681 -7380 -6883 -2078 4704 9405 9109 3822
497 3822 -3872 -10068 -10994 -5939 2646 10157 12253 7970 -609 -8382 -11589 -8871 -1803 5835 9965
512 9965 8668 3475 -2905 -6579 -6394 -3222 719 2925 2729 1046 27 418 1596 2233 800 -2474
528 -2474 -6000 -6920 -3490 3053 9137 11196 7260 -1387 -10105 -14655 -11523 -2120 9103 16140 14860
543 14860 5620 -6752 -15849 -16642 -9097 2826 12904 15942 10876 829 -8795 -13127 -10452 -3247
557 -3247 4016 7957 7312 3901 -290 -2971 -3501 -2876 -2107 -2144 -2247 -1171 1581 5371 7632 6270 688
574 688 -6743 -11944 -11711 -5302 4932 13491 15967 9530 -2033 -13334 -18078 -13286 -1889 10174
588 10174 17208 15422 6148 -5908 -14363 -15135 -8480 1534 9477 12005 8738 2211 -4170 -7607 -6941
603f941L234L811K430L12k15O1L12l60k102l814l429p77L012O129O250L581k126
620I368p689r385n869R66P523J0433P727J420n684j0116r344l858L315R208R342
635G357N220j546o554p794n102p56L714N929M563R85j929l014k241n34L61J92
651a149o58n16K00J912K607K330Q53k264m688m864k082K498N632O248L291j355
667G995n515p136n158J79N043P448N771Q13m097o548n201j679K407N186M802J687
683E997j458l815l502j208J255K483J921M03j583j204r58O11J961J615j37j911
699D70k734j810N98K970L440J835q38l051l922k167Q26L316L939K124p71l248
715I77l576j706P76K846K888J943j069k762l133j205J478L253K905N79k154l062
$$ plain form
603 -6941 -3707 104 2534 2846 2631 2692 3004 2644 542 -3272 -6701 -7478 -4466 1663 7913 11494 9368
620 9368 1679 -7706 -13575 -12609 -5086 5347 13074 14494 8810 -1306 -10650 -14508 -11193 -1985 7357
635 7357 12577 11031 4477 -3317 -8419 -9175 -5461 468 5031 6016 4087 1073 -1168 -1702 -1341 -1149
651 -1149 -1807 -2323 -2123 -211 2396 4726 5579 3315 -1373 -6237 -8319 -5821 -189 6059 9350 7995
667 7995 2480 -4656 -9814 -9635 -4592 2856 8627 9440 5343 -1205 -6406 -8085 -5678 -492 4310 5997
683 5997 4539 724 -2778 -3986 -2731 -248 1673 2076 493 -711 -1669 -1058 903 2518 2381 470
699 470 -2264 -4074 -3476 -506 2934 4769 3931 880 -3042 -5209 -4383 -1067 2872 4996 4225 977
715 977 -2599 -4305 -3529 -683 2205 4148 3079 317 -2816 -4021 -2543 710 3615 4194 2040 -1022
731a022k980m99K228L868K970L64k480l968l129j03K103L560K920M73j536k835
747f6k622o59J193J871J918J10o34j208o22L37R56M48n72j523j414l46J718K984
765A869K343K80k293l786l724q25K423M517M463J883j619m920m966k811Q10M010
781b346N142L452M51l131m223l709j339J347L344L226J384j48j435j908j179p39
797a811k22j42L86Q63J811K091J208l63k539l608k989r86K340M502M693K344j330
814F248m245n746m141j39L703N941N016J692k207m987n444k833N42L634M532L311
830D877P88j513k792l014j710o75R84J575K057J780J229L87j269k523k997k221
846e037k63J982L965M015K179q98l989n187l885n87L101N287N256K213j618m736
$$ plain form
731 -1022 -4002 -4501 -2273 1595 4565 4929 2449 -1519 -4648 -4751 -2648 912 3832 4305 2769 -66
747 -66 -2688 -3347 -2154 -283 1635 1745 1111 -97 -719 -382 574 1022 450 -1073 -2487 -2833 -1115 1869
765 1869 4212 4492 2199 -1587 -5311 -6136 -3713 804 5267 7150 5531 611 -4355 -7166 -6356 -2346
781 -2346 2796 6248 6699 3568 -655 -4364 -5703 -4356 -1012 2214 3598 3450 2015 107 -1072 -1811
797 -1811 -2033 -2175 -1789 -926 885 2976 4184 3821 1282 -2326 -5315 -6301 -3961 541 5234 7578 6248
814 6248 2003 -3743 -7884 -8023 -4320 1621 6637 8329 6122 1135 -4309 -7142 -6600 -2966 1566 4877
830 4877 5665 4152 1360 -1654 -3364 -4039 -3055 -1480 577 2357 3586 3973 2704 181 -2816 -5037
846 -5037 -5300 -3318 647 4662 6841 5943 1954 -3233 -7118 -7705 -4604 683 5939 8152 6534 1798
862A798n427l323l2L271M407L925J417j396k832l452k335n17J231J960K431J592
878B718R33k52j669k103k318j524n7J666L194L247J860o42l131m148l569n64K288
895d071M310M269K086j268l714m508k748j47K551L766L389J131r66k762k816j870
911c368q7J264J687J557J098K96m02j023j217j373j214n2P58K085K219J530j97
928C561j894k884k476o06J371K822L183J222o34k349l136j828m0J688K541J977
944B518M46p30j798j515p87M14R54R21L59j40k18j58K39J16k21q06o69m22N26
963i71J233J265O19m68j574j556p31M72J349J434R07j95j041j601p24L0R37J375
981G60P15k12j067j345k85O07J387R09J62j008j547j046R7J417J366J063J94j568
$$ plain form
862 1798 -3629 -6952 -6984 -3713 694 4619 6036 4640 1808 -1644 -3979 -4496 -3265 -1305 1126 2718
878 2718 3651 3399 1730 -373 -2691 -4215 -4272 -2606 588 3835 5695 5053 1922 -2226 -5795 -6359 -4071
895 -4071 239 4508 6594 5326 1612 -2896 -5644 -5791 -3240 526 3915 5046 4080 1318 -1498 -3368
911 -3368 -3455 -2191 -504 1053 2151 2447 2045 1022 -195 -1568 -2782 -2834 -2076 9 2228 3758 3561
928 3561 1667 -1217 -3693 -4299 -2928 -106 3077 4299 3665 1316 -1820 -3648 -3688 -2000 541 2518
944 2518 2964 2234 436 -1079 -1866 -1452 -498 423 782 642 424 266 505 621 400 -406 -1075 -1497 -971
963 -971 262 1527 2146 1678 104 -1452 -2183 -1711 -362 1072 1979 1784 743 -858 -1582 -1552 -615 760
981 760 1475 1263 196 -1149 -1434 -827 560 1469 1631 623 -924 -1970 -1873 -456 910 1973 2167 599
999E99j526r92j37Q18J634R77N64q41j109r99l79L71O93L83L48q8k26rK76L18
1019F75l00o61j120m86N66J416J577J078m19j711k343j564q5J641K652K300O27
1036C843j240k646k427j407M36K016K714J803M72j257k337k120o57K67J543J667
1052F70R37L75k59p82j053q25q47j84M02R73J507J326P28p44j572k289j581l64
1070c582J359K845K359J542o30k656l330k278k62K005L212L202J130j159k959
1085G98k941k139K45J667K724K395Q72m11j884k147j780m51P32J465J711Q51O60
1102B367k37p60j429j391j178j56Q38J944K142J630k04j821l088k477r19J428
1118c311L074L117J827j96k557l393k664p74J628L105K910J789p02k049k932k114
$$ plain form
999 599 -927 -1919 -2056 -1238 396 1373 1937 1096 -13 -1012 -1391 -1020 -327 56 404 316 90 81 357 675
1019 675 375 -286 -1406 -1892 -1326 90 1667 2745 2326 615 -1728 -3292 -3377 -1736 916 3216 3843
1036 3843 2603 -43 -2470 -3877 -3441 -1425 1289 3092 3564 2307 -30 -2150 -2807 -2540 -997 670
1052 670 1607 1982 1723 941 -112 -937 -1784 -1968 -1566 -593 914 2240 2968 2224 652 -1637 -3218 -3582
1070 -3582 -2223 622 2981 4523 3893 1237 -2093 -4371 -4633 -2628 584 3786 4916 3757 798
1085 798 -2143 -4282 -4037 -2370 354 2749 3621 3210 1326 -821 -2601 -3052 -2320 -855 856 1707 2367
1102 2367 2130 1370 -59 -1450 -2628 -2784 -1946 -2 2140 3770 3566 1745 -1343 -3820 -4739 -3311
1118 -3311 -237 2880 4707 4511 1954 -1439 -4103 -4877 -3249 -144 2766 4555 3853 1804 -1128 -3242
1134c242l98J122K123K119R55j51j169j425q58q10p9K34P15J214J291O41Q6j037
1152A331j862j799j054M86J795K582J855L76j431k392k735j371P47K331L101J812
1168C772K0j676k842k187o28Q27K245K193R89k46j303j591j007l71L81R14N93
1185H3O38L40q2j04m69m11p68p34j66Q84J226J201M88l18j383j600j137J1J238
1204a063J802J415M68j217j541j398o47N61J061J500Q33k25o26j341o52p6M17
1221g29P21O07J14k88m40l20K16K79N8m5n09k49nN82P13J21k80m12o83k86L2N50
1243b53P56K35j04l75m24l33j42M91L80J02q4j37m19k54M44M69M00q9m83n13n44
1264h77R8N78O37Q04p9o47q40j030K4N20P59R10K84n2n96p04o85l55L55N70P49
$$ plain form
1134 -3242 -3640 -2518 -395 1724 2679 2528 1359 -66 -924 -1734 -1813 -1579 -864 350 1641 2282 2368 1331
1152 1331 -531 -2330 -3384 -2898 -1103 1479 3334 3710 2279 -113 -2848 -4219 -3472 -1141 1960 3772
1168 3772 3792 2116 -726 -2913 -3541 -2714 -469 1724 2713 2467 1164 -427 -1434 -1805 -1424 -510 83
1185 83 721 1061 979 875 406 -5 -773 -1507 -1673 -789 437 1638 2126 1808 425 -1175 -2312 -2301 -1063
1204 -1063 739 2154 2622 1405 -136 -1534 -2181 -1620 -559 941 1774 1549 923 -418 -1070 -1146 -729
1221 -729 -8 599 713 425 -15 -335 -119 160 218 173 -336 -585 -590 -8 705 826 546 134 -549 -835 -803 -253
1243 -253 503 738 634 259 -165 -498 -640 -149 231 333 249 112 -307 -561 -117 352 752 663 180 -333 -877
1264 -877 -779 -201 436 1240 1161 514 -326 -1356 -1332 -812 -53 857 1141 1089 493 -211 -896 -1251 -896 -326 423
1285D23M15J53l47j89q52m09LQ6N34L88M47P07j8r00p47j104l77M09R83J353R25
1306A883M7p50j598j094p59O98R86J557R75J1o46j517j140o97L45R89J338Q63
1324A491J62m71p92r72p81l03M86O20R75Q31M11k23p47j353j093l50N87J094J447
1343A019J167N9p38j703j685q61L62J623J898J447J63j101j648j951r23N95J570
1360g07J604J037Q2p37j154j137n24o8M89R46Q43N31L43l60o41j029q47n76M17
1379a488R12J328J065M79l93j517j919j123L8J318K174J650M91j001j928j983
1395a897j016M64J535J902J313J95j080j426j263p17L74Q53J105O82M09l70n28
1412E35m83n40l28k03O9N84O06Q35N09J8q53j442j246m43J061J598J586O38m49
$$ plain form
1285 423 838 991 644 455 -397 -806 -803 -717 -183 205 652 1359 1341 441 -306 -1410 -1787 -1378 -395 958 1883
1306 1883 1930 1180 -418 -1512 -2271 -1573 -587 970 1945 1956 1310 -207 -1347 -2044 -1699 -710 628 1491
1324 1491 1653 1182 390 -582 -1363 -1666 -1180 -560 415 1246 1657 1434 687 -666 -1759 -2109 -1522 -428 1019
1343 1019 2186 2245 1507 -196 -1881 -2742 -2380 -757 1141 2588 2751 1650 2 -1949 -2872 -2277 -707
1360 -707 897 1934 2016 1279 125 -1012 -1536 -1604 -1115 -169 674 1205 1548 1188 547 -482 -1329 -1905 -1488
1379 -1488 -576 752 1817 2296 1903 386 -1533 -2656 -2618 -1300 874 2524 3015 2014 86 -1897
1395 -1897 -2913 -2449 -914 988 2301 2496 1416 -10 -1273 -1990 -1616 -763 342 1024 1433 1063 535
1412 535 52 -488 -816 -1019 -950 -366 240 1075 1584 1602 749 -693 -1939 -2382 -1321 277 1863 2501 2052
1431B052j500j768j253J60J208J817J284L16q03j483j545n13O79R54J002O34j49
1448A092n62o44n56K17K17J84k2k07J10J22O43L27j75n83p97o55J2P48J185P77
1468A433J72q13j158r56k70L46J347J083N14k72j364j139n00M19R33J208L39l40
1486I82q75o39l82L91N79M64J79m17o70l91K30L10P71L04j28q01o42k38J94P75
1506dQ26K69m68p59p11j67K69R36O42K77q03p16k25q5O10O16M22k93p24o62k52
1527a002J98J062N68M74n24r75j111k70M76J302J074N79p37j088j360n41O43J135
1545i7J181M41l38r47q06n96K24R52O53J94j90o51l41J90K07K47J46n19m50m18
1565i18K21R00R46L29l26j040j333r07L65J367J587J286m68j409j663j325J05
$$ plain form
1431 2052 552 -1216 -2469 -2309 -1101 716 2000 2316 1513 30 -1515 -2028 -1349 -395 607 1241 1092
1448 1092 530 -114 -670 -453 -236 -52 -74 -281 -171 -49 594 921 746 163 -634 -1289 -1277 -529 656 1433
1468 1433 1605 792 -366 -1322 -1592 -1246 101 1184 1698 1426 62 -1077 -1577 -1158 -225 983 1322 982
1486 982 107 -532 -914 -523 56 520 699 282 -388 -779 -549 -239 532 836 708 -93 -735 -973 -779 -4
1506 -4 822 1091 623 -136 -847 -1014 -745 191 833 1110 307 -409 -634 -719 -109 507 929 636 -88 -750 -1002
1527 -1002 -804 258 826 1300 776 -199 -1310 -1580 -1104 198 1272 1851 1114 26 -1334 -1875 -1232 -97
1545 -97 1084 1525 1187 240 -566 -1162 -938 14 667 861 671 20 -321 -131 76 323 469 -50 -500 -918
1565 -918 -697 203 1149 1478 1152 112 -1221 -2128 -1763 -396 1191 2477 2009 600 -1063 -2388 -2283
1582b283J209J570J647J9j067j340j319m15O90J245J093J80k67q10o68j25N20
1599a21K03J15l80m06M6L54J023N37m8j030j250j035O0J119J854J295J35j278
1617A193j646j908l00Q26K025J688P45n51j597k022q56M51J112J693J062l21r58
1634F36j125n62J65L80O22K72j39l98m2K28N26L60l17r35q67l59M54J426J146
1653A471N78m35j511j630q28L82J244J919J186P5j213k070j375j17Q90J940J181
1670A687L85q26j210j086n48N66Q09Q08J77l14l44k53j01M43J12j67m14k62l30
1689h68N35Q53M67K17n45r79j027l20O76J357J033N05n39j605j036o57M25J130
1707c78J333N61kr66j163o59K5O64P75O74j02l72n31l65p1K80L78K36o5m07k02
$$ plain form
1582 -2283 -1074 496 2143 2162 1095 -245 -1564 -1979 -1289 -44 1049 1229 962 152 -516 -641 -121
1599 -121 82 197 -183 -589 -543 -189 834 1371 1323 293 -957 -1992 -1932 -813 1041 2336 2471 1193
1617 1193 -453 -2361 -2661 -1835 190 1878 2623 2072 475 -1547 -2403 -1952 -840 853 1915 1594 636
1634 636 -489 -1051 -886 -506 116 388 249 -149 -191 37 563 923 606 -329 -1196 -1555 -1101 325 1471
1653 1471 2049 1614 103 -1527 -2355 -1973 -729 1190 2376 2451 1238 -832 -2207 -2324 -1434 506 1687
1670 1687 2072 1246 36 -1050 -1598 -1032 -223 585 762 448 104 -149 -250 193 305 138 -276 -538 -868
1689 -868 -333 520 987 1204 659 -320 -1347 -1667 -991 366 1399 1904 1365 -240 -1276 -1933 -1508 -378
1707 -378 955 1516 1514 548 -615 -1274 -1249 -585 190 864 762 390 -141 -506 -577 -297 81 317 252 -155 -357
1728c57Q9L11N77J34m16o00l90j47K37P95N38J36l94n89p32k12K58R94N62J1K9
1749H34q38n93l39K75M99N32K99k6o32m03l18L09N82K58J08k74m28l98K61J28
1769a64M48J71j23r0l00l61j65L19M67K26P4l70k59l77J2J48K61L35K45j53l50
1790fk57L3N1R1J36j22k3q1J60N1M29n9l20m09j84L0L43K25K64K69j01m32m34
1813c46k62j43M00P55L16J97m37m40m68k69k0L88N78K34Nj01j27l52l04j49J47
1834c98K25L14K00J08n2m5m47k34k99R9L62L76N52Q4k08n08o49k61j85P70L73
1855A77M17L16l21l67m96l16j73K31M19L73L86Qk26l91m97j90R3J82N83L30J25
1876F63nl22n38m54j95J03O20N94L92l1k77o47n03k63O0L93O93M10n8p9m33l76
$$ plain form
1728 -357 -268 43 620 754 338 -262 -652 -799 -562 233 771 907 513 -76 -808 -1020 -762 232 794 805 834
1749 834 -4 -597 -936 -661 -162 370 669 643 11 -392 -710 -401 181 439 547 273 -155 -553 -292 -164
1769 -164 284 455 332 242 -58 -419 -584 -265 202 428 502 132 -127 -504 -492 -344 -83 252 497 344 -6
1790 -6 -263 -230 -179 -88 48 -74 -97 -178 -18 33 462 403 83 -326 -510 -480 -137 88 352 621 520 88 -346
1813 -346 -608 -751 -351 404 720 917 480 40 -428 -697 -717 -329 249 483 488 387 260 -92 -396 -545 -398
1834 -398 -173 141 341 449 397 352 -95 -329 -628 -529 -167 209 761 845 637 129 -520 -781 -966 -196 177
1855 177 594 910 589 222 -274 -590 -763 -532 -113 260 646 654 428 37 -460 -650 -557 -375 208 538 663
1876 663 658 336 -202 -656 -851 -748 -128 466 858 827 550 -97 -600 -863 -803 -410 283 693 635 556 123 -253
1898b53k20k92L18M57M35K81N8l41m38m95k46K42R9M50K54L42k2k91n10k33l98
1919h03M1M12O59M26J42k56m95p15k88K14L52O67K73J11k94m27l05m43J79N1O27
1940A28K84K57l1l82k72l49j31K70K7J44L30K30N3l90j07l30k18j31K72N25K32
1961D11L00k21l40n51k95o4M64L89L84K48j89m25m44j28N6K57K67K39K4l55q6
1982e9n8l04J52J14J34J31k7J7J70l9q3L6l50j18O7R7K07K76n8k0l05l93o8J93
2006b88J87L85K24r8l81l36j47J6K86L66J50J8k45m25j8K05K60J47q1L9m23q9
2028b48QK29J78O8p6P2n86j67R5K53M98J52r8l31l45j76K12J55L41J56k47j03
2050D0k70j22J52L21K4J45l43k59J04m3L31R3K74j18m87k46j85J99L22M59K73
$$ plain form
1898 -253 -473 -765 -447 10 445 726 784 443 5 -490 -736 -494 -395 55 309 651 629 338 -172 -405 -803
1919 -803 -762 -350 309 735 877 621 126 -589 -877 -663 -311 356 629 740 446 19 -286 -729 -550 -499 128
1940 128 412 669 638 256 -16 -365 -496 -226 -199 -55 275 505 558 168 61 -269 -487 -618 -346 179 411
1961 411 711 490 150 -401 -696 -760 -296 93 477 725 536 111 -333 -461 -405 -148 119 358 382 27 -59
1982 -59 -117 -421 -269 -155 -21 110 83 100 270 231 148 184 -166 -284 -217 -120 87 363 305 285 -20 -413 -481 -288
2006 -288 -101 284 508 410 29 -307 -454 -438 -152 214 364 382 137 -288 -306 -101 159 306 225 264 -159 -248
2028 -248 -240 -11 167 235 159 231 -355 -522 -427 -174 324 476 378 47 -298 -474 -262 -107 234 390 143 40
2050 40 -230 -352 -200 121 145 290 -53 -312 -208 -251 80 173 447 329 -158 -404 -589 -390 -68 391 664
2071F64j89l96p00j39J07O11N57J57j23l93m97k28pL21M63O8M3k09k74p5M9K38
2093D8O9l0k02k48PL41L51R4rl03m72l73J98M74M65L69J78n71q66l93p6O35N62
2116B48M83Q1l84n61m28p9KN43N34J54o3k41m43j85J2L00n2J02k6n8%K30J27j53
2140A43j80l40j15%K13M98L99Mj69m98m96l30K79O12N63J42j43k84o44m12j49
2161i07M07P47M01J17l36l49l79j28R6J51L05J01L6n3k19k5o3m7L2j90K09K6K94
2184B26Q2L3q6k27l65j66qL10M95J44K60l93m17m18j77L21K58M53J85J33m71l57
2206a85k46K3J71K22K28K03j09k21k88q2n9J76K50O4j15J85j67m8K9n1R1k75j03
2229c07J80j7L10R5J63k67k49k69q9K25J11N70K4j71j97k73j33L7J00L43K0K22
$$ plain form
2071 664 475 79 -621 -760 -653 -42 515 672 549 156 -341 -569 -576 -255 208 276 319 110 -164 -239 -190 48
2093 48 117 87 -115 -363 -356 -15 336 430 421 118 -354 -727 -529 -55 410 779 957 386 -480 -873 -949 -314 248
2116 248 731 812 428 -133 -561 -640 -638 -95 439 593 530 289 -154 -339 -327 -27 -79 23 -3 -61 -61 169 296 143
2140 143 -37 -377 -492 -492 -279 219 618 622 453 -45 -541 -871 -592 20 583 725 582 298 -346 -758 -907
2161 -907 -500 247 648 765 429 80 -299 -427 -331 -180 125 226 262 209 -10 -35 -98 -145 -113 -303 -94 -68 226
2184 226 308 341 255 28 -337 -503 -511 -201 294 438 698 305 -112 -530 -707 -386 -128 325 510 643 172 -185
2206 -185 -431 -408 -237 -15 213 416 307 86 -202 -284 -343 -167 83 147 32 217 50 2 31 -20 71 -204 -307
2229 -307 -127 -144 166 261 424 157 -92 -361 -450 -225 -114 456 480 309 112 -161 -294 -257 -157 186 206 428
2251D28j93k42k87M4P0J67K98k2j54k88J17m7k3L11l9k68J6o5pR1J72Q2Rj34l44
2276c08O3O0R1M66j24O0l13k01j49Q9J64L35J23j21l14j38Q8KJ59P0J28q1k45
2299i6J0j79J78K90o6KL3m41n3K29q6L13R4M2j26k83j94N2J06K54L05m9j84q5
2323F6l00LJ60j5K37L5q7j38j0mK6Q2j7j79L1j4J33K32j49J45j89j60k48J22J00
2348a38J31K46L10k32l63j89k19nL10L93K07j4k92k09j05j86J05L07L6K71O8m95
2370f3q9k0j2O8K20o4j11J38P3k16K51j37M5l84L3o3J71L20J38j03Qk56k11k03
2394d67n8M50L16J16J50k29m58l05O6J19M03L57j07j36j96j87k62J34J46K80M1
2415A73l6p6j2p5j00J89J6j48J18o7J63k2L7O3j67j93k11o5Q0M61L25J52k39l98
$$ plain form
2251 428 235 -7 -294 -250 -180 -13 285 263 109 -179 -62 -109 -132 179 140 -128 -112 -177 -184 -93 79 161 170 36 -308
2276 -308 -245 -185 -94 372 248 308 -5 -206 -355 -266 -102 233 356 235 -79 -217 -129 -127 32 102 230 149 -96
2299 -96 -86 -265 -87 203 137 139 172 -269 -322 -93 -179 134 228 270 144 -139 -333 -281 -175 79 384 335 151 66
2323 66 -234 -231 -71 -86 151 186 99 -39 -49 -53 -27 55 38 -141 -110 -124 9 241 92 237 48 -112 -360 -238 -138
2348 -138 -7 239 549 317 -46 -235 -454 -459 -149 244 451 437 145 -64 -169 -355 -250 57 93 364 432 -63
2370 -63 -152 -172 -184 -116 104 40 -71 67 140 -76 175 38 83 -301 -268 -331 -160 160 298 195 203 -53 -264 -467
2394 -467 -525 -75 241 357 507 278 -180 -485 -419 -300 103 460 353 217 21 -166 -428 -294 -148 132 173
2415 173 137 61 49 -26 -126 63 79 -69 49 -18 145 123 160 223 56 -137 -348 -413 -333 128 453 605 366 -32
2439c2k41k68J43K32M74L05j66j54l41j85k6J38J2J93L76k85k09r4j07J3L27L9
2461A44k53J21j85K20N0Q2n8n3k07n8Q6l7K50K89q5k66j57j43p3R7K07M95q1j4
2485C71k88l63j46O6L74P7J17J45k28j48l30J66J47j40M14j26m2m6n8J9N7k0k
2508A6j43L4j50K87QJ85j06R9l28j03o8J46K22J46N2j59k68q4j35J28K22K89q8
2531B02mk61j68J2J40qO7R1pj16K4j59K03M0L4k7q3j39r4K52O1J3Q9Rl64N6p0
2558b07J66J20K4j4l5jk47JJ33m9J76l2J0j75k9M7L2K38Q4k67r9j54J18K03l1
2583A2K67k27r6l1r1J22j79M26N1k61M7k26j45K40J22L2O3P4r2j41j05J01R5n3
2607EJ09j16m1m5J00m9J18O3j75j27M6k1J28L21J32k61k01j16k24J97L7L41J32
$$ plain form
2439 -32 -273 -541 -398 -166 308 613 447 293 -48 -233 -259 -121 -109 84 460 175 -34 -128 -235 -222 105 144
2461 144 -109 12 -173 47 97 179 121 68 -139 -197 -111 -148 102 391 306 40 -117 -260 -333 -236 -29 466 385 371
2485 371 83 -280 -426 -360 14 91 208 353 125 -23 -353 -187 -40 -180 234 108 66 20 -38 -19 38 18 16
2508 16 -127 -93 -243 44 52 237 131 230 -98 -201 -269 -123 99 245 297 138 -130 -214 -349 -221 1 290 202
2531 202 198 -63 -231 -219 -79 -87 -20 71 64 -52 -28 -187 16 56 90 63 -20 -159 -253 -1 60 73 162 171 -193 -137 -207
2558 -207 -41 79 103 89 54 53 -194 -193 -60 -109 67 35 45 -130 -159 -112 -80 158 242 -25 -124 -278 -160 43 12
2583 12 279 52 -44 -75 -166 -44 -223 203 254 -7 40 -186 -331 -91 31 63 126 200 108 -33 -138 -37 58 5
2607 5 114 -2 -43 -88 12 -37 81 144 -31 -158 -112 -133 -5 316 448 187 -14 -130 -354 -157 -120 221 353
2630C53j49q9j96k7j38k6L83J21N7j76q9q2lj26J55JR6j52J9J64j21K95n2j08
2654A10l80P6o8J19M01k3J02r4n11j59P8O1M24J86J18j57k93j87Mk8K28Q8K47
2677C42n6j21l02j70K33k1J13J11p7j55J78j07J41p5O1j50j92L0qL44L5K10k69
2700I5o6o7m76K78J86L64Q4k02Nm00j57N2J56J80K74J17l13k15j40J01o2K36J83
2723B13P9j69p9j23J2k3J13k4J13r0p7N2J99M1j32R9k46j26j4K16N2J79l7O4k04
2748H8l41k22L33J28L07j23p9r5j43J00j80M8K75Q9J04k69k5r0m4K26q3K07j23
2771H8j45m9J47N8j42K04j7k10%j05n6K22K49j35j28L1o5k9Q2j17K32J96m6j20
2795A45k19j47MJ21J71O0j8k25J18n8O9j9K39q2k11j90L1lL30j12L2J67j50j16
$$ plain form
2630 353 204 115 -81 -108 -246 -272 111 232 289 113 24 -58 -61 -187 -32 -31 65 -87 -68 96 -25 270 218 110
2654 110 -270 -194 -262 -143 258 235 337 243 -268 -427 -349 -288 136 322 440 283 -10 -197 -193 -221 7 95 342
2677 342 286 165 -137 -307 -74 -95 18 129 52 -103 75 -32 109 34 95 -55 -247 -217 -225 119 154 364 95
2700 95 29 -38 -514 -236 -50 314 398 196 201 -199 -356 -304 -148 32 306 423 110 -105 -245 -144 -206 30 213
2723 213 292 123 44 -79 -67 -90 23 -1 112 22 -55 -3 196 237 105 204 -42 -168 -182 34 86 265 228 292 88
2748 88 -253 -475 -142 -14 293 170 91 -4 -147 -47 -227 -179 96 185 289 20 -5 -95 -139 87 4 211 88
2771 88 -57 -106 41 99 -43 161 144 -66 -66 -171 -227 -5 244 109 -19 12 -53 -82 0 -117 115 311 265 145
2795 145 -74 -221 -217 -96 75 135 117 -108 10 -48 21 2 241 159 -52 -242 -211 -214 116 4 36 203 53 -63
2819f3j54O2J12k0K0M58l60j24j15K50k53K81O2J61m62N2j00J22J22J72m9k49
2841g5j1Q9o6n2O6K64m8r0k84N1L8Q3K41j28L7p4k2j88O8kK12J20p1j74p9k5j35
2868b55J66L06p5J28k73j14r8Q8J42R5j87K41j7p5j66J34j21J49Mm6j0r1Q2j41
2892a34K29J4J35l06l9o8J6J59J03O2K2P7m09r3J28J94J05O0j16Kj81j7j54J8
2916a93J13K30J25k11r4N4n0o4J18q7J05j78N3J03j9r9P8j8j67K40k43J73J63
2939A32p1P0j21j18o9j09J90O1J17OJ01k7j46j59pR5K21R7n0m1l11j34J63J23
2963A3r4P9k0K8J00j72j0J40k05Q0J66j59J22m1M2L7l0r8O7jk98O9K67Q4k1j30
2989A5k51P0o3J07J55K12l40L05j86J4j08j19J59LN0J17Kq8m4j07J11r1K68k73
$$ plain form
2819 -63 -217 -155 -43 -63 -43 415 55 -69 -184 66 -187 94 156 317 -145 -93 -193 -71 51 223 174 -75
2841 -75 -86 3 -63 -115 -49 215 167 77 -207 -156 -118 -35 206 78 115 41 19 -169 -101 -103 109 229 158 -16 -95 -120 -255
2868 -255 -89 217 142 270 -3 -117 -215 -127 15 110 -77 164 147 72 -94 40 -81 68 72 26 16 -75 7 -134
2892 -134 95 109 244 -62 -101 -169 -153 6 109 171 193 270 -139 -232 -104 90 195 255 139 141 -40 -57 -211 -193
2916 -193 -80 150 275 64 -30 24 -26 -90 28 -59 46 -132 -79 24 5 -94 -16 -34 -201 39 -204 -31 132
2939 132 61 131 10 -108 -177 -286 -96 -35 82 88 189 162 16 -143 -150 -55 166 263 213 172 -139 -273 -110 13
2963 13 -81 -2 -22 6 106 -66 -76 64 -141 -61 105 -54 68 27 69 106 76 -22 45 44 -254 -185 82 166 145 15
2989 15 -236 -166 -229 -122 33 245 -95 210 24 38 -70 -189 -30 -27 23 140 142 54 10 -97 14 -77 191 -82
3013h2K09r4j67K08k77L22j71O4J08q1l1j1N2P2p2j37J17m0K6M0k5j06L2K38l25
3038a31N2l5P0r6J35K21q9k34Q5j9J32k36J63k13J44K11K4k90J12j33n2P5J34
3061C0j4p1L3j99L14j77J00K5l2L9m0n2R6M4l9J5P0j98Q2j50J03o4J7K26j82J76
3087A52j44L5n9n3P7K8l6Q9k21k2J91l2j54J86J15j57j29J15r9K30nr6Mk08R9
3112i4j9J47O8J8o9j5o1K1j12J11J8K28j21j88k9j54KK88k04J13Q2j30N1j03J97
3137D5l2O4N3j28O8j06l4P8R9Qj47j38K0M8P5J43o1l3j29L6l3Q1K2jJ00J25j10
3164A13j86J1j0j03K52L0k0j06L3j45J09M6m3J32m7l3J14j77n7J90l8j44J67j29
3188d1Q%R2NO5Oq6j88n1J66m2J40J14j28n8p0r5k3J89M2p7J95k11k4rk0oJJ06
$$ plain form
3013 -82 127 33 -134 74 -203 119 -52 12 120 39 8 -3 49 121 49 -88 29 -11 15 55 30 -76 -44 194 -131
3038 -131 -79 -114 -44 -140 -5 216 127 -107 -22 -41 91 -145 18 -195 -51 160 184 -106 6 -127 -179 -104 30
3061 30 16 -55 -22 -221 93 -84 16 41 9 48 8 -44 52 96 57 72 142 -56 26 -124 -21 -85 -68 158 -24 152
3087 152 8 43 -16 -69 8 36 0 89 -132 -154 37 5 -149 37 152 -5 -134 -19 -118 112 107 11 15 -193 -94
3112 -94 -113 34 102 120 51 36 -25 -4 -116 -5 13 241 120 -68 -97 -251 -249 39 -165 -52 30 -100 -49 -152 45
3137 45 13 77 130 2 70 -36 -70 8 107 115 -32 -170 -150 -102 -27 116 55 22 -107 -71 -104 -23 -1 -2 98 223 113
3164 113 -73 -62 -72 -175 77 107 87 -19 14 -131 -22 24 -19 113 66 33 147 -30 -87 103 65 -79 88 -41
3188 -41 -33 -33 59 64 129 135 49 -139 -190 -24 -66 74 188 60 2 -68 -163 -186 3 45 -32 163 -48 -72 -81 -101 -107 -106 0
3217@J75k6j61J25j8l26M8J33J27j07K1l8NM5L8l2N7mj55n4J08J33Om2o2j22J25
3244aj72K11M8Q9k1k60J26q2K9j07J45J77j25J99l10J0o0J13J14l0k0r8j43K65
3268I7j48J30Jp5mk83J20M8Q9P8j41L18l01L5o0L7j7J88j16J8R2k41m4J11J96
3293A28m4J2j95O3p3J8J14j26L2K58j19M0j7j04K9p0K05k32n0K02M0k22J82J5
3317H6j7j64P4j24R5J7j36J78J92k12J08j02j21J70q0J98P8l28J62q3j54K01m3
3340eR8O3o6k88P6N0Q0L9ok9l5J2k6J23j56K36j22op3Q4j56Q0K8n9J87j30j15
3367a16l7K67q1q0J27O2k72J16l7l6O4J13r5m8k9jO3M5k29L14pj37m0K54l45J78
3393A3j5o1K52k70N7R6r4j39J44M7MJ10j06pm5L0J27k44P1P0r7Q2J07j59o3J5
$$ plain form
3217 0 175 149 -12 113 95 -231 -183 -50 77 -30 -9 -47 -42 3 41 9 66 62 -93 -147 -39 94 100 58 -4 -126 -1
3244 -1 -173 38 86 175 154 -106 20 -62 -33 -140 5 182 57 256 -54 -44 -104 9 123 93 73 -25 -168 97
3268 97 -51 79 80 5 1 -282 -162 -114 -25 53 -88 230 -71 -36 -96 -59 -76 112 -4 14 106 -135 -179 -68 128
3293 128 84 96 -99 -36 -109 -91 23 -103 -71 187 68 108 91 -13 16 -54 151 -81 -131 71 111 -111 71 86
3317 86 69 -95 -21 -145 -50 -33 -169 9 201 -11 97 -5 -126 44 -36 162 240 -88 74 -9 -163 38 -5
3340 -5 93 156 90 -198 -122 -72 8 47 41 12 -23 -11 -37 86 -70 166 44 38 -35 49 -107 -27 1 -58 129 -1 -116
3367 -116 -153 114 33 -47 80 142 -130 -14 -51 -87 -23 90 -5 -53 -82 -83 -20 25 -204 110 103 -34 -74 180 -165 13
3393 13 -2 -63 189 -81 -24 72 -22 -161 -17 30 34 144 38 31 -14 16 143 -101 -30 40 -57 25 132 -27 -90 -75
3419g5J89j1l01K36j13M4M4q7K34k09N0M6m1o0M3o1N8k4k8J44J4k9n4O8j78J99
3445I8Mk3k55K3L3P0J85j54J22j37M0j09PJ18o7P0O4M1k13K18j28k0jJ9J73k13
3471c5M4j4j53J71k12K5L04J1j14L7N7n3q1l7J36q9l3k4QQ1%r3Q6j38o9J54P9
3498D8p8L8J45M5k19Oj18J33M4j01P9J37j22P5q9o0R0J00qM2q9j68j1Q5M8j4L0
3525F8j54Ml5M7P4%J36j17n1j5J64%k21R8J22j41n0n2m7K86m2J88k33q6P3P6j90
3552i8J18Q0J2j2j50O3k57J84O8O5K5m3m3m7N0J06J9k6kj73K9k00J36J79Q6J15
3578B84j29j73j25l0l2L7J59K16j25p6j76l9R3L65j25Q9l54J44j80J02K2O6J84
3601A97j23n1j4j80L3K14O1J6j58K5m3J17k76J70QJ41k43J55k96J47R4n0l5J78
$$ plain form
3419 -75 114 103 -198 38 -75 -31 13 -74 160 -49 1 47 6 -54 -11 -72 -14 -38 -66 78 92 63 9 77 -101 98
3445 98 102 79 -176 -153 -120 -50 135 -19 103 -34 6 -103 -96 22 -45 25 89 130 -83 135 7 -13 -14 5 178 -35
3471 -35 9 -5 -158 13 -199 -174 130 141 27 64 121 68 -13 -50 86 -3 -36 -60 -52 29 29 -64 22 -116 -185 -31 48
3498 48 -30 8 153 198 -21 -15 -133 0 44 -57 22 159 37 112 23 -37 53 153 145 187 98 -70 -81 4 52 38 68
3525 68 -86 -82 -117 -70 4 4 140 23 -28 -43 121 121 -100 -2 120 -21 -71 -123 -170 116 74 262 29 -57 16 92 -98
3552 -98 20 100 112 100 -50 13 -244 -60 8 73 98 55 12 -35 15 121 140 114 112 -61 -32 -232 -96 83 169 284
3578 284 155 -18 -143 -173 -205 -168 -9 207 82 6 -170 -209 -116 249 124 213 -141 3 -177 -75 -53 13 197
3601 197 74 23 9 -171 -138 76 137 153 -5 20 -23 94 -182 -12 -4 137 -106 49 -247 -100 -6 -56 -91 87
3625H7j02j08Q8j41J98j32K33q8k4j48J5P9j33K64J73j8J3m05MN9J77J25q0j59
3649b3j5K3PO8nJ63k20P2M6k98O8N2O0L93l61L4j51rp0J59N4P1q6j74J28l9J24
3676G1J22n2j16P2j08j93o0J50O3K55j3k35r8Q0M6J40K8j64J83j10j27p9J07Q
3700c0O8k7J55j30k3k74K13J35k49J78M4l30J85M2k16L55J1J5p0M2j52O4J7j13
3724i0K03Q6k01n9j8N9PN0J65j26j59J08j53R0J10j10J44J2k90M4P9q0J55K21
3748B47k20j7o9R6p5j11K82r8j8j58J42O9k39J63kJ70j72M4j31j23k3K66q8J75
3772A10m0j44J04n6j13J07J9K28l5r8j19o9P0J95j95J01k3J5j39J78j47L1J59
3795A39n0J43k56j70J1J83J51j84J70j25j00j4J23k0K47M6j97j63k9N0P8M3r7
$$ plain form
3625 87 -15 -123 -35 -176 22 -110 123 35 11 -137 -122 -43 -176 88 261 243 256 -149 -145 -86 91 216 136 -23
3649 -23 -38 -15 -8 60 55 218 -2 70 116 -182 -114 -62 -2 391 30 64 -87 -96 -166 -7 47 118 32 -142 -14 -53 71
3676 71 193 141 25 97 -11 -204 -264 -114 -51 204 191 -44 -142 -62 -16 124 152 -12 171 61 -66 -145 -38 -30
3700 -30 38 11 166 36 13 -261 -48 87 -162 16 60 -270 -85 -43 -259 96 107 122 52 94 -58 6 23 -90
3724 -90 113 199 -2 -61 -79 -20 -13 37 202 76 -83 25 -128 -38 72 -38 106 118 -172 -128 -49 -129 26 247
3748 247 27 10 -59 37 -38 -149 133 35 17 -141 1 70 -169 -6 -8 162 -10 34 -97 -220 -243 23 -65 110
3772 110 70 -74 30 -26 -139 -32 -13 215 180 82 -37 -106 -36 159 -36 65 42 57 -82 96 -51 -20 139
3795 139 89 232 -24 -194 -183 0 151 -33 137 12 -88 -102 21 1 248 294 97 -66 -95 -45 33 76 -21
3818b1K05j14q5r7M9J9Q0O3p7rq2L4L3k1q0K03j37M2k0o8J13j11J39k9J98l63
$$ plain form
3818 -21 184 70 -15 -112 -63 -44 36 99 22 13 -69 -35 -2 -23 -103 100 -37 5 -15 -83 30 -81 58 29 227 -136
$$ [...]
8191B2
##END NTUPLES=NMR FID
##END=
