##TITLE=1H_675
 CDCl3, 8 sc, 
 25.12.2019
##JCAMPDX= 6.0         $$ Bruker NMR JCAMP-DX V2.0
##DATA TYPE= NMR FID
##DATA CLASS= NTUPLES
##ORIGIN= UXNMR, Bruker Analytische Messtechnik GmbH
##OWNER= root
$$ XWIN-NMR		Version 3.5
$$ Wed Dec 25 13:55:39 2019 Russian Standard Time (UT+4h)  she@DPX200
##.OBSERVE FREQUENCY= 200.1315
##.OBSERVE NUCLEUS= ^1H
##.DELAY= (6, 6)
##.ACQUISITION MODE= SIMULTANEOUS
##.ACQUISITION SCHEME= undefined
##.AVERAGES= 8
##.DIGITISER RES= 18
##SPECTROMETER/DATA SYSTEM= spect
##.PULSE SEQUENCE= zg30
##.SOLVENT NAME= DMSO
##.SHIFT REFERENCE= (INTERNAL, DMSO, 0, 15.7039)
##AUDIT TRAIL= $$ (NUMBER, WHEN, WHO, WHERE, WHAT)
$$ ##TITLE= Audit trail, XWIN-NMR		Version 3.5
$$ ##JCAMPDX= 5.01
$$ ##ORIGIN= Bruker BioSpin GmbH
$$ ##OWNER= she
$$ F:/spectra/data/she/nmr/H-F/1/audita.txt
$$ ##AUDIT TRAIL=  $$ (NUMBER, WHEN, WHO, WHERE, WHAT)
(   1,<2019-12-25 13:53:29.68 +0400>,<she>,<DPX200>,
      <created by zg, POWCHK disabled, PULCHK disabled
       configuration hash MD5:
       00 E9 B6 7A A2 85 ED C7 34 08 36 98 17 FE 4E 26
       data hash MD5: 16K
       3B 3F 43 40 6A 60 9E 7D CA 42 D8 8A 3D 74 8E EF>)
$$ ##END=
$$ 
$$ hash MD5
$$ 9E 9B E8 28 D0 66 B0 7F 88 F2 DE C4 F3 59 84 3E
##$RELAX= 
##$RELAX= 
##$RELAX= 
##$RELAX= 
##$RELAX= 
##$RELAX= 
$$ Bruker specific parameters
$$ --------------------------
##$DU= <F:/spectra>
##$EXPNO= 1
##$NAME= <H-F>
##$PROCNO= 1
##$TYPE= <nmr>
##$USER= <she>
##$AMP= (0..31)
100 100 100 100 100 100 100 100 100 100 100 100 100 100 100 100 100 100 
100 100 100 100 100 100 100 100 100 100 100 100 100 100 
##$AQSEQ= 0
##$AQ_mod= 1
##$AUNM= <au_zg>
##$AUTOPOS= <>
##$BF1= 200.13
##$BF2= 200.13
##$BF3= 200.13
##$BF4= 200.13
##$BF5= 200.13
##$BF6= 200.13
##$BF7= 200.13
##$BF8= 200.13
##$BYTORDA= 1
##$CFDGTYP= 0
##$CFRGTYP= 5
##$CHEMSTR= <none>
##$CNST= (0..31)
1 1 145 1 1 1 1 1 1 1 1 1 1 1 1 1 1 1 1 1 1 1 1 1 1 1 1 1 1 1 1 1 
##$CPDPRG= <>
##$CPDPRG1= <>
##$CPDPRG2= <>
##$CPDPRG3= <>
##$CPDPRG4= <mlev>
##$CPDPRG5= <mlev>
##$CPDPRG6= <mlev>
##$CPDPRG7= <mlev>
##$CPDPRG8= <mlev>
##$CPDPRGB= <>
##$CPDPRGT= <>
##$D= (0..31)
0 1.2 0 0 0 0 0 0 0 0.06 0 0.03 0 0 0 0 0.0002 0 0 0 0 0 0 0 0 0 0 0 0 
0 0 0 
##$DATE= 1577267609
##$DBL= (0..7)
120 120 120 120 120 120 120 120 
##$DBP= (0..7)
150 150 150 150 150 150 150 150 
##$DBP07= 0
##$DBPNAM0= <>
##$DBPNAM1= <>
##$DBPNAM2= <>
##$DBPNAM3= <>
##$DBPNAM4= <>
##$DBPNAM5= <>
##$DBPNAM6= <>
##$DBPNAM7= <>
##$DBPOAL= (0..7)
0.5 0.5 0.5 0.5 0.5 0.5 0.5 0.5 
##$DBPOFFS= (0..7)
0 0 0 0 0 0 0 0 
##$DE= 6
##$DECBNUC= <off>
##$DECIM= 24
##$DECNUC= <off>
##$DECSTAT= 4
##$DIGMOD= 1
##$DIGTYP= 9
##$DL= (0..7)
0 120 120 120 120 120 120 120 
##$DP= (0..7)
150 150 150 150 150 150 150 150 
##$DP07= 0
##$DPNAME0= <>
##$DPNAME1= <>
##$DPNAME2= <>
##$DPNAME3= <>
##$DPNAME4= <>
##$DPNAME5= <>
##$DPNAME6= <>
##$DPNAME7= <>
##$DPOAL= (0..7)
0.5 0.5 0.5 0.5 0.5 0.5 0.5 0.5 
##$DPOFFS= (0..7)
0 0 0 0 0 0 0 0 
##$DQDMODE= 0
##$DR= 18
##$DS= 0
##$DSLIST= <SSSSSSSSSSSSSSS>
##$DSPFIRM= 0
$$ [...]
##$SUBNAM2= <"">
##$SUBNAM3= <"">
##$SUBNAM4= <"">
##$SUBNAM5= <"">
##$SUBNAM6= <"">
##$SUBNAM7= <"">
##$SUBNAM8= <"">
##$SUBNAM9= <"">
##$SW= 24.9337058887773
##$SWIBOX= (0..15)
0 0 2 0 0 0 0 0 0 0 0 0 0 0 0 0 
##$SW_h= 4990.01996007984
##$TD= 16384
##$TD0= 1
##$TE= 0
##$TE2= 300
##$TE3= 300
##$TEG= 300
##$TL= (0..7)
0 120 120 120 120 120 120 120 
##$TP= (0..7)
150 150 150 150 150 150 150 150 
##$TP07= 0
##$TPNAME0= <>
##$TPNAME1= <>
##$TPNAME2= <>
##$TPNAME3= <>
##$TPNAME4= <>
##$TPNAME5= <>
##$TPNAME6= <>
##$TPNAME7= <>
##$TPOAL= (0..7)
0.5 0.5 0.5 0.5 0.5 0.5 0.5 0.5 
##$TPOFFS= (0..7)
0 0 0 0 0 0 0 0 
##$TUNHIN= 0
##$TUNHOUT= 0
##$TUNXOUT= 0
##$USERA1= <user>
##$USERA2= <user>
##$USERA3= <user>
##$USERA4= <user>
##$USERA5= <user>
##$V9= 5
##$VALIST= <valist>
##$VCLIST= <CCCCCCCCCCCCCCC>
##$VD= 0
##$VDLIST= <DDDDDDDDDDDDDDD>
##$VPLIST= <PPPPPPPPPPPPPPP>
##$VTLIST= <TTTTTTTTTTTTTTT>
##$WBST= 1024
##$WBSW= 4
##$XGAIN= (0..3)
0 0 0 0 
##$XL= 0
##$YL= 0
##$YMAX_a= 773682
##$YMIN_a= -592228
##$ZGOPTNS= <>
##$ZL1= 120
##$ZL2= 120
##$ZL3= 120
##$ZL4= 120
##$ABSF1= 10
##$ABSF2= 0
##$ABSG= 5
##$ABSL= 3
##$ALPHA= 0
##$AQORDER= 0
##$ASSFAC= 0
##$ASSFACI= 0
##$ASSFACX= 0
##$ASSWID= 0
##$AUNMP= <proc_1d>
##$AZFE= 0.1
##$AZFW= 0.1
##$BCFW= 1
##$BC_mod= 2
##$BYTORDP= 1
##$COROFFS= 0
##$CY= 11.3945322036743
##$DATMOD= 1
##$DC= 2
##$DFILT= <>
##$DTYPP= 0
##$F1P= 16.9975609425685
##$F2P= -3.02152046262296
##$FCOR= 0.5
##$FTSIZE= 0
##$FT_mod= 4
##$GAMMA= 1
##$GB= 0.15
##$INTBC= 1
##$INTSCL= 1
##$ISEN= 128
##$LB= 0.24
##$LEV0= 0
##$LPBIN= 0
##$MAXI= 10000
##$MC2= 0
##$MEAN= 0
##$ME_mod= 0
##$MI= 1.114404
##$NCOEF= 0
##$NC_proc= 0
##$NLEV= 6
##$NOISF1= 3.799351
##$NOISF2= 2.8
##$NSP= 1
##$NTH_PI= 0
##$NZP= 0
##$OFFSET= 15.70392
##$PC= 1
##$PHC0= -10150.25
##$PHC1= 16.0008
##$PH_mod= 1
##$PKNL= yes
##$PPARMOD= 0
##$PSCAL= 0
##$PSIGN= 0
##$REVERSE= no
##$SF= 200.130013532006
##$SI= 16384
##$SIGF1= 3
##$SIGF2= 2
##$SINO= 400
##$SIOLD= 16384
##$SREGLST= <1H.CDCl3>
##$SSB= 0
##$STSI= 0
##$STSR= 0
##$SW_p= 3612.71676300578
##$SYMM= 0
##$S_DEV= 0
##$TDeff= 0
##$TDoff= 0
##$TI= <>
##$TILT= no
##$TM1= 0
##$TM2= 0
##$TOPLEV= 0
##$USERP1= <user>
##$USERP2= <user>
##$USERP3= <user>
##$USERP4= <user>
##$USERP5= <user>
##$WDW= 1
##$XDIM= 8192
##$YMAX_p= 0
##$YMIN_p= 0
$$ End of Bruker specific parameters
$$ ---------------------------------
##NTUPLES= NMR FID
##VAR_NAME=  TIME,          FID/REAL,        FID/IMAG
##SYMBOL=    X,             R,               I
##VAR_TYPE=  INDEPENDENT,   DEPENDENT,       DEPENDENT
##VAR_FORM=  AFFN,          ASDF,            ASDF
##VAR_DIM=   8192,          8192,            8192
##UNITS=     SECONDS,       ARBITRARY UNITS, ARBITRARY UNITS
##FACTOR=    0.0002004,     1,               1
##FIRST=     0,             0,               0
##LAST=      1.6414764,     0,               0
##MIN=       0,             -592228,         0
##MAX=       1.6414764,     773682,          0
$$ Real data points
##PAGE= N=1
##DATA TABLE= (X++(R..R)), XYDATA
0@%%%%qJ6j6K4l2M0m8N6p8J02j20J44j76K12k51K93l46M09m75N48o33P29q34R47
$$ 0 0 0 0 0 -8 8 -8 16 -16 24 -24 32 -46 56 -64 80 -96 116 -135 158 -188 221 -254 294 -339 390 -444 503
28E03j075J222j379J549j743J955k184K434k710L019l352L713m116M562n048N587
$$ 503 -572 650 -729 820 -923 1032 -1152 1282 -1428 1591 -1761 1952 -2164 2398 -2650 2937
44B937o191O861p610Q462r437J0552j1853J3398j5260J7565k0495K4364k9759
$$ 2937 -3254 3607 -4003 4459 -4978 5574 -6279 7119 -8141 9424 -11071 13293 -16466
57a6466L7858n1521Q0379k40969L97049M33436o45176l29209K69725K26060k92303
$$ -16466 21392 -30129 50250 -190719 206330 639766 -5410 -334619 -64894 161166 -131137
68a31137q3139L07992J81475k34285j30808O8365m9093j41378K14771L45311o2733
$$ -131137 -214276 93716 275191 40906 -89902 -21537 -70630 -212008 2763 348074 285341
79B85341l47628k4074J69335j30878k25910K41951L69045k02191m96025M1060
$$ 285341 -62287 -86361 82974 -47904 -273814 -31863 337182 134991 -361034 -319974
89c19974M02460k3018l11038J97724N15366q4936o11578j26301M99222K15321
$$ -319974 82486 59468 -251570 -53846 461520 376584 -234994 -361295 137927 353248
99C53248l54789j81690K89323J36474l23877k57708J51827K47363R5892M2485
$$ 353248 -1541 -183231 106092 242566 -81311 -339019 -187192 60171 156063 198548
109A98548p3119l04713j75915L10647L55754j99169l83737J65160M30184j38774
$$ 198548 125429 -179284 -355199 -44552 311202 112033 -271704 -106544 323640 184866
119A84866n32265L30N63686K38990l26039k29350J09993j1609j98113Q5159L20087
$$ 184866 -347399 -347069 216617 455607 129568 -99782 10211 -1398 -199511 -114352 205735
130B05735l1863l74684p9326L00010Q4719k55874m4851L24527J86655j79682j98150
$$ 205735 173872 -200812 -280138 19872 104591 -151283 -196134 128393 315048 135366 -62784
141f2784k4562q606L8308K27526J32267k96035l52494J63600L99254o6253l89768
$$ -62784 -87346 -95952 -57644 169882 302149 6114 -346380 -182780 216474 150221 -239547
152b39547L3847M41082Q4853m21865k45482K29520K27733n5787m9120P5332o7558
$$ -239547 -205700 235382 320235 -101630 -347112 -117592 110141 54354 5234 80566 13008
163A3008j90279N3856K68991M9641j97570l0315J75425j8529k50693p3839J84830
$$ 13008 -177271 -123415 145576 195217 -2353 -32668 142757 124228 -126465 -200304 -15474
174a5474Q7895r5764j3588O4894j11176j63933J48759L22019L660k82982o3959
$$ -15474 72421 -23343 -36931 27963 -83213 -247146 -98387 223632 227292 -55690 -119649
185a19649K14162L9730k17808n4601K13197R0655j66976j00609Q3469J1267r9200
$$ -119649 94513 134243 -83565 -138166 75031 165686 -1290 -101899 -18430 -7163 -106363
196a06363O1002K01855n953k32501q6108J46715O6463j01319o654J32386P471
$$ -106363 -45361 156494 150541 -81960 -168068 -21353 45110 -56209 -62863 69523 76994
207G6994j38359r914J37070J1802j12015M5078J74800l4211k48573q7322J67378
$$ 76994 -61365 -71279 65791 77593 -34422 10656 185456 151245 -97328 -184650 -17272
218a7272R8973r9529o0077P1298N240r4441K1270J40762J8187j08119J8659J38564
$$ -17272 81701 -17828 -77905 -6607 -1367 -95808 -74538 66224 84411 -23708 -5049 133515
230A33515k5814j97949m6669J78360J02222j10830r8489M3496L2006m8845J2830
$$ 133515 107701 -90248 -136917 41443 143665 32835 -65654 -22158 9848 -38997 -26167
241b6167R1944k576j04713j4018Q8208j1548j19097n759J40394N8943r3565n5300
$$ -26167 65777 63201 -41512 -55530 32678 21130 -97967 -103726 36668 95611 2046 -53254
253e3254O1829L5084l4407K4777P9070l2138j30014k4646R8111J3002j13069l3533
$$ -53254 8575 43659 9252 34029 113099 80961 -49053 -73699 24412 37414 -75655 -109188
265a09188J07867N6838q2649n9545O2575O4532j3646o022L8721j3883p7913j4522
$$ -109188 -1321 55517 -27132 -86677 -24102 40430 26784 20762 59483 45600 -32313 -46835
277d6835P0565K3781n9494k2693M8831J4054m8902q446M9048L493m9681N300N2565
$$ -46835 23730 47511 -11983 -34676 14155 28209 -20693 -29139 19909 23402 -26279 -20979 31586
290C1586k5882r6254o885J07605N5180o8204n5677N1475O5813q777l0537O893
$$ 31586 5704 -90550 -97435 10170 65350 -2854 -58531 -7056 58757 49980 19443 26336
302B6336O720k0802p117Q673l2304n6086O673O8644K2174n3000l1609M0679M7505
$$ 26336 33056 12254 5137 13810 -18494 -74580 -67907 737 22911 -30089 -61698 -21019 26486
315B6486J060j0924K568r677j7879J4884K7789k3073n3850P042O9642K6251n7179
$$ 26486 27546 16622 19190 9513 -8366 6518 34307 11234 -42616 -35574 34068 60319 3140
328C140m8444K9134N1600j399m0306k7500l460R647J6211Q066j7874j7912K7478
$$ 3140 -45304 -16170 35430 34031 -6275 -33775 -37235 -27588 -11377 -3311 -21185 -39097 -11619
341a1619N3544J4143l4758k1195K5146K8143j1041l3916k3651r356k26R926P193
$$ -11619 41925 56068 21310 115 25261 53404 42363 8447 -15204 -24560 -24786 -14860 -7667
354g667j4409j8748J3815M0329J8124k2252k0974J1813K5477L815j9119j9588
$$ -7667 -22076 -40824 -27009 13320 31444 9192 -11782 31 25508 29323 10204 -9384
366i384m461J2810J9264O780j5836j7657R283K6089N688k6901k9466k359J5950
$$ -9384 -13845 -1035 18229 25009 9173 -8484 799 26888 32576 5675 -23791 -26150 -10200
379a0200N571j3928j7466m55K1745K8183J1518r284q298J2328K2770L542k3145
$$ -10200 -4629 -18557 -36023 -36478 -14733 13450 24968 15684 7386 19714 42484 46026 22881
392B2881k8118q006R517N153j2511k0794o309J7097K3809P200j3318j1549R349
$$ 22881 -5237 -13243 -3726 1427 -11084 -31878 -38187 -21090 2719 9919 -3399 -14948 -5599
405e599K0916O217j6478k0727p22J7816J4361m296j5492l494J6199J8738q54k1310
$$ -5599 15317 21534 5056 -15671 -16393 1423 15784 11488 -4004 -7498 8701 27439 26585 5275
419E275j8263P04J0414j505j9351j7745K378J9253J5576J430l719M394J6059J6809
$$ 5275 -12988 -12284 -1870 -3375 -22726 -40471 -38093 -18840 -3264 -1834 -5553 -1159 14900 31709
433C1709L194j3134j6161l865O235p53j4034j6340l316R370J0916M195m093o659
$$ 31709 34903 21769 5608 1743 7978 7225 -6809 -23149 -26465 -17095 -6179 -1984 -6077 -12736
447a2736J625J6086J3521j0212k5185n662K2982J8919j1214k0623K748K4063J4692
$$ -12736 -11111 4975 18496 8284 -16901 -22563 419 19338 8124 -12499 -9751 14312 29004
460B9004o249j3283q371J594P422K53k0104k6154r34K4889J3749j3728j2113J4638
$$ 29004 22755 9472 1101 2695 10117 10370 -9734 -35888 -36822 -11933 1816 -11912 -24025 -9387
474i387K3293P875j345J983l462r730K913J1872j0903l4350r559L2920K2135k5768
$$ -9387 13906 21781 20436 22419 18957 9227 12140 24012 13109 -21241 -30800 2120 24255 -1513
488a513l1003J2618L2391N329j7095o722L688j542J357Q017n345j7081P429L5295
$$ -1513 -32516 -19898 12493 17822 727 -5995 -2307 -3849 -2492 5525 180 -16901 -9472 25823
502B5823J0245l1978j8790K7394K4097j9056k4457P909M291k7212j6246K4866
$$ 25823 36068 4090 -14700 12694 36791 17735 -6722 1187 5478 -21734 -37980 -13114
514a3114J7609k2322j2613L2970K6077k5610k3283K9694L4421j5740k9425M281
$$ -13114 4495 -17827 -30440 2530 28607 2997 -20286 9408 43829 28089 -1336 2945
526B945O838k3584j1923L1509J8635l3164k4312L0039K4241l0477k3398L4853
$$ 2945 9783 -13801 -25724 5785 24420 -8744 -33056 -3017 21224 -9253 -32651 2202
538B202L1160k9870l6174J6877K1540k1242p769M5333K5276m5286l5830L8200
$$ 2202 33362 3492 -32682 -15805 5735 -15507 -23276 22057 47333 2047 -33783 4417
550D417L9231l2251l5676L0469K9345m3418m8731K3487L7665j6975j5968M0647
$$ 4417 43648 11397 -24279 6190 35535 -7883 -56614 -33127 4538 -12437 -28405 12242
562A2242K5009n0528l8348N2018N7916l0233m8336K4189L2704m1078m7709L1834
$$ 12242 37251 -13277 -51625 393 58309 28076 -20260 3929 36633 -4445 -52154 -20320
574b0320N1486j4630l0930J9224J0690m6721j8545O4907M4378n7149n2915M4449
$$ -20320 31166 16536 -14394 4830 15520 -31201 -49746 15161 59539 2390 -50525 -6076
586f076M0208n8446m5963P4473Q2088m5408q3288J9954O0472k1188m5745L5750
$$ -6076 34132 -24314 -70277 4196 86284 40876 -42412 -22458 38014 16826 -28919 6831
598F831N0600m2463o7273J5637L9911k3850j8528O2087M5401o4451o8003M4074
$$ 6831 57431 14968 -52305 -36668 3243 -20607 -39135 22952 68353 3902 -64101 -20027
610b0027O5799k6081l6454M6577L3888p4136o4162N7313O5156m5378m3260P3204
$$ -20027 45772 19691 -16763 29814 63702 -10434 -74596 -17283 47873 2495 -40765 32439
622C2439N4239r9790j04597P3318J32791j8779j08916o747O7572r611o0274J6258
$$ 32439 86678 -13112 -117709 -44391 88400 69621 -39295 -46042 21530 11919 -48355 -32097
634c2097O3424O773j8596J7115j4245q1634j4748J17659P3964r9580j08945N2480
$$ -32097 31327 38100 19504 36619 22374 -59260 -74008 43651 117615 18035 -90910 -38430
646c8430Q4053n3763p8891O8450J06531l6889r7238J3621N6945l7286m0268Q7234
$$ -38430 45623 -8140 -87031 -18581 87950 51061 -46177 -32556 24389 -12897 -53165 34069
658C4069Q4923q8076j36948K8860J20993M171p7925J1967P1477j6331p4800r343
$$ 34069 118992 30916 -106032 -77172 43821 47992 -29933 -17966 53511 37180 -37620 -46963
670d6963L0305m625K0373P9344n145j48093p4714J37025J34322q0223j21333O9990
$$ -46963 -16658 -21283 -910 78434 73289 -74804 -149518 -12493 121829 41606 -79727 -9737
682i737J22238p1354j54737K5674J49354K7455q7615k6338K5243m4689m4976Q0341
$$ -9737 112501 41147 -113590 -87916 61438 88893 1278 -25060 183 -44506 -89482 -9141
694i141R9574m3644r4277K4796O4836m9184p2614O3419J05286k7360r0690l34
$$ -9141 90433 46789 -47488 -22692 42144 -7040 -79654 -16235 89051 61691 -28999 -29333
706b9333K9121m7175j5319J17252P7409j18325j29923P2353J22145o2618j19250
$$ -29333 -212 -47387 -62706 54546 131955 13630 -116293 -43940 78205 15587 -103663
717a03663P1886J54941l7037j72376l4461J16678N9422l1155M851K4493n5467
$$ -103663 -31777 123164 86127 -86249 -120710 -4032 55390 24235 29086 53579 -1888
728a888o3819M4856O3188m1329m2241P9766O0879j14159j29074P1397J51288l729
$$ -1888 -65707 -20851 42337 1008 -41233 38533 99412 -14747 -143821 -72424 78864 75135
740G5135r3235J3179N6834o4493q7728P0954J22434l3165j03011K8868P7482o7271
$$ 75135 -18100 -4921 51913 -12580 -100308 -29354 93080 59915 -43096 -14228 63254 -4017
752d017j11875O6458J59968N1j34560m3639N8818M683l6629M2789O4125m1709
$$ -4017 -115892 -49434 110534 110585 -23975 -67614 -8796 -4113 -40742 2047 66172 24463
764B4463p0710L3137M5076o8284n1102J17112J22009q9738j64678J8769J28799
$$ 24463 -46247 -13110 31966 -36318 -87420 29692 151701 61963 -102715 -83946 44853
775D4853k29q9119K7641R5143l5550j16751Q09Q9228M138m6099M7915O8290p3773
$$ 44853 44624 -44495 -16854 78289 42739 -74012 -73203 16025 20163 -25936 21979 90269 16496
788A6496j22996L1382J24531J2608p4735P374N4103m6069q4754L7329R8365p170
$$ 16496 -106500 -75118 49413 62021 -12714 -5340 48763 2694 -82060 -44731 53634 46464
800D6464o3320K5713M5158p7713r4143P2479J38669j8021j19625p819P9077j6296
$$ 46464 -16856 8857 54015 -23698 -117841 -45362 93307 75286 -44339 -52158 26919 10623
812A0623p8788L5048J08435k457r3257j6336M8546k2016n0016N5444R1532l8676
$$ 10623 -68165 -33117 75318 72861 -20396 -36732 11814 -10202 -60218 -4774 86758 48082
824D8082j08284J567P6709q166n7346M2370Q5946l6044j05943J553P9549r66n2871
$$ 48082 -60202 -58635 18074 9908 -47438 -5068 80878 44834 -61109 -59556 19993 19027 -33844
837c3844L6790P3989m4107j05684J0730R4325R231n8985J6865N9036m1008r3055
$$ -33844 2946 76935 32828 -72856 -62126 32199 41430 -17555 -690 58346 17338 -75717
849g5717J6274R4256Q595o1427P992N2218l4191p9487K7569R6393P790o8421o100
$$ -75717 -59443 34813 43408 -18019 -10027 42191 8000 -71487 -43918 52475 60265 -8156 -14256
862a4256M3089k7257o2655L2625Q6496o368p6718o052N1082j5564n6635L0372
$$ -14256 28833 1576 -61079 -28454 58042 51674 -25044 -31096 19986 4422 -52213 -21841
874b1841Q2350p335p8498j2841M8838m588m1725K8723O6072j9712p7063j335N9910
$$ -21841 60509 53174 -25324 -38165 10673 6085 -35640 -6917 59155 39443 -37620 -38955 20955
887B0955r92m8453J9448O3894j5771p8856j1539N8453J4487l5396Q781M1346j9310
$$ 20955 19963 -28490 -9042 54852 39081 -39775 -51314 7139 21626 -13770 -4989 36357 17047
900A7047n8638P621N7638K975m0157J2577M3065k5844o5817R068O8266J0344m8979
$$ 17047 -41591 -33970 23668 26643 -13514 -937 42128 16284 -49533 -40465 27801 38145 -10834
913a0834o233L6986j0992m7701J0035N7557M680m5623m305L2179j1654m2630J5301
$$ -10834 -17067 19919 8927 -38774 -28739 28818 33498 -12125 -16430 15749 4095 -38535 -23234
926b3234N7242J862n0296j0615L4246J093l1431R123M1060m138m2888m631K9185
$$ -23234 34008 35870 -14426 -25041 9205 10298 -21133 -12010 29050 24912 -17976 -22607 6578
939F578m906k8615J6404M2852r953m9426k770M1411P377l1138N63L4371j372l9074
$$ 6578 1672 -26943 -10539 32313 22360 -27066 -29836 11575 18952 -12186 -11623 22748 21376 -17698
953a7698q088K9613P262j9664M346K3596j0592l3944M075L5338L888k7547j388
$$ -17698 -25786 3827 11089 -8575 -4229 19367 8775 -25169 -21094 14244 18132 -9415 -10803
966a0803K4777l606l0158r71L1102P154k1061k991J7756m848k2645N504K8541
$$ -10803 13974 10368 -19790 -20761 10341 17495 -3566 -6557 11199 6351 -16294 -10790 17751
979A7751L52k6741m542K0720n47k1612J437K4768M191k1058n245J5914J786j4742
$$ 17751 18103 -8638 -13180 7540 6993 -14619 -13182 11586 15777 -5281 -10526 5388 7174 -7568
993g568L325J8855j672k1076k532J6709J625j5245J504J7218M11j8338l272J4984
$$ -7568 -4243 14612 12940 -8136 -10668 6041 7666 -7579 -6075 11143 11554 -6784 -10056 4928
1007D928L477j2067r09J2949r93j4430k197J3329L495r541l63J0497j838j1511
$$ 4928 8405 -3662 -4571 8378 7385 -7045 -9242 4087 7582 -1959 -2322 8175 6337 -5174
1021e174j89J2571J060j1948j928R972R62j1444k568J0457M948o708l487M932
$$ -5174 -5363 7208 8268 -3680 -5608 4364 5326 -6118 -8686 1771 6719 11 -3476 1456
1035A456J199m794Q42N781r57o869J20O608k13p946n42Q032K737o621l778M332
$$ 1456 2655 -2139 -1297 4484 3527 -3342 -3222 3386 3173 -4773 -5315 2717 5454 -1167 -4945 -613
1051f13K466k926j106K587l43l335L26M010J44l997o18N235K171m571k986K471
$$ -613 1853 -1073 -2179 408 65 -3270 -2944 1066 1210 -2787 -3405 1830 4001 -570 -3556 -1085
1067a085K743j273k107L7k44k35O79J431p75j920Q93L316j61l135o57K486J732
$$ -1085 1658 385 -1722 -1685 -1929 -2164 -1485 -54 -829 -2749 -1856 1460 1299 -1836 -2493 -7 1725
1084A725k007j706P72J360m36p21N7N47M47o3k80l15n09O04K07k58o45L13J416
$$ 1725 -282 -1988 -1216 144 -292 -1013 -956 -409 38 -25 -305 -620 -1129 -525 -318 -576 -1221 -908 508
1103E08j06q95J89J214N84p21o89L52P83K8r45o54K17K01M29J02o16n58P89J321
$$ 508 402 -493 -304 910 1494 773 84 436 1219 1247 302 -352 -135 66 495 597 -19 -577 212 1533
1123A533J72j311o11J656Q45q56j086K4Q55J32k20N00j124j129R46J953m5k920
$$ 1533 1705 394 -217 1439 2284 1428 342 366 1221 1353 1133 1633 509 -620 326 2279 2234 -686
1141f86p41L006J324l007j874J678K456o84j223M72M08j443O56K663p08l431k43
$$ -686 -1427 1579 2903 -104 -1978 -300 2156 1472 249 721 1129 -314 342 3005 2297 -1134 -1377
1158a377L407K77m181j660M672K271m352k283L321J977l232j029M291J195m982
$$ -1377 2030 2307 -1874 -3534 1138 3409 -943 -3226 95 2072 -1160 -2189 2102 3297 -1685
1173a685k010M585J790m547r89N232J173o171k105N627K043n545j755P054J594
$$ -1685 -3695 890 2680 -1867 -2856 2376 3549 -2622 -4727 900 2943 -2602 -4357 2697 4291
1188D291q594l600P792N302o470l961O299K806p054l224P791L521o716k021P495
$$ 4291 -4303 -7903 -111 5191 -1279 -5240 1059 3865 -3189 -6413 1378 4899 -1817 -3838 3657
1203C657M8j1076j974J2833N605j1442o639R273N521r692m778J0705O450r338
$$ 3657 3705 -7371 -9345 3488 9093 -2349 -8988 285 5806 -3886 -8664 2041 8491 -847
1217h47n382P922K034j0803r65J5947N229j7324r037J3745R280j1450p686J2577
$$ -847 -6229 1693 3727 -7076 -8041 7906 13135 -4189 -13226 519 9799 -1651 -9337 3240
1231C240Q364j2150r202Q576M844q457Q54J6095k05k2275o801K2272J1412j8363
$$ 3240 11604 -546 -9748 -1172 3672 -4785 -3931 12164 11959 -10316 -17117 5155 16567 -1796
1245a796j0906J8085J1459j8268j6169J3439J5272o292o889Q830q16j8839j777
$$ -1796 -12702 5383 16842 -1426 -17595 -4156 11116 4824 -2065 6765 5949 -12890 -14667
1258a4667K5016R202k2825j1309K0769J0623k3697j5222K2729K1701j2812j8028
$$ -14667 10349 19551 -3274 -14583 6186 16809 -6888 -22110 619 22320 9508 -8520
1270h520O389M654j2059P48K3954N106k7669j2443K5756J1818k7443j4322L1190
$$ -8520 -2131 2523 -9536 -8788 15166 20272 -7397 -19840 5916 17734 -9709 -24031 7159
1283G159K4904k4290l0229R140K0225m749m989J4749K303k5535q583K5816J0118
$$ 7159 32063 7773 -22456 -13316 6909 2160 -2829 11920 14223 -11312 -19895 5921 16039
1296A6039k6913q193L5721J6463l8896l2411K5263L5038q799j9416Q309P041k1368
$$ 16039 -10874 -19067 16654 33117 -5779 -38190 -12927 22111 13312 -6104 2205 9246 -12122
1309a2122r020K6510J3875k4117r468L0253Q377m3671k3413M1890M0534k2952
$$ -12122 -21142 5368 19243 -4874 -14342 15911 24288 -19383 -42796 -906 39628 16676
1321A6676l6680Q140J9197j3553j1602K4035J6054k2133j4816K1366N359l5119
$$ 16676 -20004 -11864 7333 -6220 -17822 6213 22267 134 -14682 6684 12043 -23076
1333b3076r758M9248L1052m0862m4768J9788L4351j2250j9435K0863K0070k3585
$$ -23076 -32834 16414 47466 6604 -38164 -18376 15975 3725 -15710 5153 25223 1638
1345A638k3102J6293J3041k1716k397M2245J5440n2392l9652L6352M5412j6756
$$ 1638 -21464 -5171 7870 -13846 -16243 26002 41442 -10950 -50602 -14250 31162 14406
1357A4406l1273J8254K4189k5491l1191J8154K8127r213r338K3108J647m6690
$$ 14406 -16867 1387 25576 85 -31106 -12952 15175 5962 -3376 19732 21379 -25311
1369b5311k1921M9609M3249l0263l9678K0020K7123k7430l0811K9596L9009j5037
$$ -25311 -47232 2377 45626 15363 -24315 -4295 22828 -4602 -35413 -5817 33192 18155
1381A8155k8376J0143Q034l0544r518M9571L3014m1936m4806K4588L4176k4194
$$ 18155 -10221 -78 7956 -22588 -32106 17465 50479 8543 -36263 -11675 22501 -1693
1393a693k8527L2713L9617k4288m2647O755K2809j1634n730L6839J6908m7242
$$ -1693 -30220 2493 42110 17822 -24825 -18070 4739 -6895 -12625 24214 41122 -6120
1405f120l8157L2953L7923k3656k6264L3450L2639l8385m9056J9694M4269l675
$$ -6120 -44277 -11324 26599 2943 -23321 10129 42768 4383 -44673 -24979 19290 15615
1417A5615j9891J7151J1798l9199l0016L6573M2583k0469l1569K1715K2884l6689
$$ 15615 -4276 12875 24673 -14526 -44542 -7969 34614 14145 -17424 4291 27175 -9514
1429i514l7345L3789N0423j2182l6508O066J4637k5991j8695M0113L7770k9059
$$ -9514 -46859 -13070 37353 25171 -11337 -5271 9366 -16625 -35320 4793 42563 13504
1441A3504l9257J7940K5967k8862k6887L9762M5797k6668n0516P486L0519j2358
$$ 13504 -25753 -7813 18154 -10708 -37595 2167 47964 21296 -29220 -21734 8785 -3573
1453c573j8683L1683L0924l2137m2850J6626L2288j5827j9750L3400L0885l7214
$$ -3573 -22256 9427 40351 8214 -34636 -18010 14278 -1549 -21299 12101 42986 5772
1465E772m8075J8728M1390q265k2494K2903K2943l6283m1047K5665M3966j0409
$$ 5772 -42303 -23575 17815 9550 -12944 9959 32902 -3381 -44428 -18763 25203 14794
1477A4794k7104J8592K1374l4875l8408K9640M8241j0360l3622J0138J9708k7882
$$ 14794 -12310 6282 27656 -7219 -45627 -15987 32254 21894 -11728 -1590 18118 -9764
1489i764k9314L2304M4555j5802l8248Q272K2237k2475k5144L1344M1530j9551
$$ -9764 -39078 -6774 37781 21979 -16269 -7997 14240 -8235 -33379 -2035 39495 19944
1501A9944m1098P374K5096j6579k1668L0892L7531k4722m4226R401L0943j1027
$$ 19944 -21154 -13780 11316 -5263 -26931 3961 41492 16770 -27456 -18055 12888 1861
1513A861k1885K4745L2347k4010m2417R671L2229p260j9375K2469K5776k9165
$$ 1861 -20024 4721 37068 13058 -29359 -19688 12541 5281 -14094 8375 34151 4986
1525D986m1211J5891L9780o134k5081J4808K4482k4389l7252J5539L9628l243
$$ 4986 -36225 -20334 19446 13312 -11769 3039 27521 3132 -34120 -18581 21047 17804
1537A7804k4421R032J6781k4609k9647K3872M0016j0536l2334P562K2576j8463
$$ 17804 -6617 2415 19196 -5413 -35060 -11188 28828 18292 -14042 -6480 16096 -2367
1549b367k8244K1229L8844q589l3844J981K0384j2669k0543K2109L2277j4921
$$ -2367 -30611 -9382 29462 20873 -12971 -10990 9394 -3275 -23818 -1709 30568 15647
1561A5647l5212N566K5446r965k2228J7598L1108j2420l5473J718K4389l179j6196
$$ 15647 -19565 -13999 11447 1482 -20746 -3148 27960 15540 -19933 -18215 6174 2995 -13201
1574a3201J5004K2374j7163l0935Q954K7687n227k0387J2640K4194j6240l3413
$$ -13201 1803 24177 7014 -23921 -14967 12720 7493 -12894 -254 23940 7700 -25713
1586b5713O029L1148J298j9701M327J6651j2766k3900J0206K7586l053k0435N207
$$ -25713 -19684 11464 12762 -6939 -2612 14039 1273 -22627 -12421 15165 12112 -8323 -3116
1599c116J6377j2976k3003J1905K9030k698k3820L54J5860p050j7563J0980K3505
$$ -3116 13261 285 -22718 -10813 18217 15519 -8301 -7947 7913 863 -16700 -5720 17785
1612A7785n904k2831K279J6055o510j6934J1393K4040o935k4214L07J8332j503
$$ 17785 11881 -10950 -8671 7384 874 -16060 -4667 19373 12438 -11776 -11469 6863 5360
1625E360j4283O578J8129o522k0949J784J5917j907j2643P791J5745q791j9945
$$ 5360 -8923 -2345 15784 9262 -11687 -9903 6014 4107 -8536 -745 15000 6209 -13736
1638a3736L321J8594o78j3250L810J3819o717j7609L574J7040M86j2597K358J0958
$$ -13736 -10415 8179 7501 -5749 -1939 11880 5163 -12446 -8872 8168 8654 -3943 -1585 9373
1652I373n918j4886N027J5803q17j3397O81J0244m039j2650M772J5261n61j3183
$$ 9373 3455 -11431 -6404 9399 8582 -4815 -4134 6110 2071 -10579 -5807 9454 8893 -4290
1666d290l80J0028k120r915L481J1936k044j2067K55Q854j982q393L618J0871
$$ -4290 -4670 5358 3238 -6677 -3196 8740 6696 -5371 -5116 3738 1756 -6637 -3019 7852
1680G852k420j1684K62R590j99q002J908Q760j782r675J79Q305k04o381J896P728
$$ 7852 5432 -6252 -5990 3600 3401 -4601 -2693 6067 4285 -5390 -5211 3094 2890 -3491 -1595 6133
1696F133k601r253O76Q352K26p148K4O298p52p444M49P083P05m711N26M836k182
$$ 6133 3532 -5721 -5045 3307 3533 -3615 -3591 2707 1955 -5489 -5040 2043 2748 -1963 -1437 3399 1217
1713A217n430J907O249r07n878p1N088r14n413P44N464L80m666l74L801q9l876
$$ 1217 -4213 -2306 3943 3036 -2842 -2913 2175 1261 -4152 -3408 2056 2436 -2230 -2604 1197 1108 -2768
1730b768O24M092m63l775n4L843J88l437R18L568j45l693p39L069j19k567k40
$$ -2768 -2144 1948 1485 -2290 -2344 1499 1687 -1750 -832 2736 2591 -1102 -1841 1228 1109 -1458 -1698
1747a698K285l12k234n7K616L68j800M57K392q6k192l08K122N29k491k72J143
$$ -1698 587 275 -1959 -2016 600 968 -832 -375 2017 1931 -261 -569 1553 2082 -409 -681 462
1764D62M79j502l16J486J24p48j5J046k71j297K43J502p52p42k74J496N77j374
$$ 462 941 -561 -877 609 733 -15 -30 1016 745 -552 -309 1193 441 -301 -575 921 1498 124
1782A24q3J050O64k58j009J94j56n08j66j5l43k47L37M37M39o92K25J036L10n99
$$ 124 41 1091 1755 1497 488 682 526 18 -148 -163 -506 -753 -416 21 460 -232 -7 1029 1339 740
1802G40j96M26l23m06k56K64j61m69k88J215l14n94k39O82J84k53p47N8K22m59
$$ 740 544 970 647 241 -15 249 88 -381 -669 546 232 -362 -601 81 265 12 -735 -677 -455 -914
1822i14J29M15M04n92O60P38K24j247K60L30j4r65q87P60j93q54j06J318O0j132
$$ -914 -785 -370 34 -558 102 840 1064 -183 77 407 393 -572 -1459 -699 -892 -1746 -1852 -534 -474 -1606
1842a606P66J531L57j928l3J878J044k549r98R47R43j008j05O61Oo54l17J645
$$ -1606 -840 691 1048 -880 -913 965 2009 -540 -1538 -591 352 -656 -761 -100 -94 -748 -1065 580
1860E80o55j773K23K567K98l226o30K583J307j334m80K125l27j524O44K284j577
$$ 580 -75 -1848 -1625 942 1240 -1986 -2616 -33 1274 -60 -540 1585 1258 -266 378 2662 1085
1877A085l324Q27L840o20n992o33N661L211l559l693K965K776j011j929J102Q56
$$ 1085 -2239 -1412 2428 1808 -4184 -4817 844 4055 496 -3197 -232 2544 1533 -396 706 1562
1893A562j790R98K235k815m294K160O656r2o818j961O085J747m972j510M336J375
$$ 1562 -228 770 3005 190 -4104 -1944 4712 4620 -2198 -4159 1926 3673 -1299 -2809 1527 2902
1909B902m576j077M636k79n448J793Q561P65r594m126Q203N627n706n789L420
$$ 2902 -1674 -2751 1885 1606 -3842 -2049 6512 7277 -2317 -6443 1760 7387 1681 -4108 -688
1924f88L625l125k553J269K22j208M229N674n488j0523K942J2870J300j2412l525
$$ -688 2937 -188 -2741 -1472 -1250 -2458 1771 7445 1957 -8566 -5624 7246 8546 -3866 -7391
1939g391J1011M201j0549n875Q721P085n380m396M182j92p231K6J0749K301j0803
$$ -7391 3620 7821 -2728 -8603 118 7203 1823 -2573 1609 1417 -5814 -5788 4961 7262 -3541
1954c541m638Q732M372p940l329Q412N143n760l576L505j886o245M870J2248l760
$$ -3541 -8179 553 4925 -3015 -6344 2068 7211 1451 -2125 1380 -506 -6751 -1881 10367 6607
1969F607j6990j617J6494M602j5856n173J6652R994j4179j3223P334J0964k751
$$ 6607 -10383 -12000 4494 9096 -6760 -11933 4719 14713 534 -12689 -5355 5609 2858
1982B858l887M420m36r114q86J0780K397j0547M1J2634J58j6529n640J4862Q362
$$ 2858 -1029 3391 2955 -6159 -7045 3735 6132 -4415 -4374 8260 8418 -8111 -13751 1111 9473
1997I473r599n103Q607R4j3283L21J8234N056j6723n955J5124N135j8486q293
$$ 9473 -126 -5229 3378 3472 -9811 -9490 8744 13800 -2923 -8878 6246 11381 -7105 -15398
2011a5398J8257J3974j2278j4953M791P410m551r81J0492J493j2252k231J1338
$$ -15398 2859 16833 4555 -10398 -5607 1803 -2748 -3729 6763 8256 -3996 -6227 5111
2024E111m84j4895J413K2064M813k3452j1597J6288J1805j1916o055J4572N992
$$ 5111 4627 -10268 -8855 13209 18022 -5430 -17027 -739 11066 -850 -6905 7667 13659
2037A3659j8117j0360J3701R976j1243n030J5693M618j9902j1256J6864J5522
$$ 13659 -4458 -14818 -1117 8859 -2384 -7414 8279 12897 -7005 -18261 -1397 14125
2049A4125q497r144Q074L126j4412n151J5385P275j2063m570J3250j59k1426m540
$$ 14125 5628 -3516 4558 7684 -6728 -11879 3506 10781 -1282 -5852 7398 7239 -14187 -18727
2063a8727K5967J3754j8907j5577J2824J0117j5009q731J7813J3711j3576j4380
$$ -18727 7240 20994 2087 -13490 -666 9451 -5558 -14289 3524 17235 3659 -10721
2075a0721Q580P011j1358l007J8917R041j9475j4587J1862R753j0956m892J7885
$$ -10721 -2141 4870 -6488 -9495 9422 18463 -1012 -15599 -3737 6016 -4940 -9832 8053
2088H053P596j9790j3093J4324J1407j0976m067J8039O191k3947j5110J7971J6595
$$ 8053 15649 -4141 -17234 -2910 8497 -2479 -6546 11493 17684 -6263 -21373 -3402 13193
2101A3193j0972j0724J3484P541j9784j3459J7566J7172r500j0077R866M266j8458
$$ 13193 2221 -8503 4981 12522 -7262 -20721 -3155 14017 4517 -5560 4306 8572 -9886
2114i886r042K0353J5941j3412j2646J0392O191j6252p870K0886J5321j5585j5757
$$ -9886 -18928 1425 17366 3954 -8692 1700 7891 -8361 -16231 4655 19976 4391 -11366
2127a1366R490P992j4131p314K0298J4631j7048j6673R727J1414j0823n976J8377
$$ -11366 -1876 6116 -8015 -15329 4969 19600 2552 -14121 -4394 7020 -3803 -9779 8598
2140H598J1686j8584j7729J0626J2829r558o715J6438J0138j9436j7545J2547
$$ 8598 20284 1700 -16029 -5403 7426 -2132 -8847 7591 17729 -1707 -19252 -6705
2152f705J6101o838q119J2646P078j8814j4653J5368J6155q612q978J2021O130
$$ -6705 9396 2558 -5561 7085 14163 -4651 -19304 -3936 12219 3607 -5371 6650 12780
2165A2780j9087j2983J7775J8855j0051j4178Q300O799j5491j0932J7793J6977
$$ 12780 -6307 -19290 -1515 17340 7289 -6889 1411 8210 -7281 -18213 -420 16557
2177A6557j0919j4599Q392Q234j3631q710J8185J6449j2639j7717O169R889r725
$$ 16557 5638 -8961 -569 7665 -5966 -14676 3509 19958 7319 -10398 -4229 5660 -4065
2190d065p179J5176J2587j3735j4822P884R620r719o271J7201J2093j7598j8494
$$ -4065 -11244 3932 16519 2784 -12038 -4154 5466 -4253 -10524 6677 18770 1172 -17322
2203a7322J0003J5306o592r093J1774J1007j3813j6633Q614J5110m488q482R134
$$ -17322 -7319 7987 1395 -7698 4076 15083 1270 -15363 -6749 8361 3873 -4609 4525
2216D525O487j5674j3819J2372J6567o032j0772P501P723j2227j1567J2649J5597
$$ 4525 11012 -4662 -18481 -6109 10458 4426 -6346 1155 8878 -3349 -14916 -2267 13330
2229A3330p096j1480N491O871j2742j0191J5273J5665r337j5311N517J0209q041
$$ 13330 6234 -5246 245 7116 -5626 -15817 -544 15121 5784 -9527 -4010 6199 -1842
2242a842j0282J1201J4658q117j4225L369Q507o036n890J1864J0934j0985j3674
$$ -1842 -12124 -923 13735 5618 -8607 -5238 3269 -2767 -8657 3207 14141 3156 -10518
2255a0518O701J0543o391q231J0511J0715j1314j5172N783J2167l334p323P926
$$ -10518 -3817 6726 335 -7896 2615 13330 2016 -13156 -7373 4794 1460 -5863 2063
2268B063Q752j0397j2429P297J2950l346r016N690P602r567j1670P324J3602l468
$$ 2063 10815 418 -12011 -4714 8236 4890 -4126 1564 9166 -401 -12071 -4747 8855 5387
2282E387r194L895N976p600q673Q220J1454m944j0149M093P024o964q166Q544
$$ 5387 -3807 88 6064 -1536 -10209 -1989 9465 4521 -5628 -1535 5489 -1475 -9641 -1097
2296a097J2008m712j1455K549P973m349p515O496R280n193j0631K361O829l126
$$ -1097 10911 6199 -5256 -2707 5266 917 -6598 -102 9178 3985 -6646 -4285 2544 -582
2310e82n505O249R023o095r687K579R134l001o329M649P795n678j0083L124Q582
$$ -582 -6087 162 9185 3090 -6597 -4018 5116 2115 -4214 435 8230 2552 -7531 -4407 4175
2325D175j513n971L371O361n456q385L861Q415j961o421K254N398m373o864M126
$$ 4175 2662 -3309 62 6423 967 -7418 -3557 4858 2897 -3524 -1270 4128 -245 -7109 -2983
2340b983Q290j239o293J883M703l337o039L069P347k596p130J244M967k240n527
$$ -2983 5307 4068 -2225 -342 4361 1024 -5015 -1946 5401 2805 -4325 -3081 1886 -354 -5881
2355e881L437P061j475o274O17N120j787l939K576M892k166n777J121M501j515
$$ -5881 -2444 4617 3142 -3132 -2515 2605 818 -3121 -545 4347 2181 -3596 -2475 2026 511
2370E11l818K792M684j976n973Q81M638o29l628Q13M263j819m888J608M789J29
$$ 511 -3307 -515 4169 2193 -3780 -2899 1739 1110 -2518 -1705 2558 739 -4149 -2541 2248 2377
2386B377k985P12L166j796m017J020L892m22l838M16K802j354l123J361L827m03
$$ 2377 -608 104 3270 1474 -2543 -1523 2369 1947 -1891 -1475 1327 -27 -3150 -1789 2038 1635
2402A635k816N39K643j129k343J006L250j388k945L42K675m20k306R66K173q4
$$ 1635 -1181 -642 2001 872 -1471 -465 2785 1397 -1548 -1206 1469 1049 -1257 -291 1882 1798
2418A798k563q5J818n16j915M35K030o01j645N37J791Pj292Q53J583j54k409M0
$$ 1798 -765 -850 968 452 -1463 -1028 1002 401 -1244 -707 1084 1091 -201 652 2235 2081 -328 -288
2436b88J078K37j346o49J219k67j198P4J533J26o89k44J366l90j323K35J161l
$$ -288 790 1027 -319 -968 251 -16 -1214 -1140 393 519 -170 -414 952 562 -761 -526 635 632
2454F32j051o8Q12J43o69J79P19J18j319K48M10j92r33m4M57M42r25K02P94L77
$$ 632 -419 -487 325 468 -201 -22 697 815 -504 -256 154 -38 -971 -1015 -558 -116 -1041 -839 -45 332
2474C32l38k3Q47r8n06n7J74q8n20n17L27p3k66m26O70K68m0R1M2K26m49L60K67
$$ 332 -6 -29 818 720 214 157 331 243 -277 -794 -467 -540 -806 -1232 -562 -294 -334 -243 -201 25 -424 -64 203
2497B03m01j06l49J053O4p98j33R14N69p32r37K20L49m06l88k14O4K95K99N58
$$ 203 -198 -304 -653 400 464 -334 -467 447 1016 284 -653 -433 -84 -490 -878 -1092 -1028 -733 -434 124
2517A24k06pK14R07J11l24n67K55Pl93k65m31P7k76M99R53m41j211N94J537Lj505
$$ 124 -82 -89 125 1032 1143 819 252 507 514 121 -144 -575 -498 -774 -275 678 237 -974 -380 1157 1160 -345
2539c45q10J389J131n04j463j3J280O50j92o88l82l3R53L92j861j378J070J620
$$ -345 -1155 234 1365 861 -602 -615 665 1315 1123 435 53 20 973 1365 -496 -1874 -804 816
2557H16l36k090L8K179Q44j298n22J562pr89O8J107o4k176j36J890K01k209n91
$$ 816 480 -1610 -1572 607 1451 153 -369 1193 1186 197 265 1372 1308 -868 -1004 886 1087 -1122 -1713
2576a713J781J508r59j295k44O49M10N87j34j125j107K036J943j862l352J757
$$ -1713 68 1576 617 -678 -922 -273 137 724 590 -535 -1642 394 2337 475 -2877 -1120
2592a120M486q8m831j575L967J570l017j631J560J257j238r51J311K28j287P89
$$ -1120 3366 3278 -1553 -3128 839 2409 -608 -2239 -679 578 -660 -1611 -300 -72 -1359 -570
2608e70K885n19l233n42K838R08k232l11J372j09k507O24K946j179k687J254M297
$$ -570 2315 1796 -1437 -1979 859 1767 -465 -776 596 487 -2020 -1396 1550 371 -2316 -1062 3235
2625C235j954n406J76O331J857n603k914M278K840l148k092K599K124j385p50
$$ 3235 1281 -4125 -3949 2382 4239 -1364 -4278 0 2840 -308 -2400 199 2323 938 188
2640A88M03j141k540J839M615j239n817O28M690J49m410N20N551P06n365j477
$$ 188 591 -550 -3090 -1251 3364 2125 -3692 -3064 1626 1775 -2635 -2115 3436 4142 -1223 -2700
2656b700M126P42m521O85O100o44p036j875O200L100m795k164M541J776m622k969
$$ -2700 1426 2168 -2353 -1668 4432 3788 -3248 -5123 1077 4177 -618 -2782 1759 3535 -1087 -4056
2672d056M036J801k276R48K766j889o058J807P480L13o963n20O761k31q345j151
$$ -4056 -20 1781 -495 453 3219 1330 -4728 -2921 4559 4872 -2091 -2611 4150 3919 -4426 -5577
2688e577P788L491o411k946M803J015n438q36P940K115o893k836N349J024n663
$$ -5577 2211 5702 -709 -3655 1148 2163 -3275 -4111 3829 5944 -949 -3785 1564 2588 -3075
2703c075q20P418K064o823k743M570J146m720R84P746p93r025k037P696K038p224
$$ -3075 -3895 3523 5587 -1236 -3979 591 1737 -2983 -1999 5747 4954 -4071 -6108 1588 3626 -3598
2719c598j1Q975J061j0267m029Q637M461n760j621O345J35r103k521Q747K994
$$ -3598 -3609 5366 6427 -3840 -7869 768 5229 -531 -2152 4193 4328 -4775 -7296 1451 4445
2734D445n961j500O587n60q804j327R858M081p453k409N975k71q687k44J0225
$$ 4445 -1516 -3016 3571 3011 -5793 -7120 2738 6819 -634 -3043 2932 2661 -6026 -6270 3955
2749C955L445q863l598O799J423q651p43J0973L624r658n045O451K167o477p00
$$ 3955 7400 -1463 -5061 1738 3161 -5490 -6233 4740 8364 -1294 -6339 112 2279 -4198 -4898
2764d898J0302K752j0227n222P887L104o218q49R496J729j0830n540Q291M159
$$ -4898 5404 8156 -2071 -7293 594 3698 -2520 -3369 6127 7856 -2974 -8514 -223 3936
2778C936o297o88Q624P67j1330m123R906N884p152k249P892Q44j1605l611J0585
$$ 3936 -2361 -3049 5575 6342 -4988 -9111 795 6679 -473 -2722 5170 6014 -5591 -9202 1383
2793A383O105p166l674P113Q07j0523k529J1920N876q970n306O885J412r125j970
$$ 1383 7488 322 -3352 3761 4568 -5955 -8484 3436 9312 342 -4964 1921 3333 -5792 -7762
2808g762J1602N418q738n890O551K013q031p01J1720L790j0830o409P440L701
$$ -7762 3840 9258 520 -5370 1181 3194 -4837 -5538 6182 9972 -858 -7267 173 3874
2822C874p960j577J1123L994j1191o950P312N568n928j708R194K567j1653o275
$$ 3874 -4086 -5663 5460 9454 -1737 -8687 -1375 4193 -1735 -3443 5751 8318 -3335 -9610
2836i610Q960O180o159k502Q171J829j1165n446R398O857n927l228O273Q21j0428
$$ -9610 -650 5530 -629 -3131 5040 6869 -4296 -9742 -344 6513 586 -2642 3631 4452 -5976
2851e976l733J1038O742p101n153O643K606r999m013J1040P385p495p165N192
$$ -5976 -9709 1329 8071 970 -4183 2460 5066 -4933 -8946 2094 9479 1984 -5181 11
2865A1K829p351k780J0153N996q348o581N946L113p391j360J0074M994r718p117
$$ 11 2840 -4511 -7291 2862 8858 510 -6071 -125 2988 -4403 -5763 4311 9305 -413 -7530
2880g530N901N042o151j959R238M203r982p240P059N530n525k516Q459K757j0046
$$ -7530 -1629 3413 -2738 -4697 4541 8744 -1238 -8478 -1419 4111 -1414 -3930 4529 7286 -2760
2895b760o906P610P232m706l060O198K336r597m647P954O955n039m314N380J743
$$ -2760 -9666 -2056 5176 470 -2590 3608 5944 -3653 -8300 -346 6609 1570 -2744 2636 4379
2910D379q605m488R132P291o137n553M700K969p260l389Q784O165o355o071M082
$$ 4379 -4226 -8714 418 7709 1572 -3981 719 3688 -3572 -6961 1823 7988 1633 -4438 -356
2925c56L368o463k194Q165N760o828o652M380L656n176k352P683M811p599o672
$$ -356 3012 -3451 -5645 2520 8280 1452 -5200 -820 2836 -2340 -4692 2991 7802 203 -6469
2940f469M361N019m033k405O733L975p437o411N132N662l972k615N656K404p525
$$ -6469 -2108 2911 -1122 -3527 3206 7181 -256 -6667 -1535 4127 155 -2460 3196 5600 -1925
2955a925n436O020N831l489l315M588K173o527m539O240N473l682m002L548K373
$$ -1925 -7361 -1341 4490 1001 -2314 2274 4447 -2080 -6619 -379 5094 1412 -2590 958 3331
2970C331n556l621N989N951m245n240L365K833m577l108N524M995m599m796K783
$$ 3331 -2225 -5846 143 6094 1849 -3391 -26 2807 -1770 -4878 646 5641 1042 -3754 -971
2985i71K884l952k140N515M346m911n100L219L494l429k641M948L893m455n759
$$ -971 1913 -2039 -4179 1336 5682 771 -4329 -1110 2384 -1045 -3686 1262 5155 700 -5059
3000e059K910M153k269k794M420K831m606m402L174M259k112k711L181K524m342
$$ -5059 -2149 2004 -265 -3059 1361 4192 -414 -4816 -1642 2617 505 -2206 975 3499 -843
3015h43l782L412M357j970k748K185K262l792l246L548L869k439l268K166K419
$$ -843 -4625 -1213 3144 1174 -1574 611 2873 -919 -4165 -617 3252 813 -2455 -289 2130
3030B130l256k720L617M271k942l310J823K358k307k373K740L383k925k670J338
$$ 2130 -1126 -3846 -229 4042 1100 -2210 -387 1971 -336 -2709 31 3414 489 -2181 -843
3045h43K634k233j833K826K734k639k844J299K811j631k185K508K260k158l311
$$ -843 1791 -442 -2275 551 3285 646 -2198 -899 1912 281 -1904 604 2864 706 -2605
3060b605J854K457q71j879J589K272k335k684J587K511j216j925J319J302j365
$$ -2605 -751 1706 835 -1044 545 2817 482 -2202 -615 1896 680 -1245 74 1376 11
3075A1k174J576K377r30j695Q18J561j312k082J510J815p62j843Q05J509j234
$$ 11 -2163 -587 1790 860 -835 -17 1544 232 -1850 -340 1475 713 -1130 -325 1184 -50
3091e0j534J449J464p03j583M77J305n26j503Q90J477r42j129K25J724q34j243
$$ -50 -1584 -135 1329 626 -957 -480 825 299 -1204 -314 1163 221 -908 -683 1041 207 -1036
3108a036J027J330p87j434L29J227p99o00K92J261l41j586L74J393k42r28K43
$$ -1036 -9 1321 534 -900 -571 656 -143 -743 -451 810 469 -1117 -743 650 408 -520 -277
3125b77J122r58j023P19J176r03m09L43O26m57p54M62O70n2p84L0N12l05m91M69
$$ -277 845 -113 -1136 -417 759 -144 -553 -210 416 -41 -795 -333 337 285 -499 -469 43 -262 -753 -284
3145b84L60J4m58kM40l2n11N78L42j00o18o4P03l96k79j45N11J91m77j02L46j87
$$ -284 76 90 -368 -370 70 38 -473 105 447 347 -271 -335 368 -28 -307 -452 59 250 -227 -329 17 -170
3167a70k06K72L00r3l5J04q2L15m27m08P48j73j94L35j96Oq8J21L14l96k75R4
$$ -170 -376 -104 196 103 68 172 90 405 -22 -430 318 145 -49 286 90 96 8 129 443 47 -228 -134
3189a34L80j14o56K13O47K97m04n82P53q1r0K13m47J38l1n1Q5m21j08M01L84j76
$$ -134 246 132 -524 -311 336 633 229 -353 400 319 229 442 -5 133 102 51 136 -285 -393 8 392 216
3211B16n67L96L96qo99j1L07L08k62O2P6j8l59L60K48j76p92K84N78P3n66j88
$$ 216 -351 45 441 433 -266 -277 30 338 76 138 214 196 -163 197 445 269 -523 -239 339 412 -154 -342
3233c42M8O69k25k72p9k9K52K29k7n22l19P20L42n28q06n1J369J64r64m82Q98
$$ -342 -294 375 150 -122 -201 -230 22 251 224 -298 -617 103 445 -83 -889 -940 429 593 -371 -853 45
3254D5N79j078l02P42j75k02L04K39j76p22M15Q90k43j135K28R99o8n76j18K72
$$ 45 624 -454 -756 -14 -189 -391 -87 152 -24 -746 -331 559 316 -819 -591 408 340 -236 -354 -82
3274h2M9m31J61J002l88j193O02J097k18j764M57J828p0j996k10J039P24p45J3
$$ -82 -33 -464 -303 699 311 -882 -280 817 599 -1165 -708 1120 1050 -946 -1156 -117 607 -138 -125
3293a25N10l50o17J89J288n70r52L78J675q83k009M50J950J52j515r9J312l16
$$ -125 385 35 -582 -393 895 325 -627 -249 1426 543 -1466 -1016 934 1086 -429 -528 784 468
3311D68j452M07J853k60j921K08K092p44k102M27K262L03j938n96J663j16j434
$$ 468 -984 -577 1276 1016 -905 -697 1395 651 -1451 -1024 1238 1541 -397 -993 670 554 -880
3328h80O11J348m07j631M95J598n48j940R16K792r58k614m95K672K69k197L25
$$ -880 -269 1079 672 -959 -464 1134 586 -1354 -438 2354 1396 -1218 -1713 959 1228 -969 -644
3345f44K187m1k859l82K759J14k109N17K485n73l260J33K704M23k227J22K195
$$ -644 1543 1502 -1357 -1739 1020 1134 -975 -458 2027 1454 -1806 -1673 1031 1454 -773 -651 1544
3362A544o80k922K77K916K92k596J84K766j264l163N60M255J11l357o24K730l14
$$ 1544 864 -2058 -1781 1135 1427 -1169 -985 1781 517 -2646 -2086 2169 2280 -1077 -1701 1029 715
3379G15k853N09L581N77l598j017K841P0l187J088L614m5m042l53L024O8l098
$$ 715 -2138 -1629 1952 2529 -1069 -2086 755 825 -2362 -1274 2340 2295 -1747 -2100 924 992 -2106
3396b106O06L913k39m091o91K929J037k802M89L902r97m447j043M529J057l178
$$ -2106 -1500 2413 2174 -1917 -2608 321 1358 -1444 -955 2947 1950 -2497 -3540 989 2046 -1132
3412a132K65L216n15m704l17M752J002l412p64L614o39m658K15N057J358l982
$$ -1132 -867 2349 1834 -2870 -3187 1565 2567 -845 -1609 2005 1366 -3292 -3077 1980 3338 -644
3428f44r14L166n70m014M98N259P04m741q74L844p31m310J110N649M27n002j508
$$ -644 -1558 1608 1038 -2976 -2478 2781 3485 -1256 -2130 1714 983 -3327 -2217 3432 3859 -1143 -2651
3445b651L811O71m165O48N350k01n190j651M107P83l467O41N106j55o123j753
$$ -2651 1160 1831 -2334 -1686 3664 3463 -1727 -3378 729 1512 -1955 -1314 3792 3637 -2486 -4239
3461d239N234J624l580N0M456m12o138j336N633J706l718o1L992q20o449l47O207
$$ -4239 995 2619 -961 -911 3545 3133 -3005 -4341 1292 2998 -720 -781 3211 2391 -4058 -4405 1802
3478A802J981m156j510L850r1n535l46O410J690m583j578L823l01m860k24O774
$$ 1802 3783 -373 -1883 1967 1876 -3659 -4005 2405 4095 -488 -2066 1757 1456 -3404 -3628 3146
3494C146J353n210k468L675O68m448L18O662Q18n863k420M047J227m428O10O267
$$ 3146 4499 -711 -3179 496 1164 -3284 -2966 3696 4514 -1349 -3769 278 1505 -2923 -2313 3954
3510C954M68o732k376N075J718l888R7N391J05o700k341N558K445l707n91M537
$$ 3954 4422 -2310 -4686 389 2107 -1781 -1684 3707 3812 -2888 -5229 329 2774 -933 -1524 3013
3526C013m5o466j626O098K946m429j270M070M68o632r62O398K940m625k005L764
$$ 3013 2968 -3498 -5124 974 3920 -509 -1779 2291 2759 -3873 -4835 1563 4503 -122 -2127 1637
3542A637M84n442j065O864K559n429k630M131Q62n391l13O373K260n551k869M275
$$ 1637 2121 -3321 -4386 2478 5037 -392 -3022 1109 1971 -3420 -3733 2640 4900 -651 -3520 755
3558G55Q97m290k46O274J770o112l320M573J835m032l23N555J282o332k874M465
$$ 755 1652 -2638 -2884 3390 5160 -952 -4272 301 2136 -1896 -2219 3336 4618 -1714 -4588 -123
3574a23K541l252n59M746M06o260k494N659K592l192j517M154K47n998j847N756
$$ -123 2418 -834 -1393 3353 3759 -2501 -4995 664 3256 64 -1453 2701 2948 -3050 -4897 859
3590H59K814l489j942L880P3n108j689O057L152m491k539L754K96m532q56N774
$$ 859 3673 184 -1758 2122 2195 -2913 -4602 1455 4607 116 -2423 1331 1627 -2905 -3761 2013
3606B013K794m762k731L265J118l720j327N685K354n043l511L652J960l883o73
$$ 2013 4807 45 -2686 579 1697 -2023 -3350 2335 4689 -354 -3865 -213 1747 -2136 -2809
3621b809N263J822n175k934L757J757k965n69M742O49m892l347M485K452k537
$$ -2809 2454 4276 -899 -3833 -76 1681 -1284 -1853 2889 3538 -1354 -4701 -216 2236 -301
3636c01j341L842P70n031j994M144K771k777j334K800Q67m865j457M481K803l078
$$ -301 -1642 2200 2970 -2061 -4055 89 2860 83 -1251 1549 2416 -2449 -3906 575 3378 300
3652C00k085K906Q53l969j415M187K962l769k055K575R44l358j103M297K536l879
$$ 300 -1785 1121 1974 -1995 -3410 777 3739 -30 -2085 490 1434 -1924 -3027 1270 3806 -73
3668g3k352K525J101k490q76L563K129l870k362K340J803k585o13L597J151l523
$$ -73 -2425 100 1201 -1289 -2165 1398 3527 -343 -2705 -365 1438 -1147 -1760 1837 2988 -535
3684e35k456K797J999k296j100L010J255l673j912K892J875j729j708K901P60
$$ -535 -2991 -194 1805 -491 -1591 1419 2674 -999 -2911 -19 1856 127 -1581 1320 2080
3699B080l081j835K956K252k085j571J958R56k643j337L114J813k677j093J563
$$ 2080 -1001 -2836 120 2372 287 -1284 674 1630 -1013 -2350 764 2577 -100 -1193 370
3714C70J307k626j075K450K047k178j643J563R04j608j259K416J763k281j537
$$ 370 1677 -949 -2024 426 2473 295 -1348 215 1119 -489 -1748 668 2431 150 -1387
3729a387J243J135j838m93K377J067k258j724J840J264j525j013K066P49j776
$$ -1387 -144 991 -847 -1340 1037 2104 -154 -1878 -38 1226 -299 -1312 754 1503 -273
3744b73j199J301J321j130j223J663R16k101q87J162J689j067j287J471P30j545
$$ -273 -1472 -171 1150 20 -1203 460 1376 -725 -1612 -450 1239 172 -1115 356 1086 -459
3760d59j326J987Q25q19j065J041O03j575o99J514Q59p12j142O90J501j414m95
$$ -459 -1785 202 1027 208 -857 184 787 -788 -1487 27 886 174 -968 -278 1223 -191 -686
3777f86P50J203j106j156R98O43r65o60J012R75r54j224J143N35p42o31P45Q08
$$ -686 64 1267 161 -995 3 646 -319 -979 33 1008 54 -1170 -27 508 -234 -865 -120 688
3795F88p12q41N55O55k71o33N37P59n18j272J137M92m18r39P92P89q57m57L12
$$ 688 -24 -865 -310 345 74 -559 -22 737 219 -1053 84 576 158 -781 11 800 -57 -514 -202
3814b02Q74j09p82r1Q89o18o29L79J050l71o15L45L13l85k37J07O88n44m03K99
$$ -202 672 563 -219 -310 579 -39 -668 -289 761 390 -225 120 433 48 -189 -82 606 62 -341 -42
3834d2N33m48j89K70L80l36o74L85K85J7p21N00M53o9p48M77L29n3n06R5O03m17
$$ -42 491 43 -146 124 504 168 -506 -121 164 181 -540 -40 413 344 -404 73 402 349 -157 -62 541 124
3856A24l45K71Lj0j53K64K83m13j08J50O09n52j62k09N38J79p41L56J42j71l96
$$ 124 -221 50 53 43 -110 154 437 24 -84 66 675 123 -39 -248 290 469 -272 84 226 55 -341
3877c41M28j06l04J76L3L96l49m01M08K49j1n12P5M60j82q8j47J57K9k11K42J57
$$ -341 87 -19 -323 -147 -114 282 -67 -468 -60 189 178 -334 -259 201 19 -69 -216 -59 -30 -241 1 158
3899A58j2l77P7L97p8n06K38%K79k11J28R6j35O5J73l51m2k24K33N46m92k49K79
$$ 158 146 -231 -154 243 165 -341 -103 -103 176 -35 93 189 54 119 292 -59 -101 -325 -92 454 -38 -287 -8
3922hm1N11m10k06K59p4l08N0L47O0n06M09l33L69m84J18Q41l48n62K71J42J87
$$ -8 -49 462 52 -154 105 31 -277 -227 120 180 -326 83 -250 119 -365 -247 594 246 -316 -45 97 284
3944B84j40k48J33J34m44J56L71m80j00K28N41j36n79LL97j12l68J87M27R3l45
$$ 284 144 -104 29 163 -281 -125 246 -234 -334 -106 435 299 -280 -277 120 8 -360 -173 254 347 2
3965Bk06L12J45k68j5M10l55n20P54P4J7o78K47N78k03p92K14N85O0n97K05L69
$$ 2 -204 108 253 -15 -30 380 25 -495 259 333 350 -328 -81 497 294 -498 -284 301 361 -236 -31 338
3987C38m55m58K92Q49j74o53j89J033k83p50PJ221j88j034L77M17l36p12P93N54
$$ 338 -117 -575 -283 566 392 -261 -450 583 300 -450 -443 778 590 -444 -67 350 14 -698 95 649
4007F49l18p68K22M63k73r78P14R50l11o46j92Q91k27j083R11Q94m03j512J59
$$ 649 331 -437 -215 248 -25 -1003 -289 661 350 -296 -488 403 176 -907 4 898 495 -1017 -858
4026h58J518l40q12K04J411r61j536M66J556l39r51N62J126o58j615M11J377J64
$$ -858 660 320 -492 -288 1123 162 -1374 -908 648 309 -642 -80 1046 388 -1227 -816 561 725
4044G25j495O20R95p67j395K47J945k70j342L95J043o31j287L18K060o44j610
$$ 725 -770 -150 845 78 -1317 -1070 875 605 -737 -342 701 70 -1217 -899 1161 517 -1093
4061a093N54J304p35j451Q39K234p37j988J15J522k56j562J103J780n06k357r4
$$ -1093 -539 765 30 -1421 -582 1652 915 -1073 -958 564 308 -1254 -151 1629 1123 -1234 -1328
4078a328K345o22j413Q59J882o54k467J96J977M3j658O98J577o80k357N0K638
$$ -1328 1017 395 -1018 -159 1723 1069 -1398 -1202 775 818 -840 -142 1435 755 -1602 -1552 1086
4095A086l33j612Q87J715j071k440L11K801O7j866p0J502n22k182N52K913k69
$$ 1086 753 -859 28 1743 672 -1768 -1457 1344 1411 -455 -525 977 455 -1727 -1175 1738 1469
4112A469k546P42J368o07k229O87L009j89k343l42K066o63j858R15K455n2l091
$$ 1469 -1077 -335 1033 426 -1803 -1116 1893 1704 -639 -981 1085 422 -1436 -521 1934 1882 -1209
4129a209j65K178l34j978Q99K881m84l210m83K404K86k101P10K961r09l393P0
$$ -1209 -1374 804 470 -1508 -609 2272 1788 -1422 -1905 499 785 -1316 -606 2355 1446 -1947 -1877
4146a877K732J57k267M95L000j362l223Q7L405N13k364N8K285o55l071l2L527
$$ -1877 855 1012 -1255 -760 2240 878 -2345 -2258 1147 1660 -704 -646 1639 984 -2087 -2119 1408
4163A408N27k548l44K248p40l349R00L796K63l029n90K149J49l078Q00L586P1
$$ 1408 1935 -613 -957 1291 551 -2798 -1898 1898 2161 -868 -1458 691 840 -2238 -1438 2148 2219
4180B219l350o98K846k23k746O37M002j50l903p26K710M80k796P11L362J33m214
$$ 2219 -1131 -1829 1017 794 -1952 -1315 2687 2537 -1366 -2092 618 1098 -1698 -987 2375 2508 -1706
4197a706o48K956L78k089M39K797j94m070m75L581O10k373L17K794p93l924j33
$$ -1706 -2354 602 980 -1109 -670 2127 1933 -2137 -2612 969 1579 -794 -477 2317 1524 -2400 -2533
4214b533L793Q58k869Q0K337m69l842K97M097P83k800o05J796j98l199M31L971
$$ -2533 1260 2118 -751 -671 1666 1197 -2645 -2348 1749 2532 -268 -873 923 725 -2474 -2043 1928
4231A928O48l402r41K694l70k681K82M384K11l768q52K529K74k500L35L516k6
$$ 1928 2576 -826 -1767 927 557 -2124 -1842 2542 2753 -1015 -1867 662 936 -1564 -1229 2287 2261
4248B261l383j553L080P71k466L25L460j38l875j138K940J240k527P7K916K2m129
$$ 2261 -1122 -2675 405 1176 -1290 -965 2495 2357 -1518 -2656 284 1524 -1003 -926 1990 2012 -2117
4265b117r96L792J049k317l54K538l1l651o34L913J240l152l82K307l66l061j01
$$ -2117 -3113 679 1728 -589 -943 1595 1564 -2087 -2721 1192 2432 -720 -1102 1205 839 -2222 -2323
4282b323L618J258k971j253K465L01l203j0L567J242l511q26K301N84l187K37
$$ -2323 1295 2553 -418 -1671 794 1095 -2108 -2118 1449 2691 -820 -1646 655 1239 -1948 -1711
4298a711L795M70l413j297K534N98k471J89L522J35l586j307K671J187k170l77
$$ -1711 2084 2554 -859 -2156 378 976 -1495 -1306 2216 2351 -1235 -2542 129 1316 -854 -1231
4314a231L110L57l621j323L252J591k518q74K835J31l511p62L147J329k473m38
$$ -1231 1879 2236 -1385 -2708 544 2135 -383 -1257 1578 1709 -1802 -2564 583 1912 -561 -999
4330i99K470r5l079q16L450J359k365j400K678O9k566q37L090J713k639j467K167
$$ -999 1471 1376 -1703 -2519 931 2290 -75 -1475 1203 1272 -1294 -2131 959 2672 33 -1434 733
4347G33N47k453q09K925J574k548j507J969O35k164l84K689J112k714j374K117
$$ 733 1280 -1173 -1982 943 2517 -31 -1538 431 1066 -1098 -1482 1207 2319 -395 -1769 348
4363C48P73k007m3K431M47k759j159K198J167j914m72K375L56k559j441K425J242
$$ 348 1121 -886 -929 1502 1949 -810 -1969 229 1396 -518 -990 1385 1741 -818 -2259 166 1408
4380A408j687n92J800O50k502q51K140J476k008p55J738L88j976r48K207R84j609
$$ 1408 -279 -871 929 1579 -923 -1774 366 1842 -166 -921 817 1205 -771 -1719 488 1472 -137
4397a37o75J195M32j513p24J971J234j819j092J245O68j522o83K348Q28j874j100
$$ -137 -812 383 815 -698 -1422 549 1783 -36 -1128 117 785 -737 -1420 928 1756 -118 -1218
4414a218R71R80j121p92J681J179j996j001J200Q62j213m41J336J104j736j198
$$ -1218 -247 733 -388 -1180 501 1680 -316 -1317 -117 745 -468 -909 427 1531 -205 -1403
4430a403J086J242r11m13J011L49j675p08J337R27j009m32Q52M75j181m60R53
$$ -1403 -317 925 14 -399 612 961 -714 -1422 -85 842 -167 -599 253 728 -453 -913 40
4447D0J121j176q11P85M66p58n29J320M85p48p55Q02M51p49o27J011O72j097o16
$$ 40 1161 -15 -826 -41 425 -333 -862 458 943 195 -560 242 693 -56 -683 328 1000 -97 -713
4466g13R70L90q15o26J140P16j405k86O86M88q67k33R44M76r76o31P73P82q00
$$ -713 257 647 -168 -794 346 1062 -343 -629 57 545 -322 -555 389 865 -111 -742 31 813 13
4485A3m97O42O30p37m54J96R52n63n21N69L91p74n35P85N16o67m67M55P21p34
$$ 13 -484 158 788 51 -403 -207 745 182 -339 230 621 -153 -688 97 613 -54 -521 -66 655 -79
4505g9l21M77L46m12l39L62K82j65o59O42K10l88m99O15L73k80o56P20M50o05
$$ -79 -400 77 423 11 -328 34 316 151 -508 134 344 -44 -543 72 445 165 -491 229 679 74
4525G4l50j43K84J1n51Q52R4l42k75O90l8l52k21J69M17l59m91P40M7j16k49p0
$$ 74 -276 -419 -135 -124 -675 177 271 -71 -346 344 306 -46 -267 -98 319 -40 -531 209 256 140 -109 -179
4547a79M88m58K4NL07j61l44L80j85J65k70oM50L8l99L83k82J16j28K99k45N4
$$ -179 309 -149 -125 -120 187 26 -318 62 -123 42 -228 -234 216 254 -145 238 -44 72 -56 243 -2 52
4569E2k67M31K65k65l90K80nn9j10j17N77l33k44j84P54k88j2o0R4J65k75j8N7
$$ 52 -215 216 481 216 -174 106 101 42 -68 -185 392 59 -185 -369 385 97 85 25 119 284 9 -9 48
4592D8K34o22N59J25l99k93K71J47j4m58K06L55k04L4O7K66j24j01k53O89l43
$$ 48 282 -340 219 344 -55 -348 -77 70 56 -402 -196 159 -45 -11 56 322 198 97 -156 533 190
4613A90j63jK42j64J9j09J29j26K6J12P4k34JK2L17r7m04K42K58j35m84J36K70
$$ 190 27 26 268 104 123 14 143 17 43 155 229 -5 -4 18 335 238 -166 76 334 199 -285 -149 121
4636A21J62m16J25K16k90n3M9L76k52k01q1N04j77k47j7L76P8m46R3M18n6p07
$$ 121 283 -133 -8 208 -82 -135 -86 290 38 -163 -244 260 83 -164 -181 195 273 -173 -80 338 282 -425
4658d25M17L33m53j34N22mj93l86L0L62o4l62J85K64j90n23O82M3l58J26nL25
$$ -425 -8 325 -128 -262 260 256 63 -323 -293 69 5 -357 -172 92 -98 -621 61 104 -254 -128 -133 192
4680A92j85m55L38O33m32m74q6N23N0m67K0O02n62k22K77R43p28l17K00O05pj044
$$ 192 7 -448 -110 523 91 -383 -469 54 104 -363 -343 259 -303 -525 -248 695 -33 -350 -150 455 448 -596
4702e96K61R53m42m62M24N66n93q54K92R27k05q55P06O43o88o79N50N44k07p53
$$ -596 -335 618 176 -286 138 704 111 -743 -451 476 271 -584 122 765 77 -602 -52 492 285 -468
4722d68K75P90l22j137O80Q65m27n89m8J053p66o90N26R34l33q70O28L23k96o19
$$ -468 -193 597 275 -862 -182 683 256 -333 -381 672 -94 -784 -258 676 343 -527 101 424 128 -491
4742d91L36Q64l26j046L94R56n64q86O84O86K08j230J06J150p22p57O80P56n03
$$ -491 -155 709 383 -663 -269 687 123 -763 -79 607 815 -415 -309 841 119 -638 42 798 295
4761B95j283O22R85n52o68N13J318p71j392N12J259l60r35Q2J370p81j337L77
$$ 295 -988 -366 619 67 -601 -88 1230 459 -933 -421 838 478 -457 -375 995 214 -1123 -746
4779g46J433r2j248M62J516q73j705O82J557n50j067O01Q30n66j675N84J832j59
$$ -746 687 595 -653 -191 1325 452 -1253 -571 986 436 -631 -30 800 234 -1441 -857 975 816
4797H16j836R43P72m28j709R52J928o99j733K72J525m98j563Q01J920o60j567
$$ 816 -1020 -77 695 267 -1442 -490 1438 739 -994 -722 803 305 -1258 -457 1463 803 -764
4814g64m2J230j75j490J229J562o92k265J91J972n0j547M23J810q74k002L03K032
$$ -764 -806 424 249 -1241 -12 1550 858 -1407 -1216 756 706 -841 -418 1392 518 -1484 -1181 851
4832H51j51j463N23J663n58k673O86K038J45j637L74J419j062j655M40K150j64
$$ 851 700 -763 -240 1423 865 -1808 -1122 916 1061 -576 -202 1217 155 -1500 -1060 1090 926
4849I26j907M57J603p00k285J034K491l95j688j89J916p79j995O96K503n50k157
$$ 926 -981 -524 1079 379 -1906 -872 1619 1224 -464 -653 1263 484 -1511 -815 1688 1138 -1019
4866a019J89J801r81j593R93K378k35k608K05J973k76j979O22K211j07k996K8
$$ -1019 -830 971 -10 -1603 -610 1768 1533 -1075 -870 1103 827 -1152 -530 1681 1574 -1422 -1394
4883a394K230K4j645L18K347r18k226n16K619P9j859O01J969p11k892P42K429
$$ -1394 836 860 -785 -467 1880 962 -1264 -1780 839 918 -941 -340 1629 918 -1974 -1232 1197
4900A197k51j720j36K567q51k374K58L010J06k588j99J869m19k585P97K756Q6
$$ 1197 946 -774 -910 1657 806 -1568 -1310 1700 1806 -782 -981 888 469 -2116 -1319 1437 1523
4917A523k559Q7J863p84j637Q79K285q5k421m14J637P4k067Q15K470j24k639l79
$$ 1523 -1036 -949 914 130 -1507 -628 1657 1572 -849 -1263 374 448 -1619 -804 1666 1542 -1097 -1476
4935a476J980K4j801M43K638m65k793n61K899p9j757K09K123k59k829J84K334
$$ -1476 504 528 -1273 -830 1808 1343 -1450 -2011 888 809 -948 -739 1384 1125 -1704 -1520 814
4952H14M21j807m3K112n84k685K5K807N24k007k48J509J10k495p2K876L63k271
$$ 814 1235 -572 -615 1497 913 -1772 -1747 1060 1584 -423 -671 838 948 -1547 -1619 1257 1620 -651
4970f51m95J957j84k135J83K819L02k594n18K041k29k044N32K198M09k420n70
$$ -651 -1146 811 627 -1508 -1325 1494 1796 -798 -1316 725 496 -1548 -1016 1182 1591 -829 -1399
4987a399K169K07k435O59K305P3k533n99K214L05j555k0K098q5k865n18K329P74
$$ -1399 770 977 -1458 -799 1506 1579 -954 -1553 661 966 -589 -609 1489 1404 -1461 -1979 350 1124
5005A124j674R2J591L16k762n13K560P15j641n52J749L7k326m05K500R43k484
$$ 1124 -550 -458 1133 1449 -1313 -1826 734 1449 -192 -744 1005 1042 -1284 -1689 811 1754 -730
5022g30j90J769P3k491R8K530O09j899j184J925M22k087k29K619M44k479l12J739
$$ -730 -920 849 922 -1569 -1471 1059 1668 -231 -1415 510 932 -1155 -1384 1235 1679 -800 -1112 627
5040F27j00j683K0K363N42k434r14J846N11j396l1J574O86k299r11J688Q23j463
$$ 627 527 -1156 -1136 1227 1769 -665 -1579 267 778 -618 -649 925 1611 -688 -1599 89 912 -551
5058e51J14J531Q9k448l02K266N04j288p21J764J11k000m98J973N93j345o10J194
$$ -551 -437 1094 1183 -1265 -1567 699 1203 -85 -806 958 1069 -931 -1429 544 1137 -208 -818 376
5076C76O85j754m17J951L74j625n01J151N98j437o68J882P12j706n95J428K72
$$ 376 1061 -693 -1110 841 1215 -410 -911 240 838 -599 -1267 615 1327 -379 -974 454 726
5093G26j253m78J631K97j280p45J361N50j545%J536M82j381j008J348M16p34n12
$$ 726 -527 -1005 626 923 -357 -1102 259 809 -736 -736 800 1282 -99 -1107 241 657 -77 -589
5111e89J173K69j162o16Q76P87r05n55J135O64j300q89J357O68j011m15R62K84
$$ -589 584 853 -309 -925 -49 738 -167 -722 413 1077 -223 -1112 245 913 -98 -513 449 733
5129G33j187l63R83O74j068o02J297K18j228k81Q36J167j106q15O66Q28r05n79
$$ 733 -454 -817 166 840 -228 -830 467 685 -543 -824 12 1179 73 -742 -76 752 -153 -732
5147g32J102O28j061m89P60J72p55j77P97N39q87q85J012O06q68l33R75O57j103
$$ -732 370 998 -63 -552 208 380 -375 -552 245 784 -103 -988 24 630 -238 -571 404 1061 -42
5166d2n36N55Q83j035m00Q03N76p62l82L97N47l79p57M48M65n72l24P08L04n12
$$ -42 -578 -23 860 -175 -575 228 804 42 -340 57 604 225 -532 -84 381 -191 -515 193 497 -15
5186a5k95N51j26m23k24O48M07o13j73M57M9l22n50O05O05l00o39L50K39k53n68
$$ -15 -310 241 115 -308 -532 116 523 -90 -263 194 243 -79 -629 -24 581 281 -358 -8 231 -22 -590
5207e90L68O01m55r9m5O63o95j09O52J64m09k86K98K17j84n49L30P1k65j99M58
$$ -590 -222 379 -76 -175 -220 443 -252 -361 291 455 46 -240 58 275 91 -458 -128 -57 -322 -521 -63
5228f3K70k91M9M11N0m63n62O46M90m60j12o0K98K48l39kj41k69J5M94j40J91
$$ -63 207 -84 -35 376 426 -37 -599 47 537 77 -35 -95 203 451 112 110 -31 -300 -285 209 69 260
5250B60m35L72j13J52k72j75N91k44j27j24L38k38l9J4M48l84j90L2N69l40k72
$$ 260 -175 197 84 236 -36 -211 380 136 9 -115 223 -15 -54 -40 408 24 -166 -134 435 95 -177
5271a77L12l6J06l81J06J75l10J80k32M57j86K1m7N6k74J97J55n0J58o28K71N7
$$ -177 135 99 205 -176 -70 105 -205 -25 -257 200 14 35 -12 44 -230 -33 122 72 230 -398 -127 -70
5293g0Q8K48l19M11j1o20J81M40j98k55J85Kr1l5O2K1J95l40J11j17J47J81k13
$$ -70 18 266 -53 358 347 -273 -92 348 150 -105 80 82 -9 -44 18 39 234 -106 5 -112 35 216 3
5316CP5j90j50J09K60o9q3j62M25J3l20o0K77k4k25K58K3K1k04r4L23N7k94J2
$$ 3 78 -112 -262 -153 107 38 -45 -207 218 231 -89 -149 128 104 -121 137 160 181 -23 -117 206 263 -31 -19
5340a9m4k6j37j91O68m03j70M26K9m6j37k33O11l68k18M8L96j38l72JP20k98m65
$$ -19 -63 -89 -226 -417 251 -152 -322 104 133 87 -50 -283 328 -40 -258 -210 186 48 -324 -323 397 99 -366
5363c66O0N47m58j41J41L67J62o48L09L28m91J66j12L41J16o69J80O35m20k01
$$ -366 -306 241 -217 -358 -217 150 312 -336 -27 301 -190 -24 -136 205 321 -348 -168 467 47 -154
5383a54K66O5k9o39N31L50j53q24N63L72l22k27L14M22n37l18J00N90m91o36R11
$$ -154 112 177 148 -491 40 390 237 -587 -24 348 26 -201 113 535 -2 -320 -220 370 -121 -757 154
5404A54M3Jn88L65P8M7p42N16N15l97j23L27M20q48m44N98O32l36o66M53N79o14
$$ 154 197 198 -390 -25 53 100 -642 -126 389 -8 -131 196 616 -232 -676 -78 554 218 -448 5 584 -30
5426c0p77P12O74k53m32j02P83p45l55J60J467p83r42K50P32J47j088M68J033
$$ -30 -807 -95 579 326 -106 -208 575 -170 -525 -365 1102 319 -623 -373 359 506 -582 -114 919
5445I19o46j015O05O01l40n37Q42M01p42q63R23M33m22q54O73P42m65j069M21
$$ 919 273 -742 -137 464 124 -413 429 830 88 -775 148 581 159 -695 -22 720 255 -814 -393
5464c93J063j89j031O89O96n64r94K06J034l09p44N40P64n32j235O39J198q38
$$ -393 670 481 -550 139 835 271 -723 -517 517 208 -536 4 768 236 -999 -360 838 0
5482@p11M83Q75o16j127J248J023o90j249Q14O67n62j098N00J599p34j134J79
$$ 0 -711 -228 647 31 -1096 152 1175 485 -764 50 717 155 -943 -443 1156 422 -712 -533
5500e33J021l26j118O71J492p09j581M34J460l81r39O73J031j017j445Q29J135
$$ -533 488 162 -956 -285 1207 498 -1083 -649 811 430 -509 164 1195 178 -1267 -438 697
5517F97j88j342O43J117p35j408Q86J491r07j166O21J108p87j034M32J775p79
$$ 697 509 -833 -190 927 192 -1216 -330 1161 254 -912 -291 817 30 -1004 -572 1203 424
5534D24j248Q12O32o38j236N35J784o73j336M44J430p01j379R94J628p87j427
$$ 424 -824 -12 620 -18 -1254 -719 1065 392 -944 -500 930 229 -1150 -156 1472 685 -742
5551g42L30J314q88j071R81J567r09k119J022J238n78j163Q69J655j306j460M18
$$ -742 -412 902 14 -1057 -76 1491 582 -1537 -515 723 145 -1018 -149 1506 200 -1260 -842
5568h42J796k02j928P30J793j048k113Q85J987m56j514N07J582r13j715M56K074
$$ -842 954 752 -1176 -446 1347 299 -1814 -929 1058 602 -912 -405 1177 264 -1451 -995 1079
5585A079k38j520J93J509o47j987O25K366m28k187O71J430k19k282R69K087n03
$$ 1079 841 -679 -486 1023 376 -1611 -986 1380 952 -1235 -564 866 647 -1635 -666 1421 918
5602I18j683J19J596n88j733J022J829m58k106L18J614n78j565P55K031r57j650
$$ 918 -765 -646 950 362 -1371 -349 1480 1022 -1084 -766 848 270 -1295 -540 1491 534 -1116
5619a116r8K128l81j316N97J652o84j998M3K084k89j439M91J685q38j701J43K102
$$ -1116 -1214 914 533 -783 -186 1466 782 -1216 -1173 911 622 -817 -326 1359 521 -1180 -1037 1065
5637A065l96j531M53J670j208j466K24K400J54k005K13J445n70j628L38K224n2
$$ 1065 669 -862 -409 1261 53 -1413 -1189 1211 1365 -640 -427 1018 448 -1180 -842 1382 1330
5654A330k340M37J600r67j629R75J904k46j954k7J827k82j753N42K026n02j925
$$ 1330 -1010 -573 1027 60 -1569 -594 1310 1064 -890 -917 910 628 -1125 -583 1443 941 -984
5671i84p3J608j41j458O14J668J59k307m29K046k70j416P32J529n41k352M23K047
$$ -984 -1057 551 410 -1048 -434 1234 1393 -914 -1343 703 433 -983 -251 1278 737 -1615 -1192 855
5689H55p5j346n4J657m60j932L33J865J55j702k6J773o74j650L02K023O7j662
$$ 855 780 -566 -620 1037 577 -1355 -1022 843 998 -704 -730 1043 369 -1281 -979 1044 1111 -551
5707e51k22J513k24j576K57J807P1j802j18J657n97j328M70J592L85j979n7J403
$$ -551 -773 740 516 -1060 -803 1004 1075 -727 -845 812 215 -1113 -643 949 1334 -645 -702 701
5725G01r8j384J14J879k24j733k72J320M19j584N43J390m2j933k65J746K76j304
$$ 701 603 -781 -667 1212 988 -745 -1017 303 722 -862 -319 1071 1029 -904 -1169 577 853 -451
5743d51k14J722n00j505k67J745L23j430M3J148j08j560J89J568N59j658m6R43
$$ -451 -665 1057 557 -948 -1215 530 853 -577 -534 614 506 -1054 -865 703 1262 -396 -442 501
5761E01L3j356l85K155J7j250j86R27N0j227l7J476M30j550k12J070K09j167m4
$$ 501 534 -822 -1207 948 965 -285 -471 456 506 -721 -758 718 1148 -402 -614 456 665 -502 -546
5780e46J406M1j080o67J463M2j225q1J289K09j579k92J017Q17j155k49J156K87
$$ -546 860 901 -179 -846 617 659 -566 -647 642 851 -728 -1020 -3 814 -341 -590 566 853
5798H53j145o41J211M40q39o18J070K58q62j49J076J85j500k10J401k11r67k73
$$ 853 -292 -933 278 718 -121 -739 331 589 -273 -422 654 839 -661 -871 530 319 -648 -921
5816i21J407K21j019j92P86K80j095j20R18N27p56p50J009O9o73m31J349k5j030
$$ -921 486 707 -312 -504 282 562 -533 -653 265 792 36 -714 295 364 -309 -740 609 584 -446
5835d46j0O62M29q40l39Q03L68r63j34O02L75j074r8J123K20r83j53M97K36m64
$$ -446 -456 206 635 -205 -544 259 627 -336 -470 132 507 -567 -665 458 678 -305 -458 39 275 -189
5855a89m08N34J82m96j87Q74J34n58p3M02m8m23L6K70O44o85l49M71j71j83n2
$$ -189 -597 -63 119 -377 -564 310 444 -114 -187 215 167 -256 -220 50 694 9 -340 131 -40 -223 -275
5876b75M49K76k69m31J76O08o43k58N65L11n11n17L89P07p92R4J6L99k97j1K14
$$ -275 174 450 181 -250 -74 534 -109 -367 198 509 -2 -519 -130 577 -215 -121 -105 294 -3 -14 200
5897B00K1l90q5J96M57m66o07P52K73m13m78N47J82n49n6L81O01m66l10J17K59
$$ 200 221 -169 -254 -58 399 -67 -674 78 351 -62 -540 7 189 -360 -416 -35 566 100 -210 -93 166
5918A66m50K44J10K87l49k30K03L83l89j37J66K03k26pM29l98j0j58K53J15k71
$$ 166 -284 -40 70 357 8 -222 -19 364 -25 -162 4 207 -19 -26 403 5 -5 -163 90 205 -66
5939f6rp7N72l36l04M12kj07k23R9L33k90l90K91M98m30k45L00J6k94m8M19O9
$$ -66 -75 -152 420 84 -220 192 190 83 -140 -41 292 2 -388 -97 401 -29 -274 26 42 -252 -300 119 188
5962A88m14j32L52j49J29N4oJ87p6m77N72r5j27j28K89O7k11J5n4L39l30l29J17
$$ 188 -226 -358 -6 -155 -26 28 22 209 133 -344 228 133 6 -122 167 234 23 38 -16 323 -7 -336 -219
5985b19M12j38n02L95M05n76K51Or9j19J49o1j30J44k26K64J55k96k6o8O84l37
$$ -219 193 55 -447 -52 353 -223 28 34 -65 -184 -35 -96 -226 -82 -308 -44 111 -185 -211 -279 405 68
6007F8m87P18K3n34O1q9K27J79k79J87r2K5L3j22J38J55m23K19J25r7k30K02J26
$$ 68 -419 299 322 -212 -151 -240 -13 166 -113 74 -18 7 40 -82 56 211 -212 7 132 35 -195 7 133
6030A33J14l69L26k99K49k91K55J52k53M7l1K10j80j87K4L92k97l51O4L80k36
$$ 133 247 -122 204 -95 154 -137 118 270 17 64 33 243 63 -124 -100 292 -5 -356 -292 88 -148
6051a48Q8m7J22m00K5M52J39l18j04J10K42o5k18M4J62k33j88M54K03m95m28P74
$$ -148 -60 -107 15 -385 -360 92 231 -87 -191 -81 161 96 -122 -78 84 -149 -337 117 320 -175 -603 171
6073A71J20l63m35L82L70k43m01J19M68k25k29J07N42j85m06K48J97m91J15K85
$$ 171 291 -72 -507 -125 245 2 -399 -280 188 -37 -266 -159 383 198 -208 40 237 -254 -139 146
6093A46L59n74k65L73K86m87p7O4M51k11m40N21P0k06m42N00l3l58k33L32N23
$$ 146 505 -69 -334 39 325 -162 -239 -175 276 65 -375 146 216 10 -432 68 35 -323 -556 -224 299
6114B99n26J5J83L55n31P2Q7K57Q2m61n0N56k44m16M43L97p41k62O21L19k91m70
$$ 299 -227 -212 -29 326 -205 -133 -46 211 293 -168 -218 338 94 -322 121 518 -223 -485 136 455 164 -306
6136c06L32P94n70n30M8N82m00m88O88L19p71l01P40k1m20p8M59O11r04l70N65
$$ -306 26 820 250 -280 -232 350 -50 -538 150 469 -302 -603 137 116 -304 -382 77 688 -216 -586 -21
6157b1O77q76n21Q21M56m88o82M24R66p90p14P37O22p87o32R48P48m70q86M44
$$ -21 656 -220 -741 80 536 48 -634 -210 756 -34 -748 -11 611 -176 -808 140 888 418 -468 -24
6177b4P78q43m11N99P77p41p11K44R04n92m73O37M67o11r19R07P12q06n82Q61
$$ -24 754 -89 -500 99 876 135 -576 -332 572 -20 -493 144 611 0 -919 -12 700 -106 -688 173
6197A73N81o68q59P79O35n77q25Q18Q94r59j037P14J213p63r70P63O90m43p74
$$ 173 754 86 -773 6 641 64 -761 57 951 -8 -1045 -331 882 119 -851 -88 602 159 -615
6216f15L12R37m46r20P16J162j409q82R17J230q77p20L05N44m67k39K62J303q59
$$ -615 -303 634 188 -732 -16 1146 -263 -1145 -228 1002 125 -595 -290 254 -213 -452 -190 1113 254
6235B54j095N59J093n71j237R59J276j059q93K31J146m17r30J014N98q11j463
$$ 254 -841 -282 811 240 -997 -38 1238 179 -714 -483 663 246 -684 330 928 117 -1346
6252a346J037J330o88j178Q10J030j084o87K36J490n73r61N10J121j042j174N80
$$ -1346 -309 1021 333 -845 -35 995 -89 -776 -540 950 377 -584 -74 1047 5 -1169 -589
6269e89J683o89r43M17J221j101j014Q35J376q17j204Q29Q66q55j078P97J576
$$ -589 1094 405 -538 -121 1100 -1 -1015 -180 1196 379 -825 4 870 15 -1063 -266 1310
6286A310q15j270M84Q61l95j311J129R96n53j360O45J055o25j102J017J067p92
$$ 1310 495 -775 -291 570 175 -1136 -7 989 436 -924 -279 776 151 -951 66 1133 341
6303C41j379M79J224n31j224J357Q38j008j413R13J293p93q46P72R94j104j132
$$ 341 -1038 -559 665 134 -1090 267 1105 97 -1316 -403 890 97 -749 23 1017 -87 -1219
6320a219P62J494m53j377Q65R77j199r78Q97J414r14j178O62J034r31j255J179
$$ -1219 -457 1037 584 -793 72 1049 -150 -1128 -231 1183 269 -909 -247 787 -144 -1399 -220
6337b20J243n12j554O87J187p18r90O13J529p76j349M07J255q72j359J777O75
$$ -220 1023 511 -1043 -356 831 113 -877 -264 1265 489 -860 -453 802 -70 -1429 348 1023
6354A023n38j500N36J054n14j047O97J434o54j611O40J141n07j134O88J352p14
$$ 1023 485 -1015 -479 575 61 -986 -289 1145 491 -1120 -480 661 154 -980 -292 1060 346
6371C46j402N18J192m24j447J110J068p91j327P28R50k68o08L16R27p44r85K95
$$ 346 -1056 -538 654 230 -1217 -107 961 170 -1157 -429 521 253 -355 -39 888 144 -841 -546
6389e46J298L2j702L28J436p57j317Q86J571o31j579N14J090l87j173J94J874
$$ -546 752 784 -918 -590 846 89 -1228 -342 1229 598 -981 -467 623 236 -937 -743 1131
6406A131n55j212J89J255n14j106P81J304j065j158L97J207j18j180L75R60m50
$$ 1131 576 -636 -447 808 294 -812 -31 1273 208 -950 -553 654 536 -644 -269 691 241
6423B41j052J87J360n86o05L90J113r14j343O12J221j93j040J69J186m73j004
$$ 241 -811 -624 736 150 -455 -65 1048 134 -1209 -597 624 431 -609 -440 746 273 -731
6440g31M04J152o56o42K80J162o04j122N03J155l8j618L70Q09k06q01K78Q74j98
$$ -731 -327 825 169 -473 -193 969 365 -757 -254 901 863 -755 -385 424 218 -583 -305 569 371
6459C71p56k0Q51m44p56O14Q04l55p14j67J209l48p83K61Q13k12j130J67P96k40
$$ 371 -385 -405 446 2 -754 -140 664 309 -405 -572 637 289 -494 -233 580 368 -762 -595 201 -39
6479c9m78J79Q50j67r78K95Q14j69o73QP00j04q66M21Q19r3o62o9R05l95r05L89
$$ -39 -517 -338 512 345 -633 -338 476 307 -366 -358 342 238 -628 -207 612 519 -143 -212 693 298 -607 -218
6501b18O00K2o09m94J105j52r21L37P29P2q12j54R96k93p03J47Q30k11n19k76
$$ -218 382 404 -205 -699 406 254 -667 -330 399 471 -341 -495 501 208 -495 -348 482 271 -248 -524
6521e24P87q1n30j26J012n2q56K6O70q2n69J81L75J14r17K77O70r7n02J0O91k85
$$ -524 263 182 -348 -474 538 486 -370 -344 326 244 -325 -144 231 345 -572 -295 375 278 -224 -214 477 192
6543A92p59J78P12N6n57l4K05K62o05K08K71J22o02j45R88k62m25j19O27L58p99
$$ 192 -567 -389 323 379 -178 -212 -7 255 -350 -142 129 251 -351 -496 492 230 -195 -314 313 671 -128
6564a28j57N13k2l54M3N22j78k16j27M32k95q9K3L85m6p43RO05k9n73L41K22K19
$$ -128 -285 228 206 -148 -105 417 239 23 -104 328 33 -56 -33 352 306 -437 -428 177 148 -425 -84 138 357
6587C57p46K71K87j2m14j3L45J17n75p4Q21q2l06l98M85K54l56k9L74j6m69q6
$$ 357 -389 -118 169 157 -257 -270 75 192 -383 -457 364 282 -24 -422 63 317 -39 -68 306 290 -179 -265
6609b65O49p8o16j28L61L59l21q1J40r2K5j56N09k60k9P2j06J10O9k96K43l6k58
$$ -265 384 306 -310 -438 -77 282 -39 -120 20 -72 -47 -203 306 46 17 89 -17 93 162 -134 109 73 -185
6632a85K7R1J32j39J13j99K37m23K33l2J76l44K41p1K87j78j07j0K29J65k61j07
$$ -185 -158 -67 65 -74 39 -160 77 -346 -113 -145 31 -313 -72 -143 144 -34 -141 -151 78 243 -18 -125
6654a25L80m58L14j79j23J18J63P2M7j63M1k2j11k60OJ03M47o6l79J61J37P5k83
$$ -125 255 -203 111 -68 -191 -73 90 162 209 46 87 65 -46 -306 -300 -197 250 184 -195 -34 103 178 -105
6677a05Q4N7j09p7K8K15j6m06K96M38p1m88K50J6j12J46m37K73j39J00K28J3j12
$$ -105 -21 36 -73 -150 -122 93 77 -329 -33 405 334 -154 96 112 0 146 -291 -18 -157 -57 171 184 72
6700G2m94N74l8l8k25J52K35k33j43j12O22m92J42K32r1k76j49J18K72j02j20
$$ 72 -422 152 114 76 -149 3 238 5 -138 -250 372 -120 22 254 163 -113 -262 -144 128 26 -94
6721i4K64j6j40k42M49K77m48r5K98r8j85O5K0M49k03m64J62K9k21j20K76lJ05
$$ -94 170 154 14 -228 221 498 50 -45 253 155 -30 35 55 504 301 -163 -1 28 -193 -313 -37 -40 65
6744F5n5K02K35p95L66J06J15k71J34o1J95l88J1K35lp7m7j65K59K03l90J24J05
$$ 65 10 212 447 -348 18 124 239 -32 102 41 236 -152 -141 94 91 14 -33 -198 61 264 -126 -2 103
6767A03j80m7j72O08n69n3L47L03l59k05L22j90J32j22k04L66m0j61M18j02k60
$$ 103 -77 -124 -296 312 -257 -310 37 340 -19 -224 98 -92 40 -82 -286 80 40 -121 297 195 -65
6788f5l5J94L0j38j13K15K88m39l23M27M94n38k7PJ43j66J4M85j56l53l87N49
$$ -65 -100 94 124 -14 -127 88 376 -63 -386 41 535 -3 -30 -23 120 -46 -32 453 297 -56 -443 106
6810A06N5j47k43L76J66n41o0M08J64k8m94K53N7k20j66L60J99j02l68K52o2k38
$$ 106 161 14 -229 147 313 -228 -288 120 284 256 -238 15 72 -148 -314 46 245 143 -225 27 -35 -273
6832b73o6L20J65l58K51L61n2m46l8K55J56k92q9J9N46o59k32O10M5k40k14P81
$$ -273 -339 -19 146 -212 39 400 348 -98 -136 119 275 -17 -106 -87 459 -200 -432 178 223 -17 -231 550
6854E50m54l02k92M36M59o15k51N83L64n35l49M24J90l51l48O48K21q60J71M59
$$ 550 96 -206 -498 -62 397 -218 -469 114 478 -57 -406 18 208 -143 -491 157 378 -482 -311 148
6874A48O2n71k70O86M32n35n36Q77Jn91r0N06Q9j83o20P08L28m87l10O50N4o43
$$ 148 210 -361 -631 55 487 -48 -584 293 294 -297 -387 119 208 25 -595 113 441 -46 -356 294 348 -295
6896b95k19N88M23r11j63Q73J87m40o75O62M54l17p51O73N80p09n12P71J31m21
$$ -295 -514 74 497 -414 -577 296 483 43 -632 30 484 167 -584 89 669 -40 -552 219 350 -71
6916g1l13M74K93m79n61P86N12q79j00J38R47j050n29P71L16m92k98N26P32q41
$$ -71 -384 90 383 -96 -657 129 641 -238 -338 -200 747 -303 -832 -61 255 -237 -535 -9 723 -118
6936a18l92N00N56o13o47J103J20p18n33P37O42m77n41N78N04r65k67N97L80k13
$$ -118 -510 -10 546 -67 -714 389 509 -209 -742 -5 637 160 -381 197 701 -264 -531 66 446 233
6956B33o90N30M40p23o59J191N03q78m96P26L31n52m54O59N17q60n50Q79O59j327
$$ 233 -457 73 513 -210 -869 322 825 -53 -549 177 508 -44 -498 161 678 -182 -732 147 806 -521
6976e21KP30L71l93r51N03Q52n47o11O76O76j092k78P11P90j170m55J144J78n59
$$ -521 -519 211 582 189 -762 -259 593 46 -565 111 787 -305 -583 128 918 -252 -707 437 615 56
6996E6j172J009P79n39p94Q47L44o54o77N78J026p81m79M38N42p12m87O73R89
$$ 56 -1116 -107 672 133 -661 186 530 -124 -801 -223 803 22 -457 -19 523 -189 -676 -3 986
7015I86q16o47O73L40p05q80Q82Q10o88n32P48K54o87n39P93N20l26p42L06Q50
$$ 986 170 -477 196 536 -169 -1049 -167 643 -45 -577 171 425 -262 -801 -8 512 186 -556 -250 600
7035F00p84n34J109N48j247l24M58O06j89r59R27P02j214m58P59M79n16m57L07
$$ 600 -184 -718 391 939 -308 -632 -174 432 243 -716 211 913 -301 -759 0 479 -37 -494 -187
7054a87J052q59o49O11Q28o79p03N60P69q10q07P92Q86p92l64O27M19p74q67J025
$$ -187 865 6 -643 -32 796 117 -586 -26 743 -67 -874 -82 804 12 -352 275 694 -80 -947 78
7074G8P41p88p67P39R39r07q16O52P44n82n99K52R24m81p47O94O83j023m07K32
$$ 78 819 31 -736 3 942 35 -781 -129 615 33 -566 -314 610 129 -618 76 759 -264 -671 -439
7094d39N54j57o88O44R72r67o02M68M90q1o17N90N44r07l68K20R19l68o29K42
$$ -439 115 -42 -730 -86 886 -81 -683 -215 275 194 -423 167 711 -196 -564 -344 575 207 -422 -180
7114a80Q13q35l79N82M73j76r75N93N58n19m51J80J038p53k89K78N55n72k98L51
$$ -180 633 -202 -581 1 474 298 -677 -84 474 -45 -496 -316 722 -31 -320 -42 513 -59 -357 -6
7134fL68j74o09K58N56o50j18K97R07m96o83J80N26m93k65L28L20j17n99J56O20
$$ -6 362 188 -421 -163 393 -257 -375 -78 829 333 -350 -170 356 -137 -402 -74 246 129 -470 -314 306
7155C06m60k06K79N66m82m78M50K06k44l83M32J2K98p13K92L20j58k15m8P41m80
$$ 306 -154 -360 -81 485 3 -475 -25 181 -63 -446 -14 -2 296 -417 -125 195 37 -178 -226 515 35
7176C5l53K44Q68j98q78J42O02k29n22Q7P45m35l00q0N00j60n05L43L03J85p08
$$ 35 -318 -74 794 596 -282 -140 462 233 -289 -202 543 108 -192 -272 228 68 -437 -94 209 394 -314
7197c14L10L42k82l56K59L26k35m48M69J82l06o33M60P81l08n86L50o4L2k82M42
$$ -314 -4 338 56 -300 -41 285 50 -398 71 253 -53 -686 -226 555 247 -339 11 -53 -21 -303 139
7218A39R0j7n95L21M20j62m42J14M39m25l54L94L08J9n18K57J70L5n32L00M59
$$ 139 229 212 -383 -62 358 196 -246 -132 307 -118 -472 -78 230 249 -269 -12 158 193 -339 -39 420
7239D20j96m04R6Q6j58k30K50K70k90q7O04j42J3l04J27K69j98j67N8J25M3l18
$$ 420 224 -180 -84 2 -156 -386 -136 134 -156 -243 361 219 232 -72 55 324 126 -41 17 142 185 -133
7261a33j65M33O0l65j67O99k00m40O0L00o4k65P8J75l1J54j81P0Q8k71j91P02
$$ -133 -298 135 195 -170 -337 362 162 -278 -218 82 18 -247 -169 6 -25 129 -52 18 106 -165 -356 346
7283C46p0n55K18M34n62N2J45j23rK03k45K80l02qK33M9k29n3J10O0J36l00r8
$$ 346 276 -279 -61 373 -189 -137 8 -115 -124 79 -166 114 -188 -196 37 86 -143 -196 -86 -26 110 -190 -288
7306b88L83j76n8k07N16k72j32J80J26K3Q7j55K17k79R2Rj72J56R9l11q3N37m80
$$ -288 95 -81 -139 -346 170 -102 -234 -54 72 95 182 27 244 -35 57 66 -106 50 149 -162 -245 292 -188
7329a88M2M06j61n1r2j92L72l37K72o5L7L2o25O62q8m5j85J48R0j45L5J77J34
$$ -188 -146 260 99 48 -44 -236 136 -201 71 6 43 75 -550 112 24 -21 -206 -58 32 -113 -78 99 233
7352B33l29M4K96m4j63r5J06m7l2r1K30l4k27MJ93k7j21J62L9P7l87L08m2K7q0
$$ 233 -96 -52 244 200 37 -58 48 1 -31 -122 108 74 -153 -149 44 17 -104 58 97 174 -213 95 53 80 0
7377@j82J68j4M0j14K15j65K8k46J96J95N2j49m1OJ21k26J86k17K5J77l3J23k64
$$ 0 -182 -14 -28 12 -102 113 -52 -24 -270 -74 121 173 24 -17 -11 110 -116 70 -147 -122 55 22 145 -119
7401a19o6L89P9o71K05o9M30j24j96J39j07j73L83Q1k00j31J03L3K26k53nM9q8
$$ -119 -185 204 283 -388 -183 -252 178 54 -142 -3 -110 -283 100 181 -19 -150 -47 -14 212 -41 -46 3 -85
7424h5L2R7j1r4j79L27q6k5q5K22r1j41M67m65L43K14k61m38N29k85L2k47L35
$$ -85 -53 44 33 -61 -240 87 1 -24 -109 113 22 -119 348 -117 226 440 179 -259 270 -15 17 -230 105
7447A05r0J30j61l5K51k9l17J95K92l12k3jJ1K64l47J60O6k15L54k35J13j77K08
$$ 105 15 145 -16 -51 200 171 -146 49 341 29 6 5 16 280 -67 93 159 -56 298 63 176 -1 207
7470B07j0n9l91J33m9L79l83J33mP9k00K98K21k17j90j99L63K07l87j04M17O4
$$ 207 197 138 -253 -120 -169 210 -173 -40 -44 35 -165 133 354 137 -53 -252 111 318 -69 -173 244 308
7492C08k69k48L91j00l72J50J54m8k90L7L30L3k04j18L77J11l80J82J22j34j40
$$ 308 39 -209 182 82 -290 -140 14 -34 -324 -287 43 76 -128 -246 131 242 -138 44 166 32 -108
7513a08l3J75j91n9L14j69L60n20J65j42L77j46l33L30Q4k33r1N24N6o73M55o3
$$ -108 -141 34 -157 -216 98 -71 289 -231 -66 -208 169 23 -310 20 104 -129 -220 304 360 -313 142 79
7535G9K26l18k79K81K89l35J31j41J29m01P7L84kj05l24J13J64M1l00L69l2j92
$$ 79 305 -13 -292 -11 278 -57 74 -67 62 -339 -262 122 120 15 -309 -196 -32 9 -291 78 46 -146
7557a46K96j58K86l81j11L85L8k97L4L31o1l73j56J90K75m20j5O57j1n28k53P74
$$ -146 150 -8 278 -103 -214 171 209 -88 -54 277 216 -157 -313 -123 152 -268 -283 374 363 -165 -418 356
7579C56m0k40l55N62k8m30o9L98J22k67P3j80K84k58j95O06J04m72k63L36M6l68
$$ 356 316 76 -279 283 255 -175 -244 154 276 9 82 -98 186 -72 -267 339 443 -29 -292 44 90 -278
7601b78k74M63L65jo62O89k74k47NM45J31l02l23P24j68k04m87P90m11l23NM00
$$ -278 -552 -89 276 275 -387 302 28 -219 -214 231 362 60 -263 461 293 89 -398 392 -19 -342 -337 63
7623F3K32m72k46Q19O2o95j65N62J34o19J13K76j0j75R1J26M06o36k44K33K56
$$ 63 295 -177 -423 396 458 -237 -402 160 294 -325 -212 64 54 -121 -30 96 502 -134 -378 -145 111
7644A11j80k47K10L87j23k69K25L8m53J49L56N86p84j98K31L12o55J01M31L50
$$ 111 -69 -316 -106 281 158 -111 114 152 -301 -152 204 790 6 -192 39 351 -304 -203 228 578
7664E78n50o04P64J83l56k34L64L5k56n63Q90K31n35m43O60K28k24o13O37o1K7
$$ 578 28 -576 188 371 15 -219 145 180 -76 -639 251 482 -53 -496 164 392 168 -445 192 131 158
7685A58n43N48J87r1p74M65L96o15L08j03L72n54M3K99N09p25m18N59K55m08k1
$$ 158 -385 163 350 259 -515 -50 346 -269 39 -64 308 -246 -203 96 605 -120 -538 21 276 -132 -153
7706a53M57Q6l44p51J195q3o06m91Q90J56l92p3K56L87p36J23L53K74p29j1K76
$$ -153 304 390 46 -705 490 407 -199 -690 200 356 -36 -109 147 534 -202 -79 274 548 -181 -192 84
7727H4L0j59k44O30K00o69k81M68K36l30j79P43k19l20j32J51L43l18m34N42K99
$$ 84 114 -45 -289 341 541 -128 -409 59 295 -35 -214 529 310 -10 -142 9 352 34 -400 142 441
7748D41n96k7L38N69o06m24L98o1l34j9N91j03m99J75K92K87o32k79M76N24n74
$$ 441 -155 -182 156 725 119 -305 93 32 -302 -321 270 167 -332 -157 135 422 -210 -489 -13 511 -63
7769f3j15M47R6o75K09R3K07k23k76J87L79j98m90M34N59o38n07Q62J72l83n50
$$ -63 -178 269 365 -310 -101 -8 199 -24 -300 -113 266 68 -422 12 571 -67 -574 288 460 77 -473
7790d73N36M45p91P4O0N41m60l48L66N39o94k73M18N53k38p87P46K99l64o47N60
$$ -473 63 508 -283 -209 -149 392 -68 -416 -50 489 -205 -478 -60 493 255 -532 214 513 149 -498 62
7811F2K77n32l42M04O76o83l74K79O92n98Q4l14M55j17k32J41N45m71k52K45K93
$$ 62 339 -193 -535 -131 545 -138 -512 -233 459 -139 -55 -369 86 -31 -263 -122 423 -48 -300 -55 238
7832B38k93n3K69R3l11l39M27J97Nk65L7R3l4n08M69Q4N0l80J40L60j47m42R9
$$ 238 -55 -108 161 254 -57 -396 31 228 233 -32 5 98 64 -444 25 109 159 -221 -81 279 132 -310 -211
7855b11P16k90k80O9M02o71J37J81K08k07l27J60K20n0m04J95L21k24r0K91j35
$$ -211 505 215 -65 4 406 -265 -128 53 261 54 -273 -113 107 57 -347 -152 169 -55 -145 146 11
7876A1k20r6L54K70L6m20j0K94m41j35K44M51n76L4Q5K76j29l51N08K00n76k2
$$ 11 -209 -305 49 319 355 -65 -75 219 -222 -357 -113 338 -238 -204 -119 157 28 -323 185 385 -191 -213
7898b13J89K36j2o02J94O89m84l5J76J1k03j20K32K26k62m05L04K41k68N5r2L50
$$ -213 -24 212 200 -402 -208 481 -3 -38 138 149 -54 -174 58 284 22 -383 -79 162 -106 -51 -143 207
7920B07O3k55J3j18K04k81J2M78n07k17O10K3j22k11K24l3j54j93N60pk06o1l43
$$ 207 270 15 28 -90 114 -167 -155 323 -184 -401 209 232 110 -101 123 90 -64 -257 303 296 90 29 -314
7943c14K53j56K34j75N67m44l8O3K54l10j21K40K7j28j82L64k7J67m68L13J61
$$ -314 -61 -217 17 -158 409 -35 -73 -10 244 -66 -187 53 80 -48 -230 134 107 274 -194 119 280
7964B80k68j43K82r0N6j74K4J44o3l86J05N93n57K28Q4k1r9L8j22J65Qj90J13
$$ 280 12 -131 151 61 117 -57 -33 111 48 -338 -233 360 -197 31 115 94 -5 33 -89 76 84 -106 7
7987GJ05M3l83K86N0k7j68K52k30J65k76J35J28Q1mj11j06J09M5k61N70m81k5
$$ 7 112 155 -228 58 108 81 -87 165 -65 100 -176 -41 87 168 164 53 -53 56 101 -160 410 -71 -96
8010i6L6J86J6R8m91K75m60N13j93K44o6N7j39L18k51k34j07K60j30O6K11k44
$$ -96 -60 126 142 240 -251 24 -436 77 -116 128 62 119 -20 298 47 -187 -294 -34 -164 -98 113 -131
8032a31M9J39j91K81j41P0J0k9O4k19k27L72K08n09L14k04Kl8n5M71j22n0k50
$$ -131 -82 57 -134 147 6 76 86 57 121 -98 -325 47 255 -254 60 -144 -142 -180 -235 236 114 64 -186
8055a86K61j30n3j02L76k02M3J78m90L14J4O2L6O3o6k58K27j44l46L72o9K07p1
$$ -186 75 -55 -108 -210 166 -36 7 185 -305 9 23 85 121 184 118 -140 87 -57 -403 -31 -100 107 36
8078C6j72L61k67J2J10R8l26J4J82l01K37J55J20N2j72l97K60J52m7j72L32j93
$$ 36 -136 225 -42 -30 80 178 -148 -134 48 -253 -16 139 259 311 139 -258 2 154 107 -65 267 74
8100G4l18L37k69M77k82k81N7N0K06r1o9K16J32k50P1k0j72K16j57J9M2k2J98
$$ 74 -244 93 -176 301 19 -262 -205 -155 51 -40 -109 107 239 -11 60 40 -132 84 -73 -54 -12 -34 164
8123A64l2k32Q9L6k41M49n75M87j22j17L0K16JR9m05J13J46j36j54L24J69j44
$$ 164 132 -100 -11 25 -216 233 -342 145 23 -94 -64 152 153 252 -153 -40 106 -30 -184 140 309 165
8145A65O1m46L46p7m4k20P4M4J43j11j4K7k20l7L65j74K69j81N7%K1o3J52l63
$$ 165 226 -220 126 49 5 -215 -141 -97 46 -65 -79 -52 -272 -309 56 -118 151 -30 27 27 48 -15 137 -226
8169b26M2K59j64M3K77k06l7m7M0k41N01j99o6J55j74J57k44J78R9n3l29P5
$$ -226 -184 75 -89 -46 231 25 -12 -59 -19 -260 241 42 -24 131 -43 114 -130 48 147 94 -235 -160
8191a60
$$ Imaginary data points
##PAGE= N=2
##DATA TABLE= (X++(I..I)), XYDATA
0@%%%qJ6j6K4m0M8n6P2q8J12j36J66k06K45k93L44m04M80n57O42p46Q61r84J121
$$ 0 0 0 0 -8 8 -8 16 -24 24 -32 40 -48 64 -72 94 -112 133 -160 184 -220 260 -297 345 -401 460 -524 597
27E97j277J451j639J846k077K332k610K912l247L621m023M457m946N483o065O714
$$ 597 -680 771 -868 978 -1099 1233 -1377 1535 -1712 1909 -2114 2343 -2603 2880 -3185 3529
43C529p438Q239r134J0146j1295J2608j4129J5919j8056K0665k3932K8155l3870
$$ 3529 -3909 4330 -4804 5342 -5953 6655 -7474 8445 -9611 11054 -12878 15277 -18593
56a8593M2078n4926P8064j32583M81788L77854j069149k67541N76893M07837m68792
$$ -18593 23485 -31441 46623 -85960 395828 773682 -295467 -563008 13885 421722 -47070
67d7070l34838K61981L52157j36014k29068q7733j4032Q8184M10197K78859l35797
$$ -47070 -381908 -119927 232230 96216 -132852 -220585 -234617 -146433 263764 542623 206826
78B06826n53212O4739M63417O9932l19176j0930K47867p0874l04044N4846K48231
$$ 206826 -346386 -281647 181770 251702 -67474 -78404 169463 98589 -205455 -150609 97622
89I7622j10942k11394L17471M20937l50460p55462K8981P83215L15723n19451
$$ 97622 -13320 -224714 92757 513694 163234 -592228 -563247 219968 535691 16240
99A6240l86143K81995L19735j44377k19686P9038J76237P9261M4927j06505l73344
$$ 16240 -369903 -87908 231827 87450 -132236 -53198 123039 202300 247227 140722 -232622
110b32622k18960L51718M53827j53850m76373l941L61501l629l07871Q6067M24345
$$ -232622 -451582 -99864 353963 200113 -276260 -280201 81300 77671 -230200 -144133 280212
121B80212L6830l71423r8207K37964k1330k77652Q6710M17407K4028m53511k05601
$$ 280212 317042 -54381 -152588 85376 64046 -213606 -126896 290511 314539 -138972 -344573
132c44573K85476K11895j25196o9601J40168p94k09753o2997J25179Q024o4111
$$ -344573 -59097 152798 27602 -41999 98169 97375 -112378 -175375 -50196 -42172 -106283
143a06283J52250J88704j73209l07132R9127L48775O941k60373L6819K61168j07021
$$ -106283 45967 234671 61462 -245670 -146543 202232 209173 -51200 -14381 246787 139766
154A39766m11974m6625L80259J54657k59856j45205J75968Q1439j70181m4937
$$ 139766 -272208 -318833 61426 216083 -43773 -188978 -13010 68429 -101752 -146689
164a46689K06899J11268j04743m5027N2598j00409j69282J10218K84283J611k67661
$$ -146689 60210 171478 66735 21708 74306 -26103 -195385 -85167 199116 200727 -66934
175f6934p6850J72673L5268j48070J9890J93635l138k07475m3104J34421l1843
$$ -66934 -143784 28889 64157 -83913 -64023 129612 126474 -81001 -124105 10316 -21527
186b1527j61478R2938K89574Q246l00147j08011K31409J57685j09412q4492Q3386
$$ -21527 -183005 -90067 199507 207753 -92394 -200405 31004 188689 79277 -5215 78171
197G8171R904j37940m8809Q4558q201q9759P5067J70336o1353k38235j4839K44874
$$ 78171 88075 -49865 -98674 -14116 -22317 -112076 -37009 133327 71974 -166261 -181100 63774
209F3774J14749j34665q1714Q2817Q959j19803q920J30731J9755j09905J0482
$$ 63774 178523 43858 -37856 44961 53920 -65883 -74803 55928 75683 -34222 -23740
220b3740J27221l4065j84192j0286J99147P6960j49175j04691N7330K3835o9971
$$ -23740 103481 69416 -114776 -125062 74085 151045 1870 -102821 -45491 -21656 -91627
231i1627K5688J31933J1647j22048q338J34124K4172j28717k8490J37385N6826
$$ -91627 -65939 65994 77641 -44407 -52745 81379 105551 -23166 -51656 85729 142555
242A42555j28592j10080K7663L6634j8330L0960O6701m0930j07041K6131J39085
$$ 142555 13963 -96117 -68454 -31820 -50150 -19190 47511 6581 -100460 -74329 64756
253F4756J7509j19405k2539J20593M0608j15601p5807O3444N8374k1769L591M8027
$$ 64756 82265 -37140 -59679 60914 101522 -14079 -89886 -26442 31932 10163 13754 61781
265F1781l2274r9458Q966J21417K7247j19038o9882P3741N9587n9121o3124L4360
$$ 61781 29507 -69951 -60985 60432 87679 -31359 -101241 -27500 32087 -27034 -90158 -55798
277e5798O3468K1473J3397Q324m4392m5868N6764R7203k7401j30887m0283Q6517
$$ -55798 7670 29143 42540 50864 6472 -39396 17368 114571 87170 -43717 -84000 2517
289B517L8211p8134n3159N5571N8774j8068k4674J9689N175k6738J6236N9696
$$ 2517 40728 -37406 -90565 -34994 23780 5712 -18962 727 5902 -20836 -4600 55096
301E5096j567p8482l5400N6769M9680k4826l3594J5722K3638l704m798K433k4927
$$ 55096 53529 -24953 -60353 -3584 46096 21270 -12324 3398 27036 23332 18534 20967 -3960
314c960l2187J6485M1025j9482o9184j2759O6222M6634k1642k2909K5999L0250
$$ -3960 -36147 -19662 21363 1881 -67303 -80062 -13840 32794 11152 -11757 14242 44492
326D4492m793q519P996q283l1910r663K0036j816m0068k2323K8794L5711J41j7345
$$ 44492 39699 31180 39176 30893 -1017 -10680 9356 7540 -32528 -54851 -26057 9654 9795 -7550
340g550l618O565R125J4287N048k2913k8136J1594L7796O788l3578j6294L0519
$$ -7550 -11168 -4603 4522 18809 23857 944 -27192 -15598 22198 28986 -4592 -20886 9633
353I633L5601m218k8939j7704Q44O901Q22j2726k6821j7244J5682L2373R670j7364
$$ 9633 45234 41016 12077 -5627 -4783 2118 2940 -9786 -36607 -53851 -38169 -5796 3874 -13490
367a3490n750K7522L3727N201j9981j8075j056Q125K547j5322k6656j4237J3439
$$ -13490 -19240 8282 42009 47210 27229 9154 8098 16223 18770 3448 -23208 -37445 -24006
380b4006K3536L115j8247j0740J5139K3879M638j7511j9087j03J6002J2731n795
$$ -24006 -470 2645 -15602 -26342 -11203 12676 17314 -197 -19284 -19387 -3385 9346 3551
393C551j6212k404K0281K4423K953j7800j3865M435J2082l567k3003k4783n603
$$ 3551 -12661 -15065 5216 29639 32592 14792 927 5362 17444 13877 -9126 -33909 -39512
406c9512J2395J2504k432j0353J822K2034K5827P960j0395j1104L814J2478J203
$$ -39512 -27117 -14613 -17045 -27398 -25576 -3542 22285 30245 19850 8746 12560 25038 26241
419B6241j7014k2623p470J0974J2919k286j5010q057J3395K1310L472j8115j7110
$$ 26241 9227 -13396 -20866 -9892 3027 741 -14269 -22326 -8931 12379 15851 -2264 -19374
432a9374M181J7953O062j3029j4960M051K1791J9593k48j5348o388J4463J6765
$$ -19374 -15193 2760 8822 -4207 -19167 -15116 6675 26268 26020 10672 4284 18747 35512
445C5512q785k9601j8347P557R965r571j6474j232J3311J3155Q343O967R71k393
$$ 35512 26727 -2874 -21221 -13664 -3699 -13270 -29744 -30976 -17665 -4510 3833 10800 11771 9378
459I378M514J4004K021j7428j6927K223P943k876q286j680J791J452O449P791
$$ 9378 13892 27896 29917 12489 -4438 -2215 5728 2852 -5434 -7114 -5323 -3871 2578 10369
473A0369p874j7742J911K1381L225k5798j5017J9065K1363n406p775J4589J3117
$$ 10369 2495 -15247 -13336 8045 11270 -14528 -29545 -10480 10883 5477 -2298 12291 25408
486B5408r365q222J2094N685k1934j9315J0014R434j9752k2698Q130K1280N265
$$ 25408 16043 7821 19915 25600 3666 -15649 -5635 3799 -15953 -38651 -30521 -9241 -3976
499c976K82Q858J12j2516P754K9713K160l7005j5517L1521J6733l6530l0266K7678
$$ -3976 -3694 5164 5276 -7240 514 30227 32387 -4618 -20135 11386 28119 -8411 -38677 -10999
513a0999L6848j1865k7327M783J1646j5083o925K6002J0368l5597k3567L1002
$$ -10999 25849 13984 -13343 -8560 3086 -11997 -18922 7080 17448 -18149 -41716 -10714
525a0714K7420k3352k0529L4495L6092j9219l1080J0663J5564j8439j0913K6759
$$ -10714 16706 -6646 -27175 7320 43412 24193 -6887 3776 19340 901 -10012 16747
537A6747M626n0539l0451M0403L7016k7637k5361L8067L5101l1965l5912K7532
$$ 16747 21373 -29166 -59617 -19214 17802 -9835 -35196 2871 37972 6007 -29905 -2373
549b373L4825k1002k1184K8767J3053n1981l4544N0703N1773l0382m3192K5252
$$ -2373 32452 11450 -9734 19033 32086 -19895 -54439 -3736 48037 17655 -25537 -285
561b85L0499l7632l8037L7245M3652k9900l9101K5919K6699m0260k9318N8891
$$ -285 30214 -7418 -45455 -8210 35442 5542 -33559 -7640 19059 -21201 -50519 8372
573H372O2461l0963n7126J1445L0145k3432j9228M0352K1612n8103m1083M7494
$$ 8372 70833 39870 -17256 -5811 24334 902 -18326 22026 43638 -14465 -55548 -8054
585h054L3184n8243l2185Q6494P3314o9691r8264L1148Q7008m327n3702J5039
$$ -8054 25130 -33113 -65298 21196 94510 24819 -73445 -42297 44711 40384 -13318 1721
597A721L8195l5595m9633K8844M4431k5570k2895N4729L2050p9064p3337N3408
$$ 1721 39916 4321 -45312 -16468 27963 2393 -20502 34227 66277 -12787 -86124 -32716
609c2716Q1647k0936n3786K1878K5131n3755l3877P4690O2485n4905m9944O7420
$$ -32716 48931 27995 -25791 -3913 21218 -32537 -66414 8276 70761 15856 -34088 33332
621C3332M6693r9241r1851Q8641J31721l9908j31498j3775P8758P036m7108K0647
$$ 33332 80025 -19216 -111067 -22426 109295 69387 -62111 -75886 2872 9908 -37200 -16553
633a6553N8231j0502m1215R499M529n2333k007J05134N3142j06903j01509O2562
$$ -16553 41678 31176 -10039 -540 3989 -48344 -50351 54783 107925 1022 -100487 -37925
645c7925R3262m2902o6674O5147Q2487o7916j08866K9032Q3179k3902n0634O2514
$$ -37925 55337 12435 -54239 10908 93395 25479 -83387 -54355 28824 4922 -45712 16802
657A6802O6264q7220j15595N5193J34512J687q6582L862O1846k8638p7303J0734
$$ 16802 83066 -4154 -119749 -64556 69956 71643 -14939 -11077 50769 22131 -55172 -44438
669d4438O0824M235j1788L3244j8780j13541l2105J45732J09176j01783j22292
$$ -44438 16386 20621 8833 42077 23297 -90244 -122349 23383 132559 30776 -91516
680i1516P2482J11453p9932j36001O3529J65873J215j32071m0101N5250K2k6123
$$ -91516 -19034 92419 12487 -123514 -59985 105888 107103 -24968 -65069 -9819 -9797 -35920
692c5920O3293O9044o4706r9116K8005P1180m0904o2260P0205R6767n1765j11628
$$ -35920 27373 96417 31711 -67405 -39400 31780 -9124 -71384 -1179 95588 43823 -67805
704f7805O430O7807n843r966Q0806L5946j25793j04942R5901J24038o9194j17745
$$ -67805 -61375 6432 589 -9377 71429 107375 -18418 -123360 -27459 96579 27385 -90360
716i0360P4314J37183o6249j78117o46J58642O6042o8284l8422J2970l4300l6928
$$ -90360 -16046 121137 54888 -123229 -123875 34767 100809 32525 -5897 7073 -27227 -64155
728f4155N8348O6850m3013n1009O2119M7169j06457j01020R8643J54677k9171
$$ -64155 -5807 61043 18030 -32979 29140 76309 -30148 -131168 -32525 122152 92981
739I2981j28987r566O0635l8796o0012P9025J06727n6997j17503L0355R1152m7297
$$ 92981 -36006 -45572 15063 -23733 -83745 -4720 102007 45010 -72493 -42138 49014 1717
751A717r1487P5185J45436l2635j58697l7539R1006L1841l4480K4467M3904n4095
$$ 1717 -89770 -14585 130851 98216 -60481 -98020 -7014 24827 -9653 14814 58718 4623
763D623p4614L8548O2563m5474m3798R5842Q7041j08124j51893M9453J51036K037
$$ 4623 -69991 -31443 31120 -14354 -58152 37690 124731 16607 -135286 -85833 65203 67240
775F7240r8705J5116Q3144m2965j10520K3538J12588O960o9034J4490M9723o6042
$$ 67240 -31465 -16349 66795 23830 -86690 -63152 49436 56396 -12638 1852 51575 -14467
787a4467r7428N4547J30108j624r5548o640N5343l2082o5934N3780J02626k0271
$$ -14467 -111895 -57348 72760 71136 -24412 -31052 24291 -7791 -73725 -19945 82681 62410
799F2410q8978N729M7743n0721o3503Q0423J18003m6800j33463n22R4242l857
$$ 62410 -26568 -20839 26904 -23817 -87320 -6897 111106 64306 -69157 -69679 24563 20706
811B0706p2602L5023R9206k2918j11119j5231P2507P349l9751M1383O6969n2405
$$ 20706 -51896 -16873 82333 59415 -51704 -66935 5572 12921 -26830 14553 81522 29117
823B9117j03429J9469R3308k716o2592K8485O9491m7896j05495J5517R9208R171
$$ 29117 -74312 -54843 38465 35749 -26843 1642 71133 23237 -82258 -66741 32467 41638
835D1638o0072J6292N6177m5479q8335L2694J05432K608p6198K311N4621l5061
$$ 41638 -18434 -2142 54035 8556 -79779 -47085 58347 60955 -15243 -12932 41689 6628
847F628q0078L0960J00950K715p8926q260M7905k3485o0426L8792R1922j1759
$$ 6628 -73450 -42490 58460 61175 -17751 -26011 21894 -1591 -62017 -23225 68697 56938
859E6938q6851j0894N4496j0173n0227L4697Q0024j8028q5574o415N9316l008
$$ 56938 -29913 -40807 13689 3516 -46711 -12014 68010 49982 -35592 -42007 17309 14301
871A4301m6484K8057O7215k5642q7329m993O6055Q396m3187J7761N4815k5038
$$ 14301 -32183 -4126 63089 37447 -49882 -54875 11180 19576 -23611 -5850 48965 23927
883B3927p3848O414O9105M732m7868J2471N2104k4906p6375L528P4200J6780m7141
$$ 23927 -49921 -43507 25598 30330 -17538 -5067 47037 22131 -54244 -50716 23484 40264 -6877
896f877o265L5191j5299n0593J3704N9683j4m5846M544L6747k3822n5057K3212
$$ -6877 -13142 22049 6750 -43843 -30139 29544 29530 -16316 -11772 24975 1153 -53904 -30692
909c0692P4003K790o1517j2917M0730r41m0047J1767N2026l401n2556o706L5643
$$ -30692 43311 46101 -15416 -28333 12397 11456 -28591 -16824 35202 31801 -20755 -27461 8182
922H182n670l5589J8557N3652o963n7699r565M3201R961k9707M633L4094q135
$$ 8182 2512 -33077 -14520 39132 32169 -25530 -35095 8106 18067 -11640 -7007 27087 18952
935A8952m2795n31L5416j65k7687J2951L6982j5668n0171J592M7367R199l4716
$$ 18952 -23843 -24374 11042 10877 -16810 -3859 33123 17455 -32716 -31124 16243 25442 -9274
948i274m674L0005k631l5553j229L5122Q449k3488q60K2015r010l0765O345L6479
$$ -9274 -13948 16057 13426 -22127 -23356 11766 20215 -3273 -4133 17882 8872 -21893 -15548 20931
962B0931K508l1952n270K2852k595k5799M469L1738L232k6627n114K0091p47k0724
$$ 20931 23439 -8513 -13783 9069 6474 -19325 -14856 16882 20114 -6513 -11627 8464 7717 -13007
976a3007N807K6603j526k8076m314K1476J603j8347K554K3234m55k4567n350J9646
$$ -13007 -7200 19403 17877 -10199 -14513 6963 8566 -9781 -7227 16007 15552 -9015 -14365 5281
990E281M280j6063Q8J6773j624j9532j319J8194K906j3898J596J5800k170j9976
$$ 5281 9561 -6502 -6414 10359 8735 -10797 -12116 6078 8984 -4914 -3318 12482 10312 -9664
1004i664j089J7666L944j5271l300J1632J079j3578j216J3199L040r704o25R681
$$ -9664 -10753 6913 10857 -4414 -7714 3918 4997 -8581 -9797 3402 6442 -3262 -3887 5794
1018E794k184j2444K102J3965Q57j3297l356J1186K542r887k259R767L769p753
$$ 5794 3610 -8834 -6732 7233 8090 -5207 -8563 2623 5165 -4722 -6981 2786 6555 -1198
1032a198l989N162Q89n097L13O490m42p678k11P320J044n996k59O991J603o971
$$ -1198 -5187 -25 864 -4233 -3920 2570 2128 -5550 -5761 1559 2603 -3393 -3652 3339 4942 -2029
1048b029k294M714K049m014k040L666P00m075m1L959J030l733k59M105J041m368
$$ -2029 -4323 391 2440 -1574 -3614 52 752 -3323 -3364 595 1625 -2108 -2367 1738 2779 -1589
1064a589j424L525K083k505j844J422J641j303k21J161k26j173R55J265j331k319
$$ -1589 -3013 512 2595 90 -1754 -332 1309 6 -215 946 720 -453 502 1767 436 -1883
1080a883K66K959O21l128j255K465K764j160j562P2J698N51p25p68j012K42J024
$$ -1883 -1617 1342 1963 -1165 -2420 45 2809 1649 87 159 1857 2408 1683 915 -97 145 1169
1097A169L52j342j220Q69J811K95j498q63J097J172k05j322q0N96K18J28n43k59
$$ 1169 1521 179 -1041 -172 1639 1934 436 -427 670 1842 1637 315 235 831 1049 1177 634 375
1115C75O29J9M14j49j001q6O07K23r51n93M12L25m66m22N51P43l29J78K75J66
$$ 375 1004 1023 1437 1288 287 201 808 1031 80 -513 -101 224 -242 -664 -113 630 301 479 754 920
1135I20j117j35J581j51k382m98K172O18k492j185K270J633j840j527J109J166
$$ 920 -197 -332 1249 1098 -1284 -1782 390 1008 -1484 -2669 -399 1234 -606 -2133 -1024 142
1151A42q31p03J971m81k274J56K872M0l420k96M683J011m975k551M304K772l912
$$ 142 -689 -1392 579 98 -2176 -2020 852 892 -2528 -2824 1859 2870 -2105 -4656 -352 2420 -1492
1168a492k045L617J400m156j541M421J654m280n79N057J148o415j925P018K356
$$ -1492 -3537 80 1480 -2676 -4217 204 1858 -2422 -3001 2056 3204 -3211 -5136 1882 4238
1183D238n458k798O222J298p739k426Q344M009o656m490O469L154p125k780P984
$$ 4238 -1220 -4018 2204 3502 -4237 -6663 1681 5690 -966 -5456 1013 4167 -2958 -5738 2246
1198B246L799o860l419O351J411q496q43J2298L756j2726o162J0028O082r666
$$ 2246 6045 -815 -4234 2117 3528 -4968 -5811 6487 10243 -2483 -8645 1383 7465 -2201
1212b201m794J0535O052j0564o482P765L833p607o74J3211K264j7481o721J5935
$$ -2201 -6995 3540 9592 -972 -7454 311 4144 -3463 -4137 9074 11338 -6143 -12864 3071
1226C071R607j2557q670J2405Q138j3025r805R753Q208p062k096J1522j972k0010
$$ 3071 12678 121 -8549 3856 11994 -1031 -10836 -1083 7125 63 -2033 9489 7517 -12493
1240a2493k306K3599R572k0660j1716J8097J0980j8684j4204J6659J7180r199
$$ -12493 -14799 8800 18372 -2288 -14004 4093 15073 -3611 -17815 -1156 16024 6825
1252F825j1667N944J298j3636J297K2871N601k5053j1492K1656J1303k2064j2764
$$ 6825 -4842 1102 2400 -11236 -9939 12932 18533 -6520 -18012 3644 14947 -7117 -19881
1265a9881K4398J9177j8154k0982P509J1242p326n4J8626Q98k8167r267K7038
$$ -19881 4517 23694 5540 -15442 -7933 3309 -4017 -4071 14555 15453 -12714 -21981 5057
$$ [...]
8191A33
##END NTUPLES=NMR FID
##END=
