##TITLE=1H_640-03
 CDCl3, 8 sc, 
 25.12.2019
##JCAMPDX= 6.0         $$ Bruker NMR JCAMP-DX V2.0
##DATA TYPE= NMR FID
##DATA CLASS= NTUPLES
##ORIGIN= UXNMR, Bruker Analytische Messtechnik GmbH
##OWNER= root
$$ XWIN-NMR		Version 3.5
$$ Wed Dec 25 14:02:54 2019 Russian Standard Time (UT+4h)  she@DPX200
##.OBSERVE FREQUENCY= 200.1315
##.OBSERVE NUCLEUS= ^1H
##.DELAY= (6, 6)
##.ACQUISITION MODE= SIMULTANEOUS
##.ACQUISITION SCHEME= undefined
##.AVERAGES= 8
##.DIGITISER RES= 18
##SPECTROMETER/DATA SYSTEM= spect
##.PULSE SEQUENCE= zg30
##.SOLVENT NAME= DMSO
##.SHIFT REFERENCE= (INTERNAL, DMSO, 0, 15.7039)
##AUDIT TRAIL= $$ (NUMBER, WHEN, WHO, WHERE, WHAT)
$$ ##TITLE= Audit trail, XWIN-NMR		Version 3.5
$$ ##JCAMPDX= 5.01
$$ ##ORIGIN= Bruker BioSpin GmbH
$$ ##OWNER= she
$$ F:/spectra/data/she/nmr/H-F/1/audita.txt
$$ ##AUDIT TRAIL=  $$ (NUMBER, WHEN, WHO, WHERE, WHAT)
(   1,<2019-12-25 14:01:41.42 +0400>,<she>,<DPX200>,
      <created by zg, POWCHK disabled, PULCHK disabled
       configuration hash MD5:
       00 E9 B6 7A A2 85 ED C7 34 08 36 98 17 FE 4E 26
       data hash MD5: 16K
       1F 4B 43 41 68 10 9A 4C D6 41 87 BD 87 A2 44 38>)
$$ ##END=
$$ 
$$ hash MD5
$$ FD B2 F9 CE 0F 49 4D 1F CF 61 4A 8D 9D 32 9A 84
##$RELAX= 
##$RELAX= 
##$RELAX= 
##$RELAX= 
##$RELAX= 
##$RELAX= 
$$ Bruker specific parameters
$$ --------------------------
##$DU= <F:/spectra>
##$EXPNO= 1
##$NAME= <H-F>
##$PROCNO= 1
##$TYPE= <nmr>
##$USER= <she>
##$AMP= (0..31)
100 100 100 100 100 100 100 100 100 100 100 100 100 100 100 100 100 100 
100 100 100 100 100 100 100 100 100 100 100 100 100 100 
##$AQSEQ= 0
##$AQ_mod= 1
##$AUNM= <au_zg>
##$AUTOPOS= <>
##$BF1= 200.13
##$BF2= 200.13
##$BF3= 200.13
##$BF4= 200.13
##$BF5= 200.13
##$BF6= 200.13
##$BF7= 200.13
##$BF8= 200.13
##$BYTORDA= 1
##$CFDGTYP= 0
##$CFRGTYP= 5
##$CHEMSTR= <none>
##$CNST= (0..31)
1 1 145 1 1 1 1 1 1 1 1 1 1 1 1 1 1 1 1 1 1 1 1 1 1 1 1 1 1 1 1 1 
##$CPDPRG= <>
##$CPDPRG1= <>
##$CPDPRG2= <>
##$CPDPRG3= <>
##$CPDPRG4= <mlev>
##$CPDPRG5= <mlev>
##$CPDPRG6= <mlev>
##$CPDPRG7= <mlev>
##$CPDPRG8= <mlev>
##$CPDPRGB= <>
##$CPDPRGT= <>
##$D= (0..31)
0 1.2 0 0 0 0 0 0 0 0.06 0 0.03 0 0 0 0 0.0002 0 0 0 0 0 0 0 0 0 0 0 0 
0 0 0 
##$DATE= 1577268100
##$DBL= (0..7)
120 120 120 120 120 120 120 120 
##$DBP= (0..7)
150 150 150 150 150 150 150 150 
##$DBP07= 0
##$DBPNAM0= <>
##$DBPNAM1= <>
##$DBPNAM2= <>
##$DBPNAM3= <>
##$DBPNAM4= <>
##$DBPNAM5= <>
##$DBPNAM6= <>
##$DBPNAM7= <>
##$DBPOAL= (0..7)
0.5 0.5 0.5 0.5 0.5 0.5 0.5 0.5 
##$DBPOFFS= (0..7)
0 0 0 0 0 0 0 0 
##$DE= 6
##$DECBNUC= <off>
##$DECIM= 24
##$DECNUC= <off>
##$DECSTAT= 4
##$DIGMOD= 1
##$DIGTYP= 9
##$DL= (0..7)
0 120 120 120 120 120 120 120 
##$DP= (0..7)
150 150 150 150 150 150 150 150 
##$DP07= 0
##$DPNAME0= <>
##$DPNAME1= <>
##$DPNAME2= <>
##$DPNAME3= <>
##$DPNAME4= <>
##$DPNAME5= <>
##$DPNAME6= <>
##$DPNAME7= <>
##$DPOAL= (0..7)
0.5 0.5 0.5 0.5 0.5 0.5 0.5 0.5 
##$DPOFFS= (0..7)
0 0 0 0 0 0 0 0 
##$DQDMODE= 0
##$DR= 18
##$DS= 0
##$DSLIST= <SSSSSSSSSSSSSSS>
$$ [...]
##$SUBNAM2= <"">
##$SUBNAM3= <"">
##$SUBNAM4= <"">
##$SUBNAM5= <"">
##$SUBNAM6= <"">
##$SUBNAM7= <"">
##$SUBNAM8= <"">
##$SUBNAM9= <"">
##$SW= 24.9337058887773
##$SWIBOX= (0..15)
0 0 2 0 0 0 0 0 0 0 0 0 0 0 0 0 
##$SW_h= 4990.01996007984
##$TD= 16384
##$TD0= 1
##$TE= 0
##$TE2= 300
##$TE3= 300
##$TEG= 300
##$TL= (0..7)
0 120 120 120 120 120 120 120 
##$TP= (0..7)
150 150 150 150 150 150 150 150 
##$TP07= 0
##$TPNAME0= <>
##$TPNAME1= <>
##$TPNAME2= <>
##$TPNAME3= <>
##$TPNAME4= <>
##$TPNAME5= <>
##$TPNAME6= <>
##$TPNAME7= <>
##$TPOAL= (0..7)
0.5 0.5 0.5 0.5 0.5 0.5 0.5 0.5 
##$TPOFFS= (0..7)
0 0 0 0 0 0 0 0 
##$TUNHIN= 0
##$TUNHOUT= 0
##$TUNXOUT= 0
##$USERA1= <user>
##$USERA2= <user>
##$USERA3= <user>
##$USERA4= <user>
##$USERA5= <user>
##$V9= 5
##$VALIST= <valist>
##$VCLIST= <CCCCCCCCCCCCCCC>
##$VD= 0
##$VDLIST= <DDDDDDDDDDDDDDD>
##$VPLIST= <PPPPPPPPPPPPPPP>
##$VTLIST= <TTTTTTTTTTTTTTT>
##$WBST= 1024
##$WBSW= 4
##$XGAIN= (0..3)
0 0 0 0 
##$XL= 0
##$YL= 0
##$YMAX_a= 875905
##$YMIN_a= -683978
##$ZGOPTNS= <>
##$ZL1= 120
##$ZL2= 120
##$ZL3= 120
##$ZL4= 120
##$ABSF1= 10
##$ABSF2= 0
##$ABSG= 5
##$ABSL= 3
##$ALPHA= 0
##$AQORDER= 0
##$ASSFAC= 0
##$ASSFACI= 0
##$ASSFACX= 0
##$ASSWID= 0
##$AUNMP= <proc_1d>
##$AZFE= 0.1
##$AZFW= 0.1
##$BCFW= 1
##$BC_mod= 2
##$BYTORDP= 1
##$COROFFS= 0
##$CY= 11.3945322036743
##$DATMOD= 1
##$DC= 2
##$DFILT= <>
##$DTYPP= 0
##$F1P= 16.9975609425685
##$F2P= -3.02152046262296
##$FCOR= 0.5
##$FTSIZE= 0
##$FT_mod= 4
##$GAMMA= 1
##$GB= 0.15
##$INTBC= 1
##$INTSCL= 1
##$ISEN= 128
##$LB= 0.24
##$LEV0= 0
##$LPBIN= 0
##$MAXI= 10000
##$MC2= 0
##$MEAN= 0
##$ME_mod= 0
##$MI= 1.114404
##$NCOEF= 0
##$NC_proc= 0
##$NLEV= 6
##$NOISF1= 3.799351
##$NOISF2= 2.8
##$NSP= 1
##$NTH_PI= 0
##$NZP= 0
##$OFFSET= 15.70392
##$PC= 1
##$PHC0= -10147.13
##$PHC1= 13.8008
##$PH_mod= 1
##$PKNL= yes
##$PPARMOD= 0
##$PSCAL= 0
##$PSIGN= 0
##$REVERSE= no
##$SF= 200.130013532006
##$SI= 16384
##$SIGF1= 3
##$SIGF2= 2
##$SINO= 400
##$SIOLD= 16384
##$SREGLST= <1H.CDCl3>
##$SSB= 0
##$STSI= 0
##$STSR= 0
##$SW_p= 3612.71676300578
##$SYMM= 0
##$S_DEV= 0
##$TDeff= 0
##$TDoff= 0
##$TI= <>
##$TILT= no
##$TM1= 0
##$TM2= 0
##$TOPLEV= 0
##$USERP1= <user>
##$USERP2= <user>
##$USERP3= <user>
##$USERP4= <user>
##$USERP5= <user>
##$WDW= 1
##$XDIM= 8192
##$YMAX_p= 0
##$YMIN_p= 0
$$ End of Bruker specific parameters
$$ ---------------------------------
##NTUPLES= NMR FID
##VAR_NAME=  TIME,          FID/REAL,        FID/IMAG
##SYMBOL=    X,             R,               I
##VAR_TYPE=  INDEPENDENT,   DEPENDENT,       DEPENDENT
##VAR_FORM=  AFFN,          ASDF,            ASDF
##VAR_DIM=   8192,          8192,            8192
##UNITS=     SECONDS,       ARBITRARY UNITS, ARBITRARY UNITS
##FACTOR=    0.0002004,     1,               1
##FIRST=     0,             0,               0
##LAST=      1.6414764,     0,               0
##MIN=       0,             -683978,         0
##MAX=       1.6414764,     875905,          0
$$ Real data points
##PAGE= N=1
##DATA TABLE= (X++(R..R)), XYDATA
$$ [...]
2572A075j60k304j75K592P98j679q29J798O0j783K39J627l19k466m83K342P35
$$ 1075 915 -1389 -1564 1028 1826 147 -682 1116 1176 -607 -368 1259 940 -1526 -2009 333 1068
2589A068k325m34J925J209j703p35M97Q11n22P47R93j746k466J601L560p82m202
$$ 1068 -1257 -1691 234 1443 -260 -995 -498 313 -209 538 1531 -215 -2681 -1080 2480 1698 -2504
2606b504N46M039N67m633j462L769K234k489k489J612J302j937q5K742P79k814
$$ -2504 -1958 2081 2648 -1985 -3447 322 2556 67 -2422 -810 492 -1445 -1530 1212 1991 -823
2622h23J10K470n5l659r6L721R14l577j505K632M86k991J006M014l60n075L72
$$ -823 -713 1757 1702 -1957 -2053 1668 2582 -995 -2500 132 618 -2373 -1367 2647 2287 -2788 -2416
2639b416M850j71n085M0O205J270o128l469M768L140k748j498K953L69l696q01
$$ -2416 2434 2263 -2822 -2782 3423 4693 -1435 -4904 -136 3004 256 -1242 1711 2080 -1616 -2417
2655b417L418M23l466J105M618j544o494J09O404K442n501r18M870J8o175q37
$$ -2417 1001 1424 -2042 -937 3681 2137 -4357 -4248 2156 4598 -903 -1821 3049 3067 -3108 -3945
2671c945O689K053n949j572N080j8o528q38Q141K825o171l004L752J646m215r09
$$ -3945 2744 4797 -1152 -2724 2356 2338 -4190 -5028 3113 5938 -233 -3237 515 2161 -2054 -2963
2687b963O098J242n685j424M666l72n269J585P950L20r352k708P300K148o295
$$ -2963 3135 4377 -1308 -2732 1934 1562 -3707 -2122 5828 6148 -3204 -5912 1388 3536 -2759
2702b759r69P381J694q391k830O464L101m977n09O390Q4q443k675P822L484n887
$$ -2759 -3728 3653 5347 -3044 -5874 590 3691 -1286 -1795 4595 4679 -3764 -6439 1383 4867 -1020
2718a020j400N787k78q051j347Q296L374o411j469O529r24r190r07J1217L246
$$ -1020 -2420 3367 3089 -4962 -6309 1987 5361 -1050 -2519 4010 3086 -6104 -7011 4206 7452
2733G452q764l293O975M81p957j005J0159L959q675m344N881J406p151l76J0259
$$ 7452 -1312 -4605 2370 2851 -5106 -6111 4048 8007 -668 -5012 869 2275 -4876 -5252 5007
2748E007K526r960m309P005K703o719J98R541K014j0818m540P865L427o866l99
$$ 5007 7533 -2427 -6736 269 2972 -3747 -3549 5992 8006 -2812 -7352 513 3940 -2926 -3325
2763c325Q972J118j1497m633R634N139o538j647P817Q13j1061l504R954N554p359
$$ -3325 5647 6765 -4732 -9365 269 5408 -1130 -2777 5040 5853 -5208 -8712 1242 6796 -563
2778e63k637P373M43j0684k350J1130N898q268m244O635P16r463j791J1575M787
$$ -563 -3200 4173 4616 -6068 -8418 2712 8610 342 -3902 2733 3449 -6014 -7805 3770 8557
2793H557q818m611O419J659r063o49J2580M583j0836o322P281K691p847j278J1335
$$ 8557 -261 -4872 1547 3206 -5857 -6506 6074 10657 -179 -6501 780 3471 -4376 -5654 5681
2808E681L640j1320o417Q153M082p448l76J0738K486j2483o542R340N730o225
$$ 5681 9321 -1999 -8416 -263 3819 -3629 -4005 6733 9219 -3264 -9806 -466 5264 -961
2822i61k311Q713J834j1601n014R592O289o885k189Q059M10j2417l936J1826O840
$$ -961 -3272 5441 7275 -4326 -9340 252 6541 -344 -2533 5526 5936 -6481 -10417 1409 8249
2837H249q119m487P505J680j0349l579J1523O992p848n865O417J430r376k675
$$ 8249 130 -4357 3148 4828 -5521 -9100 2423 9415 1567 -4298 2119 3549 -5827 -8502
2851h502J2538N379r488o199O431L259q123j863J1496M803j0465o340O395L648
$$ -8502 4036 9415 -73 -6272 159 3418 -4705 -6568 4928 9731 -734 -7074 -679 2969
2865B969p272j190J1464L639j1925o726Q168N397o545k200R247L000j1091o795
$$ 2969 -4303 -5493 5971 9610 -2315 -9041 -873 4524 -2021 -4221 5026 8026 -3065 -9860
2879i860Q432O107n685k548Q017J603j0923m595R811O551o568l694P353J868j0938
$$ -9860 -1428 4679 -1006 -3554 4463 6066 -4857 -9452 359 6910 342 -3352 4001 5869 -5069
2894e069m192J0502O436o716m461N556J975q984k899J0532N866p686n579N408
$$ -5069 -9261 1241 7677 961 -3500 2056 4031 -4953 -7852 2680 8546 860 -4719 689
2908F89K613p625k562J0367N552q216o205N013L444o094j786Q938M394r161o592
$$ 689 3302 -4323 -6885 3482 9034 818 -5387 -374 3070 -3024 -4810 4128 8522 -639 -7231
2923g231O327M125n612k186R252K989q880o318O757N303n023k594P415K610r217
$$ -7231 -904 3221 -2391 -4577 4675 7664 -1216 -7534 -777 4526 -497 -3091 4324 6934 -2283
2938b283n271P011N386m335l247O032K022q532m497P839N851n221l662N153J834
$$ -2283 -7554 -543 4843 508 -2739 3293 5315 -3217 -7714 125 5976 755 -2907 2246 4080
2953D080p304l620P743N732n776m398M685K458o671k937Q233M515o038m847M390
$$ 4080 -3224 -6844 899 6631 855 -3543 1142 3600 -3071 -6008 2225 6740 702 -4145 245
2968B45K678o038k280P708M419o509n079M467L433m786k209O670L221o086n018
$$ 245 2923 -3115 -5395 2313 6732 223 -4856 -389 3044 -1742 -3951 2719 5940 -146 -5164
2983e164M163L841m133j870N936K253o330m281M651M123l396k546M483K650n919
$$ -5164 -1001 2840 -1293 -3163 2773 5026 -1304 -5585 -934 3189 -207 -2753 1730 4380 -1539
2998a539l807M756M376l533k537L873K295n700l320N442M183l613l932L397J992
$$ -1539 -5346 -590 3786 253 -2284 1589 3884 -1816 -5136 306 4489 876 -3056 341 2333
3013B333m520k566N010L746l182l622L073K120m101j841M746L454m391l393K315
$$ 2333 -2187 -4753 257 4003 821 -2801 272 2392 -1709 -3550 1196 4650 259 -3134 -819
3028h19L011l420j951M286L128l865l840K774K667k602j862L853K289l913l157
$$ -819 2192 -1228 -3179 1107 4235 370 -3470 -696 1971 -631 -2493 1360 3649 -264 -3421
3043c421K700K788k138j569K957J946l177l171L000K707k147k398K767J533l169
$$ -3421 -721 2067 -71 -1640 1317 3263 86 -3085 -85 2622 475 -1923 844 2377 -792
3058g92k346K883K750j810j913K099J389k710k033K670K574k144j955J460J576
$$ -792 -3138 -255 2495 685 -1228 871 2260 -450 -2483 187 2761 617 -1338 122 1698
3073A698k125j470K204K192j880k120J260J652j809j341K166J753k038j978J637
$$ 1698 -427 -1897 307 2499 619 -1501 -241 1411 -398 -1739 427 2180 142 -1836 -199
3088a99J589j535j206J781J334j548j709J105J605j175j524J668R32j043j613
$$ -199 1390 -145 -1351 430 1764 216 -1493 -388 1217 42 -1482 186 1118 75 -1538
3103a538J338J125q26j235J168J149j236j446J080J674r94j050M58J106j172p73
$$ -1538 -200 925 99 -1136 32 1181 -55 -1501 -421 1253 259 -791 -333 773 -399 -1172
3119a172J001Q02m58j182J066N79r00q91P77J202n87q55K02Q24n65p30O33Q72
$$ -1172 -171 631 173 -1009 57 636 -264 -1155 -378 824 237 -618 -416 408 -157 -887 -254 618
3137F18l98o37J57O87n60o95O06O83m31r14R32L07m36k44O6Q37k18j222O13P57
$$ 618 220 -417 -260 427 -133 -828 -222 461 30 -884 48 355 -81 -325 -259 578 360 -862 -249 508
3157E08l45l91J73N29j96r05N95M12m46l85K53O79m16n13K01N55j51m77K92J52
$$ 508 163 -228 -55 474 278 -627 -32 380 -66 -451 -198 481 65 -448 -247 308 157 -320 -28 124
3177A24J77l58j16P34k28l25L04Q9k74jq9L24q4o72J66N33Q9l68J13L11l8m12
$$ 124 301 -57 -173 561 333 8 312 401 127 126 37 361 277 -395 -229 304 393 25 138 449 411 -1
3199ap3O06n57J47l9J02J32n48J98N51Ro41J8L36k83M5M6M9M7k69L33l3m77j2
$$ -1 -74 532 -25 122 83 185 317 -231 -33 518 527 -114 -96 240 -43 2 48 97 144 -125 208 175 -302 -314
3223c14O15L73l78q53J96O64l17k88j98N85j4p36M05K66R7n06K98N58l59n24r9
$$ -314 301 674 296 -557 -361 303 -14 -302 -500 85 71 -665 -260 6 103 -403 -105 453 94 -430 -529
3244e29J266m83o12j6O28m35m46N01K85j12m65P40K52o97j019J011J024n03j398
$$ -529 737 254 -358 -374 254 -181 -627 -126 159 47 -418 322 574 -123 -1142 -131 893 390 -1008
3263a008J64J200k78m77j52J018k60n25M59R2m28j32O41O82j025j245J062R91
$$ -1008 -844 356 78 -399 -551 467 207 -318 141 233 -195 -327 314 996 -29 -1274 -212 779
3281G79n02j201P93J377q65j245O68R72p17q58Q13J103j137j272R94J498l20j870
$$ 779 277 -924 -131 1246 381 -864 -196 776 59 -799 14 1117 -20 -1292 -298 1200 880 -990
3299i90Q49Q77j24j571N30J310n05q36L92O67r10q47J356J394j030j989J120J854
$$ -990 -141 736 612 -959 -429 881 376 -460 -68 599 -311 -1158 198 1592 562 -1427 -307 1547
3317A547j267j623J426K100j247k266Q43J873p73j721J363J803j769j916R27K030
$$ 1547 280 -1343 83 2183 936 -1330 -487 1386 613 -1108 255 2058 289 -1627 -700 1330
3333A330p92j807J140K013j490k260Q26K518q23j626J198J670j881k559J968K888
$$ 1330 538 -1269 -129 1884 394 -1866 -1040 1478 655 -971 227 1897 16 -2543 -575 2313
3349B313j869k201J397K569k146k644J545L388r76k719O94K031j449k320J891
$$ 2313 444 -1757 -360 2209 63 -2581 -1036 2352 1376 -1343 -649 1382 -67 -2387 -496
3364d96L118j434l199J211K254j571k685K464L234j727l385J015K636j362k243
$$ -496 2622 1188 -2011 -800 1454 -117 -2802 -338 2896 1169 -2216 -1201 1435 73 -2170
3379b170K115K949j892l962J403L214j279k469K029L357k519l892J183L880r34
$$ -2170 -55 2894 1002 -2960 -1557 1657 378 -2091 -62 3295 776 -3116 -1933 1947 1013
3394A013k920J883K850k514l875J431M453j117l512K154K894k474m354K606M353
$$ 1013 -1907 -24 2826 312 -3563 -2132 2321 1204 -2308 -154 2740 266 -4088 -1482 2871
3409B871r64l573J038K713k520l538K936M827j486m590J088L688k232l916K832
$$ 2871 1907 -1666 -628 2085 -435 -3973 -1037 3790 2304 -2286 -1198 2490 258 -3658 -826
3424h26N098j919m983J088L477j708l632K985N104k829n017Q15M382j625l117
$$ -826 4272 2353 -2630 -1542 1935 227 -3405 -420 4684 1855 -3162 -2347 2035 410 -2707
3439b707K782M223k498n519J322M530o94l533K676L969l484n552J954N555j036
$$ -2707 75 4298 1800 -3719 -2397 2133 1439 -2094 582 4551 1067 -4485 -2531 3024 1988
3454A988m418K482M219l348n500J857O033r18m228J417L477k715n151K978N678
$$ 1988 -2430 52 4271 923 -4577 -2720 3313 2395 -1833 -416 3061 346 -4805 -1827 3851
3469C851r85n217J358L791k578n107L413N981j371n859J301L620k124m387L181
$$ 3851 2866 -2351 -993 2798 220 -4887 -1474 4507 3136 -2723 -1422 2198 74 -4313 -1132
3484a132O020k109o281J002M553j622m540L376O274k731o702N49N314p17m307
$$ -1132 4888 2779 -3502 -2500 2053 431 -4109 -733 5541 2810 -3892 -3343 1971 1254 -3053
3499c053K925N385l396o892J565N819n57m613K766M432l082o777J886O420l24
$$ -3053 -128 5257 1861 -5031 -3466 2353 1796 -2817 -51 4381 1299 -5478 -3592 2828 2504
3514B504m546J974M445l987o059K756O605l62n535J012M325l037n662K817P435
$$ 2504 -2042 -68 4377 390 -5669 -2913 3692 3330 -2205 -1193 3132 95 -5567 -2750 4685
3529D685r10o096N72M165k477m831L220O893j529o739N06M797j884m688L332O493
$$ 4685 3775 -2321 -1749 2416 -61 -4892 -1672 5221 3692 -3047 -2541 2256 372 -4316 -984 5509
3545E509j978p109k6N586j314m035K943N895k522p078M82N963r33m122K795N050
$$ 5509 3531 -3578 -3604 1982 668 -3367 -424 5471 2949 -4129 -3647 2316 1383 -2739 56 5106
3561E106k870o964Q23O509j06m473J613M768k840o882J840O479J44m786Q27M575
$$ 5106 2236 -4728 -3905 2604 2498 -1975 -362 4406 1566 -5316 -3476 3003 3147 -1639 -812 3763
3577C763k820o242K259P372o73n367M72L926k063n150J964P140p69o135O2M728
$$ 3763 943 -5299 -3040 4332 3659 -1708 -1236 2690 627 -4523 -2559 4581 3812 -2323 -2261 2467
3593B467k158m443K730O142j160o349j11M604q52m133K200N922j618o530k1M936
$$ 2467 309 -4134 -1404 4738 3578 -2771 -2882 1722 870 -3263 -1063 4859 3241 -3289 -3310 1626
3609A626k84m082K163N014k061o392L50N457J51m079J550M623k050o466Q27N770
$$ 1626 1342 -2740 -577 4437 2376 -4016 -3666 1791 1942 -2137 -587 4036 1986 -4480 -3653 2117
3625B117L59l909N17M260k261n272J201N203Q06m482L4L829j363m971J354N639
$$ 2117 2476 -1433 -916 3344 1083 -4189 -2988 2215 3021 -1461 -1427 2402 1039 -3932 -2578 3061
3641C061J27m921J48L243r58m531J637N656k45m894m86L639n68l802J447N404
$$ 3061 3188 -1733 -1585 1658 700 -3831 -2194 3462 3217 -1677 -2163 1476 908 -2894 -1447 3957
3657C957j197n368L68L632m98l163J320M575j223n101j48L886J42l112J169M101
$$ 3957 2760 -2608 -2240 1392 894 -2269 -949 3626 2403 -2698 -2846 1040 1182 -1930 -761 3340
3673C340j428m685J85M161M36l142P02L163j516m093M67M083N18k848m20L043
$$ 3340 1912 -2773 -2588 1573 2009 -1133 -431 2732 1216 -2877 -2410 1673 2191 -657 -1077 1966
3689A966j042l786R83M036j1l170O1K784p48l474P08M144j55l545j81K596l71
$$ 1966 924 -2862 -1879 2157 2146 -1024 -963 1821 1073 -2401 -1693 2451 2296 -1249 -1430 1166 795
3706G95k901J214L311k12l409k12K477j76k740Q58L258Ml733m93K763J4k291O27
$$ 795 -2106 -892 2419 2207 -1202 -1414 1063 887 -1853 -995 2263 2267 -1466 -1959 804 818 -1473 -846
3724h46L052o41l268n9K538N65k374M02K516r45k887N2K969K93k256L11K122q56
$$ -846 2206 1565 -1703 -1762 776 1341 -1033 -631 1885 940 -1947 -1895 1074 1367 -889 -578 1544 688
3742F88k540M02K485J27j889n8J779m11k284L85K422L59k119p0J352J2k010M22
$$ 688 -1852 -1450 1035 1162 -727 -785 994 583 -1701 -1316 1106 1465 -654 -724 628 640 -1370 -948
3760i48K058J15k294Q2J478l2j785K74K158K6j827n69J897K2j835O34J448R4j651
$$ -948 1110 1225 -1069 -987 491 459 -1326 -1052 1106 1132 -695 -1264 633 655 -1180 -546 902 996 -655
3779f55n03J460K54j231K26J205j38j511j94J627r9q48j36J342j79j420k05J687
$$ -655 -1158 302 556 -675 -449 756 618 -893 -1087 540 441 -407 -543 799 620 -800 -1005 682
3797F82k48q42J59J031k24j337o8J394K15j310m50J763k99j014K4J038K17j094
$$ 682 434 -408 -249 782 558 -779 -847 547 762 -548 -998 765 466 -548 -524 514 731 -363
3815c63j34Q63Lp25J93P06j37m60m44Q24J26n16l23Q54p8m58L8L09K24n17n92
$$ -363 -497 366 369 -356 -163 543 406 -54 -498 326 452 -64 -387 467 389 -69 -31 278 502 -15 -607
3836f07J068L5p10n7N72K82p35K32J67P6l99k08O39L14o79J94K4J36n58J72K85
$$ -607 461 496 -214 -271 301 583 -152 80 247 323 -76 -284 355 669 -10 184 208 344 -214 -42 243
3857B43J75o07l68N93K81k70l59L37J67n12l2K63K14r7j42J19J67m05j25K18J80
$$ 243 418 -189 -557 36 317 47 -312 25 192 -320 -352 -89 125 28 -114 5 172 -233 -358 -140 40
3878D0j37j96K65K86l30l52M15k27J51k12R2L12m24J92K77Q4m10K1L68P6m19k14
$$ 40 -97 -293 -28 258 -72 -424 -9 -236 -85 -297 -205 107 -317 -125 152 236 -174 -153 215 291 -128 -342
3900c42K91L77j05m15L7L04k30k25O04k46k39K82J77m4l77j00M39J4j41n24K25
$$ -342 -51 326 221 -194 -157 147 -83 -308 296 50 -189 93 270 226 -151 -251 188 202 61 -463 -238
3921b38K67k48k2K56j69K4m7J04P36q48P5M00J12m16j47L49O9k33k13L79J09k18
$$ -238 29 -219 -241 15 -154 -130 -177 -73 663 -185 -110 290 402 -14 -161 188 257 24 -189 190 299 81
3943H1K20l3Ll03j02M72j68k99j54K97L50k71n38P21L48n60l31P05J01o63r8N29
$$ 81 301 268 271 -32 -134 338 170 -129 -283 14 364 93 -445 276 624 64 -267 438 539 -124 -222 307
3965C07K33p20J15M41J08m78m92M64N09q34J65N67Jn44j82N50M48j047MN31L84
$$ 307 540 -180 -65 376 484 6 -486 -22 487 -347 -182 385 386 -158 -340 210 658 -389 -385 146 530
3986E30j036l05J078O23j076l01O41M90r58m02R02J85m38n02P55L67j009J05R27
$$ 530 -506 -811 267 890 -186 -487 154 644 -314 -716 186 371 -67 -569 186 553 -456 -351 576
4005E76K28j230n97R48N92q28n27J250J10q87r04J416M10j112q7J051K19j328
$$ 576 804 -426 -1023 -75 517 -311 -838 412 522 -365 -1269 147 557 -555 -642 409 628 -700
4023g00j50Q48P88r98q45J277K57j433j09J452O54j585n6J155J12j317m71J632
$$ -700 -850 -2 786 -212 -1057 220 477 -956 -1065 387 1041 -544 -600 555 667 -650 -1121 511
4041E11P23j463n98J250J24j304k49J709P40j760o33J221K82j228l05J893N38
$$ 511 1234 -229 -827 423 547 -757 -1006 703 1443 -317 -950 271 553 -675 -980 913 1451
4058A451j711j150J753M40j417K04J233N36j996p28J707M17j591k2J903N24k358
$$ 1451 -260 -1410 343 783 -634 -430 803 1339 -657 -1385 322 739 -852 -874 1029 1553 -805
4075h05q61K003R71j637m15J777K8k146m58J925R29j679n58J564L14j956o72K311
$$ -805 -1666 337 1308 -329 -744 1033 1061 -1085 -1543 382 1311 -368 -926 638 952 -1004 -1676 635
4093F35J425j783j559J749P53k405j92K377J165k183j383J758N21j887l10K346
$$ 635 2060 277 -1282 467 1220 -1185 -1377 1000 2165 -18 -1401 357 878 -1009 -1319 1027
4109A027J272k433j694K041R50k060j79K086J147k967j221J923J015j595n63K702
$$ 1027 2299 -134 -1828 213 1163 -897 -1076 1010 2157 -810 -2031 -108 907 -688 -1251 1451
4125A451Q03l019j663K069J849j548j080K223Q66l331q34K346J377j457j267K344
$$ 1451 2254 -765 -2428 -359 1490 -58 -1138 1085 1951 -1380 -2214 132 1509 52 -1215 1129
4141A129N03l039j037K858J984k137j622J979M03k770p54L287J708k267j971J986
$$ 1129 1632 -1407 -2444 414 2398 261 -1361 618 1021 -1749 -2503 784 2492 225 -1746 240
4157B40P34k462p35L347J590k656j664J484J179k370n51L303J380l070j914K014
$$ 240 974 -1488 -2223 1124 2714 58 -1606 -122 1057 -1313 -1864 1439 2819 -251 -2165 -151
4173a51J502k116j066L137J681l606j917K216J605j712n20K523Q84l426j710K333
$$ -151 1351 -765 -1831 1306 2987 -619 -2536 -320 1285 -427 -947 1576 2460 -966 -2676 -343
4189c43K208j743j527K462R35l377j881L201K091j973j126K098O40l081j317L510
$$ -343 1865 122 -1405 1057 1992 -1385 -3266 -65 2026 53 -1073 1025 1665 -1416 -2733 777
4205G77J883k314j733K068O52k574j229L667J941l056j819J893J238k782q04L439
$$ 777 2660 346 -1387 681 1333 -1241 -2470 1197 3138 82 -1737 156 1394 -1388 -2192 1247
4221A247K008l115k373K059J607k277p05L137J290l152k329K112J889k048p54
$$ 1247 3255 140 -2233 -174 1433 -844 -1549 1588 2878 -274 -2603 -491 1398 -650 -1404
4236a404K896J189l372j972K251K308k075j129K674Q35k891j965K353K400j921
$$ -1404 1492 2681 -691 -2663 -412 1896 -179 -1308 1366 2201 -690 -2655 -302 2098 177
4251A77j505K468R38l223j709K903K395j842j543J437R33k981j197L160K192k011
$$ 177 -1328 1140 2078 -1145 -2854 49 2444 602 -941 496 1429 -1552 -2749 411 2603 592
4267E92k021J654J195k657j289L053K356k633k000J486J234k025r56L069J857
$$ 592 -1429 225 1420 -1237 -2526 527 2883 250 -1750 -264 970 -1055 -2011 1058 2915
4282B915k978k051J876J443j982q44K593J573k456k541J781J844j366j022K439
$$ 2915 -63 -2114 -238 1205 -777 -1621 972 2545 89 -2452 -671 1173 -193 -1215 1224
4297A224J393l131k213K236K235j732r94K023J077k843k004K504K073j518j390
$$ 1224 2617 -514 -2727 -491 1744 12 -982 1041 2118 -725 -2729 -225 1848 330 -1060
4312a060J552J242k741j337K521J955j309k165J853O38k209j142K571J927j815
$$ -1060 492 1734 -1007 -2344 177 2132 823 -1342 511 1149 -1060 -2202 369 2296 481
4327D81j909J452R65j762j109K504J845k224k037J887P34j308q19K141J403k092
$$ 481 -1428 24 989 -773 -1882 622 2467 243 -1794 93 827 -481 -1300 841 2244 152
4343A52k134J702J426j308j150K288J001k180j699J113J978r38j234J888R83k228
$$ 152 -1982 -280 1146 -162 -1312 976 1977 -203 -1902 -789 1189 251 -983 905 1888 -340
4359c40j904J732J850j076j004J315N28j705j512J914J677j232q82Q54R46j738
$$ -340 -2244 -512 1338 262 -742 573 1101 -604 -2116 -202 1475 243 -639 215 1161 -577
4375e77j386J992J743j342j753J325R36j686q11J801J890j755j505Q22J293j376
$$ -577 -1963 29 1772 430 -1323 2 938 -748 -1559 242 2132 377 -1128 -306 987 -389
4391c89j192J875J224j165j761R59J067q88p45J557J046j775j546J209J253r99
$$ -389 -1581 294 1518 353 -1408 -449 618 -270 -1015 542 1588 -187 -1733 -524 729 -270
4407b70r73J399J179j869r89J078J398j064m73Q48P75j139j280R69J347j005p32
$$ -270 -1243 156 1335 -534 -1523 -445 953 -111 -584 264 1039 -100 -1380 -411 936 -69 -801
4424h01R63P95j351n52N35J491o86r66P27M17q77o69J121J003j275o38O14P17
$$ -801 162 957 -394 -946 -411 1080 394 -572 155 572 -305 -974 147 1150 -125 -763 -149 568
4442E68o81p51J015J160j179q88O17M40m38n70R09L31j89j068L90J021o08l34
$$ 568 -113 -864 151 1311 132 -756 -139 301 -137 -707 202 533 344 -724 -334 687 79 -255
4460b55O08L09m50o98L34N51k11p85P94M45o03q04L67R29l61k74M24L44n72o44
$$ -255 353 662 212 -486 -152 399 188 -597 197 642 39 -765 -398 531 170 -104 320 664 92 -552
4480e52M07Q01j93o19L0O90m11p21O19M77j32o93K87K87j95o95N66L60k26n35
$$ -552 -145 656 463 -156 -126 564 153 -568 51 528 396 -297 -10 277 82 -613 -47 313 87 -448
4500d48R3O54j29l84J1N94Q3r46L99N63o89j76N39Q5l47k14l9O85k76m77N41n
$$ -448 -355 299 170 -214 -203 391 474 -472 -73 490 -199 -375 164 249 -98 -312 -351 334 58 -419 122 117
4522A17m5m63J62Q72m95j93J72%M4q15M53M02k23m9j06K84j96k3k96M28J6k63
$$ 117 72 -391 -229 643 148 -45 127 127 171 -644 -191 211 -12 -61 -167 117 -79 -102 -398 30 46 -217
4544b17Q6K37j42p4J16O4R2n10J43J99J41l05l42N34J26k72J95k62L02j30J69
$$ -217 -131 106 -36 -110 6 70 162 -348 -205 -6 135 -170 -512 22 148 -124 71 -191 111 -19 150
4565A50O6J36n63J4L86r4j23k06N14m4l67O6J15Q1l22L90k96J03j72j5L15j70
$$ 150 216 352 -211 -197 189 95 -28 -234 280 236 -131 -65 50 131 -191 199 -97 6 -166 -181 134 -36
4587c6J3J02j02PJ22j12K18j67k37L57R2k68p2J9K54j70l81L29K45j49j57m6J37
$$ -36 -23 79 -23 -16 106 -6 212 45 -192 165 257 -11 -83 -64 190 20 -361 -32 213 64 -93 -139 -2
4610bJ80l39J1K38J54k28K66l7m17J97j34N57n96O3J43j53J8o0m5J99k42J26j34
$$ -2 178 -161 -150 88 242 14 280 243 -174 23 -111 446 -150 -87 56 -97 -79 -139 -184 15 -227 -101 -235
4633b35K34J10k64K7k02M53m52K39M67k19k87K18m37M55l70L71nj36j30L43q4
$$ -235 -1 109 -155 -128 -330 123 -329 -90 377 158 -129 89 -348 107 -263 108 103 -33 -163 180 96
4654I6k28k26M87q6J8k88q8M21j68k25K19K85J12k81N5r9j05r0M61J19j91j38
$$ 96 -132 -358 129 43 61 -227 -315 106 -62 -287 -68 217 329 48 103 4 -101 -191 270 389 198 60
4676F0k89L78n1k63j14L30J21l51n7M47j90l43K62K65j80k05L23Q3p5n22L9Q86
$$ 60 -229 149 98 -165 -279 51 172 -179 -236 211 21 -322 -60 205 25 -180 143 226 151 -371 -332 554
4698E54o09nk53M38K66o20M0M25j76l39J99L05P0p42O07O6K5m54J04P19n66p5
$$ 554 -55 -60 -313 125 391 -229 -189 236 60 -279 -80 225 295 -447 160 226 251 -203 -99 620 54 -21
4720b1l31Q68l63o39J97P54j27m06k51M62m1p32M95Q06n88m46m0O57j91k98K11
$$ -21 -352 516 153 -486 -289 465 338 -68 -319 143 102 -630 -135 671 83 -363 -403 254 63 -235 -24
4741b4R29n11j009N33J99J70n69O28J41l20m93j71J042j93r23O00N41n39o79K98
$$ -24 905 394 -615 -82 117 287 -282 346 487 167 -326 -497 545 352 -571 29 570 31 -648 -350
4761c50J091m97o67K91N34l38r21R29P22n55n08r4Q37n01p88O76Q66n04q34L30
$$ -350 741 244 -423 -132 402 64 -857 72 794 239 -269 -363 474 -27 -815 -139 727 223 -611 -281
4781b81P58k95j204Q04J152p24p64N54M34o9r04M12R49o24j190N94Q68j71q88
$$ -281 477 182 -1022 -218 934 210 -554 0 434 365 -539 -127 822 198 -992 -398 470 299 -589
4800e89N16P52l50j324N39R98l42o01K38Q49p33j051Q96J017l02q48K79R35p80
$$ -589 -73 679 329 -995 -456 542 200 -401 -163 686 -47 -1098 -202 815 513 -335 -56 879 99
4819I9j050N52J265o15o83K82J059o94j214L35J427j45j199J70J240n71j244O85
$$ 99 -951 -399 866 251 -432 -150 909 215 -999 -664 763 618 -581 -411 829 258 -986 -301
4837c01J175m22j041L90P23o68n56O34J214l39j539J58J179m84r01O67J426r10
$$ -301 874 452 -589 -199 524 -144 -700 -66 1148 809 -730 -572 607 123 -778 -111 1315 405
4855D05j288J87J267j2r92M80R91l49j895J89J429k40o35K72R95m84j749N77J525
$$ 405 -883 -696 571 559 -433 47 1038 689 -1206 -1017 412 172 -463 -191 804 320 -1429 -852 673
4874F73R7r83J02J237p76j139J64J635k70j295M53P66m67j536Q44J390rj328J71
$$ 673 770 -213 -111 1126 350 -789 -625 1010 740 -555 -102 664 197 -1339 -495 895 886 -442 -271
4893b71Q71o00j105O52J550K7k140L79R94k29j101M50J655k32j614j77J259k04
$$ -271 600 0 -1105 -453 1097 1124 -1016 -637 357 128 -973 -523 1132 900 -714 -891 368 164
4911A64j090O96J532o55j509L9J390q8j169O09J275p34j340QJ499Q3q84nJ320
$$ 164 -926 -230 1302 647 -862 -823 567 479 -690 -81 1194 460 -880 -872 627 710 -174 -179 1141
4930A141j121r32J29J583j27j199J93Q15l75j036J07J974j17j466l07J155j40
$$ 1141 20 -912 -783 800 673 -526 -333 482 107 -929 -822 1152 1035 -431 -738 417 277
4947B77j217K67J804k07j509l8R08k95j099P55J516m20j294j14J184k58q12L45
$$ 277 -940 -673 1131 924 -585 -623 285 -10 -1109 -354 1162 742 -552 -666 518 260 -552 -207
4965b07J407o98j327j49J391J06r64N59O72l41j410R9J404j88q90N01O01qj589
$$ -207 1200 502 -825 -974 417 523 -441 118 790 449 -961 -862 542 354 -536 -35 566 558 -1031
4984a031K78J458J90r01j21Q44n70j062L23J241L50j130k84P92n17r42P34J260
$$ -1031 -753 705 895 -6 -127 717 147 -915 -592 649 999 -131 -415 377 -140 -1082 -348 912
5002I12l38j406J60R83K3j184L20J576k15j635J78J050Q4j266N47J138J7j609
$$ 912 574 -832 -672 311 334 -850 -530 1046 831 -804 -626 424 508 -758 -211 927 944 -665
5020f65M7O61M20j081K71Q33M3r86l77J215J7p25N4J148o41r51N4J125M4o65K0
$$ -665 -618 43 463 -618 -347 486 529 -457 -834 381 398 -327 -273 875 234 -717 -663 462 506 -159 -139
5041a39J073o09j082J91M96P29j050J99M28J30q72l91J391J72r32j22O34j28o76
$$ -139 934 325 -757 -566 -70 659 -391 -192 236 366 -506 -897 494 666 -266 -388 246 118 -558
5060e58LJ144j52q02k24O73J7o54M12P51J22j229j00P23R6p39J26J002l09q99
$$ -558 -555 589 437 -365 -589 84 101 -553 -141 610 732 -497 -597 126 222 -517 -391 611 302 -597
5080e97K50Q02l41k06k06R47k45j035L35N10Ok56j43P52j66j029L03N29K56n37
$$ -597 -347 455 114 -92 -298 649 404 -631 -296 214 220 -36 -179 573 407 -622 -319 210 466 -71
5100g1k11J045l95q42M0R69j90o15P7K19K57n60l30R74K04o32l30O49k5m09l5
$$ -71 -282 763 368 -474 -434 535 345 -270 -193 26 283 -277 -607 367 571 -61 -391 258 233 -176 -211
5121b11N57K78p24m40P45J9o29q7P52K06r49j54R13L0m88P6M86j16o78J51L99
$$ -211 346 624 -100 -540 205 224 -405 -492 260 466 -483 -637 276 306 -182 -106 380 264 -414 -263 136
5142A36K03p68L67L36l9l10o72P78K77p09L03M46l63m8k94O00K4m46J32O4p5o4
$$ 136 339 -429 -62 274 235 -75 -747 31 308 -401 -98 348 -15 -63 -357 243 267 -179 -47 17 -58 -122
5164a22j44N04J7l14k20N70m1l57j43P12o96K86l97M68J77n58m2J79M84n95NK43
$$ -122 -266 238 255 -59 -279 291 250 -107 -250 462 -234 52 -345 123 300 -258 -300 -121 363 -232 -227 16
5186A6L69p63o0N17J63m83L07K10j77l44o3K84p5n6n9J61j3M7j42j46K57k59K97
$$ 16 385 -378 -438 79 242 -241 66 276 99 -245 -308 -24 -99 -155 -214 -53 -66 -19 -161 -307 -50 -309 -12
5209a2j30L80r0l06K27L33n59j38J24O48m78k92M24J05k49l14N14j90k64K34J28
$$ -12 -142 238 148 -158 69 402 -157 -295 -171 477 -1 -293 131 236 -13 -327 187 -3 -267 -33 95
5230I5j54J26J8n2OQ6k02p4N8kJ87j61J15j6j39l3P5J64k92J43J57k57l7J73J08
$$ 95 -59 67 85 33 39 125 -77 -151 -93 -95 92 -69 46 30 -109 -142 -67 97 -195 -52 105 -152 -189 -16 92
5255I2j64l05N27n59M59o0L40n4j2l03O0l07J18L86L6k05J72m88J55K11j1J05
$$ 92 -72 -377 150 -409 50 -10 330 276 264 -39 21 -286 -168 218 254 49 221 -267 -112 99 88 193
5277A93l78K54Q8m48J94L31l31J34j02L68O2o28M26j62r1Nk83M30j01J07k09o1
$$ 193 -185 69 157 -291 -97 234 -97 37 -65 303 365 -263 163 1 -90 -85 -368 62 -39 68 -141 -202
5299b02j07L54r1J96k28j12J07QK10k04O3K66J2l11K16j78O6j81j70K77k44r7
$$ -202 -309 45 -46 150 -78 -190 -83 -75 135 -69 -6 260 272 -39 177 -1 65 -116 -286 -9 -253 -350
5321c50L84k6j90J07q8L26l23n9j0J81J85l51JN91n90L4K25k86J49j39OM74p4
$$ -350 34 8 -182 -75 -163 163 -160 -219 -229 -48 137 -214 -213 378 -212 -178 47 -239 -90 -229 -223 251 177
5344A77n64N54j2m54K77J10J24l64K20J48p6j57n6K41l03K34k72L07j45L4j61
$$ 177 -387 167 155 -299 -22 88 212 -152 68 216 140 -17 -73 168 -135 99 -173 134 -11 23 -138
5365a38J62R3k94K7L38k29j38K52l1k1L8l38K96J00l39K81M0n0m87K70PL01k44
$$ -138 24 117 -177 -150 188 -41 -179 73 42 21 59 -279 17 117 -222 59 99 49 -438 -168 -161 140 -104
5388a04k21N37R0l82q7J34J06R9l46P1L80n32K61J06N2j40k9NJ55l91K4M37j08
$$ -104 -325 212 302 -80 -167 -33 73 172 -174 -103 277 -255 6 112 164 24 -5 0 155 -236 -212 225 117
5411A17q7k33J63J41mn1j26J40l53m0L67o2j10L13k97J79j9j88J73J71j95j66
$$ 117 30 -203 -40 101 97 46 -80 60 -293 -333 34 -28 -138 175 -122 57 38 -150 23 194 -1 -167
5433a67J88N51n52j69L51O6l74k65L50JL6k48Q9P08q19r6K03L16l80j80L86J74
$$ -167 21 572 20 -149 202 268 -106 -371 -21 -20 16 -232 -143 565 -254 -350 -147 169 -211 -391 -5 169
5455A69k17o7K25Q7l06k04M55L9j2mj08P7k71j67L87L4q2l59L23J2m07J76J23
$$ 169 -48 -115 110 197 -109 -313 142 181 169 165 57 134 -137 -304 83 117 35 -324 -1 11 -396 -220 -97
5478i7J58k18j21K00K03k29k1L24K63q14L30oL33m8n09L41k19j38j5L54K26k38
$$ -97 61 -157 -278 -78 125 -104 -125 199 462 -352 -22 -28 305 257 -252 89 -130 -268 -283 71 297 59
5500E9j11L3J24j20m68M53N35o19j70L0O55k80n45J57N28r4l12J03Q3k68j24L51
$$ 59 -52 -19 105 -15 -483 -30 505 -114 -284 -254 401 121 -424 -267 261 167 -145 -42 41 -227 -351 0
5522@K15m9l28L3J89k59k44N97K41p96O7L92M09l97j61K94j1m58m8J66L81k50
$$ 0 215 166 -162 -129 60 -199 -443 154 395 -401 -334 58 467 70 -91 203 192 -266 -314 -148 233 -17
5544a7l48N30k0j75k84L07L75k87l14L23L93m38k69l3L92J4j78J34J55l40l95
$$ -17 -365 165 145 -30 -314 -7 368 81 -233 90 483 45 -224 -257 135 149 -29 105 260 -80 -475
5565d75L03N79m94l50M56R3j02l49M55K13J08p13J42K85j18n96Q21K21m25m65
$$ -475 -172 407 -87 -437 19 112 10 -339 116 329 437 -276 -134 151 33 -563 258 479 54 -411
5585d11M67L59q1n02J40M43k86l80N0O12n44k12L10L78l04l59M56K80l62m38O21
$$ -411 56 415 334 -168 -28 415 129 -251 -201 411 -133 -345 -35 343 39 -320 136 416 54 -384 237
5606B37m7k91j53J2M20J20m21P4K46j83n09P11K43j19l84J60J00o11J60J62M31
$$ 237 190 -101 -254 -242 178 298 -123 -49 197 14 -495 216 459 340 -44 116 216 -395 -235 -73 358
5627C58j70o31K69M53k86k42J70M81m38j42n2L55k92k41M51P48q73l75M22J20
$$ 358 188 -443 -174 279 -7 -249 -79 402 -36 -178 -230 125 -167 -408 43 791 -82 -457 -35 85
5647H5L15n46M03J92n69j32K18L96l59k07N11l02R5p00M55N29l79r8qL45K4o24
$$ 85 400 -146 257 449 -120 -252 -34 362 3 -204 307 5 100 -600 -145 384 5 -93 -101 244 268 -356
5669c56L58J25J1k89J05K32k12m39M67M68l38k37K58j42P8l77J81K70l55k81M63
$$ -356 2 127 138 -151 -46 186 -26 -465 2 470 132 -105 153 11 89 -288 -107 163 -192 -473 -10
5690a0Q7j70j69N64k4k01n30M58K02k79k12L77L37n4j003O22L63m39j62R1K54
$$ -10 77 -93 -262 302 278 77 -453 5 207 -72 -284 93 430 376 -627 -5 358 -81 -243 -152 102
5711A02j54l5L0K01k1k04J10J73m11n1K25L98j03l08M0M26k15o58M43L82l17l2
$$ 102 -52 -87 -57 144 123 -81 29 202 -209 -260 -35 363 260 -48 -8 418 203 -455 -12 370 53 21
5733B1LK65j03l52K97k6l23J46l2l6K24n38P99J72m12j61R5K62j74l18J45P11
$$ 21 24 289 186 -166 131 105 -218 -72 -104 -140 84 -454 345 517 105 -56 39 301 127 -191 -46 665
5755F65o02M8j63K63j48k4q4N37p80j1M12j77K83k68l2L38m09p1K4J92R0Nj87
$$ 665 63 111 -52 211 63 39 -45 492 -288 -299 113 -64 219 -49 -81 257 -152 -223 -199 -7 83 88 -99
5778i9N24l89k41L8M60l4o65O68p0o0l34K06oM38o52K74K48n13J14J18J36L2l67
$$ -99 425 36 -205 -167 293 259 -406 262 192 132 -202 4 -2 436 -216 58 306 -207 -93 25 161 193 -174
5801a74o4K23ol68L65J78l17j22K80lQ5j5j3N3J52j21j67J68k20p9M31m18K11
$$ -174 -238 -15 -21 -389 -24 154 -163 -285 -5 -8 77 62 49 102 254 133 -34 134 -86 -165 266 -152 59
5824E9j67K40j68qJ6K5K74l95K02l51M41k80J25k90L58K00k59o4L44l24O0j50
$$ 59 -108 132 -36 -44 -28 -3 271 -124 78 -273 168 -112 13 -277 81 281 22 -42 302 -22 38 -112
5846a12L69k5n96J13M08q4k01J79J16k48j68N13l50M53l92M5p0L14j73J81j72
$$ -112 257 232 -364 -251 157 73 -128 51 167 -81 -249 264 -86 367 -25 20 -50 264 91 272 100
5867A00Q7k01q0L24l20J2K99n9l36L1L92k23K4o4Q6ql54K30j65K2M9l3L30r8o2
$$ 100 187 -14 -94 230 -90 -78 221 162 -174 -143 249 26 50 -14 72 64 -290 -60 -225 -203 -154 -187 143 45 -17
5892a7L13l68M55m63j49K3K63J06m27L3J38J41l23J2N12j25J6m9Q4m90Q06n24
$$ -17 296 -72 383 -80 -229 -206 57 163 -264 -231 -93 48 -275 -263 249 124 140 91 175 -315 491 -33
5914c3J32l22L1J91j67J04k00M25J8K5m88K31M58m04m5n8%%j08M16k87Q7k57L29
$$ -33 99 -223 -192 -1 -168 -64 -264 161 179 204 -284 -53 405 1 -44 -102 -102 -102 -210 206 -81 6 -251 78
5938G8j47L14l59j41K96NJ02l58J71K01j2l82K27N6j12J13j82J78OM6j45J62j5
$$ 78 -69 245 -114 -255 41 46 148 -210 -39 162 150 -232 -5 51 -61 52 -130 48 54 100 -45 117 102
5961A02j11j41R4j89K60k73M01r8j28J58M5j5j04q6L8J80j79J67M2j12l09M34
$$ 102 -9 -150 -56 -245 15 -258 143 45 -83 75 120 105 1 -85 -47 133 -46 121 163 51 -258 176
5983A76l13J43p8M0j5K54l35L00m60J41P3O5M1K1p3J17j82j41M56n14K3N2j86
$$ 176 -137 6 -72 -32 -47 207 -128 172 -288 -147 -74 -9 32 53 -20 97 -85 -226 230 -284 -261 -209 -395
6006c95K69L97l06o2J5p2K04o5k69J88K86k78N9k02K83m7J08j53k2j17L80j55
$$ -395 -126 271 -35 -97 -82 -154 50 -15 -284 -96 190 -88 -29 -231 52 5 113 -40 -62 -179 201 46
6028D6k36J50p9m1K04Q7m6K44n83J13J64j85L3K59q5m8J92k91Pl1J79L8j37lq0
$$ 46 -190 -40 -119 -160 44 131 85 329 -254 -141 23 -162 -129 130 45 -3 189 -102 -95 -126 53 91 -46 -49 -129
6053a29pL84k09j75J35n9K31j79Q0j24M3j53J36j36M06l61K51l05K51L2k62J21
$$ -129 -136 248 39 -136 -1 -60 171 -8 72 -52 -9 -162 -26 -162 244 -117 134 -171 80 112 -150 -29
6075b9P6J85J4k09J8j23k56K56N4K23m62L22l1j86K63k31R3N3j99O3P8J45k01
$$ -29 47 232 246 37 55 -68 -324 -68 -14 209 -253 69 38 -148 115 -116 -23 30 -169 -106 -28 117 -84
6098h4N6j2K6k40N32o9r3J32m3O7n38J08K02mk09L88k40k09O8J48o2j32K72j03
$$ -84 -28 -40 -14 -254 278 209 116 248 205 272 -266 -158 44 40 -169 219 -21 -230 -162 -14 -76 -208 64 -39
6122c9k8N3j97K25L02j31m34J77L63j21k59o2K73j1j10j43K97j19j59N7N0l3O0
$$ -39 -67 -14 -211 14 316 185 -249 -72 291 170 -89 -151 122 111 1 -142 155 36 -123 -66 -16 -49 11
6145A1J38j74Q6j36J05J73j55M2j70M44j50j08k63J70l4J69J40R0m76K58r0j12
$$ 11 149 -25 61 -75 30 203 48 90 -80 364 214 106 -157 13 -21 148 288 378 -98 160 70 -42
6167d2J37j51K95k24o9l7K51l21K76j4O7n0K13m84OM5N6k72L91Q8k92m9L79J8
$$ -42 95 -56 239 15 -54 -91 160 -161 115 101 168 118 331 -153 -147 -102 -46 -318 73 161 -131 -180 199 217
6191B17k0J07l23J48L02n66P6J03M2j77n6O5L02k43QJ3J03Q4j98k02J96j51j18
$$ 217 197 304 -19 129 431 -135 -59 44 86 -91 -147 -82 220 -23 -15 -2 101 185 -13 -215 -19 -170 -288
6214b88K63M00m43P0J45L1J10m78N29m61k3J33j60M04j68J77j98q2J52o5J7nK6
$$ -288 -25 375 -68 2 147 178 288 -190 339 -122 -145 -12 -172 232 64 241 43 -39 113 48 65 60 86
6237H6L15n80o8K55k41N28k97k98M21k04L94n03Q4K13n9O6J81J06k91k39L25j74
$$ 86 401 -179 -247 8 -233 295 -2 -300 121 -83 311 -192 -108 105 46 112 293 399 108 -131 194 20
6259B0J11L69m05j10K06l81lM03k53k92K06J04j2N9J59l34M56l3o02N17p2m12
$$ 20 131 500 95 -15 191 -190 -193 210 -43 -335 -129 -25 -37 22 181 -153 303 270 -332 185 113 -299
6281b99M10M5j66L1j78L63k40R5K20p2l86K65j3q5J49l04K91m33m8P5K52N7j37
$$ -299 111 156 -10 21 -157 206 -34 61 281 209 -177 88 75 -10 139 -165 126 -307 -355 -280 -28 29 -108
6304a08K99o4p0k01J61K03j39k26n4j8M51k97M0j02J66L4o5l23M80j88K48j72
$$ -108 191 127 57 -144 17 220 81 -145 -199 -217 234 -63 -23 -125 41 75 10 -313 167 -21 227 55
6326E5j50n0K08k63K79p1l26M09K55m71j26J44J2j17L03K0N5j85m2J44L1j20k4
$$ 55 -95 -145 63 -200 79 8 -318 91 346 -125 -251 -107 -95 -212 91 111 166 -19 -61 83 114 -6 -30
6349c0J85j79j5j40L1L88j87j16l98P72k12l71P3K52o0K40k64K87j6l54R2k9M8
$$ -30 155 -24 -39 -179 -148 240 53 -63 -461 311 99 -272 -199 53 -7 233 -31 256 240 -114 -22 -51 -3
6372cN2j05k6J75j81P3M23l90j18r1L96l69L51N9m64L61n8j9j31K15j43k44L47
$$ -3 49 -56 -82 93 -88 -15 408 18 -100 -191 205 -164 187 246 -218 143 85 66 -65 150 7 -237 110
6395A10rJ06l28k0qJ19j50J31O7l81N95j49k45J12j3o3J07K4Q7J86m12q7L72k85
$$ 110 101 207 -121 -141 -149 -30 -180 -49 18 -363 232 83 -162 -50 -63 -126 -19 5 92 278 -134 -221 151 -134
6419a34K71j95K27j58j84N8J72J76j33q8l57K40k4o3k03L85l9nJ22Q4k93j49L07
$$ -134 137 -58 169 11 -173 -115 57 233 100 12 -345 -105 -129 -192 -395 -10 -49 -54 68 152 -141 -290 17
6442A7LJ28j09p4j07K16j07q0K38j25q0L01l02L79m36J15J50k01k6r1J94Pj80
$$ 17 20 148 39 -35 -142 74 -33 -113 125 0 -80 221 -81 298 -138 -23 127 -74 -100 -191 3 10 -170
6465a70K47Q5j35j0l13L29KJ3K67m36K62j36K48q0k11j03K33J38m41M01j2r8K6
$$ -170 77 162 27 17 -296 33 35 48 315 -121 141 5 253 173 -38 -141 92 230 -211 190 178 80 106
6488A06j53Q7J32j93L3J04k01M4k63K33K72j36j29m5K96o9p4j97r6K73r4j10J09
$$ 106 -47 40 172 -21 12 116 -85 -41 -304 -71 201 65 -64 -109 187 118 44 -153 -249 24 -70 -180 -71
6511g1n8q7K97n2j26N8J16kj05P3k93J69M0j05J71k33K92k12K87k54J28r1J87
$$ -71 -129 -216 81 29 -97 -39 77 75 -30 43 -250 -81 -41 -146 25 -208 84 -128 159 -95 33 -58 129
6534A29M2J6k24j08K32j30j92K65l2N6N0L1j89l7J02K45n84J39P6J13k25J57K00
$$ 129 171 187 -37 -145 87 -43 -235 30 -2 54 104 135 -54 -91 11 256 -328 -189 -113 0 -225 -68 132
6557A32j04%j18L6N2K02q1n0k3J4K49k89k88K58j93J12p2M06j72l7m7K81n9O8
$$ 132 28 28 -90 -54 -2 200 119 69 46 60 309 20 -268 -10 -203 -91 -163 243 71 34 -13 268 209 277
6581B77k21J12k36Q4K22k64j73m9N45j45m3K9No1k61L36k10JJ16o0lJ41p1j14
$$ 277 56 168 -68 16 238 -26 -199 -248 297 152 109 138 143 82 -179 157 -53 -52 64 4 1 142 71 -43
6605d3J9M8K5J81r3J46n48J77J47l10L59k37J72j12K22nk04oL22m04Q4L32m32
$$ -43 -24 24 49 230 137 283 -265 -88 59 -251 108 -129 43 -69 153 148 -56 -62 260 -144 -60 272 -160
6628a60N4J14J89M7m38K89p2L9n5j6j58j74N75m38K82K24l73J0J91j82M9p4J36
$$ -160 -106 8 197 244 -194 95 23 62 7 -9 -167 -341 234 -204 78 302 -71 -61 130 -52 -3 -77 59
6651E9K46k43j43MJ91m21M47O9q4m4J9m2r8K2j27K04j85J72j10Q2J08o2j3n3R
$$ 59 305 62 -81 -77 114 -307 140 209 125 81 100 58 -40 -18 -145 59 -126 46 -64 18 126 64 51 -2 7
6676GJ87j91m0l44O76k92p6m3K31j5j38K6q5J05j88K40m0Q6j36n7NK71k79J00
$$ 7 194 3 -37 -381 295 3 -73 -116 115 100 -38 -12 -97 8 -180 60 20 106 -30 -87 -82 189 -90 10
6700A0J02q1n4K68j35j6k8j94J17L51l89J47j82R0k20K0K65Q4R5m01m1N06m75
$$ 10 112 31 -23 245 110 94 66 -128 -11 340 -49 98 -84 6 -214 -194 71 155 250 -151 -192 314 -161
6723a61J1K20j19K0J15rj66K52k64O4j04K85j98m6J33K44k07J40k60J14K53l41
$$ -161 -150 70 -49 -29 86 77 -89 163 -101 -37 -141 144 -54 -100 33 277 70 210 -50 64 317 -24
6745b4j10L08j58l9j21K61o6l58K32J18j72K39j48J50R3k34K3j28K44J11m4qj57
$$ -24 -134 174 16 -23 -144 117 51 -307 -75 43 -129 110 -38 112 205 -29 -6 -134 110 221 177 169 12
6768A2n1rj49J93k65M43k33L59k14O0k68J63l17M80k13N4j39j04L14l69M25k60
$$ 12 -39 -48 -197 -4 -269 174 -59 300 86 146 -122 41 -276 204 -9 45 -94 -198 116 -253 172 -88
6790h8L6p0L49jj86j38J97K07l94r9K33J7j35RJ2J2K20k02k32J63K80j72j08L1
$$ -88 -52 -122 227 226 40 -98 99 306 -88 -187 46 63 -72 -63 -51 -39 181 -21 -253 -90 190 18 -90 -59
6814e9Q0j5P4J52j84j77K2o2K19j10K06N6j25j73R5J68k01J22j12k96qL06J14
$$ -59 21 6 80 232 48 -129 -107 -169 50 -60 146 202 77 -96 -1 167 -34 88 -24 -320 -328 -22 92
6837I2k34J08j25mL91l75K77j87L61k11j26J14k36k07L18j57K01r3j21L26l06
$$ 92 -142 -34 -159 -163 228 -147 130 -57 304 93 -33 81 -155 -362 -44 -201 0 -93 -214 112 -194
6858a94J85j60J59k17J29L02k3k26o1K32k11K94j80OPl27K20N07j28p9l81K53
$$ -194 -9 -169 -10 -227 -98 204 181 -45 -106 126 -85 209 29 35 42 -285 -65 442 314 235 -146 107
6880A07k98L67j47k18K14K84m0l29N2K23l80K47q0J72j79J56k25j4r1K15l0J9
$$ 107 -191 176 29 -189 25 309 269 -60 -8 215 -165 82 2 174 -5 151 -74 -88 -179 36 6 25
6902B5j19o0M6l5L65l44lL7K90j76j64j35L38R6k08K48l92K5J14o0Q2k1jP5Q7
$$ 25 -94 -154 -108 -143 222 -122 -125 -88 202 26 -138 -273 65 161 -47 201 -191 -166 -52 -112 -30 -51 -52 23 110
6927A10l49K95r6J0j79J40K26l45K57k3J3O0J48l56m13N98Pk18j56K97K21l45
$$ 110 -239 56 -40 -30 -209 -69 157 -188 69 46 59 119 267 -89 -502 96 103 -115 -271 26 247 -98
6949i8K48K23l71L4k15P8J64K2l04J67J4O5j37L60N0n48J47j44J59j57J62n0J68
$$ -98 150 373 2 36 -179 -101 63 85 -219 -52 -38 27 -110 250 300 -248 -101 -245 -86 -243 -81 -131 37
6972C7j64M6L03n17L47k50R7q7L10K2k90J44M9k23L11M2m33M74n02J67R0L5k45
$$ 37 -127 -81 222 -295 52 -198 -101 -188 122 144 -146 -2 47 -176 135 177 -256 218 -284 -117 -27 8 -237
6995b37K01J99l41O0K06N2p5P4P9k16j5J9J93p6k22j1Q3k00P0M14l38K84j93J01
$$ -237 -36 163 -178 -118 88 140 65 139 218 2 -13 6 199 123 -99 -110 -27 -227 -157 257 -81 203 10 111
7019A11k73J06J06j2l25J93K13j01Q9k19J92j66k06K91J62j27L98o29K71k55L55
$$ 111 -162 -56 50 38 -287 -94 119 18 107 -112 80 -86 -292 -1 161 34 432 -197 74 -181 174
7040A74l80K73J16m26J54K67l28j04J27M14l60j39M21K0k53q4J0L2L06j19o9j30
$$ 174 -206 67 183 -243 -89 178 -150 -254 -127 287 -73 -212 209 229 -24 -108 -98 -66 240 121 52 -78
7062g8J56l6k26J64P3Q4J61l80J86n3j32J82j04j17L7j46J1K30N0K78l38j42J87
$$ -78 78 42 -184 -20 53 137 298 -82 104 51 -81 101 -3 -120 -83 -229 -218 12 62 340 2 -140 47
7085D7o0j54M13n06K90k6PlK81k89J38k65k17L83k64L11l55M50K06m45K53q4j68
$$ 47 -13 -167 246 -260 30 4 11 8 289 0 138 -127 -344 39 -225 86 -269 181 387 -58 195 111 -57
7108e7j00j24M77l48J02R6O3k71J30J00n0p2n7J55p1J27j84R2k2L1r6j12L68l78
$$ -57 -157 -281 196 -152 -50 46 109 -162 -32 68 18 -54 -111 44 -27 100 -84 8 -14 17 -79 -191 177 -201
7132b01K30k7M8l3j17M51k28K78n48J31j40L18n1j5J02j61O6k76N5mj21M21k10
$$ -201 29 2 50 17 -100 351 123 401 -147 -16 -156 162 111 96 198 37 103 -173 -118 -122 -243 178 -32
7155c2Jj26J47J61k83K61m31P4L74k79j5J36j57O5K33j32J82p1o0r7j81K70P9
$$ -32 -31 -157 -10 151 -132 129 -302 -228 146 -133 -148 -12 -169 -104 129 -3 179 108 48 -49 -230 40 119
7178A19l63J69Q4RJ49l47J76k5j50R3J09J27O3l19k2r3K68k4q4j54R8K09l33K18
$$ 119 -244 -75 9 18 167 -180 -4 -29 -179 -86 23 150 213 -106 -128 -221 47 23 -61 -215 -117 92 -241 -23
7202b3j22K70o6P1j14L5j3J8p9j21K54o8qj32O2P2j73j37K56l91M73j76L8J50
$$ -23 -145 125 59 130 16 51 38 56 -23 -144 110 42 34 -98 -36 36 -137 -274 -18 -409 64 -112 -74 76
7226G6L29k91j54J73k2K2j05k05j79J40N38l69j98L57l34Q5K40j87o5J78K3j22
$$ 76 405 114 -40 133 111 133 28 -177 -356 -216 322 -47 -245 112 -222 -137 103 -84 -149 29 52 -70
7248g0mL2J26l69K25j93K54J51l00K16n2k02q9L32p8O7j11P0J14P4l42M05m19
$$ -70 -74 -42 84 -285 -60 -253 1 152 -148 68 16 -186 -275 57 -21 46 -65 5 119 193 -149 256 -163
7271a63O9k64Q02k64m20J11K97J06o27L72k44J66J93m80N19r8j7J34l69J31j79
$$ -163 -94 -358 444 180 -240 -129 168 274 -353 19 -225 -59 134 -346 173 75 58 192 -177 -46 -225
7292b25o0K36J40K6p6m5O2J87k76k7J53k07M1j97N87l59J21Q1m36K25q7K28J41
$$ -225 -285 -49 91 117 41 -4 58 245 -31 -58 95 -112 -71 -268 319 -40 81 162 -274 -49 -136 92 233
7315B33j49m56K08K95k09M85p01L99l92K62J47l20J16k4J80K7j77p0J91k2j51
$$ 233 84 -372 -164 131 -78 407 -294 105 -287 -25 122 -198 -82 -106 74 101 -76 -146 45 23 -128
7336a28K30r7j07K3m87L23J56oQ5nJ90j24k26Q5k6R4J35k56K07j97J69j95K4K70
$$ -128 102 5 -102 -79 -566 -243 -87 -93 -8 -13 177 53 -173 -88 -114 -20 115 -141 66 -131 38 -157 -133 137
7360A37k02p0J98k40M30r1k05K41m22K16J12m0J78k97QJ03p7j62K21k00q2K23
$$ 137 -65 -135 63 -177 253 162 -43 198 -224 -8 104 64 242 -55 -47 56 -21 -183 38 -162 -244 -21
7382b1m5k80N26k37J63j63Q6J26k6j6k33K04n2j34P8o5J77j28J20j96j32L44k8
$$ -21 -66 -346 180 -57 106 -57 29 155 129 113 -120 84 32 -102 -24 -89 88 -40 80 -116 -248 96 68
7405F8l56J11p2K69m8j27lL62o9m7k69J13m6O5J49k79j08N21m9l63j29K05n7J51
$$ 68 -288 -177 -249 20 -28 -155 -158 204 135 88 -181 -68 -114 -49 100 -179 -287 234 185 -178 -307 -102 -159 -8
7429hr4J98J09q0j35K36k78J2oR1k41l2N49j92k23J25K57j11j90J40J01k98K14
$$ -8 -102 96 205 125 -10 226 -52 -40 -46 45 -196 -228 321 129 -94 31 288 177 -13 127 228 -70 144
7452A44j75P1j24k37M46M9l11J29j54J81p5L8k26L42m0O2k01n8n1R7M5K0N7RK20
$$ 144 -31 40 -84 -321 125 174 -137 -8 -162 19 -56 -18 -244 98 58 120 -81 -139 -190 -93 -48 -28 29 38 258
7477B58j16J78o25K73j74L98j45j0J73k56j02M19k09J20k16m3Q1j41J20O5K35
$$ 258 142 320 -305 -32 -206 192 47 37 210 -46 -148 271 62 182 -34 -77 4 -137 -17 48 283
7498B83k67k56nl3R2K75l5k8M9j28k48J82J55J80j08n6k2k23L53k66m2J07k42
$$ 283 16 -240 -245 -278 -186 89 54 26 75 -53 -301 -119 36 216 108 52 30 -193 160 -106 -148 -41 -283
7521b83M10k3P7k83M1J3L21m56nL70k85L03m73L86j54m4J2Q7K20n9l12J51%r8
$$ -283 127 104 181 -102 -61 -48 273 -183 -188 182 -103 200 -273 113 -41 -85 -73 14 234 175 -137 14 14 -84
7545h4J5k01M74j76l2J14l27L73l80K17j58M7L17j15k62J69l2j44l6R6q5L84J04
$$ -84 -69 -270 204 28 -4 110 -217 156 -224 -7 -165 -118 199 84 -178 -9 -41 -185 -221 -125 -210 174 278
7568B78k69p7L58o99K93N91o08M7L93k49P3m0r1k07K97k13J98kl0j6l09L63k09
$$ 278 9 -68 290 -409 -116 475 -133 -86 307 58 131 91 0 -207 90 -123 75 73 43 27 -282 81 -128
7591a28J50l59M29L14n21OJ93l12L02m14N01l17k54M93J73L1k78k29K79j98K13
$$ -128 22 -337 92 406 -115 -109 84 -228 74 -340 161 -156 -410 83 256 287 9 -220 59 -139 74
7612G4k64L04jn0m6M42l10l51P03o08l4J84k19L70j0m18J39J82Q4l26j77J58K79
$$ 74 -190 114 113 63 17 459 149 -202 501 -107 -141 43 -176 194 184 -234 -95 87 171 -155 -332 -174 105
7635A05k87J35K93l87J0M9j17M62l70q1K26J92k75k03o2K89J9j03L40j23J35j63
$$ 105 -182 -47 246 -141 -131 -82 -199 263 -107 -188 38 230 -45 -248 -310 -21 -2 -105 235 112 247 84
7657H4p3J75m41K19J15J4J48l56L6K42l41L67j41j89K35k01J62J23k61R0N8J77
$$ 84 11 186 -255 -36 79 93 241 -115 -79 163 -178 189 48 -141 94 -107 55 178 -83 7 65 242
7679B42k10L1QK39l40j06K52j50Jk54L86L8m19K74o7J65k08K30l88N89k18q9k93
$$ 242 32 63 71 310 -30 -136 116 -34 -33 -287 99 137 -282 -8 -75 90 -118 112 -276 313 95 6 -287
7702b87L75N9k70R2K79k6l72J39J62j35n7n9J74j47J37j40J23j16R7J68m6m63
$$ -287 88 147 -123 -31 248 222 -150 -11 151 16 -41 -100 74 -73 64 -76 47 -69 28 196 150 -313
7724c13K90R8k68J38j12L19r0o5J1o5j25K08k8j01L97l23Po2K34p8R4q4j95L59
$$ -313 -23 75 -193 -55 -167 152 62 -3 8 -57 -182 26 -2 -103 294 -29 -22 -84 150 72 166 82 -113 246
7748B46n43K71K71k9j9K6n7j91J10J3j39pJ14N7P3l81j8J95Qj01J32J02k22O9
$$ 246 -297 -26 245 216 197 223 166 -25 85 98 -41 -48 66 123 196 -185 -203 -8 0 -101 31 133 -89 -20
7772b0l31L11J85k80mj20M96l99K76n5j23J85k84L00k97J05o0Q4k71J25r8N95
$$ -20 -351 -40 145 -135 -139 -259 237 -162 114 59 -64 121 -163 137 -160 -55 -115 -31 -302 -177 -275 320
7794C20k71j5k23O2R5Qk7j69L24Q7m41K7J68l1J1j76N51o11L07l49L53K63l76
$$ 320 49 34 -189 -127 -32 -24 -51 -220 104 191 -250 -223 -55 -86 -75 -251 300 -311 -4 -353 0 263 -113
7817a13m6L01k84j02M19n6l8J3J21J23o31OL23Q6k2k68Q5K52j73l21M02Q7l45
$$ -113 -159 142 -142 -244 175 119 81 94 215 338 -293 -287 36 122 100 -168 -83 169 -4 -325 77 164 -181
7840a81J34j40K32j28j7Q1L08j93l44L59J17k03J04l71L46p1l70K58K28j39j51
$$ -181 -47 -187 45 -83 -100 -19 289 96 -248 111 228 25 129 -242 104 33 -337 -79 149 10 -141
7861a41k19L49k07L28k05L54k31n8j33L54j49l5j67L28k53j40K36L37j88k96K71
$$ -141 -360 -11 -218 110 -95 259 28 -30 -163 191 42 7 -160 168 -85 -225 11 348 160 -136 135
7882A35K04j18j53k2l4l5L7m7J55j90J48N9J02j69j49M05j21K7l20K9J40m97M46
$$ 135 339 221 68 46 12 -23 14 -33 122 -68 80 139 241 72 -77 328 207 234 -86 -57 83 -414 32
7905C2k4P9L2j51J58J85l95J80l47L92Q1k51lk24K79J25j90K51j6n45O09Q9l85
$$ 32 8 87 119 -32 126 311 -84 96 -251 141 222 -29 -32 -256 23 148 -42 209 193 -352 257 346 -39
7928c9K89l68R8O9j77J28N4m9L0J25P2l01Oj71J47N0J25m2l71M80j32j7J12P7
$$ -39 250 -118 -20 49 -128 0 54 5 35 160 232 -69 -63 -234 -87 -37 88 46 -325 155 23 6 118 195
7952A95k24p1K36j72J47j44J94j90j24r2M61r6l88J30J74L08n90J37J83%l23R7
$$ 195 -29 -100 136 -36 111 -33 161 -29 -153 -245 216 120 -268 -138 36 344 -246 -109 74 74 -249 -152
7974a52K22M6k27l6J56k9O2J42j1j06j53L3q8P1K36j53j7J64m09R0J82j33J1O0
$$ -152 70 116 -111 -147 9 -20 42 184 173 67 -86 -53 -141 -70 166 13 -4 160 -249 -159 23 -110 -99 -39
7998c9J27m6m19O65k83k29K63K9l2j11J65n2j26L9N3L08m52k26N79k66J82n6R
$$ -39 88 42 -377 288 5 -224 39 68 36 -75 90 38 -88 -49 4 312 -140 -366 213 -53 129 73 82
8021H2j45k03K08K28n0M8p9l31L50n8o4J08j21m2o0n6k10M38J6j36R7j76M84k89
$$ 82 -63 -266 -58 170 120 168 89 -242 108 50 -14 94 -27 -69 -129 -185 -395 43 59 -77 20 -156 328 39
8045C9L3k83L37k58n8K13J52k46Nk79K14n3J11J83j58L0L9Q0K2j96j81L01j31
$$ 39 72 -211 126 -132 -190 23 175 -71 -66 -345 -131 -184 -73 110 -48 -18 21 101 123 -73 -254 47 -84
8068h4j23j41K20LK08r1m4L1L05l03O6l0k2O7k89N81k30l38M98k88k9j39R3m8
$$ -84 -207 -348 -128 -125 83 -8 -52 -21 284 -19 47 17 -5 62 -227 354 124 -214 284 -4 -33 -172 -79 -127
8092a27J78j85L82l39Q8O6J06m95M43j39O0M0Q5l57Q7J25p6K57j52k6L3L6J88
$$ -127 51 -134 248 -91 -3 63 169 -326 117 -22 38 78 163 -194 -107 18 -58 199 47 21 54 90 278
8115B78m96L05m27L64j72m8M50k63N7J08m22L23j04jJ09q5J88p1J76l33P9l9k31
$$ 278 -218 87 -340 24 -148 -196 254 -9 48 156 -266 57 -47 -48 61 -24 164 93 269 -64 15 -24 -255
8138b55J47L63k06r8q6L35j88k41L87Q9q0qj62J6J35j07k00J90R0q4J5J41J52
$$ -255 -108 255 49 -49 -135 200 12 -229 158 247 167 159 -3 13 148 41 -159 31 121 37 52 193 345
8161C45k34j11Rj19J83m3N6r8K63m80L19J17l79J54Mn4J39j16P4L0j34k8O4k41
$$ 345 111 0 9 -110 73 30 86 -12 251 -229 90 207 -172 -18 -14 -68 71 -45 29 59 -75 -103 -39 -280
8185b80J59J90k90J95K02j46
$$ -280 -121 69 -221 -26 176 30
8191C0
$$ Imaginary data points
##PAGE= N=2
##DATA TABLE= (X++(I..I)), XYDATA
0@%%%qK4k4K4m0N6o4Q0j04J28j60J92k32K80l36M00m70N53o43P43q63R94j133
$$ 0 0 0 0 -8 16 -8 16 -24 32 -32 48 -56 72 -88 104 -128 152 -184 216 -254 299 -344 399 -464 530 -603
26f03J293j476J676j893K131k397K692l013L361l745M176m639N140n705O323o994
$$ -603 690 -786 890 -1003 1128 -1269 1423 -1590 1771 -1974 2202 -2437 2703 -3002 3321 -3673
42c673P743q577R502j0536J1702j3027J4542j6298J8361k0825K3837k7607L2478
$$ -3673 4070 -4507 4995 -5541 6161 -6866 7676 -8622 9739 -11086 12751 -14856 17622
55A7622l9068M8534o3349R0006j52693N50705M24148j273515k86368P04046M88581
$$ 17622 -21446 27088 -36261 53745 -98948 451757 875905 -397610 -683978 20068 508649
66E08649n19561l96018K35822L79674q2730k04796j44158p3672R9060M84235L29622
$$ 508649 -10912 -406930 -171108 208566 125836 -78960 -223118 -296790 -197730 286505 616127
77F16127l57332o34021J4644M95597J39670k81834j3771J93222j57127l07011
$$ 616127 258795 -375226 -360582 135015 274685 -7149 -20920 172302 15175 -291836
87b91836J81061L26182k15053l35627L70168N52300l38206q53685m0023Q03444
$$ -291836 -110775 215407 354 -335273 34895 587195 248989 -604696 -644719 158725
97A58725L96051m51762m03463J89659K50199j17529j24635J49067J41941k9493
$$ 158725 554776 103014 -300449 -110790 139409 21880 -102755 46312 188253 158760
107A58760p900m3297k88920k09249L01650L92580j81213m08202J12637L47125
$$ 158760 150860 107563 -181357 -390606 -88956 303624 122411 -285791 -173154 173971
117A73971j75265l91558K34705O04037O638n54352k03768L13823J33547k16910
$$ 173971 -1294 -392852 -158147 445890 452528 -101824 -305592 8231 141778 -75132
127g5132j0524K78826L710l43081r3814K69389P5575k20387K0263L12989J8496
$$ -75132 -85656 193170 196880 -146201 -240015 29374 104949 -115438 -95175 217814 236310
138B36310l68480j84772J71957J43462K9570J26181L7863k97814k24786L06578
$$ 236310 -132170 -316942 -144985 -1523 28047 154228 192091 -105723 -330509 -23931
148b3931L98506j68365m16114R8656M38551m4805n36641j98275L89009L07810
$$ -23931 374575 206210 -209904 -111248 327303 282498 -254143 -452418 -63409 244401
158B44401j49890j97582K8681n468r6310J30528K78264k6421k72265k1554K08137
$$ 244401 94511 -103071 -74390 -79858 -176168 -45640 232624 206203 -66062 -87616 120521
169A20521k8729k37996Q178K43421N3872j58467l8801O3934r2576j17755J78042
$$ 120521 91792 -146204 -138026 105395 159267 800 -38001 25933 -66643 -184398 -6356
180f356K80925r3511l62992p5010K60748Q9393j86104k0830K26881M4030k12153
$$ -6356 274569 181058 -181934 -256944 3804 93197 -92907 -113737 113144 157174 -54979
191e4979m9927J82630L7957j38574L6260J82847n5037k69848p8933J63629Q0090
$$ -54979 -104906 77724 115681 -22893 13367 196214 141177 -128671 -207604 -43975 36115
202C6115o6938J2100P8112p5867j47332P5965K26985J2814j92840k0978J82448
$$ 36115 -30823 -18723 59389 -16478 -163810 -87845 139140 151954 -40886 -61864 120584
213A20584P552k20522o5854J82981R4317r4848k7939O3329p3603j32564R2128
$$ 120584 128136 -92386 -158240 24741 119058 24210 -3729 59600 -14003 -146567 -54439
224e4439K10677k5494k19198n4282J40639L7487j17811k0861J34249N9275q1453
$$ -54439 156238 130744 -88454 -142736 -2097 35390 -82421 -103282 30967 90242 8789
235H789k5287P9564n166j01285L0536J56811j764j96376r4014R7773N6719n2649
$$ 8789 -16498 63066 57900 -43385 -12849 143962 142198 -54178 -148192 -50419 6300 -46349
247d6349O546O8577l5872q4688N3910J20966k6426j16253K5083J38503O710j52081
$$ -46349 -39803 28774 -7098 -91786 -37876 83090 56664 -59589 -34506 103997 110707 -41374
259d1374p5542R2222Q3062l0648k4300L6116k5326q9261K1740J27793Q184j37755
$$ -41374 -116916 -24694 58368 27720 3420 39536 14210 -75051 -53311 74482 82666 -55089
271e5089n2043R6259M6623p5510m5992M7978M8299J6981L1803Q147o7817n2585
$$ -55089 -107132 -10873 35750 -39760 -85752 -37774 10525 27506 59309 67456 -361 -52946
283e2946P2429J07229l4348j45033n1459Q9067N2218p0331n3237N4122M8187k5949
$$ -52946 19483 126712 92364 -52669 -104128 -15061 37157 -33174 -86411 -32289 15898 -10051
295a0051n938M4452n280n6474J7601Q1701M197q4834m2313M0460L9501k19m418
$$ -10051 -15989 28463 23183 -33291 -15690 66011 70208 -14626 -56939 -16479 23022 22803 18385
308A8385j035j8140j3946K5642L2705k6432o4326p729N8646J8784n8948l5839
$$ 18385 17350 -790 -14736 10906 43611 17179 -47147 -54876 3770 22554 -36394 -72233
320g2233M3855M4742j267P408K7444j3839l8317J7409N2003p675o6879l8009K0349
$$ -72233 -28378 16364 15097 22505 49949 36110 -2207 15202 67205 59530 -7349 -45358 -25009
333b5009K6854n667k6257j5541J2305L0614K7435L770k7171k8875J8402N3356
$$ -25009 1845 -3822 -30079 -45620 -33315 -2701 24734 28504 1333 -27542 -9140 44216
345D4216P896n7384l8994L0247M0250k31j5505p399n864N439K6007P629l6263
$$ 44216 52112 -5272 -44266 -14019 26231 26000 10495 3096 -2768 2671 28678 36307 44
358D4l8722K303K7801J0454k0685k7741J244L5619L3825M916j1114p243K908J8966
$$ 44 -38678 -36375 -8574 1880 -18805 -46546 -45302 -9683 24142 29058 17944 10701 13609 32575
372C2575J9692j7139m7675k2154K2069J8658j3043k4277j1026J0009K9410K4950
$$ 32575 52267 35128 -12547 -34701 -12632 6026 -7017 -31294 -42320 -32311 -2901 22049
384B2049j0068k8218l082K4522J9416n949k4546k0729Q838L1582J4294j7849j9098
$$ 22049 11981 -16237 -19319 5203 24619 18670 -5876 -26605 -17767 13815 28109 10260 -8838
397h838M042J8225J4897l200k7263k9087K355K2700K709k1605j7144M709K3894
$$ -8838 -4796 13429 28326 25126 -2137 -31224 -28869 -6169 -3460 -25065 -42209 -37500 -13606
410a3606K9220R577j6201j0673J8238K4963p1k2348k5461j1204R790J3967r248
$$ -13606 15614 25191 8990 -1683 16555 41518 41447 19099 -6362 -17566 -7776 6191 -3057
423c057k4929o935J7167J9660Q452m425j4267n944J7138J9174p669k3417r559
$$ -3057 -27986 -34921 -17754 1906 10358 5933 -8334 -14278 2860 22034 14365 -9052 -18611
436a8611J0013J8268J2787n708j7937l420J9897J8518n996k6845k4961J734K3759
$$ -18611 -8598 9670 22457 16749 -1188 -4608 15289 33807 27811 966 -23995 -22261 1498
449A498O345l1436k5966J8217L6255J1135q627m369L366J1820J8302L356k3232
$$ 1498 7843 -23593 -49559 -31342 4913 16048 7421 3052 6418 18238 36540 39896 16664
462A6664k4091J381J3757p59j7406j2379M527J2310O260J340J234n039r957Q762
$$ 16664 -7427 -6046 7711 6952 -10454 -22833 -18306 -5996 264 1604 2838 -2201 -12158 -3396
476c396K5346k189l6728j4145L1254K3636j5406j3631J3423J1175q208j625R226
$$ -3396 21950 19761 -16967 -31112 142 23778 8372 -5259 8164 19339 11131 9506 18732
489A8732o715k2697o437J5243J774k4128j6786J5971K2289M220J930J0494m742
$$ 18732 12017 -10680 -17117 -1874 -100 -24228 -41014 -25043 -2754 1466 3396 13890 9148
502I148j7527J4120M0598m853n5100j8435M2890J8095m4637l0203L0182L1166
$$ 9148 -8379 5741 46339 41486 -13614 -32049 10841 28936 -15701 -45904 -15722 15444
514A5444j1277j4688Q107j884j7772J0101L8014J335m8818k1854L9065K9001k5575
$$ 15444 4167 -10521 -2414 -4298 -22070 -11969 26045 27380 -21438 -43292 -4227 24774 -801
527h01j7857L2077K2229k7961j6752K4873J788l9299j877M8088J270o7366k8077
$$ -801 -18658 13419 35648 7687 -9065 15808 17596 -21703 -23580 24508 25778 -41588 -69665
540f9665N1880L8013k4547j3393L5346J1405l8840j0538M8259J8302m8272k2617
$$ -69665 -17785 20228 -4319 -17712 17634 29039 -9801 -20339 27920 46222 -2050 -24667
552b4667M6611J6123o4729l7997N5974N0012l0979l0256K7112O234m7514m605
$$ -24667 21944 38067 -26662 -64659 -8685 41327 10348 -19908 7204 13438 -34076 -38681
564c8681O7273K3320o4074l4680M9587K8041m8439k2426O0483M2417m0509l6019
$$ -38681 28592 51912 -12162 -46842 2745 30786 -17653 -40079 20404 62821 22312 -13707
576a3707K4013M667m6539L839P6232R084r8293m5854P7809M9959o2200l1946Q2797
$$ -13707 10306 14973 -31566 -27727 48505 57589 -40704 -86558 -8749 41210 -20990 -52936 29861
589B9861N3081p4214o7964M7291N7634k7556k7716L8071J1245o8058l3996N7576
$$ 29861 82942 8728 -59236 -11945 45689 18133 -9583 28488 39733 -28325 -62321 -4745
601d745L7424l9928q366O1649l31r9391l2404J00071O0835p1425n0430O0670K8011
$$ -4745 32679 -7249 -15615 46034 45703 -53688 -86092 13979 74814 3389 -47041 13629 41640
614D1640q2302l3239R6989O2111o9472m8323O3614K2085r9924m8281J10928R0578
$$ 41640 -40662 -73901 23088 85199 15727 -32596 31018 53103 -46821 -95102 15826 106404
626A06404p7324j08990J9528O5195j0143j9804M4442K5242m5547j3572M6509j9029
$$ 106404 29080 -79910 -60382 4813 -5330 -25134 19308 44550 -997 -14569 31940 12911
638A2911q9315K5007J51398K8111j69071j01382J12290J10126o4045p3855O9493
$$ 12911 -76404 -51397 100001 128112 -40959 -142341 -30051 80075 16030 -57825 11668
649A1668O6283p7031q3269M8326O4109l5093k1229P4606K1350j16547p2694J00417
$$ 11668 77951 920 -82349 -34023 30086 -5007 -26236 48370 69720 -46827 -119521 -19104
661a9104J08253l8035o6706K9272K1222o8180l1740P4271L7173o2428r419P9079
$$ -19104 89149 51114 -15592 13680 34902 -33278 -65018 9253 46426 -16002 -25421 53658
673E3658k0161j46795j8093J87429J04649j37452j28351Q4979J03559q0113j00732
$$ 53658 33497 -113298 -131391 56038 160687 23235 -105116 -20137 83422 3309 -97423
684i7423P9374J21821l5054j05280j2112K7954j8109J9870R5604J4012j21409
$$ -97423 -18049 103772 68718 -36562 -48674 -20720 -38829 -18959 76645 90657 -30752
695c0752o0758R0935N0703q7941l4289J20706O7039j17640j02402O7333P9159
$$ -30752 -91510 -575 50128 -37813 -72102 48604 115643 -1997 -104399 -37066 42093
706D2093l9567j4010R5288J4780j53329q4118J31740J16162q8929j02542P9609
$$ 42093 2526 -11484 83804 98584 -54745 -138863 -7123 109039 20110 -82432 -2823
717b823R6541q6560j25230M5983J24522K0417m0832m402k9851p9370J3024J29985
$$ -2823 93718 7158 -118072 -72089 52433 72850 32018 27616 -2235 -81605 -68581 61404
729F1404L9169j17705n2579J07885M2076j39382p7928J44082J36762q0874j29964
$$ 61404 100573 -17132 -69711 38174 80250 -59132 -137060 7022 143784 62910 -67054
740f7054K4415N9622n1522l4235J04392P4151r6688r8800O0159P2193o2104m7867
$$ -67054 -42639 16983 -34539 -68774 35618 109769 13081 -85719 -25560 46633 -15471 -63338
752f3338J01533Q3767r1031j16247K8984O8827j9391j0524P2344J3760j16148
$$ -63338 38195 121962 30931 -85316 -56332 12495 -6896 -17420 54924 68684 -47464
763d7464n7087J00334O7358q0956l8428J17381N9342j45933j23595J01517J43301
$$ -47464 -104551 -4217 63141 -17815 -56243 61138 120480 -25453 -149048 -47531 95770
774I5770l7084r5768L1334N5103o7262p0177O8259Q4307l6734m9048M5564J4027
$$ 95770 58686 -37082 -5748 49355 -17907 -88084 -19825 64482 27748 -21300 24264 38291
786C8291j01716m7915J17556J00791o9549r2574L8631M9807o2265m1275R4816
$$ 38291 -63425 -111340 6216 107007 37458 -55116 -16485 33322 -28943 -70218 24598
797B4598P7786p5334q3895M6352M4121p6086m2352J13565R1097r4645j20329M0086
$$ 24598 102384 27050 -56845 -10493 33628 -42458 -84810 28755 119852 25207 -95122 -55036
809e5036Q8122k4643m4728O1534N6429p1616q1399M1153N9555l4373k5438P5552
$$ -55036 33086 8443 -36285 25249 81678 10062 -71337 -30184 29371 -5002 -30440 45112
821D5112L9785j00651q4416P0546R0049l7443n4489N3622M2418q6365p5835P1499
$$ 45112 84897 -15754 -100170 -29624 60425 22982 -31507 22115 64533 -21832 -97667 -26168
833b6168R1138l6752n9702M3245M0143p2577o1086P4370Q5780l9778o6768K9539
$$ -26168 64970 28218 -31484 11761 51904 -20673 -81759 -7389 78391 38613 -28155 1384
845A384L3578o3561m8981P7262Q0916m9925p7226K7839M7115m5320m0620P0094
$$ 1384 34962 -28599 -77580 -318 80598 30673 -46553 -18714 28401 -16919 -57539 12555
857A2555O8904n4833p5285K7949M5701l9396l1533O8426N6608o4027p6815L3208
$$ 12555 81459 26626 -48659 -20710 24991 -14405 -45938 22488 79096 15069 -61746 -28538
869b8538N8353k6662l4795N0332M4513o0979p0131L5987O3037k1853l6452M2607
$$ -28538 29815 3153 -31642 18690 63203 2224 -67907 -31920 31117 9264 -27188 15419
881A5419L9394n8046o1691M4563O6256k4062m3901L1053L2676n2559n3242M3020
$$ 15419 54813 -3233 -64924 -20361 45895 21833 -22068 8985 41661 -10898 -64140 -21120
893b1120O2703j9164m3590J8923K5687l9610l3601M7652N1068l2832m5692K7126
$$ -21120 41583 22419 -21171 -2248 23439 -16171 -49772 -2120 48948 16116 -29576 -2450
905b450L2623m3848m1670N0917O2837l1250o0624J2787L8241k0007k7910L4825
$$ -2450 30173 -13675 -55345 -4428 58409 27159 -33465 -20678 17563 -2444 -30354 4471
917D471L7354l3684m3458K0105L1632k3988k4544L8853L9379l3726m9782J7111
$$ 4471 41825 8141 -35317 -15212 16420 -7568 -32112 6741 46120 12394 -37388 -20277
929b0277M0409j0803k4325K3619K4605l5250l8076K7095L8404k1077k8648K8099
$$ -20277 20132 9329 -14996 8623 33228 -2022 -40098 -13003 25401 4324 -24324 3775
941C775K9913l2597m0610K3818M2457r474k9595J0380K0406k0241k5959K0505
$$ 3775 33688 1091 -39519 -15701 26756 17282 -12313 -1933 18473 -1768 -27727 -7222
953g222L1964j1673k5310J2101J8425k1272k3065K4249L0157j8508k9672J3363
$$ -7222 24742 13069 -12241 -140 18285 -2987 -26052 -1803 28354 9846 -19826 -6463
965f463K2166j8422k1434K2039K9195j4424k7038Q085J8898r991j4291J5187J8100
$$ -6463 15703 -2719 -24153 -2114 27081 12657 -14381 -6296 12602 2611 -11680 3507 21607
978B1607j5665k3691R763J9836r265j7432J3711K0947j2662k3864Q074J9878o415
$$ 21607 5942 -17749 -7986 11850 2585 -14847 -1136 19811 7149 -16715 -8641 11237 4822
991D822j3336J0988J2224j5249j5773J2536J7197q226j3666Q543J2543r725j5267
$$ 4822 -8514 2474 14698 -551 -16324 -3788 13409 5183 -8483 60 12603 2878 -12389
1004a2389O537J5373m059j3638M579J0347o984j3101Q470J5489m920j2852N501
$$ -12389 -5852 9521 5462 -8176 -3597 6750 -234 -13335 -4865 10624 5704 -7148 -1647
1017a647R632p161r517Q308J0101p821j1000N563Q755m976q754M417R311j005
$$ -1647 7985 824 -8693 -385 9716 1895 -9105 -3542 5213 237 -8517 -4100 5211 4206
1031D206q020r62N299n42l797L993M814n846p453O407Q674n055r165M939Q596
$$ 4206 -3814 -4776 523 -19 -3816 177 4991 -855 -8308 -1901 6773 1718 -7447 -2508 6088
1046F088k362p534J25L662J74k164J164Q29k436j864K778M348j234m352P97N265
$$ 6088 3726 -3808 -3683 -21 153 -2011 -847 -18 -2454 -4318 -1540 2808 1574 -2778 -1981 3284
1062C284K93m870r50L689Q8k794Q51J865k647j875L522K157k110k459K087J527
$$ 3284 3577 -1293 -2243 1446 1534 -1260 -409 1456 -1191 -3066 456 2613 503 -1956 131 1658
1078A658j353n54K19N06O74r11r42J590J512j243j621J816J212j511o79O84j143
$$ 1658 305 -249 -30 476 1150 239 -703 887 2399 1156 -465 1351 2563 1052 373 1057 -86
1095h6q57K341N12l202q36K958J550j173j487M83Q31J529L56k217j801K212R72
$$ -86 -943 1398 1910 -1292 -2128 830 2380 1207 -280 203 1034 2563 2919 702 -1099 1113 2085
1112B085j401p39nl91Q24J227o67k112Q17K297j340j291O52R60j414l26J559K41
$$ 2085 684 -55 -60 -451 373 1600 933 -1179 -362 1935 595 -696 -44 916 -498 -824 735 976
1130I76q72n4L02K08K70k9j351N28Q41j581p96K168p69k577Q30L254o41l089R91
$$ 976 104 50 352 560 830 801 -550 -22 819 -762 -1558 610 -159 -2736 -1906 1348 707 -2382 -1391
1149a391K887j400j845K570J146l253j603K793J517j980l019J538M302n11m620
$$ -1391 1496 96 -1749 821 1967 -1286 -2889 -96 1421 -559 -3578 -2040 2262 1751 -2869
1164b869j300M640J447l737m75L646j584m715L145N485k837n699L812N791l971
$$ -2869 -4169 471 1918 -1819 -2294 1352 -232 -4947 -1802 3683 846 -4853 -1041 4750 779
1179G79o098L032N722k008m877K243M234l597o026L399Q222n66q970J97P695m06
$$ 779 -5319 -2287 3435 1427 -3450 -1207 3027 -570 -6596 -3197 5025 4459 -4511 -4314 3381 2975
1195B975p673K032Q828k796q438L401P660o076q870Q167J2416o391j3455J715
$$ 2975 -4698 -2666 6162 3366 -5072 -1671 5989 -87 -8957 -790 11626 5235 -8220 -6505
1209f505J1453k57q846J785Q529j596r836J215R406k976r062O994J3001p865j8676
$$ -6505 4948 4691 -4155 -2370 6159 4563 -5273 -4058 5348 2372 -6690 304 13305 5440 -13236
1224a3236M365J9402j127j5412J938J3086m726j3908M262J3099l592r647P319
$$ -13236 -8871 10531 9404 -6008 -4070 9016 4290 -9618 -5356 7743 4151 -5496 1823
1237A823J0731j1809j7870J0308K3626l159k3154o03J9009m37j9187J035J9546
$$ 1823 12554 745 -17125 -6817 16809 13650 -9504 -10107 8902 8465 -10722 -9687 9859
1250I859J454j5268R79R372j0596j2443J7721K2372j4857k7485O566K5797m440
$$ 9859 11313 -3955 -2976 6396 -4200 -16643 1078 23450 8593 -18892 -12326 13471 9031
1263I031k3902M432K6040N75k4017o832J5307J556r960J1402J7016j6797k9701
$$ 9031 -14871 -10439 15601 16176 -7841 -14673 634 2190 -7770 3632 20648 3851 -25850
1276b5850J1306L2711n327k9458N919L0593m581l2609m203K5564P322j1495L151
$$ -25850 -14544 18167 12840 -16618 -10699 19894 15313 -17296 -21499 4065 11387 -108 3043
1289C043Q861j7977k0886J8886L2905j0738l3845P508L3902q187m0927P88M2421
$$ 3043 11904 -6073 -26959 -8073 24832 14094 -19751 -12243 21659 13472 -27455 -26667 15754
1302A5754J1557k9008j0434J3642n519j5922J8885K8498j6070l3678J0584L1506
$$ 15754 27311 -1697 -12131 1511 -4008 -19930 -1045 27453 11383 -22295 -11711 19795
1314A9795j3216l6522J2757M7400R99m4979j4757K6898R411j5697Q636K4268j4963
$$ 19795 6579 -29943 -17186 30214 31213 -13766 -28523 -1625 7786 -7911 725 24993 10030
1327A0030l5502R822L4183j0288l3354J8341M5474j3969n6520n958M6805J6918
$$ 10030 -25472 -15650 18533 8245 -25109 -6768 38706 24737 -31783 -37741 9064 25982
1339B5982k5114n225J8845r741k9192R288L3486m869k8360J3318L3787k1508n3121
$$ 25982 868 -4357 14488 4747 -24445 -15157 18329 13460 -14900 -1582 32205 10697 -42424
1352d2424R288O1067J3156m4720j6528K6553J041k8719P333L6833k575l1197M647
$$ -42424 -33136 27931 41087 -3633 -20161 6392 7433 -21286 -13953 22880 20305 -10892 -6245
1365f245K4994k0282l8475K3868N9883l463n8994j6116L8986J1332l0025K713
$$ -6245 18749 -1533 -40008 -16140 43743 40280 -18714 -34830 4156 15488 -14537 -11824
1377a1824L8380p46m1647o296K9612m327k7216K2924M7112j9648o3553l860N3772
$$ -11824 26556 25810 -15837 -22133 7479 3152 -24064 -1140 45972 26324 -37229 -41089 12683
1390A2683J3211l4976j231L5087n948m5304m240L9652Q230k4857R260L0454k3496
$$ 12683 25894 -9082 -10313 24774 18826 -26478 -30718 8934 17164 -7693 1567 32021 8525
1403H525n4768J0937O2896R942m7757r420L7393l934m6162P55N1434J2671l4656
$$ 8525 -46243 -35306 27590 37532 -10225 -19645 17748 13814 -32348 -31593 19841 32512 -2144
1416b144q616K1876j3398l5120J9593N5077j030n2832j0606L6614O59l8456P752
$$ -2144 -10760 11116 -2282 -37402 -17809 37268 36238 -16594 -27200 9414 10073 -28383 -20631
1429b0631N3110N433n1065j7271L1177M166k7140J5494M6651j0382n8174q477
$$ -20631 32479 37912 -13153 -30424 753 4919 -22221 -6727 39924 29542 -28632 -37109
1441c7109M5486R562l2981M826M3550n177n4487j2885M2855J6441k5208K407L1361
$$ -37109 8377 17939 -15042 -10216 33334 28157 -26330 -39215 3640 20081 -5127 -2720 28641
1454B8641j3919n1122Q74N2478J2906l7155l006L5054r780n1602J456N5764J5315
$$ 28641 14722 -36400 -35526 16952 29858 -7297 -10303 24751 14971 -36631 -35175 20589 35904
1467C5904l8841j0185K8547q152m1256P593N4151J0151m3837j4237K8757j592
$$ 35904 -2937 -13122 15425 7273 -33983 -26390 27761 37912 -5925 -20162 8595 7003
1479G003l5689P777N2250O576m7768j6126L1477K668l1780J0146M9067on2165
$$ 7003 -28686 -20909 31341 37917 -9851 -25977 5500 8168 -23612 -13466 35601 35595 -16570
1492a6570j5605L4838R285k7205P022L9899l617m9895j2000L8293J2718k6653
$$ -16570 -32175 2663 11948 -15257 -8235 31664 28047 -21848 -33848 4445 17163 -9490
1504i490K770L5969n584n0119j0588M3974J8403k7929n365K8897n343m2802l942
$$ -9490 -6720 29249 23665 -26454 -37042 6932 25335 -2594 -7959 20938 15595 -27207 -31149
1517c1149M4023J3881l0134o314K6730o714m0876Q52M7296J5373l5112j4686K4347
$$ -31149 12874 26755 -3379 -9693 17037 10323 -30553 -29701 17595 32968 -2144 -16830 7517
1530G517J101l1748J170M1942J0823l5378j3670K4267Ll0414O532M4537N228m3427
$$ 7517 8618 -23130 -21960 19982 30805 -4573 -18243 6024 6027 -24387 -17855 26682 31910 -11517
1544a1517j6413K9629R449k4834L46L4750M739l7595j4447K5714R502j9537L547
$$ -11517 -27930 1699 11148 -13686 -13340 21410 26149 -11446 -25893 -179 9323 -10214 -6667
1557f667L0404k456m0899j0126L4471J4332k4514m884K7095L52l5657q801L1259
$$ -6667 23737 21281 -19618 -29744 4727 19059 -5455 -10339 16756 17108 -18549 -27350 3909
1570C909J3671j9884m211K1373l968l2460k056L5245J2442k5721j1160K0402L397
$$ 3909 17580 -2304 -6515 14858 10890 -21570 -23626 11619 24061 -1660 -12820 7582 10979
1583A0979k6749n424L0304J3330k1935j2054J5529J529k1152J828K9718O486k8072
$$ 10979 -15770 -21194 9110 22440 505 -11549 3980 5509 -15643 -13815 15903 22389 -5683
1596e683j0497K0438N097k1324j084K7733P630k6525j3046J7569Q190j4756j143
$$ -5683 -16180 4258 9355 -11969 -13053 14680 22310 -4215 -17261 308 8498 -6258 -7401
1609g401K1169K836k5361j0215K0365R702j5621k669K0103K469k4440q829K0608
$$ -7401 13768 16604 -8757 -18972 1393 11095 -4526 -7195 12908 15377 -9063 -17892 2716
1622B716J0456j4072m075J4632J50k0772m402K0421Q233j5116n426J4469J960
$$ 2716 13172 -900 -4975 9657 9807 -10965 -15367 5054 13287 -1829 -7255 7214 9174
1635I174j9340m443K0105R373j5369q134J1923K995j3908k941J7438O434j4587
$$ 9174 -10166 -14609 5496 14869 -500 -8634 3289 6284 -7624 -10565 6873 13307 -1280
1648a280o832J1179K860j3171j586J5831M674j4989p207J0827M601j0524j920
$$ -1280 -8112 3067 5927 -7244 -8830 7001 11675 -3314 -10521 306 4907 -5617 -7537
1661g537J3616M582j3299p084J0250N480q892k600J1077K765j2890n682J0670
$$ -7537 6079 10661 -2638 -9722 528 6008 -2884 -5484 5593 8358 -4532 -10214 456
1674D56N193q179k479R589J897j1535m077J0127N445p645l673P009K094q328l331
$$ 456 5649 -2530 -5009 4580 6477 -5058 -9135 992 6437 -1208 -4881 2128 4222 -4106 -7437
1689g437Q788N187p014l532O622K081q533k757Q604L888p028m248N597K324n780
$$ -7437 1351 6538 -476 -4008 2614 4695 -3838 -6595 2009 5897 -1131 -5379 218 2542 -3238
1704c238j667P137K671n599k764M813K119n326j782O298K467o167l651M848L004
$$ -3238 -4905 2232 4903 -696 -3460 1353 3472 -1854 -3636 2662 5129 -1038 -4689 159 3163
1719C163m458k043M886K298m489k400L247K231l138j066L741O91l868j798M504
$$ 3163 -1295 -3338 1548 3846 -643 -3043 204 2435 -703 -1769 1972 2663 -1205 -3003 1501
1734A501J936l364j127L063J352l268k234K600J658k249j785J843J317k036j127
$$ 1501 3437 73 -1054 2009 3361 93 -2141 459 2117 -132 -1917 -74 1243 -793 -1920
1749a920K952J668j954j384K075R36k326p36J560J369k181j170J147O60p70o76
$$ -1920 1032 2700 746 -638 1437 2373 47 -689 871 2240 59 -1111 36 696 -74 -750
1765g50J121J032j547p23R80R25j542j015J355Q64r60q36J105J041l91p89R19
$$ -750 371 1403 -144 -867 113 1038 -504 -1519 -164 700 -260 -1096 9 1050 659 -130 789
1782G89K31p13n30K86n30n76o9L93K44r26nJ085Q08m93n56O67P77l30q28j28M94
$$ 789 1020 307 -223 63 -467 -1043 -1112 -719 -475 -1401 -1406 -321 487 -6 -562 105 882 552 -276 -404 90
1803I0m98o0j25N60n53j51M96M07n65j77K86j82l59l16M11J83l14l0J043K01L3
$$ 90 -408 -468 -593 -33 -586 -737 -241 166 -399 -576 -290 -472 -831 -1147 -736 -553 -867 -897 146 347 380
1824C80j18N74N17r00j151N27R57j202j088K23J046o88j82R55P11m01l30R45O75
$$ 380 262 836 1353 453 -698 -171 786 -416 -1504 -1281 -235 -923 -1105 -150 561 160 -170 775 1450
1843A450j200q03J226N19q22j385Q66P14k75j78Q07P6j655q4J729M20k430j065
$$ 1450 250 -553 673 1192 370 -1015 -149 565 290 112 919 995 -660 -744 985 1405 -1025 -2090
1861b090K399J980k684j970K465K600q34k212J436J144j596j081J917N18k774
$$ -2090 309 2289 -395 -2365 100 2700 1866 -346 1090 2234 638 -443 1474 1992 -782
1876g82j463K296J996l226k104L296L329j951k826J273J636j339k12K424J08m396
$$ -782 -2245 51 2047 -1179 -3283 13 3342 1391 -1435 -162 1474 135 -77 2347 2455 -1941
1892a941q21N003J230n789k105O286M838o084o737L580O102j405m629R95K637
$$ -1941 -2762 2241 3471 -2318 -4423 1863 6701 617 -6120 -2540 3562 2157 -2472 -1477 1160
1907A160j669k200L012J854l380m01N314J694p423m366O558N427m436n292K921
$$ 1160 -509 -2709 303 2157 -1223 -1624 3690 5384 -2039 -6405 153 5580 1144 -4148 -1227
1922a227K866m199k511O016L072o007k343P098L194r884n315J0104R736p339j1079
$$ -1227 1639 -2560 -5071 945 4017 -1990 -4333 2765 5959 -3925 -9240 864 10600 3261 -7818
1937g818K889Q715j845n067K297M407k971k842K830j43o800O28J1599L380j3654
$$ -7818 -4929 3786 1941 -3126 -829 3578 607 -2235 595 452 -6348 -5720 5879 9259 -4395
1952d395p590J0819R370p409p428P880Q110p741r368N472P054m953m725Q268M457
$$ -4395 -11985 -1166 8204 795 -6633 1247 9357 1616 -7752 -2280 4774 -179 -4904 3364 7821
1967G821j1714r642J0929J2742n735j0118M473P390n789p380N216P031l585k778
$$ 7821 -3893 -13535 -2606 10136 4401 -5717 -1244 6146 357 -7023 -1807 5224 1639 -1139
1981a139O244p66j3380k172J7639R881j5557j3185J1276J1925j1304j2886J0701
$$ -1139 5105 4339 -9041 -11213 6426 16307 750 -12435 -1159 10766 -538 -13424 -2723
1994b723J5627o388j4043K546P304l993l122J1175P607j2952j1773Q909R620q723
$$ -2723 12904 6516 -7527 -4981 2323 -1670 -4792 6383 13990 1038 -10735 -1826 7794 -929
2008i29p170J1573R123j2467j2684P762J0403o034l855J2473M770j8667j2011
$$ -929 -8099 3474 12597 130 -12554 -4792 5611 -423 -4278 8195 12965 -5702 -17713
2021a7713J6698J5977j2068j3482J2229J3185j4224j7944J0165J8745k313j1719
$$ -17713 -1015 14962 2894 -10588 1641 14826 602 -17342 -7177 11568 9255 -2464
2033b464K666M057j0540o615J3682J1731j0956j0317J0207P703j5780j0122J8779
$$ -2464 202 4259 -6281 -12896 786 12517 1561 -8756 1451 9154 -6626 -16748 2031
2046B031J7856j2485j7942O623J0378j0621q943J6053J4891j4571j8670R057J3858
$$ 2031 19887 7402 -10540 -3917 6461 -4160 -13103 2950 17841 3270 -15400 -6343 7515
2059G515r369j0667J5379J6018j3693k0604N249J5528l654o919J0771Q406j5883
$$ 7515 -1854 -12521 2858 18876 5183 -15421 -10172 5356 1702 -5217 5554 13960 -1923
2072a923j4937J2163J4769q624r367J4809R582k0733j9084J5247K1973p517j4454
$$ -1923 -16860 -4697 10072 1448 -7919 6890 16472 -4261 -23345 -8098 13875 6358 -8096
2085h096R012J0583j5231j5566J4994K0932p257j5626O536R183j4710j3562J6857
$$ -8096 916 11499 -3732 -19298 -4304 16628 9371 -6255 281 9464 -5246 -18808 -1951
2098a951K0031r499j8114N851R845j1788j0108J8196J8216j3826j9587P444J2139
$$ -1951 18080 8581 -9533 -3682 6163 -5625 -15733 2463 20679 6853 -12734 -5290 6849
2111F849j0758j0041J7871J8393j5170k2449O685J6238o812r919J4462J4908j6571
$$ 6849 -3909 -13950 3921 22314 7144 -15305 -8620 7618 806 -9113 5349 20257 3686
2124C686k2276Q252J8259n148j0873J2488J2807j6695k0093J1183K0145m309j1825
$$ 3686 -18590 -10338 7921 2773 -8100 4388 17195 500 -19593 -8410 11735 7426 -4399
2137d399R385R397j7622j7962J4361K1614o418j5375P382J0685j4856j6228J5099
$$ -4399 4986 14383 -3239 -21201 -6840 14774 8356 -7019 363 11048 -3808 -20036 -4937
2150d937K2681o977j7678M401R848j2966j2420J7198K1376j1261k0080N489J3265
$$ -4937 17744 10767 -6911 -2510 7338 -5628 -18048 -850 20526 9265 -10815 -5326 7939
2163G939j0163j2735J5376J9938j0743k2089K695J3359n822q929J4434J5170j3851
$$ 7939 -2224 -14959 417 20355 9612 -12477 -9782 3577 -2245 -11174 3260 18430 4579
2176D579k0121P174J6329o521j0422J3627J4416j5766k2178P409J9376l383j0924
$$ 4579 -15542 -8368 7961 1440 -8982 4645 19061 3295 -18883 -11474 7902 4519 -6405
2189f405R228J0984j4828j8527J0698K0471m722j3237P208J1080j3251j8318J1229
$$ -6405 2823 13807 -1021 -19548 -8850 11621 6899 -6338 870 11950 -1301 -19619 -8390
2202h390K1444k691j4870L058Q789j0262j2323J2773J8005p935j5789M644J0021
$$ -8390 13054 10363 -4507 -1449 7340 -2922 -15245 -2472 15533 7598 -8191 -3547 6474
2215F474j0985j2539J4427K0196p463k0316K558J3069m779j0614J0411J5632p917
$$ 6474 -4511 -17050 -2623 17573 10110 -10206 -7648 5421 642 -9972 439 16071 8154
2228H154j8819K258J2762m193r341J0937J3936j0493j8822M299J5505k395r442
$$ 8154 -10665 -8407 4355 162 -9179 1758 15694 5201 -13621 -9322 6183 3788 -5654
2241e654P461J0861j0864j5606N951J5459k527r899P174J0165j1169j6524Q219
$$ -5654 1807 12668 1804 -13802 -7851 7608 5081 -4818 2356 12521 1352 -15172 -6953
2254f953J7988k252j3573K415R938p735j3341P269J5813k002j1244K400P541p529
$$ -6953 11035 8783 -4790 -2375 7563 -172 -13513 -6244 9569 7567 -3677 -1277 6264 -1265
2268a265r600R435J4463n345j4151K065R476n215r825P842J4101m971j4279Q28
$$ -1265 -10865 -1430 13033 7688 -6463 -4398 5078 -137 -9962 -2120 11981 7010 -7269 -6441
2282f441J0387l087q392O950J1513n996j3914J964J0929j224p898N422J0148n697
$$ -6441 3946 859 -7533 -583 10930 4934 -8980 -7016 3913 2689 -5209 213 10361 4664
2296D664j2967K046J0709o54q005L736P895o607j1386L886J1800r10q387L059
$$ 4664 -8303 -6257 4452 3798 -4207 -471 7424 817 -10569 -6683 5117 4207 -4180 -1121
2310a121Q036n055j1080L983J2242j128r145J055O151l886p941L856J0225j395
$$ -1121 6915 1860 -9220 -5237 7005 5877 -3268 -2213 3938 52 -7889 -4033 6192 4797
2324D797q429J063N911l342p125M392R443k455r271L75P525j429o687L687Q484
$$ 4797 -3632 -2569 3342 0 -7125 -2733 6710 4255 -5016 -4641 2884 1455 -5232 -1545 6939
2339F939k192q548J77O316j339n635K864O469k649q073P19O942j42m760K184N724
$$ 6939 4747 -3801 -3624 2692 1353 -4282 -1418 5051 2402 -5671 -4952 1990 1848 -2912 -728 4996
2355D996j949p161O78O632j49n194J428M797k748o175J461P129m29n082O37M271
$$ 4996 3047 -4114 -3436 3196 3047 -2147 -719 4078 1330 -4845 -3384 3745 3316 -1766 -1129 3142
2371C142j858n229J406N290o1m431J40L412j013l374J405N027m00m503j66M017
$$ 3142 1284 -3945 -2539 2751 2690 -1741 -1601 1811 798 -2576 -1171 3856 3456 -1047 -1213 2804
2387B804j238m289J280M317n88m692o0L514K1l105J297L845q61l343j99L043j84
$$ 2804 1566 -2723 -1443 2874 2286 -2406 -2466 1048 1069 -2036 -739 3106 2245 -1098 -1297 1746 1562
2404A562k612L55K818o53l270J13K545O66k579N79K274q48k874k5K891l87k157
$$ 1562 -1050 -695 2123 1470 -1800 -1687 858 1524 -1055 -476 1798 950 -1924 -1949 942 555 -1602
2421a602N70K021m93k095O99K553P7j910J17J475k44k108n10K018l01j324p52
$$ -1602 -1032 989 496 -1599 -900 1653 1730 -180 -63 1412 1168 -940 -1450 568 267 -1057 -1809
2438a809J751mj455M40J912M51j780MJ231k19j176j62J228J95j319o6P25N14j018
$$ -1809 -58 -62 -1517 -1077 835 1286 -494 -490 741 522 -654 -816 412 607 -712 -778 -53 461 -557
2457e57j2Q03K24j144l17P23J80j026j72J306K79p75j98J054M92p89J12L58ro24
$$ -557 -569 234 458 -686 -1003 -280 -100 -1126 -1298 8 287 -488 -686 368 860 71 183 541 532 -92
2477i2l53M94j22r55l2P71N8j38k94R17K56m09K05j38L91k82n32M51J30k48l96
$$ -92 -445 49 -73 -1028 -1060 -289 -231 -369 -663 254 510 101 306 168 559 277 -255 196 326 78 -318
2498c18O10L71k73k99Q3J74l16j32j96k2k2M1J88J54n15N90J069j07n75n36J279
$$ -318 292 663 390 91 174 348 32 -100 -296 -318 -340 -299 -111 43 -472 118 1187 1080 505 -31 1248
2519A248J06q90j044O1P44k35m44j17J14K08M19K74k96n99P49N51l37p97J9O45
$$ 1248 1354 464 -580 -519 225 -10 -454 -571 -457 -249 170 444 148 -451 298 849 512 -285 -266 379
2539C79j06m93LM64N73j143L25J084o50j656J09J932nj908q03J460J198p09j318
$$ 379 273 -220 -217 247 820 -323 2 1086 436 -1220 -1111 821 816 -1092 -1895 -435 763 54 -1264
2558a264R55J349R1o22l82k75l3N27M88j027j758O29K168l09k183q9K574P07k262
$$ -1264 -309 1040 1131 509 127 -148 -181 346 834 -193 -1951 -1322 846 537 -1646 -1735 839 1546 -716
2577g16j068J809R08j647J17J540m85j925M5K368Q49k679m39J873J122k070j473
$$ -716 -1784 25 933 -714 -597 943 458 -1467 -1422 946 1795 -884 -1323 550 1672 -398 -1871
2594a871J079J009n71K76K34j162j468J585L363j115l939J343M065m74m471j197
$$ -1871 -792 217 -354 -78 156 -1006 -2474 -889 2474 1359 -2580 -1237 2828 2354 -2117 -3314
2610c314M585J747l301k465J988J771j862j9K080M21k475k47K416L39l577M00
$$ -3314 1271 3018 -283 -2748 -760 1011 -851 -870 1210 1631 -844 -1091 1325 1664 -1913 -1513
2626a513L916L40l971r53K988N89k131N20L233j011m760L08M779k56n010M62N497
$$ -1513 2403 2743 -1228 -2181 807 1396 -735 -215 3018 2007 -2753 -2445 2334 2078 -2932 -2470 3027
2643C027O59o181k569O045L604l485k425K697Q66l964l14L660L50l211qM336k043
$$ 3027 3686 -2495 -5064 981 4585 1100 -1325 1372 2238 -1726 -2040 1620 1970 -1241 -1249 3087 1044
2660A044n616Q96O822J730o357j296M668N67n608j78O302J651o048j819M813R74
$$ 1044 -4572 -3676 3146 4876 -1481 -2777 1891 2458 -3150 -3328 2974 4625 -1423 -3242 1571 2545
2676B545n870nP579J649p178l983M943K382m008p79N655J45n691j597N209J120
$$ 2545 -3325 -3330 4249 5898 -1280 -5263 -320 2062 -1946 -2725 2930 3075 -2616 -4213 996 2116
2692B116m605J082O605q27q764k066Q104L055o461j668O814P33q246k706P883
$$ 2116 -2489 -1407 5198 4371 -4393 -6459 1645 4700 -1761 -3429 3385 4118 -4128 -6834 1049
2707A049M052n691j970N467Q8q073j395R083L227o447k684N291M90p302k40R054
$$ 1049 5101 -590 -2560 2907 2995 -5078 -6473 2610 5837 -610 -3294 1997 2487 -4815 -5055 3999
2723C999K175p557k630N671L74q012M19J0712J993r834l499P099K363o776p37
$$ 3999 6174 -1383 -4013 1658 2032 -5980 -5561 5151 7144 -2690 -6189 910 3273 -3503 -4240
2738d240J0175J949r892m509O607L023o016l12Q735J254j0674l888Q420L718n869
$$ -4240 5935 7884 -2008 -6517 90 3113 -2903 -3215 5520 6774 -3900 -7788 632 4350 -1519
2753a519r88P816K89j0721l308R821M336o714k041P962M97j1192k583J1058N280
$$ -1519 -2507 5309 5598 -5123 -8431 1390 5726 -988 -3029 4933 5430 -5762 -8345 2713 7993
2768G993p864l413O443P60j0187j597J1202N002q639m277O531J576r267r44J1685
$$ 7993 129 -3284 3159 3919 -6268 -7865 3337 8339 -300 -4577 1954 3530 -5737 -6681 5004
2783E004N113j0363n881O943K190p726q56J1238L380j0767n571P479K938p287
$$ 5004 10117 -246 -6127 816 3006 -4720 -5576 5662 9042 -1725 -7296 183 3121 -4166
2797d166l61J1359K294j2614n704Q869M677o663j415R845J883j1946n462R955
$$ -4166 -4527 6832 9126 -3488 -9192 -323 4354 -2309 -3724 6121 8004 -3942 -9404 551
2811E51N341p187j395Q230O47j2326m499J1100O549p045l977P651J250j0350l268
$$ 551 5892 -1295 -2690 5540 6187 -6139 -10638 462 7011 -34 -4011 3640 4890 -5460 -8728
2826h728J1294N865p928m413O538P36j0103k197J2860O040j0060o068O951K832
$$ -8728 2566 8431 503 -3910 2628 3364 -6739 -8936 3924 9964 -96 -6164 787 3619
2840C619q940j971J1653N337r951o802O565L389p412j324J1507M115j1331o468
$$ 3619 -5321 -7292 4361 9698 -253 -7055 -490 2899 -4513 -5837 5670 9785 -1546 -8014
2854h014P207N099o456k287R796L445j1903o674Q745N112n739j710Q871J872j1713
$$ -8014 -807 4292 -2164 -4451 5345 8790 -3113 -9787 -1042 4070 -1669 -3379 5492 7364 -4349
2869d349n519J0277O531o774l714Q129J888j1316m821J0118P188o845m051O018
$$ -4349 -9868 409 6940 166 -3548 4581 6469 -4847 -9668 450 7638 793 -3258 2760
2883B760J421r710k955J1125N796p770n338O090K288q597k681J1265N589q504
$$ 2760 4181 -5529 -8484 2641 8437 667 -4671 1419 3707 -4890 -7571 3694 9283 779
2897G79o290N773L225p195j983J0406M364r513o620O085M425o210j939R169M101
$$ 779 -5511 262 3487 -3708 -5691 4715 9079 -434 -7054 -969 3456 -2754 -4693 4476 8577
2912H577r309o660O254N063n084k134Q057K479r523n850P315N768n418k335O813
$$ 8577 -732 -7392 -1138 3925 -1159 -3293 4764 7243 -2280 -8130 -815 4953 -465 -2800 4013
2927D013K414r577n203P963O225n274l920O293J580q479l781Q397O189o130l859
$$ 4013 6427 -3150 -8353 -390 5835 561 -3359 2934 4514 -3965 -7746 651 6840 710 -3149
2942c149M954K076p832k870Q817N082o428m902M203K808o237k674Q469M521o340
$$ -3149 1805 3881 -3951 -6821 1996 7078 650 -4252 -49 2759 -3478 -6152 2317 6838 498
2957D98n712M876L191n233k036P370L800p373m944M502M106m979j793O610K943
$$ 498 -5214 -338 2853 -2380 -4416 2954 6754 -619 -5563 -1061 3045 -1934 -3727 2883 5826
2972E826p003m900M985M177l812k715O215K253o976m452N491N017m208k534M914
$$ 5826 -1177 -6077 -1092 3085 -727 -3442 2773 5026 -1950 -6402 -911 4106 -102 -2636 2278
2987B278J949o400l366N486M869m198l382L839K407n821k864N371M804m371l530
$$ 2278 4227 -2173 -5539 -53 4816 618 -2764 1075 3482 -2339 -5203 168 4972 601 -2929
3002b929L431K418n230k105N369M324m544m033K985K441l477k215N103L271m151
$$ -2929 502 2920 -2310 -4415 954 5278 734 -3299 -314 2127 -1350 -3565 1538 4809 658
3017F58m179K945K711l180j941M638K426m412l429L140L153k756j997L933K234
$$ 658 -3521 -576 2135 -1045 -2986 1652 4078 -334 -3763 -623 2530 -226 -2223 1710 3944
3032C944l992l568L263L191k779k086L252J955m199k781L632K933k318k225K965
$$ 3944 -48 -3616 -353 2838 59 -2027 1225 3180 -1019 -3800 -168 2765 447 -1778 1187
3047A187J315l078k707L538K933k549k222J602K080l161j819L335K571k524k478
$$ 1187 2502 -576 -3283 255 3188 639 -1583 19 2099 -1062 -2881 454 3025 501 -1977
3062a977J953J748k656j700K897K502k409k645K128J622j702j696K595K108k380
$$ -1977 -24 1724 -932 -2632 265 2767 358 -2287 -159 1463 -239 -1935 660 2768 388
3077C88k352J595J621j472j414J839J664k285j647J663J253j007j143J522J254
$$ 388 -1964 -369 1252 -220 -1634 205 1869 -416 -2063 -400 853 -154 -1297 225 1479
3092A479k003j332J590J747j370j176J176J116j194j817J833J331r78j300P77
$$ 1479 -524 -1856 -266 1481 111 -1065 111 1227 33 -1784 49 1380 402 -898 -121
3107a21J125j078j534J291J626j467j205J114J313j400o67Q06J784j186j182Q50
$$ -121 1004 -74 -1608 -317 1309 -158 -1363 -249 1064 -336 -1003 -197 1587 401 -781 69
3123F9O35m98j294J232P35o87j254P15Q54m29p92R40L06m8j098N34P27o48k99
$$ 69 704 206 -1088 144 879 192 -1062 -347 507 78 -714 226 532 484 -614 -80 647 -1 -300
3142c00K52P87n75r25O41Q27n6j080P06L36l66o34L82M55j27o91J12J046o89m85
$$ -300 -48 739 164 -761 -120 707 651 -429 277 613 247 -387 -5 450 323 -368 -256 790 101 -384
3162c84N30M43m51m38L78P18p57l67K32Q07p9n33l58P72l7p02M1N85l58k29L41
$$ -384 146 589 138 -300 78 796 39 -328 -96 711 632 99 -259 513 476 -226 -185 400 42 -187 154
3183A54K40k43m93K67O43m81n72M28M35K31n73o9J4K3m30J32O43m18n55M68N82
$$ 154 394 151 -342 -75 568 87 -485 -57 378 609 36 -33 -19 4 -426 -294 349 -69 -624 -156 426
3204D26n14j52j81P56p6o08kN92K25n48j39J78j53j54K52J43o31J14O27N00o20
$$ 426 -88 -240 -421 335 259 -349 -351 241 466 -82 -221 -43 -196 -350 -98 45 -586 -472 155 655 35
3225C5n30K48P16m39o77L43O06j40p37K78O72l48o11P02L09o03o08K98R61l90
$$ 35 -495 -247 469 30 -647 -304 302 162 -575 -297 375 27 -584 118 427 -176 -784 -486 475 85
3245H5q31N16L98k35k51L89M95r48p8N69K05m63n24O81Q31p00r35L01J134k63
$$ 85 -746 -230 168 -67 -318 71 566 -382 -460 109 314 -149 -673 8 839 139 -796 -495 639 376
3265C76p44l0R22m62l49L33L83k55l39M19L34m25j120Q94J087m12j437P56J017
$$ 376 -368 -398 524 62 -287 46 429 174 -165 254 588 163 -957 -63 1024 612 -825 -69 948
3284I48m64j071K84J062l99j173P02R18o08j519J522J406r77j390M62J331p54
$$ 948 484 -587 -303 759 360 -813 -111 807 199 -1320 202 1608 631 -759 -297 1034 280
3301B80j144O22J292l26j406K79R36o41r66J213J418j429j705J053J800j247j446
$$ 280 -864 -242 1050 724 -682 -403 533 -108 -1074 139 1557 128 -1577 -524 1276 29 -1417
3318a417J076K135j179k145Q42K012r93j746J317J542j645j972J619K064j181
$$ -1417 -341 1794 615 -1530 -688 1324 331 -1415 -98 1444 -201 -2173 -554 1510 329
3333C29j457N30K002j340j927J175K294o34k338J389J142j505k062K039K674j725
$$ 329 -1128 -598 1404 64 -1863 -688 1606 972 -1366 23 1165 -340 -2402 -363 2311 586
3349E86k448J239K025j491k378J721L130j271k760M76K114j003j877J802K806
$$ 586 -1862 -623 1402 -89 -2467 -746 2384 1113 -1647 -1171 943 -60 -1937 -135 2671
3364B671j830l476J580K564j198k519K366K583j883l644J308L169q74k490J853
$$ 2671 841 -2635 -1055 1509 311 -2208 158 2741 858 -2786 -1478 1691 817 -1673 180
3379A80K869k686l763J798L847r08l024J508K914k309l570J764L967r14l101Q16
$$ 180 3049 363 -3400 -1602 2245 1337 -1687 -179 2735 426 -3144 -1380 2587 1673 -1428 -612
3395f12L015k357l548K571M260j370l710Q48K941k146l485K888M387j396m436
$$ -612 2403 46 -3502 -931 3329 1959 -1751 -903 2038 -108 -3593 -705 3682 2286 -2150
3410b150P41L277k065k766K650M746k734m863J460L854j697l264K729M474k485
$$ -2150 -1409 1868 -197 -2963 -313 4433 1699 -3164 -1704 2150 453 -2811 -82 4392 1907
3425A907n180J184M148j049l374K799L863l053n148J542N051j207l809K498L487
$$ 1907 -3273 -2089 2059 1010 -2364 435 4298 1245 -3903 -2361 2690 1483 -2326 172 3659
3440C659l110m999K182N253r36m020J845L510l256n118K748O110j211m861J214
$$ 3659 549 -4450 -2268 2985 2049 -1971 -126 3384 128 -4990 -2242 3868 2657 -2204 -990
3455i90L970l144m762L182O267j594n481J057L561k440m008K873O119j800n904
$$ -990 2980 -164 -4926 -1744 4523 2929 -2552 -1495 2066 -374 -4382 -1509 4610 2810 -3094
3470c094Q97M384j738m410L254O152k668o724R67M802j659l663L535N103l230
$$ -3094 -2197 2187 449 -3961 -707 5445 2777 -3947 -2980 1822 163 -3500 35 5138 1908
3485A908o543J088N847j010l877K664M568k933o738J360O289n31m313K394L855
$$ 1908 -4635 -3547 2300 1290 -2587 77 4645 1712 -5026 -3666 2623 2092 -2221 173 4028
3500D028l410o499L005O528j023m770J278M672l435n681K838P021j111n680R17
$$ 4028 618 -5881 -2876 3652 2629 -2141 -863 3809 374 -5307 -2469 4552 3441 -2239 -1322
3515a322M198k992n038L281P120j666o490R89M248k107m493L340O602k117o640
$$ -1322 2876 -116 -5154 -1873 5247 3581 -2909 -1920 2328 221 -4272 -932 5670 3553 -3087
3530c087J60M934j257m424L229N920k542p129Q74N292o88m435L058N673l051p434
$$ -3087 -2927 2007 750 -3674 -445 5475 2933 -4196 -3322 1970 1282 -3153 -95 5578 2527 -4907
3546d907J035O268n74m045J898N532l398p103J400O835m2m936J489M337k843o435
$$ -4907 -3872 2396 1822 -2223 -325 5207 1809 -5294 -3894 2941 2899 -2037 -548 3789 946 -5489
3562e489K036P364j64n698R36M185l076n139K236P216j76o178J88M500k624m585
$$ -5489 -3453 3911 3747 -1951 -1015 3170 94 -5045 -2809 4407 4231 -1947 -1759 2741 117 -4468
3578d468K749O465j002o554M19M188j212m514K785O531k103o743N97M377p47m000
$$ -4468 -1719 4746 3744 -2810 -2391 1797 585 -3929 -1144 5387 3284 -3459 -2862 1515 768 -3232
3594c232K533N740k393o570M82N165k91l733J619N007k564o310N20O076J71m159
$$ -3232 -699 5041 2648 -3922 -3440 1725 1434 -2299 -680 4327 1763 -4547 -4027 2049 2220 -1939
3610a939J443M179k282n919J242N871O9m326J122L531k208n585K022O028L4n122
$$ -1939 -496 3683 1401 -4518 -3276 2595 2664 -1662 -540 2991 783 -4802 -2780 3248 3282 -1840
3626a840L86L566j741m777J811O083M5n332l68L721q98m015J958N367p72n566
$$ -1840 -1454 2112 371 -4406 -2595 3488 3533 -1799 -2167 1554 656 -3359 -1401 3966 3194 -2372
3642b372J3L638m23l650J861M656j137m920m56M093k82l049J530M131j317n312
$$ -2372 -2359 1279 856 -2794 -933 3723 2586 -2334 -2790 1303 1021 -2028 -498 3633 2316 -2996
3658b996K93M416L4l242P28L868j233n139N52M537K24l301M99L169j173m441R13
$$ -2996 -2703 1713 1747 -1495 -767 3101 1868 -3271 -2719 1818 2042 -1259 -760 2409 1236 -3205 -2292
3675b292M511R7l332l2L381j337l812Q43M534K02l829j15K719r94l342J132M262
$$ -2292 2219 2316 -1016 -1048 2333 996 -2816 -1973 2561 2763 -1066 -1181 1538 544 -2798 -1666 2596
3692B596j23l641k75K433m3l287J116L569J63m262k54K928o2k465O61L461n42
$$ 2596 2473 -1168 -1443 990 947 -2340 -1224 2345 2508 -1754 -2008 920 858 -1607 -946 2515 1973
3709A973l890j97L028K96k626K15L260o73l430m2K981N75k502K11K574n32l531
$$ 1973 -1917 -2114 914 1210 -1416 -1201 2059 1386 -2044 -2086 895 1470 -1032 -821 1753 1221 -2310
3726b310O9L569R8k336J08K204q80k431L70K833L62k342m18K080q79j996M95K896
$$ -2310 -2241 1328 1426 -910 -802 1402 522 -1909 -1539 1294 1656 -686 -1104 976 97 -1899 -1404 1492
3744A492K66k879r6K174n80j934M66K649k12k040n17J934j83j751M27J730K30
$$ 1492 1758 -1121 -1217 957 377 -1557 -1091 1558 1346 -694 -1211 723 540 -1211 -784 946 1176
3761A176k272m3J884j35j383K23J940m35k034n1J712R0j236rJ283K85j834l23
$$ 1176 -1096 -1139 745 610 -773 -550 1390 955 -1079 -1130 582 672 -564 -573 710 995 -839 -1162
3779a162J964k3j268K00R37J52j517j13J462K57j453L10P92O5j420K64J077J64
$$ -1162 802 779 -489 -289 648 800 -717 -830 632 889 -564 -254 538 603 -817 -553 524 688
3797F88j009j78R21o2q66k9J111O41j706j39R15L44p16l48J402m56p47k72P74
$$ 688 -321 -499 422 360 -506 -535 576 1217 -489 -628 287 631 -85 -433 969 513 -234 -506 268
3816B68L94j309J55J107p5p87j45J018k12n01j47N61J95q54k08P61J00n64l35
$$ 268 662 -647 -492 615 540 -247 -392 626 414 -87 -234 327 522 -332 -540 221 321 -243 -578
3835e78R98No68k85N80Q1j68l78M22N16p11k83N99J55o70L6N30J25m46k71K77
$$ -578 420 425 -243 -528 52 133 -35 -413 9 525 -186 -469 130 285 -385 -349 181 306 -140 -411 -134
3856a34K60j23m00L88J48m57O7L48J15k90k13M01J58k78p3K27j27l60P2K11J82
$$ -134 126 3 -397 -9 139 -318 -251 97 212 -78 -291 110 268 -10 -83 144 17 -343 -271 -60 122
3877A22k96k74M83K87m30j92l5M15R5o94N28rl18J65R4K42m33L09Q5L6Nn95K23
$$ 122 -174 -448 35 322 -108 -300 -335 80 175 -519 9 0 -318 -153 -59 183 -250 59 144 180 185 -410 -187
3900a87M47j80N8K67k66j26N9J20k75R1k4K17K58o41J02J74K64o56J66K61K34
$$ -187 260 80 138 405 139 13 72 192 -83 8 -16 201 459 -182 -80 94 358 -298 -132 129 363
3921C63k05m23M55j14j09l1L72j87j38K44J57k42j59k31O08l0j27o03N03J11k88
$$ 363 158 -265 190 76 -33 -64 308 121 -17 227 384 142 -17 -248 360 330 203 -400 103 214 -74
3942g4J50K31N3o21O11l06J29m27k43Q14O6k83o41O73L71m01j46o7L40l64l79
$$ -74 76 307 360 -261 350 44 173 -254 -497 317 383 100 -541 132 503 102 -44 -111 229 -135 -514
3963e14O53nk44k03M79J49n27m94R59K01n60r3K41P6k60l39P16L4m90j38O46r0
$$ -514 139 134 -110 -313 166 315 -212 -706 253 454 -106 -199 42 118 -142 -481 235 269 -221 -359 287 197
3985A97n03q7O63J42q89l06J023J40p77j84P54L87j003m14J088j05p49m2Q79K99
$$ 197 -306 -393 270 412 -477 -783 240 380 -397 -581 173 560 -443 -857 231 126 -623 -665 214 513
4005E13j419P1J104L05q25l76J197j24r51l58J178N41q72p79J418j85j238j26
$$ 513 -906 -835 269 574 -251 -627 570 446 -505 -863 315 856 -16 -795 623 438 -800 -926
4023i26J241Q28j188p46J204N6r60k61J277P08j573m58J221K56j360Q1J308M20
$$ -926 315 1143 -45 -791 413 469 -491 -752 525 1233 -340 -798 423 679 -681 -600 708 1128
4041A128j548o03R87O15j183k50J829M05j881m41J045P89j191l91J686J4j506
$$ 1128 -420 -1023 -36 579 -604 -854 975 1380 -501 -942 103 892 -299 -690 996 1010 -496
4058d96p22J650P10j222m48J406K55j648j019J739J146j437n86J614K31k173r21
$$ -496 -1218 432 1142 -80 -528 878 1133 -515 -1534 205 1351 -86 -672 942 1173 -1000 -1921
4075a921K403J054j800p15J570K06k018l70K330J000j747j110J522M58k151J2
$$ -1921 482 1536 -264 -979 591 797 -1221 -1591 739 1739 -8 -1118 404 862 -1289 -1277
4091a277K334O33k090j007J634O60j855l64K273J056k311j497J709J064j836K9
$$ -1277 1057 1690 -400 -1407 227 887 -968 -1332 941 1997 -314 -1811 -102 962 -874 -845
4107h45K085M27k554j146J901J426j751o74K236M18k467j458K617J409j991l87
$$ -845 1240 1667 -887 -2033 -132 1294 -457 -1131 1105 1523 -944 -2402 215 1624 -367 -754
4123g54J727M75k585j003K123J838j744j190K060K81k438r41K706J534j699j622
$$ -754 973 1448 -1137 -2140 -17 1821 77 -1113 947 1228 -1210 -2151 555 2089 390 -1232
4139a232J639M44k519o19L122J615k576j572K058R69k192j144L217J552k974j891
$$ -1232 407 851 -1668 -2287 835 2450 -126 -1698 360 1329 -863 -2007 1210 2762 -212 -2103
4155b103J925J353j968p03K939R05k674k080K266J927k372m20J979J537l277j802
$$ -2103 -178 1175 -793 -1496 1443 2348 -326 -2406 -140 1787 -585 -1005 974 2511 -766 -2568
4171b568K638J527k106n76K379O43l008j615L002K112k440j162K295O84l186j443
$$ -2568 70 1597 -509 -1085 1294 1937 -1071 -2686 316 2428 -12 -1174 1121 1805 -1381 -2824
4187b824L134K162k076j552J923N10k632j163L317K101k457k387K306Q11k811
$$ -2824 310 2472 396 -1156 767 1277 -1355 -2518 799 2900 443 -1944 362 1173 -1638
4202a638l95K933K225k825k352J806J555k639n11L122J771l019k510K175J694
$$ -1638 -2033 900 3125 300 -2052 -246 1309 -1330 -1841 1281 3052 33 -2477 -302 1392
4217A392k382n35L264J138l299k461K986J438k160q77L008P63l256j984K772J992
$$ 1392 -990 -1525 1739 2877 -422 -2883 103 1541 -619 -1496 1512 2275 -981 -2965 -193 1799
4233A799j903j030K435J017l813j536L197K157k139j389K288N34l077j599L380
$$ 1799 -104 -1134 1301 2318 -1495 -3031 166 2323 184 -1205 1083 1617 -1460 -3059 321
4248C21K106k113j906K111N01k373j260L226J995k540j943K043R85k484j042L363
$$ 321 2427 314 -1592 519 1020 -1353 -2613 613 2608 68 -1875 168 1153 -1331 -2373 990
4264I90K072k908k276J738J530k005p26K611J920l407k295K254J656j763n32K736
$$ 990 3062 154 -2122 -384 1146 -859 -1585 1026 2946 -461 -2756 -502 1154 -609 -1141 1595
4280A595J178l155k359K461J397j309r52K333J267l453j756K688J845j394j355
$$ 1595 2773 -382 -2741 -280 1117 -192 -1144 1189 2456 -997 -2753 -65 1780 386 -969
4295i69J895R56k779j870K860K081j882j482J808J059k789j403K934K377k295
$$ -969 926 1882 -897 -2767 93 2174 292 -1190 618 1677 -1112 -2515 419 2796 501
4310E01j670J320Q76j999r89K560K082k334k001J532J057j668j087K853J427k088
$$ 501 -1169 151 1027 -972 -1961 599 2681 347 -1654 -122 935 -733 -1820 1033 2460 372
4326C72j945R80J857j506r54K066J522k452k097J749J727j690o95J979J067k399
$$ 372 -1573 -593 1264 -242 -1196 870 2392 -60 -2157 -408 1319 -371 -1066 913 1980 -419
4342d19j986K098J951j570r17J413Q37k126j394J637K229j099j497J501L61j967
$$ -419 -2405 -307 1644 74 -843 570 1407 -719 -2113 -476 1753 654 -843 658 1019 -948
$$ [...]
8191i1
##END NTUPLES=NMR FID
##END=
