##TITLE=1H_5E2003-05
 CDCl3
 8 sc, 
 21.3.2023
##JCAMPDX= 6.0         $$ Bruker NMR JCAMP-DX V2.0
##DATA TYPE= NMR FID
##DATA CLASS= NTUPLES
##ORIGIN= UXNMR, Bruker Analytische Messtechnik GmbH
##OWNER= root
$$ XWIN-NMR		Version 3.5
$$ Tue Mar 21 14:14:15 2023 Russian Standard Time (UT+4h)  she@DPX200
##.OBSERVE FREQUENCY= 200.13135
##.OBSERVE NUCLEUS= ^1H
##.DELAY= (6, 6)
##.ACQUISITION MODE= SIMULTANEOUS
##.ACQUISITION SCHEME= undefined
##.AVERAGES= 8
##.DIGITISER RES= 18
##SPECTROMETER/DATA SYSTEM= spect
##.PULSE SEQUENCE= zg30
##.SOLVENT NAME= CDCl3
##.SHIFT REFERENCE= (INTERNAL, CDCl3, 0, 15.7039)
##AUDIT TRAIL= $$ (NUMBER, WHEN, WHO, WHERE, WHAT)
$$ ##TITLE= Audit trail, XWIN-NMR		Version 3.5
$$ ##JCAMPDX= 5.01
$$ ##ORIGIN= Bruker BioSpin GmbH
$$ ##OWNER= she
$$ F:/spectra/data/she/nmr/H-F/1/audita.txt
$$ ##AUDIT TRAIL=  $$ (NUMBER, WHEN, WHO, WHERE, WHAT)
(   1,<2023-03-21 14:13:12.32 +0400>,<she>,<DPX200>,
      <created by zg, POWCHK disabled, PULCHK disabled
       configuration hash MD5:
       00 E9 B6 7A A2 85 ED C7 34 08 36 98 17 FE 4E 26
       data hash MD5: 16K
       DF 50 F9 8D 12 08 CB EB A1 BE 53 98 E6 F7 8D 11>)
$$ ##END=
$$ 
$$ hash MD5
$$ CF AC 13 68 26 2B C1 B1 9B 3F 9B AD B9 5C 93 B1
##$RELAX= 
##$RELAX= 
##$RELAX= 
##$RELAX= 
##$RELAX= 
##$RELAX= 
$$ Bruker specific parameters
$$ --------------------------
##$DU= <F:/spectra>
##$EXPNO= 1
##$NAME= <H-F>
##$PROCNO= 1
##$TYPE= <nmr>
##$USER= <she>
##$AMP= (0..31)
100 100 100 100 100 100 100 100 100 100 100 100 100 100 100 100 100 100 
100 100 100 100 100 100 100 100 100 100 100 100 100 100 
##$AQSEQ= 0
##$AQ_mod= 1
##$AUNM= <au_zg>
##$AUTOPOS= <>
##$BF1= 200.13
##$BF2= 200.13
##$BF3= 200.13
##$BF4= 200.13
##$BF5= 200.13
##$BF6= 200.13
##$BF7= 200.13
##$BF8= 200.13
##$BYTORDA= 1
##$CFDGTYP= 0
##$CFRGTYP= 5
##$CHEMSTR= <none>
##$CNST= (0..31)
1 1 145 1 1 1 1 1 1 1 1 1 1 1 1 1 1 1 1 1 1 1 1 1 1 1 1 1 1 1 1 1 
##$CPDPRG= <>
##$CPDPRG1= <>
##$CPDPRG2= <>
##$CPDPRG3= <>
##$CPDPRG4= <mlev>
##$CPDPRG5= <mlev>
##$CPDPRG6= <mlev>
##$CPDPRG7= <mlev>
##$CPDPRG8= <mlev>
##$CPDPRGB= <>
##$CPDPRGT= <>
##$D= (0..31)
0 1.2 0 0 0 0 0 0 0 0.06 0 0.03 0 0 0 0 0.0002 0 0 0 0 0 0 0 0 0 0 0 0 
0 0 0 
##$DATE= 1679393591
##$DBL= (0..7)
120 120 120 120 120 120 120 120 
##$DBP= (0..7)
150 150 150 150 150 150 150 150 
##$DBP07= 0
##$DBPNAM0= <>
##$DBPNAM1= <>
##$DBPNAM2= <>
##$DBPNAM3= <>
##$DBPNAM4= <>
##$DBPNAM5= <>
##$DBPNAM6= <>
##$DBPNAM7= <>
##$DBPOAL= (0..7)
0.5 0.5 0.5 0.5 0.5 0.5 0.5 0.5 
##$DBPOFFS= (0..7)
0 0 0 0 0 0 0 0 
##$DE= 6
##$DECBNUC= <off>
##$DECIM= 32
##$DECNUC= <off>
##$DECSTAT= 4
##$DIGMOD= 1
##$DIGTYP= 9
##$DL= (0..7)
0 120 120 120 120 120 120 120 
##$DP= (0..7)
150 150 150 150 150 150 150 150 
##$DP07= 0
##$DPNAME0= <>
##$DPNAME1= <>
##$DPNAME2= <>
##$DPNAME3= <>
##$DPNAME4= <>
##$DPNAME5= <>
##$DPNAME6= <>
##$DPNAME7= <>
##$DPOAL= (0..7)
0.5 0.5 0.5 0.5 0.5 0.5 0.5 0.5 
##$DPOFFS= (0..7)
0 0 0 0 0 0 0 0 
##$DQDMODE= 0
##$DR= 18
##$DS= 0
##$DSLIST= <SSSSSSSSSSSSSSS>
$$ [...]
##$SUBNAM2= <"">
##$SUBNAM3= <"">
##$SUBNAM4= <"">
##$SUBNAM5= <"">
##$SUBNAM6= <"">
##$SUBNAM7= <"">
##$SUBNAM8= <"">
##$SUBNAM9= <"">
##$SW= 18.05172834244
##$SWIBOX= (0..15)
0 0 2 0 0 0 0 0 0 0 0 0 0 0 0 0 
##$SW_h= 3612.71676300578
##$TD= 16384
##$TD0= 1
##$TE= 0
##$TE2= 300
##$TE3= 300
##$TEG= 300
##$TL= (0..7)
0 120 120 120 120 120 120 120 
##$TP= (0..7)
150 150 150 150 150 150 150 150 
##$TP07= 0
##$TPNAME0= <>
##$TPNAME1= <>
##$TPNAME2= <>
##$TPNAME3= <>
##$TPNAME4= <>
##$TPNAME5= <>
##$TPNAME6= <>
##$TPNAME7= <>
##$TPOAL= (0..7)
0.5 0.5 0.5 0.5 0.5 0.5 0.5 0.5 
##$TPOFFS= (0..7)
0 0 0 0 0 0 0 0 
##$TUNHIN= 0
##$TUNHOUT= 0
##$TUNXOUT= 0
##$USERA1= <user>
##$USERA2= <user>
##$USERA3= <user>
##$USERA4= <user>
##$USERA5= <user>
##$V9= 5
##$VALIST= <valist>
##$VCLIST= <CCCCCCCCCCCCCCC>
##$VD= 0
##$VDLIST= <DDDDDDDDDDDDDDD>
##$VPLIST= <PPPPPPPPPPPPPPP>
##$VTLIST= <TTTTTTTTTTTTTTT>
##$WBST= 1024
##$WBSW= 4
##$XGAIN= (0..3)
0 0 0 0 
##$XL= 0
##$YL= 0
##$YMAX_a= 619525
##$YMIN_a= -712294
##$ZGOPTNS= <>
##$ZL1= 120
##$ZL2= 120
##$ZL3= 120
##$ZL4= 120
##$ABSF1= 10
##$ABSF2= 0
##$ABSG= 5
##$ABSL= 3
##$ALPHA= 0
##$AQORDER= 0
##$ASSFAC= 0
##$ASSFACI= 0
##$ASSFACX= 0
##$ASSWID= 0
##$AUNMP= <proc_1d>
##$AZFE= 0.1
##$AZFW= 0.1
##$BCFW= 1
##$BC_mod= 2
##$BYTORDP= 1
##$COROFFS= 0
##$CY= 11.3945322036743
##$DATMOD= 1
##$DC= 2
##$DFILT= <>
##$DTYPP= 0
##$F1P= 2.36226072786647
##$F2P= -0.459571619588291
##$FCOR= 0.5
##$FTSIZE= 0
##$FT_mod= 4
##$GAMMA= 1
##$GB= 0.15
##$INTBC= 1
##$INTSCL= 1
##$ISEN= 128
##$LB= 0.24
##$LEV0= 0
##$LPBIN= 0
##$MAXI= 10000
##$MC2= 0
##$MEAN= 0
##$ME_mod= 0
##$MI= 1.114404
##$NCOEF= 0
##$NC_proc= 0
##$NLEV= 6
##$NOISF1= 3.799351
##$NOISF2= 2.8
##$NSP= 1
##$NTH_PI= 0
##$NZP= 0
##$OFFSET= 15.70392
##$PC= 1
##$PHC0= -19104.02
##$PHC1= 11.60075
##$PH_mod= 1
##$PKNL= yes
##$PPARMOD= 0
##$PSCAL= 0
##$PSIGN= 0
##$REVERSE= no
##$SF= 200.130013532006
##$SI= 16384
##$SIGF1= 3
##$SIGF2= 2
##$SINO= 400
##$SIOLD= 16384
##$SREGLST= <1H.CDCl3>
##$SSB= 0
##$STSI= 0
##$STSR= 0
##$SW_p= 3612.71676300578
##$SYMM= 0
##$S_DEV= 0
##$TDeff= 0
##$TDoff= 0
##$TI= <>
##$TILT= no
##$TM1= 0
##$TM2= 0
##$TOPLEV= 0
##$USERP1= <user>
##$USERP2= <user>
##$USERP3= <user>
##$USERP4= <user>
##$USERP5= <user>
##$WDW= 1
##$XDIM= 8192
##$YMAX_p= 0
##$YMIN_p= 0
$$ End of Bruker specific parameters
$$ ---------------------------------
##NTUPLES= NMR FID
##VAR_NAME=  TIME,          FID/REAL,        FID/IMAG
##SYMBOL=    X,             R,               I
##VAR_TYPE=  INDEPENDENT,   DEPENDENT,       DEPENDENT
##VAR_FORM=  AFFN,          ASDF,            ASDF
##VAR_DIM=   8192,          8192,            8192
##UNITS=     SECONDS,       ARBITRARY UNITS, ARBITRARY UNITS
##FACTOR=    0.0002768,     1,               1
##FIRST=     0,             0,               0
##LAST=      2.2672688,     0,               0
##MIN=       0,             -712294,         0
##MAX=       2.2672688,     619525,          0
$$ Real data points
##PAGE= N=1
##DATA TABLE= (X++(R..R)), XYDATA
0@%%%%%%%QqQj6K4l2L2m0N6p2Q8j05J29j53J78k17K61l02L50m12M80n51O30p22
31c86Q26r36J061j204J358j524J706j910K134k376K640k932L252l595L969m383
47b300M839n333N873o472P133p859Q665r573J0594j1746J3064j4598J6397j8536
61i852K1143k4401K8601l4246M2282n4713P6629j26287M32308o9057r94701N48783
73a63511P60715m02914q02231M37747P55601l57670q37959L69902Q28336l51859
83B36157q46937M19070Q10260m37212q05817M58045P66230m29175p55396M24360
93a60415P39090m11937p54873M20509P54139m16168p51577M16812P23833m08413
103A51000p06965M05208P00410l88905p02147L85271O95996l95659o88961M17150
$$ plain form
0 0 0 0 0 0 0 0 0 8 0 8 -8 16 -16 16 -24 32 -40 48 -57 72 -81 97 -120 141 -161 189 -223 257 -294 336 -386
31 -386 440 -496 565 -639 719 -805 901 -1009 1125 -1251 1389 -1543 1709 -1886 2083 -2300
47 -2300 2539 -2794 3079 -3393 3740 -4119 4546 -5027 5567 -6179 6885 -7713 8684 -9852
61 -9852 11291 -13110 15491 -18755 23527 -31186 45443 -80844 351464 282407 -712294 -163511
73 -163511 597204 194290 -607941 -170194 585407 227737 -610222 -240320 588016 236157
83 236157 -610780 -191710 618550 181338 -624479 -166434 599796 170621 -584775 -160415
93 -160415 578675 166738 -588135 -167626 586513 170345 -581232 -164420 559413 151000
103 151000 -555965 -150757 549653 160748 -541399 -156128 539868 144209 -544752 -127602
113a27602O74625m29210o56116M25204O29849m14435o16533M01334O20026l85765
123A21377o28870L78421O33538l84035o31277L97594O24848m04609o08416M06761
133i4668N88886m06249n72771M04309N61079m03793n55531M01683N50015l99217
143G3743n45538L97607N42881l97944n41628M02023N42749m05965n38433M09863
153f0642N25664m14565n08822M14777M94037m08030m84549L97574M82444l90254
163D7634m85562L90243M88253l99147m85644M12777M79271m19288m66205M15847
173b1821M49808m07288m38905L99279M38374l94296m45692L90857M46189l95153
183B1352m39516M05146M29879m09701m18815M06259M08937l98907m03650L93882
$$ plain form
113 -127602 547023 117813 -538303 -113099 516750 102315 -514218 -112884 507142 121377
123 121377 -507493 -129072 504466 120431 -510846 -113252 511596 106987 -501429 -94668
133 -94668 494218 87969 -484802 -80493 480586 76793 -478738 -77055 472960 73743
143 73743 -471795 -74188 468693 70749 -470879 -68856 473893 67928 -470505 -60642
153 -60642 465022 50457 -458365 -43588 450449 42419 -442130 -44556 437888 47634
163 47634 -437928 -47685 440568 41421 -444223 -31446 447825 28537 -437668 -21821
173 -21821 427987 20699 -418206 -18927 419447 25151 -420541 -29684 416505 21352
183 21352 -418164 -13018 416861 7160 -411655 -5396 403541 4634 -399016 -5134
193e134M03503l92547m03192L97036M00668m03895l93842M06036L83161m03447
203a1653l71654L97991L64521l93664l65326L90858L68164l91606l66449L97188
213A8370L60718m03079l52213M04024L41131m01711l32954L96027L30701l89179
223b8165l29603L86859L28146l90341l26733L96419L24168l98763l16606L97550
233D2931L06222l96921k98594L95703K97344l92425k96833L89412K93627l90395
243d9929k91183L92393K86959l93336k82083L93442K78145l90929k74392L88038
253E7125K69772l87746k65778L89033K64322l89073k61935L87312K57738l86322
263f5552k51949L87380K49298l87652k48117L85806K44799l85353k41015L85227
$$ plain form
193 -5134 398369 5822 -397370 -334 400334 -3561 -397403 8633 391794 -11653
203 -11653 -383307 14684 379205 -14459 -379785 11073 379237 -12369 -378818 18370
213 18370 379088 -23991 -376204 27820 368951 -32760 -365714 30313 361014 -28165
223 -28165 -357768 29091 357237 -33104 -359837 36582 360750 -38013 -354619 42931
233 42931 349153 -47768 -346362 49341 346685 -45740 -342573 46839 340466 -49929
243 -49929 -341112 51281 338240 -55096 -337179 56263 334408 -56521 -330913 57125
253 57125 326897 -60849 -326627 62406 326728 -62345 -324280 63032 320770 -65552
263 -65552 -317501 69879 319177 -68475 -316592 69214 314013 -71340 -312355 72872
273G2872K36835l84336k32804L84019K29141l83635k27081L81227K23953l79885
283g9694k19407L80791K16591l81391k14192L80838K11863l79452k07680L78465
293H6732K03824l78404k01195L77641J98359l76543j95797L76054J93196l74637
303i0770j89015L73770J84412l74913j82370L74436J80262l71863j76087L70598
313I8460J71896l71690j69537L71704J67370l69886j64369L68442J61125l67775
323a04260j58206L67603J55647l66147j52677L66180J50382l64807j48314L62890
333A08291J43140l62640j39949L63247J38374l61562j36457L58998J32546l58426
343a14438j29311L58570J27275l58154j24627L56549J22139l54878j19343L54143
$$ plain form
273 72872 309707 -74629 -307433 76586 305727 -77908 -304989 76238 300191 -79694
283 -79694 -299101 81690 298281 -83110 -297302 83536 295399 -84053 -291733 86732
293 86732 290556 -87848 -289043 88598 286957 -89586 -285383 90671 283867 -90770
303 -90770 -279785 93985 278397 -96516 -278886 95550 275812 -96051 -272138 98460
313 98460 270356 -101334 -270871 100833 268203 -101683 -266052 102390 263515 -104260
323 -104260 -262466 105137 260784 -105363 -258040 108140 258522 -106285 -254599 108291
333 108291 251431 -111209 -251158 112089 250463 -111099 -247556 111442 243988 -114438
343 -114438 -243749 114821 242096 -116058 -240685 115864 238003 -116875 -236218 117925
353A17925J16298l52989j12956L53148J10377l53202j09270L50709J05877l48038
363a22121j00893L48928R9003l49239r8856L46773R6231l44816r2228L44613Q8822
374B16217l45018q6749L43535Q4210l41540q1100L39680P8736l38161p6265L37492
385A31037P4055l37470p2533L37329P1355l35139o7293L34225O3736l35005o2295
396a97998L33393O0146l31114n6756L28760N3834l27335n1912L25462N0791l24302
407a37031m9872L24062M8621l23923m6442L23949M2327l24122l7937L23579L5847
418A79058l20097l3622L15289L1295l13329l1092L13549L1790l13456l0513L14031
429A42903K7174l14358k2463L12851J7730l10458j5189L07637J4257l05619j4143
$$ plain form
353 117925 234223 -118766 -231722 121426 231803 -121399 -230669 120040 225917 -122121
363 -122121 -223014 125914 224917 -124322 -223178 123595 219826 -124990 -217218 127395 216217
374 216217 -128801 -215550 127985 212195 -129345 -210445 129235 207971 -130190 -206455 131037
385 131037 205092 -132378 -204911 132418 203773 -131366 -198659 135566 199302 -135703 -197998
396 -197998 135395 195541 -135573 -192329 136431 190265 -137070 -188982 136480 187271 -137031
407 -137031 -186903 137159 185780 -138143 -184585 139364 181691 -142431 -180368 143211 179058
418 179058 -141039 -174661 140628 171923 -141406 -172498 141051 172841 -140615 -171128 142903
429 142903 170077 -144281 -166744 146107 163837 -146621 -161810 145827 160084 -145535 -159678
440a59678L03571J2742l03310r527L04588P091l03864n632L00491L545k97303
451a47286j430K96846J296k97120q72K98443j879k98611N709K96546j1094k92915
463a52367J4602K89437j4679k86305J1729K83596r352k83839J0755K87851j4315
474A37113k91820J7819K90718k2661k85506K8081K80990k9414k77545K7214K74889
485A49878k4227k74814K3157K76246k4477k77535K8122K78278l2156k77100L4929
496a19699K74098l6983k70527L8431K67949l9880k67721L9914K66936l9611k64991
507a52084M0730K64357m1762k64748M2006K63943m3485k62935M6823K62645m9048
518A06442k60588N0954K57182n3629k53981N5537K52826n5773k52243N4954K51038
$$ plain form
440 -159678 143893 156635 -146675 -156202 148386 155477 -148387 -154019 146472 150017 -147286
451 -147286 -148716 148130 149426 -147694 -148566 149877 147998 -150613 -144904 151642 140548 -152367
463 -152367 -137765 151672 136993 -149312 -137583 146013 136661 -147178 -136423 151428 137113
474 137113 -154707 -136888 153830 131169 -154337 -126256 154734 125320 -152225 -125011 149878
485 149878 125651 -149163 -126006 150240 125763 -151772 -123650 154628 122472 -154628 -119699
496 -119699 154399 117416 -153111 -114680 153269 113389 -154332 -114418 152518 112907 -152084
507 -152084 -111354 153003 111241 -153507 -111501 152442 108957 -153978 -107155 155490 106442
518 106442 -154146 -103192 153990 100361 -153620 -98083 154743 98970 -153273 -98319 152719
529A52719n6349k50128N8620K50403o0036k49999O0279K48603o1359k47475O2157
540i2565K46296o4451k44351O7765K43312o9814k40409O9930K35579o9514k32390
551a50612O9749K33121o8886k36378O8180K38522p0962k37705P6924K36082q1961
562G6074k33093Q2861K27086q0956k22516P8234K20913p5887k22342P6208K25484
573A52066p9033k27447Q3209K25092q7497k20226R0740K16369r0286k14183Q7410
584f3786K13707q4901k14029Q5358K15820q9015k16319R1944K13550r4056k09333
595a51060R5087K05751r3714k04247R2288K03678r3132k04800R5212K05537r7358
606E3242k03868R9629K00720j00689j97790R9956J96775r8777j96299R7843J96794
$$ plain form
529 152719 96370 -153758 -95138 155265 95229 -154770 -94491 154112 92753 -154722 -92565
540 -92565 153731 89280 -155071 -87306 156006 86192 -154217 -84287 151292 81778 -150612
551 -150612 -80863 152258 83372 -153006 -84826 153696 82734 -154971 -78047 158035 76074
562 76074 -157019 -74158 152928 71972 -150544 -72310 148603 72716 -149626 -73418 152066
573 152066 73033 -154414 -71205 153887 66390 -153836 -63096 153273 62987 -151196 -63786
584 -63786 149921 65020 -149009 -63651 152169 63154 -153165 -61221 152329 58273 -151060
595 -151060 -55973 149778 56064 -148183 -55895 147783 54651 -150149 -54937 150600 53242
606 53242 -150626 -50997 149723 49034 -148756 -48800 147975 49198 -147101 -49258 147536
617A47536r8897j96490J01177J94924j03799j92235J06050J89362j05376j87674
627a45422J03649J85101j03865j84691J05589J86573j06772j86872J07377J84493
637A45160j09228j81264J11160J79375j11310j78255J10303J76666j09345j75031
647a41769J09971J74290j10968j73705J12647J72768j13804j72266J14182J70331
657A41677j15348j67719J17587J66223j18683j65333J17926J62968j17277j60692
667a38671J17114J60137j17137j60952J17752J60904j19012j59433J21125J57791
677A39618j22770j54886J23258J51907j23168j50546J22328J50042j20627j49263
687a34107J20819J48785j22880j48925J24025J48056j24934j45710J25430J43116
$$ plain form
617 147536 48639 -147851 -46674 148250 44451 -147784 -41734 147628 42252 -145422
627 -145422 -41773 143328 39463 -145228 -39639 146934 40162 -146710 -39333 145160
637 145160 35932 -145332 -34172 145203 33893 -144362 -34059 142607 33262 -141769
647 -141769 -31798 142492 31524 -142181 -29534 143234 29430 -142836 -28654 141677
657 141677 26329 -141390 -23803 142420 23737 -141596 -23670 139298 22021 -138671
667 -138671 -21557 138580 21443 -139509 -21757 139147 20135 -139298 -18173 139618
677 139618 16848 -138038 -14780 137127 13959 -136587 -14259 135783 15156 -134107
687 -134107 -13288 135497 12617 -136308 -12283 135773 10839 -134871 -9441 133675
697A33675j25566j41655J25611J40904j26007j39864J26406J39007j26972j37272
707a31733J27207J34983j27459j33480J28021J33137j27164j32890J27075J31605
717A29302j28803j30404J30861J28977j31747j26830J31430J24498j30705j22582
727a26003J29425J21741j29454j21522J29765J22039j30732j21476J31344J19321
737A24448j31938j16896J33607J15356j33196j14338J31518J12651j30871j11373
747a21032J31693J11149j32062j10435J31868J09575j32581j08064J32239J06582
757A18932j32136j05616J32421J04885j33020j03901J32436J03014j32137j00734
767a15856J32373R9449j33086r8983J32470R8040j31089r7185J32035R6299j32492
$$ plain form
697 133675 8109 -133546 -7935 132969 6962 -132902 -6496 132511 5539 -131733
707 -131733 -4526 130457 2998 -130482 -2461 130676 3512 -129378 -2303 129302
717 129302 499 -129905 956 129933 -1814 -128644 2786 127284 -3421 -126003
727 -126003 3422 125163 -4291 -125813 3952 125991 -4741 -126217 5127 124448
737 124448 -7490 -124386 9221 124577 -8619 -122957 8561 121212 -9659 -121032
747 -121032 10661 121810 -10252 -120687 11181 120756 -11825 -119889 12350 118932
757 118932 -13204 -118820 13601 118486 -14534 -118435 14001 117015 -15122 -115856
767 -115856 16517 115966 -17120 -116103 16367 114407 -16682 -113867 18168 114467 -18025
778a8025r5654J32561R4222j32576r3190J32746R1993j32000r0779J31366Q9318
789A09982j31997q8551J32275Q8364j31664q7353J31105Q5505j32057q4139J32735
800B4205Q3743j32023q2382J31432Q1184j31354q0637J31420P9690j31254p8362
811a04338J31095P7938j30843p7318J30033P6053j30113p4532J30318P4398j30703
822b8012p3978J29846P2340j29426p0761J29941P0183j29944p0041J29410O8979
833I8537j28975o8148J28903O7189j28511o5881J28889O5153j28481o4960J27875
844C1590O3955j27276o2584J27377O1700j28099o1485J27496O1056j26754n9446
855i2470J26535N8063j26563n7989J26325N7380j26052n6752J25928N6029j25339
$$ plain form
778 -18025 -113679 18882 113104 -19472 -112662 20084 112077 -19923 -110702 20664 109982
789 109982 -22015 -110566 21709 110073 -21591 -108944 22161 107666 -24391 -108530 24205
800 24205 107948 -24075 -106457 24975 106159 -25195 -105832 25588 105278 -25976 -104338
811 -104338 26757 104695 -26148 -103466 26567 102620 -27493 -102025 28293 102691 -28012
822 -28012 -101990 27856 100196 -29230 -99991 29950 100133 -29811 -99852 29558 98537
833 98537 -30438 -98586 30317 97506 -31005 -96886 32003 97156 -31325 -96285 31590
844 31590 95545 -31731 -94315 33062 94762 -33337 -94822 32674 93730 -33024 -92470
855 -92470 34065 92128 -34435 -92424 33901 91281 -34771 -91523 34405 90434 -34905
866c4905n4801J25551N3512j25523n3067J24733N2975j23608n2108J23484N0898
877H7141j23842n0470J24313M9961j23733m9074J23119M7539j23016m6637J22529
888C7830M5916j22083m5452J21929M5300j21654m4359J21266M3147j21694m2264
899h2118J21617M2188j20761m1523J20104M0372j20064l9394J20669L8847j20456
910d0519l8061J19551L7014j19063l6512J18572L5924j17973l5386J18378L4787
921G6712j18848l4490J18148L3165j17681l1170J17602L0575j17073l0834J16128
932D2234L0682j15540k9607J15907K8921j16482k8076J16159K6965j15359k5993
943g0189J14784K5350j14285k4620J13544K4559j14598k4032J14318K3335j13530
$$ plain form
866 -34905 -89706 35845 89357 -36166 -89233 35500 88475 -35133 -87241 36243 87141
877 87141 -36701 -87171 37142 87103 -36630 -85704 37415 84954 -38062 -84699 37830
888 37830 83746 -38337 -83789 38140 83440 -38214 -82573 38693 81840 -39854 -82118
899 -82118 39499 81687 -39074 -80597 39507 79879 -40185 -79579 41090 79937 -40519
910 -40519 -78580 40971 77985 -41078 -77590 40982 76906 -41067 -76453 41925 76712
921 76712 -42136 -76626 41522 74687 -42994 -74164 43438 74013 -43060 -73894 42234
932 42234 72916 -42624 -72231 43676 72597 -43885 -71961 44198 71163 -44196 -70189
943 -70189 44595 69945 -44340 -68960 44584 69143 -45455 -69487 44831 68166 -45364
954d5364k1557J13162K0215j12854k0234J12293J9964j11256j9730J11504J8989
965F5132j12132j7832J12109J6967j11535j5520J10366J5354j09352j5363J08408
976D6602J5147j08660j5400J09831J5005j09726j4067J09168J1734j08304j0812
987e9482J07554J0887j06273j1793J05706J1873j05743j1243J06396J0754j07066
998d8430r344J06800Q321j05748p873J04397P322j03502p010J03735P334j03716
1010d7714p389J03117O309j03238n030J02920M730j02638m280J01771M292j01812
1022d8962l776J01741K825j01190k062J01024J179j00455r80R9514J004r8159
1034d8297o88R8534j13r9076J75R9507j419r8887K875R8185m101r7381M415R6773
$$ plain form
954 -45364 -66921 46241 66456 -46398 -66632 45661 65625 -45631 -65361 46143 65132
965 65132 -47000 -64832 47277 64244 -47291 -62811 47555 62909 -46443 -61806 46602
976 46602 61749 -46911 -62311 47520 62525 -47201 -61268 47900 59634 -48670 -59482
987 -59482 48072 58959 -47314 -59107 46599 58472 -47271 -58514 47882 58636 -48430
998 -48430 -57774 49026 57347 -48401 -56274 48123 55445 -48057 -55067 48668 56002 -47714
1010 -47714 -55103 48014 54323 -48915 -53945 48975 53705 -48933 -53213 48558 52850 -48962
1022 -48962 -52738 49003 51828 -49362 -51424 49600 50779 -49676 -50656 48858 49862 -48297
1034 -48297 -48985 49549 49436 -49640 -49465 50042 48623 -50264 -47389 50796 46695 -50686 -46271 50502
1048E0502m692r5956M327R5284m279r5017M883R5280n735r5591O019R5494o337
1061D4182r4447P428R3788q656r3940R321R3359r211r2195R899R1056r918r0715
1074e0049R279R0797q932r1269R133R1674r802r1917J0882R1320j2551r0213J3618
1087c8030Q9300j3636q7838J2826Q6708j2566q6810J2825Q7833j3032q8163J3554
1099c7029Q8076j4704q7495J5626Q6708j6491q5905J6897Q5457j6633q5251J6596
1111c4148Q4434j7062q3632J7663Q3582j8164q3353J7367Q3088j7495q2546J8294
1123c1972Q3230j9263q3390J9896Q2938k1175q1436K1638Q0200k1425p9198K1238
1135b8719P8695k0614p9148K0227P9694k0445p9983K1868P9392k3493p9068K4187
$$ plain form
1048 50502 45810 -50146 -45819 49465 45186 -49831 -44948 50332 44597 -50994 -44975 50519 44182
1061 44182 -50265 -42837 50951 42295 -51645 -42324 51035 41824 -50371 -40472 50584 40666 -50049
1074 -50049 -40770 50027 41095 -50174 -41041 50633 40831 -51086 -40204 51116 38565 -51648 -38030
1087 -38030 51270 37634 -50204 -37378 49330 36764 -50046 -37221 50612 37580 -50583 -37029
1099 -37029 51047 36343 -51152 -35526 51182 34691 -51214 -34317 51140 34507 -50744 -34148
1111 -34148 50286 33224 -50408 -32745 50837 32673 -50680 -33313 49775 32280 -50266 -31972
1123 -31972 51258 31995 -51395 -31499 51439 30264 -51172 -29534 50666 29241 -49957 -28719
1135 -28719 49976 29362 -49786 -29559 50135 29690 -50293 -28425 50967 27474 -51594 -27407
1147b7407P8383k4396p6748K4154P5920k4145p5645K3985P5484k3730p5814K3987
1159b5972P5871k4195p5369K5071P4681k5738p4784K6265P4406k6246p3472K6166
1171b3316P2750k6922p2118K7035P2185k6984p1844K6701P1328k6940p1212K7290
1183b2047P1193k7740p1024K8645P0579k8917o9974K9113O8914k9327o8427K9813
1195a9199O7981k9253o7919K9052O7648k9488o7198L0177O7102l0577o7075L0831
1207a7918O6616l1269o5935L1376O5293l1748o4601L2274O3974l2331o3837L1738
1219a6368O3540l1590o3018L2256O3158l2968o3139L3329O2556l3267o1784L3696
1231a3599O1114l4230o0659L4319O0029l3998n9871L4144N9748l4032n9547L4322
$$ plain form
1147 -27407 50976 26580 -50168 -26014 49906 25761 -49884 -25899 49585 25855 -49959 -25972
1159 -25972 49899 25704 -49665 -24594 50087 24349 -50435 -24170 50236 23990 -49482 -23316
1171 -23316 49434 22512 -49606 -22571 49614 22630 -49214 -22513 48815 21875 -49337 -22047
1183 -22047 49146 21406 -49618 -20973 49606 20689 -49285 -20172 48742 19415 -49012 -19199
1195 -19199 48782 19529 -48390 -19338 48310 18822 -48376 -18199 48903 18326 -48749 -17918
1207 -17918 48698 17429 -48506 -17130 48163 16415 -48186 -15912 48062 15731 -48106 -16368
1219 -16368 47172 15582 -47436 -15180 47978 15010 -48129 -14800 47756 14489 -47295 -13599
1231 -13599 47515 13285 -47374 -13055 46974 12976 -46895 -12751 46997 12965 -46582 -12260
1243a2260N9021l5103n9000L5156N8847l5080n7929L5199N7227l5490n6900L5448
1255a0864N6959l5188n6839L5782N5868l5920n5550L6185N5400l6258n4977L6382
1267i020N4671l6416n4568L6436N3999l6789n3836L7395N3394l7091n2878L6655
1279h048N2391l7055n1956L7518N1723l7581n1277L7349N1190l7957n0444L8229
1291e918N0107l8500m9533L8441M9377l8444m9456L8720M8661l8648m7986L8989
1303d190M7749l9160m7750L9124M7079l9281m6665L9567M6386l9597m6090L9437
1315c391M5822l9444m5415L9642M5053l9803m4445L9791M4243l9942m4284M0167
1327b006M3747l9681m3164L9941M2746m0550m2469M0182M2349m0075m1964M0321
$$ plain form
1243 -12260 46761 11658 -47342 -12186 46661 11581 -46348 -11149 46078 10588 -46312 -10864
1255 -10864 46095 10907 -45932 -10150 45718 9798 -45752 -9567 45833 9575 -45402 -9020
1267 -9020 45651 9235 -45333 -8897 45102 8313 -45523 -8128 45266 8175 -44703 -8048
1279 -8048 44343 7288 -44668 -7150 44573 6992 -44285 -6936 44254 6297 -44147 -5918
1291 -5918 44189 5689 -43844 -5403 43974 5530 -43926 -5206 43455 4807 -43179 -4190
1303 -4190 43559 4399 -43351 -4227 42852 3571 -43094 -3527 42859 3262 -42828 -3391
1315 -3391 42431 2987 -42428 -2786 42267 2464 -41981 -2190 42053 2111 -42173 -2006
1327 -2006 41741 2060 -41104 -1163 41583 1033 -41436 -1254 41095 1020 -40944 -623
1339f23M1499m0551m1166M0635M0893m0933m0480M0827M0292m0947l9572M0781
1351F55L9231m1194l8784M1190L9066m1026l8493M0916L7740m1141l7666M1869
1363B363L7113m1474l6866M1246L6389m1186l6401M1626L5720m1693l5312M1664
1375C189L5046m1683l4754M1523L4114m1389l3786M1964L3714m2159l3343M1768
1387D204L2825m1912l2095M2304L1933m2335l1655M1981L1384m2094l0752M2031
1399E819L0370m2072l0219M2500K9679m2663k9444M2410K9034m2036k8631M2454
1411G201K7959m2654k7785M2408K7695m2205k6942M2130K6658m2207k6600M2336
1423G994K6270m2222k6083M2179K5891m2269k5365M2141K4928m2182k4619M2018
$$ plain form
1339 -623 40876 325 -40841 -206 40687 -246 -40726 101 40393 -554 -40126 655
1351 655 39886 -1308 -40092 1098 40164 -862 -39355 1561 39301 -1840 -39506 2363
1363 2363 39476 -1998 -38864 2382 38771 -2415 -38816 2810 38530 -3163 -38475 3189
1375 3189 38235 -3448 -38202 3321 37435 -3954 -37740 4224 37938 -4221 -37564 4204
1387 4204 37029 -4883 -36978 5326 37259 -5076 -36731 5250 36634 -5460 -36212 5819
1399 5819 36189 -5883 -36102 6398 36077 -6586 -36030 6380 35414 -6622 -35253 7201
1411 7201 35160 -7494 -35279 7129 34824 -7381 -34323 7807 34465 -7742 -34342 7994
1423 7994 34264 -7958 -34041 8138 34029 -8240 -33605 8536 33464 -8718 -33337 8681
1435H681K4485m1917k4003M1555K3713m1618k3829M1772K3864m1710k3354M1895
1447I534K2819m1969k2462M1969K1995m1811k1567M1585K1479m1465k1166M1379
1459A0320K0557m1120k0645M1375K0522m1283k0443M1189J9882m1233j9422M1476
1471A1175J8991m1316j8960M1410J8267m1103j7933M0763J7652m0454j7462M0609
1483A1639J7408m0390j7661M0622J7382m1212j6477M1402J5898m1316j5535M0710
1495A2470J5035m0126j4660M0166J4601m0288j4713M0261J4399m0136j4231M0247
1507A3025J3664l9875j3432M0234J2970m0241j3003M0263J2753m0067j2051L9748
1519A3988J1759l9633j1684L9458J1558l8946j1649L9038J1336l9315j1303L9616
$$ plain form
1435 8681 33166 -8751 -32754 8801 32514 -9104 -32933 8839 32703 -9007 -32361 9534
1447 9534 32353 -9616 -32078 9891 31886 -9925 -31492 10093 31572 -9893 -31059 10320
1459 10320 30877 -10243 -30888 10487 31009 -10274 -30717 10472 30354 -10879 -30301 11175
1471 11175 30166 -11150 -30110 11300 29567 -11536 -29469 11294 28946 -11508 -28970 11639
1483 11639 29047 -11343 -29004 11618 29000 -12212 -28689 12713 28611 -12705 -28240 12470
1495 12470 27505 -12621 -27281 12885 27486 -12802 -27515 12746 27145 -12991 -27222 13025
1507 13025 26689 -13186 -26618 13616 26586 -13655 -26658 13605 26358 -13709 -25760 13988
1519 13988 25747 -13886 -25570 13888 25446 -13500 -25149 13889 25225 -14090 -25393 14223
1531A4223J0678l9617j0017L9343R920l9147r450L8427R337l8526r030L8571R258
1544B3970l8376r209L8217Q772l8396q404L8802Q048l8727p787L8382P197l8099
1557a5610o622L7834O543l7434o658L7558O288l7400o191L6833O157l7392n435
1570b1529L7428N547l7356n433L7285N027l7220m296L6849M225l6656m122L6217
1583A5966M372l6147m054L6006L922l6023l927L6292L335l6187l221L6107K660
1596A9101l5575k268L5403K112l5343k318L5188K219l5141j961L4826J967l5070
1609a6860j266L4701J525l4538j444L4477J188l4295j060L4594J79l4206j77L4099
1623A6917r8l3279l9L3182r9l3384P6L3473k48l3395O01L3213r48l2897J227L2454
$$ plain form
1531 14223 24901 -14716 -24733 14610 24530 -14617 -24067 14360 23697 -14829 -23859 14712 23970
1544 23970 -14406 -23615 14602 23374 -15022 -23426 15376 23424 -15303 -23090 15292 22489 -15610
1557 -15610 -22232 15602 22145 -15289 -21947 15611 21899 -15501 -21692 15141 21298 -16094 -21529
1570 -21529 15899 21446 -15910 -21343 15942 20969 -16251 -20547 16302 20527 -16129 -20251 15966
1583 15966 20338 -15809 -19863 16143 20065 -15958 -19885 16407 19742 -16445 -19666 16441 19101
1596 19101 -16474 -18742 16661 18773 -16570 -18888 16300 18519 -16622 -18583 16243 18210 -16860
1609 -16860 -18126 16575 18100 -16438 -17882 16595 17783 -16512 -17572 17022 17201 -17005 -17182 16917
1623 16917 16819 -16460 -16499 16683 16584 -16800 -16724 16749 16501 -16894 -16293 16920 15972 -16925 -15698 16756
1639A6756j187l2612J514L2338j372l2209J530L1899j629l2109K091L2238k116
1652A5132l2059K419L1443k637l1377K955L1276k865l1151K800L1023k984l1020
1665a7045L460L0542l614l0429L785L0318l976l0112L944K9932m134k9635M350
1678a2614L0103m780k9969M783K9534m951k9099N099K9262n236k9284N431K8900
1691A7179n721k8435N559K8578o095k8340O315K8105o440k8135O585K7706o281
1704A0580k7431O516K7435p045k7205O865K7480o945k7058P057K6765p173k6892
1717a7051P563K6535p513k6698P794K6355p937k5927P589K6035p878k5746Q080
1730h799K5680q086k5488P918K5494q536k5192Q802K4938q557k4753Q649K4621
$$ plain form
1639 16756 15569 -17043 -15529 16809 15437 -16772 -15242 16657 15028 -17081 -14990 17248 15132
1652 15132 -16927 -14508 16935 14298 -17079 -14124 17152 14287 -16864 -14064 16959 13975 -17045
1665 -17045 -13585 16957 13343 -17086 -13301 17017 13041 -17071 -13127 16805 12671 -16964 -12614
1678 -12614 17489 12709 -17260 -12477 17057 12106 -16993 -11894 17368 12132 -17152 -11721 17179
1691 17179 11458 -16977 -11418 17160 11065 -17275 -10960 17145 10705 -17430 -10845 16861 10580
1704 10580 -16851 -10335 17100 10055 -17150 -10285 17195 10250 -16808 -9751 17014 9841 -17051
1717 -17051 -9488 17047 9534 -17164 -9370 16985 9048 -16879 -9290 16745 8867 -16879 -8799
1730 -8799 16881 8795 -16693 -8775 16719 8183 -17009 -8207 16731 8174 -16579 -7930 16691
1743A6691q709k4621Q867K4589r263k4368R418K4109r280k4194R715K3697r922
1756F729k3378R909K3456j0135k3109R786K2920r816k3004J0484K2586j0051k2982
1769a6605J0567K2486j0610k2313J0604K2358j0778k1965J0728K1913j0859k1770
1781a6244J0784K1561j0918k1223J1039K1216j1293k1026J1008K1171j1231k0793
1793a5949J1279K0716j1554k0669J1449K0468j1512k0153J1783J9801j1688j9434
1805a5463J1618J9718j2084j9715J2186J9281j1730j9356J2183J8928j2233j8964
1817a5631J2154J8904j2138j8480J2088J8359j2267j8354J2316J8234j2293j8123
1829a5231J2387J7963j2302j7653J2148J7615j2463j7518J2472J7535j2515j7373
$$ plain form
1743 16691 7982 -16639 -7772 16817 7554 -16814 -7396 16713 7433 -16761 -7046 16651 6729
1756 6729 -16649 -6740 16716 6581 -16528 -6742 16178 6362 -16642 -6158 16428 6377 -16605
1769 -16605 -6038 16448 5838 -16475 -5871 16487 5709 -16256 -5528 16385 5526 -16244
1781 -16244 -5460 16101 5183 -16040 -5001 16215 4922 -16104 -5096 16075 4844 -15949
1793 -15949 -4670 16046 4492 -16177 -4728 15740 4228 -15925 -4142 15659 3971 -15463
1805 -15463 -3845 15873 3789 -15926 -3740 15541 3811 -15545 -3362 15566 3333 -15631
1817 -15631 -3477 15427 3289 -15191 -3103 15256 2989 -15365 -3049 15185 2892 -15231
1829 -15231 -2844 15119 2817 -14836 -2688 14927 2464 -15054 -2582 14953 2438 -14935
1841a4935J2625J6967j2350j6893J2665J6745j2617j6815J2591J6517j2619j6552
1853a4671J2828J6245j2703j6111J3100J5794j2803j6089J2911J5775j2978j5471
1865a4173J2952J5542j2992j5534J2855J5243j2749j5062J3095J4848j3145j4727
1877a3847J3025J4709j2978j4605J3119J4408j3158j4334J3354J3804j3132j4100
1889a3735J3070J3943j2951j3662J3085J3532j3095j3612J3282J3155j2921j3145
1901a3054J3287J2834j3335j2726J3235J2785j3206j2656J3283J2423j3035j2584
1913a2749J3222J2083j3304j1878J3083J2072j3191j1827J3177J1537j3119j1479
1925a2373J3355J1274j3476j1101J3262J1201j3341j0835J3157J1007j3301j0855
$$ plain form
1841 -14935 -2310 14657 2307 -14586 -1921 14824 2207 -14608 -2017 14500 1881 -14671
1853 -14671 -1843 14402 1699 -14412 -1312 14482 1679 -14410 -1499 14276 1298 -14173
1865 -14173 -1221 14321 1329 -14205 -1350 13893 1144 -13918 -823 14025 880 -13847
1877 -13847 -822 13887 909 -13696 -577 13831 673 -13661 -307 13497 365 -13735
1889 -13735 -665 13278 327 -13335 -250 13282 187 -13425 -143 13012 91 -13054
1901 -13054 233 13067 -268 -12994 241 13026 -180 -12836 447 12870 -165 -12749
1913 -12749 473 12556 -748 -12626 457 12529 -662 -12489 688 12225 -894 -12373
1925 -12373 982 12256 -1220 -12321 941 12142 -1199 -12034 1123 12130 -1171 -12026
1937a2026J3571J0618j3467j0659J3256J0629j3517j0001J3269J0196j3390j0038
1949a1559J3271R754j3205r897J3484R853j3532r550J3244R510j3334r360J3297
1962A976R197j3120r089J2917R268j3160r273J3537Q764j3226q675J3276Q636
1975A1028j3288q626J3078Q548j3325p983J3095Q172j3281q128J3313P805j2934
1988b526q010J3105P737j2865p673J2782P744j3097p355J2902P556j3036p292
2001a0028J2920P031j2801p226J3109O932j2707p113J3021O685j2927o411J2680
2014C165O517j2743o674J2822O409j2509o396J2538O074j2698n969J2784O024
2027I344j2554n977J2316N950j2739n442J2536N794j2494n703J2528N548j2534
$$ plain form
1937 -12026 1545 12163 -1304 -11963 1293 11922 -1595 -11596 1673 11869 -1521 -11559
1949 -11559 1712 11466 -1739 -11636 1848 11701 -1831 -11381 1863 11373 -1961 -11321 1976
1962 1976 11173 -1947 -11036 1881 11149 -2011 -11284 2253 11017 -2209 -10884 2392 11028
1975 11028 -2260 -10886 2192 10740 -2585 -10568 2527 10699 -2582 -10710 2603 10408 -2526
1988 -2526 -10536 2569 10306 -2559 -10232 2550 10294 -2803 -10158 2744 10300 -2736 -10028
2001 -10028 2892 9923 -2878 -10104 3005 9937 -2770 -9883 3138 9823 -3104 -9515 3165
2014 3165 9682 -3061 -9735 3087 9496 -3013 -9409 3129 9203 -3495 -9464 3320 9344
2027 9344 -3210 -9187 3129 9079 -3660 -9102 3434 9228 -3266 -8969 3559 9107 -3427
2040c427n375J2339N274j2447n145J2445N076j2418m964J2295M889j2251m821
2053h530J2252M841j2315m853J2291M510j2067m399J2276M373j2105m234J1840
2066C880M163j1793m290J1995M078j1917l923J1677M120j1990l701J1680L894
2079G873j1750l871J1877L307j1532l663J1546L703j1444l348J1398L402j1459
2092c961l623J1474L380j1435l072J1390L197j1460k909J1117L091j1145l175
2105g131J1318K892j1022l097J1252K524j1074k561J1163K593j1218k279J0794
2118D154K376j0975k136J0921K053j0854j821J0565K156j0813j984J0720J904
2131F266j0545j888J0541J859j0498k034J0738J747j0547j799J0786J488j0660
$$ plain form
2040 -3427 -8802 3537 8811 -3636 -8781 3664 8740 -3678 -8642 3653 8542 -3709 -8530
2053 -8530 3722 8563 -3752 -8605 3686 8196 -3871 -8270 4006 8379 -3726 -7960 3880
2066 3880 8043 -3750 -8040 3955 8033 -3884 -7807 3870 7990 -4000 -7701 3979 7873
2079 7873 -3877 -7748 4129 7436 -4096 -7759 3787 7490 -3954 -7302 4096 7498 -3961
2092 -3961 -7584 3890 7270 -4165 -7237 4153 7350 -4110 -7019 4098 7189 -3956 -7131
2105 -7131 4187 7079 -3943 -7040 4212 6736 -4338 -6899 4264 6857 -4361 -6640 4154
2118 4154 6530 -4445 -6581 4340 6393 -4461 -6282 4283 6439 -4374 -6358 4362 6266
2131 6266 -4279 -6167 4374 6233 -4265 -6299 4439 6186 -4361 -6160 4626 6114 -4546
2144d546j406J0541J276j0341j359J0202J359j0251j199J0261J078j0179j259
2157e823J0309J024j0096q94J0086R20j0015q41R813R70r994n35R657O00r641
2172d460r57J0012O10r741o19R643O46r555o80R580N73r564l81R308M13r503j14
2189d789R385K02r418k10R347L17r284j53R228qr295J91R202l6r130%R272l36
2207D485q980K00Q840k56q878L60Q710j54q968K03Q935k87q836M46Q741m00q608
2224d447K92Q631m51q569N71Q649p97q417P19Q520r77q359P51Q330o18q380Q47
2241c705Q282q23q435J062P916r51q058J062Q207j212p949J180P885j087p894
2256d520J106P941j024p956J224P728j190p774J272P802j329p582J180P405j069
$$ plain form
2144 -4546 -5952 4589 5865 -4476 -5835 4367 5726 -4525 -5724 4537 5615 -4564 -5823
2157 -5823 4486 5510 -4586 -5480 4606 5526 -4489 -5330 4483 5453 -4541 -5076 4581 5181 -4460
2172 -4460 -5417 4595 5205 -4536 -5155 4488 5134 -4421 -5101 4479 5052 -4512 -4893 4415 4828 -4675 -4789
2189 -4789 4596 4798 -4620 -4830 4517 4834 -4450 -4603 4625 4617 -4678 -4487 4715 4679 -4451 -4451 4821 4485
2207 4485 -4495 -4295 4545 4289 -4589 -4229 4481 4327 -4641 -4438 4497 4210 -4626 -4180 4561 4161 -4447
2224 -4447 -4155 4476 4025 -4544 -3973 4676 3879 -4538 -3819 4701 3724 -4635 -3884 4446 3828 -4552 -3705
2241 -3705 4577 3754 -4681 -3619 4297 3346 -4712 -3650 4557 3345 -4604 -3424 4461 3374 -4520
2256 -4520 -3414 4527 3503 -4453 -3229 4499 3309 -4465 -3193 4609 3280 -4302 -3122 4283 3214
2271C214p780J478P422j291p535J456P530j556p651J675P516j508p365J421P492
2286D518j513p266J434P287j661p251J621P238j578p150J601P032j591p218K002
2301b495O915j659p229K077O848j872p001J953O743j871o849K025O709j815o814
2316d335K065O669k038o687J878O713j851o559J913O525k022o450K036O379k040
2331B196o485K083O389k003o420K221O251k185o217J996O486k223o292K120O290
2346D207k105o171K101O242k352o238K467N948k416n780K525N662k335n940K337
2361a848N895k198o132K510N985k558n761K455N897k671n676K447N665k432n574
2376c996K527N438k508n656K677N631k604n456K390N492k470n629K553N674k730
$$ plain form
2271 3214 -4566 -3088 4334 3043 -4492 -3036 4494 2938 -4713 -3038 4478 2970 -4395 -2974 4518
2286 4518 3005 -4261 -2827 4460 2799 -4452 -2831 4407 2829 -4321 -2720 4312 2721 -4497 -2495
2301 -2495 4420 2761 -4468 -2391 4457 2585 -4416 -2463 4280 2409 -4440 -2415 4294 2479 -4335
2316 -4335 -2270 4399 2361 -4326 -2448 4265 2414 -4145 -2232 4293 2271 -4179 -2143 4236 2196
2331 2196 -4289 -2206 4183 2180 -4240 -2019 4232 2047 -4170 -2174 4312 2089 -4203 -2083 4207
2346 4207 2102 -4069 -1968 4274 1922 -4316 -1849 4099 1683 -4097 -1572 4090 1755 -4185 -1848
2361 -1848 4047 1849 -4283 -1773 4212 1654 -4107 -1652 4245 1574 -4102 -1655 4010 1578 -3996
2376 -3996 -1469 3969 1461 -4195 -1518 4113 1509 -3947 -1557 3935 1465 -4164 -1611 4063 1333
2391A333n376K762N233k587n222K462N379k842n142K632N270k649n282K829N065
2406C865k647n206K912M902k471n173K684M779k738m871K816N021k788m973K907
2421i81M958k866m997K771M742k552m701K755M790k896m645K623M859k832m651
2436c623K787M592k832m787L062M320k688m487K977M532k947m702L129M500l091
2451G42m243K799M428l058m407L293M089k922m426L133M327k951m476L130M043
2466C501k830m277L233L933k985m124K885M174l095l912K934M046l072m043L160
2481d72M115l178l946L047L931l208l845L176L920l156l702L079L651k988l991
2496c567L144L834l029l765L209L556l235l541L087L633l037l581L179L531l114
$$ plain form
2391 1333 -4043 -1281 3952 1365 -3857 -1395 3984 1142 -4000 -1368 3902 1253 -4029 -1200 3865
2406 3865 1218 -3988 -1076 3826 1355 -3818 -1134 3645 907 -3964 -1148 3873 1085 -3888 -981
2421 -981 3977 1111 -3886 -1115 3627 1075 -3626 -871 3919 1023 -3622 -999 3860 1028 -3623
2436 -3623 -836 3756 924 -3863 -801 3519 831 -3656 -679 3853 906 -3796 -667 3833 742
2451 742 -3501 -702 3726 668 -3739 -446 3643 721 -3705 -572 3755 804 -3672 -542 3501
2466 3501 671 -3606 -373 3560 575 -3549 -664 3510 415 -3497 -563 3483 411 -3632 -472
2481 -472 3643 465 -3481 -434 3497 289 -3556 -380 3540 384 -3318 -239 3412 424 -3567
2496 -3567 -423 3411 382 -3383 -174 3382 147 -3394 -307 3326 289 -3292 -113 3418 304
2511C04l641L101L464l076l562L333L376l170l428L188L369k982l473L049L473
2526C325l326l298L148L433l164l361K934L611l206l402L451L004l108l353L371
2541E9L179l119l440L230L281l337k925L268K962l243l053L239L023l293k836
2556c005L042K936l000l188L394K895l072l081L375K776l306k948L231K997l221
2571a75k860L030K843k989k958L190K984l170k799L103K884l162k983L344K769
2586C051l231k789L275K748l272k637L083K658l225k561L085K600l052k629L057
2601A61K654l212k446L134K529l232k372L249K270l176k353L108K451l055k377
2616b667L064K462l291k278L050K384l075k349L100K513l416k282L330K148l194
$$ plain form
2511 304 -3337 -236 3228 152 -3410 -77 3299 129 -3299 -111 3258 276 -3197 -148 3325
2526 3325 -1 -3299 -151 3282 118 -3243 -309 3302 96 -3306 145 3149 41 -3312 59
2541 59 3238 119 -3321 -91 3190 -147 -3072 196 3158 -85 -3138 101 3124 -169 -3005
2556 -3005 37 2973 -27 -3215 179 3074 2 -3079 296 3072 -234 -3182 49 3046 -175
2571 -175 -3035 -5 2838 -151 -3109 81 3065 -105 -2904 199 3083 -79 -3062 282 3051
2586 3051 -180 -2969 306 3054 -218 -2855 228 2886 -339 -2900 185 2785 -267 -2896 161
2601 161 2815 -397 -2843 291 2820 -412 -2784 465 2735 -441 -2794 314 2765 -290 -2667
2616 -2667 397 2859 -432 -2710 340 2724 -351 -2700 400 2913 -503 -2785 545 2693 -501
2631e01k049L006K123l115k249L130K384l275k173L268K005l024k071K870K143
2646B472l070j985L151J999l135k086L114K058l045j835K822K000l209j845L183
2661E89J925l222j763L106J961l265j803L085J916l130j868L041J742k888j743
2676b317K977J889l232j711L033J803l321j555L160J660k955j904L232J673l246
2691h14j273K805J705l419j405K979J761l238j446L098J508k920j685L161J438
2706B255l053j563L145J507l172j444L152J376l200j393L305J216l022j298K887
2721F98J592l038j518L195J206l119j115L043J189l081j167L197R48k996j211
2736b177L225J053l261j058L212R20k862j055L042R79k922j105K962J267l253
$$ plain form
2631 -501 -2550 456 2579 -536 -2785 345 2729 -546 -2719 549 2554 -470 -2541 329 2472
2646 2472 -598 -2583 568 2567 -568 -2654 460 2518 -527 -2362 460 2460 -749 -2594 589
2661 589 2514 -708 -2471 635 2596 -669 -2472 613 2529 -601 -2469 572 2314 -574 -2317
2676 -2317 660 2549 -683 -2394 639 2442 -879 -2434 726 2386 -569 -2473 759 2432 -814
2691 -814 -2087 718 2423 -996 -2401 578 2339 -899 -2345 753 2261 -659 -2344 817 2255
2706 2255 -798 -2361 784 2291 -881 -2325 827 2203 -997 -2390 915 2131 -891 -2189 698
2721 698 2290 -748 -2266 929 2135 -984 -2099 944 2133 -948 -2115 1082 2030 -966 -2177
2736 -2177 1048 2101 -1160 -2218 994 1914 -948 -2003 1039 2018 -904 -2009 953 2220 -1033
2751a033j117L109R74k944r31K967J134l184j077L052Q69k835q31L008Q89l078
2767a028r10K895R81l154q04L305N58k997p42L008O81k853q12L018Q63l184o21
2784a796L101O00l113p46L099Q10l124n93K801O05k726p60K948P07l030o04K935
2801A114O78k966m90K789O25k939o41L101N91l230l08K869O36l169l11K869L78
2818A596k771n44K830O45k930n26K887N18k794p64L133J74k679m52K920M12k814
2835a159l67K700L46k938j23K852J46k601m06K615N11k814k62K804M04k877j54
2852a323K704K65l018j15K633L93k806l79K896K01k752l08L083N5k806l13K779
2869A189K07k663o9K714j3k701m3K858o7k818q5K822r5k664J7K707J06k630j72
$$ plain form
2751 -1033 -2150 959 1933 -1011 -1942 1025 2159 -1025 -2102 950 1819 -1016 -1847 1161 2050 -1028
2767 -1028 -1938 957 1938 -1216 -2020 1285 1843 -1154 -1896 1112 1793 -1060 -1872 1146 2009 -1175 -1796
2784 -1796 1305 1905 -1208 -1954 1145 1955 -1169 -1762 1039 1644 -1082 -1842 1106 1813 -1217 -1821 1114
2801 1114 1792 -1174 -1664 1125 1750 -1189 -1830 1271 1862 -1368 -1676 1193 1829 -1340 -1651 1218 1596
2818 1596 -1175 -1719 1111 1756 -1174 -1700 1187 1705 -1089 -1853 1280 1454 -1225 -1677 1243 1655 -1159
2835 -1159 -1526 1174 1520 -1418 -1541 1311 1457 -1144 -1550 1065 1576 -1238 -1500 1304 1708 -1169 -1323
2852 -1323 1381 1646 -1372 -1487 1146 1539 -1267 -1646 1250 1451 -1301 -1609 1474 1529 -1277 -1590 1189
2869 1189 1396 -1267 -1336 1378 1365 -1336 -1379 1479 1412 -1406 -1491 1331 1236 -1428 -1411 1296 1402 -1228 -1400
2888a400K748jk808M7K811k5k720J45K413j3k642M09K456k42k545P4K657j66k576
2907a378K35K406o5k498l0K773k91k494M9K680j71k543K98K344o3k767K36K636
2925A357k43k534M00K348k09k357K85K376l76k459K68K576j97k650L36K450k91
2942A080k547M67K427m92k397M08K401k98k427J97K628m23k543O15K365o01k204
2959a344K65K435m50k196L94K353m25k521P87K082n15k265N24K310o77k146N65
2976h24K217m12k490O65K244n89k220O21K308o94k337N22K381o45k279O98K269
2993A435o25k363Q19K263p61k231O82K345p70k294P64K132o06k216N14K260p56
3010E92j833M44K110n36k248Q26K146p84k308R61K234r22k260Q59K268q21k184
$$ plain form
2888 -1400 1348 1347 -1461 -1414 1397 1372 -1348 -1203 1210 1197 -1445 -1036 1420 1178 -1367 -1293 1364 1198 -1378
2907 -1378 -1143 1263 1198 -1300 -1330 1443 1152 -1342 -1293 1387 1216 -1327 -1029 1315 1252 -1515 -1279 1357
2925 1357 1114 -1420 -1020 1328 1119 -1238 -953 1423 1047 -1412 -1144 1432 1235 -1415 -1079 1371 1080
2942 1080 -1467 -1000 1427 935 -1462 -1054 1347 1049 -1378 -1181 1447 1024 -1519 -904 1461 860 -1344
2959 -1344 -1079 1356 906 -1290 -896 1457 1032 -1489 -702 1380 865 -1400 -876 1434 757 -1389 -824
2976 -824 1393 981 -1509 -844 1400 811 -1409 -788 1520 826 -1511 -989 1392 747 -1532 -834 1435
2993 1435 810 -1553 -734 1529 768 -1463 -781 1564 794 -1500 -736 1396 790 -1426 -912 1348 592
3010 592 -1241 -797 1313 777 -1471 -645 1501 717 -1591 -630 1604 682 -1578 -719 1549 728 -1456
3027a456P40K317j098k094J011J952p67k141J078J951r33k183R84K015r59j937
3043a520R71K060j175j839R65J879p60k026P75K028p36k122J016J876r30k052
3059a590J116J958r50k124J246J742r10j888Q67K035j163j756R11K216j095k214
3075a599J055K010j189j763R53K055j026k006J132J648j009j877J143J924j021
3090D30j866J135J661q63k002J180J814j172j716J087J767j035j963J036K109
3105A602j090j964J134J766j181j582R96J877j223j684J095J804j394j596J307
3120a33J506j053j602J040J698j189j747J227J491r62j644J162J464j019j729
3135a490J330J690j237j943J256J671r97j618J313J567j445j464J147J614j286
$$ plain form
3027 -1456 -716 1601 503 -1591 -580 1372 605 -1536 -458 1493 560 -1623 -639 1376 417 -1520
3043 -1520 -549 1511 336 -1503 -538 1341 581 -1445 -670 1358 622 -1500 -484 1392 462 -1590
3059 -1590 -474 1484 534 -1590 -344 1398 488 -1400 -533 1502 339 -1417 -506 1710 615 -1599
3075 -1599 -544 1466 277 -1486 -533 1522 496 -1510 -378 1270 261 -1616 -473 1451 430
3090 430 -1436 -301 1360 497 -1505 -325 1489 317 -1399 -312 1455 420 -1543 -507 1602
3105 1602 512 -1452 -318 1448 267 -1315 -319 1558 335 -1349 -254 1550 156 -1440 -133
3120 -133 1373 320 -1282 -242 1456 267 -1480 -253 1238 276 -1368 -206 1258 239 -1490
3135 -1490 -160 1530 293 -1650 -394 1277 280 -1338 -25 1542 97 -1367 -220 1394 108
3150A08j503J252J528j219j643J253J640j179j582J185J437j089j445J154J518
3165A415j248j545J123J718j268j658J230J819j696j311J315J456j237j559J269
3180a77J561j361j507J498J576j645j448J334J447j331j238J289J454j293j681
3195a522J466J593j436j369J305J199j293j178J282J161j114j543J450J302j293
3210A0j444J461J251j294j538J627J329j443j336J394J265j423j300J543J221
3225A323j470j169J267J633j606j442J540J286j465j242J369J193j507j020J359
3240D9J447j527j288J513J094j382j420J585J480j572j346J501J091j265j274
3255a314J346J274j337j082J378J000j373j030J253J240j460j232J478J284j598
$$ plain form
3150 108 -1395 -143 1385 166 -1477 -224 1416 237 -1345 -160 1277 188 -1257 -103 1415
3165 1415 167 -1378 -255 1463 195 -1463 -233 1586 -110 -1421 -106 1350 113 -1446 -177
3180 -177 1384 23 -1484 14 1590 -55 -1503 -169 1278 -53 -1291 -2 1452 159 -1522
3195 -1522 -56 1537 101 -1268 37 1236 -57 -1235 47 1208 94 -1449 1 1303 10
3210 10 -1434 27 1278 -16 -1554 73 1402 -41 -1377 17 1282 -141 -1441 102 1323
3225 1323 -147 -1316 -49 1584 -22 -1464 76 1362 -103 -1345 24 1217 -290 -1310 49
3240 49 1496 -31 -1319 194 1288 -94 -1514 71 1551 -21 -1367 134 1225 -40 -1314
3255 -1314 32 1306 -31 -1113 265 1265 -108 -1138 115 1355 -105 -1337 141 1425 -173
3270a73r83J379J133j527j107J317J218j357j186J367J274j646r29J218J363j609
3286b48q95J449Q25j420j021J528J047j456j049J507J031j649j000J632J057j632
3302b94r45J615Q50j404j141J651R33j580j028J573J034j688j019J820R25j554
3318b52j024J645R08j602j010J677Q63j573p97J369J110j659p62J453P35j429
3334c48r97J688P83j590q49J428J115j616q37J550Q80j570q72J759P60j627p62
3351a105J456R11j621r37J643R65j772r26J737Q52j741m84J440Q18j670n74J650
3368F42M70j331p17J429P61j501q94J739O29j696p07J540R53j842n34J249J000
3385A190j868m30J576O19j682n68J563O80j522p47J701P15j779o05J696N69j609
$$ plain form
3270 -173 -1156 223 1356 -171 -1278 39 1257 -100 -1286 81 1355 -291 -1220 -2 1361 -248
3286 -248 -1143 306 1131 -289 -1310 218 1265 -191 -1240 267 1298 -351 -1351 281 1338 -294
3302 -294 -1239 376 1226 -178 -1319 332 1265 -315 -1343 230 1264 -424 -1443 377 1302 -252
3318 -252 -1276 369 1277 -325 -1335 342 1205 -368 -1165 204 1314 -345 -1107 346 1081 -348
3334 -348 -1345 343 1126 -464 -1313 115 1230 -386 -1223 327 1207 -363 -1235 524 1284 -343 -1105
3351 -1105 351 1262 -359 -1296 347 1312 -460 -1386 351 1203 -538 -1022 418 1236 -434 -1008 642
3368 642 1112 -219 -936 493 1254 -247 -1141 598 1227 -469 -1176 364 1317 -525 -1059 190 1190
3385 1190 -678 -1108 468 1087 -595 -1163 400 1080 -442 -1189 512 1227 -552 -1157 539 1108 -501
3402e01o44J611O30j672n99J591P61j578p48J817O27j850o50J765N41j629o58
3419a186J902M02j686n26J783L15j622m12J573N17j618n34J709M08j608n63J704
3436E58M92j886l44J783N58j818m32J611O23j697o04J851M23j610o01J629O06
3453A142j822l03J629N75j796n28J758M89j807m07J803K36j691k54J518L90j586
3470f54m72J784N08j868k66J597L19j497p29J935M50j797k20J769J79j838n9J545
3488F86K74j781l53K003J32j644J3J509L6j678l24K020J24j853p7J805O4j705
3506g49m09J960J99j848q1J705J75j844j30J808J65j614l99J822K36j850m6J886
3524I86L2j938k9J758p4j599j17J821j5j597j61J738Q9j835j91J888K3j601k8
$$ plain form
3402 -501 -1145 466 1096 -576 -1175 416 1177 -401 -1149 668 1295 -555 -1205 560 1101 -528 -1186
3419 -1186 716 1118 -568 -1094 689 1004 -618 -1030 543 1060 -558 -1092 617 1025 -583 -1146 558
3436 558 1050 -836 -1180 603 1161 -657 -1089 522 1145 -552 -1156 695 1118 -492 -1093 536 1142
3453 1142 -680 -983 646 1221 -575 -1103 655 1144 -663 -1070 733 969 -722 -976 542 932 -654
3470 -654 -1126 658 1166 -702 -968 629 948 -549 -1278 657 1107 -690 -910 859 1038 -800 -859 686
3488 686 960 -821 -1174 829 961 -683 -670 839 875 -803 -1127 893 1017 -836 -913 892 956 -749
3506 -749 -1158 802 1001 -847 -928 777 952 -892 -1022 786 951 -663 -1062 760 996 -854 -900 986
3524 986 1018 -920 -949 809 735 -864 -981 840 825 -772 -933 805 894 -941 -1132 756 779 -822 -850
3543h50J566K09j773J99J508J41j891MJ850j06j791q2J914j02j634RJ707K15j917
3562h24q5J831J8k029K27J730K0j744J69J513q1j785K34J811r9j798J69J608J15
3581A000j800l1J762l9j794O4J722J7j624j83J850j64j827M13J491q4j670J01
3599g96J798k01j726j5J876r5j922K28J941j88j893J06J912k72j730J44J847k94
3617G20j758J44J958k61j730J80J797l47j784L78J761l16j713K24J730k23j697
3634i37J18J957n40j714M64J760n00j637M08J768n09j737M68J824m26j913L57
3651g89J933n13j693K50J711j79j778N45J630m29j791N03J633m76j590K39J736
3668I42k95j637K73J836p48j496N80J616m80j848O38J743n34j655N50J781p35
$$ plain form
3543 -850 716 925 -848 -649 859 1000 -891 -887 963 857 -934 -1016 898 796 -838 -829 878 1093 -824
3562 -824 -909 922 940 -1089 -862 868 888 -856 -687 826 745 -1040 -806 1005 906 -892 -723 885 1000
3581 1000 -800 -831 931 892 -902 -838 884 901 -723 -906 944 780 -1047 -634 857 773 -897 -796
3599 -796 1002 801 -925 -940 936 841 -1081 -853 1088 900 -993 -887 1025 753 -977 -833 1014 720
3617 720 -1038 -894 1064 803 -927 -747 1050 703 -1081 -703 1058 742 -971 -747 983 760 -937
3634 -937 -819 1138 598 -1116 -652 1108 608 -1029 -621 1147 638 -1099 -631 1193 767 -1146 -789
3651 -789 1144 631 -1062 -812 899 720 -1058 -513 1117 688 -1103 -600 1033 557 -1033 -794 942
3668 942 647 -990 -717 1119 371 -1125 -545 1071 591 -1257 -619 1124 590 -1065 -515 1266 531
3685E31j716P39J527m65j785O12J772p72j496L41J917o29j630N95J514o59j512
3702a116M10J994p60j783P47J622p30j675O70J953p59j788P51J725q54j473O35
3719d31J678p94j514O97J592p84j702R90J494p80j701Q91J509p48j568R73J326
3736A128p88j723R64J614q05j511P14J594q55j474P75J525q52j402P21J802j060
3753C67j655Q97J528p77j483P02J731r93j391Q78J441j165j222Q59J515r34j613
3770a315J030J638r98j736J271J373r02j915J175J509q01j562J030J540j106j526
3786a295Q98J604j024j413J040J490r87j500R90J316j017j254J030J347j053j423
3802a251R98J673j040j718J132J676j288j348J028J248j056j117R77J423j159
$$ plain form
3685 531 -1185 -446 1081 616 -1169 -557 1215 443 -1053 -712 1205 576 -1054 -459 1055 396 -1116
3702 -1116 -706 1288 528 -1255 -508 1114 384 -1291 -621 1332 573 -1215 -464 1261 407 -1066 -431
3719 -431 1247 453 -1061 -364 1228 444 -1258 -268 1226 446 -1255 -364 1145 397 -1171 -198 1128
3736 1128 340 -1383 -419 1195 390 -1121 -407 1187 332 -1142 -367 1158 306 -1096 -375 1427 367
3753 367 -1288 -391 1137 360 -1123 -421 1310 317 -1074 -196 1245 80 -1142 -283 1232 298 -1315
3770 -1315 -285 1353 355 -1381 -110 1263 361 -1554 -379 1130 329 -1233 -203 1337 231 -1295
3786 -1295 -397 1207 183 -1230 -190 1300 313 -1187 -197 1119 102 -1152 -122 1225 172 -1251
3802 -1251 -253 1420 380 -1338 -206 1470 182 -1166 -138 1110 54 -1063 -86 1337 178
3817A78j445J186J287j094j401J143J391j205j332J293J213j064j459J159J410
3832A260j270j153J049J500j293j284J228J146r94j439J256J174j259j199J248
3847c0J307j190j331J396J255j404j242J268J178j018j449J308J177j366j045
3862a186J333J352j564j252J332J190j414r59J128J255j313j218J531J100j462
3877a47j072J255J329j526j100J285J316j435j160J395J173j575r17J133J315
3892A269j174j417J453J150j259j333J347J205j486r97J305J112j330j078J202
3907c1J156j392j035J536J027j548j139J697J049j654q21J367J016j571r96J531
3923A92J125j449j019J440Q61j388j085J532R51j356r93J453R93j623q41J548
$$ plain form
3817 178 -1267 -81 1206 112 -1289 -146 1245 40 -1292 1 1214 150 -1309 -150 1260
3832 1260 -10 -1163 -114 1386 93 -1191 37 1183 189 -1250 6 1180 -79 -1278 -30
3847 -30 1277 87 -1244 152 1407 3 -1239 29 1207 189 -1260 48 1225 -141 -1186
3862 -1186 147 1499 -65 -1317 15 1205 -209 -1168 -40 1215 -98 -1316 215 1315 -147
3877 -147 -1219 36 1365 -161 -1261 24 1340 -95 -1255 140 1313 -262 -1179 -46 1269
3892 1269 95 -1322 131 1281 22 -1311 36 1241 -245 -1242 63 1175 -155 -1233 -31
3907 -31 1125 -267 -1302 234 1261 -287 -1426 271 1320 -334 -1155 212 1228 -343 -1339 192
3923 192 1317 -132 -1151 289 1150 -238 -1323 209 1160 -196 -1189 264 1257 -366 -1207 341
3939C41Q18j420r64J472R44j557p45J439P52j477r22J659P99j524o80J304J057
3956A296j757q47J610R76j727p58J674O93j581o73J343R19j646o62J413R80j595
3973c42r73J738Q11j696p83J736O51j618p28J449P77j634p15J733P24j694n07
3990a071J383P78j567n41J516O88j883l39J528O44j542o36J666L88j577o12J626
4007D49P26j648n55J575O30j876l65J528Q63j911m42J680N42j690o04J751L89
4024A042j657l34J595L82j566n30J861L81j645p19J652O86j965k65J531P36j735
4041e50n60J893M19j833m90J716N24j747n25J743L86j668m05J708M13j663k76
4058i15J641L91j721n69J844L49j703m56J817M10j759l50J815K77j648l78J734
$$ plain form
3939 341 1159 -261 -1225 247 1191 -366 -1111 328 1080 -397 -1319 340 1139 -385 -1065 239 1296
3956 1296 -461 -1308 302 1278 -449 -1207 467 1160 -421 -1094 249 1168 -478 -1140 273 1253 -342
3973 -342 -1315 423 1234 -462 -1245 491 1142 -476 -1204 245 1022 -612 -1327 406 1130 -564 -1071
3990 -1071 312 1090 -477 -1018 498 1186 -697 -1036 492 1136 -406 -1042 624 1012 -565 -1177 449
4007 449 1175 -473 -1028 547 1177 -699 -1064 464 1327 -584 -1026 654 1196 -494 -1098 653 1042
4024 1042 -615 -949 646 1028 -538 -1068 793 1174 -471 -1190 462 1148 -817 -1082 449 1185 -550
4041 -550 -1110 783 1202 -631 -1121 595 1119 -628 -1153 590 976 -692 -1097 611 1024 -639 -915
4058 -915 726 1117 -604 -1173 671 1020 -683 -1139 678 1088 -671 -1021 794 1071 -577 -955 779
4075G79K46j766k25J670K56j621l52J728K42j757j37J768N9j663m2J586L46j828
4093g11l81J754M20j829k35J776J34j666j16J645K90j964JJ764J93k060N9J918
4111I92o0j783k8J638J36j710o5J651J55j642k35J710N2j673O0J586J28j822J07
4130h03J562P2j647j01J657K54j862J3J599k7j621M7J716K6j644q2J633r8j792
4149a098K82J724j08j578p4J804k16j644L3J792l24j575J25J648K1j767J56J672
4167H73p2j742Q4J645Q4j700K16J626j89j857K99J565O6j995N18J475j99j646
4185i49K56J678j97j686J7J799j50j726K15J667l52j714N09J592k41j605K49J644
4203A006l14j698L49J713m90j589K20J792l14j593L12J387j63j672M09J610m50
$$ plain form
4075 779 1025 -741 -966 704 960 -661 -1013 715 957 -800 -937 831 890 -773 -815 771 1117 -711
4093 -711 -1092 662 1082 -747 -982 794 928 -738 -854 791 1081 -883 -882 882 1075 -985 -926 992
4111 992 932 -851 -879 759 895 -815 -880 771 926 -716 -951 759 811 -862 -802 784 912 -910 -803
4130 -803 759 831 -816 -917 740 994 -868 -855 744 717 -904 -857 859 885 -759 -841 792 694 -1098
4149 -1098 -816 908 800 -778 -852 952 736 -908 -875 917 593 -982 -857 791 812 -955 -799 873
4167 873 801 -941 -857 788 872 -828 -612 1014 825 -1032 -733 832 898 -1097 -579 896 697 -949
4185 -949 -693 985 788 -898 -881 918 768 -958 -743 924 572 -1142 -633 959 718 -887 -638 1006
4203 1006 692 -1006 -657 1056 566 -1023 -803 989 675 -918 -606 781 618 -1054 -645 965 515
4220E15j469K75J569k44j665M08J768m27j732L46J698l58j608L08J588m77j728
4237a233M69J782m27j785O29J659m91j432J36J803m75j657N10J611o08j427M34
4254e02J592n82j507N07J559m82j659O40J530n36j563M17J637n67j613O35J542
4271A048m55j596N78J551p87j268L65J503m04j663O35J511o24j503O85J371p29
4288B18j223N75J550p27j537O68J519n96j430N50J472p31j439P77J350m94j629
4305a127O18J569n51j477M65J754q36j542Q01J386p39j401O34J647r81j240P04
4322c16J250n12j418Q27J342p08j578Q18J357p45j436P49J483q73j354Q60J402
4339A148p61j529O58J569o83j353O09J455o49j637R95J249q10j250P54J251o30
$$ plain form
4220 515 -954 -679 890 646 -1019 -611 1157 730 -1002 -656 1042 684 -924 -616 972 495 -1233
4237 -1233 -764 1018 591 -1194 -565 1094 603 -829 -693 1110 635 -1022 -512 1099 491 -936 -502
4254 -502 1090 508 -999 -492 1067 585 -1074 -434 1096 560 -1003 -586 1051 484 -1129 -494 1048
4271 1048 593 -1003 -425 1126 339 -929 -564 939 535 -1128 -493 1018 394 -1109 -424 947 218
4288 218 -1005 -430 1120 393 -1144 -476 1043 447 -983 -433 1039 308 -1131 -354 996 502 -1127
4305 -1127 -509 1060 509 -968 -503 1251 415 -1127 -326 1060 321 -1080 -446 1201 220 -1020 -316
4322 -316 934 422 -996 -169 1173 465 -1113 -295 1062 317 -1119 -370 1113 240 -1114 -254 1148
4339 1148 387 -1142 -484 1085 402 -951 -342 1113 464 -1173 -178 1071 261 -989 -235 1016 386
4356C86j398N94J493p26j379Q73J197o43j427Q89J232p81j211P03J119o20j300
4373i99P34J389r53j322Q42J451q93j210P70J219q02j311P00J566j050j204Q06
4390b67J426j036j132Q06J350j062j253J060J339r71j215P40J395r68j174P69
4406a93J139p68j290J020J149p32j293R28J033q86j051P11J141p40j265J071J037
4423A011r40j252J214Q43r32r67R51J177r55j221J050J116j107j040J128R81j041
4440A6r83P33J239r41j070Q43J196q83j159Q88J247r72j264J155J081j077j103
4457a054J029J203j229r78P91J201r72r63Q94J064j061j164J077J238j161j026
4473a111R89J028r27j031J062J058j181r50R71J154j137r72R50J060j015j120
$$ plain form
4356 386 -1012 -418 1075 349 -1030 -157 1040 397 -1030 -141 1091 310 -901 -198 921 301 -999
4373 -999 -265 1124 171 -1151 -309 1142 249 -961 -191 1028 226 -1085 -385 1181 131 -1073 -267
4390 -267 1159 123 -1009 -203 1147 85 -1168 -108 1231 260 -955 -215 1180 212 -962 -193
4406 -193 946 178 -1112 -92 1057 325 -968 -40 993 107 -944 -233 908 168 -1097 -26 1011
4423 1011 71 -1181 33 876 -56 -1023 -72 1105 150 -1071 -21 1095 -12 -1052 76 1057 16
4440 16 -967 -234 1005 64 -1006 -163 1033 150 -1009 -121 1126 154 -1110 45 1126 49 -1054
4457 -1054 -25 1178 -51 -1029 -238 963 -9 -972 -78 986 -75 -1239 -162 1076 -85 -1111
4473 -1111 -122 906 -21 -1052 10 1068 -113 -1063 -92 1062 -75 -1047 -97 963 -52 -1172
4489a172J326Q32j160j015J280Q38r66r82J112J033j251r98J239R04j068q47J017
4506A22P90r96q15J103P99j044r03R68R52j022r01J012J104j365o71Q94Q95q87
4524C5r82R48R20r53j004J200Q27j022r68Q67J121j089r24J077J018j331p93J090
4542C7J095j392q00J282R68j382p62J191Q09j181q68J084Q56j192n77J075Q23
4559A066j130q86J277N64r18r42J086P84j097p68J112R21j183p32J094P39j330
4576c43n73J129P71j146q36J254N55j098o70J007Q68j126o70J155N84j016o62
4593h17Q14Q71r88r71J322O79j138o37J061P66j019q61J123O35r35q41J248M74
4611G86q98p15J051P06j167o42J222O72j225o01R30Q88j353o80J152P79j168o62
$$ plain form
4489 -1172 154 986 -174 -1189 91 929 -37 -1019 93 1126 -125 -1123 116 1020 -48 -895 122
4506 122 912 -84 -899 204 1003 -41 -944 24 976 -46 -947 65 1169 -196 -867 27 922 35
4524 35 -947 1 921 -32 -1036 164 991 -31 -999 -132 989 -100 -1024 53 1071 -260 -1053 37
4542 37 1132 -260 -1060 222 1190 -192 -954 237 1046 -135 -1003 81 937 -255 -832 243 1066
4559 1066 -64 -950 327 891 -27 -969 117 901 -196 -964 148 1069 -114 -846 248 987 -343
4576 -343 -916 213 984 -162 -998 256 811 -287 -957 50 918 -208 -878 277 861 -155 -817
4593 -817 -3 868 -120 -1091 231 910 -228 -865 196 962 -57 -918 205 840 -95 -936 312 786
4611 786 -112 -827 224 930 -237 -879 343 1015 -210 -811 119 1007 -346 -1026 126 905 -263 -925
4629i25J233N93j319m50J106O75j195m83J066O67j298p24J200O61r51o61J075
4646B70N58j156n68J254M36r74p13J184N44j004p30J201P33j154o35R91M91j201
4664d73j86J046L40j184m03J117O68j168n89J245M18j121n11J127M77j153m75
4681h25J104O24j164m62R57N83j125m57J074N08j138m37J177M56j258m35J173
4698C55M48j110l96J157L00j220m04J317L52j028n57J177M21j038n75J128L90
4715G17j007m35J204K93j079n58J122M08j027l86J064L96j132m93J285L33j155
4732d50l77J245L54r76n36R93M99j077l36J034M13j016m78J131L71j185l21J017
4750C05L79j068l95J073N90j287l80J164L41j247j99J068J88q72m59J186J59r99
$$ plain form
4629 -925 308 901 -418 -868 238 913 -282 -765 301 968 -330 -1054 146 807 -144 -805 270
4646 270 828 -328 -896 358 794 -180 -893 291 835 -169 -899 302 1035 -119 -754 237 728 -473
4664 -473 -659 387 727 -457 -860 257 925 -243 -832 413 831 -290 -801 326 803 -350 -825
4681 -825 279 903 -261 -723 234 817 -308 -765 309 817 -321 -758 419 875 -383 -818 355
4698 355 803 -307 -703 454 754 -466 -870 447 799 -229 -786 391 812 -226 -801 327 717
4715 717 -290 -725 479 772 -307 -865 257 665 -362 -748 316 712 -420 -913 372 705 -450
4732 -450 -827 418 772 -204 -740 253 752 -325 -661 373 786 -230 -708 423 794 -391 -712 305
4750 305 684 -384 -779 294 884 -403 -783 381 722 -525 -724 344 532 -340 -799 387 546 -453
4768d53k76J242J36j144l27J041N81j179l06J127K48j137l38J087M06j120n7R87
4786E18K00j069k88J169K30j331j35J050L16j213m3R24K17j025k43J198K28j341
4804f38n5J247J64j069m35J257K35j313j34J242L2j023k30J235J57j337j71J270
4822D34K85j079l44J103J04j074m7J214J84j251j81J164J93j262q8J043K59j186
4840e29k04J206J7j197K51R54J9j154k6J105L01j263j0J221O5j292j03J152J7
4859E30q49k89J036K21j287K15R00M4j195J23J142j05r78j03J171k9r35j18J075
4878E69K03j067m5Q14J35j237O4J062K4r88l26J379j64j175K45J059Q7j352J11
4897f02J029M3j032mJ058l0j038J0J095j51r98m1J322j66j058O7R43Lr43j68J354
$$ plain form
4768 -453 -729 513 649 -495 -822 219 800 -379 -685 442 690 -447 -785 302 708 -412 -469 518
4786 518 718 -351 -639 530 760 -571 -706 344 660 -553 -596 328 545 -480 -723 475 703 -638
4804 -638 -693 554 718 -351 -786 471 706 -607 -741 501 533 -490 -720 515 672 -665 -836 434
4822 434 719 -360 -704 399 503 -571 -618 596 780 -471 -652 512 705 -557 -645 398 657 -529
4840 -529 -733 473 490 -707 -456 498 517 -637 -663 442 743 -520 -530 691 756 -536 -639 513 530
4859 530 -319 -608 428 649 -638 -423 477 521 -674 -551 591 486 -492 -595 576 547 -388 -506 569
4878 569 772 -295 -340 474 609 -628 -564 498 522 -466 -792 587 423 -752 -507 552 639 -713 -602
4897 -602 427 470 -562 -566 492 462 -576 -566 529 378 -620 -661 661 495 -563 -496 447 450 -493 -661 693
4918F93p5j307J23J156n9j130qJ214j99r31r2J242k40j117L34R46J14j125J40
4937c21Q89j24j132K07J028o3r92J04Q70j01p58o3J011q0j014Q6R61J9j122J27
4957d68R82J7j057qJ186k51j051R9J001J67j274J27J122j52j063K20R64k26p90
4976d55L3J063l61q60K06J014j50j147L02J156l99j201N25R95m11q33K07R67k95
4995C56j167N57R43k16j240K98J109l64r14K18J086k80j111M59Q70k61r29J40
5013d46J100l40q82L25P63l70r39M44J073n08r72L86Q28K4j073L32Q08j44j110
5032g01L32R33k62r61K65J157l46j083K74R46j32j218N58J004m94q24J38J046
5050F32l04q60K52J036m70j104M97J005m59q87K68J065l13j071L86J076n15r00
$$ plain form
4918 693 618 -689 -566 590 531 -599 -607 607 408 -523 -615 627 387 -730 -396 550 664 -461 -321
4937 -321 568 444 -688 -481 547 484 -508 -404 466 365 -393 -456 555 475 -539 -453 508 527 -595 -468
4957 -468 514 531 -526 -534 652 401 -650 -551 450 617 -657 -530 592 440 -623 -403 561 335 -455
4976 -455 -422 641 280 -580 -374 640 490 -657 -355 801 402 -799 -274 721 310 -523 -316 651 356
4995 356 -811 -254 689 473 -767 -469 640 276 -638 -420 666 386 -725 -266 604 343 -586 -446
5013 -446 654 314 -568 -243 520 150 -789 -345 728 220 -752 -366 462 486 -587 -255 553 409 -701
5032 -701 -369 564 302 -659 -394 763 417 -666 -392 554 422 -796 -238 766 272 -552 -414 632
5050 632 328 -532 -280 756 286 -818 -321 684 225 -662 -394 671 358 -713 -327 749 234 -666
5068f66L39R65m56q08M12P19k81r84L84J063m91p56L41R29m77j011O94P72l50
5087C38j061N03P90k12j074N16Q07l16j025O14P83l97j006M55J113p35q12M49
5105b70R10m48q47M11R36n79q36M35J047m64j170O45Q62n99o91L70J096n94q28
5124f14L88Q36m38q29N80R26q09o07L08J092o72q32O84O65n04q86N54R96o53p78
5144e93N59O16m08q06M65Q49n23q02M83R08o47o40M55P04l84q93N80O74m90o94
5164e87M97Q55p73p33O43Q58o61p08N48P38n76o96N17P80o12r11P51P73m87q55
5184f39N14P87o26o69O09P09n42p27L42Q70n35p04M43P98o38p20O75O49n47p22
5204f73O20P42o60p72Q06O16n68o99N07Q01o74n87N08P77p17o49N72Q10r04n33
$$ plain form
5068 -666 -327 638 182 -626 -214 505 224 -760 -376 687 196 -560 -219 710 233 -778 -84 688 338
5087 338 -723 -220 570 358 -716 -200 607 291 -734 -120 663 266 -740 -285 828 93 -719 -270
5105 -270 640 192 -655 -244 692 113 -723 -288 759 295 -875 -230 632 33 -658 -288 808 214 -614
5124 -614 -226 610 172 -657 -77 849 40 -567 -259 833 161 -671 13 678 174 -712 -158 838 185 -593
5144 -593 -34 582 174 -632 -167 682 159 -643 -160 748 101 -539 -84 620 236 -657 -77 597 107 -587
5164 -587 -90 765 -8 -741 -98 760 99 -609 -61 677 101 -595 -78 702 90 -821 -70 703 216 -639
5184 -639 -125 662 36 -633 -24 685 143 -584 -242 628 93 -611 -168 630 -8 -728 -53 596 49 -673
5204 -673 -53 689 29 -743 63 679 111 -588 -81 720 46 -541 -33 744 27 -622 -50 760 -144 -677
5224f77L99Q46n98o76O63N89n41p10P70N22m87p67O90N51m87p62N94O94o05p55
5244g47O75P18p97n53Q67O69q77o27N62O31m80p01O66O71o47n07O20N88p82m53
5264e04M50O49m76q70Q86N77p14p01O45Q33p18o51N72N53m55n50M71N89n31p44
5284f89P06O10o83n06N25O87p92m73P02N23p91o09Q73N70p42m97O69N62o79p03
5304g37P84O06q14n85P65N09n05o38O83P05p30o60P24N33p42m89O19N20p17o02
5324g71Q81M38p08m96Q87N74q50o65N58P28o75o15Q24L66n04n73P95L76q23l51
5344f04O67N71o91n08P56N98q47o11Q59M37o16n29O11N08p15m26O40L98n98o41
5364g41P96N34p62l75Q55J78o85l71P44M38p90l82O24M24n25m05M91N58n64n53
$$ plain form
5224 -677 -278 568 -30 -706 -43 546 5 -705 65 587 100 -667 23 574 87 -675 -81 613 8 -747
5244 -747 -72 646 -151 -704 163 832 -45 -672 -110 521 41 -660 6 677 30 -477 143 731 -51 -504
5264 -504 -54 595 119 -751 135 712 -2 -703 -58 775 57 -594 -22 531 76 -474 -3 586 55 -689
5284 -689 17 627 -56 -562 -37 650 -142 -615 87 610 -181 -790 83 653 -89 -586 83 645 -34 -737
5304 -737 47 653 -161 -746 19 528 23 -615 68 773 43 -617 107 640 -102 -591 28 548 -169 -771
5324 -771 110 548 -160 -656 231 805 -45 -710 -152 576 -99 -714 110 476 -28 -601 194 570 -253 -604
5344 -604 63 634 -57 -565 191 789 -58 -669 190 627 11 -518 93 601 -114 -540 100 498 -100 -741
5364 -741 55 589 -173 -548 307 485 -200 -571 173 611 -179 -561 63 487 -38 -443 48 606 42 -511
5384e11N30M64q17k17O73N15q45l82P39L33n97m63N64O24o43n65J005J89p30n09
5404f43P72M36q64k85O94K99m02m45O04M00o99n01P76L02o07m33Q09K39n99l21
5424d68O94K93p20l53Q52K18o85m80P34M81q27l80Q96K34p69k43Q36R7p34k98
5444f22R05R4o37k36O53N56q77l47P34L37q32j32O20L86p23m38Q37L40q54l69
5464f05Q67L46p88l59P77K90p49j80P11K80p11m74R18K19p36l77Q42J89p57j27
5484d24O59L40q90j97Q27Rn63k33P79K63q15l21P58M40j022n6N12L18p74p5O62
5505A97l6n17j96Q59ln93k25Q03J94q00k57O62K83n86j22M65M81q71j91P95k9
5526C13o32j65P31K13q62m7P48J95p66j53R33p3o53k74Q71J54r49Q5Q66j73p25
$$ plain form
5384 -511 19 483 -334 -551 122 637 -208 -590 149 482 -115 -578 -14 610 -33 -598 407 596 -134 -643
5404 -643 129 565 -299 -584 110 409 7 -438 166 566 -133 -634 142 444 -163 -596 213 452 -147 -468
5424 -468 226 519 -201 -554 298 516 -169 -649 85 566 -261 -641 255 489 -280 -523 313 410 -324 -622
5444 -622 283 377 -260 -496 157 713 -164 -511 223 560 -272 -404 216 602 -121 -559 278 618 -236 -605
5464 -605 262 608 -180 -539 238 528 -221 -401 310 590 -121 -595 323 542 -194 -571 271 460 -297 -424
5484 -424 235 575 -315 -512 315 324 -239 -472 307 570 -245 -566 192 632 -390 -446 66 384 -390 -465 197
5505 197 161 -356 -552 307 304 -289 -514 289 483 -317 -574 88 371 -215 -337 128 609 -262 -453 342 313
5526 313 -319 -484 247 460 -402 -449 299 494 -272 -425 508 435 -218 -492 379 533 -416 -331 535 362 -363
5547c63l4P69M2p50L7O73l1o29j27O52J38n70k45P89K9p44p9P49K72j015p0O86
5569A79M41o81k00M49L06q28n8P33P4q07o4R13r2q09N0Q72L5r52n8P39Q4p49J46
5592b77P03n2n70l08Q20L7n57k21Q58m2n70p0M51K10o83O7N77o1o87K4O63J59
5614D71q98n4Q39Q7o96o2P46Q7p80k3P69j18p67O7P99k80n57M3P47p0o51j62P87
5637C24j01o62J89P08j03q18J49P87J3r10J10P63p8p06j1P00j08o04n8P39m6o69
5659c92M0N95J3p13P2Q28L9r05J93Q52j48q81L7O84j5m89j66P30q2p65L34N98
5681D59k19m81j01P87j89p04J44Q69l21o77J69N71K2o53pP24o2p33J63P26k88
5702A99o36J64O42K4p20N4P50l22n54K50O32k99p10M17K90R4p74J38Q28j84p07
$$ plain form
5547 -363 -397 372 414 -336 -299 374 343 -286 -413 239 377 -193 -438 351 380 -364 -443 306 578 -437 -507 179
5569 179 620 -61 -261 188 494 -334 -392 341 415 -392 -456 457 365 -444 -394 478 513 -439 -497 242 326 -423 -277
5592 -277 426 374 -196 -504 316 353 -204 -425 433 391 -179 -249 202 412 -271 -204 373 312 -375 -351 312 471
5614 471 -427 -481 358 445 -251 -313 433 520 -260 -283 486 368 -399 -332 467 187 -370 -327 420 350 -301 -463 324
5637 324 223 -439 -250 458 355 -463 -314 473 486 -424 -314 449 371 -335 -346 354 246 -358 -416 323 277 -392
5659 -392 -352 243 256 -457 -385 443 482 -423 -230 622 474 -407 -370 314 299 -190 -356 374 292 -473 -139 459
5681 459 240 -241 -342 445 256 -448 -304 565 244 -433 -264 307 329 -324 -331 393 331 -402 -239 487 199
5702 199 -437 -273 369 393 -327 -273 477 155 -399 -149 483 184 -526 -109 181 275 -499 -361 467 283 -424
5723d24J93P57j26o93P1O09j24o63N9O65L7p78J23N83L5o43K4P63j83o43K07M68
5745C17j86l87J07M72j51o44J09Q39k50o46J39P36j56o66J82O46j06n89J47N06
5765D19k39o23J42O82k06o65L11M94j31p41L55N64k59m36N6Q89l95o36K40M68
5785B89m3o32K07O86l54n29J68O38k01o02K02P21l55o35K45Q00k53o85K07O13
5805D87k55p35K98N44Kq15L01N62j61p10K65O93m07m27R0P40k88p18M83O11l91
5826A69n18J01M86j42m23l8P69l18n42M07M23j56m92N7N70j29p83L36N94j91p04
5847e24L78N56k89n96M24L22k51l44J80N68l38o36M11N49k47n16J91N17j99o68
5867e12N21L27l18m00K43P02n02m33K21N94k66p95P46L05l44n42K53O05l78k97
$$ plain form
5723 -424 -231 526 400 -293 -222 387 263 -400 -341 324 361 -417 -294 289 324 -319 -295 468 285 -358 -151 317
5745 317 131 -256 -149 323 172 -472 -363 476 226 -420 -281 455 299 -367 -185 461 355 -234 -87 419
5765 419 180 -443 -301 381 175 -490 -179 315 184 -557 -202 362 103 -333 -277 612 217 -419 -179 289
5785 289 246 -386 -179 507 153 -376 -208 430 229 -373 -171 550 195 -440 -195 605 352 -333 -126 487
5805 487 232 -503 -205 339 341 -474 -173 389 228 -482 -217 476 69 -358 -268 472 184 -534 -51 560 169
5826 169 -349 -248 238 96 -327 -365 404 86 -456 -49 374 218 -274 -217 353 224 -559 -223 371 180 -524
5847 -524 -146 410 121 -475 -51 271 20 -324 -144 424 86 -550 -139 410 163 -353 -162 355 156 -512
5867 -512 9 336 18 -382 -139 563 61 -372 -151 443 177 -618 128 433 89 -453 -200 405 27 -270
5887b70L4O45k08m83P6M43j95n06L56N12j43o79J41P82m52m77L57N88n07l27L00
5908a3N62m38n39L61M71l66m99K80N47m01m01K62M75k13n62N26L44l99k03L8O61
5929D93m96l12M27K86l49m92M43L73j87p09M36O83m91m26K60N94m68l63K79L69
5949C50l74l93M23K95k91n19L58M64l19n19N36L72l30m14K34N53k76n69L96L22
5969B99k66m10K68N58m64m68L42M53j98n61M19M35m02k81L20M26l36o58N07L89
5989C72l90n25M04O62m10l30N0P27n85l57M83J81j49n53K66N61l72k65L08K62
6009C40l01m83M42M62m16m20N14L34n36l11L67L24m05l88M96M00l54n26M83M24
6029D46m05l96L48L23l90l30R1P19m46m42N05M95n43n11N30L95m09l83L80M04
$$ plain form
5887 -270 -236 409 201 -282 -206 237 42 -464 -108 404 261 -418 -277 505 53 -424 -67 521 14 -313 -13
5908 -13 549 111 -428 -67 404 38 -461 -181 366 -35 -436 -174 301 88 -474 52 396 -3 -206 -168 493
5929 493 -3 -315 112 398 49 -443 0 373 186 -523 -87 596 105 -321 -61 533 65 -298 -19 350
5949 350 -24 -417 6 301 10 -509 -151 313 -6 -525 11 383 53 -361 -127 426 150 -419 -23 299
5969 299 33 -377 -109 449 -15 -483 -141 312 114 -447 -28 407 5 -276 44 470 134 -524 -17 372
5989 372 -18 -543 -139 523 113 -217 -167 560 -25 -382 101 282 133 -420 -154 407 35 -230 78 340
6009 340 39 -444 -2 460 44 -376 138 472 -64 -375 -8 316 -89 -477 19 419 65 -461 22 446
6029 446 41 -355 -7 316 -74 -404 -313 406 -40 -482 23 518 -25 -536 -6 389 -20 -403 -23 381
6049C81l54l59M17K84m42l48M75L43l40l42L06L22m91j33K36M86l36n93M49K42
6069B03l05l87O52J79l92k59M16L09n60l38N46K76m18k90M66L50n57k57M60L23
6089D17n08l59L70N56o06j74K92K95k90l43L64L90n50j87L98J96l26j94K52L32
6109C25m65j50K44L57m84l34O50K71n06j27K11M51o18k13M37K82k99l82L88M21
6129D59n58m08N72L73m72k28L13K68m39k79M42K01l83l56M85L25m52k91N10L47
6149D29m72k03L95K85n08l87N12K92n07l18O00K55m38j87K42L95m25k36L34M01
6169D59n49l11M63K20m48k06M89J64k89l45N57J97o51o6K81M15k83l44L19K70
6189C42n86o3N42M9l68l00N28J81m05k03L62J75m31j80N54L9n16j49O74k4m07
$$ plain form
6049 381 27 -332 85 369 -73 -421 54 397 57 -285 21 343 -148 -281 -45 441 105 -488 -39 203
6069 203 -102 -489 163 342 -50 -309 107 416 -144 -482 64 340 -78 -368 98 448 -109 -366 94 417
6089 417 -91 -450 -80 476 -130 -304 -12 283 -7 -350 14 404 -146 -333 65 261 -65 -259 -7 325
6109 325 -140 -290 -46 311 -173 -507 143 414 -92 -219 -8 443 -175 -388 49 331 32 -350 38 459
6129 459 -99 -507 65 438 -34 -262 51 319 -120 -399 43 244 -139 -495 -10 315 -137 -428 82 429
6149 429 -43 -246 149 434 -74 -461 51 343 -164 -482 118 373 -65 -252 -10 385 -40 -276 58 459
6169 459 -90 -401 62 282 -166 -372 117 281 -8 -353 204 401 -250 -316 -35 380 97 -247 72 342
6189 342 -244 -307 235 284 -84 -384 144 325 -80 -283 79 254 -177 -357 197 236 -280 -429 245 221 -186
6210a86k66O08ql12j17L66J61m28j47L93M04r10K06J70L37l64j89L64K60m23j73
6231b54M42Nl99j43M02K55n33j41M62K3j63k29L35L20m42k10M27J96m67j15M09
6252A80K26o13j13N52o9l29j63O18L5l57k30M34J85o26j4M00J09m26j11N22J01
6273C11m21l35O38j2l61k48P01L3m47j62N19J02o09O7L74n1k35r1L39J79n26n6
6295b91M85K4l09m7L57N3m84j22M66K14n73p5M33j6l33lL98k2k98k00M57M3l87
6318b30K7L65J01n15J11L65k1l82n5L06J43l48KJ33L00n57K42N9J8j10j35L12
6340A31J0l40J8L02pl50j6M41j9l44OM07J10o30J14K53J06m01L2M91j52n14J15
6363b37L64R2n25J83K03J00k40j34O54l55l48J19L20Km20K10J40J13m28k52O52
$$ plain form
6210 -186 -452 156 148 -164 -281 85 246 -182 -329 64 468 -442 -236 -66 271 -93 -282 82 342 -81 -254
6231 -254 188 193 -206 -349 53 308 -225 -366 96 119 -44 -273 62 382 -60 -270 157 353 -114 -229 180
6252 180 406 -207 -320 232 163 -166 -329 289 324 -33 -263 171 356 -270 -284 116 225 -201 -312 210 311
6273 311 -110 -445 193 181 -180 -428 273 306 -141 -303 216 318 -291 -224 150 99 -136 -227 112 291 -235 -291
6295 -291 194 218 -91 -138 219 272 -212 -334 132 346 -227 -302 131 115 -218 -221 177 155 -143 -343 114 157 -230
6318 -230 -203 162 263 -252 -141 224 203 -179 -234 72 215 -133 -131 2 302 -255 -13 46 64 -46 -181 131
6340 131 141 -199 -181 121 114 -236 -252 189 170 -174 -168 239 349 -281 -167 86 192 -209 -177 314 162 -352 -237
6363 -237 127 219 -306 -123 80 180 -60 -194 460 105 -243 -124 196 198 -222 -12 128 241 -187 -439 213
6384B13j91k02m2L25J01m92J28N25r2m42j22M52Mk41k81N66j8o15L33L66j21k87
6406a33j50N83j05n34KP04k40l95m4M88L9m43l8M69j9l48J07K37Rn49J99L38K0
6429A97m99K51K50O8m47NL42J3m86Q9L63m5m40J47N40m2m65N6L11n1m24J78M33
6452C44k18l93K07L37j08m21J66L32r6k96j0K83m4k08l1L47j54l77L57K51m7m78
6474b57m4P68l50m01J26L30m6l91R0K59Nl11P0K63q1l09K28K63j91j64J06J83
6496A46o1m37J99M31o9m77J71K24L1k56j79N93k8m55O6M60k18l00J14O3K17m83
6518b48K26K18k26k11L52J9j39j19J0L79j87j7j05J33kl23J68L34k40l52P7M31
6540A78m9l29J46L49j99m72K18L39k02k33J13L21Km08Q0M90j56n37J45N55k21
$$ plain form
6384 213 22 -180 -222 103 204 -288 -160 365 273 -169 -291 161 165 -76 -357 209 191 -424 -91 275 154 -133
6406 -133 -283 300 195 -339 -337 367 127 -268 -312 176 215 -228 -266 203 184 -164 -57 180 189 -360 -161 177 197
6429 197 -302 -51 199 267 -180 -175 167 180 -306 -217 146 101 -339 -192 348 306 -159 -103 208 157 -267 -89 344
6452 344 126 -267 -60 277 169 -252 -86 246 150 -146 -156 127 83 -125 -156 191 37 -340 17 268 221 -257
6474 -257 -301 467 117 -284 -158 172 126 -265 -175 84 89 -222 -152 111 30 -279 -51 212 21 -143 -37 146
6496 146 85 -352 -153 278 209 -268 -97 127 158 -98 -277 316 288 -167 -101 359 141 -159 -45 18 235 -248
6518 -248 -22 196 -30 -241 111 130 -9 -128 -118 261 74 57 -48 85 83 -240 -72 262 22 -330 -253 178
6540 178 129 -200 -54 295 96 -376 -158 181 -21 -254 -141 180 182 -226 -146 344 188 -349 -204 351 130
6561A30m01Q4L97k13l17L11K55%n61J56L83j64m06K51K51J1m14R3M46j39m58K39
6583f6K61k28Qj36M39j27l19J14L99l35k76J42M42k24l48J85M08k96m85J98O40
6604C96l92k69J73M29l28j44J25J29n3l89K11L36n8l70K65J42l01q1K43K99l90
6625b7k13K57K10j64j81K47J66l33l75M49J97k47k35J39L68l24j10K04K79k26
6645H1k81J71M19m36k35K75K48k14k90K29J62O3l78L06J03q6m89K30L31m9l14
6666a54n0L86j22k97J79K35j03k53J62K39k40j58J54K50k53k98K43L16k07k00
6686a71J36K07k27j07K46J05r7l51J39M72k49m22K72K71j07l46J68L37j47m35
6706c06L55J61l55K5P5K26j88k01Q8M28k63j15m4K16k25j31J87L24k70k84K93
$$ plain form
6561 130 -271 -187 210 -3 -320 -9 246 246 -315 -159 224 60 -346 -95 156 167 -247 -154 292 153 -305 -66
6583 -66 195 -33 -25 -161 278 151 -168 -54 345 10 -266 -124 318 94 -254 -69 339 43 -442 -244 396
6604 396 4 -265 -92 337 9 -135 -10 119 66 -323 -112 224 166 -204 61 203 -98 -179 64 363 -27
6625 -27 -240 17 227 63 -118 129 295 -38 -413 36 233 -14 -249 -110 258 -66 -176 28 307 81
6645 81 -200 -29 390 -46 -281 -6 242 28 -262 -33 129 192 -186 120 223 137 -352 -122 209 160 -154
6666 -154 -204 182 60 -237 -58 177 74 -179 -17 222 -18 -176 -22 228 -25 -323 -80 236 29 -171
6686 -171 -35 172 -55 -162 84 189 92 -259 -120 352 103 -319 -47 224 117 -229 -61 276 129 -306
6706 -306 49 210 -145 -120 -45 181 -7 -208 -120 308 45 -70 -114 102 -123 -254 -67 257 -13 -297 -4
6727dJ88k49n8J10K49k12k08K51J78l20j79L02K85k77k88L74K34m99L4Q7m1Q0
6749C7k90L81K1k50j52L51J58k96l14K92K25k00k84N10J18k18l38K71J29p0m34
6770c53L87L87l45m51N73r5j60q6L29N1j60k15J73J49j64j11K64P0l84j22L92
6791A29K9j82j23L28p8j34j03K96O8l42j38L55J4n3l95N25K43n24j81L89J65k62
6813B6k32L40J55l49j92K95J58k79O1J14Q6m19PL07J16o1l78L22K5j03j66K24
6835E7J8q6n6R0N7o0j44K48J37l68K1K13M3k95p7M37j30j92j96K60K55l35j51
6858b54K72K01j42l38J61L90l97k71N14K8l18mL14M8l54n0M18l5k35LJ06J22l56
6881a77j54L45mj18lJ36J40k97l4L17j78j54O3L04n9k80J6K56kk49j41L51J66
$$ plain form
6727 -4 184 -65 -123 -13 236 24 -184 67 245 -75 -254 48 333 56 -232 142 376 -123 -89 -2 -43 37
6749 37 -253 128 149 -101 -253 98 256 -40 -354 -62 163 -37 -321 189 307 89 -249 22 151 81 -353
6770 -353 34 421 76 -375 198 103 -57 -143 186 237 77 -138 35 184 20 -91 173 243 -141 -263 129
6791 129 158 -24 -147 181 103 -31 -134 162 230 -112 -250 105 119 66 -329 196 439 -85 -266 123 288 26
6813 26 -206 134 289 -60 -252 43 201 -78 -17 97 183 -236 -229 78 194 133 -245 77 102 -1 -167 57
6835 57 75 -11 -67 23 80 20 -124 124 261 -107 -86 127 170 -125 -202 235 105 -87 -283 -23 232 -103 -254
6858 -254 18 219 77 -261 -100 290 -107 -378 136 164 -154 -158 156 204 -150 -200 218 183 -52 -49 57 179 -177
6881 -177 -331 14 10 -108 -111 25 165 -132 -166 151 -27 -181 -118 186 127 -153 -137 119 117 -132 -273 78 244
6904B44l40O8J08J9j84q6K22K90l70j41M85j36l10J5L6J89j13k25L27J93l82j0
6926a01J76J2k88n2L73J19l53j84K61K75k25l51M58Rk41o8K13O3j38k1J71rk12
6949a13l1J30K43l97L0K25R4l00k00L37K17k89j42L30r8j31l2R0J30l12J07J50
6971C8J12l28J2L06P1l54m0L01P1l18k1K38J71m49J46J43J20j38k16L38j67k33
6993a97j02M56j4l20m7K77m4j65J32P5J67l55o1L61L2m90P0M22j64k38j0J96N7
7016C8k85K10K43j67k55J52L37j90l51K13J29K6j76J7L42m18j14L05J45j10k77
7037a86J91N0R3k20J50p9Q1j28l2J91J30l67l0J68M3j30N8K40k34j08m3K72j73
7060f3J06k25K38L6k26J67O3J78l65K1K41m1k21j5M01j65k11n1K20P1l63J06L59
$$ plain form
6904 244 -96 -28 80 99 -85 -171 51 341 -29 -170 315 179 -131 -116 -80 109 -4 -229 98 291 -91 -101
6926 -101 75 87 -201 -253 120 239 -114 -298 -37 238 13 -338 120 129 -112 -180 33 96 -42 -63 108 99 -113
6949 -113 -144 -14 229 -168 -138 87 181 -119 -319 18 235 -54 -196 134 36 -95 -127 -37 93 -219 -112 38
6971 38 150 -178 -166 140 211 -143 -183 118 189 -129 -150 88 259 -190 -44 99 219 81 -135 203 36 -197
6993 -197 -299 157 143 -177 -224 53 9 -156 -24 51 218 -137 -198 163 195 -295 -225 197 33 -205 -215 -19 38
7016 38 -247 -37 206 39 -216 -64 273 83 -268 -55 74 100 -76 -59 283 -135 -249 56 201 91 -186
7037 -186 5 55 148 -72 78 -1 80 -48 -80 111 241 -126 -156 12 55 -75 -17 223 -11 -119 -162 110 -63
7060 -63 43 -182 56 92 -134 33 96 274 -91 -70 171 130 -91 -106 295 130 -81 -132 88 159 -204 -98 261
7083B61r1m13K60J18N4l05Q5M5l8j84J60L78k03j99k7K01m5k26pK79J46k92r5
7106a38M57k85j75n4M00m19J45m1L09j82k24J30L89j53l42J13J71r0k50J68K23
7127A52j93k21M26m1j04k21J03K45j38j13K7K49o8k33J25J71k84j7J05P3m9k25
7149b31K03K86k63q2P2K04k35p2J16J19j42r4J51M7O8m12J83J61R1k24N9kj37
7172a34nJ53l6P9k72J34K46L3l71J3L13j68j59J81J46j38j83kL46m0j00P3Mj12
7196AjK4K98l24j82K56J22j67k29J13J29M9j53J07J05j57j03J18J00j5m18M26
7218I9L5j93J19j01J46k06j40K99P0j11r2l1K15q1j14L5j8J54k53J20K30j17k37
7241a72K75J14j25j89r3K75j42n8J30J04j02j55j11M35k92J46n9J62k04p8J52
$$ plain form
7083 261 170 -243 17 135 189 -116 -31 14 -24 -208 -48 330 127 -72 -99 102 57 -169 -176 103 249 -43 -138
7106 -138 319 34 -141 -195 205 -214 -69 -110 199 17 -207 -77 312 159 -183 -70 101 11 -239 -71 152
7127 152 -41 -262 164 123 19 -202 -99 146 8 -105 -78 171 103 -130 -5 166 -118 -135 -30 43 -6 -231
7149 -231 -28 258 -5 -87 -15 189 -46 -118 -2 117 -25 -119 32 79 147 -265 -82 79 170 -54 5 3 -134
7172 -134 -139 14 -22 57 -215 -81 165 198 -173 -160 153 -15 -174 7 153 15 -168 -170 176 136 36 109 113 1
7196 1 0 24 322 -2 -184 72 194 27 -202 -89 40 89 -64 43 148 -9 -112 6 106 91 -327 99
7218 99 134 -59 60 -41 105 -101 -241 58 128 17 -75 -106 109 28 -86 -51 -69 85 -168 -48 182 65 -172
7241 -172 103 217 92 -97 -190 85 -57 -115 15 119 17 -138 -249 186 -106 40 -19 143 -61 -139 13
7262A3j16J74j96J86j8Rq9R0j26NJ0L8K24j80n8J33M0j66j82J04K35j26j19J91
7286G6J80k18j67J75K8j55q6K12O9k58J39j27K78r2j43K4K48j94r7J85L9j96j73
7309b53K79P9j34k11K84M2k88P9J46j10J14j87L12r2N5k80L19ml53J47N4J57l26
7332a71P3J54J19j73j82N3K79j72j01J06J02l4k40K42m6J24l14K50O8k22M2L4
7354iJ7K9r9R4K11k89q1K38Q3j78j56J85R8j71K2J81j08q0k1J93o4r8Q2p8J54
7379A55k20oL3j02K04j73K61q9q3j28J61j7r7J17qJ0k5k3NN4J27j70N7O7k34q9
7405b13J95P4o0q0Q3j5J06k76K52O8j74j47K02O4r1n6m8O8Q5j21K02J76k64o9
7429c9J56P2j66k4M2J38l30k2J28L4j39L3Q8J8n6R2j0J19j16p7L6K20k51K42l4
$$ plain form
7262 13 -103 71 -125 61 43 52 -37 53 -73 -68 -58 -20 204 24 -34 99 139 -27 -209 -105 130 4 -115 76
7286 76 256 38 -129 46 74 -81 -167 45 114 -144 -5 -132 146 54 -89 -65 183 -11 -108 77 116 -80 -253
7309 -253 26 105 -29 -240 44 86 -202 -123 23 -87 27 -160 152 60 115 -165 154 150 -203 -56 -2 155 -171
7332 -171 -98 56 175 2 -180 -127 152 -20 -121 -15 87 53 -187 55 9 133 -181 69 137 -85 -43 -9
7354 -9 8 37 -62 32 243 -46 -127 111 194 16 -140 45 143 -28 -6 175 67 -13 -34 159 95 -3 79 1 155
7379 155 -65 -71 -38 -140 64 -109 152 63 -20 -148 13 -4 -101 16 8 18 -7 -30 -25 29 156 -14 43 110 -124 -213
7405 -213 -18 56 -4 -84 -1 -16 90 -186 66 134 -40 -187 15 79 -12 -68 -116 -48 37 -84 118 294 30 -39
7429 -39 117 189 23 -1 41 179 -151 -173 -45 -11 -150 -117 -29 -11 -67 25 15 134 18 -59 -23 197 -54 188 154
7454A54l6k58n5K99P8k01q0L9J79j82Q6P8R0k13q4R3M4k5p4J21Lr7O3j15J5o2
7480a40j3P5jK4O6J06K7l67K88m4R1mj40L0L7k01L7J82J07k12KJ24O1j79r2J92
7506E6Nk8k03J61J06j68J01K29k59K7j37J82l1j31r3K06R2k48L4R5J14k07M9k1
7530f9M8Jp4J63j58J38p3J15k4q6j14J09K05k22m1L10j02k48oK27r9O1j37O2P3
7555E9o4J6J23o7j64j5J31J09j19j3o9R5r1k3K05j12P1k82K50J00j94Q8o8R7L0
7580I3j54l3L9k4o2J86J41k09O3k1Q6k59K93J6O8j09k69L18j10j24KJ8R0k11J80
7605Hr1J89j87L1R9m7o5J49J95m29K8k1L16r1q2L6K03k42j18O9R3Q0n6j52K12
7630A27l0K9k85J18J15K5k40K32j51M4O7L1J4O9j10KJ75k74j83L70Pk68Q9P6k4
$$ plain form
7454 154 118 -140 -195 104 182 -19 -99 -60 119 -63 23 101 191 -22 -106 -13 31 6 -68 53 56 -41 22 -93 -78 -140
7480 -140 -153 -78 -79 -55 11 117 144 -223 65 21 112 108 -32 -2 35 -166 -129 53 160 -52 -50 74 135 -44 -136 56
7506 56 61 33 -170 -9 97 -71 30 259 0 27 -110 72 41 -90 -183 23 115 -133 -99 -4 110 -97 -48 -69
7530 -69 -21 -20 -94 69 -89 49 -24 91 67 -19 -133 -24 181 -41 -82 228 126 -122 -128 99 0 61 -76 -14 59
7555 59 -5 11 134 67 -97 -112 19 128 9 -4 -73 22 -69 -92 113 1 72 -210 40 140 -54 34 -34 63 93
7580 93 -61 -94 -55 -79 -141 45 186 -23 40 19 105 -154 139 155 223 114 -155 163 53 -71 -69 -51 39 -172 8
7605 8 -83 106 -81 -50 49 2 -63 86 281 -148 -120 -141 175 84 2 38 241 -1 -119 -50 43 123 67 -85 127
7630 127 97 126 -159 -41 74 99 -141 91 -60 -16 51 82 96 165 55 57 232 -42 -225 145 152 -116 -27 49 25
7655B5n9J47k66J19M8j47L40q8j23l6K73j42n5RK1O2j76J07r2J21j38RN5R5j60
7680e1N1R9j20M9m3J82k62J8M6J02p3p5J04M8q9j33P2N3J3L5j72J42J25k77J2
7705a44O3J52n6J12rq5j44N6J71j06j79L23m5j46j59K40J52k16Q0j77K13j30N7
7728B3m0K5J21k12jN0L6k9J83r3m9L9r0R9r0j58J61J77q5R6l17J85k74L44j05
7753dMP9k54J5P7J05p4M8Kj12J69q6K39p7j44k6J19l6k17J47J65o4j43p9K11k18
7779a54J48j55J77K1r3K07m6m4j38r0L15Kq7j14K00j78K8p7M09m49J38j2Q9j78
7803h1k9K05o4P8j48K6m3J13j69m5K44r0l2K1J23n6j97M5O6M0o3K6J78j78m8P6
7829bL4o9M8P9j06m3Q0p3q5K67l36J56L5N2j16L5L04l20L5J1R1m6mj11N5J92j53
$$ plain form
7655 25 -34 113 -153 -34 14 -133 207 119 -4 -40 233 91 36 45 66 128 -48 59 -33 88 -50 -41 14 109 -51
7680 -51 0 99 -21 28 -15 167 -95 -77 -31 71 -2 -77 27 75 -14 -147 -75 -22 -9 26 -146 -4 121 -156 -144
7705 -144 -81 71 15 127 118 33 -111 -55 116 10 -169 154 109 -37 -196 44 196 -20 60 -117 96 -34 23
7728 23 -17 8 129 -83 -84 -34 2 -27 156 63 14 53 -37 62 -28 -186 -25 152 67 163 -154 31 -243 101 -4
7753 -4 0 79 -175 -160 -83 22 -52 -4 -2 -114 55 -31 208 131 -13 -39 80 44 -173 -26 139 75 -68 -147 64 -154
7779 -154 -6 -161 16 37 -56 151 105 61 -77 -167 148 150 63 -51 149 -29 -1 -78 331 -118 20 8 97 -81
7803 -81 -110 95 31 109 -39 -13 -56 57 -112 -157 87 -3 -35 -14 109 53 -144 -99 -33 7 -56 -30 148 -30 -78 -2
7829 -2 32 -37 11 90 -16 -59 21 -52 -137 130 -206 -50 -15 37 -79 -44 260 -60 -25 -14 77 31 27 -84 -29 163 10
7856A0N7Pr1K1Jj5J4j24J39M6L8j91J89J3j30n7q6L10j35j45K69j75J35j86R4
7881HN9m3J22j9j65P9jJ8j10M5J26j95K11l59N1J62K23j97l2J70k3j50k3K0L4
7906A1j58J80j20R8o1j10J30Q8n9p5r1L10j31l2j4J03M7k46P1J90l00J13M9mN9
7931D8o2k7K12j77K2K0J50r0j97J1J05J40o5j68K31j99n3LJ43j92M2N7P2K4j3
7956C7M2M0l4k06R0L4r8j8Q1M8P0j66J42K6j29n2P4J65k36l1K91j04o4R6q0M9
7982F7k09J20l7J16R6l5K3N4k48j01J05J52j73m6oJ49j26J13l4M0M5O3k02J14
8006D0n1l5j28J19N9j61NK38K7k07p9K54q3k80L47J36j16k49J64rJ11k38J47j2
8030aj56K19Q5m8j20l9J18j02J07L4r3J9j71J7J49k7j00J20K1R5j67P5j77J54
$$ plain form
7856 10 67 74 -17 4 5 -10 4 -120 19 65 103 -88 101 114 -16 -73 -159 151 16 -129 140 -35 100 -86 8
7881 8 67 24 146 127 -38 41 40 58 -52 -7 119 -76 135 -224 -173 -11 212 15 -17 153 130 -20 -43 -23 11
7906 11 -147 33 -87 11 -50 -160 -30 58 -1 -76 -167 143 12 -20 -34 69 116 -130 -59 131 -169 -56 -7 -11 48
7931 48 -14 -41 171 -6 16 36 186 96 -101 -90 15 155 90 -78 153 -46 -99 -96 47 -145 -103 -46 26 50 37
7956 37 79 119 85 -121 -31 3 -95 -113 -32 16 86 -80 62 88 -41 -93 -19 146 -90 -121 170 66 2 98 18 67
7982 67 -142 -22 -59 57 153 118 141 195 -53 -154 -49 103 -70 -116 -122 27 -99 14 -20 20 65 128 -74 40
8006 40 -11 -46 -174 -55 4 -157 -152 86 113 -94 -173 81 -2 -282 65 201 85 -164 0 -9 102 -136 11 -1
8030 -1 -157 62 147 99 -21 -60 58 -44 63 97 4 23 -148 -131 18 -9 -109 11 32 127 -40 35 -142 12
8054A2M6j56o4J79q7k1K59j89k5o0k2L29m9j44J08n5q3N6N6j47L3m0K9j7M8Qn5
8081e1R5j63K6J34oj11mJ25Q8k12N2J25j27O6M3k10K84j00k4j33R5q0K7j1J45
8106G3j27N5o8J26k1j33J37J53k15k6O5q3L6jq0K07j57j10K64q9j10j6K11j60
8130f9K69k51K3l9j41M6K89l7j71O6J07J65k65r4J03J29p3j13L8J36j10k26L02
8153H4j8q7q2J73R4j29r1M6J38j73l3J05On1o9Q8J20R6j75l2M8m5qJ45j94R8P5
8180A29j10P8p7M8j18M5j02j4R6L3m8
$$ plain form
8054 12 58 -98 -162 17 -70 -91 168 -21 -46 -106 -128 201 152 8 116 61 -22 34 90 -57 -24 -64 -35 -52 -4 4 -51
8081 -51 44 -119 -93 41 35 -76 -80 45 133 -79 -27 98 -29 37 80 -130 154 54 30 -103 -8 -88 -61 -72 73
8106 73 -54 1 -67 59 38 -95 42 195 -20 -46 19 -64 -28 -29 -109 98 -59 -169 95 6 -104 -120 91 -69
8130 -69 200 -51 -28 -67 -208 -162 127 90 -81 -15 92 257 -8 -102 1 130 57 -56 -18 118 8 -218 84
8153 84 66 -21 -103 70 164 35 -56 -10 128 -45 -78 27 33 -18 -87 1 121 217 42 10 58 13 5 150 -44 54 129
8180 129 19 97 20 68 -50 -5 -107 -121 -25 8 -40
8191d0
$$ Imaginary data points
##PAGE= N=2
##DATA TABLE= (X++(I..I)), XYDATA
0@%%%%%%%%%%%oJ4j4J4j6K2k8L0l8M6n2O0p2Q8j03J19j42J70j94K18k53K91l26
34a72L67m18M75n32N95o69P48q29R20j024J136j256J386j532J693j863K049k258
52a184K490k742L020l338L694m091M548n077N696o430P315q413R810j1646J4159
67G811j7753K2874l2386N11979k39003q56357L64762Q57598l65843q90740M23700
78b13358Q25844m40151p89050M64605P57108m24491p62503L89272P56359l62692
88B00943p70211L76039P71248l93738p73861M07638P49768m05731p24119M08428
98a53596P04786m06763p04521M12907P10114m15600p06050M26162O88776m34783
108A21432o74483M31632O65040m11338o59868L91113O58547l86437o68314L92624
$$ plain form
0 0 0 0 0 0 0 0 0 0 0 0 0 -6 8 -6 8 -8 14 -14 16 -22 24 -28 32 -40 48 -55 64 -78 92 -102 116 -137 154 -172
34 -172 195 -223 252 -280 315 -354 394 -435 485 -539 597 -659 727 -805 888 -975 1074 -1184
52 -1184 1306 -1436 1584 -1754 1940 -2151 2397 -2680 3016 -3414 3901 -4512 5298 -6348 7811
67 7811 -9942 12932 -19454 492525 253522 -602835 -238073 619525 253682 -637058 -213358
78 -213358 612486 172335 -616715 -152110 604998 180507 -581996 -192724 563635 200943
88 200943 -569268 -193229 578019 184281 -589580 -181942 567826 162095 -562024 -153596
98 -153596 551190 144427 -560094 -147187 562927 147327 -558723 -132561 556215 121432
108 121432 -553051 -121419 543621 132283 -527585 -136472 522075 135638 -532676 -140052
118a40052O74112m02720o63118M17686O40909m28593o17260M29127O00919m18215
128I2795n90751M06586N85919m03386n90082M03479N93806m04064n91791M06096
138i1393N86099m07219n76652M09876N66878m12129n56513M13452N44811m10649
148F6561n29901M06792N16653m03652n12166L97768N13031l96029n16739L98525
158e9157N15831m07281n08127M17268M95547m20396m78567M14931M66290m01730
168C4609m59390L88665M57757l86082m61622L92142M65939l99210m60628M04523
178b3297M44601m08946m29443M07444M21459l99044m19122L90651M18984l89190
188A4097m18617L95062M15632m01907m07989M04482L96087m03324l86705L96854
$$ plain form
118 -140052 534060 131340 -531778 -114092 526817 98224 -519036 -89909 511010 92795
128 92795 -497956 -91370 494549 91163 -498919 -95440 498366 94302 -497489 -91393
138 -91393 494706 87487 -489165 -79289 487589 75460 -481053 -67601 477210 66561
148 66561 -463340 -56548 460105 56453 -455713 -57945 455086 59057 -457682 -59157
158 -59157 456674 49393 -458734 -41466 454081 33685 -444882 -29951 436339 34609
168 34609 -424781 -36116 421641 35559 -426063 -33921 432018 32808 -427820 -23297
178 -23297 421304 12358 -417085 -9641 411818 12774 -406348 -15697 403287 14097
188 14097 -404520 -9458 406174 4267 -403722 760 396847 -6477 -393182 3672
198C672L81382l90695l78798L91902L80723l95623l80886M00075L73130m03244
208a8362l61144M04111L50999l99933l44738L92654L43059l88686l44601L88790
218B2149L44581l92859l41345L98847L33234m03470l25303M03126L18517l96126
228c8649l10987L91039L06959l91006l08728L91548L09813l90858l05150L93198
238D7179K97888l95996k91215L96083K86320l94057k82293L90878K78974l89263
248e5502k76972L89736K73552l91275k70536L91820K68670l90179k65061L87864
258F2117K58904l88354k55194L89367K54199l87569k50708L86211K45798l86216
268g1445k41432L86266K38138l85574k35542L84978K33260l84338k30500L83869
$$ plain form
198 3672 385054 -5641 -384439 7463 388186 -7437 -388323 11752 384882 -18362
208 -18362 -379506 24605 375604 -24329 -369067 23587 366646 -22040 -366641 22149
218 22149 366730 -26129 -367474 31373 364607 -38863 -364166 38960 357477 -38649
228 -38649 -349636 41403 348362 -42644 -351372 40176 349989 -40869 -346019 47179
238 47179 345067 -50929 -342144 53939 340259 -53798 -336091 54787 333761 -55502
248 -55502 -332474 57262 330814 -60461 -330997 60823 329493 -60686 -325747 62117
258 62117 321021 -67333 -322527 66840 321039 -66530 -317238 68973 314771 -71445
268 -71445 -312877 73389 311527 -74047 -309589 75389 308649 -75689 -306189 77680
278G7680K26599l83758k22632L84884K19433l84837k17561L81988K13267l80475
288h5412k09032L80955K06723l80528k04435L79558K01176l78811j97821L77900
298I0273J94679l77032j90515L77572J88096l77360j86070L75741J82893l73936
308i5659j78696L73966J74735l75259j73650L73581J71307l71093j66657L70925
318A03500J62960l71144j61010L70144J58401l69142j55343L68320J52860l66897
328a07351j49424L66084J46110l66250j44072L65814J42353l63496j39106L62047
338A12709J34814l62461j32074L62756J30796l60615j28084L58688J23900l58276
348a17847j21629L57277J18964l56930j16298L56585J14474l54825j11878L52471
$$ plain form
278 77680 304279 -79479 -302111 82773 302206 -82631 -300192 81796 295063 -85412
288 -85412 -294444 86511 293234 -87294 -291729 87829 289005 -89806 -287627 90273
298 90273 284952 -92080 -282595 94977 283073 -94287 -280357 95384 278277 -95659
308 -95659 -274355 99611 274346 -100913 -274563 99018 270325 -100768 -267425 103500
318 103500 266460 -104684 -265694 104450 262851 -106291 -261634 106686 259546 -107351
328 -107351 -256775 109309 255419 -110831 -254903 110911 253264 -110232 -249338 112709
338 112709 247523 -114938 -247012 115744 246540 -114075 -242159 116529 240429 -117847
348 -117847 -239476 117801 236765 -120165 -236463 120122 234596 -120229 -232107 120364
358A20364J08297l52246j04788L52916J04245l51452j02640L48818R8256l47429
368a25659r3740L48299R1999l47479r1129L44458Q7775l43639q4916L43642Q2606
379B12217l42874q0065L42545P7884l41883p5241L39180P2094l37270o8599L36605
390A34593O6422l35981o4993L33301O4036l31562o0493L31276N8302l32072n7008
401a94179L31278N4917l30383n1452L30239M8063l28298m4543L25640M1449l24199
412a41468m0974L21083M1069l18648m0107L19049L7792l20955l5626L22374L2602
423A76191l20579k7936L17849K3374l15282k1444L13007K1396l10379k1546L10075
434A44726K1336l10914j8812L10262J4295l10352j0730L09331R296l05909q284
$$ plain form
358 120364 228661 -123585 -228373 124543 228788 -122664 -225304 123514 221770 -125659
368 -125659 -219399 128900 220899 -126580 -217709 126749 214524 -129115 -214031 129611 212217
379 212217 -130657 -210722 131823 209707 -132176 -207417 131763 203857 -133413 -202012 134593
390 134593 201015 -134966 -199959 133342 197378 -134184 -194677 136599 194901 -137171 -194179
401 -194179 137099 192016 -138367 -189819 140420 188483 -139815 -184358 141282 182731 -141468
412 -141468 -182442 138641 179710 -138938 -179045 140004 177796 -143159 -178785 143589 176191
423 176191 -144388 -172324 145525 168899 -146383 -167827 145180 166576 -143803 -165349 144726
434 144726 166062 -144852 -163664 146598 160893 -149459 -160189 149142 158438 -147471 -155755
445a55755L03256O047l02856m534L03856L059l03947k92L01164l197k97580N875
457a44904K94784n933k92655M938K93114l585k94967M733K95762r791k96020J6368
469a38156K95626k0217k90670K0117K83644j9939k80023J8619K80525j5970k83803
480a50247J5239K85650j8651k86143K5114K85072l0014k82024L2651K77987l3136
491A21498k74599L2271K72367l0893k71556L1645K72789l2397k74120L3375K72293
502A52673l5583k70745L8851K69539m0773k68638M2439K66047m4704k63686M6945
513a07635K61882m7802k59845M7581K58069m8729k58026M9533K59760m9612k58752
524a53576N1279K57116n5102k55544N7445K54031n8058k51691N8748K49288o0229
$$ plain form
445 -155755 147501 153548 -149308 -153842 150014 153073 -150874 -151166 149998 146801 -150779 -144904
457 -144904 149880 143947 -148708 -143770 149344 145759 -149208 -144475 151287 141496 -154524 -138156
469 -138156 157470 137253 -153417 -133300 150344 130405 -149618 -130999 149526 133556 -150247
480 -150247 -135008 150642 131991 -154152 -129038 156034 126020 -156004 -123353 154634 121498
491 121498 -153101 -120830 151537 120644 -150912 -119267 153522 121125 -152995 -119620 152673
502 152673 117090 -153655 -114804 154735 113962 -154676 -112237 153810 109106 -154580 -107635
513 -107635 154247 106445 -153400 -105819 152250 103521 -154505 -104972 154788 105176 -153576
524 -153576 -102297 154819 99717 -155827 -98382 155649 97591 -154100 -95352 153936 93707
535I3707k47501O2410K45782o3958k45241O4906K43620o4232k42662O3327K42152
546A52310o4331k43407O7177K45572o9271k44186P1237K38897p4444k33844P6666
557g7624K30702p4106k28773P0578K28522o9663k30410P2523K33236p7671k34170
568a56856Q2278K31363q5568k25843Q5540K20831q4046k18007Q1036K19409p9069
579G1068k22035P9284K22449q3452k20592Q8883K18205r1103k14449R1250K10134
590A49642q9806k09007Q9142K09836q9004k11250R1075K11044r3905k09815R6493
601e5555K06666r6584k03185R5526K00569r4918k00908R4476K01725r5191k01375
612a48754R8419J99376j00940j96762J02171J93862j02470j91791J01068J92315
$$ plain form
535 93707 -153794 -91384 154398 90440 -154801 -89895 153725 89493 -153169 -89842 152310
546 152310 87979 -155428 -88251 157321 88050 -156136 -84899 153998 79554 -154290 -77624
557 -77624 153078 78972 -149801 -79223 149299 79636 -150774 -78251 154985 77314 -156856
568 -156856 -74578 156785 71217 -154626 -69086 151745 67699 -150308 -69272 150137 71068
579 71068 -150967 -71683 150766 67314 -153278 -64395 153810 62707 -151742 -60492 149642
590 149642 59836 -149171 -60029 149807 60803 -150447 -59372 151672 57767 -152048 -55555
601 -55555 151111 54527 -148658 -53132 147437 52519 -148389 -53913 147812 52621 -148754
612 -148754 -50335 149041 48101 -148661 -46490 147372 44902 -146889 -45821 146494
622A46494r9985j91838J00773J91477j03851j91067J05953J90349j06403j87104
632a45202J05971J82862j06752j81225J06985J82009j06000j82134J05910J80794
642A43218j08118j79703J10389J78477j11707j76954J12586J75209j12047j73230
652a41880J12163J71190j13257j69529J13966J69117j13522j68481J13011J66843
662A39621j14054j65815J16540J65398j17845j64501J18302J61530j19479j58718
672a39021J19713J56803j18535j55663J17824J55249j17538j55910J18137J55596
682A36655j19618j53681J22003J51642j23584j49739J23225J47712j22073j45099
692a32557J21816J44205j22386j44734J22764J43766j23457j42144J24355J40320
$$ plain form
622 146494 46509 -145329 -44556 146921 43070 -147997 -42044 148305 41902 -145202
632 -145202 -39231 143631 36879 -144346 -37361 144648 38648 -143486 -37576 143218
642 143218 35100 -144603 -34214 144263 32556 -144398 -31812 143397 31350 -141880
652 -141880 -29717 141473 28216 -141313 -27347 141770 28248 -140233 -27222 139621
662 139621 25567 -140248 -23708 141690 23845 -140656 -22354 139176 19697 -139021
672 -139021 -19308 137495 18960 -136703 -18879 136370 18832 -137078 -18941 136655
682 136655 17037 -136644 -14641 137001 13417 -136322 -13097 134615 12542 -132557
692 -132557 -10741 133464 11078 -133656 -10892 132874 9417 -132727 -8372 131948
702A31948j24374j38770J24753J37344j25716j36902J26142J36117j26139j34338
712a29935J27407J31912j28534j29989J28715J28956j27500j27600J26486J26447
722A26365j26808j26369J27797J26420j29204j25254J30757J23069j31186j20373
732a24786J30389J17866j30977j16607J30542J16830j29060j16403J28725J15170
742A21689j29995j14301J31593J13666j31945j12096J31432J09923j31300j08182
752a19516J31354J07806j31248j06659J31390J05679j31629j04987J31015J03206
762A16411j31088j01433J31395J01508j31507j01270J30911R9833j31393r8092
772a14725J32162R6834j32215r6189J31900R4720j31132r3268J30996R2654j30313
$$ plain form
702 131948 7574 -131196 -6443 130901 5185 -131717 -5575 130542 4403 -129935
712 -129935 -2528 129384 850 -129139 -424 128532 1032 -126568 -82 126365
722 126365 -443 -126812 985 127405 -1799 -127053 3704 126773 -4413 -124786
732 -124786 5603 123469 -7508 -124115 6427 123257 -5803 -122206 6519 121689
742 121689 -8306 -122607 8986 122652 -9293 -121389 10043 119966 -11334 -119516
752 -119516 11838 119644 -11604 -118263 13127 118806 -12823 -117810 13205 116411
762 116411 -14677 -116110 15285 116793 -14714 -115984 14927 114760 -16633 -114725
772 -114725 17437 114271 -17944 -114133 17767 112487 -18645 -111913 19083 111737 -18576
783a8576r2164J30617R1127j31522r0648J31992Q9332j30830q7460J31006Q5752
794A08626j31826q5330J31252Q4644j30394q3426J30389Q2032j30960q1431J31200
805B4776Q0457j30658p9172J30414P8376j30083p7834J29737P6654j30250p5313
816a02896J30714P5228j29670p4365J28908P2420j29219p1586J29707P1221j29238
827b8776p0534J28445O9403j28539o8261J28780O7185j28641o6651J28313O5735
838I6459j27605o5299J27597O4012j27335o2756J27881O2613j27719o2379J26874
849C2343O0960j26453n9471J26690N9128j26881n8518J26244N7545j25840n6598
860i0851J25615N5594j25566n4821J25136N4312j24986n4175J24674N3438j23767
$$ plain form
783 -18576 -110740 19877 111004 -20518 -111166 20826 110158 -20672 -108132 22874 108626
794 108626 -23200 -108530 22722 107366 -23028 -106454 23935 105967 -24993 -106424 24776
805 24776 105233 -25425 -104597 25817 104193 -25890 -103724 26013 102667 -27583 -102896
816 -102896 27818 103046 -26624 -100989 27919 100339 -28880 -100466 29241 100462 -28776
827 -28776 -99310 29135 98538 -30001 -98262 30518 97703 -30938 -97589 30724 96459
838 96459 -31146 -96445 31152 95164 -32171 -94927 32954 95567 -32152 -94531 32343
849 32343 93303 -33150 -92621 34069 93197 -33684 -92202 34042 91587 -34253 -90851
860 -90851 34764 90358 -35208 -90029 35107 89419 -35567 -89742 34932 88370 -35397
871c5397n2400J24381N1281j24847n0957J24080N0007j22765m8579J22689M7996
882H5489j22872m7386J22395M7242j22484m6299J21967M5510j22080m4205J21855
893C9132M3052j21851m2472J21228M2592j20663m1618J20280M0026j20756l9493
904h0543J20565L9480j19624l8315J19187L7402j19209l7076J19453L6456j19403
915d1627l5550J19509L4604j18827l3555J17805L2616j17596l1851J17373L2211
926G5112j17509l2254J16836L0656j16925k9011J17544K8408j17006k7673J15495
937D3673K7036j14941k6371J14952K6052j15035k5570J15661K4528j15347k3608
948f8970J14643K2485j13536k1477J13026K1273j13425k1398J12983K1043j13046
$$ plain form
871 -35397 -87797 36584 87865 -36982 -87939 36141 86148 -36617 -85196 37493 85489
882 85489 -37383 -84769 37626 84868 -37616 -83915 38052 83562 -38518 -82723 39132
893 39132 82184 -39667 -82139 39089 81681 -38982 -80600 39680 79706 -41050 -80543
904 -80543 40022 79502 -40122 -78437 40750 78152 -41057 -78133 41320 77776 -41627
915 -41627 -77177 42332 76936 -41891 -75446 42359 74975 -42621 -74472 42901 75112
926 75112 -42397 -74651 42185 72841 -44084 -73095 44449 72857 -44149 -71822 43673
937 43673 70709 -44232 -70603 44349 70401 -44634 -70204 45457 69985 -45362 -68970
948 -68970 45673 68158 -45378 -66855 46171 67444 -45981 -67379 45604 66647 -46399
$$ [...]
8191A32
##END NTUPLES=NMR FID
##END=
