##TITLE=1H_5DPAA1312
 CDCl3
 8 sc, 
 14.12.2021
##JCAMPDX= 6.0         $$ Bruker NMR JCAMP-DX V2.0
##DATA TYPE= NMR FID
##DATA CLASS= NTUPLES
##ORIGIN= UXNMR, Bruker Analytische Messtechnik GmbH
##OWNER= root
$$ XWIN-NMR		Version 3.5
$$ Tue Dec 14 12:25:09 2021 Russian Standard Time (UT+4h)  she@DPX200
##.OBSERVE FREQUENCY= 200.131346
##.OBSERVE NUCLEUS= ^1H
##.DELAY= (6, 6)
##.ACQUISITION MODE= SIMULTANEOUS
##.ACQUISITION SCHEME= undefined
##.AVERAGES= 8
##.DIGITISER RES= 18
##SPECTROMETER/DATA SYSTEM= spect
##.PULSE SEQUENCE= zg30
##.SOLVENT NAME= CDCl3
##.SHIFT REFERENCE= (INTERNAL, CDCl3, 0, 15.7039)
##AUDIT TRAIL= $$ (NUMBER, WHEN, WHO, WHERE, WHAT)
$$ ##TITLE= Audit trail, XWIN-NMR		Version 3.5
$$ ##JCAMPDX= 5.01
$$ ##ORIGIN= Bruker BioSpin GmbH
$$ ##OWNER= she
$$ F:/spectra/data/she/nmr/H-F/1/audita.txt
$$ ##AUDIT TRAIL=  $$ (NUMBER, WHEN, WHO, WHERE, WHAT)
(   1,<2021-12-14 12:22:11.26 +0400>,<she>,<DPX200>,
      <created by zg, POWCHK disabled, PULCHK disabled
       configuration hash MD5:
       00 E9 B6 7A A2 85 ED C7 34 08 36 98 17 FE 4E 26
       data hash MD5: 16K
       BD 90 FA 3E 10 E9 58 56 88 2D EE EB 1B D8 2B 1C>)
$$ ##END=
$$ 
$$ hash MD5
$$ FF 4F 38 65 3B A0 F0 70 D6 D0 27 E1 76 13 B1 59
##$RELAX= 
##$RELAX= 
##$RELAX= 
##$RELAX= 
##$RELAX= 
##$RELAX= 
$$ Bruker specific parameters
$$ --------------------------
##$DU= <F:/spectra>
##$EXPNO= 1
##$NAME= <H-F>
##$PROCNO= 1
##$TYPE= <nmr>
##$USER= <she>
##$AMP= (0..31)
100 100 100 100 100 100 100 100 100 100 100 100 100 100 100 100 100 100 
100 100 100 100 100 100 100 100 100 100 100 100 100 100 
##$AQSEQ= 0
##$AQ_mod= 1
##$AUNM= <au_zg>
##$AUTOPOS= <>
##$BF1= 200.13
##$BF2= 200.13
##$BF3= 200.13
##$BF4= 200.13
##$BF5= 200.13
##$BF6= 200.13
##$BF7= 200.13
##$BF8= 200.13
##$BYTORDA= 1
##$CFDGTYP= 0
##$CFRGTYP= 5
##$CHEMSTR= <none>
##$CNST= (0..31)
1 1 145 1 1 1 1 1 1 1 1 1 1 1 1 1 1 1 1 1 1 1 1 1 1 1 1 1 1 1 1 1 
##$CPDPRG= <>
##$CPDPRG1= <>
##$CPDPRG2= <>
##$CPDPRG3= <>
##$CPDPRG4= <mlev>
##$CPDPRG5= <mlev>
##$CPDPRG6= <mlev>
##$CPDPRG7= <mlev>
##$CPDPRG8= <mlev>
##$CPDPRGB= <>
##$CPDPRGT= <>
##$D= (0..31)
0 1.2 0 0 0 0 0 0 0 0.06 0 0.03 0 0 0 0 0.0002 0 0 0 0 0 0 0 0 0 0 0 0 
0 0 0 
##$DATE= 1639470130
##$DBL= (0..7)
120 120 120 120 120 120 120 120 
##$DBP= (0..7)
150 150 150 150 150 150 150 150 
##$DBP07= 0
##$DBPNAM0= <>
##$DBPNAM1= <>
##$DBPNAM2= <>
##$DBPNAM3= <>
##$DBPNAM4= <>
##$DBPNAM5= <>
##$DBPNAM6= <>
##$DBPNAM7= <>
##$DBPOAL= (0..7)
0.5 0.5 0.5 0.5 0.5 0.5 0.5 0.5 
##$DBPOFFS= (0..7)
0 0 0 0 0 0 0 0 
##$DE= 6
##$DECBNUC= <off>
##$DECIM= 32
##$DECNUC= <off>
##$DECSTAT= 4
##$DIGMOD= 1
##$DIGTYP= 9
##$DL= (0..7)
0 120 120 120 120 120 120 120 
##$DP= (0..7)
150 150 150 150 150 150 150 150 
##$DP07= 0
##$DPNAME0= <>
##$DPNAME1= <>
##$DPNAME2= <>
##$DPNAME3= <>
##$DPNAME4= <>
##$DPNAME5= <>
##$DPNAME6= <>
##$DPNAME7= <>
##$DPOAL= (0..7)
0.5 0.5 0.5 0.5 0.5 0.5 0.5 0.5 
##$DPOFFS= (0..7)
0 0 0 0 0 0 0 0 
##$DQDMODE= 0
##$DR= 18
##$DS= 0
##$DSLIST= <SSSSSSSSSSSSSSS>
$$ [...]
##$SUBNAM2= <"">
##$SUBNAM3= <"">
##$SUBNAM4= <"">
##$SUBNAM5= <"">
##$SUBNAM6= <"">
##$SUBNAM7= <"">
##$SUBNAM8= <"">
##$SUBNAM9= <"">
##$SW= 18.0517287032376
##$SWIBOX= (0..15)
0 0 2 0 0 0 0 0 0 0 0 0 0 0 0 0 
##$SW_h= 3612.71676300578
##$TD= 16384
##$TD0= 1
##$TE= 0
##$TE2= 300
##$TE3= 300
##$TEG= 300
##$TL= (0..7)
0 120 120 120 120 120 120 120 
##$TP= (0..7)
150 150 150 150 150 150 150 150 
##$TP07= 0
##$TPNAME0= <>
##$TPNAME1= <>
##$TPNAME2= <>
##$TPNAME3= <>
##$TPNAME4= <>
##$TPNAME5= <>
##$TPNAME6= <>
##$TPNAME7= <>
##$TPOAL= (0..7)
0.5 0.5 0.5 0.5 0.5 0.5 0.5 0.5 
##$TPOFFS= (0..7)
0 0 0 0 0 0 0 0 
##$TUNHIN= 0
##$TUNHOUT= 0
##$TUNXOUT= 0
##$USERA1= <user>
##$USERA2= <user>
##$USERA3= <user>
##$USERA4= <user>
##$USERA5= <user>
##$V9= 5
##$VALIST= <valist>
##$VCLIST= <CCCCCCCCCCCCCCC>
##$VD= 0
##$VDLIST= <DDDDDDDDDDDDDDD>
##$VPLIST= <PPPPPPPPPPPPPPP>
##$VTLIST= <TTTTTTTTTTTTTTT>
##$WBST= 1024
##$WBSW= 4
##$XGAIN= (0..3)
0 0 0 0 
##$XL= 0
##$YL= 0
##$YMAX_a= 213837
##$YMIN_a= -188018
##$ZGOPTNS= <>
##$ZL1= 120
##$ZL2= 120
##$ZL3= 120
##$ZL4= 120
##$ABSF1= 10
##$ABSF2= 0
##$ABSG= 5
##$ABSL= 3
##$ALPHA= 0
##$AQORDER= 0
##$ASSFAC= 0
##$ASSFACI= 0
##$ASSFACX= 0
##$ASSWID= 0
##$AUNMP= <proc_1d>
##$AZFE= 0.1
##$AZFW= 0.1
##$BCFW= 1
##$BC_mod= 2
##$BYTORDP= 1
##$COROFFS= 0
##$CY= 11.3945322036743
##$DATMOD= 1
##$DC= 2
##$DFILT= <>
##$DTYPP= 0
##$F1P= 2.36226072786647
##$F2P= -0.459571619588291
##$FCOR= 0.5
##$FTSIZE= 0
##$FT_mod= 4
##$GAMMA= 1
##$GB= 0.15
##$INTBC= 1
##$INTSCL= 1
##$ISEN= 128
##$LB= 0.24
##$LEV0= 0
##$LPBIN= 0
##$MAXI= 10000
##$MC2= 0
##$MEAN= 0
##$ME_mod= 0
##$MI= 1.114404
##$NCOEF= 0
##$NC_proc= 0
##$NLEV= 6
##$NOISF1= 3.799351
##$NOISF2= 2.8
##$NSP= 1
##$NTH_PI= 0
##$NZP= 0
##$OFFSET= 15.70392
##$PC= 1
##$PHC0= -16033.38
##$PHC1= 16.6008
##$PH_mod= 1
##$PKNL= yes
##$PPARMOD= 0
##$PSCAL= 0
##$PSIGN= 0
##$REVERSE= no
##$SF= 200.130013532006
##$SI= 16384
##$SIGF1= 3
##$SIGF2= 2
##$SINO= 400
##$SIOLD= 16384
##$SREGLST= <1H.CDCl3>
##$SSB= 0
##$STSI= 0
##$STSR= 0
##$SW_p= 3612.71676300578
##$SYMM= 0
##$S_DEV= 0
##$TDeff= 0
##$TDoff= 0
##$TI= <>
##$TILT= no
##$TM1= 0
##$TM2= 0
##$TOPLEV= 0
##$USERP1= <user>
##$USERP2= <user>
##$USERP3= <user>
##$USERP4= <user>
##$USERP5= <user>
##$WDW= 1
##$XDIM= 8192
##$YMAX_p= 0
##$YMIN_p= 0
$$ End of Bruker specific parameters
$$ ---------------------------------
##NTUPLES= NMR FID
##VAR_NAME=  TIME,          FID/REAL,        FID/IMAG
##SYMBOL=    X,             R,               I
##VAR_TYPE=  INDEPENDENT,   DEPENDENT,       DEPENDENT
##VAR_FORM=  AFFN,          ASDF,            ASDF
##VAR_DIM=   8192,          8192,            8192
##UNITS=     SECONDS,       ARBITRARY UNITS, ARBITRARY UNITS
##FACTOR=    0.0002768,     1,               1
##FIRST=     0,             0,               0
##LAST=      2.2672688,     0,               0
##MIN=       0,             -188018,         0
##MAX=       2.2672688,     213837,          0
$$ Real data points
##PAGE= N=1
##DATA TABLE= (X++(R..R)), XYDATA
$$ [...]
$$ plain form
2009 -783 913 -639 -2369 633 1714 -768 184 1017 -1738 -268 3214 642 -1521 1068 384 -1287
2025 -1287 1994 2412 -1941 -1275 1269 -617 -77 2078 -1201 -3003 682 739 -1209 1037 285 -3638
2041 -3638 -646 2937 -408 -1088 1443 -1243 -2051 2912 2444 -1761 -129 950 -1390 1393 3422 -1188
2057 -1188 -2114 1406 -162 -690 2830 79 -4259 -220 2167 -1343 -7 1524 -3182 -2619 2860 1043
2073 1043 -1768 768 -628 -2766 2141 3464 -1583 -891 1454 -1514 192 4522 150 -3465 1056
2088 1056 1164 -1438 2316 2074 -3971 -1960 2622 -267 -783 1817 -2174 -3756 2094 2099 -1942 175
2104 175 105 -3537 609 4416 -859 -2338 1518 -585 -1290 4034 2107 -3514 -503 2043 -707 1292
2120 1292 2752 -2716 -2834 2285 810 -909 1819 -1000 -4370 860 3237 -1580 -1047 946 -2887
$$ packed form
2009g83J696j552j730L002J081k482R52Q33k755J470L482k572k163K589o84j671
2025a287L281M18m353O66K544j886N40K155l279j802L685N7j948K246p52l923
2041c638K992L583l345o80K531k686q08M963m68m205J632J079k340K783K029m610
2057a188r26L520j568n28L520k751m338M039K387l510J336J531m706N63N479j817
2073A043k811K536j396k138M907J323n047O92K345k968J706M330m372l615M521
2088A056J08k602L754k42o045K011M582k889n16K600l991j582N850Nm041K117
2104A75p0l642M146L807n275j479L856k103p05N324j927n621L011K546k750J999
2120A292J460n468j18N119j475j719K728k819l370N230K377m817N33J993l833
$$ plain form
2135 -2887 -1538 3913 873 -2960 236 192 -1601 2570 3009 -2687 -1473 2126 -243 488 3423 -1087
2151 -1087 -3697 1734 2237 -1318 995 838 -3831 -945 3478 -316 -1995 671 -1728 -2445 2799 1779
2167 1779 -2789 -512 567 -1800 1288 3510 -1628 -2363 1964 588 -518 2978 708 -3413 341
2182 341 2678 -503 181 1283 -2477 -1704 2491 476 -1730 363 -1022 -2626 1575 2169 -2209 -1443
2198 -1443 993 -1219 -360 2956 -31 -2608 695 1380 -352 1570 1358 -2076 -505 2314 166 -160
2214 -160 1415 -1238 -2021 1795 1399 -1707 -236 284 -2086 -204 2157 -870 -1971 367 -298 -881
2230 -881 1585 663 -1925 -60 1173 -414 731 1620 -1231 -927 1872 676 -553 1175 83 -1773
2246 -1773 671 1749 -751 -669 383 -1014 -589 1204 -233 -1456 -113 -344 -981 808 646 -1479
$$ packed form
2135b887J349N451l040l833L196m4j793M171M39n696J214L599k369P31K935m510
2151a087k610N431N03l555K313j57m669K886M423l794j679K666k399p17N244j020
2167A779m568K277J079k367L088K222n138p35M327j376j106L496k270m121L754
2182C41K337l181O84J102l760P73M195k015k206K093j385j604M201N94m378P66
2198a443K436k212Q59L316k987k577L303O85j732J922k12l434J571K819k148l26
2214a60J575k653p83L816l96l106J471N20k370J882K361l027j101K338o65n83
2230h81K466r22k588J865J233j587J145Q89k851L04K799j196j229J728j092j856
2246a773K444J078k500Q2J052j397M25J793j437j223J343k31o37J789j62k125
$$ plain form
2262 -1479 -513 977 -258 -82 1282 -94 -1054 891 1230 -94 398 549 -513 211 1057 -46 -299
2279 -299 284 -517 -607 752 101 -1229 -301 106 -855 -204 478 -641 -808 297 162 -197 408 102 -338
2298 -338 390 675 128 382 522 -166 157 908 143 -213 367 32 -373 128 199 -582 -535 -176 -314 -280 -180
2319 -180 -426 -384 -150 -251 -103 186 -105 -222 347 431 40 238 581 195 224 535 449 192 75 159 204 59
2341 59 -149 -147 6 -354 -448 -31 -203 -667 -471 -26 -223 -425 -129 -133 -194 -62 64 185 236 -4 129 575 391
2364 391 90 454 496 -53 142 513 80 -191 70 77 -216 -162 -80 -347 -247 -215 -417 -210 -156 -495 -201 111
2386 111 -245 -317 185 136 -208 262 510 120 152 500 402 267 377 308 153 144 36 1 156 -100 -418 -176 -22
2409 -22 -452 -422 3 -310 -610 -237 67 -229 -262 34 122 -50 110 327 334 279 248 305 410 264 85 294 326
$$ packed form
2262a479R66J490j235J76J364j376r60J945L39j324M92J51j062P24Q46j103k53
2279b99N83q01r0J359o51j330R28M07r61O51O82j119j67J105j35l59O05l06m40
2298c38P28K85n47K54J40o88L23P51p65l56N80l35m05N01P1p81M7L59j38L4J00
2319a80k46M2K34j01J48K89k91j17N69Q4l91J98L43l86K9L11q6k57j17Q4M5j45
2341E9k08KJ53l60r4M17j72m64J96M45j97k02K96mo1J32J26J21N1k40J33M46j84
2364C91l01L64M2n49J95L71m33k71K61Pk93N4Q2k67J00L2k02K07N4l39K94L12
2386A11l56p2N02m9l44M70K48l90L2L48r8j35J10o9j55rj08l5J55k56l18K42J54
2409b2m30L0M25l13l00L73L04k96l3K96Q8j72J60K17Pn5l1N7J05j46j79K09L2
$$ plain form
2432 326 61 -91 185 -39 -267 -112 41 -354 -545 -213 -175 -379 -303 -90 -304 -344 -41 109 25 9 40 62
2454 62 367 404 200 289 377 -27 192 672 220 -317 219 262 -324 18 266 -574 -586 56 -156 -379 -120 -410
2476 -410 -678 -20 91 -412 17 150 -605 145 976 37 -348 618 316 -149 847 875 -464 -158 598 69
2496 69 234 521 -555 -782 317 46 -529 193 -303 -1362 -171 827 -516 -680 338 -492 -660 1078
2514 1078 670 -757 32 466 -255 733 1232 -435 -504 816 197 -74 1128 -39 -1481 317 1004 -650
2532 -650 -149 440 -1406 -987 1239 164 -1147 -10 -339 -1140 898 1187 -1006 -478 635 -473 417
2549 417 1991 -216 -1471 878 876 -378 1169 831 -1829 -566 1609 80 -437 504 -1095 -1497 1186
2566 1186 873 -1177 -281 -153 -1656 413 2002 -847 -1506 681 -27 -501 1950 794 -1927 -82
$$ packed form
2432C26k65j52K76k24k28J55J53l95j91L32L8k04P6K13k14m0L03J50q4j6L1K2
2454F2L05L7k04Q9Q8m04K19M80m52n37N36M3n86L42K48q40j2O42k12k23K59k90
2476d10k68O58J11n03M29J33p55P50Q31r39l85R66l02m65R96K8j339L06P56n29
2496F9J65K87j076k27J099k71n75P22m96j059J191R98j343j64J018q30j68J738
2514A078m08j427P89M34p21R88M99j667o9J320o19k71J202j167j442J798O87j654
2532f50N01N89j846M19K226j075j311J137l29q01K038K89k193N28J113j108Q90
2549D17J574k207j255K349kj254J547l38k660J263K175j529n17R41j599m02K683
2566A186l13k050Q96J28j503K069J589k849o59K187p08m74K451j156k721J845
$$ plain form
2582 -82 1496 -51 717 1394 -1453 -1269 1769 800 -621 747 -508 -2255 819 1942 -1184 -966 339
2599 339 -1627 -669 2262 86 -2217 11 328 -826 1462 1523 -1927 -937 1574 201 329 1835 -790
2616 -790 -2010 1496 1715 -694 462 397 -2189 -266 2507 -158 -1654 190 -867 -1268 1757 919
2632 919 -2147 -769 453 -895 709 2024 -1405 -1916 1372 800 -337 1637 342 -2291 343 2336
2648 2336 -56 -111 771 -1484 -994 2245 673 -1593 1 -360 -1658 1171 1734 -1904 -1541 764 -625
2665 -625 -310 1952 -413 -2466 447 1314 -386 880 941 -1863 -458 2230 421 -417 991 -786
2681 -786 -1374 1844 1499 -1384 -382 358 -1467 94 1967 -782 -2087 327 -48 -724 1260 403 -2123
2698 -2123 -396 1165 -181 399 1124 -1252 -1099 1822 993 -594 842 197 -1481 799 2016 -533
$$ packed form
2582h2J578j547P68O77k847J84L038r69j421J368j255j747L074J123l126K18J305
2599C39j966R58K931k176k303K228L17j154K288O1l450R90K511j373J28J506k625
2616g90j220L506K19k409J156o5k586J923K773k665j496J844j057m01L025q38
2632I19l066J378J222j348J604J315l429n11L288n72j137J974j295k633K634J993
2648B336k392n5Q82k255M90L239j572k266J594l61j298K829N63l638L63K305j389
2665f25L15K262k365k053K913Q67j700J266O1k804J405K688j809q38J408j777
2681g86n88L218l45k883J002P40j825J561J873k749j305K414l75o76J984q57k526
2698b123J727J561j346N80P25k376J53K921q29j587J436o45j678K280J217k549
$$ plain form
2714 -533 -817 503 -707 -450 1505 52 -1759 -168 151 -820 639 733 -1688 -964 1082 -13 -314
2731 -314 1030 -356 -1397 878 1410 -343 244 569 -775 51 1647 138 -677 462 -188 -665 1069
2748 1069 571 -1278 -428 392 -731 -115 864 -874 -1269 445 267 -577 382 117 -1036 77 1004 -65
2766 -65 42 604 -465 -155 1255 407 -480 462 316 -550 403 828 -622 -597 327 -201 -390 422 -254 -926
2786 -926 -75 123 -408 142 120 -747 -130 617 -61 -177 509 -1 -362 579 660 -110 108 424 0 162 521
2807 521 -2 -222 57 -65 -263 140 -166 -636 -191 -24 -425 -236 109 -357 -326 177 149 -200 80 145 -14
2828 -14 227 370 188 239 213 107 279 387 86 -75 240 -9 -251 40 19 -302 -238 -84 -195 -321 -236 -198
2850 -198 -158 -181 -195 20 46 -130 20 252 149 4 298 306 95 189 272 238 196 174 45 152 78 -150 -42 60
$$ packed form
2714e33k84J320j210K57J955j453j811J591L19r71J459R4k421P24K046j095l01
2731c14J344j386j041K275N32j753N87L25j344Q26J596j509q15J139o50m77J734
2748A069m98j849Q50Q20j123O16R79j738l95J714j78q44R59k65j153J113R27j069
2766f5J07N62j069L10J410q48q87R42j46q66R53M25j450K5R24n28j89Q12o76o72
2786i26Q51J98n31N50k2q67O17P47o78j16O86n10l61R41Q1p70K18L16m24J62L59
2807E21n23k20K79j22j98M03l06m70M45J67m01J89L45m66L1N03k8l49K80O5j59
2828a4K41J43j82N1k6j06J72J08l01j61L15k49k42K91k1l21O4J54j11j26Q5L8
2850a98M0k3j4K15K6j76J50K32j03j45K94Qk11R4Q3l4m2k2j29J07p4k28J08J02
$$ plain form
2874 60 -252 -325 24 -157 -380 -145 -118 -325 -198 11 -135 -168 36 -8 78 202 55 82 330 166 76 403 341
2897 341 -74 101 345 0 -64 112 -33 -282 -147 -95 -192 -248 -200 -300 -154 -134 -218 -89 -25 -217 -143 233 166
2920 166 -121 194 352 79 141 386 304 85 208 235 183 83 21 -69 10 -94 -243 -19 -177 -387 -286 -38
2942 -38 -142 -292 -140 -90 -160 -74 141 159 17 -18 167 308 246 181 281 226 42 217 370 115 -5 -13 -85 16
2966 16 -32 -136 -173 -228 -361 -199 46 -202 -404 -62 -75 -327 173 201 -218 -95 288 158 178 396 129 -51
2988 -51 410 307 105 446 130 -333 180 530 -165 -207 113 -396 -467 326 84 -673 -314 -95 -408 130 240
3009 240 -474 -369 231 -64 72 707 14 -660 401 738 37 303 522 -529 -247 865 356 -334 154
3028 154 -254 -673 394 479 -703 -432 -62 -737 -61 853 -397 -1040 257 115 -363 727 515 -1016
$$ packed form
2874F0l12p3L49j81k23K35K7k07J27K09j46l3K04m4Q6J24j47K7K48j64r0L27o2
2897C41m15J75K44l45o4J76j45k49J35N2r7n6M8j00J46K0q4J29O4j92P4L76o7
2920A66k87L15J58k73O2K45q2k19J23K7n2j00o2r0P9j04j49K24j58k10J01K48
2942c8j04j50J52N0p0Q6K15J8j42l5J85J41o2o5J00n5j84J75J53k55j20qp2J01
2966A6m8j04l7n5j33J62K45k48k02L42j3k52N00K8m19J23L83j30K0K18k67j80
2988e1M61j03k02L41l16m63N13L50o95m2L20n09p1P93k42p57L59K19l13N38J10
3009B40p14J05O00k95J36O35o93o74J061L37p01K66K19j051K82J112n09o90M88
3028A54m08m19J067Q5j182K71L70o75O76R14j250o43J297j42m78J090k12j531
$$ plain form
3046 -1016 -192 1031 193 145 800 -485 -672 1000 707 -402 263 -70 -1014 381 1185 -652 -887 193
3064 193 -652 -567 1154 131 -1588 -320 432 -387 523 872 -1074 -827 996 421 38 1009 -225 -1288
3082 -1288 871 1481 -387 60 449 -1111 -296 1714 165 -1306 -21 -251 -890 878 810 -1529 -897
3099 -897 546 -446 124 1241 -886 -1671 757 899 -292 765 435 -1594 73 2013 230 -336 616
3116 616 -703 -820 1663 1066 -1190 -309 47 -995 619 1509 -1192 -1614 483 -97 -491 1301 -39
3133 -39 -2171 -43 1365 -176 235 788 -1320 -779 1851 861 -543 596 -243 -1261 1316 1757 -978
3150 -978 -681 534 -804 -133 1870 -294 -1996 56 366 -653 817 576 -1943 -819 1236 -48
3166 -48 -102 953 -940 -1408 1450 1323 -657 254 350 -1256 467 2121 -243 -1138 436 -287 -457 1452
$$ packed form
3046a016Q24J223q38m8O55j285j87J672k93j109O65l33r44J395Q04j837k35J080
3064A93q45Q5J721j023j719J268P52q19R10L49j946K47J823n75l83R71j234j063
3082a288K159O10j868M47L89j560Q15K010j549j471J285k30o39J768o8k339O32
3099h97J443r92N70J117k127p85K428J42j191J057l30k029J667J940j783n66R52
3116F16j319j17K483n97k256Q81L56j042J614Q90k701m22K097n80l94J792j340
3133c9k132K128J408j541M11N53k108N41K630r90j404J139q39j018K577M41k735
3150i78K97J215j338O71K003k164j702K052L10j019J470k41k519J124K055j284
3166d8n4J055j893m68K858j27j980R11R6j606J723J654k364q95J574p23j70J909
$$ plain form
3184 1452 555 -1782 -429 594 -542 339 927 -1466 -1501 1027 418 -533 718 -170 -1654 501 1700
3201 1700 -278 -327 650 -769 -227 1811 556 -1065 234 214 -592 1041 1087 -1312 -888 735 -347
3218 -347 -276 987 -674 -1802 393 799 -636 91 202 -1348 -314 1398 80 -501 525 -367 -521
3235 -521 1417 930 -858 12 615 -459 423 1317 -542 -1083 455 238 -434 588 0 -1411 -215
3252 -215 688 -415 -220 297 -911 -697 907 325 -689 182 113 -654 592 1161 -403 -311 652 33 35
3271 35 973 186 -725 197 453 -267 261 306 -893 -425 560 -234 -476 241 -397 -850 359 427 -543 -168
3291 -168 283 -350 28 762 -30 -281 392 232 2 695 381 -461 123 488 -129 40 459 -305 -477 349
3311 349 87 -443 -99 -100 -513 -129 179 -310 -298 46 -244 -98 402 78 -226 241 326 -18 293 512 -99
$$ packed form
3184A452q97k337J353J023j136Q81N88k393l5K528o09r51J251q88j484K155J199
3201A700j978m9R77j419N42K038j255j621J299k0q06J633M6k399M24J623j082
3218c47P1J263j661j128K195M06j435P27J11j550J034J712j318n81J026q92j54
3235e21J938m87j788Q70O03j074Q82Q94j859n41J538k17o72J022n88j411J196
3252b15R03j103J95N17j208K14J604n82j014Q71o9p67J246N69j564R2R63o19K
3271C5R38p87r11R22K56p20N28M5j199M68R85p94k42P17o38m53J209O8r70L75
3291a68M51o33L78P34p92k51O73j60k30O93l14q42N84L65o17J69M19p64j72Q26
3311C49k62n30L44jm13L84L08m89J2L44k90J46N00l24l04M67Q5l44L11K19o11
$$ plain form
3332 -99 -21 474 220 -44 153 54 -214 44 55 -176 -140 -125 -316 -214 31 -282 -356 -22 -127 -270 101 81 -204
3355 -204 18 293 121 90 266 182 150 256 270 162 184 87 42 129 82 -75 -60 -7 -193 -211 -77 -133 -287 -246 -100
3380 -100 -131 -217 -98 -53 -107 -23 116 85 91 91 183 238 204 166 202 160 122 102 150 75 -22 -50 31 -12 -153 -133 -90 -253 -211
3409 -211 -140 -94 -208 -201 -86 -43 -40 -11 -18 43 30 100 207 208 131 189 281 246 108 185 159 58 -10 31 54 -145 -133 -107 -156
3438 -156 -162 -255 -195 -146 -245 -139 -34 -109 -139 -36 95 44 73 196 144 152 169 226 245 162 54 191 211 35 -26 60 -24
3465 -24 -149 -19 14 -264 -306 -94 -168 -210 -78 -232 -216 -152 -110 -52 179 30 -102 170 297 95 235 382 50
3488 50 31 417 331 2 129 91 -134 93 144 -206 -226 -21 -268 -205 138 -258 -540 -2 -31 -347 108 164 -366
3511 -366 -209 459 143 -24 312 44 -123 442 457 40 157 157 -307 175 547 -187 -411 114 -175 -392 361
$$ packed form
3332i9P8M95k54k64J97r9k68K58J1k31L6J5j91J02K45l13p4L34j05j43L71k0k85
3355b04K22K75j72l1J76q4l2J06J4j08K2r7m5Q7m7j57J5N3j86j8J34n6j54M1J46
3380a00l1q6J19M5n4Q4J39l1O%R2N5l4l8L6m2l8k0M8p5r7k8Q1m3j41K0M3j63M2
3409b11P1M6j14PJ15M3LK9pO1j3P0J07Jp7N8R2l5j38P7k6j01o8M1K3j99J2K6m9
3438a56or3O0M9r9J06J05p5l0J03J31n1K9J23n2QJ7N7J9q3j08J37K0j76o1Q6q4
3465b4j25J30L3k78m2K12p4m2J32j54J6O4M2N8K31j49j32K72J27k02J40J47l32
3488E0j9L86q6l29J27l8k25K27N1l50k0K05k47O3L43l96k82N38k9l16M55N6n30
3511c66J57O68l16j67L36k68j67N65J5m17J17%m64M82L72p34k24N25k89k17P53
$$ plain form
3532 361 44 -715 -303 175 -293 -26 292 -431 -523 419 263 -79 407 38 -489 375 838 -92 -10 397 -263
3553 -263 -120 944 276 -623 -66 128 -465 299 422 -745 -644 216 -166 -145 431 -428 -1015 253 576
3572 576 -341 221 291 -821 -50 1195 264 -315 377 -51 -361 972 789 -633 -214 250 -409 297 901
3591 901 -664 -1080 280 20 -458 510 -36 -1378 -285 817 -139 -129 337 -770 -654 1087 647 -436
3609 -436 249 26 -616 816 1362 -431 -527 478 -198 -67 1238 71 -1390 -67 447 -355 348 387
3627 387 -1278 -872 795 157 -409 373 -586 -1100 803 1094 -512 -129 309 -771 226 1627 56 -947
3645 -947 336 153 -290 1073 693 -1282 -510 681 -128 105 783 -1008 -1356 642 485 -640 275 -111
3663 -111 -1472 173 1438 -222 -596 393 -513 -303 1493 678 -997 56 365 -361 768 1109 -891
$$ packed form
3532C61l17p59M12M78m68K67L18p23r2R42j56l42M86l69n27Q64M63r30Q2M07o60
3553b63J43J064o68q99N57J94n93P64J23j167J01Q60l82K1N76q59n87J268L23
3572E76r17N62P0j112P71J245r31n79O92m28l10J333j83j422M19M64o59P06O04
3591I01j565m16J360k60m78R68n46j342J093J102r56J0M66j107J16J741m40j083
3609d36O85k23o42J432N46j793r6J005o76J31J305j167j461J323N14q02P03L9
3627C87j665M06J667o38n66P82r59n14J903K91j606L83M38j080R97J401j571j003
3645i47J283j83m43J363l80j975P72J191q09K33O78j791l48J998j57j125R15l86
3663a11j361J645J265j660l74R89r06K10J796q15j675J053L09p26J129L41k000
$$ plain form
3680 -891 -843 731 98 -202 826 -276 -1612 176 908 -397 -154 163 -1143 -543 1236 239 -713 163
3698 163 -191 -690 1075 1057 -803 -337 615 -193 279 1399 -223 -1135 433 593 -302 574 308 -1305
3716 -1305 -442 943 -142 -426 196 -827 -955 790 511 -887 -78 70 -787 354 1287 -363 -698
3733 -698 530 125 -106 1062 377 -924 160 730 -195 353 554 -781 -655 818 164 -549 244 -311
3751 -311 -1105 265 711 -597 -491 146 -533 -246 911 5 -736 243 230 -193 687 638 -634 -221 759
3770 759 96 112 630 -230 -763 441 477 -477 -73 87 -735 -219 605 -279 -573 96 -233 -430 498 197
3790 197 -648 -10 312 -248 244 676 -246 -391 544 346 -161 447 254 -429 168 563 -129 -67 177 -398
3810 -398 -313 387 12 -508 10 -121 -503 141 287 -439 -305 259 -109 -77 470 102 -241 274 348 4 293
$$ packed form
3680h91M8J574o33l00J028j102j336J788P32j305K43L17j306O00J779r97r52Q76
3698A63l54m99J765j8j860M66R52q08M72J120j622r12J568J60q95Q76k66j613
3716a305Q63J385j085k84O22j023j28J745k79j398Q09J48q57J141R33j650l35
3733f98J228m05k31J168o85j301J084N70r25N48K01j335J26J473o54p13P93n55
3751c11p94J370M46j308J06O37o79K87J157r06p41R79j3m23Q80m9j272M13R80
3770G59o63J6N18q60n33J204L6r54M04J60q22N16Q24q84k94O69l29j97R28l01
3790A97q45O38L22n60M92M32r22j45R35j98n07O08j93o83N97L95o92O2K44n75
3810c98Q5P00l75n20N18j31l82O44J46p26J34N64l68L2N47l68l43N15P4l44K89
$$ plain form
3831 293 326 -87 121 454 78 -80 229 -50 -324 161 93 -360 -200 17 -330 -249 51 -184 -327 -28 -43
3852 -43 -145 156 76 -135 65 265 115 159 327 64 28 345 221 -36 154 193 -86 29 109 -59 -189 -4
3874 -4 -165 -208 -142 -215 -275 -113 -87 -268 -90 76 -147 -73 170 123 -12 212 186 126 154 253 133 115 146 136 66 112
3900 112 38 -4 27 -55 -204 -119 -98 -246 -174 -65 -184 -185 -69 -61 -118 -86 69 60 70 170 119 82 163 173 192 218 81
3927 81 77 162 103 64 4 -3 -39 -58 -54 -67 -198 -170 -92 -178 -188 -92 -98 -83 -82 -72 53 68 56 56 196 116 47 203 241 58 92
3958 92 284 191 29 48 -27 -90 -37 -59 -99 -105 -164 -245 -156 -100 -224 -250 -59 -207 -156 72 -8 -87 97 126 84 124 267
3985 267 106 82 240 176 84 278 113 -106 127 114 -187 15 53 -319 -296 61 -192 -279 -9 -206 -306 -32
4007 -32 101 -250 4 50 -153 70 339 33 -17 255 106 -35 453 284 -166 61 224 -41 92 261 -261
$$ packed form
3831B93L3m13K08L33l76j58L09k79k74M85o8m53J60K17l47Q1L00k35j43K99j5
3852d3j02L01q0k11K00K00j50M4J68k63l6L17j24k57J90L9k79J15Q0j68j30J85
3874dj61m3O6p3o0J62K6j81J78J66k23P4K43m7j35K24k6o0K8R9j20j8L1j0p0M6
3900A12p4m2L1q2j49Q5K1j48P2J09j19jJ16Qn7L2J55rJ0J00n1l7Q1J0J9K6j37
3927H1mQ5n9l9o0pl6j9Mj3j31K8P8q6j0R6oJ5JJ0J25J5j2%J40q0o9J56L8j83L4
3958I2J92r3j62J9p5o3N3k2m0on9q1Q9N6j24k6J91j48N1K28q0p9J84K9m2M0J43
3985B67j61k4J58o4r2J94j65k19K33j3l01K02L8l72K3L57k53q7K70j97j00K74
4007c2J33l51K54M6k03K23K69l06n0K72j49j41M88j69m50K27J63k65J33J69n22
$$ plain form
4028 -261 -290 124 -22 -231 51 -194 -559 13 198 -268 -123 154 -373 -159 529 157 -241 252 216 -171 399
4049 399 495 -181 -75 315 -47 45 470 -136 -532 143 138 -338 145 41 -718 -317 354 -115 -396 135 -298
4070 -298 -478 411 369 -335 21 214 -276 281 863 -81 -356 475 153 -86 700 236 -768 -64 521 -198
4090 -198 -40 364 -667 -647 377 147 -506 87 -239 -821 279 676 -397 -289 295 -406 -46 1033 228
4109 228 -678 242 384 -145 644 693 -602 -390 614 139 -51 512 -404 -909 391 434 -495 -28 8 -978
4129 -978 -209 905 -179 -667 158 -162 -399 811 595 -695 -104 483 -170 418 918 -446 -715 676
4147 676 391 -184 615 2 -1105 100 786 -267 -315 164 -778 -622 829 273 -805 -14 -88 -630 592
4166 592 863 -634 -547 520 -97 104 1060 -28 -991 430 752 -146 413 430 -941 -398 936 102 -437
$$ packed form
4028b61k9M14j46k09K82k45l65N72J85m66J45K77n27K14O88l72l98M93l6l87N70
4049C99R6o76J06L90l62R2M25o06l96O75nm76M83j04p59M01O71m69k81N31m33
4070b98j80Q89m2p04L56J93m90N57N82r44k75Q31l22k39P86m64j004P04N85p19
4090a98J58M04j031K0J024k30o53N93l26n82J100L97j073J08N84p01L60J079q05
4109B28r06R20J42n29P89M9j295K12J004m75j90N63r16n05J300M3r29M67L6r86
4129i78P69J114j084m88Q25l20k37J210k16j290N91N87o53N88N00j364k69J391
4147F76k85n75P99o13j107J205O86j053m8M79r42J56J451n56j078P91p4n42J222
4166E92K71j497Q7J067o17K01R56j088r63J421L22q98N59J7j371N43J334q34n39
$$ plain form
4185 -437 218 -488 -918 647 587 -798 -336 122 -669 26 1016 -285 -915 335 222 -248 795 449 -864
4204 -864 -4 869 49 181 662 -596 -642 816 425 -474 150 -90 -922 210 838 -514 -654 154 -495
4223 -495 -392 765 80 -924 -74 347 -310 466 649 -607 -433 780 231 -19 688 -96 -736 490
4241 490 765 -299 -82 254 -645 -226 815 -39 -717 62 -203 -548 453 319 -826 -335 358 -303 46
4260 46 669 -320 -642 558 411 -199 414 241 -566 149 827 -25 -169 373 -288 -360 686 220 -646 -72
4280 -72 29 -534 167 445 -550 -555 250 -81 -256 408 -4 -639 156 475 -117 90 378 -302 -85 671 201
4301 201 -162 330 36 -307 397 400 -422 -229 196 -271 -164 302 -211 -559 -10 66 -344 97 68 -500 -112
4322 -112 363 -37 -70 343 -53 -236 411 319 -166 139 248 -112 125 441 -83 -216 145 -19 -175 117 -12
$$ packed form
4185d37O55p06m30J565o0j385M62M58p91O95R90j301o30J250j13m70J043l46j313
4204h64Q60Q73q20J32M81j258m6J458l91q99O24k40q32J132O28j352j40Q08o49
4223d95J03J157o85j004Q50M21o57P76J83j256J74J213n49k50P07p84o40J226
4241D90K75j064K17L36q99M19J041q54o78P79k65l45J001j34j145M91O93o61L49
4260D6O23r89l22J200j47o10O13j73q07P15O78q52j44N42o61p2J046m66q66N74
4280g2J01n63P01K78r95nQ05l31j75O64m12o35P95L19n92K07K88o80K17P56m70
4301B01l63M92k94l43P04Lq22J93M25m67J07M66n13l48N49P6m10M41k9n68L88
4322a12M75m00l3M13l96j83O47r2m85L05J09l60K37L16n24j33L61j64j56K92j29
$$ plain form
4343 -12 -453 -42 23 -336 -129 102 -262 -289 149 13 -194 156 79 -137 189 294 32 73 286 64 10 331
4365 331 100 -91 183 98 -124 76 94 -266 -197 40 -188 -275 18 -127 -312 -62 -71 -225 -65 -23 -89 -43 193
4388 193 -38 23 218 150 42 244 164 -32 139 198 -30 10 124 -79 -145 29 -24 -137 -95 -129 -190 -134 -23 -205
4412 -205 -106 -6 -74 -98 113 31 -37 155 182 10 115 136 79 111 143 158 8 108 -14 -52 2 -7 -117 -80 -85 -220
4438 -220 -122 -42 -149 -217 -7 -73 -156 -42 37 -42 -43 100 84 79 152 92 141 206 141 66 149 115 6 94 52 -88 -62 -14
4466 -14 -72 -155 -123 -105 -192 -86 -85 -132 -140 -77 -115 -73 14 -28 11 99 97 17 219 221 47 117 259 176 169 125 23 -47 54 24
4496 24 -55 -62 -64 -193 -125 -17 -179 -126 -54 -184 -212 137 29 -198 10 111 8 27 287 48 19 215 103 79
4520 79 307 125 -93 113 133 -104 35 112 -259 -216 138 -100 -317 -59 -121 -310 37 156 -215 -167 37 -162
$$ packed form
4343a2m41M11O5l59K07K31l64k7M38j36k07L50p7k16L26J05k62M1K13k22n4L21
4365C31k31j91K74q5k22K00J8l60O9K37k28q7K93j45j85K50rj54J60M2o6M6K36
4388A93k31O1J95o8j08K02q0j96J71N9k28M0J14k03o6J74n3j13M2l4o1N6J11j82
4412b05R9J00o8k4K11q2o8J92K7j72J05K1n7L2L2J5j50J00j22l8N4rj10L7nj35
4438b20R8Q0j07o8K10o6q3J14P9p9jJ43j6nP3o0M9O5o5p5Q3l4j09Q8m2j40K6M8
4466a4n8q3L2J8q7J06Jm7qO3l8M2Q7m2L9Q8kq0K02Kj74P0J42q3pm4j02p0J01l0
4496B4p9pkj29O8J08j62N3P2j30k8L49j08k27K08J01j03J9K60k39k9J96j12k4
4520G9K28j82k18K06K0k37J39P7l71M3L54k38k17K58o2j89L47J19l71M8K04j99
$$ plain form
4542 -162 -4 364 21 -200 221 173 -29 247 300 -213 7 316 55 -46 182 -106 -311 160 144 -259 -95
4563 -95 -84 -440 -19 274 -223 -310 75 -107 -163 421 229 -356 6 311 -67 230 455 -176 -230 390 234 -30
4585 -30 262 -69 -506 152 383 -299 -141 62 -477 -321 393 11 -584 -21 -35 -378 270 418 -462 -262 364
4606 364 -35 78 626 -30 -425 370 445 -45 321 290 -534 -64 638 -23 -353 153 -290 -570 353 253 -567
4627 -567 -235 56 -474 32 522 -385 -618 212 93 -174 546 243 -674 30 692 -3 126 489 -426 -437
4647 -437 699 353 -367 150 -84 -628 236 658 -455 -485 93 -411 -303 668 -41 -829 -16 229 -301 292
4667 292 471 -678 -385 668 127 -15 473 -178 -605 481 600 -277 84 213 -558 -54 891 -136 -661
4686 -661 93 -213 -453 488 321 -880 -361 273 -224 49 580 -405 -615 527 364 -162 516 278 -723
$$ packed form
4542a62J58L68l43k21M21m8k02K76N3n13K20L09k61j01K28k88k05M71j6m03J64
4563i5J1l56M21K93m97q7L85j82n6N84j92n85L62L05l78K97K25o31n4O20j56k64
4585c0K92l31m37O58K31o82J58K03n39J56P14l82n95N63j4l43O48J48q80K00O26
4606C64l99J13N48o56l95P95P5m90L66l1q24M70P02o61l30N06m43k80R23j00q20
4627e67L32K91n30N06M90r07k33Q30j19k67P20l03r17P04O62o95J29L63r15j1
4647d37J136l46p20N17k34n44Q64M22j113l0N78n04J08R71p09p88Q13K45n30N93
4667B92J79j149K93J053n41j42M88o51m27J086J19q77L61J29p71N04R45j027n25
4686f61P54l06k40R41j67j201N19O34m97K73N31r85k10J142j63n26O78k38j001
$$ plain form
4705 -723 235 961 -92 -186 402 -343 -392 758 263 -682 -50 93 -556 214 461 -637 -606 304 -164 -249
4725 -249 582 -74 -894 203 616 -239 159 466 -512 -161 937 275 -262 314 -51 -445 556 601 -484
4744 -484 -192 248 -390 -100 643 -304 -856 85 110 -433 314 205 -819 -229 561 -66 -108 392 -232 -426
4764 -426 584 448 -327 199 256 -441 172 782 -209 -346 323 -80 -261 429 108 -669 -73 284 -350 4
4784 4 302 -568 -449 333 -13 -285 279 4 -536 333 574 -183 -14 378 -177 -73 658 125 -306 184 88
4805 88 -362 292 312 -491 -245 223 -242 -210 291 -261 -542 218 164 -359 105 183 -368 -96 483 -23 -175 293
4827 293 46 -73 440 301 -175 126 321 -147 96 346 -193 -319 146 56 -302 84 10 -466 -140 188 -202
4848 -202 -166 66 -213 -170 303 68 -174 157 127 -161 246 432 -84 54 334 92 -15 262 85 -198 115
$$ packed form
4705g23R58P26j053r4N88p45m9J150m95r45O32J43o49P70K47j098L1R10m68q5
4725b49Q31o56q20J097M13q55L98L07r78L51J098o62n37N76l65l94J001M5j085
4744d84K92M40o38K90P43r47n52R41K5n43P47j09j024N90P90o27m2N00o24j94
4764d26J010j36p75N26N7o97O13O10r91j37O69m03j81O90l21p77N96L57o34L54
4784DK98q70J19P82l46k72N64k75n40Q69K41p57J69L92n55J04P31n33m31M90r6
4805H8m50O54K0q03K46M68m65L2N01n52k81P60n4n23M64P8n51K72N79n06j52M68
4827B93k47j19N13j39m76L01J95m68K43K50n39j26M65r0l58L86p4m76L26L28l90
4848b02L6K32k79M3M73k35k42L31l0k88M07J86n16J38K80k42j07K77j77k83L13
$$ plain form
4869 115 113 -122 -33 47 -209 -162 76 -226 -229 30 -121 -258 68 48 -219 -70 132 -47 36 279 96 -22 196
4892 196 156 85 168 145 -36 24 140 -36 -15 68 -132 -164 72 -62 -205 -94 -84 -220 -54 56 -98 -144 60
4915 60 -52 -16 70 54 -25 158 143 41 156 206 32 22 187 57 -56 64 23 -115 -5 22 -123 -97 -50 -129
4939 -129 -123 -63 -104 -149 5 -32 -43 25 95 -16 95 152 30 68 194 102 73 150 58 70 91 62 -19 -74 97 -100 -86
4966 -86 -24 -142 -154 -62 -82 -167 -106 -17 -161 -189 16 -45 -41 84 109 17 137 123 117 144 105 38 115 200 49 11 100 -5
4994 -5 -108 51 -8 -196 -149 -39 -194 -129 -43 -146 -171 -14 -57 -101 68 44 -76 60 99 -28 122 288 -19 20
5018 20 270 180 -28 152 126 -106 26 104 -60 -40 17 -145 -86 71 -111 -219 33 -44 -184 16 173 -236 -81
5041 -81 188 -32 -56 213 70 -87 162 210 -51 123 175 -125 48 279 -59 -129 155 -98 -294 115 72 -333
$$ packed form
4869A15kk35Q9Q0k56M7K38l02lK59j51j37L26k0k67J49K02j79Q3K43j83j18K18
4892A96m0p1Q3k3j81O0J16j76K1Q3k00l2K36j34j43J11J0j36J66J10j54m6K04
4915F0j12L6Q6j6p9J83j5j02J15N0j74j0J65j30j13J20m1j38J10K7j45K6M7p9
4939a29OO0m1m5J54l7j1O8P0j11J11N7j22L8J26r2k9P7r2J2K1k9q1n5J71j97J4
4966h6O2j18j2R2k0q5O1Q9j44k8K05o1MJ25K5r2J20j4oK7l9o7P7Q5j51l8Q9j05
4994ej03J59n9j88M7J10j55O5Q6j03k5J57m3m4J69k4j20J36L9j27J50J66l07L9
5018B0K50r0k08J80k6k32J32P8j64K0N7j62N9J57j82j08K52p7j40K00J57m09J55
5041h1K69k20k4K69j43j57K49M8k61J74N2l00J73K31l38p0K84k53j96M09m3m05
$$ plain form
5063 -333 -121 98 -269 -88 174 -166 -256 160 79 -119 257 146 -234 194 325 36 103 315 -93 -137 355
5084 355 158 -219 97 73 -346 45 293 -268 -312 58 -220 -220 271 -74 -452 -3 114 -200 134 326 -311
5105 -311 -146 425 126 -77 395 16 -227 329 514 -166 20 237 -263 -14 460 -113 -369 73 -119 -343
5125 -343 186 173 -589 -249 216 -185 -52 342 -291 -476 225 268 -151 238 155 -416 152 639 -19 -86 371
5146 371 -166 -229 593 206 -530 24 158 -365 97 412 -420 -521 203 -64 -285 305 -42 -711 102 455
5166 455 -222 95 341 -402 -201 686 195 -258 317 65 -392 412 547 -369 -190 243 -221 -38 552 -210
5186 -210 -673 94 133 -332 243 173 -756 -234 508 -32 -164 358 -188 -467 503 510 -233 82 198 -354 167
5207 167 787 -146 -370 269 -102 -269 485 117 -722 -104 260 -358 -51 324 -497 -563 368 125 -295 251
$$ packed form
5063c33K12K19l67J81K62l40r0M16q1j98L76j11l80M28J31k89O7K12m08m4M92
5084C55j97l77L16k4m19L91K48n61m4L70k78%M91l45l78M49J17l14L34J92o37
5105c11J65N71k99k03M72l79k43N56J85o80J86K17n00K49M74n73k56M42j92k24
5125c43N29j3p62L40M65m01J33L94o33j85P01M3m19L89q3n71N68M87o58o7M57
5146C71n37o3Q22l87p36N54J34n23M62L15q32j01P24k67k21N90l47o69Q13L53
5166D55o77L17K46p43K01Q87m91m53N75k52m57Q04J35r16J79M33m64J83N90p62
5186b10m63P67L9m65N75p0r29N22P42n40j32N22n46k79R70Pp43L15J16n52N21
5207A67O20r33k24O39l71j67P54l68q39O18L64o18L07L75q21o6R31k43m20N46
$$ plain form
5227 251 -51 -541 245 584 -206 -81 375 -212 -12 803 174 -443 192 203 -294 338 448 -524 -353 271
5247 271 -186 -169 291 -242 -662 146 216 -361 72 137 -552 -110 512 -62 -305 272 -16 -302 477 450 -326
5268 -326 -5 376 -160 127 542 -112 -377 254 70 -237 281 46 -653 -33 315 -314 -253 216 -302 -427
5288 -427 371 121 -337 96 140 -307 235 470 -217 -87 409 -82 -124 442 40 -408 182 254 -235 115 175
5309 175 -474 -309 266 -79 -329 55 -174 -368 167 204 -298 -44 127 -290 20 401 39 -211 300 163
5329 163 -169 374 310 -240 -4 338 -85 -14 247 -138 -294 156 17 -282 -7 -24 -404 -57 210 -267 -215
5350 -215 184 -128 -131 239 136 -246 68 167 -74 161 280 -23 -14 315 74 -13 227 67 -276 95 187 -173
5372 -173 -79 70 -202 -241 49 -123 -316 45 -43 -263 52 87 -174 -4 169 -69 26 274 30 -97 198 143
$$ packed form
5227B51l02m90P86L39p90J25M56n87K00Q15o29o17O35J1m97O32J10r72J71O24
5247B71m57J7M60n33m20Q08P0n77M33O5o89M42O22n74k43N77k88k86P79k7p76
5268c26L21L81n36K87M15o54k65O31j84l07N18k35o99O20L48o29O1M69n18j25
5288d27P98k50m58M33M4m47N42K35o87J30M96m91m2N66m02m48N90P2m89L50O0
5309A75o49J65N75l45k50L84k29j94N35L7n02K54J71m17L10L81l62k50N11j37
5329A63l32N43o4n50K36L42m23P1K61l85j56M50j39k99K75j7l80L47K67m77N2
5350b15L99l12lL70j03l82L14R9k41K35J19l03RL29k41q7K40j60l43L71R2l60
5372a73R4J49k72l9K90j72j93L61q8k20L15L5k61J70J73k38R5K48k44j27K95n5
$$ plain form
5394 143 -53 125 160 -79 30 164 -75 -112 67 -54 -147 38 -42 -212 -67 6 -165 -26 58 -133 -116 149
5416 149 -6 -46 138 111 -37 126 197 28 27 198 58 76 112 0 -44 35 -43 -132 13 1 -199 -89 28 -151
5440 -151 -169 25 -90 -137 -10 15 -43 9 130 28 74 168 63 61 174 19 17 122 63 -97 -12 79 -68 -79 26
5465 26 -109 -104 -20 -120 -182 -64 -103 -123 -60 -58 -166 18 41 -73 23 167 44 -38 163 152 47 122 122 37 30 77 80 15
5493 15 51 -49 -53 18 -78 -142 -103 -68 -179 -87 11 -176 -146 10 -22 -140 23 -2 -54 123 130 8 88 119 58 70 189
5520 189 113 -5 106 75 -53 14 66 -136 -165 16 -134 -152 2 -109 -170 -19 -17 -124 37 12 -114 -40 124 2
5544 2 -21 151 29 -57 205 176 -24 96 132 -48 20 200 -42 -139 33 -50 -151 25 13 -233 -96 1 -168 -68
5568 -68 179 -186 -160 143 62 -62 110 144 -121 64 299 45 -67 168 -26 -33 292 141 -117 29 -22 -238
$$ packed form
5394A43j96J78L5k39J09J34k39l7J79j21r3J85q0j70J45P3j71J39Q4j91J7K65
5416A49j55m0J84k7j48J63P1j69jJ71j40J8L6j12m4P9p8q9J45j2k00J10J17j79
5440a51j8J94j15m7J27K5n8N2J21j02M6R4j05kJ13j55kJ05n9j60Q5R1j47j1J05
5465B6j35NQ4j00o2J18l9k0O3Kj08J84K3j14R6J44j23q2K01j1j05P5%q5pM7Lo5
5493A5L6j00mP1r6o4L9L5j11R2R8j87L0J56l2j18J63k5n2J77Pj22Q0L1o1J2J19
5520A89p6j18J11l1j28O7N2k02k9J81j50j8J54j11o1J51Kj07J61k5j26P4J64j22
5544Bk3J72j22q6K62k9k00J20L6j80O8J80k42r7J72q3j01J76j2k46J37R7j69J00
5568f8K47l65K6L03q1j24J72L4k65J85K35k54j12K35j94pL25j51k58J46n1k16
$$ plain form
5590 -238 21 163 -246 -243 80 -115 -210 182 -51 -361 -14 120 -140 70 140 -164 -67 346 121 -56 241 60
5612 60 -163 256 345 -134 -63 215 -152 -75 272 -69 -359 5 26 -237 32 53 -453 -123 214 -145 -113 175
5634 175 -174 -261 307 222 -186 130 192 -162 130 444 -32 -202 200 -33 -100 344 114 -384 -81 130 -191
5655 -191 -18 262 -326 -438 276 8 -279 151 -7 -450 63 380 -192 -64 248 -183 -76 456 110 -216
5675 -216 170 105 -212 276 411 -370 -202 294 -74 -157 283 -208 -553 123 199 -214 15 48 -454 -106 482
5696 482 -7 -259 218 -109 -221 446 347 -312 -9 309 -173 57 511 -179 -345 256 82 -215 260 56
5716 56 -520 -98 253 -173 -136 179 -381 -336 366 108 -347 94 39 -392 175 539 -165 -179 269 5 -64 490
5738 490 212 -377 180 209 -186 138 251 -460 -284 293 -34 -312 139 -164 -493 89 278 -343 -139 183
$$ packed form
5590b38K59J42m09LL23j95r5L92k33l10L47J34k60K10P0l04R7M13k25j77K97j81
5612F0k23M19Q9m79P1K78l67P7L47l41k90L64K1k63K69K1n06L30L37l59L2K88
5634A75l49q7N68q5m08L16O2l54K92L14m76j70M02k33o7M44k30m98L03K11l21
5655a91J73K80n88j12P14k68k87M30j58m43N13L17n72J28L12m31J07N32l46l26
5675b16L86o5l17M88J35p81J68M96l68q3M40m91l45O76P6m13K29L3n02L48N88
5696D82m89k52M77l27j12O67r9o59L03L18m82K30M54o90j66O01j74k97M75k04
5716E6n76M22L51m26L7L15n60M5P02k58m55M41n5m31N67L64p04j4M48k64o9N54
5738D90k78n89N57K9l95L24J13p11J76N77l27k78M51l03l29N82J89o21K04L22
$$ plain form
5758 183 -330 -85 504 -16 -333 215 71 -139 374 342 -364 32 415 -67 4 355 -195 -382 232 162 -258
5779 -258 61 46 -454 -94 379 -197 -242 83 -202 -278 319 99 -377 48 188 -222 146 397 -165 -254 338
5800 338 118 -90 318 110 -335 147 252 -239 9 140 -292 -226 307 -54 -338 41 -9 -290 114 242 -252
5821 -252 -97 217 -115 8 342 30 -184 259 173 -103 183 163 -168 -11 292 -29 -168 154 -141 -284 119
5842 119 132 -298 -96 22 -214 -84 140 -140 -213 152 -30 -57 231 128 -203 120 234 -57 80 266 -33
5863 -33 -88 229 155 -143 19 18 -187 39 47 -142 -81 60 -125 -182 76 -103 -214 56 -18 -126 42 123 -160 -35
5887 -35 184 70 -6 243 55 -13 152 191 -6 89 135 -113 8 177 -54 -144 67 -16 -122 30 21 -195 -110 0
5911 0 -90 -101 35 -69 -95 108 31 -14 94 73 -39 153 187 -58 5 134 -6 -51 131 46 -144 -43 -1 -86 -106
$$ packed form
5758A83n13K45N89n20l17N48j44k10N13l2p06L96L83m82P1L51n50j87O14p0m20
5779b58L19j5n00L60M73n76m5L25k85p6N97k20m76M25J40m10L68K51n62q9N92
5800C38k20k08M08k08m45M82J05m91K48J31m32O6N33l61k84L79n0k81M04J28m94
5821b52J55L14l32J23L34l12k14M43q6k76K86k0l31J57L03l21j39L22k95j43M03
5842A19J3m30K02J18k36J30K24k80p3L65j82k7K88j03l31L23J14k91J37J86k99
5863c3n5L17p4k98J62jk05K26Qj89O1J41j85n7K58j79j11K70p4j08J68Q1k83J25
5887c5K19j14p6K49j88o8J65L9j97R5M6k48J21J69k31r0K11q3j06J52rk16Q5J10
5911@r0j1J36j04k6K03p7m5J08k1j12J92L4k45O3J29j40m5J82q5j90J01M2q5k0
$$ plain form
5936 -106 -10 -96 -43 -19 -80 -105 -10 -96 -103 38 58 -46 39 111 29 12 130 129 30 139 44 20 69 -10 36 46 62 -110
5964 -110 -53 -27 -73 -76 -16 -124 -149 -57 14 -110 -65 65 -34 21 74 58 -3 86 82 3 123 104 58 89 137 -24 72 95
5992 95 -25 -16 45 7 -97 -96 -13 -107 -93 -38 -89 -149 -64 -110 -45 13 -43 -47 53 89 -20 108 120 21 42 82 79 15 108 65
6022 65 -42 38 63 -23 -38 12 -54 -33 -18 -43 -87 35 -69 -168 -54 25 -56 -32 27 -11 -60 103 87 -29 99 75 34
6049 34 90 121 40 26 75 -22 -35 68 -30 -115 27 -17 -160 -63 28 -202 -119 86 -58 -69 51 9 -113 123 120 -45
6075 -45 59 91 -23 42 165 -24 -32 161 13 -69 139 39 -118 -58 8 -97 -113 65 -131 -166 16 -41 -133 36
6099 36 -29 -186 66 155 -95 -12 131 -20 -32 221 199 -111 129 138 -58 111 197 -106 -115 83 -52 -118 109 -110
6123 -110 -251 4 36 -173 -82 73 -221 -142 161 9 -124 53 -6 -170 192 277 -94 20 149 -58 64 364
$$ packed form
5936a06R6q6N3K4o1k5R5q6pJ41K0j04Q5P2q2j7J18jr9J09r5k4M9p9M6J0J6j72
5964a10N7K6m6lO0j08k5R2P1j24M5J30r9N5N3j6o1Q9mp9J20j9m6L1M8j61R6K3
5992I5j20RO1l8j04JQ3r4J4N5n1o0Q5m6O5N8n6mJ00L6j09J28J2r9K1M0lo4R3m3
6022F5j07Q0K5q6j5N0o6K1J5k5m4J22j04r9J14P9q1K4N9l8m9J63j6j16J28k4m1
6049C4N6L1q1j4M9r7j3J03r8q5J42m4j43R7R1k30Q3K05j44j1J20m2j22K36lj65
6075d5J04L2j14O5J23j89qJ93j48q2K08j00j57O0O6j05j6J78j96l5J82n7r2J69
6099C6o5j57K52Q9k50Q3J43j51j2K53k2l10K40Rj96J69Q6l03rJ98j35o6K27k19
6123a10j41K55L2k09R1J55k94P9L03j52j33J77n9j64L62Q5l71J14J29k07J22L00
$$ plain form
6145 364 19 -184 165 115 -143 115 89 -311 -158 125 -101 -152 44 -187 -325 147 73 -208 35 54 -222 39
6167 39 336 -69 -124 186 -14 -111 314 170 -202 37 202 -89 28 223 -148 -180 184 19 -180 151 -65
6188 -65 -382 0 238 -162 -96 143 -205 -167 352 89 -212 138 101 -106 157 295 -162 -86 271 -30 -30 273
6210 273 -38 -348 151 111 -280 24 113 -378 -203 286 -23 -265 91 -114 -248 221 231 -238 -53 196 -172
6231 -172 32 406 -44 -196 275 109 -110 290 134 -306 -49 318 -60 -53 146 -230 -265 174 81 -288 7
6252 7 -13 -385 29 270 -187 -161 216 -92 -159 308 149 -234 84 237 -151 170 270 -139 -85 328 54 -51
6274 -51 229 -8 -283 144 181 -225 -86 90 -311 -200 295 -16 -315 52 -9 -192 182 178 -240 -101 248 -31
6296 -31 16 250 -37 -174 208 122 -157 76 118 -242 -40 290 -61 -218 128 -114 -200 176 40 -260 22 68
$$ packed form
6145C64l45k03L49n0k58K58k6m00J53K83k26n1J96k31j38M72p4k81K43J9k76K61
6167C9K97m05n5L10k00r7M25j44l72K39J65k91J17J95l71l2L64j65j99L31k16
6188f5l17L82K38m00O6K39l48L8N19k63l01L50l7k07K63J38m57P6L57l01%L03
6210B73l11l10M99m0l91L04Q9m91J75M89l09k42L56k05j34M69J0m69J85K49l68
6231a72K04L74m50j52M71j66k19M00j56m40K57L67l78PJ99l76l5M39r3l69K95
6252Gk0l72M14K41m57K6L77l08o7M67j59l83L18J53l88L21J00m09N4M13k74j05
6274e1K80k37k75M27L7m06J39J76m01J11M95l11k99L67o1j83L74mm18J39L49k79
6296c1M7K34k87j37L82q6k79K33M2l60K02L30l51j57L46k42q6L76j36l00K82M6
$$ plain form
6318 68 -132 45 219 -150 -90 286 51 -49 231 73 -184 80 274 -72 7 152 -145 -81 210 8 -212
6339 -212 83 -30 -221 39 132 -210 -175 87 -148 -88 194 -75 -203 173 59 -112 83 169 -92 42 215
6360 215 53 9 149 -75 -87 162 104 -151 5 95 -163 -74 160 -128 -213 104 -74 -143 -9 74 -189 -40 120
6383 120 -114 -24 160 -94 -71 177 95 -59 174 100 -87 129 154 9 -31 121 12 -55 120 -68 -107 59 -1
6406 -1 -144 -13 12 -189 -114 44 -44 -74 73 -46 -109 66 94 -33 38 102 2 8 55 -26 16 99 -41 -55 72 21
6432 21 -167 -3 26 -73 -29 51 -106 -106 18 8 -110 13 51 -17 8 72 43 10 74 23 28 46 58 8 110 65 -81
6459 -81 63 44 -43 -50 44 -31 -98 -28 -61 -139 -48 -37 -75 -45 -38 -55 -22 43 48 40 51 66 -2 101 122 53 64 53 6 14 44 7
6491 7 -34 30 -61 -61 17 -66 -95 -61 -89 -126 -86 -6 -88 -99 24 -63 -44 25 68 -13 44 44 13 21 115 16 54 56 5 -5 109 45
$$ packed form
6318F8k00J77J74l69O0L76k35j00K80j58k57K64J94l46P9J45k97O4K91k02k20
6339b12K95j13j91K60R3l42L5K62k35O0K82k69j28L76j14j71J95Q6k61J34J73
6360B15j62m4J40k24j2K49n8k55J56R0k58Q9K34k88q5L17j78o9J34Q3k63J49J60
6383A20k34R0J84k54K3K48q2j54K33p4j87K16K5j45m0J52j09o7J75j88l9J66o0
6406aj43J31K5k01P5J58q8l0J47j19o3J75K8j27P1O4j00OM7q1M2Q3j40j4J27n1
6432B1j88J64K9r9M4Q0j57%J24j0j18J23L8o8K5O4k9l3O4n1NJ8J2n0J02m5j46
6459h1J44j9q7pR4p5o7P0l3p8R1J1l8L0Pj7L3O5NqJ1J5o8J03K1o9J1j1m7QL0l7
6491Gm1O4r1%P8q3k9L4k8l7M0Q0q2j1J23q7J9O9M3q1N7%l1QR4r9L8Kn1j0J14o4
$$ plain form
6523 45 -60 40 28 -84 -81 8 -81 -107 -12 -17 -64 -74 -20 -15 -9 47 -12 -32 37 -44 55 35 22 59 9 81 53 53 72 -8 -50
6554 -50 34 23 -44 38 -55 -52 -29 -13 -63 -40 1 -52 -30 52 -44 -64 -12 78 -18 82 118 -51 -24 34 23 46 86 -27 -74
6583 -74 34 13 -68 37 26 -119 -41 51 -19 -80 -46 -78 -156 37 39 -91 -7 67 -88 16 158 -6 -6 63 64 -13 101
6610 101 99 -56 82 158 17 45 99 -54 -89 57 2 -82 -6 -45 -165 -54 76 -106 -96 -6 -125 -103 154 20
6634 20 -137 102 72 -71 57 207 -92 7 189 22 -35 193 24 -120 43 81 -94 50 -33 -157 -141 162
6656 162 -36 -139 107 -90 -183 162 146 -154 -89 111 -96 49 203 3 -127 110 63 -38 133 134 -215 -34
6678 -34 192 -5 -64 100 -125 -266 149 85 -91 -15 63 -208 2 188 -82 -191 101 -27 -40 230 105 -250
6700 -250 54 146 -39 60 223 -159 -181 257 70 -79 131 -29 -217 34 218 -145 -62 23 -179 -88 189 -11
$$ packed form
6523D5j05J00j2j12LQ9q9k6R5nm7j0N4NON6n9k0O9q1R9k0j3L7n0P2k8%J9q0m2
6554e0Q4j1o7Q2r3LK3J6n0K3M1n3K2Q2r6k0N2R0r6J00L6j69K7N8j1K3M0j13m7
6583g4J08k1q1J05j1j45P8R2p0o1L4l2p8J93Kj30Q4P4j55J04J42j64%O9Jp7J14
6610A01kj55J38P6j41K8N4j53l5J46n5q4P6l9j20J11J30j82J0R0j19K2K57j34
6634B0j57K39l0j43J28J50k99R9J82j67n7K28j69j44J63L8j75J44q3j24J6L03
6656A62j98j03K46j97r3L45j6l00O5K00k07J45J54k00j30K37m7j01J71Jl49J81
6678c4K26j97n9J64k25j41M15o4j76P6P8k71K10J86k70j09K92j28j3K70j25l55
6700b50L04R2j85R9J63l82k2M38j87j49K10j60j88K51J84l63Q3Q5k02R1K77k00
$$ plain form
6722 -11 -301 56 3 -199 157 224 -188 -122 210 63 71 271 -44 -173 140 218 -78 111 141 -220 -51 227 -70
6745 -70 -183 -13 -177 -256 126 79 -276 -32 97 -145 26 275 -153 -231 148 46 -84 221 156 -246 34 279
6767 279 -24 9 199 -192 -144 283 135 -212 68 14 -260 46 173 -128 -172 77 -143 -57 192 -11 -263 90
6789 90 133 -116 121 180 -202 -99 266 92 -92 159 -2 -200 112 159 -142 -45 58 -161 -52 231 -30 -184
6811 -184 84 -43 -190 138 68 -306 -93 195 -49 -40 184 -109 -146 147 140 -90 102 74 -157 30 251 -109
6833 -109 -102 140 -138 -119 168 114 -231 -24 45 -153 -9 142 -129 -168 120 29 -79 130 -9 -169 126 183 -62
6856 -62 26 179 -97 -10 204 47 -98 92 6 -175 73 146 -119 -71 38 -81 -76 53 -94 -160 37 -1 -150
6879 -150 6 55 -133 16 146 22 -118 182 2 -1 143 93 -69 30 120 -83 35 145 -6 -28 61 14 -63
$$ packed form
6722a1k90L57n3k02L56O7m12O6L32j47QK00l15j29L13P8k96J89L0l61J69K78k97
6745g0j13J70j64p9L82m7l55K44J29k42J71K49m28p8L79j02j30L05o5m02K80K45
6767B79l03L3J90l91M8M27j48l47K80n4k74L06J27l01m4K49k20Q6K49k03k52L53
6789I0M3k49K37N9l82J03L65j74j84K51j61j98L12M7l01R7J03k19J09K83k61j54
6811a84K68j27j47L28p0l74K13K88k44RK24k93l7K93pk30J92k8k31J87K21l60
6833a09PK42k78J9K87n4l45K07O9j98J44J51k71l9K88r1j08K09j39j60K95N7k45
6856f2Q8J53k76Q7K14j57j45J90q6j81K48P3k65M8J09j19NJ29j47o6J97l8j49
6879a50J56M9j88J49J30j24j40L00j80lJ44n0j62R9R0k03J18J10j51k2Q9m7p7
$$ plain form
6902 -63 80 -28 -144 -8 -9 -104 -78 91 -71 -71 31 14 -58 22 4 -42 21 117 -22 -10 122 55 0 116 40 -56
6928 -56 2 83 -90 -70 25 -95 -110 32 -33 -86 -12 2 -70 33 6 -29 -35 55 14 44 171 -21 -28 116 15 -16 66
6955 66 105 -5 -9 17 -23 -35 -22 -87 -75 15 -41 -77 -18 13 -74 6 29 -27 -18 22 -42 -36 26 76 21 60 63 39 65 85 18 10
6987 10 100 60 -37 11 21 -51 20 74 -74 -71 20 -24 -42 -21 -17 -78 -57 17 32 4 -45 -42 20 14 -10 35 29 2 -57 118 52 21
7019 21 90 38 23 27 11 -18 11 17 18 -16 31 -1 -87 3 17 -79 -54 -4 -44 20 10 -21 22 64 59 13 -5 16 -26 -5 24 4
7051 4 45 15 -56 5 52 -14 -14 5 -27 -47 -15 51 -41 -53 43 7 -26 10 51 -16 44 35 4 48 112 -80 -26 81 66 -88
7081 -88 67 19 -75 31 34 -30 -72 21 -91 -73 17 -22 -68 -41 -9 -62 6 47 -68 -58 32 -19 27 133 -15 -79 29
7108 29 96 62 140 55 -41 56 84 -3 -11 45 -44 -84 45 29 -138 -24 -26 -148 7 111 -50 -107 18 56 -23 118 10
$$ packed form
6902f3J43j08j16J36jr5K6J69j62%J02j7p2Q0j8m6O3R6j39J2J32o7n5J16p6r6
6928e6N8Q1j73K0R5j20j5J42o5n3P4J4p2J03k7l5oR0m1L0J27j92pJ44j01l1Q2
6955F6L9j10mK6m0j2J3o5J2R0n6l6N9L1q7Q0K3n6RM0o4OO2N0n5L9Lk4K6K0o7q
6987A0R0m0r7M8J0p2P1N4j48LR1m4j8K1Mo1K1P4J5k8m9LO2ok4M5ok7n9J75o6l1
7019B1O9n2j5Mj6k9K9OJl4M7l2q6R0J4r6K5N0m0O4j0l1M3M2nm6j8K1m2K1K9k0
7051DM1l0p1O1M7o6%J9l2k0L2O6r2j2R6l6l3L6M1o7O0rl1M4O4j92N4J07j5j54
7081h8J55m8r4J06Lo4m2R3j12J8R0l9m6K7L2n3O8M1j15J0R0n1M6J06j48o4J08
7108B9O7l4P8q5r6R7K8q7qN6q9m0J29j6j67J14kj22J55J04j61n7J25L8p9J41j08
$$ plain form
7135 10 -72 40 113 -17 43 191 -53 -44 153 58 -83 108 31 -94 76 136 -95 -68 14 -107 -47 61 -26 -176
7159 -176 44 4 -95 82 101 -119 -66 79 -11 -45 156 -53 -152 115 177 -91 34 114 -149 -89 164 -46 -86 42
7183 42 -115 -97 140 100 -181 -16 78 -114 32 191 -107 -154 119 80 -79 116 89 -156 30 167 -23 -23 114
7206 114 -102 -58 163 52 -196 55 -18 -195 54 187 -148 -161 32 -55 -95 185 -12 -280 23 110 -42 76
7228 76 138 -173 -64 259 124 -36 210 7 -176 202 251 -114 -52 113 -165 15 241 -79 -197 25 -10 -109
7250 -109 78 57 -261 -86 70 -89 -18 185 -102 -171 171 97 -58 79 109 -181 76 285 -22 -112 133 -30
7272 -30 -115 202 76 -255 -23 121 -157 14 154 -240 -225 153 2 -81 98 37 -218 49 123 -113 16 101
7294 101 -82 -42 271 16 -148 111 2 -143 175 191 -193 -49 120 -83 -68 183 -26 -224 91 67 -172
$$ packed form
7135A0q2J12P3j30O0J48k44RJ97r5j41J91p7j25J70O0k31K7Q2j21O0J08q7j50
7159a76K20m0r9J77J9k20N3J45r0l4K01k09r9K67O2k68J25Q0k63O0K53k10m0J28
7183D2j57J8K37m0k81J65R4j92J46J59k98m7K73l9j59J95k7k45J86J37j90%J37
7206A14k16M4K21j11k48K51p3j77K49J33l35j3J93q7m0K80j97k68L03Q7j52J18
7228G6O2l11J09L23j35j60K46k03j83L78M9l65O2J65k78J80K26l20j18K22l5r9
7250a09J87k1l18J75J56j59P1K03k87o9L42p4j55J37L0k90K57K09l07r0K45j63
7272c0q5L17j26l31K32J44k78J71J40l94J5L78j51q3J79o1k55K67P4k36J29Q5
7294A01j83M0L13k55j64K59j09j45L18J6l84J44J69k03J5K51k09j98L15k4k39
$$ plain form
7315 -172 41 86 -244 3 234 -1 -70 126 26 -119 202 129 -143 22 109 -84 76 199 -90 -149 118 46
7337 46 -121 75 17 -295 -32 91 -100 -42 96 -168 -130 229 38 -123 67 98 -80 50 201 -91 -16 105
7359 105 -27 15 182 40 -154 52 85 -92 51 60 -152 -91 124 -14 -122 126 -77 -142 74 131 -108 -43 44
7382 44 -142 -32 171 -42 -39 118 37 -80 148 144 -97 29 112 -88 -39 144 -66 -103 78 50 -65 43 -25 -98
7406 -98 -1 71 -82 -64 8 -95 -83 87 3 -65 5 77 -52 43 105 -51 -44 75 42 -6 93 57 -38 43 57 -70 -15
7433 -15 37 -98 -45 54 -30 -138 103 -8 -29 70 45 -29 -36 53 -20 10 25 29 -61 78 80 26 59 47 -18 -38 115 44 -68
7462 -68 21 19 -78 -29 1 -89 -35 -9 -61 -27 59 -18 -26 51 41 42 59 69 -14 10 36 34 14 118 25 -53 19 46 -36 28 42 -32
7494 -32 -50 -23 -35 -54 10 -58 -66 30 -39 -52 16 -22 2 7 38 31 -49 110 47 -25 76 44 36 41 53 15 38 112 1 10 25 -62
$$ packed form
7315a72K13M5l30K47K31k35o9J96j00j45L21p3k72J65Q7j93J60J23k89n9K67p2
7337D6j67J96n8l12K63J23j91N8J38k64L8L59j91j61J90L1j78J30J51k92P5J21
7359A05j32M2J67j42j94K06L3j77J43Rk12O1K15j38j08K48k03o5K16N7k39O5Q7
7382D4j86J10K03k13LJ57q1j17K28mk41J26Q3k00M9J83k10l7J81k8j15J08o8p3
7406i8R7P2j53J8P2j03J2J70q4o8P0P2j29R5O2j56PJ19l3m8R9l6r5Q1J4j27N5
7433a5N2j35N3R9q4j08K41j11k1R9k5p4pQ9p3L0J5Mr0J39Kn4L3j2o5k0J53p1j12
7462f8Q9kr7M9L0r0N4K6n2L4Q6p7qP7j0JJ7J0q3K4K6kk0J04r3p8P2K7q2O4J4p4
7494c2j8K7j2j9O4o8qR6o9j3O8l8K4NL1pq0J59o3p2J01l2qNJ2l8K3P4j11RJ5q7
$$ plain form
7526 -62 -6 -5 16 -87 -43 -5 -79 -50 -28 -34 -13 1 16 33 32 15 -34 5 90 14 22 45 -50 13 135 36 -50 -12 -57 -39 -18
7557 -18 -52 7 -61 3 -78 1 7 -38 -49 24 5 -33 44 53 21 12 111 22 -9 16 18 -6 75 2 18 50 3 -52 57 70 -67
7588 -67 -12 -28 -81 -89 -7 -27 -109 -19 1 -18 -27 20 -54 8 70 -1 22 54 80 -6 59 43 3 35 36 -16 -1 74 11 -20 17 -31
7620 -31 -65 42 -9 -96 -26 10 -54 -110 67 2 -70 61 53 -18 79 32 -101 50 166 34 -27 41 29 6 98 67 -35
7647 -35 22 -8 -43 70 97 -83 -93 85 0 -69 79 -30 -142 47 58 -87 16 39 -53 -36 104 -15 -70 54
7671 54 -29 -58 119 88 -78 -30 111 -82 -36 108 -116 -123 16 27 -60 14 23 -145 -44 107 -30 -54 84 -45 -102
7696 -102 118 106 -64 75 27 -102 60 238 -46 -93 149 -27 -71 68 69 -186 -52 29 -86 -61 23 -133 -90
7719 -90 140 -22 -101 112 44 -160 29 172 -73 -40 139 -37 21 209 124 -77 69 75 -40 99 146 -115 -74
$$ packed form
7526f2N6JK1j03M4L8p4K9K2oK1J4J5J7jj7m9L9Q5p6QK3r5O3J22r9q6L8m5J8K1
7557a8l4N9o8O4q1P9Om5j1P3j9l8P7Rl2rR9q9l1K5Kk4Q1p3J6L2m7n5J09J3j37
7588f7N5j6n3qQ2k0q2R0K0j9rM7p4O2O2p1K3L2K6q6O5j6m0L2Jn2J5P5o3l1L7m8
7620c1l4J07n1q7P0L6o4n6J77o5p2J31qp1R7m7j33J51J16j32o1O8j2k3R2l1j02
7647c5N7l0l5J13K7j80j0J78q5o9J48j09j12J89J1j45J03K3r2J7J40j19n5J24
7671E4q3k9J77l1j66M8J41j93M6J44k24pJ39J1q7P4Rj68J01J51j37k4J38j29n7
7696a02K20j2j70J39m8j29J62J78k84m7K42j76m4J39Jk55J34Q1j15K5Q4j56M3
7719i0K30j62p9K13o8k04J89J43k45L3J79j76N8J88q5k01J46Oj15J39M7k61M1
$$ plain form
7742 -74 127 -75 -69 165 -26 -268 54 84 -143 1 78 -183 -51 204 -12 -93 80 12 -54 131 122 -60 32 129
7766 129 -91 86 191 -71 -136 89 -4 -61 111 -7 -171 21 122 -54 -58 53 -111 -94 172 73 -102 35
7788 35 10 -142 120 143 -117 -80 76 12 -21 145 44 -191 86 71 -63 73 138 -165 -118 126 -28 -71 124
7811 124 -10 -188 145 201 -149 -25 65 -137 -16 201 19 -103 74 62 -73 149 177 -190 -9 96 -67
7832 -67 -79 116 -47 -155 150 100 -142 34 34 -137 -26 189 -83 -81 77 -126 -72 117 35 -116 66 82 -70
7855 -70 107 216 -63 -47 170 71 -72 84 37 -85 57 83 -45 -38 50 -90 -52 125 -36 -142 39 16 -103
7878 -103 49 47 -99 -65 80 -11 -6 77 37 -45 58 107 -58 55 112 -74 22 128 -11 -60 54 -28 -115 85 -58
7903 -58 -134 -63 80 -123 -77 98 -98 -98 86 23 2 73 49 -96 16 119 -10 -4 81 0 -64 112 35 -81 54
$$ packed form
7742g4K01k02OK34j91k42L22L0k27J44P7k61J32K55k16q1J73o8o6J85rj82R2R7
7766A29k20J77J05k62o5K25r3n7J72j18j64J92J01j76mJ11j64J7K66r9j75J37
7788C5k5j52K62K3k60L7J56o4l3J66j01k35K77j5j34J36O5l03M7K44j54m3J95
7811A24j34j78L33N6l50J24R0k02J21K17j82j22J77j2j35K22K8l67J81J05j63
7832f7j2J95j63j08L05n0k42J76%j71J11K15k72KJ58k03N4J89q2j51J82J6j52
7855g0J77J09k79J6K17r9j43J56m7j22J42K6j28PQ8j40L8J77j61j06J81k3j19
7878a03J52kj46L4J45r1NQ3m0q2J03M9j65J13N7j86R6J06j39m9J14q2q7K00j43
7903e8p6P1J43k03M6J75j96%J84o3k1P1k4j45J12J03j29OQ5q1o4J76p7j16J35
$$ plain form
7928 54 69 -37 8 56 -96 -41 6 -44 -107 49 -8 -104 33 28 -26 23 53 -57 21 124 32 -43 139 17 11 75 58
7955 58 -22 -17 54 -8 5 17 25 -40 -6 26 -55 37 10 -85 -55 28 -51 -9 59 -11 -73 96 47 26 36 37 -25 79 82 14 -47
7986 -47 79 -32 -28 57 -11 -99 -11 -23 -85 -54 7 -56 -81 -31 -4 -79 -39 1 -92 29 -20 37 -30 66 15 30 61 16 -29
8015 -29 53 82 4 40 39 -13 -18 57 -10 11 22 9 20 -22 -7 -38 -38 -38 -40 -11 60 -38 -59 8 -14 -62 70 55 -11 41 62 29
8047 29 4 77 3 -16 75 -23 -19 -16 -3 -27 -7 25 -51 -18 13 -27 -74 26 54 -2 29 22 -14 78 11 19 23 30 7 -7 79 10 -19
8080 -19 65 38 -113 46 29 -21 18 -54 -71 -72 -25 -44 -29 12 -1 -45 10 -2 -35 12 72 -18 -16 57 48 -22 80 73 42 50 62
8111 62 -5 18 65 -47 22 19 -38 -40 6 -38 -67 -33 6 -125 -42 11 -9 -83 -5 0 -48 34 96 -53 46 91 25 82 126 2
8141 2 -7 51 -32 27 95 -11 -68 -21 62 -60 -44 74 -73 -63 10 9 -93 24 1 -83 56 5 -43 -1 63 -14 19 119
$$ packed form
7928E4J5j06M5M8j52N5M7n0o3J56n7r6J37nn4M9L0j10P8J03r2p5J82j22oO4j7
7955E8q0NP1o2J3J2Qo5L4L2q1R2k7r5L0Q3p9M2O8p0o2J69m9k1J0Jo2J04Lo8o1
7986d7J26j11MQ5o8q8Q8j2o2L1O1o3k5N0K7p5M0M0r3J21m9N7o7R6n1J5L1m5m5
8015b9Q2K9p8L6jn2nP5o7K1J1j3J1m2J5l1%%kK9P1r8k1O7k2m8J32j5o6N2K1l3
8047B9k5P3p4j9R1r8MLJ3k4K0L2p6L3L1m0m7J00K8n6L1pl6R2o7QMPk3j4Q6o9k9
8080a9Q4k7j51J59j7n0L9p2j7jM7j9J5M1j3m4N5j2l3M7O0r0KP3rp0J02pl1QJ2
8111F2o7K3M7j12O9ln7kM6m4k9L4L9j31Q3N3k0p4P8Nm8Q2O2j49R9M5o6N7M4j24
8141BrN8q3N9O8j06n7M7Q3j22J6J18j47J0P3jj02J17k3q4J39n1m8M2O4p7L3J00
$$ plain form
8169 119 24 -33 66 76 -12 -3 17 -40 -7 72 -4 48 58 -58 -49 73 39 -114 -19 11 -100 -2
$$ packed form
8169A19r5n7R9J0q8RK0n7L3P9p6N2J0j16RJ22l4j53R5L0j11R8
8191b
$$ Imaginary data points
##PAGE= N=2
##DATA TABLE= (X++(I..I)), XYDATA
$$ plain form
0 0 0 0 0 0 0 0 0 0 0 0 0 0 0 0 0 0 0 0 0 0 0 0 0 0 0 0 -3 4 -4 4 -4 4 -5 5 -4 5 -6 7 -8 9 -9 10 -10 11 -10 12 -12 14 -15 15
50 15 -16 18 -20 24 -28 32 -39 47 -59 77 -100 134 -185 265 -398 636 -1112 2242 -5943 38701 213837
71 213837 -520 -127442 -49097 -188018 -177502 102695 64857 -149451 -68719 -24096 -92031
82 -92031 96901 203718 -31639 -80392 72323 18429 18916 172882 42758 -147314 1986
93 1986 89568 -29977 23493 63692 -111523 -98070 78002 17480 -63186 20856 -33405 -110853
105 -110853 43674 88313 -66279 -39519 43100 -45246 -5474 127112 3710 -97759 47826
116 47826 59124 -34762 57648 59257 -100472 -39716 87770 -3552 -32620 38489 -59444 -93386
128 -93386 69470 55805 -68741 -2585 18527 -73505 25615 120570 -26092 -67726 46434
$$ packed form
0@%%%%%%%%%%%%%%%%%%%%%%%%%%lPqQqQrJ0rRj1J3j5J7j8J9k0K1k1K2k4K6k9L0
50A5l1L4l8M4n2O0p1Q6j06J36j77K34l19M50o63J034j748L354q185M4644J75136
71B13837k14357j26922P8345j38921J0516K80197l7838k14308Q0732M4623o7935
82i2031J88932J06817k35357m8753J52715n3894M87J53966j30124j90072J49300
93A986Q7582j19545N3470M0199j75215J3453J76072o0522q0666Q4042n4261p7448
105a10853J54527M4639j54592K6760Q2619q8346L9772J32586j23402j01469J45585
116D7826J1298r3886R2410J609j59729O0756J27486r1322k9068P1109r7933l3942
128i3386J62856j3665j24546O6156K1112r2032R9120R4955j46662m1634J14160
$$ plain form
139 46434 2382 -28902 82024 29506 -98067 -21681 36342 -28126 14032 40954 -77592
150 -77592 -65206 58494 20402 -25447 40046 -5389 -74097 36076 87615 -15781 -13646 32247
162 32247 -33815 -15637 77837 18977 -53933 -2795 -3213 -33769 34103 34371 -62776 -39495 23493
175 23493 -18330 -8994 45034 -21618 -63535 24563 38645 -18065 17197 26136 -41169 -6458
187 -6458 58226 9159 -15215 19429 -11535 -22847 38717 22586 -35158 -4887 7794 -31721
199 -31721 2840 34466 -28356 -40507 16959 1763 -22214 20567 8916 -37657 -1045 29046
211 29046 -2956 2048 16550 -15582 -7668 33159 9910 -13094 14861 2407 -21886 17255
223 17255 27166 -19223 -14979 12599 -8849 -11393 17286 -2819 -26628 -1130 4276 -9897 5868
$$ packed form
139D6434m4052l1284J10926n2518j27573P6386N8023o4468M2158K6922j18546
150g7592J2386J23700l8092m5849O5493m5435o8708J10173N1539j03396K135M5893
162C2247o6062J8178R3474n8860p2910N1138m18l0556O7872K68r7147K3281O2988
175B3493m1823R336N4028o6652m1917Q8098J4082n6710L5262Q939o7305L4711
187f458O4684m9067k4374L4644l0964j1312O1564j6131n7744L0271J2681l9515
199c1721L4561L1626o2822j2151N7466j5196k3977M2781j1651m6573L6612L0091
211B9046l2002N004J4502l2132P914M0827k3249k3004K7955j2454k4293L9141
223A7255R911m6389M244K7578k1448k544K8679k0105k3809K5498N406j4173J5765
$$ plain form
236 5868 3754 -20570 -4239 15001 -4401 -3050 14081 -6363 -13548 16450 14419 -7928 3139
249 3139 9838 -6660 1665 16452 446 -6372 4437 -1317 -2573 7810 -1271 -11423 -547
262 -547 498 -8932 806 4339 -13044 -9633 6860 -519 -7253 2785 1919 -6498 739 8249 2796
277 2796 1144 2459 834 5937 7434 8 1570 6077 -1094 -2662 7081 3069 -8519 -3185 3215
292 3215 -3424 -5648 -1018 -2556 -6918 -5405 -1923 -489 -2133 -5699 -2244 3959 540 -1676 4609
307 4609 4977 -692 2473 9065 4815 -59 3564 4690 2220 1988 2168 1138 -1803 -3576 -931 794
323 794 -2936 -6587 -3387 -1325 -5299 -4384 -45 -2911 -5816 -1370 2568 -198 -1700 1642 2381 773
339 773 2644 5742 4406 511 1401 5456 5376 1315 -202 2135 1425 -2385 -1200 2039 -1200 -6719
$$ packed form
236E868k114k4324J6331J9240j9402J351J7131k0444p185K9998k031k2347J1067
249C139O699j6498Q325J4787j6006o818J0809n754j256J0383r081j0152J0876
262e47J045r430R738L533j7383L411J6493p379o734J0038q66q417P237P510n453
277B796j652J315j625N103J497p426J562M507p171j568R743m012j1588N334O400
292C215o639k224M630j538m362J513L482J434j644l566L455O203l419k216O285
307D609L68n669L165O592m250m874L623J126k470k32J80j030k941j773K645J725
323G94l730l651L200K062l974R15M339k866k905M446L938k766j502L342P39j608
339G73J871L098j336l895Q90M055q0m061j517K337p10l810J185L239l239n519
$$ plain form
355 -6719 -3464 1973 -3154 -6910 -1298 -935 -5661 -2687 2688 -522 -3721 358 2176 1893 3202 987
371 987 1892 5994 2066 -111 7100 5411 -4137 719 7835 -2196 -5775 3816 71 -7330 -233
386 -233 1418 -6806 -3780 548 -5083 -2648 1518 -5912 -3692 5532 -1871 -5552 6447 3377 -7185
401 -7185 5426 11673 -4499 -1640 11717 1369 -2968 10469 4537 -8063 2587 6220 -5330
414 -5330 973 4017 -11389 -4800 8458 -6301 -8972 6972 -5469 -16147 8538 10083 -14579
427 -14579 -3567 10064 -8088 -2967 16971 -463 -11716 8403 5360 -4413 14028 7856 -15834
440 -15834 3364 16199 -7553 -469 15560 -13249 -18013 16972 6432 -18360 1849 1985 -20974
453 -20974 1204 18005 -11146 -12418 8073 -7602 -5833 23594 3086 -21475 7756 12109 -10430
$$ packed form
355f719L255N437n127l756N612L63m726K974N375l210l199M079J818k83J309k215
371I87R05M102l928k177P211j689r548M856P116j0031l579R591l745p401P097
386b33J651q224L026M328n631K435M166p430K220R224p403l681J1999l070j0562
401g185J2611O247j6172K859J3357j0348m337J3437n932j2600J0650L633j1550
414e330O303L044j5406O589J3258j4759k671J5944j2441j0678K4685J545k4662
427a4579J1012J3631j8152N121J9938j7434j1253K0119l043r773J8441o172k3690
440a5834J9198J2835k3752P084J6029k8809m764L4985j0540k4792K0209J36k2959
453b0974K2178J6801k9151j272K0491j5675J769K9427k0508k4561K9231M353k2539
$$ plain form
466 -10430 12543 20450 -20270 -12877 24333 4211 -9570 15472 -3288 -26583 10722 21184
478 21184 -13575 -6151 5487 -21442 -6033 28233 -4425 -24690 7476 -2237 -17932 22811
490 22811 19097 -30951 -10087 22165 -6347 -461 27611 -11378 -28941 19161 18823 -9045 12756
503 12756 5671 -30870 4031 34172 -8787 -11686 14086 -20659 -21082 34460 12508 -35169 -3732
516 -3732 7715 -21755 10741 30902 -23759 -26621 17756 2617 -3848 28387 -2529 -37501 11391
529 11391 29266 -9154 7354 17372 -32214 -14959 42200 9612 -23317 8355 -5591 -29431
541 -29431 21640 30925 -26869 -19368 9533 -15820 -1367 35351 -9750 -39156 9885 12295 -12659
554 -12659 23109 16015 -41122 -9461 38176 1075 -6478 22691 -16002 -30241 31593 27355 -20768
$$ packed form
466a0430K2973P907m0720P393L7210k0122j3781K5042j8760k3295L7305J0462
478B1184l4759P424J1638k6929J5409L4266l2658k0265L2166r713j5695M0743
490B2811l714n0048K0864L2252k8512N886K8072l8989j7563M8102l38k7868K1801
503A2756p085l6541L4901L0141m2959k899K5772l4745m23N5542k1952m7677L1437
516c732J1447k9470L2496K0161n4661k862M4377j5139o465L2235l0916l4972M8892
529A1391J7875l8420J6508J0018m9586J7255N7159l2588l2929L1672j3946k3840
541b9431N1071R285n7794P501K8901k5353J4453L6718m5101k9406M9041K410k4954
554a2659L5768p094n7137L1661M7637l7101p553K9169l8693j4239O1834m238m8123
$$ plain form
567 -20768 -1077 3421 -27918 9621 39100 -16510 -28566 10808 -9131 -12685 36081 6587
579 6587 -46573 -3618 22508 -11691 8574 25017 -30498 -27904 30146 14030 -9716 16077
591 16077 -6335 -33732 18645 35921 -13480 -6797 12146 -23878 -7006 43269 3693 -34256
603 -34256 4059 4046 -18886 20002 22688 -34016 -20948 18638 -3721 -2232 23204 -15482 -33810
616 -33810 17756 20773 -11576 9564 8371 -31298 402 40724 -840 -17010 12852 -8300
628 -8300 -17629 29969 19612 -28191 -8119 9430 -13813 7210 25485 -20030 -26860 13314 2356
641 2356 -9450 20253 510 -36106 2327 26413 -8332 -2590 15165 -18573 -15853 28779 13300
654 13300 -15057 5844 1961 -16685 15090 23925 -15006 -10378 11038 -9638 -4763 24102 -3587
$$ packed form
567b0768J9691M498l1339L7539K9479n5610j2056L9374j9939l554M8766k9494
579F587n3160M2955K6126l4199K0265J6443n5515K594N8050j6116k3746K5793
591A6077k2412k7397N2377J7276m9401O683J8943l6024J6872N0275l9576l7949
603c4256L8315j3k2932L8888K686n6704J3068L9586k2359J489K5436l8686j8328
616c3810N1566L017l2349K1140j193l9669L1700M0322m1564j6170K9862k1152
628h300r329M7598j0357m7803K0072J7549k3243K1023J8275m5515o830M0174j0958
641B356j1806K9703j9743l6616L8433K4086l4745N742J7755l3738K720M4632j5479
654A3300k8357K0901l883j8646L1775Q835l8931M628K1416k0676M875K8865k7689
$$ plain form
667 -3587 -28928 4613 10420 -13006 5737 10973 -22606 -11081 19138 490 -7853 10074 -6698
680 -6698 -15854 16142 14364 -11651 2006 7877 -13177 3666 24069 -5194 -15107 9698 976
693 976 -9389 13794 7002 -19611 -3906 9982 -6585 -709 9491 -12284 -12839 10591 1967
706 1967 -8000 7122 -397 -15502 5305 14999 -6722 -3753 10211 -4413 -5135 14680 5198 -9317
720 -9317 3693 5160 -5466 4807 7520 -9043 -4435 6555 -4539 -4075 7565 -4659 -12706
733 -12706 4930 5376 -9280 -839 5371 -7765 -3539 8859 -131 -4366 4702 319 -3208 7294
747 7294 4389 -4968 2993 5014 -4314 2347 8133 -3853 -4719 5679 55 -5848 2787 1601 -6903
762 -6903 -1567 2028 -3932 -1670 1372 -3859 -2577 2521 -1580 -2484 3600 511 -3086 3650 3880 -2322
$$ packed form
667c587k5341L3541N807k3426J8743N236l3579J1525L0219j8648q343J7927j6772
680f698r156L1996j778k6015J3657N871k1054J6843K0403k9263r913K4805q722
693I76j0365K3183o792k6613J5705J3888j6567N876J0200k1775n55K3430q624
706A967r967J5122p519j5105K0807R694k1721K969J3964j4624p22J9815r482j4515
720i317J3010J467j0626J0273K713j6563M608J0990j1094M64J1640j2224q047
733a2706J7636M46j4656Q441O210j3136M226J2398q990m235R068m383l527J0502
747G294k905r357P961K021r328O661N786j1986q66J0398n624n903Q635j186q504
762f903N336L595n960K262L042n231J282N098m101r04O084l089l597O736K30o202
$$ plain form
778 -2322 1605 5355 -583 -1270 4192 1970 -1325 1476 1117 -1141 407 -368 -2169 -43 -735 -4173
794 -4173 -1315 1226 -3270 -2803 1596 -1488 -3614 1147 1938 -1729 -832 2027 1228 1249 1942 834 1965
811 1965 2233 -154 1510 3668 -255 -1967 1949 1525 -2054 -166 813 -2904 -2617 128 -1070 -2315
827 -2315 -1800 -2051 -1254 252 -966 -1089 968 -418 -1616 2173 2968 -616 183 3132 1342 347 3083
844 3083 1936 -755 534 1602 528 81 -332 -1053 -734 -583 -1626 -970 -425 -3007 -2931 601 -76 -2841
862 -2841 -1097 963 -1003 -1221 2150 1695 -974 186 2265 1833 1359 1631 1371 996 1053 748 1370 1506
880 1506 -1219 -2018 960 1045 -2224 -1632 328 -2424 -3328 589 324 -3182 -2264 98 -680 -498 1266
897 1266 107 -953 869 1259 1360 2950 1093 -1221 1814 3530 245 567 2880 -1230 -2896 2768
$$ packed form
778b322L927L750n938o87N462k222l295K801l59k258J548p75j801K126o92l438
794d173K858K541m496M67M399l084k126M761P91l667Q97K859p99K1O93j108J131
811A965K68k387J664K158l923j712L916m24l579J888R79l717K87K745j198j245
827b315N15k51P97J506j218j23K057j386j198L789P95l584P99K949j790r95K736
844C083j147k691J289J068j074m47m13p21L19J51j043O56N45k582P6L532o77k765
862b841J744K060j966k18L371m55k669J160K079m32m74K72k60l75N7l05O22J36
880A506k725p99K978Q5l269N92J960k752r04L917k65l506R18K362p78J82J764
897A266j159j060J822L90J01J590j857k314L035J716l285L22K313m110j666N664
$$ plain form
913 2768 2035 -3334 -1321 348 -3324 -1552 2455 -1715 -4351 -462 -1185 -1880 2717 381 -4640 344
929 344 3143 -1496 1973 5383 -3021 -3229 6446 3633 -2176 2982 2023 -4809 1034 6234 -1499 -2881
945 -2881 859 -3963 -2390 5429 -732 -7027 150 19 -5524 3034 5510 -7648 -5697 5694 390
960 390 -2125 6054 189 -7488 3141 7492 -907 1853 3464 -6264 -662 10497 507 -5245 3396
975 3396 -2437 -7678 7471 6828 -10397 -4664 4158 -5455 -1061 9515 -4579 -11668 3812 3618
989 3618 -3579 6240 2525 -12003 305 11371 -1396 -564 7216 -6887 -7208 13513 6982 -8713
1003 -8713 1699 2440 -9393 4118 13005 -6549 -9802 3443 -2357 -3093 10276 -662 -15110
1016 -15110 115 6130 -4803 3993 7146 -12996 -8131 13671 4266 -5451 6403 -1495 -12136
$$ packed form
913B768p33n369K013J669l672J772M007m170k636L889p23o95M597k336n021M984
929C44K799m639L469L410q404k08R675k813n809N158r59o832N843N200p733j382
945b881L740m822J573P819o161o295P177j31n543Q558K476j3158J951J1391n304
960C90k515Q179n865p677J0629M351q399K760J611r728N602J1159r990n752Q641
975C396n833n241J5149o43j7225N733Q822r613M394J0576j4094p089J5480j94
989C618p197R819l715j4528J2308J1066j2767Q32P780j4103l21K0721o531j5695
1003h713J0412P41j1833J3511Q887j9554l253J3245n800p36J3369j0938j4448
1016a5110J5225O015j0933Q796L153k0142M865K1802r405r717J1854p898j0641
$$ plain form
1029 -12136 8428 14792 -5465 -3844 4133 -7280 96 16588 -1484 -13951 2984 987 -7338
1042 -7338 10570 7450 -18524 -7581 11059 -2874 -2086 10525 -9172 -15957 10558 9994 -6141
1055 -6141 3760 1625 -14344 3681 18788 -2837 -6811 6438 -6094 -5790 18210 6720 -16203
1068 -16203 -1325 5689 -7631 5275 12930 -12971 -14121 8330 2333 -3912 8297 -3527 -17683
1081 -17683 3891 12837 -4309 266 4878 -13038 -4276 19568 4438 -11136 3497 462 -9134
1094 -9134 11707 14520 -11795 -8379 6580 -2981 946 13506 -5972 -16915 4795 5904 -5714
1107 -5714 6812 3198 -18918 -3823 15960 -1251 -5804 6806 -7208 -11307 14164 10661 -9931
1120 -9931 -622 3307 -8493 5952 16181 -6542 -10245 6475 -808 -2993 13518 1147 -17490
$$ packed form
1029a2136K0564O364k0257J621P977j1413P376J6492j8072j2467J6935j997q325
1042g338J7908l120k5974J0943J8640j3933P88J2611j9697o785K6515n64j6135
1055f141R901k135j5969J8025J5107k1625l974J3249j2532L04K4000j1490k2923
1068a6203J4878P014j3320J2906P655k5901j150K2451n997o245J2209j1824j4156
1081a7683K1574Q946j7146M575M612j7916Q762K3844j5130j5574J4633l035r596
1094i134K0841K813k6315L416J4959r561L927J2560j9478j0943K1710J109j1618
1107e714J2526l614k2116J5095J9783j7211m553J2610j4014m099K5471l503k0592
1120i931R309L929j1800J4445J0229k2723l703J6720p283k185J6511j2371j8637
$$ plain form
1133 -17490 190 9535 -4669 1465 6870 -12868 -10041 11947 3788 -6747 3137 -3218 -11321
1146 -11321 7450 11707 -6477 -3658 3955 -6329 514 15466 -357 -11771 3687 3989 -4407
1159 -4407 7901 7298 -11977 -5815 8645 -212 -1580 5951 -6424 -10878 6343 5532 -5877 1293
1173 1293 566 -11151 610 12317 -2854 -7001 4313 -1810 -4793 9960 6058 -8616 -807
1186 -807 5321 -2318 3446 7820 -5990 -5978 6282 1259 -3001 5198 -1382 -10556 2151 7163 -4793
1201 -4793 -2603 2820 -6312 -4002 7877 1292 -6519 863 569 -3729 4954 5586 -5020 -1717 4238
1216 4238 -1199 1160 7149 -1809 -6062 4004 3642 -2899 2401 2479 -6295 -2088 5155 -784 -3237
1231 -3237 1100 -2792 -3999 3113 1249 -4058 -6 508 -3488 1660 4796 -2599 -2680 3983 1057 -1341
$$ packed form
1133a7490J7680R345j4204O134N405j9738K827K1988q159j0535R884o355q103
1146a1321J8771M257j8184K819P613j0284O843J4952j5823j1414J5458L02q396
1159d407J2308o03j9275O162J4460q857j368P531j2375m454J7221q11j1409P170
1173A293p27j1717J1761J1707j5171m147J1314o123k983J4753l902j4674P809
1186h07O128p639N764M374j3810J2J2260n023m260Q199o580r174J2707N012j1956
1201d793K190N423r132K310J1879o585p811P382k94m298Q683O32j0606L303N955
1216D238n437K359N989q958m253J0066l62o541N300P8q774M207P243n939k453
1231c237M337l892j207P112j864n307M052N14l996N148L136p395q1O663k926k398
$$ plain form
1247 -1341 3920 1946 -3357 932 3651 -366 173 1354 -2441 -1169 2825 -620 -2280 796 -1711
1262 -1711 -3518 1611 1691 -3471 -1706 1126 -1721 -936 2442 -229 -2146 796 1109 231 1983 1257
1278 1257 -999 1036 2072 21 1255 1954 -1093 -849 1966 367 -1680 125 -10 -2125 -669 384
1294 384 -1310 -1589 -737 -799 -322 57 -1047 -636 673 -175 -247 1747 788 -1011 951 2265 518 324
1312 324 1328 525 -120 801 778 308 -186 -1083 -483 616 -678 -1676 -208 -494 -2159 -689 830 -1066
1330 -1066 -1559 85 76 -365 433 506 124 589 581 534 1640 963 -357 936 1524 -130 77 1302 -33
1349 -33 -1180 419 562 -1159 -929 -252 -978 -934 -337 -750 -861 -641 -791 -320 562 -177 -731 711 858
1368 858 -211 789 1650 48 -396 1455 1400 -11 397 856 32 -81 402 201 -189 -540 -891 -389 108
$$ packed form
1247a341N261j974n303M289K719m017N39J181l795J272L994l445j660L076k507
1262a711j807N129Q0n162J765K832k847P85L378k671j917K942L13q78J752p26
1278A257k256K035J036k051J234O99l047K44K815j599k047J805j35k115J456J053
1294C84j694k79Q52o2M77L79j104M11J309q48p2J994r59j799J962J314j747j94
1312C24J004q03o45R21k3m70m94q97O00J099j294r98J468k86j665J470J519j896
1330a066m93J644rm41P98P3l82M65qm7J106o77j320J293N88j654K07J225j335
1349c3j147J599J43j721K30O77p26M4N97m13j11K20j50M71Q82p39n54J442J47
1368H58j069J000Q61j602m44J851n5j411M08M59q24j13M83k01l90l51l51N02M97
$$ plain form
1387 108 -1037 -1213 -48 -578 -1443 -293 421 -772 -1097 490 764 -257 122 955 668 251 675 1179
1405 1179 660 285 650 735 525 241 -216 11 271 -670 -876 148 -605 -1844 -242 408 -1653 -1341 494
1424 494 -617 -1289 647 358 -1185 335 1169 -41 719 1248 -278 604 2071 345 -89 1739 53
1441 53 -1316 1778 1307 -2152 -811 1032 -1526 -1348 1210 -829 -2818 -196 264 -1284 273 211 -2166
1458 -2166 -141 2047 -424 -225 2146 -701 -1722 3251 2635 -1842 488 2194 -1431 114 3618
1473 3618 -564 -2788 977 -27 -1615 1941 73 -4377 -600 1836 -2255 -306 2319 -3542 -3267
1488 -3267 3853 1246 -2582 1856 734 -3574 1984 4928 -1515 -1158 2319 -1531 -266 5184 161
1503 161 -4101 1281 1000 -2509 2685 2626 -5583 -2689 3659 -1039 -1901 2972 -2321 -5831 2396 3528
$$ packed form
1387A08j145j76J165n30q65J150P14j193l25J587K74j021L79Q33k87m17M24N04
1405A179n19l75L65Q5k10k84m57K27K60r41k06J024p53j239J602O50k061L12J835
1424D94j111o72J936k89j543J520Q34j210P60N29j526Q82J467j726m34J828j686
1441E3j369L094m71l459J341J843k558J78K558k039j989K622M60j548J557o2k377
1458b166K025K188k471J99K371k847j021M973o16m477K330J706l625J545L504
1473C618m182k224L765j004j588L556j868m450L777K436m091J949K625n861K75
1488c267P120k607l828M438j122m308N558K944o443L57L477l850J265N450n023
1503A61m262N382k81l509N194n9q209K894O348m698q62M873n293l510Q227J132
$$ plain form
1519 3528 -2649 -167 1138 -4088 203 6121 -250 -2831 2381 -603 -2230 5899 3694 -5637 -839
1534 -839 3795 -1993 539 5203 -3443 -6114 3142 2130 -2629 2108 -274 -7017 513 5433 -2419
1549 -2419 -1825 2225 -4573 -3101 7430 2122 -5773 1197 1850 -3689 4006 6705 -4599 -3677 4309
1564 4309 -44 -291 5965 -1460 -7370 2300 3797 -2802 1572 1815 -7728 -2606 7049 -396 -4209
1579 -4209 2304 -2497 -5717 5428 5402 -5158 -1815 2483 -2878 1586 7651 -2071 -5619 3233 1684
1594 1684 -1418 5600 1826 -8066 -525 6415 -1455 -964 3700 -5226 -6017 5858 3236 -4844 84
1609 84 -470 -5935 2385 6788 -3651 -3814 2625 -2345 -1174 7960 978 -7388 1464 4096 -2380 3139
1625 3139 5174 -5986 -4016 5914 1157 -1987 3397 -2219 -6680 3516 4909 -3885 -884 1182
$$ packed form
1519C528o177K482J305n226M291N918o371k581N212k984j627Q129k205r331M798
1534h39M634n788K532M664q646k671R256j012m759M737k382o743P530M920p852
1549b419N94M050o798J472J0531n308p895O970O53n539P695K699j1304R22P986
1564D309m353k47O256p425n910R670J497o599M374K43r543N122R655p445l813
1579d209O513m801l220J1145k6j0560L343M298n361M464O065r722l548Q852j549
1594A684l102P018l774r892P541O940p870M91M664q926p91J1875k622q080M928
1609H4n54n465Q320M403j0439j63O439m970J171R134o982q366Q852K632o476N519
1625C139K035j1160J970R930m757l144N384n616m461J0196J393q794L001K066
$$ plain form
1639 1182 -5801 -700 7389 -1228 -5886 1834 -82 -3446 5157 4031 -6370 -1876 4513 -738 878
1654 878 5225 -2896 -4910 4438 2957 -2088 2728 359 -6424 986 6034 -2371 -2830 2196 -3528
1669 -3528 -3678 5441 1701 -5788 -389 1266 -3021 2175 4370 -3838 -2948 3450 -90 -482 4901 -532
1685 -532 -5257 2724 4295 -1917 979 2724 -4163 -1889 5235 497 -3240 1095 -1156 -3598 2715
1700 2715 2472 -4011 -1454 1255 -2731 6 4129 -1976 -4050 2317 1299 -1896 2686 1896 -3855
1715 -3855 -116 4130 -262 -279 2612 -1498 -2050 3380 1461 -2284 863 155 -3296 1020 2911 -2756
1731 -2756 -2193 1541 -1624 -1805 2715 88 -3614 329 1582 -1285 889 1929 -1886 -589 2552
1746 2552 209 -110 2305 -411 -1822 2317 1793 -1788 371 1443 -1958 -726 2030 -711 -2060
$$ packed form
1639A182o983N101Q089q617m658P720j916l364Q603j126j0401M494O389n251J616
1654H78M347q121k014R348j481n045M816k369o783P410N048q405m59N026n724
1669c528j50R119l740p489N399J655m287N196K195q208Q90O398l540l92N383n433
1685e32m725P981J571o212K896J745o887K274P124m738l737M335k251k442O313
1700B715k43o483K557K709l986K737M123o105k074O367j018l195M582p90n751
1715c855L739M246m392j7K891m110n52N430j919l745L147p08l451M316J891n667
1731b756N63L734l165j81M520k627l702L943J253k867K174J040l815J297L141
1746B552k343l19K415k716j411M139n24l581K159J072l401J232K756k741j349
$$ plain form
1761 -2060 386 -311 -1527 523 98 -1936 -98 552 -1300 228 1413 -1162 -815 1994 470 -795
1777 -795 1515 1023 -917 707 1732 -231 -188 840 -381 -288 979 -317 -889 357 -523 -1230 446
1794 446 119 -1585 -481 419 -1121 -700 835 -303 -846 524 403 -220 642 615 64 695 580 -31
1812 -31 790 959 -388 119 955 -287 -593 677 123 -1066 -237 -20 -753 -413 -280 -695 -367 -369 -741 -54
1832 -54 341 -615 -341 870 93 -497 881 904 -161 504 1079 380 243 726 380 205 437 -276 -358 295
1852 295 -473 -894 62 -312 -1413 -560 199 -860 -831 322 -353 -706 393 512 -66 343 483 -56 599
1871 599 838 69 465 826 -226 18 1041 116 -701 434 394 -895 -131 538 -702 -805 41 -385 -703
1890 -703 -243 -382 -546 59 -223 -512 325 258 -544 357 1037 107 -76 883 690 -25 516 867 57 -143
$$ packed form
1761b060K446o97j216K050m25k034J838O50j852J528J185k575L47K809j524j265
1777g95K310m92j940J624J025j963M3J028j221R3J267j296n72J246q80p07J676
1794D46l27j704J104R00j540M21J535j138n43J370j21o23Q62k7n51O31j15o11
1812c1Q21J69j347N07Q36j242l06J270n54j189Q29K17p33L40J33m15L28kl72O87
1832e4L95r56K74J211p77n90J378K3j065O65N75o99j37M83l46j75K32p13q2O53
1852B95p68m21R56l74j101Q53P59j059K9J153o75l53J099J19n78M09J40n39O55
1871E99K39p69L96L61j052K44J023r25q17J135m0j289P64O69j240j03Q46m26l18
1890g03M60j39j64O05k82k89Q37o7q02R01O80r30j83R59j93p15N41L51q10k00
$$ plain form
1910 -143 276 224 -58 -181 -310 -336 -270 -406 -452 -42 -460 -949 -445 140 -282 -574 66 46 -488 146 782 259
1932 259 -61 380 596 350 731 774 233 194 418 263 349 249 -455 -553 6 -201 -633 -282 -314 -1275 -677 410
1954 410 -328 -982 -84 48 -613 430 991 -140 -280 599 450 560 1071 136 -431 674 634 -194 793
1973 793 547 -1517 -564 1217 -250 -1080 300 -632 -1708 438 866 -1144 -693 24 -931 144 1556
1990 1556 -420 -1037 814 140 -408 1933 985 -1877 -16 1915 -141 102 1582 -942 -1672 1475
2006 1475 1057 -1074 174 -283 -2203 282 1800 -1162 -1375 404 -1458 -1008 2368 271 -2631 173
2022 173 1101 -987 1200 2326 -1735 -1555 2232 907 -186 1965 -236 -2442 1266 2200 -925 87
2038 87 660 -2763 -792 3166 -276 -2634 409 -730 -2349 1873 2088 -2942 -1685 1292 -681 428
$$ packed form
1910a43M19n2k82j23j29k6O6j36m6M10m18m89N04N85m22k92O40k0n34O34O36n23
1932B59l20M41K16k46L81M3n41l9K24j55Q6j00p04r8N59k07m32L51l2r61N98J087
1954D10p38o54Q98J32o61J043N61j131j40Q79j49J10N11r35n67J105m0q28R87
1973G93k46k064R53J781j467q30J380r32j076K146M28k010M51P17r55J075J412
1990A556j976o17J851o74n48K341r48k862J861J931k056K43J480k524p30L147
2006A475m18k131J248m57j920K485J518k962k13J779j862M50L376k097k902K804
2022A73R28k088K187J126m061J80L787j325j093K151k201k206L708R34l125J012
2038H7N73l423J971L958l442k358L043j139j619M222K15n030J257K977j973J109
$$ plain form
2054 428 2872 -1140 -2676 1855 1663 -533 2137 928 -3353 223 3886 -271 -1036 1449 -1800 -2345
2070 -2345 3006 1684 -2944 -680 28 -2406 1074 2962 -2438 -2755 1226 -439 -633 3284 76 -4139
2086 -4139 748 2888 -834 1163 2347 -2925 -1705 3950 1435 -1483 1242 -718 -2969 2300 3077
2101 3077 -2345 -1376 632 -2482 -139 3845 -1277 -4121 777 575 -1688 2407 1631 -4089 -1313 3206
2117 3206 216 -45 2294 -1825 -2661 3106 2430 -1262 870 233 -3079 1116 4229 -1271 -2491 1070
2133 1070 -1212 -1538 3431 898 -4129 -843 1289 -1247 950 2161 -3097 -2649 2466 789 -686
2148 -686 2154 -658 -3503 1887 3705 -1103 -216 1467 -2249 -532 4328 644 -2816 448 26 -1740
2164 -1740 2271 2013 -3380 -1714 1340 -1156 16 2427 -2031 -3520 1672 1475 -1372 1250 704 -3296
$$ packed form
2054D28K444m012j536M531j92k196K670j209m281L576L663m157p65K485l249n45
2070b345N351j322m628K264P08k434L480J888n400l17L981j665j94L917l208m215
2086d139M887K140l722J997J184n272J220N655k515k918K725j960k251N269P77
2101C077n422R69K008l114K343L984n122k844M898k02k263M095p76n720K776M519
2117C206k990k61K339m119q36N767o76l692K132o37l312M195L113n500j220L561
2133A070k282l26M969k533n027L286K132k536K197J211n258M48N115j677j475
2148f86K840k812k845N390J818m808Q87J683l716J717M860l684l460L264m22j766
2164a740M011k58n393J666L054k496J172K411m458j489N192j97k847K622n46m000
$$ plain form
2180 -3296 141 3638 21 -894 1377 -1038 -1101 3165 1650 -1994 124 506 -1569 1429 2495 -2247
2196 -2247 -2237 1323 -290 -1070 1826 -350 -3449 2 1802 -772 -74 859 -1994 -935 2604 674
2212 674 -963 987 -227 -1360 2092 2315 -1533 -597 1332 -803 -173 2412 -395 -2424 415 599
2228 599 -929 622 333 -2311 -847 1332 -479 -503 825 -1229 -1521 1642 957 -1073 469 562 -1227
2245 -1227 675 2247 -308 -965 955 117 -289 1509 425 -1337 58 559 -577 399 585 -1673
2261 -1673 -1014 882 -368 -914 421 -347 -1517 295 1086 -561 -341 438 -315 92 1169 248 -302
2278 -302 554 333 -124 1058 668 -807 -27 793 -304 -168 515 -534 -1006 114 184 -635 -319 -258 -756
2297 -756 -187 237 -349 -284 128 -315 5 822 172 -291 486 544 23 479 775 -20 -57 423 265 13 70
$$ packed form
2180c296L437L497l617r15K271k415o3M266j515l644K118L82k075K998J066m742
2196b247J0L560j613p80K896k176l099L451J800k574O98R33k853J059L539j930
2212F74j637J950j214j133L452K23l848R36J929k135O30K585k807k029K839J84
2228E99j528J551k89k644J464K179j811k4J328k054k92L163o85k030J542R3j789
2245a227J902J572k555o57J920q38m06J798j084j762J395N01j136R76J86k258
2261a673O59J896j250n46J335p68j170J812P91j647K20P79p53M07J077r21n50
2278c02Q56k21m57J182l90j475P80Q20j097J36O83j049m72J120P0q19L16O1m98
2297g56N69M24n86O5M12m43L20Q17o50m63P77N8n21M56K96p95l7M80j58k52N7
$$ plain form
2318 70 -175 -253 -77 -195 -288 -165 -405 -663 -169 -36 -473 -435 34 -249 -275 171 206 -2 29 284 398 383 170
2341 170 258 470 250 64 428 287 -192 -117 252 0 -409 -151 -196 -414 -307 -218 -274 -238 -470 -413 -20 46 -339
2364 -339 46 280 -85 -4 575 386 -28 396 456 131 262 370 129 75 124 -56 -2 175 -276 -309 54 -331
2386 -331 -595 -153 -132 -585 -298 65 -305 -411 23 71 -67 136 281 118 197 334 329 460 350 21 278 443
2408 443 57 -69 246 88 -348 -70 152 -328 -504 -267 -217 -455 -396 -187 -211 -283 -173 -88 40 13 -58 257
2430 257 387 159 98 450 444 109 279 495 127 -129 149 345 21 -116 12 -136 -366 -200 -130 -352 -416 -395
2452 -395 -331 -162 -64 -226 -228 7 -176 11 458 201 -287 293 616 62 285 632 14 -216 539 414 -177
2473 -177 25 -4 -374 103 219 -502 -314 -82 -667 -361 478 -370 -949 27 210 -461 302 567 -622 -283
$$ packed form
2318G0k45p8J76j18r3J23k40k58M94J33m37L8M69k83k6M46L5k08L1K55J14j5k13
2341A70Q8K12k20j86L64j41m79P5L69k52m09K58m5k18J07Q9n6L6k32N7L93O6l85
2364c39L85K34l65Q1N79j89m14M24O0l25J31J08k41n4M9j80N4J77m51l3L63l85
2386c31k64M42K1m53K87L63l70j06M34M8j38K03J45j63P9J37nJ31j10l29K57J65
2408D43l86j26L15j58m36K78K22m80j76K37N0k38N9K09k4p2J10Q5J28k7p1L15
2430B57J30k28o1L52ol35J70K16l68k56K78J96l24j37J28j48k30J66P0k22o4K1
2452c95O4J69R8j62kK35j83J87M47k57m88N80L23n54K23L47o18k30P55j25n91
2473a77K02k9l70M77J16p21J88K32n85L06Q39q48n79R76J83o71P63K65j189L39
$$ plain form
2493 -283 832 443 155 619 -36 -359 790 733 -224 265 222 -843 4 1074 -252 -1073 72 -274 -845
2512 -845 513 400 -1323 -659 436 -313 41 718 -629 -925 872 613 -237 762 365 -1105 539 1715
2530 1715 -148 -342 725 -533 -668 1514 665 -1309 -275 150 -867 429 873 -1378 -1294 507 -275
2547 -275 -366 1116 -594 -1940 504 1369 -397 310 913 -1274 -413 2236 706 -760 541 -141 -863
2564 -863 1469 1435 -1197 -668 486 -869 53 1769 -979 -2264 484 487 -914 822 385 -2350 -671
2581 -671 1741 27 -415 850 -1037 -1195 1948 1426 -927 281 304 -1280 1005 2526 -883 -1512 811
2598 811 -273 -556 1991 280 -2705 -374 1085 -694 347 862 -2166 -1635 1614 456 -749 804
2614 804 -598 -2013 1373 2297 -874 -395 896 -1120 15 2826 311 -1971 309 510 -694 1503
$$ packed form
2493b83J115l89k88M64o55l23J149n7r57M89m3j065Q47J070j326q21J145l46n71
2512h45J358j13j723O64J095p49L54O77j347k96J797k59q50R99l97j470J644J176
2530A715j863j94J067j258j35K182q49j974J034M25j017J296M44k251Q4J801p82
2547b75r1J482j710j346K444Q65j766P07O03k187Q61K649j530j466J301o82p22
2564h63K332l4k632N29J154j355R22J716k748j285K748Lj401J736m37k735J679
2581f71K412j714m42J265j887j58L143n22k353J208K3j584K285J521l409o29K323
2598H11j084k83K547j711k985K331J459j779J041N15l028N31L249j158j205J553
2614H04j402j415L386R24l171M79J291k016J135K811k515k282K280K01j204K197
$$ plain form
2630 1503 1161 -2257 -1211 1182 -252 -132 1198 -1534 -2478 1251 1293 -1105 185 178 -2210 78 2650
2647 2650 -31 -1143 666 -402 -610 2455 1289 -1724 -189 885 -654 1091 1903 -1689 -1881 1291
2663 1291 306 -738 1169 -418 -2749 160 1764 -759 -505 430 -1759 -830 2177 506 -1403 331
2679 331 -79 -1035 1654 1882 -1377 -727 1174 -278 234 2099 -348 -2153 635 1107 -627 622 394
2696 394 -2153 -742 1523 -159 -747 442 -1220 -1379 1485 1027 -1367 -178 425 -1144 495 2119
2712 2119 -459 -1228 778 396 -173 1437 507 -1564 -21 1135 -320 255 798 -1400 -1153 1224 325
2729 325 -986 271 -350 -1636 305 1265 -809 -743 392 -589 -213 1450 174 -1014 413 576 -266
2746 -266 1053 955 -962 -339 1124 28 -149 878 -456 -1253 567 676 -690 -191 38 -1088 -317
$$ packed form
2630A503l42l418J046K393j434J20J330k732r44L729M2k398J290pk388K288K572
2647B650k681j112J809j068k08L065j166l013J535J074j539J745Q12l592j92L172
2663A291r85j044J907j587k331K909J604k523K54R35k189R29L007j671j909J734
2679C31m10r56K689K28l259O50J901j452N12J865k447j805K788M72j734J249k28
2696C94k547J411K265j682n88J189j662j59K864m58k394J189O03j569J639J624
2712B119k578p69K006l82n69J610r30k071J543J156j455N75N43k198K47K377q99
2729C25j311J257o21j286J941R60k074O6J135r81L76J663j276j188J427J63q42
2746b66J319r8j917O23J463j096j77J027j334p97J820J09j366M99K29j126P71
$$ plain form
2763 -317 887 -347 -761 168 -380 -496 872 389 -825 125 674 -244 348 1048 -287 -511 767 416
2781 416 -173 453 130 -617 55 419 -277 -186 54 -704 -462 459 -214 -741 82 -130 -629 167 450 -422
2801 -422 -293 355 40 61 485 165 -95 405 338 93 416 329 -272 131 366 -145 -124 161 -240 -475 32
2822 32 -31 -476 -292 -107 -381 -229 -48 -182 -196 88 -53 59 254 72 43 331 296 84 330 396 95 56
2844 56 267 183 -86 -13 -34 -57 -110 -255 -86 -148 -364 -298 -25 -174 -315 -189 -14 -184 -118 89 129 137 160 157 268
2869 268 319 128 203 376 112 13 301 182 -180 13 172 -187 -182 -13 -200 -339 -189 -220 -255 -106 -246 -245 -16
2892 -16 -68 -139 102 200 -71 11 435 210 64 405 346 60 209 356 145 -28 124 -31 -21 53 -254 -181 -108
2915 -108 -314 -372 -56 -115 -436 -203 28 -226 -197 115 21 -109 92 215 224 215 151 214 287 313 184 247 221 8 11
$$ packed form
2763c17J204j234m14R29n48j16J368m83j214R50N49r18N92P00j335k24J278l51
2781D16n89O26l23p47O72L64o96R1K40p58K42R21o73n27Q23k12m99P96K83q72
2801d22J29O48l15K1M24l20k60N00o7k45L23q7o01M03K35n11K1K85m01k35N07
2822C2o3m45J84J85k74J52J81j34j4K84j41J12J95j82k9K88l5k12K46O6l01l9
2844E6K11q4k69P3k1k3n3j45J69o2k16O6K73j49j41J26J75j70O6K07M0QK3lJ11
2869B68N1j91P5J73k64r9K88j19l62J93J59l59NJ69j87j39J50l1l5J49j40JK29
2892a6n2p1K41R8k71Q2M24k25j46L41n9k86J49J47k11j73J52j55J0P4l07P3P3
2915a08k06n8L16n9l21K33K31k54K9L12r4j30K01J23Rro4O3P3K6j29O3k6k13L
$$ plain form
2940 11 200 27 -239 -118 -100 -257 -170 -174 -237 -278 -332 -159 -60 -120 -189 -46 9 -71 124 305 98 27 227 214 226
2965 226 320 192 94 170 30 44 262 6 -317 -9 1 -348 -84 38 -447 -462 2 -59 -248 -66 -193 -310
2987 -310 163 194 -28 149 177 -138 316 731 41 -161 399 172 -122 487 371 -432 -217 251 -110 -63 193
3008 193 -514 -684 86 -52 -337 165 -311 -974 78 610 -240 -188 323 -325 -275 1027 561 -397 119 294
3028 294 -190 653 864 -419 -462 330 -123 -72 784 -355 -1240 99 396 -563 41 196 -1241 -574 938
3047 938 79 -568 237 -342 -721 933 915 -548 -57 408 -389 501 1472 -342 -980 568 258 -327 1020
3066 1020 360 -1594 -385 883 -235 -152 379 -1138 -1133 895 493 -714 96 -324 -1301 626 1612 -574
3084 -574 -666 626 -358 -155 1796 557 -1396 121 733 -228 805 966 -1342 -943 1072 162 -308 728
$$ packed form
2940A1J89j73k66J21J8j57Q7mo3m1n4J73R9o0o9J43N5q0J95J81k07p1K00j3J2
2965B26R4j28r8P6j40J4K18k56l23L08J0l49K64J22m85j5M64o1j89J82j27j17
2987c10M73L1k22J77K8l15M54M15o90k02N60k27k94O09j16q03K15M68l61M7K56
3008A93p07j70P70j38k85N02m76o63J052N32q50N2N11o48N0J302m66r58N16J75
3028B94m84Q43K11j283m3P92m53N1Q56j139q85J339K97r59O04J55j437O67J512
3047I38q59o47Q05n79l79J654j8j463M91M65p97Q90R71j814o38J548l10n85J347
3066A020o60j954J209J268j118Q3N31j517NK028m02j207Q10m20r77J927R86k186
3084e74r2J292r84K03J951j239j953J517O12r61J033J61k308L99K015r10m70J036
$$ plain form
3102 728 -773 -1825 669 1166 -827 -250 112 -1423 -289 1864 91 -1271 294 -7 -474 1567
3118 1567 1287 -1299 -479 916 -124 537 1558 -885 -1651 899 859 -587 644 -24 -2155 -284 1641
3135 1641 -319 -821 281 -1097 -1012 1564 803 -1331 -119 217 -794 1013 1793 -978 -1112 1020 211
3152 211 -27 1664 72 -1968 242 1381 -331 241 537 -1654 -897 1516 275 -950 221 -764
3168 -764 -1507 1018 1326 -1252 -676 418 -826 107 1885 -189 -1582 527 687 -212 1208 835 -1564
3185 -1564 -282 1455 149 27 799 -967 -1304 1199 921 -1042 -83 -52 -1497 151 1597 -637 -1291
3202 -1291 338 -397 -506 1380 499 -1528 -79 792 -178 702 1179 -1042 -862 1341 549 -285 810
3219 810 -164 -1468 565 1291 -619 -498 261 -994 -450 1287 -123 -1252 -53 -127 -670 796 704 -1252
$$ packed form
3102G28j501j052K494M97j993N77L62j535J134K153j773j362J565l01m67K041
3118A567k80k586Q20J395j040O61J021k443p66K550m0j446J231o68k131J871J925
3135A641j960n02J102j378Q5K576p61k134J212L36j011J807P80k771j34K132q09
3152B11k38J691j592k040K210J139j712N72K96k191P57K413j241j225J171r85
3168g64p43K525L08k578N76J094j244R33J778k074j393K109J60q99J420l73k399
3185a564J282J737j306j22P72j766l37K503k78j963R59L1j445J648J446k234o54
3202a291J629p35j09J886q81k027J449Q71r70Q80M77k221J80K203p92q34J095
3219H10r74j304K033P26j910J21P59j255N44J737j410j129J199p4n43J466r2j956
$$ plain form
3237 -1252 -503 870 -185 64 1149 -291 -1067 788 909 -284 406 400 -891 -42 1208 -58 -531
3254 -531 235 -472 -657 808 353 -1121 -365 143 -732 89 793 -683 -900 519 199 -272 657 203 -770
3273 -770 253 887 -2 209 498 -379 -173 971 227 -496 276 -12 -651 365 540 -702 -496 205 -376
3292 -376 -356 395 -196 -764 -6 218 -275 283 189 -517 -8 695 38 -39 504 44 -227 613 518 -225 61
3313 61 265 -190 31 322 -203 -371 11 -169 -302 85 -186 -581 -125 64 -323 -107 187 -255 -224 381 208
3334 208 -131 159 280 44 253 381 81 31 243 50 74 244 -76 -194 61 -97 -279 -118 -61 -406 -323
3355 -323 -15 -83 -356 -118 -75 -73 -53 96 27 12 149 138 255 246 116 138 243 138 96 151 160 -40 -35 50 -18 -180
3381 -180 -173 -66 -179 -192 -160 -179 -206 -262 -108 -8 -94 -82 -21 59 82 77 173 212 166 168 250 285 114 142 144 104 -29 98
$$ packed form
3237a252P49J373j055K49J085j440p76J855J21j193O90oj291Q49J250j266m73
3254e31P66p07j85J465m55j474P56N08q75Q21P04j476k17J419l20m71R29m54r73
3273g70J023O34q89K11K89q77K06J144p44p23P72k88o39J016J75j242K06P01n81
3292c76K0P51n91n68P58K24m93N58r4p06N09P03o57p7N43m60k71Q40r5p43K86
3313F1K04m55K21K91n25j68L82j80j33L87k71l95M56J89l87K16K94m42L1O05j73
3334B08l39K90J21k36K09J28l00n0K12j93K4J70l20j18K55j58j82J61N7l45Q3
3355c23L08o8k73K38M3KK0J49o9j5J37j1J17rj30K2J05j05m2N5Rk00NQ5o8j62
3381a80PJ07j13j3L2j9k7n6J54J00q6J2O1Q0K3nR6L9m6KQ2L5j71K8Km0j33J27
$$ plain form
3409 98 13 -153 -175 -87 -159 -224 -168 -219 -217 -240 -168 -144 -89 -142 -98 54 54 -2 102 201 144 125 282 261 94 153 218 115
3437 115 135 56 63 -1 -80 -114 -44 -123 -224 -132 -127 -228 -220 -175 -103 -175 -124 -39 -12 -36 -74 117 207 118 80 229 195 68 186
3466 186 302 79 4 176 70 -9 25 -74 -140 -43 -102 -201 -100 -215 -369 -127 70 -226 -159 103 -153 -136 268
3489 268 213 -76 116 233 123 244 380 29 14 310 141 42 259 -98 -373 -8 95 -283 -133 43 -465
3510 -465 -433 223 12 -393 -75 -120 -372 161 319 -151 -47 272 -42 226 695 4 -320 329 339 -94 424
3531 424 327 -542 -196 485 -31 -184 161 -489 -669 227 157 -501 -126 -156 -650 42 628 -295 -447 274 -27
3552 -27 -108 785 424 -606 11 591 82 349 694 -434 -512 628 316 -169 257 -213 -906 184 644 -520
3572 -520 -422 46 -723 -407 890 46 -915 -10 133 -389 659 711 -709 -407 695 123 270 893 -289
$$ packed form
3409I8q5j66k2Q8p2o5N6n1Kk3P2K4N5n3M4J52%n6J04R9n7j9J57k1j67N9O5j03
3437A15K0p9Po4p9l4P0p9j01R2Nj01QM5P2p2N1Q5K7k4l8J91R0q9l8J49l4j27J18
3466A86J16k23p5J72j06p9L4r9o6R7n9r9J01j15j54K42J97k96O7K62k56J7M04
3489B68n5k89J92J17j10J21J36l51j5K96j69r9K17l57k75L65J03l78J50J76n08
3510d65L2O56k11m05L18m5k52N33J58m70J04L19l14K68M69o91l24O49J0m33N18
3531D24r7q69L46O81n16j53L45o50j80Q96p0o58L75l0m94O92N86r23j52P21l01
3552b7q1Q93l61j030O17N80n09K67L45j128p8J140l12m85M26m70o93J090M60j164
3572e20R8M68p69L16J297q44r61R05J43n22J048N2j420L02J102n72J47O23j182
$$ plain form
3591 -289 -923 667 753 -218 339 220 -1087 -217 1131 -30 -693 14 -557 -756 781 496 -976 -423
3609 -423 168 -536 380 1043 -612 -974 609 377 -31 997 298 -1206 188 1204 81 77 459 -850
3627 -850 -646 1157 420 -781 -78 -346 -1011 537 973 -916 -919 244 -451 -164 1221 -95 -1422 211
3645 211 713 -151 662 691 -1056 -441 1328 438 -57 675 -493 -1005 994 1019 -707 -192 122 -1032 46
3664 46 1393 -376 -1346 71 -152 -525 937 409 -1401 -404 703 -88 344 993 -803 -924 1115 772
3682 772 -265 541 109 -1196 389 1494 -228 -580 277 -621 -444 1115 287 -1201 -274 55 -622 487
3700 487 732 -1113 -893 599 14 -157 865 -273 -1252 470 1161 -202 178 479 -849 -132 1421
3717 1421 352 -619 323 -199 -598 878 780 -1020 -550 265 -591 -80 893 -643 -1280 302 281 -386 413
$$ packed form
3591b89o34J590Q6r71N57j19j307Q70J348j161o63P07n71j99J537k85j472N53
3609d23N91p04R16O63j655l62J583k32m08J028o99j504J394J016j123mL82j309
3627h50K04J803p37j201P03k68o65J548M36j889lJ163o95K87J385j316j327J633
3645B11N02q64Q13K9j747O15J769q90m95P32j168n12J999K5j726N15L14j154J078
3664D6J347j769r70J417k23l73J462n28j810R97J107p91M32O49j796j21K039l43
3682G72j037Q06m32j305J585J105j722l52Q57q98J77J559q28j488R27L29o77J109
3700D87K45j845K20J492n85j71J022j138r79J722O91j363L80L01j328P17J553
3717A421j069r71R42n22l99J476r8j800M70Q15q56N11R73j536o37J582k1o67P99
$$ plain form
3736 413 226 -1051 -73 1014 59 -28 563 -414 -433 1112 633 -509 197 212 -627 402 993 -499 -707
3755 -707 252 -233 -412 595 -84 -1119 -166 346 -389 128 313 -756 -478 762 208 -264 458 30 -519
3774 -519 580 863 -280 -82 432 -324 -34 835 -9 -679 116 71 -407 284 140 -807 -350 312 -304 -238
3794 -238 383 -420 -645 311 349 -378 100 282 -390 108 720 82 -44 370 0 -75 574 288 -339 129 294
3815 294 -255 82 293 -426 -460 205 -77 -398 73 -72 -554 -60 256 -224 -116 115 -181 -63 434 111
3835 111 -103 297 211 -53 367 443 -129 30 303 -44 -12 248 12 -308 -4 -10 -214 -66 -63 -332 -216 29
3857 29 -218 -202 79 -68 -117 221 200 -56 107 280 105 96 294 131 43 182 144 44 112 33 -121 -107 40 -181
3881 -181 -133 -46 -227 -301 -81 -65 -263 -133 -10 -177 -110 84 48 27 86 102 110 158 159 163 228 179 69 137 211 32 -30
$$ packed form
3736D13j87j277R78J087r55q7N91r77j9J545m79j142P06J5q39J029N91j492k08
3755g07R59m85j79J007o79j035R53N12p35N17J85j069K78J240n54m72P22m28n49
3774e19J099K83j143J98N14p56K90Q69q44o70P95m5m78O91j44r47M57O62o16O6
3794b38O21q03k25R56L8p27M78J82o72M98O12o38j26M14l70p5O49k86o27M68J65
3815B94n49L37K11p19l4O65k82l21M71j45m82M94L16m80J08K31k96J18M97l23
3835A11k14M00q6k64M20P6n72J59K73l47L2K60k36l20L04ok04J48Lk69J16K45
3857B9k47J6K81j47m9L38k1k56J63J73j75rJ98j63q8J39l8j00O8p9j54J4J47k21
3881a81M8Q7j81p4K20J6j98J30J23j67O7J94l6k1N9J6QM8JMO5m9j10O8P4j79o2
$$ plain form
3908 -30 58 59 -138 -57 -76 -187 -261 -103 -121 -198 -99 -152 -149 -38 -78 -42 -43 14 -3 114 188 152 180 199 177 41 253 218
3936 218 69 46 130 25 -84 -42 -99 -144 -130 -163 -149 -57 -189 -268 -140 -76 -172 -40 37 -78 -49 154 106 46 137 160
3962 160 114 175 210 188 164 155 32 58 155 -65 -81 24 -135 -242 -37 -37 -274 -194 -75 -152 -106 -32 -136 -117 39 -3
3988 -3 44 196 113 -33 200 277 81 127 291 21 19 269 144 -118 80 10 -181 33 49 -267 -261 -51 -287 -207
4012 -207 142 -231 -316 10 -35 -176 187 208 -291 -63 461 96 65 402 89 -84 322 361 -78 103 87 -328
4034 -328 75 339 -279 -321 -3 -248 -354 281 -10 -622 -141 97 -268 16 334 -251 -250 329 124 73 416
4055 416 43 -359 388 533 -63 163 308 -332 -178 659 70 -511 55 -37 -487 237 314 -585 -385 66 -326
4076 -326 -83 504 -311 -710 297 298 -151 425 344 -651 8 824 98 -99 447 -178 -374 688 494 -464
$$ packed form
3908c0Q8Jj97Q1j9j11p4J58j8p7R9n3LJ11m0L6jN7j7J17P4l6K8J9k2j36K12l5
3936B18j49k3Q4j05j09M2n7m5J4l3J4R2j32p9J28O4r6J32P7j15K9K03m8o0R1K3
3962A60m6O1L5k2k4rj23K6R7k20j6J05j59j07K05%k37Q0J19p7M6P4j04J9J56m2
3988cM7J52q3j46K33P7j96M6J64k70kK50j25k62J98p0j91K14J6l16OK10k36Q0
4012b07L49l73q5L26m5j41L63K1m99K28N24l65l1L37l13j73M06L9m39J81j6m15
4034c28M03K64o18m2L18k45j06O35k91o12M81K38l65K84L18n85JN79k05n1L43
4055D16l73m02P47J45n96K26J45o40J54Q37n89n81N66r2m50P24P7q99K00M51l92
4076c26K43N87q15l99J007Jm49N76q1r95O59Q16p26j97N46o25j96J062j94r58
$$ plain form
4096 -464 -29 46 -577 165 635 -529 -720 110 -240 -286 603 29 -1003 -79 526 -181 102 463 -595 -460
4116 -460 913 420 -191 371 -13 -586 601 907 -375 -256 270 -566 -172 989 -67 -1012 -8 102
4134 102 -466 413 363 -1011 -637 484 -78 -44 585 -453 -847 632 684 -302 224 294 -713 211 1267
4153 1267 7 -496 319 -176 -341 938 418 -949 -321 184 -422 143 579 -825 -957 395 151 -353
4171 -353 471 -90 -1147 229 947 -147 -57 458 -603 -294 1255 461 -549 221 59 -444 699 895
4189 895 -764 -538 408 -265 -164 789 -358 -1219 151 371 -463 163 191 -1018 -292 885 77 -325 384
4208 384 -368 -543 936 789 -497 18 350 -411 385 1060 -311 -738 379 124 -267 617 114 -1094
4226 -1094 -250 487 -292 -120 312 -812 -645 714 239 -451 185 34 -733 456 918 -272 -324 440 -129
$$ packed form
4096d64M35P5o23P42M70j164j91Q30l50m6Q89n74j032R24O05p07K83L61j058J35
4116d60J373m93o11N62l84n73J187L06j282J19N26q36L94J161j056r45J004J10
4134A02n68Q79n0j374L74J121n62L4O29j038l94J479N2r86N26P0j007R24J056
4153A267j260n03Q15m95j65J279n20j367O28N05o06N65M36j404j32J352k44n04
4171c53Q24n61j057J376P18j094R0N15j061L09J549p94j010P70j62n03J143J96
4189H95j659K26R46o73J01R53j147q61J370K20q34O26K8j209P26J177q08m02P09
4208C84p52j75J479j47j286N15L32p61P96O75j371m27J117k55l91Q84n03j208
4226a094Q44P37p79J72M32j124J67J359m75o90O36j51p67J189M62j190n2P64n69
$$ plain form
4245 -129 -49 962 186 -690 153 335 -251 315 393 -828 -468 474 -119 -337 326 -435 -857 290 452 -483
4265 -483 -96 174 -589 -36 811 49 -462 283 107 -190 694 532 -485 60 500 -127 90 556 -314 -623
4285 -623 381 187 -429 136 36 -798 -139 433 -270 -357 122 -321 -282 474 159 -419 133 226 -211 305 548
4306 548 -227 -132 523 116 -43 533 108 -414 164 280 -260 -50 75 -383 -261 263 -177 -470 41 -180
4326 -180 -469 119 186 -389 -122 235 -40 -42 456 81 -152 302 276 -21 303 211 -159 52 351 -69 -70 198
4348 198 -185 -286 141 8 -369 -117 7 -297 -178 106 -185 -258 93 -3 -102 172 82 -119 149 266 76
4369 76 139 305 -9 7 341 74 -65 120 52 -167 -36 130 -165 -215 -57 -157 -189 -80 -109 -169 -6 -30 -214
4392 -214 23 113 -92 -31 217 96 61 196 117 46 150 161 31 86 137 -23 -35 32 -118 -164 -17 -135 -213 -85
$$ packed form
4245a29Q0J011p76q76Q43J82n86N66P8j221L60R42n93k18O63p61m22J147J62r35
4265d83L87K70p63N53Q47p62n11P45j76k97Q84j62j017N45M40o27K17M66q70l09
4285f23J004j94o16N65j00q34O59N72p03q7M79m43L9P56l15n78N52R3m37N16K43
4306E48p75R5O55m07j59N76m25n22N78J16n40K10J25m58J22N24m40k93N11k21
4326a80k89N88O7n75K67L57k75kM98l75k33M54k6k97L24r2l70K11K99m20jK68
4348A98l83j01M27j33l77K52J24l04J19K84k91p3L51r6r9K74r0k01K68J17j90
4369G6O3J66l14J6L34k67j39J85o8k19J31J66k95n0J58j00l2J09k9o0J63k4j84
4392b14K37R0k05O1K48j21l5J35p9p1J04J1j30N5N1j60j2O7j50m6J47j18p8J28
$$ plain form
4416 -85 -150 -195 -129 -22 -165 -127 27 -51 -33 32 124 77 107 148 167 152 224 97 110 139 79 41 85 3 -85 -6 7 -192
4444 -192 -155 -49 -142 -178 -80 -140 -166 -136 -49 -96 -31 -6 -59 61 114 37 119 212 105 88 192 187 25 150 94 -4 49
4471 49 70 -20 -135 -76 -146 -112 -42 -95 -210 -47 -79 -170 -61 25 -73 -85 128 28 58 83 123 7 189 184 130 148 226
4498 226 -9 146 206 -28 -79 77 -79 -165 40 -27 -313 -193 0 -184 -126 17 -148 -175 107 43 -20 121 139
4521 139 -110 165 312 88 65 249 33 -29 344 181 -151 31 71 -204 -4 113 -240 -315 -25 -103 -181 88
4543 88 -119 -480 2 143 -218 93 118 -258 -69 415 162 -79 236 161 -166 345 403 -153 11 176 -127
4564 -127 33 401 -136 -406 86 -97 -287 140 64 -561 -276 227 -218 -143 238 -285 -393 361 276 -180 135
4585 135 170 -280 237 634 -74 -146 278 -96 -115 528 118 -577 -33 155 -289 86 260 -486 -548 260 17
$$ packed form
4416h5o5m5O6J07j43L8J54p8J8O5R2m7L0M1J9j5P2j27J3K9o0l8M4q2q8P9J3j99
4444a92L7J06r3l6R8o0k6L0Q7m7O5K5n3J20N3p7Q2R3j07j7J04nj62J25n6r8N3
4471D9K1r0j15N9p0L4P0n3j15J63l2r1J09Q6r8j2K13j00L0K5M0j16J82nn4J8P8
4498B26k35J55O0k34n1J56j56q6K05o7k86J20J93j84N8J43j65k7K82o4o3J41J8
4521A39k49K75J47k24k3J84k16o2L73j63l32J82M0k75K00J17l53p5K90p8p8K69
4543H8k07l61M82J41l61L11K5l76J89M84k53k41L15p5l27N11N8n56J64J65l03
4564a27J60L68n37k70M92j83j90M27p6o25K85N03m45P5L81n23j08P54q5m56L15
4585A35L5m50N17L97p08p2M24l74j9O43m10o95N44J88m44L75J74p46o2Q08k43
$$ plain form
4606 17 -242 208 -183 -674 268 522 -220 12 223 -349 -71 823 190 -364 251 137 -227 459 557 -460
4626 -460 -224 331 -127 -8 509 -366 -759 173 183 -335 119 69 -815 -181 636 -81 -275 322 -220 -461 715
4647 715 535 -399 21 279 -237 323 801 -265 -560 375 27 -180 590 41 -919 -134 419 -284 -92 205
4667 205 -690 -651 586 225 -472 84 -121 -548 441 780 -290 -217 345 -155 43 979 80 -721 187 412
4687 412 -184 347 452 -751 -437 578 -40 -243 327 -491 -852 344 429 -494 -31 70 -706 -23 900
4706 900 -136 -564 354 28 -295 756 494 -617 -77 517 -103 211 640 -462 -616 474 183 -397
4724 -397 329 -45 -920 30 619 -333 -341 214 -491 -400 702 196 -635 -7 155 -309 440 628 -368 -350 510
4745 510 25 -39 695 -22 -744 272 502 -306 70 245 -677 -402 554 -81 -503 97 -236 -570 410 390
$$ packed form
4606A7k59M50l91m91R42K54p42K32K11n72K78Q94o33n54O15j14l64O86R8j017
4626d60K36N55m58J19N17q75l93R32J0n18M54n0q84O34Q17p17j94N97n42k41J176
4647G15j80r34M20K58n16N60M78j066k95R35l48k07P70n49r60P85N53p03J92K97
4667B05q95L9J237l61o97N56k05m27R89L39j070P3N62n00J98R36q99q01R08K25
4687D12n96N31J05j203L14J015o18k03N70q18l61J196Q5r23M63J01p76O83R23
4706I00j036m28R18l26l23J051k62j111N40N94o20L14M29j102j54J090k91n80
4724c97P26l74q75R50N89r52qN55p05R1J102n06q31O28J62m64P49J88r96J8Q60
4745E10m85o4P34p17p22J016K30q08L76J75r22K75R56o35m22O00l33l34R80k0
$$ plain form
4765 390 -551 -219 275 -322 22 748 -90 -512 412 317 -166 433 405 -545 -47 563 -19 -107 318 -358 -482
4786 -482 419 164 -471 5 -43 -587 7 477 -389 -397 230 -147 -289 478 194 -526 147 409 -65 250 488
4807 488 -223 -148 516 170 -176 332 -30 -474 191 300 -320 -169 153 -396 -270 285 -116 -451 27 35 -273
4828 -273 154 209 -342 -72 328 -56 -2 393 4 -196 383 271 -134 143 246 -266 7 369 -93 -180 83
4849 83 -150 -324 118 -27 -395 -77 34 -243 -12 166 -259 -227 264 53 -135 256 177 -177 182 304 34
4870 34 53 232 -39 4 245 15 -75 35 -38 -226 -2 41 -300 -170 16 -213 -163 45 -94 -270 80 80 -88
4893 -88 121 109 -54 140 226 71 83 242 107 -7 242 167 -78 66 120 -102 -98 99 -129 -252 -76 -149 -207
4916 -207 -44 -103 -201 -97 27 -139 -36 123 -68 2 223 102 71 209 183 55 125 218 55 12 92 4 4 35
$$ packed form
4765C90r41L32M94n97L44P26q38m22R24r5m83N99k8r50M98O10n82q8M25o76j24
4786d82R01k55o35M76m8n44N94M70q66qO27l77j42P67k84p20O73K62m74L15K38
4807D88p11P5O64l46l46N08l62m44O65J09o20J51L22n49J26N55m01l35M78Ql08
4828b73M27N5n51K70M00l84N4L95l89k00N79j12m05K77J03n12K73L62m62q7K63
4849H3k33j74M42j45l68L18J11k77K31J78m25L2M91k11j88L91p9l54L59J22k70
4870C4J9J79k71M3K41k30r0J10p3j88K24M3l41J30J86k29N0K08j39j76L50%j68
4893h8K09j2j63J94Q6j55J2J59j35j14K49p5k45J44N4k22MJ97k28j23J76p3n8
4916b07J63n9r8J04J24j66J03J59j91P0K21j21l1J38k6j28P0R3j63m3Q0q8%L1
$$ plain form
4940 35 -92 -76 -105 -98 -196 -77 -79 -151 -224 -28 -106 -121 -4 10 -34 10 137 20 63 147 72 139 114 133 83 155 67 6
4968 6 80 65 -75 23 56 -58 -100 -37 -78 -204 -37 -54 -189 -99 -80 -109 -48 30 -105 33 157 38 4 212 114 19
4994 19 190 143 -64 12 145 -6 26 63 -49 -139 -25 -78 -157 -85 -116 -206 -84 3 -220 -150 65 -50 -146 139 117
5019 117 -60 80 133 11 108 282 109 9 227 44 59 192 25 -153 52 6 -168 -62 59 -243 -241 41
5041 41 -90 -246 -23 -66 -249 -13 145 -81 -77 153 -53 50 369 115 -43 250 207 -91 245 291 -239 -25
5063 -25 257 -73 -109 150 -116 -382 -6 100 -276 -19 -44 -379 -93 214 -155 -202 154 -62 -103 366 224 -167
5085 -167 74 283 -149 202 465 -52 -224 219 80 -94 260 35 -508 -59 218 -189 -100 193 -391 -319 288
5106 288 105 -328 52 35 -418 147 453 -186 -105 281 -43 -17 524 145 -354 213 242 -186 201 288 -395 -260
$$ packed form
4940C5j27J6k9Pr8J19kp2p3J96p8j5J17J4m4M4J27j17M3Q4p5O7k5J9n0P2q8o1
4968FP4j5j40R8L3j14m2O3m1j26J67j7j35R0J9k9O1P8j35J38J24j19l4K08r8r5
4994A9J71m7k07P6J33j51L2L7j12r0J14n3p9P2l1r0J22Q7k23P0K15j15r6K85k2
5019A17j77J40N3j22R7J74j73j00K18j83J5J33j67j78K05m6j74J06J21l02KK82
5041D1j31j56K23m3j83K36J58k26MK30k06J03L19k54j58K93m3k98L36M6n30K14
5063b5K82l30l6K59k66k66L76J06l76K57k5l35K86L07l69m7L56k16m1M69j42l91
5085a67K41K09m32L51K63n17j72M43j39j74L54k25n43M49K77m07Q9K93n84P2O07
5106B88j83m33L80j7m53N65L06o39Q1L86l24K6N41l79m99N67K9m28L87Q7o83J35
$$ plain form
5128 -260 375 -48 -234 207 -186 -578 194 285 -356 -128 55 -459 -60 538 -77 -314 254 23 -214 554
5148 554 389 -409 -64 389 -115 88 560 -276 -469 383 179 -283 141 -48 -695 -23 412 -291 -293 178 -361
$$ packed form
5128b60O35m23j86M41l93l92P72R1o41K28J83n14L99N98o15k37N68k31k37P68
5148E54j65p98L45M53n04K03M72q36j93Q52k04m62M24j89o47O72M35p03kM71n39
$$ [...]
8191E7
##END NTUPLES=NMR FID
##END=
