##TITLE=1H_5C2003
 CD3CN
 64 sc, 
 21.3.2023
##JCAMPDX= 6.0         $$ Bruker NMR JCAMP-DX V2.0
##DATA TYPE= NMR FID
##DATA CLASS= NTUPLES
##ORIGIN= UXNMR, Bruker Analytische Messtechnik GmbH
##OWNER= root
$$ XWIN-NMR		Version 3.5
$$ Tue Mar 21 14:32:01 2023 Russian Standard Time (UT+4h)  she@DPX200
##.OBSERVE FREQUENCY= 200.13135
##.OBSERVE NUCLEUS= ^1H
##.DELAY= (6, 6)
##.ACQUISITION MODE= SIMULTANEOUS
##.ACQUISITION SCHEME= undefined
##.AVERAGES= 64
##.DIGITISER RES= 18
##SPECTROMETER/DATA SYSTEM= spect
##.PULSE SEQUENCE= zg30
##.SOLVENT NAME= CDCl3
##.SHIFT REFERENCE= (INTERNAL, CDCl3, 0, 15.7039)
##AUDIT TRAIL= $$ (NUMBER, WHEN, WHO, WHERE, WHAT)
$$ ##TITLE= Audit trail, XWIN-NMR		Version 3.5
$$ ##JCAMPDX= 5.01
$$ ##ORIGIN= Bruker BioSpin GmbH
$$ ##OWNER= she
$$ F:/spectra/data/she/nmr/H-F/1/audita.txt
$$ ##AUDIT TRAIL=  $$ (NUMBER, WHEN, WHO, WHERE, WHAT)
(   1,<2023-03-21 14:29:42.15 +0400>,<she>,<DPX200>,
      <continue with go, POWCHK disabled, PULCHK disabled
       configuration hash MD5:
       00 E9 B6 7A A2 85 ED C7 34 08 36 98 17 FE 4E 26
       data hash MD5: 16K
       40 E9 EA 7E 7C 12 38 04 DE CA F1 36 8D 5B C0 FE>)
$$ ##END=
$$ 
$$ hash MD5
$$ 19 E6 C9 9A 51 95 C9 A6 66 D5 1B 7A B5 19 B4 19
##$RELAX= 
##$RELAX= 
##$RELAX= 
##$RELAX= 
##$RELAX= 
##$RELAX= 
$$ Bruker specific parameters
$$ --------------------------
##$DU= <F:/spectra>
##$EXPNO= 1
##$NAME= <H-F>
##$PROCNO= 1
##$TYPE= <nmr>
##$USER= <she>
##$AMP= (0..31)
100 100 100 100 100 100 100 100 100 100 100 100 100 100 100 100 100 100 
100 100 100 100 100 100 100 100 100 100 100 100 100 100 
##$AQSEQ= 0
##$AQ_mod= 1
##$AUNM= <au_zg>
##$AUTOPOS= <>
##$BF1= 200.13
##$BF2= 200.13
##$BF3= 200.13
##$BF4= 200.13
##$BF5= 200.13
##$BF6= 200.13
##$BF7= 200.13
##$BF8= 200.13
##$BYTORDA= 1
##$CFDGTYP= 0
##$CFRGTYP= 5
##$CHEMSTR= <none>
##$CNST= (0..31)
1 1 145 1 1 1 1 1 1 1 1 1 1 1 1 1 1 1 1 1 1 1 1 1 1 1 1 1 1 1 1 1 
##$CPDPRG= <>
##$CPDPRG1= <>
##$CPDPRG2= <>
##$CPDPRG3= <>
##$CPDPRG4= <mlev>
##$CPDPRG5= <mlev>
##$CPDPRG6= <mlev>
##$CPDPRG7= <mlev>
##$CPDPRG8= <mlev>
##$CPDPRGB= <>
##$CPDPRGT= <>
##$D= (0..31)
0 1.2 0 0 0 0 0 0 0 0.06 0 0.03 0 0 0 0 0.0002 0 0 0 0 0 0 0 0 0 0 0 0 
0 0 0 
##$DATE= 1679394311
##$DBL= (0..7)
120 120 120 120 120 120 120 120 
##$DBP= (0..7)
150 150 150 150 150 150 150 150 
##$DBP07= 0
##$DBPNAM0= <>
##$DBPNAM1= <>
##$DBPNAM2= <>
##$DBPNAM3= <>
##$DBPNAM4= <>
##$DBPNAM5= <>
##$DBPNAM6= <>
##$DBPNAM7= <>
##$DBPOAL= (0..7)
0.5 0.5 0.5 0.5 0.5 0.5 0.5 0.5 
##$DBPOFFS= (0..7)
0 0 0 0 0 0 0 0 
##$DE= 6
##$DECBNUC= <off>
##$DECIM= 32
##$DECNUC= <off>
##$DECSTAT= 4
##$DIGMOD= 1
##$DIGTYP= 9
##$DL= (0..7)
0 120 120 120 120 120 120 120 
##$DP= (0..7)
150 150 150 150 150 150 150 150 
##$DP07= 0
##$DPNAME0= <>
##$DPNAME1= <>
##$DPNAME2= <>
##$DPNAME3= <>
##$DPNAME4= <>
##$DPNAME5= <>
##$DPNAME6= <>
##$DPNAME7= <>
##$DPOAL= (0..7)
0.5 0.5 0.5 0.5 0.5 0.5 0.5 0.5 
##$DPOFFS= (0..7)
0 0 0 0 0 0 0 0 
##$DQDMODE= 0
##$DR= 18
##$DS= 0
##$DSLIST= <SSSSSSSSSSSSSSS>
$$ [...]
##$SUBNAM2= <"">
##$SUBNAM3= <"">
##$SUBNAM4= <"">
##$SUBNAM5= <"">
##$SUBNAM6= <"">
##$SUBNAM7= <"">
##$SUBNAM8= <"">
##$SUBNAM9= <"">
##$SW= 18.05172834244
##$SWIBOX= (0..15)
0 0 2 0 0 0 0 0 0 0 0 0 0 0 0 0 
##$SW_h= 3612.71676300578
##$TD= 16384
##$TD0= 1
##$TE= 0
##$TE2= 300
##$TE3= 300
##$TEG= 300
##$TL= (0..7)
0 120 120 120 120 120 120 120 
##$TP= (0..7)
150 150 150 150 150 150 150 150 
##$TP07= 0
##$TPNAME0= <>
##$TPNAME1= <>
##$TPNAME2= <>
##$TPNAME3= <>
##$TPNAME4= <>
##$TPNAME5= <>
##$TPNAME6= <>
##$TPNAME7= <>
##$TPOAL= (0..7)
0.5 0.5 0.5 0.5 0.5 0.5 0.5 0.5 
##$TPOFFS= (0..7)
0 0 0 0 0 0 0 0 
##$TUNHIN= 0
##$TUNHOUT= 0
##$TUNXOUT= 0
##$USERA1= <user>
##$USERA2= <user>
##$USERA3= <user>
##$USERA4= <user>
##$USERA5= <user>
##$V9= 5
##$VALIST= <valist>
##$VCLIST= <CCCCCCCCCCCCCCC>
##$VD= 0
##$VDLIST= <DDDDDDDDDDDDDDD>
##$VPLIST= <PPPPPPPPPPPPPPP>
##$VTLIST= <TTTTTTTTTTTTTTT>
##$WBST= 1024
##$WBSW= 4
##$XGAIN= (0..3)
0 0 0 0 
##$XL= 0
##$YL= 0
##$YMAX_a= 331796
##$YMIN_a= -529805
##$ZGOPTNS= <>
##$ZL1= 120
##$ZL2= 120
##$ZL3= 120
##$ZL4= 120
##$ABSF1= 10
##$ABSF2= 0
##$ABSG= 5
##$ABSL= 3
##$ALPHA= 0
##$AQORDER= 0
##$ASSFAC= 0
##$ASSFACI= 0
##$ASSFACX= 0
##$ASSWID= 0
##$AUNMP= <proc_1d>
##$AZFE= 0.1
##$AZFW= 0.1
##$BCFW= 1
##$BC_mod= 2
##$BYTORDP= 1
##$COROFFS= 0
##$CY= 11.3945322036743
##$DATMOD= 1
##$DC= 2
##$DFILT= <>
##$DTYPP= 0
##$F1P= 2.36226072786647
##$F2P= -0.459571619588291
##$FCOR= 0.5
##$FTSIZE= 0
##$FT_mod= 4
##$GAMMA= 1
##$GB= 0.15
##$INTBC= 1
##$INTSCL= 1
##$ISEN= 128
##$LB= 0.24
##$LEV0= 0
##$LPBIN= 0
##$MAXI= 10000
##$MC2= 0
##$MEAN= 0
##$ME_mod= 0
##$MI= 1.114404
##$NCOEF= 0
##$NC_proc= 0
##$NLEV= 6
##$NOISF1= 3.799351
##$NOISF2= 2.8
##$NSP= 1
##$NTH_PI= 0
##$NZP= 0
##$OFFSET= 15.70392
##$PC= 1
##$PHC0= -19108.86
##$PHC1= 13.80075
##$PH_mod= 1
##$PKNL= yes
##$PPARMOD= 0
##$PSCAL= 0
##$PSIGN= 0
##$REVERSE= no
##$SF= 200.130013532006
##$SI= 16384
##$SIGF1= 3
##$SIGF2= 2
##$SINO= 400
##$SIOLD= 16384
##$SREGLST= <1H.CDCl3>
##$SSB= 0
##$STSI= 0
##$STSR= 0
##$SW_p= 3612.71676300578
##$SYMM= 0
##$S_DEV= 0
##$TDeff= 0
##$TDoff= 0
##$TI= <>
##$TILT= no
##$TM1= 0
##$TM2= 0
##$TOPLEV= 0
##$USERP1= <user>
##$USERP2= <user>
##$USERP3= <user>
##$USERP4= <user>
##$USERP5= <user>
##$WDW= 1
##$XDIM= 8192
##$YMAX_p= 0
##$YMIN_p= 0
$$ End of Bruker specific parameters
$$ ---------------------------------
##NTUPLES= NMR FID
##VAR_NAME=  TIME,          FID/REAL,        FID/IMAG
##SYMBOL=    X,             R,               I
##VAR_TYPE=  INDEPENDENT,   DEPENDENT,       DEPENDENT
##VAR_FORM=  AFFN,          ASDF,            ASDF
##VAR_DIM=   8192,          8192,            8192
##UNITS=     SECONDS,       ARBITRARY UNITS, ARBITRARY UNITS
##FACTOR=    0.0002768,     1,               1
##FIRST=     0,             0,               0
##LAST=      2.2672688,     0,               0
##MIN=       0,             -529805,         0
##MAX=       2.2672688,     331796,          0
$$ Real data points
##PAGE= N=1
##DATA TABLE= (X++(R..R)), XYDATA
$$ plain form
0 0 0 0 0 0 0 0 0 0 0 0 0 0 0 0 0 0 -1 64 -64 64 -64 64 -65 128 -128 128 -192 192 -231 256 -315 322 -385
33 -385 447 -503 564 -633 703 -778 874 -971 1079 -1195 1324 -1470 1619 -1794 1973 -2175
49 -2175 2397 -2636 2910 -3199 3534 -3906 4326 -4799 5347 -5977 6721 -7610 8713 -10082
63 -10082 11867 -14305 17820 -23370 33555 -58389 274647 45306 -473281 -85366 199411
74 199411 158614 7069 -48144 -187909 -105995 171566 267702 -75039 -333586 -96029 303404
85 303404 192486 -186806 -220150 32070 99313 78948 89241 -57318 -239234 -25832 303142
96 303142 153402 -251892 -222340 120996 188594 -14958 -86302 -40131 -45959 12799 149264
107 149264 66397 -193604 -173906 151247 236289 -60155 -220545 -16822 134494 41046 -8210
$$ packed form
0@%%%%%%%%%%%%%%%%jO5j28J28j28J28j29J93k56K56l20L84m23M87n71O37p07
33c85Q32r50J067j197J336j481J652j845K050k274K519k794L089l413L767m148
49b175M572n033N546o109O733p440Q232r125J0146j1324J2698j4331J6323j8795
63a0082K1949k6172L2125m1190N6925r1944L33036k29341n18587L87915K84777
74A99411m0797j51545n5213j39765Q1914K77561R6136l42741k58547K37557L99433
85C03404j10918l79292l3344K52220O7243k0365J0293j46559j81916K13402L28974
96C03142j49740m05294K9552L43336O7598k03552p1344M6171n828N8758J36465
107A49264q2867k60001J9698L25153Q5042k96444j60390K03723J51316r3448m9256
$$ plain form
118 -8210 19069 -83450 -115698 109939 199204 -75438 -227554 9845 188967 39620 -111075
129 -111075 -52889 24199 12516 32762 65631 -36401 -143476 -60 191871 62698 -177198
140 -177198 -97196 116874 80786 -42970 -12036 2635 -65653 -3512 123232 34749 -147053
151 -147053 -82856 121346 106378 -77773 -99456 32406 58414 -7849 7441 22833 -68807
162 -68807 -69981 94842 116453 -82452 -137491 47479 120336 -13720 -66428 9272 7055 -33004
174 -33004 31136 67835 -46992 -103902 35157 124814 -5704 -116170 -17902 81556 19153
185 19153 -37635 9175 2212 -57585 5334 100076 10155 -117874 -32333 103747 42784 -72515
197 -72515 -33661 40540 6628 -19028 29647 18469 -61088 -33498 79899 58846 -76398 -73124
$$ packed form
118h210K7279j02519l2248K25637Q9265k74642j52116K37399J79122j49347j50695
129a11075N8186P7088j1683K0246L2869j02032j07075J43416J91931j29173k39896
140a77198Q0002K14070l6088j23756L0934J4671o8288O2141J26744q8483j81802
151a47053O4197K04202j4968j84151k1683J31862K6008o6263J5290J5392r1640
162f8807j174J64823K1611j98905n5039J84970P2857j34056n2708P5700k217m0059
174c3004O4140L6699j14827n6910J39059Q9657j30518j10466R8268R9458o2403
185A9153n6788M6810o963n9797O2919R4742q9921j28029Q5541J36080o0963j15299
197g2515L8854P4201l3912k5656M8675j1178p9557K7590J13397k1053j35244L274
$$ plain form
209 -73124 58148 67505 -32978 -35678 21960 -7597 -33908 38440 52372 -53295 -71066 47030
221 47030 77532 -30234 -67360 15063 45907 -11126 -19674 20094 -5122 -43602 17076 70941
233 70941 -11092 -84227 -396 78527 8394 -57433 -5015 27950 -15516 -9978 38240 6371
245 6371 -54439 -9544 63645 20180 -59789 -28658 46395 25229 -31803 -11398 19563 -11484
257 -11484 -18045 37252 29330 -48408 -40921 45919 44095 -35502 -37376 22931 19753 -16253 2338
270 2338 22264 -15028 -29297 24947 40129 -26008 -49871 15439 45991 -9079 -33386 7374
282 7374 16730 -14568 1694 30646 -9206 -44753 4611 47117 -1052 -42513 -2137 32777
294 32777 3061 -17190 5837 7990 -17384 -6171 27823 6278 -38659 -15094 39089 21098
$$ packed form
209g3124J31272R357j00483k700N7638k9557k6311P2348J3932j05667j7771J18096
221D7030L0502j07766l7126Q2423L0844n7033q548L9768k5216l8480O0678N3865
233G0941q2033p3135Q3831P8923p0133o5827N2418L2965m3466N538M8218l1869
245F371o0810M4895P3189m3465p9969L1131P5053k1166n7032K0405L0961l1047
257a1484o561N5297p922p7738P487Q6840j824p9597j874O0307l178l6006J8591
270B338J9926l7292j4269N4244J5182o6137k3863O5310L0552n5070k4307M0760
282G374R356l1298J6262K8952l9852l5547M9364M2506m8169m1461M0376L4914
294C2777k9716k0251K3027K153k5374J1213L3994k1545m4937K3565N4183j7991
$$ plain form
306 21098 -28458 -15653 20381 4949 -14725 9212 11682 -22703 -16241 28050 21725 -25626 -22391
319 -22391 21342 21266 -13998 -15489 7606 1694 -10204 8151 18001 -13302 -25478 14506 31577
332 31577 -8958 -28187 4314 18850 -5389 -7791 10316 747 -16637 4021 23218 -3910
344 -3910 -26181 247 24774 2845 -20169 -2732 11317 -1566 -5162 9707 2635 -17851 -4874
357 -4874 22038 8897 -20060 -10225 16108 8592 -10679 -4236 6205 -3692 -6227 9856 8307
370 8307 -13626 -11506 14500 15432 -10860 -14366 5926 8389 -4834 -1649 5755 -5076 -8366 8192
384 8192 13378 -7106 -15744 3840 13488 -1980 -10580 1009 5671 -1717 142 6980 -2226 -11824
398 -11824 1134 14127 148 -13526 -2863 10135 2898 -4522 -35 999 -3963 -550 6785
$$ packed form
306B1098m9556J2805L6034j5432j9674K3937K470l4385O462M4291o325m7351L235
319b2391M3733p6l5264j491K3095n912j1898J8355R850l1303j2176L9984J7071
332C1577m0535j9229L2501J4536k4239k402J8107r569j7384K0658J9197k7128
344c910k2271K6428K4527k1929k3014J7437J4049j2883l596J4869p072k0486J2977
357d874K6912j3141k8957R835K6333p516j9271O443J0441r897k535J6083j549
370H307k1933K120K6006R32k6292l506K0292K463j3223L185P404j0831l290J6558
384H192N186k0484q638J9584R648j5468q600J1589M662p388J859O838r206r598
398a1824J2958J2993j3979j3674J0663J2998p237p420M487J034m962L413P335
$$ plain form
411 6785 620 -9734 -3521 10155 6554 -7117 -5971 4755 3659 -1845 706 1070 -5695 -3067
425 -3067 8481 5862 -7075 -7056 4441 6361 -2378 -4602 225 1280 -757 2511 2474 -3125 -5706
440 -5706 2647 7258 -1652 -8292 -1008 5971 1859 -1350 236 -532 -2629 2600 4197 -3164 -6440
455 -6440 -263 5326 2370 -2584 -2458 921 2791 1455 -299 -2587 -3036 -609 4610 2142 -4353 -2595
471 -2595 4212 3912 -1422 -1788 -785 -1501 711 2671 249 -3612 -552 3831 3405 -988 -3977 -951
487 -951 2058 1060 -907 -1611 -1563 -42 2430 2312 -1381 -2608 321 2472 584 -1457 -2099 -232 1398
504 1398 2276 -334 -2378 -775 1621 2694 -615 -2332 -2066 1109 1817 -14 -521 -539 367 1180 1568
521 1568 -759 -2070 54 2036 1132 -1469 -2063 -525 1638 2193 77 -1871 -874 1310 984 521 -1248
$$ packed form
411F785o165j0354O213J3676l601j3671J146J0726j096n504K551L64o765K628
425c067J1548k619j2937J9J1497J920q739k224M827J055k037L268l7n599k581
440e706Q353M611q910o640P284O979m112l209J586p68k097N229J597p361l276
455f440O177N589k956m954J26L379J870j336j754k288m49K427N219k468o495J758
471b595O807l00n334l66J003p16K212J960k422l861L060M383m26m393k989L026
487i51L009r98j967p04M8J521K472j18l693j227K929K151j888k041o42J867J630
504A398Q78k610k044J603K396J073l309j717K66L175P08j831n07j8R06Q13L88
521A568k327j311K124J982r04k601n94J538K163N55k116j948R97K184l26m63j769
$$ plain form
538 -1248 -1804 -189 1230 511 -909 -861 -173 1051 1544 -275 -2390 155 1947 909 -998 -1596 -480
555 -480 1325 1599 643 -998 -737 -209 981 361 -395 -1571 -356 939 533 -1135 -596 145 1083 1085 -582
574 -582 -1807 -346 1330 927 -138 -1018 -1130 94 1511 943 -442 -1039 -580 440 1270 314 -1869
591 -1869 -737 1547 639 -693 -1161 145 245 787 -162 -818 -253 -448 1031 596 -226 -2104 -452 1651
609 1651 801 -1349 -393 350 -200 -202 225 -170 -529 909 1161 -361 -1345 243 714 1447 356 -664 -387
628 -387 184 456 891 359 -1303 -891 1688 932 -1756 -334 872 303 -666 -131 84 -692 -12 1955
646 1955 660 -1942 -707 1315 1450 -425 -876 -30 589 -623 -604 903 111 -1447 -93 1801 -569
663 -569 -1809 1180 1814 -1187 -964 825 52 -538 531 1538 -364 -1796 -220 1690 285 -1474
$$ packed form
538a248n56J615J419p19j420M8O88J224M93j819k115K545J792j038j907n98J116
555d80J805K74r56j641K61N28J190o20p56j176J215J295m06j668N39P41R38Kj667
574e82j225J461J676m03j065q80j12J224J417n68j385n97M59J020Q30r56k183
591a869J132K284r08j332m68J306J00N42r49o56N65j95J479m35q22j878J652K103
609A651q50k150R56P43n50kM27l95l59J438K52j522r84J588M71P33j091j020K77
628c87N71K72M35n32j662M12K579p56k688J422J206n69r69N35K15p76O80J967
646A955j295k602J235K022J35j875m51Q46O19j212J9J507p92j558J354J894k370
663e69j240K989O34l001K23J789p73n90J069J007j902j432J576J910j405j759
$$ plain form
679 -1474 -1133 945 -221 -1575 554 1156 -1397 -1106 1897 1007 -2277 -775 2511 1105 -1548 -230
695 -230 1779 357 -726 1087 1336 -561 -1577 930 1897 -1071 -1655 757 1251 -1113 -1241 1201 283
712 283 -2319 -174 2240 -393 -1971 1187 2685 -977 -2016 1279 1224 -880 -424 1599 647 -2540
728 -2540 -1467 1598 551 -2669 -962 2096 -9 -3118 -611 2179 -511 -1246 1629 1650 -1689 -1190
744 -1190 2178 1196 -1465 -1269 1728 403 -2062 -593 1559 -212 -2284 418 1847 -1551 -1988 1096
760 1096 2019 -1730 -1582 1226 1222 -2005 -306 2452 -392 -2559 293 2531 -539 -2237 1080 2057 -949
777 -949 -1507 923 1159 -1538 -995 1628 829 -2076 -329 2687 510 -2218 -286 2303 -657 -1897
793 -1897 1339 1919 -1055 -1450 1906 1741 -1853 -1350 1875 1009 -2410 -934 1668 348 -1623 883
$$ packed form
679a474L41K078j166j354K129O02k553K91L003q90l284J502L286j406k653J318
695b30K009j422j083J813K49j897j016K507R67k968n84K412M94k364j28K442r18
712B83k602K145K414k633j578L158J498l662j039L295n5k104M56K023r52l187
728b540J073L065j047l220J707L058k105l109K507K790k690p35K875K1l339M99
744a190L368r82k661J96K997j325k465J469K152j771k072K702J429l398m37L084
760A096R23l749J48K808ml227J699K758k844k167K852K238l070j698L317R77l006
777i49n58K430K36k697N43K623p99k905J747L016k177k728J932K589k960j240
793a897L236N80k974l95L356j65l594N03L225q66l419J476K602j320j971K506
$$ plain form
809 883 2129 -430 -1527 900 1878 -1441 -2252 1221 944 -1506 -1120 1122 884 -2212 25 2236 174
826 174 -2453 470 1902 -645 -1532 761 1890 -577 -939 1189 594 -1146 -365 1848 282 -1705
842 -1705 -524 1353 190 -1956 295 1676 -647 -1614 943 1395 -810 -476 1760 1524 -915 -1060
858 -1060 1039 630 -1243 -159 1525 32 -1607 635 1335 -866 -1797 1009 1401 -1002 -983 926 315
875 315 -929 -598 1604 461 -1047 318 1109 -22 -1603 124 1179 -19 -1044 426 749 -772
891 -772 -1045 733 422 -1400 -812 1083 492 -1155 27 1383 -790 -855 -253 641 -591 -465 1095 1042
909 1042 -556 -1123 388 564 -962 -834 68 356 -1258 -649 603 -370 -798 131 827 -625 -558 827
927 827 298 -139 -171 303 214 -841 115 512 -371 -684 -32 285 64 -1225 -131 797 -19 -404 790 593
$$ packed form
809H83J246k559j097K427R78l319q11L473k77k450L86K242k38l096K237K211k062
826A74k627K923J432k547q87K293J129k467l62K128n95j740P81K213j566j987
842a705J181J877j163k146K251J381k323r67K557M52k205L34K236k36k439j45
858a060K099m09j873J084J684j493j639K242P00k201r31K806L92k403J9J909o11
875C15j244L31K202j143j508J365P91j131j581J727J055j198j025J470L23j521
891g72k73J778l11j822N88J895n91j647J182J356k173o5O02Q94j232J26J560n3
909A042j598n67J511J76j526J28R02K88j614O09J252r73m28R29O96j452O7J385
927H27n29m37l2M74q9j055R56L97q83l13O52L17k21j289J094R28q16l85J194j97
$$ plain form
947 593 -665 -638 1035 -296 -828 285 810 -61 -333 120 149 -297 -685 580 230 -202 -564 183 610
966 610 -553 -522 528 535 -608 -570 467 -89 -12 369 415 -554 -308 114 -183 16 -439 -192 144 48 -169
987 -169 -150 -95 158 314 -33 137 -64 -104 440 6 -238 -162 112 -263 270 51 -559 -512 138 201 198 -428 -313
1010 -313 546 668 -227 -284 83 -81 -245 396 -444 -622 128 -336 -75 -270 131 -585 -233 93 -63 -101 558
1031 558 463 56 -66 -269 -210 -109 -91 292 -81 201 -11 118 -182 -203 -31 -250 141 137 -697 -44 15 -103
1053 -103 130 -1 382 192 -444 215 -148 459 130 -291 -281 6 -218 470 4 701 -217 234 135 58 74
1074 74 0 -129 -103 188 -123 -110 217 134 -50 364 141 -341 -264 16 -383 251 697 260 -372 37 138 -372
1096 -372 -503 415 -59 -85 -47 -127 79 -319 -182 -111 -168 -103 -118 211 130 -14 226 -2 283 -49 464 357 -403
$$ packed form
947E93j258K7J673j331n32J113N25q71k72M53K9m46l88J265l50m32l62P47M27
966F10j163L1J050Pj143L8J037n56P7L81M6r69K46M22k97J99m55K47L36r6k17
987a69J9N5K53J56l47J70k01m0N44m34k44P6K74l75N33k19o10M7O50O3lo26J15
1010c13Q59J22q95n7L67j64j64O41q40j78P50m64K61j95M01p16L52L26j56l8O59
1031E58r5m07j22k03N9J01J8L83l73K82k12J29l00k1J72k19L91mq34O53N9j18
1053a03K33j31L83j90o36O59l63O07l29m21J0K87k24O88m66O97r18M51r9p7J6
1074G4p4j29K6K91l11J3L27q3j84M14k23m82P7K80l99O34M46m37o32M09J01n10
1096c72j31R18m74k6L8q0K06l98J37P1n7O5j5L29q1j44K40k28K85l32N13j07p60
$$ plain form
1119 -403 218 652 -301 -266 212 180 -398 -525 422 370 -273 -645 9 53 63 -362 405 -216 -798 -274 727
1140 727 271 -289 326 894 -146 -578 581 -22 -97 -532 535 216 -885 -174 580 124 -36 -455 1035
1159 1035 -129 -1035 521 528 -321 -611 454 606 -577 -1031 854 331 -1085 -96 875 -156 -885 523
1177 523 743 -167 -755 322 589 -619 -894 322 -33 -754 -547 1368 538 -587 -525 1223 197 -1208
1195 -1208 -53 947 -478 -979 996 871 -451 -659 848 1234 -816 -663 1224 627 -1802 233
1211 233 1547 148 -1013 -96 1506 -12 -1599 255 1173 -867 -902 1407 942 -898 -1074 1911 852
1228 852 -1651 -237 1412 -7 -1397 -239 1883 -846 -1628 554 1754 -1168 -1095 1735 1329 -1579
1244 -1579 -1244 1714 857 -1897 -80 1857 286 -1684 721 2169 -940 -1941 1150 2089 -1621 -1375
$$ packed form
1119d03O21M34r53L5M78l2n78j27R47n2o43l72O54M4J0m25P67o21n82N24J001
1140G27m56n60O15N68j040m32J159o03p5m35J067l19j101P11P54m56j60m19J490
1159A035j164r06J556Pq49k90J065J52j183m54J885n23j416R89R71j031p29J408
1177E23K20r10n88J077K67j208k75J216l55p21K07J915q30j125O2J748j026j405
1195a208J155J000j425n01J975j25j322k08J507L86k050J53J887n97k429K035
1211B33J314j399j161R17J602j518j587J854R18k040l5K309m65j840j76K985j059
1228H52k503J414J649j419j390J158K122k729p82K182J200k922P3K830m06k908
1244a579L35K958q57k754J817J937j571j970K405J448l109j001L091R39l710K46
$$ plain form
1260 -1375 1351 1300 -1586 -1138 2464 823 -2366 160 2800 -127 -2027 865 2446 -846 -1927 1437
1276 1437 2007 -1920 -1503 2049 1821 -2273 -1154 2660 777 -2278 -360 2530 -459 -2387 626 2432
1292 2432 -1057 -2302 1385 2319 -1990 -2233 2263 1291 -2450 -865 2508 907 -2790 44 2954 -582
1308 -582 -2860 746 2815 -1173 -2636 1907 2527 -1802 -2143 2278 1466 -2804 -976 3450 510 -3083
1324 -3083 -187 3199 -311 -2855 1195 2588 -1326 -2632 1686 2275 -2259 -2112 2595 1863 -3040 -735
1340 -735 3264 551 -2991 256 3754 -680 -3187 1365 2962 -1838 -2623 2166 2464 -2351 -1644 2824
1356 2824 1253 -2931 -973 3646 410 -3621 492 3427 -457 -2963 1388 3783 -1619 -2787 2444
1371 2444 2387 -2875 -2373 2862 1694 -3124 -1039 3720 617 -3036 445 3646 -720 -3309 1043 3386
$$ packed form
1260a375K726n1k886M48L602j641l189K526K640k927j900K892J581l292j081L364
1276A437N70l927M17L552k28m094J119L814j883l055J918K890k989j928L013J806
1292B432l489j245L687R34m309k43M496r72l741J585L373j601l697K834K910l536
1308e82k278L606K069l988j463M543O20m329l41M421q12m270J828M426k940l593
1324c083K896L386l510k544M050J393l914j306M318N89m534J47M707p32m903K305
1340g35L999k713l542L247L498m434k507M552J597m800p85M789K98m815P07M468
1356B824j571m184J958M619l236m031M113K935l884k506M351K395n402j168N231
1371B444n7n262N02N235j168m818K085M759l103l653L481L201m366k589M352K343
$$ plain form
1387 3386 -1985 -2553 2418 2573 -3123 -1653 3260 1377 -3791 -853 3324 -147 -3570 633 3320
1402 3320 -682 -3409 1658 2884 -2337 -3065 2654 1924 -2944 -1524 3346 1900 -3724 -529 3655
1417 3655 -87 -3440 586 3605 -1256 -3691 1952 3213 -2706 -2763 2693 1769 -3142 -1677 3595 1284
1433 1284 -3900 -355 3730 37 -3395 1035 3532 -791 -3205 1424 2757 -2690 -2170 3348 2596
1448 2596 -3345 -1569 3184 1113 -3541 -349 3723 329 -3632 669 3934 -1436 -3088 2253 3209
1463 3209 -2487 -2588 2902 2199 -3554 -1448 3796 1165 -3689 -486 3804 157 -3570 868 3346
1478 3346 -1277 -2967 2422 3042 -2791 -1973 2776 1774 -3229 -1407 3610 640 -3409 108 3452
1493 3452 -374 -3589 973 3677 -1637 -2702 2469 2397 -3179 -2275 3409 1569 -3066 -1150 3344 1217
$$ packed form
1387C386n371n68M971J55n696J470M913j883n168K938M177l471l423M203K687
1402C320m002k727N067J226n221p28N719p30m868J420M870j446n624L195M184
1417C655l742l353M026L019m861k435N643J261n919n7N456r24m911J465N272k311
1433A284n184L545M085l693l432M430K497m323k414M629J333n447N20N518p52
1448B596n941J776M753k071m654L192M072l394l961M301L265n370j652N341R56
1463C209n696j01N490p03n753K106N244k631m854L203M290l647l727M438K478
1478C346m623j690N389O20n833Q18M749j002n003J822N017k970m049L517L344
1493C452l826l215M562K704n314j065N171p2n576R04N684j840m635J916M494k127
$$ plain form
1509 1217 -3647 -261 4017 -873 -3648 1089 3005 -1646 -2822 1929 2550 -2914 -1857 2562 1525
1524 1525 -3013 -938 2986 522 -2918 731 3244 -850 -3459 954 3219 -1439 -2818 1948 2293
1539 2293 -2036 -1937 3155 1237 -3384 -904 3188 541 -3310 242 3554 -1092 -3050 1322 2969
1554 2969 -1797 -2496 1553 2129 -2577 -1862 2189 1210 -3447 -736 3227 107 -3226 30 3364 -921
1570 -921 -2525 1182 2289 -1978 -1775 2262 2116 -2409 -1622 2431 607 -2812 -333 2823 -7 -3084
1586 -3084 230 2633 -939 -1861 1328 1881 -1326 -1833 2142 1699 -2543 -768 2543 961 -2727 -152
1602 -152 2654 142 -2802 863 2123 -1252 -2300 1186 2058 -1666 -1878 1500 1141 -2203 -885 2385
1618 2385 868 -2800 -664 2137 -761 -1796 494 2256 -1119 -1959 1402 1901 -1538 -1861 2197 774
$$ packed form
1509A217m864L386M278m890k775M737J916m651j176M751O21n464J057M419j037
1524A525m538K075L924k464l440L649K513m094k609M413K265m658j379M766L45
1539B293m329R9N092j918m621K480M092k647l851L552L312m646j958M372J647
1554B969m766o99M049N76m706P15M051r79m657K711L963l120l333L256L334m285
1570i21j604L707J107m267K03M037j46m525P87M053j824l419K479L156k830l077
1586c084L314K403l572r22L189N53l207n07L975m43m242J775L311j582l688K575
1602a52K806k512k944L665J260l375j048L486Q72l724k12L378l59l344J318L270
1618B385j517l668K136K801k898j035K290J762l375q40L361M99l439l23M058j423
$$ plain form
1634 774 -1858 -879 1782 304 -2563 345 2214 -431 -2295 351 1836 -907 -1539 1149 1545 -1465
1650 -1465 -1545 1547 530 -2094 -744 2357 371 -1888 -230 1966 -227 -2136 412 2192 -1128
1665 -1128 -1774 925 1208 -1332 -732 1998 756 -1861 -346 1467 300 -1449 298 1916 -261 -1639
1681 -1639 640 1766 -808 -1589 1089 1050 -1744 -1016 1283 581 -1529 -662 1365 166 -1317 -44
1697 -44 1821 -608 -1402 813 1182 -1111 -1252 1411 1094 -1076 -716 950 830 -1422 -264 2109 345
1714 345 -1451 354 1528 -523 -782 1036 1065 -225 -1002 991 766 -725 -162 1026 555 -708 -365
1731 -365 1672 40 -1677 43 1464 -909 -509 132 852 -591 -1397 1008 744 -851 -685 1136 662
1748 662 -818 -113 1145 -116 -1061 -126 858 241 -366 324 772 -641 -790 613 685 -1299 -550 649
$$ packed form
1634G74k632R79K661j478k867K908J869k645j864K646J485k743o32K688L96l010
1650a465q0L092j017k624J350L101j986k259J658K196k193j909K548J780l320
1665a128o46K699K83k540O00K730j242k617J515J813j167j749J747J618k177j378
1681a639K279J126k574p81K678l9k794P28K299p02k110Q67K027j199j483J273
1697d4J865k429p94K215L69k293j41K663l17k170L60J666j20k252J158K373j764
1714C45j796J805J174k051k59J818K9j290p77J993k25j491N63J188m71j263L43
1731c65K037j632j717J720J421k373M00O41P20j443q06K405k64j595J66J821m74
1748F62j480P05J258j261r45R35R84o17o07O90M48j413j49J403P2j984P49J199
$$ plain form
1766 649 289 -857 -768 525 -13 -1030 455 1262 -537 -842 525 620 -686 -270 358 407 -709 -178
1784 -178 810 94 -878 121 399 -104 -546 -296 705 -173 -796 674 436 -109 -534 560 786 -527 -180
1803 -180 877 486 -558 -72 602 -193 -626 242 147 -840 -613 561 618 -361 -533 772 519 -515 -8
1822 -8 418 287 -954 -63 727 180 -324 377 307 40 -542 499 299 -351 -47 643 562 -585 -36 77
1842 77 126 -305 -422 275 6 -200 102 413 229 55 385 -118 -47 -506 489 547 -335 -107 136 77 -6 -214
1864 -214 -259 -137 -358 -102 -41 -352 -386 203 334 -314 -247 295 319 -248 -394 426 -151 -452 -138 406 -55 217
1886 217 278 -538 149 16 446 283 -13 -307 619 15 -374 76 -99 -94 -362 630 354 -367 -281 210 -358
1907 -358 -260 -453 -116 319 -70 -137 263 287 -537 135 -267 322 -276 -200 541 -203 -589 -114 100 674 -176
$$ packed form
1766F49l60j146Q9J293n38j017J485Q07j799l05J367R5j306M16O28M9j116N31
1784a78R88p16r72R99K78n03m42K50J001q78o23J470k38n45m25J094K26j313L47
1803a80J057l91j044M86O74p95m33Q68r5r87K27J174N7r79j72J305k53j034N07
1822hM26j31j241Q91P90n47n04P01p0k67n82J041k00o50L04O90q1j147N49J13
1842G7M9m31j17O97k69k06L02L11j84j74L30n03P1m59R95N8q82K28K43n9q3k08
1864b14m5J22k21K56O1l11l4N89J31o48O7N42K4n67j46Q20n77l01L14N44m61K72
1886B17O1q16O87j33M30j63k96k94R26o04l89M50j75Nk68R92k76p21Q6M91n68
1907c58R8j93L37M35l89o7M00K4q24O72m02N89n98P6P41p44l86M75K14N74q50
$$ plain form
1928 -176 -135 -191 410 89 -19 108 -140 295 -371 -213 150 -166 225 202 -431 -397 131 -147 272 132 -49
1949 -49 -151 -185 -9 368 215 284 -144 -568 -158 278 -46 -375 652 40 -265 528 -99 -253 27 -176 -9
1970 -9 139 -131 -154 118 -692 -85 -249 -206 -2 -101 -280 -181 -40 -101 133 -178 -252 -48 -50 -524 208 -255 73
1993 73 120 81 227 -131 455 375 -230 174 -66 118 -404 30 95 -371 -588 371 211 619 280 -280 14 23
2015 23 152 -421 68 -513 398 -19 348 153 131 -213 -108 -158 -239 -74 -84 729 300 -366 150 26 -268 -14
2037 -14 -388 -306 318 -176 144 -96 -409 -255 96 -148 475 -59 -51 109 -221 186 -41 94 41 -84 2 83
2059 83 252 87 75 41 -10 167 -21 -213 134 -66 42 219 -186 -165 -93 552 42 290 -171 118 -267 224
2081 224 50 10 10 376 289 182 -472 169 62 25 153 -70 -57 -218 101 -263 -303 -593 -178 -16 -439 -284
$$ packed form
1928a76M1n6O01l21j08J27k48M35o66J58L63l16L91k3o33L4N28k78M19j40j81
1949d9j02l4J76L77j53O9m28m24M10M36l24l29J027o12l05P93o27j54K80k03J67
1970iJ48k70k3K72q10O07j64M3K04r9j79R9J41o1K34l11p4K04km74P32m63L28
1993G3M7l9J46l58N86q0o05M04k40J84n22M34O5m66k17R59j60M08l39n60K94R
2015B3J29n73M89n81R11m17L67j95k2l44J05n0q1J65j0Q13m29o66N16j24k94K54
2037a4l74Q2O24m94L20k40l13J54L51k44O23n34QJ60l30M07k27J35n3j25Q6Q1
2059H3J69j65j2l4n1J77j88j92L47k00J08J77m05K1P2O45n10K48m61K89l85M91
2081B24j74m0%L66q7j07o54O41j07l7J28k23J3j61L19l64m0k90M15J62m23J55
$$ plain form
2103 -284 -114 -507 247 -357 -233 -189 -335 77 130 -158 -455 -115 13 125 113 -37 -39 -356 319 213 30 12
2125 12 10 -260 113 154 16 -159 147 504 245 -327 -130 -214 -70 534 289 -30 738 -562 -205 377 -290
2146 -290 -671 -67 212 399 -196 -43 94 -232 55 63 449 263 -85 328 247 -276 291 103 548 -133 -79
2167 -79 -251 224 88 -57 -97 -129 -482 -35 -289 -271 69 -43 90 -175 118 37 33 -320 167 267 136 -35
2189 -35 -194 198 -66 -590 225 -189 43 78 -268 208 -100 -323 333 239 -287 -284 -202 65 -482 175 -22 -5
2211 -5 2 -98 413 -352 -245 -65 192 -355 73 -11 -435 -294 -73 -336 -12 -339 -477 482 132 -247 -611 89
2233 89 -172 -173 -281 555 -433 128 -227 434 -153 76 -374 -191 94 -9 365 -47 288 -226 -115 370 133
2254 133 448 416 234 55 325 322 395 -72 45 161 229 -264 335 -21 -139 344 -13 183 -98 551 54 19
$$ packed form
2103b84J70l93P54o04J24M4j46M12N3k88k97L40J28J12j2j50kl17O75j06j83j8
2125A2kk70L73M1j38j75L06L57k59n72J97q4J44O04k45l19P68j300L57N82o67
2146b90l81O04K79J87n95J53J37l26K87QL86j86l48M13q1n23N67j88M45o81N4
2167g9j72M75j36j45m0l2l53M47k54J8L40j12J33k65K93q1ml53M87J00j31j71
2189c5j59L92k64n24Q15m14K32L5l46M76l08k23O56r4n26LQ2K67n47O57j97J7
2211ePj00N11p65J07J80K57n47M28q4m24J41K21k63L24l27j38R59l50l79l64P00
2233H9k61jj08Q36r88N61l55O61n87K29m50J83K85j03L74m12L35n14J11M85k37
2254A33L15l2j82j79K70lP3m67J17J16O8m93N99l56j18M83l57J96k81O49m97l5
$$ plain form
2276 19 -662 139 -30 -336 -214 194 -377 -283 189 233 -322 -268 93 -228 43 -377 125 -67 169 -29 35 -147
2298 -147 270 198 -95 -470 302 289 487 328 76 426 606 -95 -201 -14 119 -347 5 -26 -161 38 343
2319 343 168 -76 -227 29 52 -66 -265 -134 -111 226 111 209 601 171 48 -77 679 -21 -82 157 149 404
2341 404 -218 63 221 -375 -442 166 -318 -310 208 -52 -15 -158 324 191 138 -190 233 -80 133 365 187 88
2363 88 -235 150 74 637 845 -30 191 -244 79 126 142 100 117 -7 -118 -472 551 16 -449 276 408 -383
2385 -383 241 473 737 -375 -349 -123 145 -198 25 146 -41 207 116 161 -429 -134 -382 240 133 70 15
2406 15 196 18 -108 180 -168 -357 -7 -27 -113 41 68 -2 -167 -460 179 -168 35 140 -128 -40 -39 522 182
2429 182 110 -24 -63 -378 203 -404 272 -58 404 125 270 -107 -252 -111 -222 96 64 -181 -22 -147 60
$$ packed form
2276A9o81Q01j69l06J22M08n71R4M72M4n55N4L61l21K71m20N02j92K36j98O4j82
2298a47M17p2k93l75P72j3J98j59k52L50J80p01j06J87J33m66L52l1j35J99L05
2319C43j75k44j51K56K3j18j99J31K3L37j15R8L92m30j23j25P56p00o1K39qK55
2341D04o22K81J58n96o7O08m84QN18k60L7j43M82j33n3l28M23l13K13K32j78r9
2363H8l23L85p6N63K08q75K21m35L23M7J6m2J7j24j11l54J023n35m65P25J32p91
2385c83O24K32K64j112K6K26K68l43K23J21j87K48r1M5n90K95k48O22j07o3n5
2406A5J81j78j26K88l48j89L50k0q6J54K7p0j65k93O39l47K03J05k68Q8JN61l40
2429A82p2j34l9l15N81o07O76l30M62k79J45l77j45J41j11L18l2k45J59j25K07
$$ plain form
2450 60 -88 174 32 -423 263 -186 173 -435 214 -111 173 -133 249 33 -24 188 -394 -285 64 235 -330
2471 -330 368 -12 85 658 -185 355 -3 140 -5 -148 -234 -273 -159 -474 341 314 -183 74 188 -36 122
2492 122 224 384 -123 109 -13 -30 314 54 -104 137 -441 97 159 -179 225 -57 -312 48 -426 247 10
2513 10 255 -629 -302 -343 136 -217 -279 34 -467 -324 -541 8 -47 -236 -116 269 135 73 41 144 -574 -59
2535 -59 -208 -62 4 -179 -283 33 -107 -209 153 360 371 206 142 -348 -134 114 -160 79 -133 101 223
2556 223 -596 151 -369 -619 -107 87 -346 -224 -81 471 176 159 -259 -141 71 73 -754 -167 89 71 57 -154
2578 -154 102 -313 -154 -301 -200 135 86 -147 -169 -46 -429 313 24 71 -2 117 201 -124 22 -269 -170 46
2600 46 479 496 -196 663 -4 -236 -392 -146 489 89 35 12 436 159 -28 18 -171 332 -541 146 -275 -66
$$ packed form
2450F0j48K62j42m55O86m49L59o08O49l25K84l06L82k16n7K12n82J09L49J71n65
2471c30O98l80R7N73q43N40l58J43j45j43q6l9J14l15Q15k7m97K57J14k24J58
2492A22J02J60n07K32j22j7L44k60j58K41n78N38O2l38M04k82k55L60m74O73k37
2513A0K45q84L27m1M79l53o2L13n01J43k17N49n5j89J20L85j34o2l2J03p18N15
2535e9j49J46O6j83j04L16j40j02L62K07J1j65o4m90K14K48k74K39k12K34J22
2556B23q19P47n20k50N12J94m33J22J43N52k95j7m18J18K12Kq27N87K56j8j4k11
2578a54K56m15J59j47J01L35m9k33k2J23l83P42k89M7p3J19Q4l25J46k91R9K16
2600D6M33J7o92Q59o67k32j56K46O35m00n4k3M24k77j87M6j89N03q73O87m21K09
$$ plain form
2622 -66 -214 353 -317 -42 348 -138 15 -29 336 215 -328 -40 242 333 139 353 147 62 -97 -286 94
2643 94 305 472 19 154 -305 -248 0 398 9 -104 -230 -225 -89 -162 239 -142 -74 -242 357 -6 3 180 -311
2666 -311 -65 -169 -11 -25 297 217 -49 176 343 82 -106 -268 147 170 127 202 -81 125 62 237 -703 -205
2688 -205 -127 172 -76 -8 61 172 -363 -278 7 106 -71 1 124 448 -5 -604 124 -40 -265 -106 -222 130
2710 130 -148 455 69 -160 -82 -125 -305 -72 -123 -316 212 -342 296 -5 -227 -287 302 -13 -98 -367 97 513
2732 513 -38 -47 86 145 157 72 195 39 -57 119 22 37 0 -183 -68 24 -268 -327 -149 -301 -90 380 -281 -336
2756 -336 -5 -18 -46 213 158 329 -247 458 -22 165 -100 -197 -712 140 29 -14 65 -172 -147 376 47 138 133
2779 133 -79 210 -470 -170 -113 -318 -664 -23 -387 150 254 138 206 -15 129 29 69 228 596 222 279
$$ packed form
2622f6j48N67o70K75L90m86J53m4L65j21n43K88K82R1j94K14k06q5j59j89L80
2643I4K11J67m53J35m59N7K48L98l89j13j26NJ36p3M01l81O8j68N99l63RJ77m91
2666c11K46j04J58j4L22q0k66K25J67k61j88j62M15K3m3P5k83K06o3J75r40M98
2688b05P8K99k48O8O9J11n35Q5K85R9j77P2J23L24m53n99P28j64k25J59j16L52
2710A30k78O03l86k29P8m3j80K33n1j93N28n54O38l01k22o0N89l15q5k69M64M16
2732E13n51rJ33N9J2q5J23j56r6J76r7J5l7j83J15R2k92n9J78j52K11M70o61n5
2756c36L31j3k8K59n5J71n76P05m80J87k65r7n15Q52j11m3P9k37K5N23l29R1n
2779A33k12K89o80L00N7k05l46O41l64N37J04j16O8k21J44j00M0J59L68l74N7
$$ plain form
2800 279 -118 34 111 104 -173 439 247 212 313 -119 324 143 -144 97 160 371 -208 -12 684 -106 -22 34
2822 34 32 91 -394 425 -511 -138 -100 -205 50 61 -158 56 -226 81 148 13 -139 89 62 -27 -60 161 54
2845 54 -104 -194 140 176 -164 278 286 159 -112 141 37 -276 8 174 440 445 -170 118 145 112 -475 -128 148
2868 148 -154 116 76 -40 -130 -188 -112 -74 -378 484 184 367 123 -212 116 -233 281 30 -78 -70 271 240 -112
2891 -112 -49 -30 516 220 -149 163 294 -269 -439 147 -153 -48 -131 280 25 -180 151 0 345 -357 -22
2912 -22 -30 -50 288 194 -17 -302 64 163 500 -382 -169 257 -316 249 -41 375 -264 48 471 459 66 325
2934 325 50 117 270 268 235 124 389 -216 385 210 -318 241 -89 -299 -6 210 90 -286 -118 -62 29 27 -151
2957 -151 194 -106 -275 -93 -44 224 -219 -379 -169 -34 -531 182 190 35 54 205 333 123 -272 33 110 -483
$$ packed form
2800B79l97J52P7pk77O12j92l5J01m32M43j81k87K41O3K11n79J96O96p90Q4N6
2822C4kN9m85Q19r36L73L8j05K55J1k19K14k82L07O7j35j52K28k7q9l3K21j07
2845E4j58r0L34L6l40M42Qj27k71K53j04l13K84J66K66No15K88K7l3n87L47K76
2868A48l02K70m0j16r0n8P6L8l04Q62l00J83k44l35L28l49N14k51j08QL41l1l52
2891a12O3J9N46k96l69L12J31n63j70N86l00J05q3M11k55k05L31j51L45p02L35
2912b2qk0L38r4k11k85L66R9L37q82K13M26n73N65k90M16o39L12M23j2l93K59
2934C25k75O7J53kl3j11K65o05O01j75n28N59l30k10K93K16j20l76J68N6R1kj78
2957a51L45l00j69J82M9K68m43j60K10J35m97P13Qj55J9J51J28k10l95L05P7n93
$$ plain form
2979 -483 372 -29 48 -367 83 258 -212 293 -174 43 20 -144 48 121 -85 -157 310 228 -172 -215 346 573
3001 573 -265 -97 -69 -71 287 555 -212 -229 -165 93 -65 -87 -132 90 -543 -523 -368 64 140 191 -135 -219 115 -249
3025 -249 408 209 -9 -442 448 -653 -449 -120 -29 175 -471 -83 -260 692 -326 91 532 -128 112 108
3045 108 240 87 -24 -18 -354 -119 42 364 26 265 134 -123 373 -37 355 16 79 194 136 163 36 -249
3067 -249 -20 -216 72 -280 -74 75 40 133 82 -15 216 134 775 -174 -210 -270 135 -64 -2 176 -137 -86 179
3090 179 348 -58 -405 193 -419 -20 -101 89 489 171 64 359 129 70 131 -300 -278 -329 558 227 -93 -588
3112 -588 -247 -149 102 -42 87 382 237 -8 299 -451 472 -387 -79 -132 -400 483 387 306 80 -278 -404
3133 -404 -269 -344 -350 -118 -210 -72 -232 -64 64 29 155 -398 27 358 282 -100 -456 177 -176 -124 -226 102
$$ packed form
2979d83Q55m01P7m15M50J75m70N05m67K17k3j64J92P3k06p2M67q2m00m3N61K27
3001E73q38J68K8kL58K68p67j7O4K58j58k2m5K22o33K0J55M32P6N1l26q4L34l64
3025b49O57j99k18m33Q90j101K04L29R1K04o46L88j77R52j018M17M41o60K40m
3045A08J32j53j11Ol36K35J61L22l38K39j31k57M96m10L92l39O3J15n8K7j27k85
3067b49K29j96K88l52K06J49l5R3n1r7K31q2O41r49l6o0M05j99O2J78l13N1K65
3090A79J69m06l47N98o12L99q1J90M00l18j07K95k30n9O1m31K2n1Q87l31l20m95
3112e88L41R8K51j44J29K95j45k45L07p50R23q59L08n3k68Q83r6q1k26l58j26
3133d04J35p5oK32r2J38j60J68J28l5J26n53M25L31p6l82l56O33l53N2j02L28
$$ plain form
3155 102 -341 -69 -107 6 32 -180 545 -750 -235 -371 -94 314 -144 -174 -259 -498 133 127 -147 -347 -389 254
3177 254 106 505 -202 -69 391 475 461 79 241 -192 148 -57 247 339 92 164 36 208 504 645 -10
3198 -10 54 -223 -210 255 -48 -213 13 138 493 149 351 57 -93 -119 15 -416 47 47 517 99 -201 -223
3220 -223 61 78 -172 -141 -23 332 -158 365 -368 -269 290 -71 388 -283 6 498 160 -43 76 337 -273
3241 -273 -288 -45 460 -62 72 -59 442 13 185 -392 -316 129 -375 2 248 -361 351 318 -121 69 348
3262 348 -52 31 96 356 115 -223 -259 -175 337 -191 -204 -125 -347 47 -276 -72 400 -70 335 184 447 64
3284 64 512 234 -155 -34 205 223 88 199 181 -344 -89 362 -172 -36 -224 136 182 183 -93 104 -85 -188
3306 -188 60 126 92 -303 -145 -90 -347 346 85 -61 26 99 296 218 262 196 -496 -193 -87 42 395 5 -42
$$ packed form
3155A02m43K72l8J13K6k12P25j295N15j36K77M08m58l0q5k39O31ok74k00m2O43
3177B54j48L99p07J33M60Q4j4l82J62m33L40k05L04R2k47P2j28J72K96J41o55
3198a0O4k77J3M65l03j65K26J25L55l44K02k94j50k6J34m31M63%M70m18l00k2
3220b23K84J7k50L1J18L55m90N23p33R9N59l61M59o71K89M92l38k03J19K61o10
3241b73j5K43N05n22J34j31N01m29J72n77P6M45n04L77K46o09P12l3m39J90K79
3262C48m00Q3O5K60k41l38l6Q4N12n28j3P9k22L94l23K04M72m70M05j51K63l83
3284F4M48k78l89J21K39J8j35J11j8n25K55M51n34J36j88L60M6Jk76J97j89j03
3306a88K48O6l4l95J58N5k57O93k61j46Q7P3J97p8M4o6o92L03J06J29L53l90m7
$$ plain form
3329 -42 195 269 -242 580 207 164 111 -142 21 -249 100 108 222 196 -388 81 -146 -397 75 -413 -689 -150
3351 -150 107 -133 -164 -8 109 172 -116 -412 -58 526 -263 -3 -486 -86 -19 -305 96 8 12 -288 9 259
3373 259 -98 25 228 -311 295 319 117 291 12 -109 138 -14 -288 215 -479 415 -131 71 -354 129
3393 129 -172 748 102 -217 92 280 -81 218 131 27 46 -238 -94 141 -160 -180 562 -573 -175 216 -93
3414 -93 -103 -93 117 -86 305 -57 -128 22 550 -131 57 250 -355 -311 -278 202 277 340 -459 -102 568 80 -256
3437 -256 445 -53 -345 -85 -418 125 55 -118 44 -134 63 311 54 -89 -495 204 152 49 407 -377 -158
3458 -158 164 413 -107 -71 57 -198 -153 348 213 -119 73 181 400 -537 42 153 286 -125 -15 -93 -133
3479 -133 334 -87 -84 -358 -65 193 475 -99 30 292 -230 -215 211 34 15 266 250 240 -91 324 -427 -339
$$ packed form
3329d2K37P4n11Q22l73m3n3k53J63k70L49QJ14k6n84M69k27k51M72m88k76N39
3351a50K57k40l1J56J17O3k88k96L54N84p89K60m83M00O7k86M01q8Ml00K97K50
3373B59l57J23K03n39O06K4k02J74k79j21K47j52k74N03o94Q94n46K02m25M83
3393A29l01R20o46l19L09J88l61K99q7j04J9k84J44K35l01k0P42j135L98L91l09
3414i3j0J0K10k03L91l62p1J50N28o81J88J93o05M4L3M80P5O3p99L57O70m88l36
3437b56P01m98k92K60l33N43p0j73J62j78J97K48k57j43m06O99n2j03L58p84K19
3458a58L22K49n20L6J28k55M5N01j35l32J92J08K19r37N79J11J33m11J10p8m0
3479a33M67m21Lk74K93K58K82n74J29K62n22J5M26j77j9K51j6j0l31M15p51Q8
$$ plain form
3501 -339 -88 -168 -334 -53 94 -129 -246 -219 478 -51 47 -268 68 -203 285 -40 183 81 342 76 -420
3522 -420 -46 57 159 485 -250 -27 86 -247 261 188 -346 112 273 -155 -275 -29 -43 292 91 -259 -98
3543 -98 -75 104 116 -255 -242 140 -120 -470 379 36 278 99 9 -182 -292 186 426 2 -29 124 52 41 294
3566 294 -44 333 199 235 -52 -514 -254 263 -22 167 -230 -149 310 77 318 27 -264 -357 72 -82 213
3587 213 -157 -70 -31 25 -226 -87 -309 352 -6 277 -115 -94 -250 -84 671 446 -191 147 12 90 -103 98
3609 98 -239 100 -21 534 282 45 -283 86 -530 250 15 -250 287 131 166 -243 398 6 -146 -1 181
3630 181 81 188 494 307 -297 -84 151 37 -208 421 58 -40 54 -77 86 -22 50 -189 312 15 -3
3651 -3 42 68 -200 -209 -231 -118 57 152 -92 -130 -75 -279 397 -228 110 2 96 -269 348 53 -25 91 103 0
$$ packed form
3501c39K51q0j66K81J47k23j17K7O97n29R8l15L36k71M88l25K23j02K61k66m96
3522d20L74J03J02L26p35K23J13l33N08p3n34M58J61m28j20K46j4L35k01l50J61
3543i8K3J79J2l71J3L82k60l50Q49l43K42j79r0j91j10M78K40m24l1J53p2j1K53
3566B94l38L77j34L6k87m62K60N17k85J89l97Q1M59k33K41k91k91r3M29j54K95
3587B13l70Q7L9N6k51J39k22O61l58K83l92K1j56J66P55k25o37L38j35P8j93K01
3609I8l37L39j21N55k52k37l28L69o16P80k35k65N37j56L5m09O41l92j52J45J82
3630A81j00J07L06j87o04K13K35j14k45O29l63r8R4j31J63j08P2k39N01k97j8
3651cM5K6k68rk2J13J75R5k44l8N5k04O76o25L38j08R4l65O17k95p8J16J2j03
$$ plain form
3675 0 -182 15 -155 -153 -161 -338 60 386 -209 225 -153 111 77 14 -170 -198 221 203 187 -398 -116 -13 201 0
3699 0 190 -237 70 -29 99 -117 394 -1 -264 251 -37 139 -58 -56 -121 92 -57 -246 -485 246 7 133
3721 133 -134 256 164 425 333 -8 418 302 41 -14 48 -467 -218 234 -648 -89 -192 361 391 -142 214 -25
3743 -25 -100 186 156 61 -353 -348 83 -105 36 134 149 -5 42 109 381 -31 333 -192 34 -98 451 62 -251
3766 -251 270 184 -1 350 -354 145 106 -326 182 3 -227 -203 136 279 339 -366 182 -338 -100 -630 195
3787 195 362 68 -159 628 -45 142 -162 -81 260 -472 170 -24 201 384 253 -121 166 172 17 -56 378
3808 378 -195 -111 -112 123 -13 -139 -317 296 -487 -13 179 -347 -376 260 -171 18 -53 228 -416 304 -242 -137
3830 -137 64 -286 101 -59 -280 285 -127 -107 239 -84 -221 -241 172 -274 116 -364 227 259 -60 86 226
$$ packed form
3675@j82J97j70Kqj77L98L26n95M34l78K64l4o3j84k8M19j8j6n85K82J03K14k01
3699@J90m27L07r9J28k16N11l95k63N15k88J76j97Ko5K13j49j89k39P31k39J26
3721A33k67L90r2K61r2l41M26j16k61n5O2n15K49M52q82N59j03N53L0n33L56k39
3743b5p5K86l0r5m14NM31j88J41R8J5j54M7O7K72m12L64n25K26j32N49l89l13
3766b51N21q6j85L51p04M99l9m32N08j79k30K4L39J43O0p05N48n20K38n30Q25
3787A95J67k94k27P87o73J87l04Q1L41p32O42j94K25J83j31l74K87Oj55p3M34
3808C78n73Q4jK35j36j26j78O13p83M74J92n26k9O36m31J89p1K81o44P20n46J05
3830a37K01l50L87j60k21N65m12K0L46l23j37k0M13m46L90m80N91L2l19J46J40
$$ plain form
3851 226 103 -11 221 -132 -464 -174 -351 309 179 34 -366 -203 97 -302 -150 -238 52 -463 286 -203
3871 -203 -21 -181 -280 196 -442 -9 69 -18 8 -345 -91 -276 -440 -26 133 -346 -161 262 428 387 303 225
3893 225 -70 -230 -193 -280 11 -180 -11 -246 -101 92 85 -70 -230 -78 -35 -25 -123 121 7 385 72 115 33
3916 33 -364 640 70 21 -496 276 184 265 568 48 -224 511 53 -361 107 218 -92 -2 179 -43 -342
3937 -342 30 -365 -267 -28 66 211 -82 144 -32 -191 321 -152 431 -283 -372 75 86 231 -187 207 61
3958 61 148 -19 -90 53 5 -199 -383 -14 445 -182 204 164 27 210 147 -76 68 182 -422 -680 184 -347
3980 -347 -342 156 -536 189 -133 -429 -327 83 -496 350 -436 -87 -153 251 -14 -39 -375 -285 -566 -169 -358 -162
4002 -162 251 -243 -334 -57 -220 586 -385 -58 -107 -39 227 -58 336 -118 -217 -31 -319 244 -95 596 7
$$ packed form
3851B26j23j14K32l53l32K90j77O60j30j45m00J63L00l99J52q8K90n15P49m89
3871b03J82j60r9M76o38M33P8q7K6l53K54j85j64M14J59m79J85M23J66m1q4p8
3893B25k95j60L7q7K91j91J69k35J45J93pj55j60J52M3J0r8K44j14L78l13M3q2
3916C3l97J004n70m9n17P72r2Q1L03n20k72P35m58m14M68J11l10R0J81k22k99
3937c42L72l95R8K39R4J45k93K26j76j59N12m73N83p14q9M47J1J45m18L94j46
3958F1Q7j67p1J43m8k04j84L69M59o27L86m0j37J83o3k23J44J14o04k58Q64n31
3980c47NM98o92P25l22k96J02M10n79Q46p86L49o6M04k65k5l36R0k81L97j89J96
4002a62M13m94r1K77j63Q06r71L27m9O8K66k85L94m54r9J86k88N63l39O91n89
$$ plain form
4023 7 221 -215 -88 241 -70 114 23 -193 365 -191 272 201 169 474 -154 37 -97 218 71 -349 -47 -15
4045 -15 276 395 528 -206 -58 -550 51 -291 367 214 -123 24 -7 -337 -22 115 100 202 10 41 253
4066 253 33 -268 407 233 191 172 249 -133 -164 148 32 537 -115 348 -54 580 258 173 -87 280 -288 -88
4088 -88 -161 137 540 -79 -286 -43 -105 -106 -2 118 260 98 49 -385 -52 304 143 129 246 295 -75 -41 -318
4111 -318 158 -141 -38 240 355 83 -22 182 -14 140 400 -79 -141 2 -442 -9 -173 341 179 -101
4131 -101 -219 357 -45 -297 89 221 117 68 66 64 279 -147 192 118 79 316 -187 429 294 325 -77 -620 539
4154 539 -186 199 259 -124 -338 -71 40 -251 -363 -114 87 -410 397 339 378 264 -356 16 336 -123 60
4175 60 -45 260 -84 315 -73 -291 249 296 -154 318 -39 285 209 63 -300 -497 50 114 518 -35 240
$$ packed form
4023GK14m36J27L29l11J84r1k16N58n56M63p1l2L05o28J91j34L15j47m20L02L2
4045a5K91J19J33p34J48m92O01l42O58j53l37J47l1l30L15J37j5J02j92L1K12
4066B53k20l01O75j74m2j9P7l82l1L12j16N05o52M63m02O34l22q5k60L67n68K00
4088h8p3K98M03o19k07K43o2jJ04J20J42j62m9m34L33L56j61j4J17M9l70L4k77
4111c18M76k99J03K78J15k72j05K04j96J54K60m79o2J43m44M33j64N14j62k80
4131a01j18N76m02k52L86J32j04m9kkK15m26L39p4l9K37n03O16j35L1m02n43J159
4154E39p25L85O0l83k14K67J11k91j12K49K01m97Q07n8L9j14o20L72L20m59J83
4175F0j05L05l44L99l88k18N40M7m50M72l57L24p6j46l63j97N47O4M04n53K75
$$ plain form
4196 240 79 135 163 90 197 -42 -146 -782 231 132 181 -145 122 -284 -244 514 -343 -126 354 -19 -283 499
4218 499 113 -194 -241 -116 121 -70 -114 261 245 -64 363 315 -229 -206 -392 -253 69 15 91 243 340 -29 -12
4241 -12 -232 167 -95 119 -719 -103 76 -297 -433 22 278 -554 205 235 228 332 57 96 206 111 201 -31
4263 -31 496 -182 -21 176 -732 25 338 -176 -141 -137 -176 -369 -122 545 -338 -163 -549 16 238 -16 55 391
4285 391 354 215 152 28 -438 -466 -97 -131 -377 -119 208 -446 282 -92 203 -485 -147 50 -446 202 253 -29
4307 -29 300 247 -201 49 570 212 237 -287 -250 180 -148 -90 175 564 55 187 252 -118 -95 215 -293 133
4329 133 33 102 74 196 264 41 48 -9 -184 463 276 -71 63 -401 25 154 -147 237 -217 -116 674 144
4351 144 607 314 -227 56 -196 73 102 -471 5 -365 -285 128 56 108 -87 185 144 7 -491 107 -414 154
$$ packed form
4196B40j61N6K8p3J07k39j04o36J013r9M9l26K67m06M0P58q57K17M80l73k64P82
4218D99l86l07m7J25K37j91m4L75j6l09M27m8n44K3j86J39L22n4P6J52R7l69J7
4241a2k20L99k62K14q38O16J79l73j36M55K56q32P59L0pJ04k75L9J10r5R0k32
4263c1N27o78J61J97r08P57L13n14L5Ml9j93K47O67q83J75l86N65K22k54P1L36
4285C91l7j39o3j24m66k8L69l4k46K58L27o54P28l74K95o88L38J97m96O48N1k82
4307b9L29n3m48K50N21l58K5n24L7M30l28N8K65L89n09J32O5l70K3L10n08M26
4329A33j00O9k8J22O8k23Pn7j75O47j87l47J34m64M26J29l01L84m54J01P90n30
4351A44M63k93n41K83k52K69K9n73M76l70Q0M13p2N2j95K72m1j37m98N98n21N68
$$ plain form
4373 154 329 -31 -281 -349 -31 402 -221 123 52 -107 127 -462 327 -658 172 70 -236 131 -225 -363 -24
4394 -24 -433 -100 -28 -8 -32 243 39 -37 -202 105 -190 38 48 430 -468 -3 177 105 352 69 -233 -41
4416 -41 -327 -225 166 261 -52 42 173 -186 -284 123 152 366 176 171 356 77 117 -168 52 130 172 179 20 -255
4440 -255 -254 -30 236 -152 -410 93 -344 -326 149 -27 -304 -242 -52 37 -266 209 -150 -431 -211 -219 -242 -266 -324
4463 -324 338 -310 -291 243 94 294 -89 140 337 54 22 196 82 -86 107 271 27 -641 -49 211 275
4484 275 -453 -164 309 -59 -203 83 -159 392 210 -117 144 -242 -298 317 419 -194 -238 -113 244 168 129
4505 129 142 63 209 23 -141 126 -19 -269 139 -30 -448 198 -147 -12 -56 1 -10 242 430 195 -507 254
4527 254 113 -113 -125 108 -303 267 -136 151 291 480 154 -86 -312 -99 -160 -169 531 -181 188 -139 138
$$ packed form
4373A54J75l60k50o8L18M33o23L44p1j59K34n89P89r85Q30j02l06L67l56j38L39
4394b4m09L33P2K0k4K75k04p6j65L07k95K28J0L82q98M65J80p2K47k83l02J92
4416d1k86J02L91R5l13R4J31l59r8M07K9K14j90nJ85k79M0k85K20P8M2Pj59k75
4440b55JK24K66l88k58N03m37J8M75j76k77O2J90Q9l03M75l59k81K20qk3k4n8
4463c24O62o48J9N34j49K00l83K29J97k83l2J74j14j68J93J64k44o68N92K60O4
4484B75p28K89M73l68j44K86k42N51j82l27K61l86n6O15J02o13m4J25L57p6l9
4505A29J3p9J46j86j64K67j45k50M08j69m18O46l45J35m4N7j1K52J88k35p02P61
4527B54j41k26j2K33m11N70m03K87J40J89l26k40k26K13o1rP00p12L69l27K77
$$ plain form
4548 138 -6 -386 -232 30 -35 584 585 86 -64 48 -468 518 -139 28 -189 427 221 41 103 563 310
4569 310 -247 -76 283 -669 269 -309 -328 231 -157 165 59 217 165 198 72 -211 399 46 -213 33 -546
4590 -546 -117 634 -378 63 -131 87 127 -118 -392 217 -315 161 487 409 528 -541 724 -51 49 104
4610 104 -618 -10 264 186 -166 -49 212 -273 535 123 -49 158 249 643 -33 112 280 116 137 -282 -16
4631 -16 68 286 -184 -34 481 213 112 273 70 218 145 242 -53 -36 -327 -274 44 63 -33 197 -332 148 -11
4654 -11 384 -196 -375 450 76 40 -213 -360 326 87 -233 380 -100 132 94 -30 261 48 -411 423 -288
4675 -288 563 112 89 470 -137 -65 62 -118 328 -475 -79 370 -25 23 474 -184 406 3 -313 175 216
4696 216 -410 -225 -69 306 -153 -164 8 466 347 -165 299 -106 -173 218 104 -387 -128 -141 215 -322 733
$$ packed form
4548A38j44l80J54K62o5O19Jm99j50J12n16R86o57J67k17O16k06j80O2M60k53
4569C10n57J71L59r52R38n78j9N59l88L22j06J58n2L3j26k83O10l53k59K46n79
4590e46M29P51j012M41j94K18M0k45k74O09n32M76L26p8J19j069J265p75J00N5
4610A04p22O08K74p8l52J17K61m85Q08m12j72K07R1L94o76J45J68j64K1m19K66
4631a6Q4K18m70J50N15k68j01J61k03J48p3R7k95J7k91N3L18J9r6K30n29M80j59
4654a1L95n80j79Q25l74l6k53j47O86k39l20O13m80K32l8j24K91k13m59Q34p11
4675b88Q51m51k3L81o07P2J27j80M46q03L96M49l95M8M51o58N90m03l16M88M1
4696B16o26J85J56L75m59j1J72M58j19n12M64m05o7L91j14m91K59j3L56n37J055
$$ plain form
4717 733 313 -372 92 -648 85 -343 79 -221 -222 -376 -367 -51 -268 -223 113 -99 170 439 -158 204 194 152
4739 152 130 -356 148 -138 -146 249 -41 -271 -436 276 60 -179 -451 161 -61 -162 -64 -31 2 -46 -299 -64
4761 -64 92 -243 18 513 -513 77 -247 -99 -14 126 -287 -239 -147 370 -178 58 11 -153 -211 -117 -430 40
4783 40 455 -112 27 318 -94 -179 118 -482 360 -127 149 24 -8 -204 235 -55 -168 -381 282 0 218
4804 218 241 -72 314 -212 60 -294 120 265 -27 87 -156 86 -287 -76 -6 227 30 68 -188 -3 70
4825 70 342 -97 226 -273 -297 118 286 516 170 17 -11 374 208 266 72 14 116 601 191 -18 -25 101
4847 101 93 90 -80 -412 112 407 -6 -170 374 -147 -72 -359 161 -275 -450 -116 -416 -631 10 486 -86 99
4869 99 -477 -266 -751 125 -47 577 -39 -71 495 -68 210 353 2 -292 320 -162 300 -75 -28 298 -217
$$ packed form
4717G33m20o85M64p40P33m28M22l00jj54RL16k17M5L36k12K69K69n97L62j0m2
4739A52k2m86N04k86qL95k90k30j65P12k16k39k72O12k22j01R8L3L3m8k53K35
4761f4J56l35K61M95j026N90l24J48Q5J40m13M8R2N17n48K36m7j64n8R4l13M70
4783D0M15n67J39K91m12q5K97o00Q42m87K76j25l2j96M39k90j13k13O63k82K18
4804B18K3l13L86n26K72l54M14J45k92J14k43K42l73K11P0K33j97L8k56J85P3
4825G0K72m39L23m99k4M15J68K30l46j53k8L85j66N8j94n8J02M85m10k09pJ26
4847A01qlj70l32N24K95m13j64N44n21P5k87N20m36j75L34l00k15O41M76n72J85
4869I9n76K11m85Q76j72O24o16l2N66n63K78J43l51k94O12m82M62l75M7L26n15
$$ plain form
4890 -217 -48 69 192 -624 329 269 -118 -111 81 -392 73 -35 475 -338 -445 104 -175 -100 292 -536 281
4911 281 763 -305 119 92 -124 -88 -535 88 -330 -359 -437 48 -141 -4 186 278 -37 15 58 270 120 126 -84
4934 -84 447 -155 205 -199 48 -227 -304 257 342 268 576 146 21 -126 316 150 -37 -86 428 -295 216 -560
4956 -560 282 566 -177 5 -443 6 -255 -266 -375 116 103 252 -9 -15 -296 374 -265 -271 18 419 -72 46
4978 46 -396 511 -200 -59 -12 -378 483 -14 36 275 48 -68 -499 152 188 -229 -17 -67 361 3 101 -151
5000 -151 -31 406 -457 -114 83 470 632 -75 -3 -77 201 596 -277 -303 -290 231 18 -101 -296 151 189 -376
5022 -376 -120 -384 -138 -487 -23 329 47 -80 -61 467 -63 -160 284 -107 -135 -239 222 -322 0 -264 -340
5043 -340 -180 -461 192 -83 -179 118 -3 -342 -185 194 -381 362 -41 -446 -31 -220 -388 316 8 -599
$$ packed form
4890b17J69J17J23q16R53o0l87PJ92m73M65j08N10q13j07N49k79P5L92q28Q17
4911B81M82j068M24k7k16L6m47O23m18k9p8M85j89J37J90R2l15N2M3K12j50Ok10
4934h4N31o02L60m04K47k75p7N61Q5p4L08m30j25j47M42j66j87m9N14p23N11p76
4956e60Q42K84p43J82m48M49k61j1j09M91j3J49k61ok81O70o39oK89M01m91J18
4978D6m42R07p11J41M7l66Q61m97N0K39k27j16m31O51L6m17K12n0M28l58R8k52
5000a51J20M37q63L43J97L87J62p07P2p4K78L95q73k6J3N21k13j19j95M47L8n65
5022c76K56k64K46l49M64L52k82j27J9N28n30r7M44l91k8j04M61n44L22k64p6
5043c40J60k81O53k75r6K97j21l39J57L79n75P43m03m05M15j89j68P04l08o07
$$ plain form
5063 -599 -77 283 -62 322 20 180 -28 -228 -78 -79 170 -264 -112 121 511 267 488 271 -489 -281 -225
5084 -225 138 -49 280 -95 -375 -129 20 2 340 -303 -366 305 -28 445 -142 -204 -30 85 -273 281 -663
5105 -663 -233 136 -533 -84 59 -69 -269 232 111 -201 388 78 -110 -62 55 -265 -59 280 -485 500
5125 500 -17 184 53 -124 -276 -502 53 -8 314 -342 294 -55 90 160 -559 -118 -30 -193 -208 -367 -125
5146 -125 233 168 196 -101 -55 203 -46 -141 252 131 360 4 -320 -201 -101 130 -90 10 397 356 -361 95
5168 95 55 -66 -320 -145 -66 96 135 -227 149 -212 -164 -8 249 396 -219 -76 101 60 -34 81 -221 347
5190 347 134 -51 -161 239 -5 -206 122 445 265 -257 81 332 -269 332 87 -428 42 -157 -349 -185
5210 -185 15 304 251 36 -457 183 -78 167 -66 135 54 -23 321 628 -9 481 -292 -339 -324 194 1 275
$$ packed form
5063e99N22L60l45L84l02J60k08k00J50jK49m34J52K33L90k44K21k17p60K08N6
5084b25L63j87L29l75k80K46J49j8L38o43o3O71l33M73n87o2J74J15l58N54r44
5105f63M30L69o69M49J43j28k00N01j21l12N89l10j88M8J17l20K06L39p65R85
5125E00n17K01j31j77j52k26N55o1L22o56O36l49J45P0p19M41Q8j63j5j59K42
5146a25L58o5K8k97M6K58k49r5L93j21K29l56l24J19J00K31k20J00L87m1p17M56
5168I5m0j21k54J75P9J62L9l62L76l61M8J56K57J47o15J43J77m1r4J15l02N68
5190C47k13j85j10M00k44k01L28L23j80n22L38K51o01O01k45n15M70j99j92J64
5210a85K00K89n3k15m93O40k61K45k33K01q1p7L44L07o37M90p73m7J5N18j93K74
$$ plain form
5232 275 250 354 43 -314 -171 46 -340 -156 164 -37 3 -31 127 31 118 -244 195 -644 231 454 -326 -125
5254 -125 -77 -108 -146 503 -255 -6 -142 92 -408 -212 669 397 -58 312 -20 375 -178 -201 200 -283 76
5275 76 276 -646 -74 250 -394 -181 -39 -61 -271 -449 310 -231 96 156 140 211 337 -147 -41 110 -317 -238
5297 -238 -88 221 151 222 77 200 -17 -22 499 -85 53 -3 189 177 189 34 -298 -449 -349 -29 725 -427
5319 -427 63 -101 236 -231 -129 -182 139 210 220 -178 124 -88 -30 -92 -168 200 452 109 -271 21 -441 68
5341 68 529 -29 210 443 -41 -187 -465 -79 -226 -128 -186 -2 4 165 222 220 -201 -658 -113 -317 172 127 -115
5364 -115 -372 231 -65 246 140 240 57 -101 220 188 417 -114 130 -265 184 140 -35 205 118 -295 182
5385 182 186 -60 -449 339 -42 98 -392 -288 -126 -58 208 131 -470 -254 -262 -97 -502 53 180 58 427 -36
$$ packed form
5232B75k5J04l11l57J43K17l86J84L20k01M0l4J58r6Q7l62M39q39Q75K23p80K01
5254a25M8l1l8O49p58K49j36K34n00J96Q81k72m55L70l32L95n53k3M01m83L59
5275G6K00r22N72L24o44K13J42k2k10j78P59n41L27O0j6P1J26m84J06J51m27P9
5297b38J50L09p0P1j45J23k17nN21n84J38n6J92j2J2j55l32j51J00L20P54j152
5319d27M90j64L37m67J02n3L21P1J0l98L02k12N8o2p6L68K52l43l80K92m62N09
5341F8M61n58K39K33m84j46k78L86j47R8n8J84OJ61N7km21m57N45k04M89m5k42
5364a15k57O03k96L11j06J00j83j58L21l2K29n31K44l95M49m4j75K40q7m13M77
5385A82Mk46l89P88l81J40m90J04J62O8K66p7o01K16qJ65m05N55J27j22L69m63
$$ plain form
5407 -36 306 379 184 73 -38 196 -174 -63 295 -2 334 210 78 865 125 271 -404 405 340 268 -11
5428 -11 -28 -172 333 269 -83 -500 -100 65 -177 78 -284 -125 616 -209 245 -329 19 21 63 285 -209 489
5450 489 151 132 -301 194 144 299 126 85 105 21 -254 335 428 209 -314 -176 -24 95 -47 238 184 -140
5472 -140 174 343 123 41 -158 187 563 18 -77 53 325 -422 -114 353 314 -369 346 398 140 203 78 173
5494 173 329 -70 -220 -59 -18 186 73 179 128 238 -196 -32 -224 178 -95 -118 443 -318 -108 5 269
5515 269 -84 346 -203 -93 -283 275 -42 247 -386 -81 -161 -52 94 63 -141 -23 -711 -263 -128 161 79
5536 79 87 -296 -276 -339 229 119 -179 14 -26 349 -93 105 -63 -163 -67 -85 30 -60 20 16 124 -221 183 373
5560 373 -104 -144 -93 -314 -67 179 -599 338 -57 -475 -241 -319 250 -92 -248 101 109 209 19 21 117 100 -322
$$ packed form
5407c6L42P3j95j11j11K34l70J11L58k97L36j24j32P87p40J46o75Q09o5p2k79
5428a1j7j44N05o4l52m17M00J65k42K55l62J59P41q25M54n74L48KM2K22m94O98
5450D89l38j9m33M95n0J55j73m1K0q4k75N89R3k19n23J38J52J19j42K85n4l24
5472a40L14J69k20q2j99L45L76n45r5J30K72p47L08M67l9o83P15N2k58O3j25R5
5494A73J56l99j50J61M1K04j13J06n1J10m34J64j92M02k73k3N61p61K10J13K64
5515B69l53M30n49J10j90N58l17K89o33L05q0J09J46l1k04J18o88M48J35K89q2
5536G9Ql83K0o3N68j10k98J93m0L75m42J98j68j00R6j8J15r0Q0mJ08l45M04J90
5560C73m77m0N1k21K47K46p78R37l95m18K34p8N69l42j56L49QJ00j90KR6j7m22
$$ plain form
5583 -322 -385 -76 181 45 267 -87 -57 235 -1 -277 -169 -263 -47 195 -2 -117 -365 142 -35 -131 -139 92
5605 92 37 -19 -213 81 -263 -352 332 -226 -11 214 77 -106 -37 140 -385 -312 -105 29 132 -160 232 88
5627 88 269 -269 -367 191 182 -97 387 269 -197 -35 536 -11 -219 -80 364 -144 -654 -4 130 -100 62
5648 62 -313 168 360 140 501 173 146 -399 -173 165 -59 -159 584 25 152 85 -124 139 311 144 -90
5669 -90 140 -6 -7 351 -59 39 359 460 -49 348 -320 286 48 -274 327 12 507 -50 -114 440 -315 287
5691 287 -283 -31 129 26 -11 -128 315 256 50 -48 -136 -132 -277 -577 -173 253 80 -27 12 -204 -155 -56 -111
5714 -111 -19 48 -148 224 167 -225 491 -24 344 -76 40 267 53 -204 126 221 41 247 193 18 127 -79
5736 -79 132 -285 -76 397 388 -434 -161 -348 -261 -218 159 -229 -193 360 -53 135 -437 140 -652 186 22 53
$$ packed form
5583c22o3L09K57j36K22l54L0K92k36k76J08r4K16K42j97j15k48N07j77r6qK31
5605I2n5n6j94K94l44q9O84n58K15K25j37j83O9J77n25P3K07J34J03k92L92j44
5627H8J81n38r8N58rk79M84j18m66J62N71n47k08J39M44n08n10O50J34k30J62
5648F2l75M81J92k20L61l28k7n45K26L38k24j00P43n59J27o7k09K63J72j67k34
5669i0K30j46jL58m10R8L20J01n09L97o68O06k38l22O01l15M95n57o4N54p55O02
5691B87n70K52J60j03l7j17M43n9k06r8q8Mj45l00M04M26j73j07L9k16M9R9n5
5714a11R2O7j96L72n7l92P16n15L68m20J16K27k14k57L30R5j80K06n4j75J09k06
5736g9K11m17K09M73rq22K73j87Q7M3L77l88L6N53m13J88n72N77p92Q38j64L1
$$ plain form
5758 53 247 -301 -25 6 -9 39 337 -154 -16 87 91 -153 183 -255 -141 -170 233 -226 199 232 -313 -276 -334
5781 -334 -175 -207 48 -168 -156 161 -300 309 -243 244 -145 431 225 -86 -76 36 -113 62 98 -267 -296 -250
5803 -250 105 104 219 424 285 -259 218 -51 125 -2 -57 -99 62 31 -136 113 -140 211 268 -382 -568 13
5825 13 -249 -227 -46 -434 -293 -196 112 450 -320 -106 -523 439 225 358 -123 410 -115 171 296 -31 276
5846 276 58 54 120 10 320 225 349 -190 -107 -33 -4 382 -191 -320 -80 122 -116 -167 -270 -294 233 255 22
5869 22 -9 83 183 -113 -28 365 -376 129 312 538 -62 139 172 -170 181 29 131 -568 54 616 -241 481
5891 481 43 -48 202 331 31 -510 107 204 107 -12 -481 -119 -23 23 -169 -925 393 168 -56 64 -128
5912 -128 -65 430 -24 204 -95 -188 -451 501 182 117 -246 47 6 -139 218 390 -202 -58 343 -333 -194
$$ packed form
5758E3J94n48K76L1j5M8K98m91J38J03Mk44L36m38J14k9M03m59M25L3n45L7n8
5781c34J59l2K55k16J2L17m61O09n52M87l89N76k06l11J0J12j49J75L6l65k9M6
5803b50L55jJ15K05j39n44M77k69J76j27n5m2J61l1j67K49k53L51N7o50j86N81
5825A3k62K2J81l88J41R7L08L38p70K14m17R62k14J33m81N33n25K86J25l27L07
5846B76k18mO6j10L10r5J24n39Q3P4K9L86n73j29K40K02k38n1j03k4N27K2k33
5869B2l1R2J00k96Q5L93p41N05J83K26o00K01L3l42L51j52J02o99O22N62q57P22
5891D81m38r1K50J29l00n41O17R7r7j19m69L62R6M6j92p56J318k25k24J20j92
5912a28O3M95m54K28k99r3k63R52l19o5l63K93m1j45L57J72n92J44M01o76J39
$$ plain form
5933 -194 211 221 215 69 -35 -214 -192 214 -256 -59 -247 -53 -191 78 296 189 -219 -335 25 68 186 80
5955 80 133 -131 210 299 -264 -67 -122 400 354 -162 112 12 -115 -372 -351 -56 -92 -129 -282 -97 -39 -139 305
5978 305 -325 242 -493 56 265 -103 321 -42 462 299 247 275 -110 -510 285 318 153 162 7 211 280 -24
6000 -24 -20 28 -526 102 64 118 -336 -63 159 -167 -586 590 -434 -409 265 23 100 41 -136 -23 85 -328
6022 -328 31 -170 452 -247 -98 16 531 -289 -212 -131 299 -150 -589 -67 -140 123 -351 128 -178 181 -417
6043 -417 -340 -247 -368 135 -48 370 140 -144 329 -8 -341 298 435 0 125 -20 101 454 -40 -99 130
6064 130 -93 27 518 249 -398 46 481 23 -38 83 586 -186 187 -145 -39 -87 -30 -19 114 -155 219
6085 219 -84 -55 285 182 -124 -199 -285 243 64 -151 267 91 31 -224 -121 392 -44 21 19 183 239 -13 -336
$$ packed form
5933a94M05J0oj46j04j79K2M06m70J97j88J94j38K69K18j07m08j16L60M3J18j06
5955H0N3k64L41Q9n63J97n5N22m6n16K74j00j27k57K1K95l6l7j53J85N8j00M44
5978C05o30N67p35N49K09l68M24l63N04j63n2K8l85m00P95L3j65Rj55K04O9l04
6000b4MM8n54O28l8N4m54K73K22l26m19J176j024K5O74k42P7n9j77J13J08m13
6022c28L59k01O22o99J49J14N15q20P7Q1M30m49m39N22p3K63m74M79l06L59n98
6043d17P7R3j21N03j83M18k30k84M73l37l33O39J37m35J25j45J21L53m94n9K29
6064A30k23J20M91k69o47M44M35m58o1J21N03p72L73l32J06m8N7J1J33k69L74
6085B19l03K9L40j03l06p5q6N28j79k15M18j76o0k55J03N13m36O5kJ64N6k52l23
$$ plain form
6108 -336 195 -34 190 147 204 2 67 93 -94 188 106 -118 237 91 -136 -44 -87 7 -178 -338 18 15 -386
6131 -386 14 204 -22 -109 213 -17 -172 -322 266 -520 29 51 -367 -106 278 109 -168 83 272 -131 -209
6152 -209 338 -444 394 221 218 -332 -470 226 -43 -252 114 -150 -273 186 233 -115 -425 -45 -317 291 -184
6173 -184 -202 -42 52 -135 163 263 -328 -169 -56 502 -277 331 399 299 189 19 56 293 21 -50 130 6
6195 6 -306 233 295 -389 139 202 141 -126 -371 -350 -303 604 -144 300 7 70 -29 125 185 249 -40 32 411 -171
6219 -171 -367 -154 131 52 29 -646 85 -232 -114 200 427 22 -236 149 7 -49 33 -212 -122 38 119 89
6241 89 -48 449 -195 245 75 120 486 206 154 264 51 24 -190 62 266 404 -238 71 425 -248 585
6262 585 -45 268 291 9 -196 -155 241 -333 220 -175 -318 -117 -272 23 214 62 101 347 -213 489 437
$$ packed form
6108c36N31k29K24m3N7k02O5K6j87K82q2k24L55j46k27R2m3R4j85j60L56lm01
6131c86M00J90k26q7L22k30j55j50N88p86N49K2m18K61L84j69k77K51J89m03p8
6152b09N47p82Q38j73ln50j38O96k69k09L66k64j23M59M7l48l10L80k72O08m75
6173a84j8J60R4j87K98J00n91J59J13N58p79O08O8j00j10j70L7K37k72p1J80j24
6195Fl12N39O2o84N28O3o1k67k45K1M7R07p48M44k93O3r9J54O0O4k89P2L79n82
6219a71j96K13K85p9k3o75P31l17J18L14K27m05k58L85j42n6Q2k45R0J60Q1l0
6241H9j37M97o44M40j70M5L66k80n2J10k13k7k14K52K04J38o42L09L54o73Q33
6262E85o30L13K3k82k05M1L96n74N53l95j43K01j55K95J91j52L9K46n60P02n2
$$ plain form
6283 437 93 36 -357 -11 365 171 535 -314 38 158 -171 206 -63 -183 -64 -259 277 182 -220 247 116
6304 116 -423 -230 -348 -225 227 48 -38 121 450 399 -7 279 400 20 -56 122 469 107 628 -3 -153
6325 -153 -212 102 46 38 130 443 687 -414 -160 -64 63 41 -235 -326 101 98 -40 40 -131 97 -233 241 -260
6348 -260 -32 351 116 -165 -454 -423 108 -505 -166 41 82 215 -61 -458 -433 -277 19 126 347 -158 112
6369 112 186 -160 -191 -371 62 -130 736 -391 238 -105 18 263 -66 -218 -222 20 -68 92 103 -431 -250 -255
6391 -255 205 57 350 -189 -141 -49 121 -187 103 -89 -205 1 259 -48 524 199 153 -75 -59 -279 -295 -109
6413 -109 193 16 232 416 9 -460 -243 242 17 -401 -100 143 175 2 258 -127 370 -307 -100 60
6433 60 -266 -297 -174 -597 -311 -40 194 -27 486 -102 29 -280 329 58 33 481 -474 72 -16 367 8
$$ packed form
6283D37l44n7l93L46L76j94L64q49L52J20l29L77k69j20J19j95N36r5m02M67j31
6304A16n39J93j18J23M52j79q6J59L29n1m06K86J21l80p6J78L47l62N21o31j50
6325a53n9L14n6qR2L13K44j101K54R6J27k2k76r1M27lj38Q0j71K28l30M74n01
6348b60K28L83k35k81k89L1N31o13L39K07M1J33k76l97K5J56K96J07K21n05K70
6369A12P4l46l1j80M33j92Q66j127O29l43J23K45l29j52mK42q8J60J1n34J81n
6391b55M60j48K93n39M8R2J70l08K90j92j16K06K58l07N72l25m6k28J6k20j6J86
6413a09L02j77K16J84m07m69K17M85k25m18L01K43L2j73K56l85M97o77K07J60
6433F0l26l1J23m23K86K71K34k21N13n88J31l09O09k71k5M48r55N46q8L83l59
$$ plain form
6454 8 -65 -43 422 228 38 -55 72 -292 150 -43 143 167 -123 260 338 91 160 35 -278 -463 11 -209 137
6477 137 271 -3 350 61 -226 131 275 -359 -47 -277 135 320 547 -297 -188 44 -123 87 73 375
6497 375 -330 122 491 -302 -128 -214 159 442 155 213 -154 138 -120 -224 93 -84 -102 -365 90 180 -92
6518 -92 -207 207 63 -57 186 -239 413 26 224 72 105 392 -66 67 -306 154 148 -69 392 29 -16 84
6540 84 -268 82 125 64 135 64 130 -312 -457 -144 -242 180 589 47 -287 -40 -270 -13 87 103 -14 485 95
6563 95 32 6 265 143 -39 390 -444 392 -32 47 176 101 -4 432 580 29 -209 456 54 153 252 -10
6585 -10 -86 191 -94 263 -201 -269 -389 294 -13 -86 -317 -124 -18 -525 -250 -63 -129 -186 163 17 -127 154
6607 154 358 -484 187 157 -141 100 -206 -203 -317 25 435 -62 -41 561 10 -50 -665 -337 -322 -151 -474 -113
$$ packed form
6454Hp3K2M65j94j90r3J27l64M42j93J86K4k90L83P8k47O9j25l13j85M74k20L46
6477A37J34k74L53k89k87L57J44o34L12k30M12J85K27q44J09K32j67K10j4L02
6497C75p05M52L69p93J74q6L73K83k87N8l67K92k58j04L17j77j8k63M55R0k72
6518i2j15M14j44j20K43m25O52l87J98j52L3K87m58J33l73M60ok17M61l63m5J00
6540H4l52L50M3o1P1p1O6m42j45L13r8M22M09n42l34K47k30K57J00J6j17M99l90
6563I5o3k6K59j22j82M29q34Q36m24P9J29p5j05M36J48n51k38O65m02R9R9k62
6585a0p6K77k85L57m64o8j20O83l07p3k31J93J06n07K75J87o6n7L49j46j44K81
6607A54K04q42O71l0k98K41l06Lj14L42M10m97K1O02n51o0o15L28J5J71l23L61
$$ plain form
6629 -113 12 -85 452 -66 11 -393 596 484 -145 -180 214 176 -395 63 -597 -286 372 -11 -9 -244 598 -78
6651 -78 49 -178 -163 200 43 -101 -215 93 297 -105 153 -243 -70 283 141 -70 357 30 -96 -121 -431
6672 -431 204 50 356 46 -278 605 19 -94 221 555 147 -359 288 -87 -11 -29 83 132 -212 183 -276
6693 -276 46 -44 56 87 51 -301 -339 -197 51 20 99 504 -79 -209 -172 235 187 -211 239 -333 -126 -542 -42
6716 -42 -67 -263 418 -46 48 215 -162 -704 70 -169 305 -156 -436 -67 -329 598 340 277 -134 -242 484
6737 484 57 188 -373 54 -308 92 -104 -95 345 107 -333 151 138 75 -198 -186 -236 -266 151 119 0 -40 -158
6760 -158 79 83 -123 32 199 397 -97 -5 168 567 -576 300 -256 150 -364 105 178 247 -20 -400 -134
6781 -134 55 -109 83 117 270 -338 213 290 215 -63 150 422 16 -619 -413 -111 -280 104 -401 207 -238
$$ packed form
6629a13J25r7N37n18P7m04R89j12o29l5L94l8n71M58o60L11O58l83Kk35Q42o76
6651g8J27k27J5L63j57j44j14L08K04m02K58l96J73L53j42k11M27l27j26k5l10
6672d31O35j54L06l10l24Q83n86j13L15L34m08n06O47l75P6j8J12M9l44L95m59
6693b76L22r0J00L1l6l52l8J42K48l1P9M05n83j30L7M07m8l98M50n72K07m16N00
6716d2k5j96O81m64R4J67l77n42P74k39M74m61k80L69k62R27k58o3m11j08P26
6737D84m27J31n61M27l62M00j96RM40k38m40M84j3o3k73J2n0l0M17l2j19m0j18
6760a58K37Mk06J55J67J98m94R2J73L99j143Q76n56M06n14M69P3O9k67l80K66
6781a34J89j64J92L4J53o08N51P7p5k78K13K72m06o35K06L02j69L84n05O08m45
$$ plain form
6802 -238 26 -151 246 52 79 263 -291 269 -171 196 94 -270 198 -104 129 109 311 -90 -96 241 2
6823 2 -113 70 -9 -404 -67 -77 120 -138 115 -115 3 90 -69 87 194 81 -287 142 -359 59 -314 -33
6845 -33 75 -375 -62 149 120 -141 220 272 254 362 -110 -208 -187 71 311 304 180 74 -129 -47 509 -84 355
6868 355 73 -9 -208 -198 -386 -81 -250 -418 -114 193 -463 408 -25 210 51 167 233 -386 73 137 -498
6889 -498 -87 -128 -20 258 160 37 533 738 46 -135 -137 -453 253 25 -92 318 27 -326 39 158 -92
6910 -92 -8 -266 2 72 113 161 854 -229 392 300 -444 -50 328 59 595 100 -93 396 22 -98 -85 74
6932 74 -60 19 -441 504 -147 -104 385 -136 -59 24 -135 216 737 144 -241 71 -139 214 -103 309 110 -104
6954 -104 -197 -183 113 10 74 285 288 382 91 194 164 38 -84 107 41 -152 225 -2 -75 197 -591 370 191
$$ packed form
6802b38K64j77L97j94K7J84n54N60m40L67j02l64M68l02K33k0K02m01oL37k39
6823Bj15J83p9l95L37j0J97k58K53k30J18Q7j59J56J07j13l68M29n01M18l73K81
6845c3J08m50L13K11k9k61L61N2j8J08m72r8K1K58K40pj24j06k03Q2N56n93M39
6868C55k82q2j99J0j88L05j69j68L04L07o56Q71m33K35j59J16O6o19M59O4o35
6889d98M11m1J08K78r8j23M96K05o92j81kl16P06k28j17M10k91l53L65J19k50
6910i2Q4k58K68P0M1M8O93j083O21r2p44L94L78k69N36m95j93M89l74j20J3J59
6932G4j34P9m60R45o51M3M89n21P7Q3j59L51N21n93l85L12k10L53l17M12j99k14
6954a04r3J4K96j03O4K11LR4k91J03l0j26j22J91o6j93L77k27p3K72p88R61j79
$$ plain form
6977 191 -338 67 -231 69 -137 123 209 -220 692 -62 435 275 -10 -54 16 138 182 18 -13 6 174 150
6999 150 277 116 181 545 -237 -275 309 79 235 145 -19 -161 -8 148 -179 -156 -159 380 260 147 -7 113
7021 113 122 -409 285 12 -343 116 -44 139 -484 -65 198 -171 -288 25 -46 -350 -343 -132 -232 -493 254 -57
7043 -57 -231 -125 -190 439 -4 23 -99 487 -354 -355 -178 124 -387 368 -184 -200 -90 50 49 -110 313 -15 183
7066 183 35 43 220 190 -313 -180 196 135 -178 17 26 55 -275 -336 -47 -233 -139 -99 -386 -136 24 -158 -17
7089 -17 -226 432 -232 330 11 -304 152 -90 171 459 -60 -189 112 518 65 216 -108 411 84 -183
7109 -183 -375 -225 102 292 -241 -184 -104 -13 -238 247 270 -185 392 302 -423 45 -384 151 67 -318 -389 -105
7131 -105 439 -333 79 -58 225 -226 -594 38 521 -74 86 108 -427 232 167 -260 -88 521 -107 -454 0
$$ packed form
6977A91n29M05k98L00k06K60Q6m29R12p54M97j60k85m4P0J22M4j64l1J9J68k4
6999A50J27j61O5L64p82l8N84k30J56r0j64j42J53J56l27K3lN39j20j13j54J20
7021A13Rn31O94k73l55M59j60J83o23M19K63l69j17L13p1l04PK11j00k61P47l11
7043e7j74J06o5O29m43K7j22N86q41jJ77L02n11P55n52j6J10J40jj59M23l28J98
7066A83j48QJ77l0n03J33L76o1l13J95RK9l30o1K89j86R4M0k87K50J60j82J41
7089a7k09O58o64N62l19l15M56k42K61K88n19j29L01M06m53J51l24N19l27k67
7109a83j92J50L27J90n33N7Q0R1k25M85K3m55N77r0p25M68m29N35q4l85p1K84
7131a05N44p72M12j37K83m51l68O32M83n95J60K2n35O59o5m27J72O09o28l47M54
$$ plain form
7152 0 361 126 22 191 29 -397 -23 11 143 218 18 -74 3 52 219 450 -67 -670 43 200 -37 -281
7174 -281 -172 -239 414 93 -64 230 92 212 -129 84 402 -73 82 -269 232 -371 -187 121 221 -43
7194 -43 64 159 156 -177 272 103 -31 65 -536 6 -17 -169 -96 -247 -57 -196 -160 114 192 -54 265 207 223 180
7218 180 -82 101 -24 -109 -559 260 -24 -182 -34 -127 -115 11 561 7 50 -105 247 -304 288 241 -211 89
7240 89 156 235 311 -305 206 143 -85 116 -288 -315 111 287 147 -159 -367 419 -60 518 -212 -17 -139 -113
7262 -113 -344 78 -253 -159 53 -409 -169 323 240 94 265 -141 -265 211 108 -194 -5 -96 -207 -312 241
7283 241 242 -223 341 -26 -56 -141 -318 132 -267 -104 -149 -261 202 7 -16 -1 110 -162 -3 -146 232 384
7305 384 -296 -130 102 8 -325 -45 -88 16 -122 247 -2 -84 -110 -5 260 -396 107 127 202 55 186 116
$$ packed form
7152@L61k35j04J69j62m26L74L4J32P5k00r2P7M9J67K31n17o03P13J57k37k44
7174b81J09o7O53l21j57K94j38J20l41K13L18m75J55l51N01o03J84L08J00k64
7194d3J07R5ll33M49j69j34R6o01N42k3j52P3j51J90j39L6K74P8k46L19n8J6m3
7218A80k62J83j25q5m50Q19k84j58J48r3J2J26N50n54M3j55L52n51N92m7m52L00
7240H9O7P9P6o16N11o3k28K01m04k7M26J76j40l06k08P86m79N78p30J95j22K6
7262a13k31M22l31R4K12m62K40M92q3j46J71m06j24M76j03l02J89r1j11j05N53
7283B41Jm65N64l67l0q5j77M50l99J63m5j12M63j95k3J5J11k72J59j43L78J52
7305C84o80J66K32r4l33K80m3J04j38L69k49q2k6J05K65o56N03K0P5j47J31p0
$$ plain form
7327 116 150 -137 -390 141 -283 -56 45 -198 248 -69 -765 -52 17 -108 82 488 110 218 -176 -115 -304
7348 -304 -173 -97 -425 -151 -48 -113 -168 -447 103 398 -534 199 61 227 44 118 -434 -3 -119 63 70 -116
7370 -116 -55 86 28 136 -104 -74 1 -107 -181 242 271 250 -694 -366 223 97 -456 -424 431 -161 -110 -65 -202
7393 -202 -215 6 -293 137 21 203 185 98 210 -65 296 -95 343 -178 -400 112 -421 43 -641 62 -75
7414 -75 -106 -462 521 -439 185 -145 95 330 -307 -150 240 41 208 34 408 -429 113 55 101 76 430 -43
7436 -43 -284 -84 229 190 112 446 -536 -330 -354 -7 186 -187 17 -588 99 423 106 -47 117 -186 -224 250
7458 250 174 -370 95 195 455 157 -249 -41 314 39 102 -65 -6 112 127 97 320 201 6 471 -259 -88
7480 -88 365 0 -254 31 153 3 -58 142 -51 -241 -74 249 -76 -86 469 303 301 -216 246 455 -98 59
$$ packed form
7327A16L4k87k53N31m24K27J01k43M46l17o96P13O9j25J90M06l78J08l94O1j89
7348c04J31P6l28K74J03o5n5k79N50K95r32P33j38J66j83P4n52M31j16J82Pj86
7370a16O1J41n8J08k40L0P5j08p4M23K9k1r44L28N89j26n53L2Q55n92N1M5j37
7393b02j3K21k99M30j16J82j8q7J12k75L61l91M38n21k22N12n33M64o84P03j37
7414g5l1l56R83r60O24l30K40K35o37J57L90j99J67j74L74q37N42n8M6k5L54m73
7436d3k41K00L13l9p8L34r82K06k4L47J93l73K04o05O87L24l17j53J64l03l8M74
7458B50p6n44M65J00K60k98m06K08L55k75O3j67N9J18J5l0K23j19j95M65p30J71
7480h8M53l65k54K85J22j50o1K00j93j90J67L23l25j0N55j66kn17M62K09n53J57
$$ plain form
7502 59 490 -189 -169 -89 -110 -355 -293 213 -343 -42 444 -77 37 364 279 -430 55 -50 -381 -190 -398 462
7524 462 13 304 -55 254 -166 552 35 -256 260 166 -405 -209 36 140 49 24 -61 -888 336 148 288
7545 288 -36 198 251 322 98 716 56 279 81 4 131 330 -57 -138 -112 59 -393 -50 227 -64 3 891
7567 891 136 -103 -308 -657 -31 167 -23 161 -93 -92 214 467 -112 84 12 -190 -69 744 -81 49 124
7588 124 -262 -39 -60 -25 -90 460 112 177 618 -19 203 -161 98 142 -269 172 -190 454 295 299 -421 -435 -284
7611 -284 -248 36 110 -129 140 20 -66 -170 -18 132 169 -244 180 546 -51 80 248 -444 91 -16 -525
7632 -525 368 84 -190 -298 -232 -87 -28 213 -397 -47 -314 -125 332 415 -62 148 -133 294 -151 -85 33
7653 33 414 -37 281 548 -357 -239 134 249 189 -60 33 310 -212 -207 -249 217 -56 -165 243 -93 -43 3 -421
$$ packed form
7502E9M31o79K0Q0k1k45O2N06n56L01M86n21J14L27q5p09M85j05l31J91k08Q60
7524D62m49K91l59L09m20P18n17k91N16r4n71J96K45J04r1k5q5q27J224j88J40
7545B88l24K34N3P1k24O18o60K23j98p7J27J99l87q1K6J71m52L43K77k91O7Q88
7567H91p55k39k05l49O26J98j90J84k54JL06K53n79J96p2k02J21Q13q25J30P5
7588A24l86K23k1L5o5N50l48O5M41o37K22l64K59M4m11M41l62O44j59Mp20j4J51
7611b84L6K84P4k39K69j20q6j04J52J50L7m13M24L66n97J31J68o92N35j07n09
7632e25Q93k84k74j08O6J45N9K41o10L50k67J89M57Q3m77K10k81M27m45O6J18
7653C3L81m51L18K67r05J18L73J15o0k49R3K77n22Nm2M66k73j09M08l36N0M6m24
$$ plain form
7676 -421 -196 -123 -427 -481 -46 -125 -411 27 -429 256 378 -33 233 -234 -131 -369 -87 318 -140 -287 -264
7697 -264 160 -245 147 155 265 -28 125 -316 177 196 22 -204 -14 -160 198 256 -208 437 214 272 -423 -106
7719 -106 -192 178 122 96 -394 -400 -72 -108 118 -360 -179 242 -268 51 -92 142 -154 -144 -262 -470 23 -237
7741 -237 -403 213 -218 -10 185 -233 135 -2 106 -384 -351 -122 326 207 33 401 -133 -39 -119 198 484
7762 484 -237 172 18 -95 -164 -265 66 7 271 -10 -142 224 -32 -228 -53 212 -165 -319 22 -550 -108
7783 -108 4 -112 86 155 50 152 56 -165 -122 -178 -24 138 358 -228 221 -162 -55 164 60 21 577 -74
7805 -74 227 336 178 81 195 693 363 -347 80 131 -260 -1 -97 -25 7 34 -183 -346 -281 385 78 -355 -98
7828 -98 16 -556 -106 107 8 -23 23 -68 68 184 242 -101 141 226 240 436 209 1 -222 -485 -267 377 -57
$$ packed form
7676d21K25P3l04n4M35p9k86M38m56O85J22m11K66m67J03k38K82M05m58j47K3
7697b64M24m05L92QJ10k93J53m41M93J9j74k26J90j46L58N8m64O45k23N8o95L17
7719a06q6L70n6k6m90oL28l6K26m78J81M21n10L19j43K34k96J0j18k08M93k60
7741b37j66O16m31K08J95m18L68j37J08m90L3K29M48j19j74L68n34R4q0L17K86
7762D84p21M09j54j13o9j01L31n9K64k81j32L66k56j96J75K65l77j54L41n72M42
7783a08J12j16J98O9j05J02r6k21M3n6J54J62K20n86M49l83J07K19j04l9N56o51
7805g4L01J09j58r7J14M98l30p10M27N1l91K59r6P2L2K7k17j63O5O66l07m33K57
7828i8J14n72M50K13r9l1M6r1J36J16N8l43K42Q5J4J96k27k08k23k63K18O44m34
$$ plain form
7851 -57 -660 627 191 -15 -522 -340 241 97 -116 230 -11 -108 -551 -169 -422 -47 -245 282 116 186 169
7872 169 54 129 42 139 71 -205 -48 -53 348 -101 -196 185 75 -286 -69 -33 81 238 -373 177 -174 -129 117
7895 117 356 -227 62 273 -254 -35 45 -38 -244 -56 291 45 73 -154 5 392 -263 7 -255 219 142
7916 142 90 -254 -149 -119 -119 -295 -360 -454 -53 -503 -27 -48 134 233 541 79 133 -276 -125 -433 211 -260 -503
7939 -503 106 -356 -2 -82 489 88 70 -72 133 -149 -56 -67 -282 -383 -208 252 -80 -536 3 -189 -449
7960 -449 -320 51 563 -70 -108 33 47 -279 -8 -223 -89 89 263 439 -91 37 -237 243 53 -621 -45
7981 -45 -36 57 66 117 82 -74 -263 49 -78 -186 157 -704 416 5 259 -344 172 185 -184 398 7 178 48
8004 48 179 325 -54 253 74 313 70 -465 323 247 466 118 158 -66 -213 133 105 -77 88 -159 101
$$ packed form
7851e7o03J287m36k06n07J82N81j44k13L46k41r7m43L82k53L75j98N27j66P0j7
7872A69j15P5q7R7o8k76J57nM01m49r5L81j10l61K17L6J14J57o11N50l51M5K46
7895A17K39n83K89K11n27K19Q0q3k06J88L47k46K8k27J59L87o55K70k62M74p7
7916A42n2l44J05L0%j76o5r4M01m50M76k1J82R9L08m62N4m09J51l08O44m71k43
7939e03O09m62L54q0N71m01j8j42K05k82R3j1k15j01J75M60l32m56N39j92k60
7960d49J29L71N12o33l8J41J4l26K71k15J34J78J74J76n30J28k74M80j90o74N76
7981d5RR3RN1l5j56j89L12j27j08L43q61J120m11K54o03N16J3l69N82l91J71j30
8004D8J31J46l79L07j79K39k43n35P88p6K19l48M0k24j47L46k8j82J65k47K60
$$ plain form
8025 101 414 283 -107 -2 398 -126 -243 -153 237 -43 151 -27 -413 -460 39 335 187 307 87 -85 121
8046 121 -482 284 -301 -212 -78 275 183 -103 186 409 -3 -237 450 -286 -88 -261 -51 69 -103 -256 92
8067 92 503 -59 -225 231 78 -78 111 491 344 -186 -337 482 -221 -2 -18 -71 109 171 -240 -152 29 80
8089 80 191 -136 -191 48 152 -151 18 80 -11 -16 55 199 94 92 105 -216 -110 -58 -253 192 169 -1 -271 258
8113 258 -423 302 521 575 193 71 -45 -505 476 149 -168 -181 -209 176 311 33 -108 104 -101 135 201
8134 201 175 269 311 -247 -111 424 -58 -287 -15 -46 14 126 228 472 139 -185 -76 -73 -404 -267 -395 270
8156 270 57 132 225 27 295 368 66 21 -90 -34 -232 -40 194 13 -21 215 -296 513 -155 -234 50 226
8178 226 107 15 136 -164 -62 309 -513 83 -98 377 -266 334 -112
$$ packed form
8025A01L13j31l90J05M00n24j17R0L90k80J94j78l86m7M99K96j48J20k20j72K06
8046A21o03P66n85Q9J34L53r2k86K89K23m12k34O87p36J98j73K10J20j72j53L48
8067I2M11n62j66M56j53j56J89L80j47n30j51Q19p03K19j6n3J80O2m11Q8J81N1
8089H0J11l27n5K39J04l03J69O2r1nP1J44j05kJ3l21J06N2j95M45k3j70k70N29
8113B58o81P25K19N4l82j22j16m60R81l27l17j3k8L85J35k78j41K12k05K36O6
8134B01k6R4M2n58J36N35m82k29K72l1O0J12J02K44l33l24J09Ll31J37j28O65
8156B70k13P5R3j98K68P3l02m5j11N6j98J92K34j81l4K36n11Q09o68p9K84J76
8178B26j19r2J21l00J02L71q22N96j81M75o43O00m46
8191a12
$$ Imaginary data points
##PAGE= N=2
##DATA TABLE= (X++(I..I)), XYDATA
$$ plain form
0 0 0 0 0 0 0 0 0 0 0 0 0 0 0 0 0 0 0 0 0 0 0 0 29 -64 64 -64 64 -64 64 -66 106 -128 128 -130 165 -192 195
37 195 -230 257 -280 319 -347 387 -427 471 -524 572 -632 699 -768 847 -935 1026 -1139 1261
55 1261 -1398 1555 -1740 1956 -2215 2531 -2926 3442 -4128 5108 -6612 9149 -14329 28835
69 28835 -148365 -529805 -55419 326277 143234 -100926 -114024 -119472 -22053 194865 195386
80 195386 -137185 -312628 -13315 331796 151799 -252419 -221555 112882 177629 39758
90 39758 -4831 -78884 -174167 23004 283402 89195 -293519 -200718 188189 216965 -63734
101 -63734 -144321 -22516 19953 34997 102969 20385 -181668 -120619 182484 214898 -105927
112 -105927 -237279 19550 187065 39729 -70365 -19322 -45088 -66200 105246 161881 -99773
$$ packed form
0@%%%%%%%%%%%%%%%%%%%%%%K9r3J28j28J28j28J28j30J72k34K56k58K95l57L87
37A95m25M87n37N99o66P34q14Q98r95J096j204J331j467J615j782J961k165K400
55A261k659K953l295L696m171M746n457O368p570R236j1720J5761k3478M3164
69B8835j77200l81440M74386L81696j83043k44160j3098n448R7419K16918N21
80A95386l32571j75443K99313L45111j79997m04218L0864L34437O4747j37871
90C9758m4589p4053r5283J97171K60398j94207l82714R2801L88907K8776k80699
101f3734q0587J21805M2469J5044O7972q2584k02053O1049L03103L2414l20825
112a05927j31352K56829J67515j47336j10094N1043k5766k1112J71446N6635k61654
$$ plain form
123 -99773 -222419 43755 215280 18560 -152258 -52053 67634 40283 11541 24975 -40873
134 -40873 -105659 23409 174268 31108 -192606 -85105 150784 95574 -78749 -51796 16245
145 16245 -28650 284 97147 14536 -141910 -59788 137980 97978 -100185 -106796 54372
156 54372 83741 -16204 -27187 10053 -41179 -44636 86663 95014 -92762 -131787 66940 134771
168 134771 -28033 -95624 7492 35487 -18680 15281 50410 -41459 -86590 44094 117804
179 117804 -21127 -124257 -7510 101771 21467 -60218 -7583 17007 -31845 4863 81449
190 81449 853 -112029 -21800 114588 40516 -88739 -40392 56428 23117 -27578 11029
201 11029 15696 -47012 -24626 72453 45327 -81530 -68131 68625 73406 -45407 -54521 24598
$$ packed form
123i9773j22646K66174J71525j96720j70818J00205J19687k7351k8742J3434o5848
134d0873o4786J29068J50859j43160k23714J07501K35889n5210j74323K6953O8041
145A6245m4895K8934R6863q2611j56446Q2122J97768m0002j98163o611J61168
156E4372K9369r9945j0983L7240n1232l457J31299Q351j87776l9025J98727O7831
168A34771j62804o7591J03116K7995n4167L3961L5129r1869m5131J30684P3710
179A17804j38931j03130J16747J09281q0304q1685N2635K4590m8852L6708P6586
190H1449q0596j12882R0229J36388p4072j29255M8347R6820l3311n0695L8607
201A1029M667o2708K2386R7079k7126j26857J3399J36756M781j18813r114P9119
$$ plain form
213 24598 13810 -26263 25202 42948 -48300 -62181 52730 76554 -39741 -74687 22017 57350
225 57350 -11348 -33225 13045 6262 -30756 13335 58253 -15700 -80078 5572 83197 5191
237 5191 -69891 -8442 41940 -3897 -16253 27926 6991 -47347 -7102 59908 13908 -64213
249 -64213 -25581 53961 28404 -38543 -19833 25134 1356 -16327 25881 22593 -44836 -36336
261 -36336 48124 44041 -41362 -41819 29260 30237 -18221 -8517 18546 -9950 -26254 20162 34006
274 34006 -26667 -45657 21523 49539 -11330 -40883 6985 25112 -10112 -6585 21343 -7572
286 -7572 -39425 7393 47951 -2384 -44897 510 38597 2915 -24974 225 11244 -11421
298 -11421 -6707 22474 5843 -33563 -9939 40226 19181 -34537 -19652 24057 10594 -17273
$$ packed form
213B4598j0788m0073N1465J7746r1248j3881J14911K3824j16295l4946R6704L5333
225E7350o8698k1877M6270o783l7018M4091M4918p3953o4378Q5650P7625p8006
237E191p5082O1449N0382m5837j2356M4179k0935n4338M0245O7010m6000p8121
249f4213L8632P9542k5557o6947J8710M4967k3778j7683M2208l288o7429Q500
261c6336Q4460m083q5403m57P1079R77m8458R704K7063k8496j6304M6416J3844
274C4006o0673j8990O7180K8016o0869k9553M7868J8127l5224L527K7928k8915
286g572l1853M6818M0558n0335m2513M5407L8087l5682k7889K5199J1019k2665
298a1421M714K9181j6631l9406K3624N0165k1045n3718J4885M3709j3463k7867
$$ plain form
310 -17273 2299 12744 -16182 -13053 26971 19879 -27065 -22486 23536 21703 -17849 -19432 10182
323 10182 9057 -8287 3667 13897 -11126 -21869 14920 29171 -12338 -31020 6295 23890
335 23890 -4448 -13211 8015 3948 -13605 3095 19685 -4925 -25444 2303 25808 1406
347 1406 -22331 -3338 15653 1344 -8202 4860 3207 -13606 -3265 20763 7254 -21991 -9917
360 -9917 18176 9930 -13560 -6898 8104 770 -5455 7143 7635 -12104 -9932 14718 13783 -13339
374 -13339 -15595 8495 12070 -4450 -4741 4922 -1109 -7139 6583 11236 -8435 -15191 5825 14534
388 14534 -2647 -12209 1501 8435 -979 -2999 3984 -1899 -10003 2720 12915 -516 -13836
401 -13836 -1354 11671 3130 -7045 -1970 1983 -2159 -1101 4995 543 -8904 -2618 10453 5510
$$ packed form
310a7273J9572J0445k8926L129M0024p092m6944M579M6022j833l9552j583K9614
323A0182j125j7344J1954J0230k5023j0743L6789J4251m1509j8682L7315J7595
335B3890k8338q763K1226m067j7553J6700J6590k4610k0519K7747K3505k4402
347A406k3737J8993J8991j4309r546J3062j653j6813J0341K4028j3509k9245J2074
360i917K8093q246k3490O662J5002p334o225J2598M92j9739K172K4650r35k7122
374a3339k256K4090L575j6520k91R663o031o030J3722M653j9671o756K1016Q709
388A4534j7181r562J3710O934r414k020O983n883q104J2723J0195j3431j3320
401a3836J2482J3025q541j0175N075L953m142J058O096m452r447O286J3071m943
$$ plain form
415 5510 -8689 -6543 5726 4892 -3207 -1491 1940 -2819 -1774 7510 4544 -8748 -6920 5867
429 5867 6230 -3407 -5664 773 3185 459 1431 1329 -3499 -4514 2946 6786 -2404 -7790 679 7529
445 7529 1572 -4009 -1210 66 -2072 926 3084 -3164 -5896 2258 6226 1453 -3948 -1967 1650
460 1650 2232 -367 -2128 -1821 -1885 1105 4620 1978 -4144 -1711 4413 3298 -3064 -3343 -202 -155 621
477 621 2613 -549 -3400 403 4001 1996 -2580 -4104 -777 3352 2023 -1567 -1927 -324 904 1805
493 1805 1331 -2024 -3237 563 2619 -248 -2044 -1297 1058 2182 1780 -922 -2540 -160 1989 2012
509 2012 -1139 -2618 -553 2234 1886 -646 -1586 -517 226 770 918 -1589 -2085 255 1813 735 -1566
526 -1566 -1577 188 1975 1398 -1289 -2125 -616 1424 1724 -748 -1120 -1084 234 1831 629 -1058 -703
$$ packed form
415E510j4199K146J2269q34q099J716L431m759J045R284k966j3292J828J2787
429E867L63r637k257O437K412k726R72j02m828j015P460L840r190n386Q469O850
445G529n957n581K799J276k138K998K158o248k732Q154L968m773n401J981L617
460A650N82k599j761L07o4K990L515k642o122K433O124j115o362k79L141M7P76
477F21J992l162k851L803L598k005m576j524L327M129j329l590l60J603J228R01
493A805m74l355j213L800K056k867j796P47K355J124m02k702j618K380K149K3
509B012l151j479K065K787l48k532r40J069P43N44J48k507m96K340J558j078k301
526a566j1J765J787n77k687q36J509K040L00k472l72L6J318J597j202j687L55
$$ plain form
543 -703 401 1451 775 -1092 -1729 119 2091 1113 -1783 -1825 -245 1387 1544 -274 -1347 -1035 746
560 746 1011 1087 -627 -1122 861 1352 557 -1396 -890 458 1415 58 -1328 -1331 141 1751 229 -350
578 -350 -807 -159 581 1779 250 -1398 -949 -431 747 816 -653 -1422 -167 1387 443 -1386 -670 672
596 672 1278 237 -360 -771 -1026 499 1419 181 -559 -1575 147 2022 722 -1462 -979 586 350
613 350 -414 -168 -294 -473 987 613 -621 -1050 3 1011 947 -55 -1487 -830 925 663 986 -445
631 -445 -1643 -391 1554 501 -1662 44 1719 529 -626 -9 41 -817 399 1057 234 -1575 -917
648 -917 1612 1240 -237 -1511 -493 769 -464 -45 992 770 -1281 9 1906 -30 -1958 611
664 611 2024 -967 -1587 1025 133 -240 562 1191 80 -1616 122 1581 441 -1755 -627 904 127
$$ packed form
543g03J104J050o76j867o37J848J972r78k896m2J580J632J57j818j073L12J781
560G46K65P6j714m95J983M91p95j953N06J348R57j357j386lJ472J610j522n79
578c50m57O48P40J198j529j648M49N18J178O9j469p69J255J554r44j829P16J342
596F72O06j041n97m11k55J525R20j238p40j016J722J875j300k184M83J565k36
613C50p64K46j26j79J460l74j234m29J053J008o4j002j432O57J755k62L23j431
631d45j198J252J945j053k163J706J675j190j155O17N0q58J216O58q23j809O58
648i17K529l72j477j274J018J262j233M19J037k22k051J290J897j936j928K569
664F11J413k991o20K612q92l73Q02O29j111j696J738J459j140k196J128J531p77
$$ plain form
681 127 -1317 193 1413 -1172 -1550 1958 1765 -1786 -739 2336 896 -2272 -826 1365 198 -481
697 -481 -21 705 -1347 -2240 650 1575 -852 -2039 971 1614 -975 -1187 1024 1213 -1720 -198 2137
714 2137 -277 -2054 1426 2919 -893 -2169 443 1252 -1325 -1005 895 -129 -1973 -1187 1980 874
730 874 -1652 -933 2169 115 -2304 211 2260 153 -1981 812 1464 -1736 -1233 1774 983 -2119
746 -2119 -1612 2135 575 -1550 -329 1452 -319 -1690 1166 1977 -401 -1741 1143 2021 -1026 -1549
762 -1549 1461 1407 -1532 -785 2450 -51 -2187 420 2211 -601 -2148 890 1763 -1114 -1978 962
778 962 1541 -992 -867 1068 1006 -1604 -417 2613 591 -1948 -419 2465 -19 -1723 267 1679
794 1679 -1225 -1835 1889 1344 -1713 -1313 1969 877 -1813 -651 2372 623 -2192 -151 1562 -451
$$ packed form
681A27j444J510J220k585l78L508j93l551J047L075j440l168J446K191j167o79
697d81M60P26k052q93K890R25k427j187L010O43k589k12K211J89k933J522K335
714B137k414j777L480J493l812j276K612Q09k577L20J900j024j844P86L167j106
730H74k526P19L102k054k419K515K049k107k134K793O52l200N03L007p91l102
746b119N07L747j560k125J221J781j771j371K856Q11k378j340K884Q78l047n23
762a549L010n4k939P47L235k501k136K607J791k812j547L038Q73k877q64K940
778I62N79k533J25J935o2k610J187L030k022k539J529K884k484j704J990J412
794A679k904o10L724n45l057M00L282j092k690J162L023j749k815K041J713k013
$$ plain form
810 -451 -1950 880 1672 -1425 -1830 1149 1995 -1047 -649 1806 694 -2008 27 2334 -7 -1986
826 -1986 508 1636 -475 -1520 619 1590 -1070 -1878 500 713 -1333 -932 1807 449 -2179 -607
842 -607 2157 513 -1473 -235 1898 -151 -1563 772 1361 -1468 -1202 1350 801 -1077 -1217 1324
858 1324 859 -1325 -613 1039 -83 -1105 361 1332 -346 -1459 867 1842 -681 -1064 1538 835 -842
875 -842 -991 1282 503 -1430 89 1360 -151 -1525 446 1355 205 -1192 -60 807 -588 -868 745
892 745 48 -1176 -828 1691 616 -1550 -271 989 173 -1022 538 952 -535 -1240 643 596 -252
909 -252 -681 519 635 -1041 -624 971 646 -915 -80 841 191 -811 450 1451 -86 -1041 629
926 629 965 -358 -610 609 518 -688 558 578 -101 -828 122 565 366 -815 72 618 -49 -165 155
$$ packed form
810d51j499K830P92l097m05K979Q46l042L98K455j112k702K035K307k341j979
826a986K494J128k111j045K139R71k660q08K378K13k046M01K739j358k628J572
842f07K764j644j986J238K133k049j412K335N89k829K66K552n49j878j40K541
858A324m65k184P12J652j122j022J466R71j678j113K326R75k523l83K602p03j677
875h42j49K273p79j933J519J271j511j374J971R09j150j397J132Q67j395k80J613
892G45o97j224L48K519j075k166J279J260q16j195J560M14j487p05J883m7q48
909b52m29J200J16j676M17J595l25j561Q35R21o50j002J261J001j537r55J670
926F29L36j323k52J219r1j206J246K0o79p27R50M43j99j181Q87N46o67j16L20
$$ plain form
945 155 823 -401 -577 815 67 -463 -194 825 -353 -575 137 507 28 -538 -78 226 -602 -666 35
964 35 391 -512 -249 226 688 -336 -649 710 64 -641 -195 425 29 -575 330 657 -442 -611 -4 -20
984 -20 -191 439 158 886 58 -345 -444 -87 -411 123 142 73 -142 -59 -50 -182 201 355 406 -749 -233 -258 -318
1007 -318 233 -6 71 -294 -139 -66 290 257 -209 247 47 78 -115 152 360 -580 185 466 71 42 -183 -111
1029 -111 -223 16 -101 139 16 390 -163 21 230 33 -86 -75 163 -190 -348 -119 -166 -86 289 -542 -48
1050 -48 -164 -55 106 -61 -106 -103 338 307 -373 342 200 -319 345 4 540 -233 -161 597 142 -38 -233 119
1072 119 237 -231 122 85 57 -341 192 -152 122 -183 -439 309 -148 29 164 399 -184 660 -322 -91 -2
1093 -2 30 -367 -68 -59 41 -164 -67 220 -71 -330 32 -7 -78 -242 -22 629 384 -105 -67 293 -354 -38 77
$$ packed form
945A55O68j224j76J392p48n30K69J019j178k22P12L70m79n66M60L04q28o4P01
964C5L56r03K63M75M62j024l13J359o46p05M46O20l96o04R05L27j099j69O07j6
984b0j71O30k81P28q28m03r9L57l24N34J9o9k15Q3Rj32L83J54N1j155N16k5o0
1007c18N51k39P7l65J55P3L56l3m66M56k00L1j93K67K08r40P65K81l95k9k25P2
1029a11j12K39j17K40j23L74n53J84K09j97j19J1K38l53j58K29m7Q0L75q31M94
1050d8j16J09J61j67m5LM41l1o80P15j42n19O64l41N36p73P2P58m55j80j95L52
1072A19J18m68L53l7k8l98N33l44K74l05k56P48m57J77J35K35n83Q44r82K31Q9
1093bL2l97K99RJ00k05R7K87k91k59L62l9p1j64K20O51k45m89L8L60o47L16J15
$$ plain form
1116 77 487 -32 -252 381 -228 -110 181 26 -383 208 611 302 -535 -377 559 -132 -104 -143 501 407 -767
1137 -767 566 122 106 -301 317 709 163 -477 -145 712 -207 -222 375 -78 -534 -444 653 326 -1021 -752
1157 -752 742 -4 -603 114 628 -11 -643 345 404 -378 -1071 789 387 -1355 -158 758 417 -1269 -346
1176 -346 840 -6 -629 399 1250 -244 -605 745 848 -828 -697 768 704 -966 -338 1087 217 -1261
1194 -1261 -38 1494 -129 -710 213 1182 -239 -1496 787 986 -817 -1040 1228 865 -1308 -615 1788
1211 1788 433 -1316 -75 1645 259 -1532 482 1570 -554 -1800 1021 1197 -893 -1383 1205
1226 1205 862 -1830 -566 1612 769 -1546 281 1638 -120 -1797 1058 1888 -948 -1576 687 1584
1242 1584 -1575 -1080 1759 743 -1690 -659 1854 118 -1921 1 1947 -801 -1530 912 1505 -1259
$$ packed form
1116G7M10n19k20O33o09J18K91j55m09N91M03l09q37J58R36o91K8l9O44r4j174
1137g67J333m44j6m07O18L92n46o40L32Q57r19j5N97m53m56R0J097l27j347K69
1157g52J494p46n99P17N14o39o32R88N9p82o93J860m02j742J197R16l41j686R23
1176c46J186q46o23J028Q51j494l61J350J03j676J31J465o4j670O28J425q70j478
1194a261J223J532j623n81R23R69j421j257K283J99j803k23K268l63k173O93K403
1211A788j355j749J241J720j386j791K014J088k124j246K821J76k090m90K588
1226A205l43k692J264K178q43k315J827J357j758j677K855Q30k836o28K263Q97
1242A584l159M95K839j016k433J031K513j736k039J922J946k748p29K442N93k764
$$ plain form
1258 -1259 -1938 1573 1263 -1841 -1368 2163 1028 -1760 -621 2136 86 -2550 39 2215 -408 -2166
1274 -2166 858 2352 -1148 -1802 2211 1806 -2068 -1409 2103 772 -2023 -527 2541 433 -2577 916
1290 916 2557 -629 -2324 1479 2112 -1885 -1833 1757 1909 -2232 -1380 2268 883 -2603 -399 2855
1306 2855 -27 -2435 756 2565 -1525 -2607 1523 2384 -1854 -1947 2107 1727 -2976 -1461 2799 752
1322 752 -2751 -267 3087 -328 -2746 862 2445 -1075 -2565 1594 2400 -2359 -2125 2016 1519 -2945
1338 -2945 -1440 3052 961 -3442 171 3142 -379 -3270 1067 2885 -1190 -2834 1929 2735 -2430
1353 -2430 -2100 2817 1809 -3399 -1025 2862 470 -3744 -208 3118 -139 -3529 911 3751 -1515
1368 -1515 -2414 2224 2457 -1939 -1869 2389 2144 -3142 -923 3284 965 -3551 -555 3573 -30 -3357
$$ packed form
1258a259o79L511l10l104M73L531j135k788J139K757k050k636K589K176k623j758
1274b166L024J494l500o54M013m05l874O59L512j331k795J496L068k108l010L493
1290I16J641l186j695L803O33l997N2L590J52m141Q52L648j385l486K204L254
1306B855k882k408L191J809m090j082M130Q61m238r3M054l80m703J515M260k047
1322G52l503K484L354l415k418L608J583l520j490M159Q06m759K34M141m97m464
1338b945J505M492k091m403L613K971l521k891M337J818m075j644M763Q06n165
1353b430L30M917j008n208K374L887k392m214L536L326l257l390M440K840n266
1368a515q99M638K33m396P0M258k45n286K219M207k319m516K996M128l603l327
$$ plain form
1384 -3357 1104 3491 -1673 -2632 2229 3042 -2834 -1985 3310 1864 -3197 -1027 3190 484 -3323 423
1400 423 3578 -697 -3742 1122 3089 -1813 -3143 2461 2548 -2833 -1964 2995 1451 -3601 -772 3539
1416 3539 404 -3777 783 3446 -1013 -3479 1358 3313 -1731 -3071 2681 2565 -2569 -2211 3162
1431 3162 1380 -3550 -381 3584 826 -3642 448 3675 -708 -2956 1953 3073 -2299 -2714 2506
1446 2506 2239 -3076 -1662 3587 1269 -3784 -486 3927 91 -3645 417 3321 -1731 -3168 1884
1461 1884 2607 -2347 -2850 2254 2418 -3196 -1676 3695 1186 -3266 -727 3913 -31 -3575 264 4098
1477 4098 -1018 -3607 1916 3147 -2368 -2333 2230 2129 -3188 -1574 3074 790 -3155 -545 3664 -268
1493 -268 -3517 1452 3110 -1617 -3239 2241 2822 -1972 -2578 3004 2046 -3016 -1307 3683 903 -3912
$$ packed form
1384c357M461K387n164r59M861Q13n876Q49N295j446n061K170M217k706l807L746
1400D23L155m275l045M864J967m902j330N604Q7n381Q69M959j544n052K829M311
1416C539l135m181M560K663m459k466M837J955n044j340N752j16n134L58N373
1431C162j782m930L169L965k758m468M090L227m383k248M909J120n372m15N220
1446B506k67n315J414N249k318n053L298M413l836l736M062K904n052j437N052
1461A884P23m954n03N104J64n614J520N371k509m452K539M640l944l544L839L834
1477D098n116k589N523J231n515L5M563j01n317J614M648k284l945K610M209l932
1493b68l249M969J658m727j622N480N81m794o06N582r58n062J709M990k780m815
$$ plain form
1509 -3912 -639 3262 151 -3592 736 3432 -1246 -3112 2222 3047 -2170 -2310 2461 1906 -2903 -677
1525 -677 2740 772 -3482 92 3050 -475 -2966 1392 2806 -2100 -2987 1691 2755 -1637 -2089 2853
1541 2853 1366 -3187 -810 3268 1014 -3287 -211 3381 -627 -2899 841 2580 -1279 -2831 1491
1556 1491 2216 -2404 -1998 3116 1375 -2884 -1583 3144 -63 -2835 160 2875 -603 -2931 766
1571 766 3134 -1583 -2724 2032 1818 -2766 -1733 3202 1467 -2388 -1027 3212 -28 -3144 -281
1586 -281 2561 -339 -2324 1019 2313 -1639 -2385 2299 1855 -2136 -1503 2508 1104 -2971 -187 2458
1602 2458 -172 -2374 -12 2135 -581 -2276 1338 2520 -1304 -1686 1490 1464 -2141 -1272 2486 720
1618 720 -2265 -775 3120 -73 -2181 243 2607 -566 -2154 575 2292 -1707 -1450 1876 1196 -2137
$$ packed form
1509c912L273L901l111l743M328K696m678j866N334Q25n217j40M771n55m809K226
1525f77L417j968m254L574K958l525k491M358J414m906q87M678J064m392m52M942
1541B853j487m553K377M078k254m301L076L592m008k272L740J739l859j552M322
1556A491P25m620M06N114j741m259J301M727l207k772K995K715l478k328L697
1571G66K368m717j141M756k14m584J033M935j735l855J361M239l240l116K863
1586b81K842k900j985L343J294l952p46M684m44l991O33M011j404m075K784K645
1602B458k630k202K362K147k716j695L614J182l824l82L176k6l605Q69L758j766
1618G20k985J490L895l193k108K424K364l173j588K729J717l999K57L326o80l333
$$ plain form
1634 -2137 -1238 2021 894 -1975 -638 2694 303 -1921 506 2149 -792 -2444 994 1768 -1190
1649 -1190 -1703 1408 900 -1958 -1244 1886 591 -2193 33 2084 19 -1962 1038 1867 -1187 -1862
1665 -1862 1055 1283 -1444 -880 1102 1056 -1503 -651 1772 102 -1845 -28 1383 -422 -1708 429
1681 429 1467 -686 -1188 1251 1606 -797 -1266 1016 1147 -1545 -801 1565 615 -1662 273 1772 -63
1698 -63 -1113 275 1750 -681 -1230 1062 1220 -757 -1091 1386 415 -1351 -238 1467 101 -1585
1714 -1585 -192 1516 -450 -1594 300 1100 -1033 -1009 954 1078 -1382 -887 1062 762 -974 95
1730 95 1049 -163 -1442 165 1348 -543 -1259 423 977 -216 -1051 713 1048 -700 -359 855 578
1747 578 -1259 -193 1426 114 -679 31 1072 -668 -927 380 743 -907 -748 534 295 -738 -251
$$ packed form
1634b137Q99L259j127k869J337L332k391k224K427J643k941j652L438P74k958
1649a190n13L111n08k858P14L130j295k784K226K051k065j981L000Q29l054o75
1665a862K917K28k727N64J982m6k559Q52K423j670j947J817J411j805j286K137
1681D29J038k153n02K439L55k403m69K282J31k692P44K366r50k277J935J499j835
1698f3j050J388J475k431n49K292J58j977l34K477r71j766J113J705j366j686
1714a585J393J708j966j144J894Q00k133K4J963J24k460M95J949l00j736J069
1730I5R54j212j279J607J183j891p16J682N54j193q35J764L35j748L41J214k77
1747E78j837J066J619j312p93P10J041j740k59J307L63j650J59J282k39j033M87
$$ plain form
1764 -251 636 590 -1056 -269 1000 -354 -838 126 926 46 -1183 828 616 -501 -211 515 530 -709
1782 -709 -116 516 129 -598 119 365 134 -564 251 946 73 -703 426 199 -105 -385 603 343 -555 -295
1802 -295 302 -237 -358 204 265 27 -33 -257 462 -154 75 284 214 -526 -501 491 12 -601 -87 522 255
1823 255 -338 144 774 -100 -610 -210 146 -42 -676 731 253 -176 -178 316 -68 -578 -292 344 169 -219
1843 -219 -222 314 -378 -103 -278 449 -75 -408 75 330 -183 -397 347 415 -371 23 151 -246 -469 -242 540
1864 540 67 -751 -77 -40 28 -632 395 113 -25 -87 122 -40 -502 -77 444 30 -219 -164 338 305 -379
1885 -379 132 305 -265 -240 885 313 507 96 -302 132 84 104 301 498 -471 116 287 -418 -38 -93 130
1906 130 44 187 217 -264 -111 113 84 95 -283 231 554 -373 21 -25 -111 -120 -273 115 -197 -244 -269 419 -186
$$ packed form
1764b51Q87m6j646P87J269j354m84R64Q00q80j229K011k12j117K90P26J5j239
1782g09N93O32l87p27P17K46k31o98Q15O95q73p76J129k27l04k80R88k60q98K60
1802b95N97n39j21N62O1k38o0k24P19o16K29K09p0p40K5R92m79o13N14O09k67
1823B55n93M82O30q74n10M00L56j88o34J407m78m29kM94l84n10K86O36j75l88
1843b19lN36o92K75j75P27n24l33M83K55n13k14P44O8p86L94J28l97k23K27P82
1864E40m73q18O74L7O8o60J027k82j38o2K09j62m62M25N21m14k49N5N02l3o84
1885c79N11J73n70K5J125n72J94m11l98M34m8K0J97J97r69N87J71p05L80n5K23
1906A30q6J43L0m81J53K24k9J1l78N14L23r27L94m6q6rj53L88l12m7k5O88o05
$$ plain form
1929 -186 175 43 -25 82 -208 424 339 -397 -336 -85 -281 260 -217 498 27 69 -428 -171 -382 85 189
1950 189 164 279 -268 -248 319 94 275 -81 -112 5 223 309 490 47 65 468 6 24 637 -249 111 -225
1972 -225 -382 640 85 -43 -56 -41 215 -41 357 -397 -318 89 -133 289 379 178 78 -146 -438 328 -382
1993 -382 170 -214 -115 -308 235 217 123 103 104 126 3 -26 28 82 9 35 129 6 0 -180 126 -155 438 -535 357
2018 357 -381 -164 50 -188 246 300 -89 -366 -44 6 -239 -95 543 -363 -197 -9 518 -211 -255 367 28
2039 28 58 -41 -82 -159 361 -390 158 354 61 131 -178 -217 -14 157 -579 209 182 -457 18 -189 3 -26 18
2062 18 -335 -238 65 -25 -226 -216 135 50 -164 15 -78 181 -77 -257 -51 -172 -115 99 -281 -121 -626 -274
2084 -274 -445 241 284 -83 211 -487 -280 -313 -183 -275 176 -288 -561 81 5 24 234 -221 539 -300 79 365
$$ packed form
1929a86L61j32o8J07k90O32q5p36O1K51j96N41m77P15m71M2m97K57k11M67J04
1950A89k5J15n47K0N67k25J81l56l1J17K18Q6J81m43J8M03m62J8O13q86L60l36
1972b25j57J022n55j28j3J5K56k56L98p54P9M07k22M22R0k01j00k24k92P66p10
1993c82N52l84R9j93N43j8r4k0JK2j23k9N4N4p3K6R4j23oj80L06k81N93r73Q92
2018C57p38K17K14k38M34N4l89k77L22N0k45J44O38r06J66J88N27p29m4O22l39
2039B8L0r9m1p7N20p51N48J96k93P0l09l9K03J71p36P88k7o39M75k07J92k9M4
2062A8l53R7L03r0k01J0L51q5k14J79r3K59k58j80K06j21N7K14l80J60n05L52
2084b74j71O86M3l67K94o98K07l3J30r2M51m64k73O42p6J9K10m55P60q39L79K86
$$ plain form
2106 365 265 330 -225 -13 156 620 -360 -122 304 190 76 -284 -263 242 21 -8 -199 8 -40 29 -23 -366
2128 -366 -370 231 -20 -644 -383 66 -124 -251 184 80 132 198 6 -74 -10 -98 2 -86 -27 -243 243 401 174
2151 174 19 36 -79 69 -111 318 357 7 -347 50 528 -241 -451 -432 -422 -30 -109 -26 -509 -202 167 -73
2173 -73 -177 -138 34 93 175 -60 -98 375 -180 -100 112 -415 299 -463 156 -49 -78 -152 -225 156 -274 -111 -55
2196 -55 -238 49 520 103 153 -98 433 -82 28 43 -345 -141 -266 -68 226 -367 -43 62 -1 296 377 102
2218 102 24 287 154 38 -17 -40 146 97 -49 -72 -54 94 201 -111 700 122 150 -121 -441 241 -105 206
2240 206 154 71 613 323 -217 199 -212 -92 -547 -334 -290 78 -14 237 202 -42 -215 553 -64 -48 142 147 -93
2263 -93 -510 40 6 304 -139 -158 -206 166 0 228 147 163 79 43 544 24 211 163 -43 -88 -409 709 -47
$$ packed form
2106C65j00O5n55K12J69M64r80K38M26j14j14l60K1N05k21k9j91K07m8O9n2l43
2128c66mO01k51o24K61M49j90j27M35j04N2O6j92q0O4q8J00q8N9k16M86J58k27
2151A74j55J7j15J48j80M29L9l50l54L97M78p69k10J9J0L92p9Q3m83L07L69k40
2173g3j04L9J72N9Q2k35l8M73n55Q0K12n27P14p62O19k05k9p4p3L81m30J63N6
2196e5j83K87M71m17N0k51N31n15J10J5l88K04j25J98K94n93L24J05o3K97Q1k75
2218A02p8K63j33j16n5k3J86m9j46k3J8J48J07l12Q11n78K8k71l20O82l46L11
2240B06n2q3N42k90n40M16m11J20m55K13M4L68r2K51l5k44j73P68o17J6J90Nk40
2263i3m17N50l4K98m43j9m8L72j66K28q1J6q4l6N01n20J87m8k06m5l21J118p56
$$ plain form
2286 -47 249 254 222 -126 -234 132 -415 -97 -343 -289 -201 168 17 320 -42 90 -137 -46 227 -62 -575 42
2308 42 508 71 -4 244 390 508 -136 -256 -269 -174 330 -352 -103 -214 131 35 -134 -30 -298 178 -199 223
2330 223 82 -574 -321 -88 -229 -545 19 -204 -354 177 -27 -104 -84 73 -67 436 239 -188 -65 -153 -386
2351 -386 -87 -129 301 -178 -410 -53 97 -28 24 -107 133 -145 -72 -306 -267 49 403 37 118 -221 -212 230
2373 230 163 -133 -2 29 371 -288 272 -84 -459 109 -71 292 -61 171 105 9 215 -17 -156 240 -343
2394 -343 -284 -77 262 -269 472 4 277 220 68 116 29 162 108 -86 -523 -160 -179 93 -172 -140 137 158 -672
2417 -672 139 -89 -196 -272 293 -324 60 13 90 227 -422 98 0 97 -78 -23 -249 -175 187 -85 148 69 -78
2440 -78 45 242 -29 -383 149 34 107 20 43 -67 -206 -82 -218 128 -195 -290 398 126 -471 -418 -365 -370 -117
$$ packed form
2286d7K96Nl2l48j08L66n47L18k46N4Q8L69j51L03l62J32k27R1K73k89n13O17
2308D2M66m37p5K48J46J18o44j20j3R5N04o82K49j11L45r6j69J04k68M76l77M22
2330B23j41o56K53K33j41l16N64k23j50N31k04p7K0J57j40N03j97m27J23q8k33
2351c86K99m2M30m79k32L57J50j25N2j31K40k78P3k34L9L16L54l66Q1l39RM42
2373B30o7k96J31L1L42o59N60l56l75N68j80L63l53K32o6r6K06k32j39L96n83
2394c43N9K07L39n31P41m68K73n7j52M8q7J33n4j94m37L63j9K72k65L2K77K1q30
2417f72Q11k28j07p6N65o17L84m7P7J37o49N20r8R7j75N5k26P4L62k72K33p9j47
2440g8J23J97k71l54N32j15P3q7K3j10j39J24j36L46l23r5O88k72n97N3N3nK53
$$ plain form
2463 -117 -304 -103 156 54 148 -117 121 468 88 -4 -17 96 -142 327 -108 -43 -167 -6 -28 12 -655 -194
2485 -194 59 -37 -551 558 375 620 80 -146 -445 136 -75 -253 62 128 -85 13 42 -165 17 64 -66
2506 -66 181 -302 -56 -205 376 332 -70 -197 17 -324 58 -180 -102 183 52 18 289 112 471 -43 126
2527 126 194 -329 219 -293 -277 -319 -16 -66 -242 36 -136 -418 -148 -580 96 175 -66 -117 -415 -241 234 118
2549 118 -417 -151 308 6 58 237 -145 -14 555 96 -39 -18 32 -30 182 90 -78 -105 -89 375 48 237
2571 237 -20 -6 -319 -155 161 49 392 -47 90 -78 -173 -86 -162 -483 526 -142 -49 156 209 -168 -66 151
2593 151 63 -289 124 -33 331 -2 81 -28 17 300 293 27 141 197 -145 126 -101 407 412 -331 -4 -134 6
2616 6 -104 375 -135 -55 -490 3 155 -50 86 185 139 -189 -149 -85 149 53 -65 282 206 -90 -492 74 490
$$ packed form
2463a17j87K01K59j02R4k65K38L47l80r2j3J13k38M69m35O5j24J61k2M0o67M61
2485a94K53r6n14J109j83K45n40k26k99N81k11j78L15O6k13R8K9k07J82M7j30
2506f6K47m83K46j49N81m4m02j27K14l41L82k38P8K85j31l4K71j77L59n14J69
2527A26O8n23N48n12J6m2L03n0j76K78j72k82K70m32O76P9k41n1k98J74M75j16
2549A18n35K66M59l02N2J79l82J31N69m59j35K1N0o2K12r2j68k7J6M64l27J89
2571B37k57J4l13J64L16j12L43m39J37j68r5Q7p6l21J009o68R3K05N3l77J02K17
2593A51q8l52M13j57L64l33Q3j09M5K83pk66J14N6l42K71k27N08Np43L27j30J40
2616Fj10M79n10Q0m35M93J52k05J36R9m6l28M0O4K34r6j18L47p6k96m02N66M16
$$ plain form
2639 490 -101 -107 -53 304 -358 -72 106 112 59 -138 90 59 321 -110 19 -448 140 194 240 263 257 480 -13 152
2663 152 -31 -192 66 -386 287 29 88 -233 -158 -23 -294 133 132 201 -11 -124 -195 194 -51 144 216 -332
2685 -332 -83 113 -53 -195 -51 204 83 -57 -115 -597 -396 -418 107 -303 22 1 554 -45 114 248 -347
2706 -347 350 312 39 130 -373 -49 48 -262 308 -269 -74 -185 -50 -257 113 501 58 12 331 -10 -211
2727 -211 -73 370 -148 -207 -152 -174 44 -279 70 673 -394 92 -573 -34 4 -44 465 -171 14 -136 62
2748 62 -32 -495 -339 311 186 -169 -344 -122 47 74 -156 350 310 406 -129 93 -232 165 -101 -11 304 -128
2770 -128 141 -191 -192 172 121 101 -492 -282 -629 -511 129 184 367 -40 -387 40 89 -412 188 102 221 -38
2792 -38 -130 12 186 275 101 -342 262 287 -166 634 -308 -403 521 -28 597 373 -7 -117 542 375 155 156
$$ packed form
2639D90n91oN4L57o62K86J78On3j97K28l1K62m31J29m67N88N4M6K3oK23m93J65
2663A52j83j61K58m52O73k58N9l21P5J35k71M27jO9k12j13p1L89k45J95P2n48
2685c32K49J96j66j42J44K55j21j40n8m82K01k2N25m10L25k1N53n99J59J34n95
2706c47O97l8k73R1n03L24R7l10N70n77J95j11J35k07L70L88m43m6L19l41k01
2727b11J38M43n18n9N5k2K18l23L49O03j067M86o65N39L8m8N09o36J85j50J98
2748F2r4m63J56O50j25l55j75K22J69K7k30N06m0R6n35K22l25L97k66R0L15m32
2770a28K69l32jL64n1k0n93K10l47J18O40N5J83m07l47M27M9n01O00q6J19k59
2792c8r2J42J74Q9j74m43O04K5m53Q00r42r5R24n49O25k24l80j10O59j67k20J
$$ plain form
2814 156 -152 -12 -99 188 -178 -7 261 -70 5 369 146 132 -130 -88 -94 50 130 190 -272 -228 274 427 727
2837 727 -49 -301 387 416 -290 82 -397 -101 140 398 -124 -357 380 -337 26 -183 51 92 -126 25 -272
2858 -272 541 202 -71 116 -156 224 -578 -171 171 -19 82 130 -28 362 -1 -181 -273 -267 348 491 -13
2879 -13 -707 64 375 253 -71 111 -309 -594 -212 -103 -328 -125 192 59 342 508 152 -53 251 425
$$ packed form
2814A56l08J40q7K87l66J71K68l31P5L64k23j4k62M2oJ44Q0O0m62M4N02J53L00
2837G27p76k52O88K9p06L72m79K96K41K58n22k33P37p17L63k09K34M1k18J51k97
2858b72Q13l39k73J87k72L80q02M07L42j90J01M8j58L90l63j80r2OO15J43n04
2879a3o94P71L11j22l24J82m20k85L82J09k25K03L17j33K83J66l56k05L04J74
$$ [...]
8191a54
##END NTUPLES=NMR FID
##END=
