##TITLE=1H_5B1603
 DMSO-d6
 8 sc, 
 17.3.2023
##JCAMPDX= 6.0         $$ Bruker NMR JCAMP-DX V2.0
##DATA TYPE= NMR FID
##DATA CLASS= NTUPLES
##ORIGIN= UXNMR, Bruker Analytische Messtechnik GmbH
##OWNER= root
$$ XWIN-NMR		Version 3.5
$$ Fri Mar 17 14:32:46 2023 Russian Standard Time (UT+4h)  she@DPX200
##.OBSERVE FREQUENCY= 200.13135
##.OBSERVE NUCLEUS= ^1H
##.DELAY= (6, 6)
##.ACQUISITION MODE= SIMULTANEOUS
##.ACQUISITION SCHEME= undefined
##.AVERAGES= 8
##.DIGITISER RES= 18
##SPECTROMETER/DATA SYSTEM= spect
##.PULSE SEQUENCE= zg30
##.SOLVENT NAME= Acetone
##.SHIFT REFERENCE= (INTERNAL, Acetone, 0, 15.7039)
##AUDIT TRAIL= $$ (NUMBER, WHEN, WHO, WHERE, WHAT)
$$ ##TITLE= Audit trail, XWIN-NMR		Version 3.5
$$ ##JCAMPDX= 5.01
$$ ##ORIGIN= Bruker BioSpin GmbH
$$ ##OWNER= she
$$ F:/spectra/data/she/nmr/H-F/1/audita.txt
$$ ##AUDIT TRAIL=  $$ (NUMBER, WHEN, WHO, WHERE, WHAT)
(   1,<2023-03-17 14:31:42.53 +0400>,<she>,<DPX200>,
      <created by zg, POWCHK disabled, PULCHK disabled
       configuration hash MD5:
       00 E9 B6 7A A2 85 ED C7 34 08 36 98 17 FE 4E 26
       data hash MD5: 16K
       94 4E 01 EF 90 20 64 01 B8 74 77 1B 61 9F E2 80>)
$$ ##END=
$$ 
$$ hash MD5
$$ 94 F4 11 CB 91 43 6A 7F F1 08 2C A7 0C 68 B4 13
##$RELAX= 
##$RELAX= 
##$RELAX= 
##$RELAX= 
##$RELAX= 
##$RELAX= 
$$ Bruker specific parameters
$$ --------------------------
##$DU= <F:/spectra>
##$EXPNO= 1
##$NAME= <H-F>
##$PROCNO= 1
##$TYPE= <nmr>
##$USER= <she>
##$AMP= (0..31)
100 100 100 100 100 100 100 100 100 100 100 100 100 100 100 100 100 100 
100 100 100 100 100 100 100 100 100 100 100 100 100 100 
##$AQSEQ= 0
##$AQ_mod= 1
##$AUNM= <au_zg>
##$AUTOPOS= <>
##$BF1= 200.13
##$BF2= 200.13
##$BF3= 200.13
##$BF4= 200.13
##$BF5= 200.13
##$BF6= 200.13
##$BF7= 200.13
##$BF8= 200.13
##$BYTORDA= 1
##$CFDGTYP= 0
##$CFRGTYP= 5
##$CHEMSTR= <none>
##$CNST= (0..31)
1 1 145 1 1 1 1 1 1 1 1 1 1 1 1 1 1 1 1 1 1 1 1 1 1 1 1 1 1 1 1 1 
##$CPDPRG= <>
##$CPDPRG1= <>
##$CPDPRG2= <>
##$CPDPRG3= <>
##$CPDPRG4= <mlev>
##$CPDPRG5= <mlev>
##$CPDPRG6= <mlev>
##$CPDPRG7= <mlev>
##$CPDPRG8= <mlev>
##$CPDPRGB= <>
##$CPDPRGT= <>
##$D= (0..31)
0 1.2 0 0 0 0 0 0 0 0.06 0 0.03 0 0 0 0 0.0002 0 0 0 0 0 0 0 0 0 0 0 0 
0 0 0 
##$DATE= 1679049102
##$DBL= (0..7)
120 120 120 120 120 120 120 120 
##$DBP= (0..7)
150 150 150 150 150 150 150 150 
##$DBP07= 0
##$DBPNAM0= <>
##$DBPNAM1= <>
##$DBPNAM2= <>
##$DBPNAM3= <>
##$DBPNAM4= <>
##$DBPNAM5= <>
##$DBPNAM6= <>
##$DBPNAM7= <>
##$DBPOAL= (0..7)
0.5 0.5 0.5 0.5 0.5 0.5 0.5 0.5 
##$DBPOFFS= (0..7)
0 0 0 0 0 0 0 0 
##$DE= 6
##$DECBNUC= <off>
##$DECIM= 32
##$DECNUC= <off>
##$DECSTAT= 4
##$DIGMOD= 1
##$DIGTYP= 9
##$DL= (0..7)
0 120 120 120 120 120 120 120 
##$DP= (0..7)
150 150 150 150 150 150 150 150 
##$DP07= 0
##$DPNAME0= <>
##$DPNAME1= <>
##$DPNAME2= <>
##$DPNAME3= <>
##$DPNAME4= <>
##$DPNAME5= <>
##$DPNAME6= <>
##$DPNAME7= <>
##$DPOAL= (0..7)
0.5 0.5 0.5 0.5 0.5 0.5 0.5 0.5 
##$DPOFFS= (0..7)
0 0 0 0 0 0 0 0 
##$DQDMODE= 0
##$DR= 18
##$DS= 0
##$DSLIST= <SSSSSSSSSSSSSSS>
$$ [...]
##$SUBNAM2= <"">
##$SUBNAM3= <"">
##$SUBNAM4= <"">
##$SUBNAM5= <"">
##$SUBNAM6= <"">
##$SUBNAM7= <"">
##$SUBNAM8= <"">
##$SUBNAM9= <"">
##$SW= 18.05172834244
##$SWIBOX= (0..15)
0 0 2 0 0 0 0 0 0 0 0 0 0 0 0 0 
##$SW_h= 3612.71676300578
##$TD= 16384
##$TD0= 1
##$TE= 0
##$TE2= 300
##$TE3= 300
##$TEG= 300
##$TL= (0..7)
0 120 120 120 120 120 120 120 
##$TP= (0..7)
150 150 150 150 150 150 150 150 
##$TP07= 0
##$TPNAME0= <>
##$TPNAME1= <>
##$TPNAME2= <>
##$TPNAME3= <>
##$TPNAME4= <>
##$TPNAME5= <>
##$TPNAME6= <>
##$TPNAME7= <>
##$TPOAL= (0..7)
0.5 0.5 0.5 0.5 0.5 0.5 0.5 0.5 
##$TPOFFS= (0..7)
0 0 0 0 0 0 0 0 
##$TUNHIN= 0
##$TUNHOUT= 0
##$TUNXOUT= 0
##$USERA1= <user>
##$USERA2= <user>
##$USERA3= <user>
##$USERA4= <user>
##$USERA5= <user>
##$V9= 5
##$VALIST= <valist>
##$VCLIST= <CCCCCCCCCCCCCCC>
##$VD= 0
##$VDLIST= <DDDDDDDDDDDDDDD>
##$VPLIST= <PPPPPPPPPPPPPPP>
##$VTLIST= <TTTTTTTTTTTTTTT>
##$WBST= 1024
##$WBSW= 4
##$XGAIN= (0..3)
0 0 0 0 
##$XL= 0
##$YL= 0
##$YMAX_a= 126943
##$YMIN_a= -255576
##$ZGOPTNS= <>
##$ZL1= 120
##$ZL2= 120
##$ZL3= 120
##$ZL4= 120
##$ABSF1= 10
##$ABSF2= 0
##$ABSG= 5
##$ABSL= 3
##$ALPHA= 0
##$AQORDER= 0
##$ASSFAC= 0
##$ASSFACI= 0
##$ASSFACX= 0
##$ASSWID= 0
##$AUNMP= <proc_1d>
##$AZFE= 0.1
##$AZFW= 0.1
##$BCFW= 1
##$BC_mod= 2
##$BYTORDP= 1
##$COROFFS= 0
##$CY= 11.3945322036743
##$DATMOD= 1
##$DC= 2
##$DFILT= <>
##$DTYPP= 0
##$F1P= 2.36226072786647
##$F2P= -0.459571619588291
##$FCOR= 0.5
##$FTSIZE= 0
##$FT_mod= 4
##$GAMMA= 1
##$GB= 0.15
##$INTBC= 1
##$INTSCL= 1
##$ISEN= 128
##$LB= 0.24
##$LEV0= 0
##$LPBIN= 0
##$MAXI= 10000
##$MC2= 0
##$MEAN= 0
##$ME_mod= 0
##$MI= 1.114404
##$NCOEF= 0
##$NC_proc= 0
##$NLEV= 6
##$NOISF1= 3.799351
##$NOISF2= 2.8
##$NSP= 1
##$NTH_PI= 0
##$NZP= 0
##$OFFSET= 15.70392
##$PC= 1
##$PHC0= -19107.6
##$PHC1= 12.40075
##$PH_mod= 1
##$PKNL= yes
##$PPARMOD= 0
##$PSCAL= 0
##$PSIGN= 0
##$REVERSE= no
##$SF= 200.130013532006
##$SI= 16384
##$SIGF1= 3
##$SIGF2= 2
##$SINO= 400
##$SIOLD= 16384
##$SREGLST= <1H.CDCl3>
##$SSB= 0
##$STSI= 0
##$STSR= 0
##$SW_p= 3612.71676300578
##$SYMM= 0
##$S_DEV= 0
##$TDeff= 0
##$TDoff= 0
##$TI= <>
##$TILT= no
##$TM1= 0
##$TM2= 0
##$TOPLEV= 0
##$USERP1= <user>
##$USERP2= <user>
##$USERP3= <user>
##$USERP4= <user>
##$USERP5= <user>
##$WDW= 1
##$XDIM= 8192
##$YMAX_p= 0
##$YMIN_p= 0
$$ End of Bruker specific parameters
$$ ---------------------------------
##NTUPLES= NMR FID
##VAR_NAME=  TIME,          FID/REAL,        FID/IMAG
##SYMBOL=    X,             R,               I
##VAR_TYPE=  INDEPENDENT,   DEPENDENT,       DEPENDENT
##VAR_FORM=  AFFN,          ASDF,            ASDF
##VAR_DIM=   8192,          8192,            8192
##UNITS=     SECONDS,       ARBITRARY UNITS, ARBITRARY UNITS
##FACTOR=    0.0002768,     1,               1
##FIRST=     0,             0,               0
##LAST=      2.2672688,     0,               0
##MIN=       0,             -255576,         0
##MAX=       2.2672688,     126943,          0
$$ Real data points
##PAGE= N=1
##DATA TABLE= (X++(R..R)), XYDATA
$$ [...]
1299C3L3l47J21K58k5j91M9J79Rj92J81l0p7k4O0j40LP1j34M27k79q9J9K07l35
$$ 33 66 -281 -160 98 73 -118 -69 110 119 -73 108 78 1 -23 37 -103 -100 -29 -163 264 -15 -104 -85 122 -213
1324b13J35K24j84K1l9J25j89L3J47j78L5J01j68K01Q2q4j60J79j19J55j14J6
$$ -213 -78 146 -38 -17 -56 69 -120 -87 60 -118 -83 18 -150 51 133 49 -111 68 -51 104 -10 6
1346Fl4n2M3j7k6J94j72jP9j38J77j03j0j9J56Qo4j6J09j03k34J77J58j09k0m0
$$ 6 -28 -80 -37 -54 -80 114 -58 -59 20 -118 59 -44 -54 -73 83 91 27 11 120 17 -217 -40 118 9 -11 -51
1372e1j9jJ79j1J2J1j28j09J41R3k50J17J74k26q4QK21j81Q9q7R6J01n8k85J95
$$ -51 -70 -71 108 97 109 120 -8 -117 24 117 -133 -16 158 -68 -152 -144 77 -104 -15 -102 -6 95 37 -248 -53
1397e3J3j88K93L1j06j52N9R3L7m5j13J80K5J5p0O3j05o3K65j37j27M4O8j85M7
$$ -53 -40 -228 65 96 -10 -162 -103 -10 27 -18 -131 49 74 89 19 82 -23 -86 179 42 -85 -41 27 -158 -111
1422a11J44k32P9K25j29J41q0L1j16j2J42k37R2J54k1j42J21j08oK01j47OO8K17
$$ -111 33 -199 -120 105 -24 117 37 68 -48 -60 82 -155 -63 91 70 -72 49 -59 -65 136 -11 -5 63 280
1446B80m60j09M11l97J61K33j30k17K61Q4k12Q9J03j33N8J1j78J84O4j59L2J7
$$ 280 -180 -289 122 -275 -114 119 -11 -228 33 117 -95 -6 97 -36 22 33 -145 39 103 -56 -24 -7
1468gJ73l23J85J37k43J4J42k24J62K52j48k30L34j95j31J18Rk15J33J51k75J31
$$ -7 166 -157 28 165 -78 -64 78 -146 16 268 120 -110 224 29 -102 16 25 -190 -57 94 -181 -50
1490e0K19k23n7K97j16k66L24m3l15L01p9k2j35L88j87j27J76Rk20K10l4k28P3
$$ -50 169 -54 -111 186 70 -196 128 85 -230 71 -8 -30 -165 223 36 -91 85 94 -126 84 50 -178 -105
1513a05K14j26J20O7l60n0L58j50j79L46M6m44L53q1k11J88J89j15l49N31k15
$$ -105 109 -17 103 170 -190 -240 118 -32 -211 135 181 -263 90 9 -202 -14 175 60 -289 242 27
1534B7l06K78K07l03K02l3k20J51J53j52j18L57k90p0L93k59r6P2K6k68K88J52
$$ 27 -279 -1 206 -97 105 72 -148 3 156 4 -114 243 -47 -117 276 17 -79 -7 19 -249 39 191
1556A91j96l9K13k41o8K77O1l81L60l06n0L17P5l97J18L24m18j14M01j8k77K35
$$ 191 -5 -44 169 -72 -140 137 198 -183 177 -129 -179 138 213 -184 -66 258 -160 -274 127 109 -168 67
1578F7L8l14R9J45j32K12J33k76k36M07r7p3J69L3k91J00L5k90J38M34m04l12
$$ 67 105 -209 -110 35 -97 115 248 -28 -264 143 46 -27 142 175 -116 -16 19 -271 -133 301 -103 -415
1600d15O36j96j07J78Lk74K20l4k88K96J88l10j73L49N3m34L21N7j51R5rk30J98
$$ -415 221 25 -82 96 99 -175 45 11 -277 19 207 -103 -276 73 126 -308 13 70 -81 14 5 -225 -27
1623b7J84k99K3L36r6n12J95J54j63J18M5j19J64J11k41Q3K99j81l48L80j52q5
$$ -27 157 -142 -119 217 121 -391 -196 -42 -205 -87 -42 -161 3 114 -127 -44 255 74 -274 106 -46 -131
1645a31J99K9k69J77J91l08K80r3l12oL83o3k2M1j00n6l7K23j56N5K15k11j92
$$ -131 68 97 -172 5 196 -112 168 75 -237 -243 140 77 55 96 -4 -60 -97 126 -30 25 240 29 -163
1668a63L73k95N8J26k59R9R2J00k05p2L34q6k47L29j70n6J40j99O1Q0J22j84p5
$$ -163 210 -85 -27 99 -160 -61 31 131 -74 -146 188 102 -145 184 14 -42 98 -101 -40 40 162 -22 -97
1691i7J32M6k38L01j57j16n9K00K3P7k3k92J67K71l26j78J28L05k28o0O4J14r6
$$ -97 35 81 -157 144 -13 -129 -188 12 35 112 89 -203 -36 235 -91 -269 -141 164 -64 -124 -60 54 -42
1714d2j2q3J46O0o5k09L27J2k38K95m07L01j31Rm2N3J16j61m4J90J8r0j93J37
$$ -42 -54 -137 9 69 4 -205 122 134 -104 191 -216 85 -46 -37 -79 -26 90 -71 -115 75 93 3 -190 -53
1738e3J27r2Q5j71J45J69j25k00J3L63l34K5lJ52q7j48J84o2L0j19j05L02P0l67
$$ -53 74 -18 67 -104 41 210 85 -115 -102 261 -73 -48 -51 101 14 -134 50 -12 18 -101 -206 96 166 -201
1762b01J27J85j09j97L15k16J21J14k37pK11l7k79N5K05Q8l66K32oK89l25k04
$$ -201 -74 111 2 -195 120 -96 25 139 -98 -105 106 69 -210 -155 50 138 -228 4 -2 287 -38 -242
1784b42P1L23j73j7l1J60j4k21J49nK04l28R1j16J85Q8j83K0J02j69J3o5L1J69
$$ -242 -171 152 -21 -38 -69 91 77 -144 5 0 204 -124 -33 -149 36 124 -59 -39 63 -106 -93 -158 -127 42
1808D2j43K5K21L5k78qJ42P5O0j76k08L42r9j31R0k9J52k77M8K63q1j38M9j4Q4
$$ 42 -101 -76 145 180 -98 -106 36 111 171 -5 -213 129 30 -101 -11 -40 112 -165 -117 146 65 -73 -24 -38 46
1833D6J11k48J12K2Q3j09j48L1QR7M6j10J94M1k92j3J87r8j23J21J11j39J30m7
$$ 46 157 -91 21 43 126 17 -131 -100 -92 5 51 -59 135 176 -116 -129 58 -40 -163 -42 69 -70 60 13
1857A3k0P7mm9j12K43q3k69J05J66o6k3k5J61k5q7k05J93J56k46R6r7J88J9j19
$$ 13 -7 70 66 17 -95 148 65 -204 -99 67 1 -22 -47 114 89 2 -203 -10 146 -100 -4 -101 87 106 -13
1882a3N5N6p0J4j40m3K26p3l5K95q9j40j7oj6jj85Q1J53P7r2j8MJ07r5om6J55
$$ -13 42 98 28 42 -98 -141 85 12 -23 272 183 43 26 20 4 3 -182 -101 52 129 37 19 23 130 35 29 -17 138
1910A38j36j27M1J46O0k35O9K3K05l37K05j52N9K02k91m8K65J00j67n7r2L31k98
$$ 138 2 -125 -84 62 122 -113 -44 -21 184 -153 52 -100 -41 161 -130 -178 87 187 20 -37 -129 202 -96
1933i6o9J67O5o9j7K4Q5J34k16p4J59j1q8J1q2J37J7N9m5L7L0j91O6K34n0j29
$$ -96 -165 2 67 -2 -19 5 90 224 8 -66 93 82 -6 5 -77 60 77 136 91 128 158 -33 33 267 217 88
1959H8j99L30j40j38M3p1J99k16n6J09K64o6k99j13M66k3j32l6o3O2Pj00j25K68
$$ 88 -111 219 79 -59 -16 -87 112 -104 -160 -51 213 147 -152 -265 201 178 46 10 -53 9 16 -84 -209 59
1983E9lr2j73K97k15J53j08J67r6J4j74Q5J50o5j57Q2L88l81J82k32K04%k28q2
$$ 59 56 -36 -209 88 -127 26 -82 85 -11 3 -171 -86 64 -1 -158 -76 312 -69 113 -119 85 85 -143 -225
2007b25K70P6j35O3mj03RJ13j2J34J0j72m6o8K20k55J85q1P0j83M4M9L3P3j51
$$ -225 45 121 -14 49 45 -58 -49 64 52 186 196 24 -22 -90 130 -125 60 -21 49 -134 -90 -41 -8 65 -86
2032h6P1J8J83j63j52O8K69k33j59J49J45j7k11J39M8j07j5j15L47k05j4j38K36
$$ -86 -15 3 186 23 -129 -61 208 -25 -184 -35 110 93 -118 21 69 -38 -53 -168 179 -26 -40 -178 58
2055E8lr3O3n3k2P6o3r4J93Q6k63O9j9L24l33r5K49j47K49j73j73J35rm2j02L60
$$ 58 55 -38 25 -28 -50 26 -37 -131 62 148 -115 -46 -65 259 -74 -169 80 -67 182 9 -164 -29 -38 -80 -182 178
2081A78k8l12J04J36N6k06J3r2K33j63j90K91q4o7L6N2o5J92J0J8r5q2J51q8J24
$$ 178 150 -162 -58 78 134 -72 -59 -151 82 -81 -271 20 -64 -131 -95 -43 -108 84 94 112 17 -65 86 -2 122
2106A22n8O6l1j00M9l9N9j16l6K29j32q0J07J49K3k95O1K17k45Qj28K00J5J9l
$$ 122 64 130 99 -1 48 9 68 -48 -84 145 13 -67 40 189 212 -83 -22 195 -50 -42 -170 30 45 64 61
2131F1j91J36j56K7k7K33J54k22Lj16L14j85r8qJ54k10J3J22j2O7k7OQ0j12o0
$$ 61 -130 6 -150 -123 -150 83 237 15 18 -98 216 31 -67 -75 79 -131 -118 4 -8 59 32 38 118 6 -54
2156e4K0k9J92j01r0J24j30K32l01J75PL6k86R4J12N2K1k47J20J20j47J33J22
$$ -54 -34 -63 129 28 -62 62 -68 164 -137 38 45 81 -205 -111 1 53 74 -173 -53 67 -80 53 175
2179A75q3pj61q9K94j06j77K08n2qo0K3J1q0J0Q2q0J57j31J14j6l9L34k58j13
$$ 175 92 85 -76 -165 129 23 -154 54 2 -6 -66 -43 -32 -112 -102 -20 -100 57 -74 40 24 -15 319 61 -52
2204e2KK06o6r5r0K33kk54K23p1k3lq7J62k9m5l1P5Oj10N2J2N9r9N8j34K40j46
$$ -52 -50 156 90 -5 -95 138 136 -118 105 34 11 8 -79 83 54 9 -22 53 59 -51 1 13 72 -27 31 -103 137 -9
2232iJ8O3j07K68j52j15K3N8n1J6p2kQ4J09L0k37J91j01pn1Q1m7j76R3O9N9q6
$$ -9 9 72 -35 233 81 -34 -11 47 -4 12 -60 -62 22 131 161 -76 115 14 7 -44 37 -10 -186 -93 -24 35 -51
2259e1m4J35m3j33K75j23Q3l7j33K36j71J1j11J75l1l1j04J28J45k34J15K8j19
$$ -51 -95 40 -3 -136 139 16 99 62 -71 165 -6 5 -106 69 38 7 -97 31 176 -58 57 85 -34
2282c4m3J05N8j96R1k3L6J8j24K11jJ3n5l0j76J35P1j05Q3j08L4K6%p8K67j36
$$ -34 -77 28 86 -110 -19 -42 -6 12 -112 99 98 111 56 26 -150 -15 56 -49 34 -74 -40 -14 -14 -92 175 39
2308C9Mj0r9j35J55J45p3L4j39R8j78M07k69J23l32K12J42j22n4K8R3M9r0n7N5
$$ 39 43 33 -66 -201 -46 99 26 60 -79 19 -159 248 -21 102 -230 -18 124 2 -52 -24 69 118 28 -29 26
2333B6j05P1K9MK4r4j27J13K6K4nk4N9k7J04n2n1o5J53j32J22j23K11j09j83K46
$$ 26 -79 -8 21 25 49 -45 -172 -59 -33 -9 -14 -38 21 -6 98 46 -5 -70 83 -49 73 -50 161 52 -131 115
2359A15n2o0k0k8J63K4j41Q5l6l6%o8P4L1j6pr6J08j60J67o1Q6o7r7J86j53q5
$$ 115 63 3 -17 -45 118 142 1 86 50 14 14 -54 20 51 35 28 -68 40 -120 47 -14 72 5 -92 94 -59 -144
2386a44P6J60J07j38j3n8j07M7Q7j51M1J47j12J30j34k2r1J77J87q3j40p5N3O9
$$ -144 -68 92 199 61 48 -10 -117 -70 17 -134 -93 54 -58 72 -62 -84 -175 2 189 106 -34 -109 -56 13
2410A3L8l9n9Q0m2J69l01Q0j00J78j5O9k1j10jo4K13j31K0J54j80N6j41J39j20
$$ 13 51 12 -47 33 -9 160 -141 -61 -161 17 2 71 50 -60 -61 -125 88 -43 -23 131 -49 7 -134 5 -115
2435a15J31J6j70Q0K07r3k62R4O4J09l6J38k23k1oK6KO6J00Or8M1n7l6oM8Kl6
$$ -115 16 32 -138 -58 149 56 -206 -112 -48 61 25 163 -60 -81 -87 -61 -59 7 107 113 15 56 -1 -37 -43 5 7 -29
2463b9R1j39Q7M9q0kmq0J50lj7o6J69j70j43J35K23j52j28L3PK54j75j84J11K3
$$ -29 62 -77 10 59 -21 -23 -27 -107 43 40 23 -43 126 -44 -187 -52 171 19 -109 -76 -69 185 10 -174 -63 -40
2489d0L8Q8pn6o9N8R2j68J40m2l1K13r1q4M1p7o4K21j89J34r9l9J28j49M6k9J09
$$ -40 -2 86 79 23 -46 12 104 -64 76 34 3 216 125 41 82 5 -59 162 -27 107 8 -31 97 -52 -6 -35 74
2516G4J37j69j10R1L7j11J8P1q0j31L79k90J13L9l4O0R0j96M5p3Q4o8J15k23K13
$$ 74 211 42 -68 23 60 -51 -33 38 -42 -173 206 -84 29 68 34 94 184 -12 33 -40 44 -24 91 -132 81
2541H1j20O0p4j09K31j10k2R1K3j9N4j60J14Nl7J5j44J16oJ26k08J19m6o4J57
$$ 81 -39 21 -53 -162 69 -41 -63 28 51 32 86 -74 40 45 8 23 -121 -5 -11 115 -93 26 -20 -84 73
2566G3j52K05ln6j27J02j81K11O6j33l5j0L2L9K3j08JRN3j5n8J48k4k72J84K8
$$ 73 -79 126 123 67 -60 42 -139 72 138 5 -30 -40 -8 31 54 -54 -53 -44 9 -6 -64 84 60 -212 -28 0
2592@K20r9K4j90Q4p0L0J01Oj85n3J27Qn9l2R1O0j61K14n9j75j4J10Oq0p9J67
$$ 0 220 121 145 -45 39 -31 -1 100 106 -79 -132 -5 3 -56 -88 3 63 -98 116 57 -118 -132 -22 -16 -96 -175 -8
2619hO5j01Q3j58RK04p9N8j24J05k01K08lj13Q4r8K38j85R4k7j85P0N2L2mj8o1
$$ -8 57 -44 39 -119 -110 94 15 73 -51 54 -147 61 58 -55 29 -69 169 -16 78 51 -134 -64 -12 20 16 -2 -63
2646f3l1P9K3l7m0Q7k3J48r0k04J28J22p5L1P2j21p6R3L2q0J68k69PK9J01J51
$$ -63 -94 -15 8 -29 -69 18 -5 143 53 -151 -23 99 24 55 127 6 -70 23 55 -25 143 -126 -119 -90 11 162
2672A62p4K8j14oP8j70PJ63j52O7Po8K97k70R0j42J84k48J20L7J6j20Q9P0k5K
$$ 162 88 116 2 -4 74 -96 -89 74 -78 -11 -4 -72 225 -45 45 -97 87 -161 -41 -4 12 -108 -19 51 26 28
2698B8m7P7Rj62R7p6O0O2r1J42j61K5jJ00q2j3p2R5q5O6ONj8P7j51N7m8J35k1
$$ 28 -19 58 67 -95 2 -74 -14 48 -43 99 -62 -37 -38 62 -20 -33 -105 -10 -95 -29 -23 -18 -36 41 -110 -53 -101 34 13
2727A3l1O8j81J59l6LJ4j33N6r2K35k6l6q4K12k76J40k3n1J74l21K92j08P5j91
$$ 13 -18 50 -131 28 -8 -5 9 -124 -68 -160 75 49 13 -71 141 -135 5 -18 -69 105 -216 76 -32 43 -148
2752a48K08j69J40o2n9J73k06K31k40K24j90Q7lJ41k1j09J2p4M3NJ79k35J12j44
$$ -148 60 -109 31 -31 -90 83 -123 108 -132 92 -98 -11 -14 127 106 -3 9 -65 -22 -17 162 -73 39 -105
2776a05K77j12j12J39J12j98j84K41k17K53j57j7Q0l4j0l4R3l5K58q9j62P9k1
$$ -105 172 60 -52 87 199 1 -183 58 -159 94 -63 -80 0 -34 -44 -78 15 -20 238 149 -13 66 45
2799D5J85l32K0J37p9L4j96J94K8j24J22j60M6J49j19kr6O3J96k3j67MJ3J68o5
$$ 45 230 -102 -82 55 -24 10 -186 8 36 -88 34 -126 -80 69 -50 -52 -148 -85 111 88 -79 -75 -62 106 41
2824D1l0l8l3J85o9N4Ol6O8j69J11j08M1m2L7j52K57j71J4l8J2M3j12J62M2R1
$$ 41 11 -27 -60 125 56 110 116 80 148 -21 90 -18 23 -19 18 -134 123 -48 -34 -72 -60 -17 -129 33 75 166
2850A66k39P0k3j32K90k24Q6j31J01J6L0j2kJ29j30m4J09k82J73J89j66J18r9
$$ 166 -73 -3 -26 -158 132 -92 -6 -137 -36 -20 10 -2 -4 125 -5 -49 60 -222 -49 140 -26 92 -7
2873gJ08j11N7N9k14L0K39p8R6j38qkL3j10R0n9r8M6m5j24L13Q8k87J74oj99R0
$$ -7 101 -10 47 106 -108 -78 161 83 179 41 33 31 64 -46 44 -15 -113 -67 -112 -236 77 165 -122 52 46 -153 -63
2900f3l0p7N8N0o2J28m3n4K14j25J88k27Q2r4j8p4J27R0Lj9k51K87j3n7o8R0j4
$$ -63 -93 -170 -112 -62 -124 4 -39 -93 121 -4 184 -43 39 -55 -73 -147 -20 70 73 54 -197 90 77 20 -48 42 28
2927B8r0m1K03j03n1J63q3Q9M5j67%K1qk5J78j59l0l0k8J31K7j87k0m9K41q4l03
$$ 28 -62 -103 100 -3 -54 109 26 115 160 -7 -7 14 6 -19 159 0 -30 -60 -88 43 70 -117 -137 -186 55 -29 -332
2954c32J30K69n4N0K3R2j26k50J44J59r5n3J1m0j6J50J9j94J66j01J11k15K40
$$ -332 -202 67 13 63 86 178 52 -198 -54 105 10 -43 -32 -72 -88 62 81 -113 53 -48 63 -152 88
2977H8j93J46j42R0K7n5N1L7k8j35R1M6l2N7J29l01l4P4N6k2J97j27J18j62l9
$$ 88 -105 41 -101 -11 16 -39 12 49 21 -114 -23 23 -9 48 177 -124 -158 -84 -28 -50 147 20 138 -24 -63
3002f3J12k13P6PJ35j95O9L9l2J26m6J8l1J19K2j23NJ40l7j72pJ60k49J81Oj13
$$ -63 49 -164 -88 -81 54 -141 -72 -33 -65 61 15 33 2 121 143 20 25 165 128 -44 -51 109 -140 41 47 -66
3028f6K2J50p6Ql5m8q4J13l1J01l6K13j24j77J41j60L6Q5Km8j9P2J11j14m4L2
$$ -66 -44 106 30 38 3 -45 -129 -16 -47 54 18 231 107 -70 71 -89 -53 32 34 -14 -33 39 150 36 -8 24
3054B4j5J2p2J07L9m9j18l8J8J5K84k69L1n8K49q4J03j43J8r2J52j61R9L6o4J31
$$ 24 9 21 -51 56 95 46 -72 -110 -92 -77 207 -62 -31 -89 160 76 179 36 54 -38 114 -47 52 88 24 155
3080A55r8n7n9q3J93j9n8M3o4K3m6P1O5j66J95j15n8N4j67K55J07j28K2j25j51
$$ 155 57 0 -59 -142 51 32 -26 17 -47 -24 -70 1 66 -100 95 -20 -78 -24 -191 64 171 43 65 -60 -211
3105b11K58j01L6O0J2j93M6J56j45J00M6p0J15j57K08j16m9J84l28J14p7O8M7
$$ -211 47 -54 -18 42 54 -139 -93 63 -82 18 64 -6 109 -48 160 44 -5 179 -149 -35 -112 -44 3
3128CJJ0j72J50lR9n1J0N9j97j5R6Q1J8r3j92K27p5m8J27k3Ro7j23K62k56jK43
$$ 3 4 14 -158 -8 -11 88 37 47 106 -91 -106 -10 71 89 -4 -196 31 -44 -92 35 12 21 -46 -169 93 -163 -164 79
3156G9J08p6j61P8j4J4J02r2q6k1k1J17r3R0J18j43J01j13J31j78o8J83j51J88
$$ 79 187 111 -50 28 14 28 130 38 -48 -69 -90 27 -66 24 142 -1 100 -13 118 -60 -128 55 -96 92
3180I2j61P4k20L28j82Q2L8k40J74O3r2o2J85l9K12l29K03j07M6O3m4N0j04o7
$$ 92 -69 5 -215 113 -69 13 51 -189 -15 48 -44 -106 79 40 252 -77 126 19 65 128 84 134 30 -37
3204c7k3M7j0J34j97o4L69k64m6j20J61L7j6L0j30j1P5R8j63J20N7o2k3K1o1p
$$ -37 -60 -13 -23 111 -86 -150 219 -45 -91 -211 -50 -13 -29 1 -129 -140 -65 33 -130 -10 47 -15 -38 -17 -78 -85
3230h5q3K49j91K12K9j85K36l47J83l2L9r2l9m0P7K07k84K64k8r5j93J67KJ74
$$ -85 -168 81 -110 102 131 -54 182 -165 18 -14 25 -67 -106 -146 -69 138 -146 118 90 -5 -198 -31 -29 145
3254A45j84Q6Lj15p9j36L66k8p3M3m1l3J27m4L4k9J9K2r9j9j03K19M5k22P0k5
$$ 145 -39 47 50 -65 -144 -280 86 58 -15 28 -13 -46 81 37 71 42 61 83 -16 -35 -138 81 126 -96 -26 -51
3280e1L5j17R8J03k13J5K36j8ko0o4K7l5J52j74j21K33j66P1P1o0L9j26j10L66
$$ -51 -16 -133 -35 68 -145 -130 106 88 86 26 -38 -11 -46 106 -68 -189 44 -122 -51 20 -40 -1 -127 -237 129
3305A29m9j61J60K5p9r5J71j53n9K07k8Qk21J98Q6k80L27j47n2J28l0j63J20p6
$$ 129 80 -81 79 104 25 -70 101 -52 -111 96 68 76 -145 53 139 -141 186 39 -13 115 85 -78 42 -34
3329c4o0J37R3j35l5J32j45O7J64j76j04P3J5R7j51J40j67M0L8j02J55M6k8o8
$$ -34 -94 43 136 1 -34 98 -47 20 184 8 -96 -23 -8 89 -62 78 -89 -49 -11 -113 42 88 60 -8
3353ho0J05r7q0K11N3k5J9k83J58j9m7J47o3K1j22K19l2j01Om3J5R5N2j01L7O4
$$ -8 -68 37 -60 -140 71 124 99 118 -165 -7 -26 -73 74 11 32 -90 129 97 -4 2 -41 -26 69 121 20 57 121
3380A21k68J34j29K82k71J90l7K53k46l3K1k00J76j53J79p1R8j11M8m4J03q3j4
$$ 121 -147 -13 -142 140 -131 59 22 275 29 -4 17 -183 -7 -160 19 -52 46 -65 -17 -61 42 -41 -55
3403e5J5k7J42L8j15J25N5r6p7p1K21r9j33K7J72k29n8J73j34J59j6kN5k46M7
$$ -55 -40 -67 75 113 -2 123 178 82 5 -66 155 56 -77 -50 122 -107 -165 8 -126 33 17 15 70 -176 -129
3428a29J63K0m8kj64p1K08o2O7j0q0K44M2k29p2R2j2j4L2Q7q1M8R0k16l9M2R3
$$ -129 34 54 6 4 -160 -231 -23 -85 -18 -28 -108 136 178 -51 -123 -31 -43 -57 -25 62 -19 29 119 -97 -136 -94 -1
3455aO2k06J34RJ43j85K8j05K44k00o8J49n5P8j68K31k8j55J15j2m3K33j43j11
$$ -1 61 -145 -11 -2 141 -44 -16 -121 123 -77 -145 4 -51 27 -141 90 62 -93 22 10 -33 200 57 -54
3479e4R0j23Q8n6J56j22Q1qn9m7J07q4j12K33q3L1j28K3P5n4j1M0j4L4Q9p3P9
$$ -54 36 -87 1 -55 101 -21 60 52 -7 -54 53 -31 -143 90 7 38 -90 -67 8 -46 -57 -17 -31 3 92 19 98
3506I8M6L7j63J1j3j82K4K60j67J03j82R3O5n3L5p5Q6PJK9J6q4j73J97j80K19
$$ 98 144 181 18 29 16 -166 -142 118 -49 54 -128 -35 30 -23 12 -63 23 30 31 60 76 -8 -181 16 -164 55
3532E5j1j64J2J91j46J71j54P2J3n0m4K42j99q8K08p1O3mj38j21K86k2k16J90
$$ 55 44 -120 -108 83 -63 108 -46 26 39 -11 -55 187 -12 -100 108 37 100 96 -42 -163 123 101 -115 75
3556G5k11J49O9j9o7R0j44o3M5R5O8Jn4m0J06o9L8j99J96p9Q8n0J1kkL4j58n3
$$ 75 -136 13 82 63 -4 86 -58 -121 -76 19 87 88 34 -6 100 31 69 -130 66 -13 75 25 36 34 32 66 -92 -145
3584a45J66l9J08o8J0l5K08k09q7J60j4p2o7J50O5r1j2j22J20Pn0j18L03j39O1
$$ -145 21 -18 90 22 32 -3 205 -4 -91 69 55 -17 -84 66 131 40 28 -94 26 33 -17 -135 168 29 90
3609I0q8K4PJ39j73j80J41K6R8J06l09J99o8j5J00j07p7J18j4J11k01J4J95j91
$$ 90 2 26 33 172 -1 -181 -40 -14 84 190 -119 80 12 -3 97 -10 -87 31 17 128 -73 -59 136 -55
3633e5N9r5L2N0jr6O5l5L7J46k03J99j3K0n3JP5r8j33J12K5j27J70k13R1M9K0
$$ -55 4 -91 -59 -9 -10 -106 -41 -76 -39 107 -96 103 90 110 57 58 133 35 -98 14 39 -88 82 -131 -40 9 29
3660B9n9L5o3L9J43k49J65L1j7k4l2j56R7jJ10k78J75Q6J7K9p9N8j30P1j02J39
$$ 29 -30 5 -58 -19 124 -125 40 71 54 30 -2 -158 -61 -62 48 -230 -55 31 48 77 -2 56 -74 -3 -105 34
3686C4Q4l7k6q1j9J87k21oJ31J4m9Q3j74J97o5n7R3O7k80J05O9j79J16O1j11j4
$$ 34 118 81 55 -26 -45 142 -79 -85 46 60 11 94 -80 117 52 -5 88 155 -125 -20 49 -130 -14 47 -64 -78
3712g8K49j93N3R1j53L3J7M4j74J67pj59L8N7R3k9N4j26O5j98K65p7M5M0k24K40
$$ -78 171 -22 31 122 -31 2 19 63 -111 56 49 -110 -72 -15 78 49 103 -23 42 -156 109 32 77 117 -107 133
3738A33m9r3M3r0o9R8N4lm8K9R5j29m4J43n6O8Pj24r7N1J99j02k5L1k15K10k29
$$ 133 84 -9 34 -56 -125 -27 27 24 -24 5 100 -29 -73 70 14 82 89 -35 -132 -81 118 16 -9 22 -193 17 -212
3765b12J02J90l03K49j17J91k69K13l2nj29q2J74j19J92j2q6R9j7R0j57J1j5q8
$$ -212 -110 80 -223 26 -91 100 -169 44 12 7 -122 -204 -30 -149 43 31 -55 44 27 117 -40 -29 -44 -132
3789a32K81j44J5k9R1J2j4j32N3j3K7O7Rj25J4k2N3J20k07J35l7j01J51j80J76
$$ -132 149 5 20 -9 82 94 80 -52 1 -12 15 82 91 -34 -20 -42 11 131 -76 59 22 -79 72 -108 68
3814F8L6m4K2q8j22K6R5m1M4k1m4L8L9n0L2l4j1R9l8l0P1K9N9j04q9J44o1L2j01
$$ 68 104 60 82 -6 -128 -102 -7 -48 -4 -25 -69 -31 8 -42 -10 -44 -55 44 6 -24 47 76 135 31 -58 86 25 57 -44
3843d4ml1K9J42j13j29Q6L3R2r5j4o9Q2N1rQ4O6k61L6J46j44j1J0j44J95j8O1
$$ -44 -48 -79 -50 92 -21 -150 -64 -31 61 -34 -48 -117 -35 16 7 91 157 -104 -68 78 -66 -77 -67 -211 -16 -34 27
3870B7l3j15J43q8J25mK0j3k61K72o1o1j3J36O2l56L16j53J8K5K1m1O4K9r6R9
$$ 27 -6 -121 22 -66 59 55 75 62 -199 73 12 -49 -62 74 136 -220 96 -57 -39 -14 7 -34 30 59 -37 62
3896F2j92J27q1qJ20K0l7J36r7m7L4o9r9J87m3j4Nqm8J05j02N2o4K50l43J63N0
$$ 62 -130 -3 -84 -92 28 48 11 147 50 3 37 -32 -131 56 13 -1 4 -4 -52 53 -49 3 -61 189 -154 9 59
3923E9l3o7J49p3L0J6j52Q6K1K4p5P8j36J82k45J30N1P7k27J05p1k1J89q7p9J21
$$ 59 26 -41 108 35 65 81 -71 15 36 60 -15 63 -73 109 -136 -6 45 122 -105 0 -71 -92 97 10 -69 52
3949E2L1J0J22l16K15j83J96j54Oo7O5K6Q8l64K14R6j92J11J15j26J7O9j47R3
$$ 52 83 93 215 -101 114 -69 127 -27 -21 -88 -23 3 91 -273 -59 37 -155 -44 71 -55 -38 31 -116 -23
3973b3P7K4M2k05kJ14K7K3j13J53j57nJ42m6m1J14j83m7J50j32K50M5j02K0j88
$$ -23 54 78 120 -85 -87 27 54 77 -36 117 -40 -45 97 51 10 124 -59 -106 44 -88 162 207 105 125 -63
3998f3l4J04K4J04k38j6K5J81j22q5Q6O4l9P1K7j10J67j63N2J12j90J92k34q9
$$ -63 -97 7 31 135 -103 -119 -94 87 -35 -120 -34 30 -9 62 89 -21 146 -17 35 147 -43 149 -85 -174
4022a74N2K60j99J56k82J91KM1O7Q2J3m56L44j50L4O6ql5krMj4P7J8M4k13o8J32
$$ -174 -122 138 -61 95 -187 4 6 47 114 196 209 -247 97 -53 -19 47 39 4 2 -7 -3 -17 60 78 122 -91 -159 -27
4050b7J03j8r9p9K05o3o5R4j3J22l88K61mj52P1j39K43j68J77r3O2Lj10J78k08
$$ -27 76 58 -41 -120 85 22 -43 51 38 160 -228 33 29 -123 -52 -191 52 -116 61 -32 30 33 -77 101 -107
4075a07mj5M1J60j14j02J2K05o3Q7o9N4j31M6M7q2J9J28j59O7k2l2J9J1M1jj7
$$ -107 -111 -126 -85 75 -39 -141 -129 76 13 100 31 85 -46 0 47 -35 -16 112 -47 20 -2 -34 -15 -4 37 36 19
4102A9j30Q2j00nK50r3L6L8j24j0K5P5k4o3j02J18q1Q2JQ9j10j13M7k7K33k15
$$ 19 -111 -29 -129 -134 116 23 59 97 -27 -37 -12 63 39 -24 -126 -8 -89 -7 -6 83 -27 -140 -93 -120 113 -102
4128a02J51L7L2r1M8j08J28j04P2J35j61m7L1r0J25q9rO9q1J42p4J34p4k13M5
$$ -102 49 86 118 27 75 -33 95 -9 63 198 37 -10 21 -69 56 -33 -42 27 -54 88 14 148 74 -139 -94
4153i4L49j59n5j5j93K00m5rR9RJ01j94j08L7J2K7Nj50J59j2N3J3k1l5nl0J10
$$ -94 255 96 41 26 -167 33 -12 -21 78 87 188 -6 -114 -77 -65 -38 -33 -183 -24 -36 17 30 9 -26 -31 -61 49
4180D9j59J58M7k1l2K7p8J5j80K12N0j39J11J8l2q5J43n4L9n2n0P0R9L0r9j88
$$ 49 -110 48 95 74 42 69 -9 6 -174 38 88 -51 60 78 46 -39 104 50 89 37 -13 57 156 186 87 -101
4206a01J11Q6q4L1J07n9j36J25n1mr3K1k2O6l3oM8J4J80q0j04k6J08j72o6K10
$$ -101 10 96 12 43 150 91 -45 80 29 25 -68 -47 -69 -3 -36 -42 6 20 200 120 16 -10 98 -74 -140 70
4232G0j5O6j82J15p8P9j31n0J28p7k1J73P4kr4m9j53J16L08k45ok5p7P5Lk3P5
$$ 70 55 121 -61 54 -24 55 -76 -126 2 -75 -96 77 151 149 55 6 -147 -31 277 32 26 1 -76 -1 2 -21 54
4259E4k6ll8M5J2P8j50N8j93J56K46k01p4j57J81j16K38L2K5J30k08o1j3M1n5
$$ 54 28 25 -13 32 44 122 -28 30 -163 -7 239 38 -36 -193 -12 -128 110 142 167 297 89 28 15 56 1
4284AJ18k92J58K9n7J46k7j62Q8K2J08j17j04J42q6j38L61j85j15J18m8j5K9J15
$$ 1 119 -173 -15 14 -43 103 76 -86 2 24 132 15 -89 53 -33 -171 190 5 -110 8 -40 -55 -26 89
4308H9O9j29O4O6n8o3k24N6J56j90K11l9M5P6k30M3K6M3k12J78L0j9K6m8j5rJ51
$$ 89 158 29 93 159 101 38 -186 -130 26 -164 47 8 53 129 -101 -58 -32 11 -201 -23 7 -12 14 -34 -49 -58 93
4335I3j92J94j95L5J35r0R7LJ9p9n0Rp8J41j27K11q5N3k01J01J32k22N7M9J5J8
$$ 93 -99 95 -100 -65 70 -20 77 80 99 20 -30 -21 -99 42 -85 126 41 94 -107 -6 126 -96 -39 10 25 43
4361D3k5O6j46k9Q3r8R7k2J39j53L5pJ5R6k57OJ83q2p6N4Q5k2j0N7j9N1L9m1j09
$$ 43 18 84 -62 -91 -8 -106 -9 -31 108 -45 -10 -17 -2 94 -163 -157 26 -56 -132 -78 7 -15 -25 32 13 64 103 62 -47
4390d7L3J9K6j42J15q4rJ44lk84K00L7j03K30k69J90rk4k38J36O7n3q7J5lK67
$$ -47 -14 5 31 -111 4 -80 -89 55 52 -232 -32 5 -98 132 -137 53 44 20 -218 -82 -15 -68 -155 -140 -143 124
4416A24p9r1P7Jj38R6m6M5Q7k31K24J00k08J60k46K43j09K7lM8m3j03QJ09j59
$$ 124 45 -46 31 32 -106 -10 -56 -11 76 -155 69 169 -39 121 -125 118 9 36 33 81 38 -65 -57 52 -107
4441a07J13P9j81J7l2J38N8j39K22j96l8N0O4L7K8l0n2l1o9J11l2n9N8O0q9K3
$$ -107 6 85 -96 -79 -111 27 85 -54 168 -28 -66 -16 48 85 113 83 31 0 -69 42 10 -49 9 69 -20 3
4467Ck2j84K20o6J86n4j33P1j66J67O9k49K64m6J12p7r2Q3p8n0J54j86J9J17k9
$$ 3 -19 -203 17 -49 137 83 -50 21 -145 22 91 -158 106 60 172 95 3 86 8 -42 112 -74 -55 62 33
4492C3j1J73k00P4m9n2J25j71J48K9j34O1k09J21M2J77j20q4Q6m2J14k25J11N
$$ 33 22 195 -5 69 20 -32 93 -78 70 99 -35 26 -183 -62 -20 157 37 -47 39 -3 111 -114 -3 2
4516BM5q2K01k36Nj0q1o0J83J24j45j3N8j07J81J02j34P1j84N2J07l1J0L5q8L
$$ 2 47 -35 166 -70 -65 -75 -156 -216 -33 91 -54 -67 -9 -116 65 167 33 104 -80 -28 79 48 58 93 5 8
4542HL7o9R2m9q5J64m6L6l1j18L8k12K13J15j28J40r9N4k15O8nK31q1K9M1q5M5
$$ 8 45 -24 68 19 -66 98 52 88 57 -61 -23 -235 -22 93 -35 105 6 60 -155 -87 -92 139 58 87 128 43 88
4569H8k33J38M0k09J28K24k33J00m6o2J75k36J52J27k47M7P6R3j37l4JM7Q1j51
$$ 88 -145 -7 33 -176 -48 176 -57 43 -3 -65 110 -126 26 153 -94 -47 29 122 -15 -49 -48 -1 80 -71
4593g1l5L6R4N6KJ50j46j2j58J45N0l1l1j54k4J75k8o9Q4j4L2j21O2P2N3r7O9
$$ -71 -106 -70 24 80 82 232 86 74 -84 61 111 80 49 -105 -129 46 18 -51 33 19 51 -70 -8 64 117 20 89
4620H9P7j16k42J80J11n0P1L9k41J62j73L6K3m5O5K75l85J30J4M6O3j63j74J89
$$ 89 166 50 -192 -12 99 49 120 159 -82 80 -93 -57 -34 -79 -14 261 -124 6 20 66 129 -34 -208 -19
4644a9J09m6n9p2J3J93k86K14n3J8J09k63K28J5m7J5j05K9j32K78L9k21kk3O2
$$ -19 90 44 -15 -87 -74 119 -167 47 -6 12 121 -142 86 101 54 69 -36 -7 -139 139 178 -43 -45 -68 -6
4669fp0K05j01m0m9P3q3J14k00Q3N5K5m5M8l2N0r3O5MrK10lj67N0r7j06J09P3
$$ -6 -76 129 28 -12 -61 12 -71 43 -157 -74 -19 6 -39 9 -23 27 -66 -1 3 -6 204 201 34 84 -13 -119 -10 63
4697F3j71R1K4K4k31K11m6J01j26O9M9p8l7J81l8j25J42q9L0r0r8J36JM7j31Q
$$ 63 -108 -17 7 31 -200 11 -35 66 -60 9 58 -20 -57 124 86 -39 103 14 44 -46 -144 -8 -7 40 -91 -83
4723h3J93o9j10J56K8j92r2K50J3%L4p8K9j67q5J32J7j18J81p3OJ91k61J09j7
$$ -83 110 41 -69 87 115 -77 -169 81 94 94 128 50 79 -88 -173 -41 -24 -142 39 -34 -28 163 -98 11 -6
4748fj7Q5m8j00J85j28J85k00j3J77r3j30J79KN3j85Q6l1L3J13j60P5l6N9r6j4
$$ -6 -23 62 14 -86 99 -29 156 -44 -57 120 27 -103 76 78 131 -54 32 1 34 147 -13 62 26 85 -11 -25
4774b5J47N0j07P3j3q1N8j34K5o6J69o3l2j16jK12j43M4k1JJ33o9k09J71J90j72
$$ -25 122 172 65 138 125 44 102 -32 -7 -73 96 33 1 -115 -116 96 -47 -3 -24 -23 110 41 -168 3 193 21
4800B1l7m0m8K5O5O6O3p5k2q9O1J33L8j26m5r3O1J68k9j85J75o9J3l4M0J17j43
$$ 21 -16 -56 -104 -79 -14 52 115 40 18 -71 -10 123 161 35 -10 -103 -42 126 97 -88 87 18 31 -3 37 154 11
4827A1n0J54j66L2P7l3j20Q1j08J43p6J5P2k3J40r9N4K8j04J47k19o9J81j19l4
$$ 11 -39 115 -51 -19 58 25 -95 -14 -122 21 -55 -40 32 9 149 50 104 132 28 175 -44 -113 68 -51 -85
4852h5K61j14k2N6l5K2j66J60j73J33J73j84j30o3J26M9J08o1n4J18r0j14R2N
$$ -85 176 62 40 96 61 83 -83 77 -96 37 210 26 -104 -167 -41 8 116 55 1 119 29 -85 7 12
4876A2o9K7R3k2p8J16r7O2j30M6J20q7k4J54k6j19J78pj99j5O5l8J37k34P7J15
$$ 12 -57 -30 63 41 -37 79 -18 44 -86 -40 80 -7 -31 123 97 -22 156 149 -50 -65 0 -38 99 -135 -58 57
4902E7j30P8m5K6j5R4om5j07j6R3j18J28M7kP8j29n4nJ05%J1o2m8J52j72J32Q
$$ 57 -73 5 -40 -14 -29 65 59 14 -93 -109 -16 -134 -6 41 39 117 -12 -66 -71 34 34 45 -17 -65 87 -85 47 55
4930E5J5k25K40j45J96j27j08K26k03R8q1J10j42J16q5k1RK8J8j26J33q3J39p4
$$ 55 70 -155 85 -60 136 9 -99 127 -76 22 -59 51 -91 25 -60 -81 -72 -44 -26 -152 -19 -102 37 -37
4954c7J14l4n8J59l20K81k29J03Q7l1j5k2JNQ8m9N8p3M8J6k73J78q3K03JN3k08
$$ -37 77 43 -15 144 -176 105 -124 -21 66 35 20 -2 -1 4 92 43 101 28 76 92 -181 -3 -86 117 118 171 -37
4981c7P6n0J7O5k5o5M8J6j41J23rO3k07K47nl6j65k7J30Pj12J6o6N8N8R8J13l43
$$ -37 39 -11 6 71 46 -19 29 45 -96 27 18 81 -126 121 116 80 -85 -112 18 25 -87 -71 -137 -79 -21 77 190 -153
5009a53R8NK93l16J22p3K13j48K06k40n2J10o5m0J25k29O9O8oR0j30RMN4J74j00
$$ -153 -55 -50 243 -73 49 -24 189 41 247 7 -45 65 0 -40 85 -144 -75 -7 -13 77 -53 -44 -40 14 188 88
5035H8k54P2k5OJ24j04r6J62J1j14M3N9RJ37j29J5m2N6q3R4j4p6J73k20J94r6
$$ 88 -166 -94 -119 -113 11 -93 -189 -27 -16 -130 -87 -28 -19 118 -11 4 -38 18 -65 29 15 -61 112 -108 86 -10
5061a0j1o9K03k59J15Jj16K73j63J56L8j59r6j04J26J37j2m1r5mO9Q6O2j83j9
$$ -10 -21 -90 113 -146 -31 -30 -146 127 -36 120 158 -1 -97 -201 -75 62 50 9 -86 -90 -21 65 127 -56 -75
5086g5J23o5r2J69J04j16j39N9Q7q2R7K2q7l5R5p3RJ59k08J09J19j37l8o2M9P
$$ -75 48 -17 -109 60 164 48 -91 -32 55 -27 70 92 5 -30 65 -8 1 160 -48 61 180 43 5 -57 -8 -1
5112aN0n4J67l9j85J09j10p5R4J19j4J07j01l2k27J46J64J16j01j09M4j41M8o5
$$ -1 49 -5 162 123 -62 47 -63 -138 -44 75 61 168 67 35 -192 -46 118 234 133 24 68 -73 -25 -90
5136i0K1m0J48O7j46J65j68l3J2J47J0j33j4J9L3q6N7q0K74n8j18K8m5J21q2j39
$$ -90 -69 -109 39 106 -40 125 -43 -76 -64 83 93 -40 -54 -35 -2 -88 -31 -111 163 105 -13 15 -30 91 9 -130
5162a30J29j11J45o5l2LJ71On8k57J68J08r8o8RJ28N4m8j04J00j15J49m6p6K7
$$ -130 -1 -112 33 -32 -64 -61 110 116 58 -199 -31 77 -21 -89 -80 48 102 54 -50 50 -65 84 38 -38 -11
5187a1j40P5J55j13q1L19j28j57K61j01k17J23q3J30m8J75j28o8jJ06N1j27J32
$$ -11 -151 -76 79 -34 -115 204 76 -81 180 79 -138 -15 -98 32 -16 159 31 -37 -38 68 119 -8 124
5210A24r0J13j47J6l7n1p1R4J70q3j20P9m7nk31K89J35k28K07p9n4L1Jr6Q5n6
$$ 124 34 147 0 16 -21 -72 -143 -49 121 38 -82 -3 -50 -55 -286 3 138 -90 117 38 -16 15 16 -80 5 -51
5236e1J33K0j63J04j03J1P2k3L2j56P7R5O9p0q3L3p2J01K1N0Qo8M2n0q5J46m7
$$ -51 82 102 -61 43 -60 -49 23 0 32 -124 -47 48 117 47 -36 -3 -75 26 47 97 105 37 79 29 -56 90 43
5263D3o2J0m6j28J17p4Q1J02p1m7L6m0K1J17j24M9Q5J27k17R1J6j65R6o6Ql8O8
$$ 43 -19 -9 -55 -183 -66 -140 -59 43 -28 -75 -39 -79 -58 59 -65 -16 69 196 -21 70 86 -79 17 -49 -41 -79 -11
5290a1K00k45M8O1n9J17j29N2P4j53l5k9MO3J04k8J44q7j21P9q9K3j5J0J30k79
$$ -11 189 -56 -8 53 -6 111 -18 34 108 -45 -80 -109 -105 -42 62 34 178 91 -30 49 -40 -17 -32 -22 108 -171
5316a71L24j01r3K34j17k27J32n0R3J3J2ll8J09j16J70l69J87J38k22K08k42J22
$$ -171 153 52 -41 193 76 -151 -19 -69 24 37 49 46 8 117 1 171 -198 -11 127 -95 113 -129 -7
5339gj24L8M6K3J82j35J1m6j7J00j30J47m5j45K03k15K53k97J58P5k20L5O9j0
$$ -7 -131 -93 -47 -24 158 23 34 -12 -29 71 -59 88 43 -102 101 -114 139 -158 0 75 -145 -110 -41 -51
5363e1m5J36j47R4j02J4p8nJ76J4L9k42K36L0n8j14K02m3p1J1R3j38j3LJ1K18
$$ -51 -96 40 -107 -13 -115 -101 -179 -184 -8 6 45 -197 39 69 11 -103 99 56 -15 -4 89 -49 -62 -59 -48 170
5389A70k38J21O7k41O0P2M1q4p7N7q6N0P6j49J85j08J45jj29J67j1l7j70J77r7
$$ 170 -68 53 120 -121 -61 11 52 -32 -109 -52 -138 -88 -12 -161 24 -84 61 60 -69 98 87 50 -120 57 -40
5414d0J03m2q3N3K6m1q9J23k18J18LK05j56q6J36N6J57j26M1j55L5L7j41N7j0
$$ -40 63 21 -62 -9 17 -24 -113 10 -208 -90 -87 118 -38 -124 12 68 225 99 140 -15 20 57 -84 -27 -37
5439c7L3J8pmn4j63K46n8K6O3j28K22k32j8J26mM4j67P0Q6j40m5K55k32J69k6
$$ -37 -4 14 7 3 -51 -214 32 -26 0 63 -65 157 -75 -93 33 29 73 -94 -24 62 -78 -123 132 -100 69 43
5465D3j72J79j0j19p3J99j71J79J21J8r3qj57m8rO3p0L16j7j98J8j19K26k32K40
$$ 43 -129 50 40 -79 -152 47 -124 55 176 194 101 93 -64 -112 -121 -58 -128 188 171 -27 -9 -128 98 -134 106
5490A06j83J47j1L4j21J08l5r2R2j83J74j03J46pM8j44k0Q1P9k09J44L2k01J11
$$ 106 -77 70 59 93 -28 80 45 -47 45 -138 36 -67 79 72 120 -24 -44 37 116 -93 51 83 -118 -7
5514gJ06j21q3Q1k3Rj36K38r0q5J09m7J12o1L7K8k3q6N0o2O4j09Q8N8j88J83O5
$$ -7 99 -22 -105 -24 -47 -38 -174 64 -26 -111 -2 -49 63 2 39 67 44 -42 8 -54 10 -99 -11 47 -141 42 107
5541A07p7p9N2j09O2Q3k88J28J3o7Q9J62m9k1p1M6Q8j52j24K59m2j35K16K3k80
$$ 107 30 -49 3 -106 -44 39 -249 -121 -108 -175 -86 76 27 6 -65 -19 69 -83 -207 52 10 -125 91 114 -166
5566a66kJ27j82J45j25J73Q3J22j36lq7J44j37Q5J05l38J65Q2m1n6J02j51n1P9
$$ -166 -168 -41 -223 -78 -203 -30 53 175 39 36 -51 93 -44 41 146 -192 -27 55 14 -42 60 -91 -142 -63
5590f3O5k7klK5J43j19j39J07P5J13k12R1K2j89l4K09o1J86k57J32r2O6NL9mj8
$$ -63 2 -25 -27 -30 -5 138 19 -120 -13 62 175 -37 54 76 -113 -147 62 1 187 -70 62 -30 36 41 80 76 58
5617E8j12R1j28K78j89P9j64J21N9j04N8j02J35q3J31j80O9jq0Q6n7P6J16l5k53
$$ 58 -54 37 -91 187 -2 77 -87 34 93 -11 47 -55 80 -3 128 -52 17 16 -64 22 -35 41 157 122 -131
5642a31J46r8L45l44kJ04j62L4K27N5j54j04J94l7o2J4N0j58K66p4Kq8k5m7P7
$$ -131 15 -83 262 -82 -84 20 -142 -108 119 174 20 -84 110 73 11 25 75 -83 183 109 111 23 -2 -49 28
5667B8j59O5%J44j23m9K11L6j18j82L8M2Mo7J59k12J65o1j4K82k06n2J70j06J25
$$ 28 -131 -66 -66 78 -45 -94 117 153 35 -147 -109 -67 -63 -130 29 -183 -18 -79 -93 189 -17 -69 101 -5 120
5692A20j37Nj02O7j07N1N5m7K74j41j49K9J28N3k29J09j46J56rJ12k1o5n4J42
$$ 120 -17 -12 -114 -47 -154 -103 -48 -95 179 38 -111 -82 46 99 -130 -21 -167 -11 -20 92 71 6 -48 94
5716I4kk19J68n4L1%p8J18Q3k07L7LR9r0J24q7R5J12k75R7L3j9j04R1k30J64J38
$$ 94 92 -127 41 -13 18 18 -60 58 141 -66 -29 -26 73 -17 107 20 115 227 -48 49 82 63 -41 50 -180 -16 122
5743A22p8K1Kp4m9L2j88K13q6M0J43r2qN6j24M9k1k3K17j45j22J22K6p3j16R8
$$ 122 44 65 67 -7 -56 -24 -212 1 -85 -45 98 6 -2 54 -70 -21 -42 -65 152 7 -115 7 33 -40 -156 -58
5769e8k7N1o5K21j08l5j4R8l1J75k11J53j92Q8%o3j59J11M4N0m2J61j97m9L7J12
$$ -58 -85 -34 -99 122 14 -21 -35 63 32 207 -4 149 -43 45 45 -18 -177 -66 -22 28 -14 147 -50 -99 -62 50
5795E0r7m7O6K9j60J64j99J04J04j5j64K16O5j78J63j68j28J23J12j64J84j80
$$ 50 -47 -94 -28 1 -159 5 -194 -90 14 -1 -165 51 116 -62 101 -67 -195 -72 40 -124 60 -120
5817a20K67j36l7KJ37j68J22r7j22J90J5l3q1J42j5K4n6l5M6j54K55k22J03k5
$$ -120 147 11 -26 -24 113 -55 67 -30 -152 38 53 20 -61 81 66 90 34 -1 45 -109 146 -76 27 2
5841BQ8J5k61J26N8j23J3N0j1J83m4j97K1R9k25R7R1N9M7o5Q5j99K09k59L3J43
$$ 2 90 105 -156 -30 28 -95 -82 -32 -43 140 96 -101 -80 19 -206 -109 -18 41 88 23 108 -91 118 -141 -108 35
5867C5j31J37q1J07j75K32j50m1J18j7r3N9o2OJ13k10J79J9r1jRMJ37k0k8j82
$$ 35 -96 41 -40 67 -108 124 -26 -67 51 34 -59 0 -62 -56 57 -153 26 45 -46 -47 -38 -34 103 83 55 -127
5893a27J86m2M4q1o5N4o8P1J63j98K30l8m4k01Q7J6J39m6m4J33l3j60j35J48j0
$$ -127 59 17 61 -20 -85 -31 -99 -28 135 -63 167 129 85 -116 -29 -13 126 80 36 169 136 -24 -159 -11 -21
5918b1k4Mo8K7J62mk20K9K60j98J17n4j58K69k72J72M2k3o4J43j44j40J38J22
$$ -21 -45 -41 -109 -82 80 76 -144 -115 145 -53 64 10 -148 121 -151 21 63 40 -24 119 -25 -165 -27 95
5942I5l8k7o7O8j06J35j91K24l2L3K8j23j31J19K36j90p3O5j04l6J57p9J19j65
$$ 95 57 30 -37 31 -75 60 -131 93 61 94 122 -1 -132 -13 223 33 -40 25 -79 -115 42 -37 82 -83
5966h3J37j15m3K24j84J69l1Kr1L4j6j04J31j2QR9j27N0j09K47j96NJ02K6j84
$$ -83 54 -61 -104 120 -64 105 74 76 -15 19 3 -101 30 18 26 125 -2 48 -61 186 -10 -5 97 123 -61
5991f1K5J13r2l7Nj06J65M3p4K0j05J67Q6r7J06j41l0Rj40M1O9r5J17j6n8R4j10
$$ -61 -36 77 -15 -52 -47 -153 12 55 -19 1 -104 63 149 52 158 17 -13 -4 -144 -103 -34 -129 -12 -28 -86 8 -102
6018a02J2m4K43q6J0j3J03j40j6K1k0M0n0P9n8L7p8j38K49r1l9J35k16N6jJ89
$$ -102 -90 -134 109 23 33 20 123 -17 -33 -12 -32 8 -42 37 -21 16 -62 -200 49 -42 -81 54 -162 -106 -107 82
6044H2j50j61K34P0q0k2P9k8n7J69k19R7J8L2O1p2r1j52J60K3J22j9k32K00o4
$$ 82 -68 -229 5 75 -5 -27 52 24 -33 136 -83 14 32 64 125 53 -38 -190 -30 -7 115 96 -136 64 0
6069@j09J28L4q1n4J19j59N0J38q8K5J6J1j7Q8R5k41Q9j8M5p4R4j39J29Pk66L37
$$ 0 -109 19 53 -28 -82 37 -122 -72 66 -22 3 19 30 13 101 196 -45 44 26 71 -3 91 -48 81 88 -178 159
6096A59k59K05j90J17j6Nj68J04J22K7M4r7nK4P4j40J82j34n6p4pM6nM7j37K26
$$ 159 -100 105 -85 32 16 21 -147 -43 79 106 150 53 48 72 146 6 188 54 -2 -76 -83 -37 -42 5 -132 94
6122I4n6r0o7K50p4n9J8J27l0j13j27J35n0N4%j21K19j84J34n9J29j32Kk6Rl0
$$ 94 38 -52 -119 131 57 -2 16 143 113 0 -127 8 -42 12 12 -109 110 -74 60 1 130 -2 0 -26 -17 -47
6148d7J18j6K7j41R4j79N7m7J64p8J69j51j6J50P5j67L4Q0k73m6M3J87l1k22K30
$$ -47 71 55 82 -59 35 -144 -87 -134 30 -48 121 -30 -46 104 179 12 46 126 -147 -193 -150 37 6 -216 14
6173A4J53p9j32J17M9M0k5k14J05j87J78j50J38n4j2N8m7m1J34j20Q7j15J65q9
$$ 14 167 88 -44 73 122 162 137 -77 28 -159 19 -131 7 -47 -59 -1 -48 -89 45 -75 12 -103 62 -27
6197b7j3R9j56J38q8J7m2M7L5l6N8m9J8j27rK09j54K59l00J74l6J70j90j37J62
$$ -27 -40 59 -97 41 -47 -30 -72 -25 10 -26 32 -17 1 -126 -135 74 -80 179 -121 53 17 187 -3 -140 22
6222B2N5p3K6j88P2M5Q9j87R7n6K50k79J51j8l5lJ54k07K20k39J28r4j09K21P
$$ 22 77 4 30 -158 -86 -41 48 -139 -42 -98 152 -127 24 6 -29 -32 122 -85 135 -104 24 -70 -179 42 49
6247D9q4P9N9k44K15j87K4QjJ93j65K05j77mJ59k3j51Q1K6k7n1P1OL9j84K8K9
$$ 49 -35 44 103 -141 74 -113 -89 -81 -82 111 -54 151 -26 -30 129 106 -45 36 62 35 -16 55 61 100 -84 -56 -27
6274b7L5n5J18J15k5k74R3j35K51j62Q5N3K0Nn9j43P6O1j50J0K14l09K06lL7N
$$ -27 8 -47 71 186 161 -113 -20 -155 96 -66 19 72 92 97 38 -105 -29 32 -118 -108 106 -203 3 0 37 42
6300D2j32O9l6J12j54K45j14M0n9p%n8nJ54K2j22K26k78J60j31p0N2k7Q6L5k69
$$ 42 -90 -21 -57 55 -99 146 32 72 13 6 6 -52 -57 97 119 -3 223 -55 105 -26 -96 -44 -71 15 50 -219
6326b19K81r2J2j03J14J2q1J03j52K41pm2J12j98P0j01O9Q6q2P7m3O9r6K4j47
$$ -219 62 -30 -18 -121 -7 5 -76 27 -125 116 109 67 179 -19 51 -50 19 105 23 100 57 126 30 54 -93
6351i3Q6kR9k04Q2j6J42k34L01L9l53R8n5J59j75R7KK5P9k30P5K15j53j4o4j7
$$ -93 -7 -9 90 -114 -32 -48 94 -140 161 200 -153 -55 -110 49 -126 -29 -27 -2 77 -153 -78 137 -16 -30 -94 -111
6377a11K55j60Nl4K1j74K63n8o5P2n7ol1J53j94K92q0j28J3L9l1Q5p5Q4j14O4
$$ -111 144 -16 -11 -45 -24 -198 65 7 -58 14 -43 -49 -80 73 -121 171 91 -37 -24 15 -16 69 -6 78 -36 28
6403B8j02l1L3Q5kP4j41rr9J42o3J78j08o4j3pJ32J26j89L0J18k55J44j07Q1P6
$$ 28 -74 -105 -72 13 11 85 -56 -65 -164 -22 -85 93 -15 -79 -92 -99 33 159 -30 0 118 -137 7 -100 -19 57
6429E7L4p2j61K87k17J34j03J65p1kMN5j48OP7k9n2l5O7mQ6j69J59k59l0L47j04
$$ 57 91 19 -142 145 -72 62 -41 124 53 51 55 110 -38 -32 45 16 -36 -71 -4 -8 78 -91 68 -191 -221 126 22
6456B2Nkj7OJ26k04k2J20r1qo4J31N1j88J17J16o7p7%J31m8l7l5o6K02l7j75K2
$$ 22 27 25 8 14 140 -64 -86 34 -57 -65 -129 2 53 -135 -18 98 31 -46 -46 85 37 0 -35 -101 101 64 -111 -89
6484h9J23J05j75J25j96K8J36j03j56K50K9j40J51j62J27j2j91K37J2P8k57p7
$$ -89 34 139 -36 89 -107 -79 57 -46 -202 48 77 -63 88 -74 53 41 -150 87 99 177 -80 -157
6506a57K11k50J76j92K22l3J29k51J10J02j90Q2q4J37l9N5j11K30k28J15k2j09
$$ -157 54 -196 -20 -212 10 -23 106 -145 -35 67 -123 -41 -125 12 -27 28 -83 147 -81 34 12 -97
6528i7l1J04M6Q6j60p1J41j42J34jr0K21m2Mk3m7m7J47j64J34j63qk5J76j08J11
$$ -97 -128 -24 22 108 -52 -123 18 -124 10 9 -81 140 98 102 79 32 -15 132 -32 102 -61 -69 -94 82 -26 85
6554H5q3j54K05P1k3j95K6P3M3j31%lJ71p2o7N2J16m1j82k8Q0J52k8j89R6K36
$$ 85 2 -152 53 124 101 -94 -68 5 48 -83 -83 -86 85 13 -54 -2 114 73 -109 -137 -57 95 67 -122 -26 210
6580B10k32j02Q3N2n9J18k1j37J83j26q8J07OpL5l0j63J35J57j11J33p9P4p1r0
$$ 210 -22 -124 -41 11 -48 70 49 -88 95 -31 -119 -12 -6 -13 22 -8 -171 -36 121 10 143 64 138 67 -23
6605b3M8j61J12J02j04m3J32j8j1O3j52jN9%r9qK34kj40Q1j08K7Q2m2k9l5R3J9
$$ -23 25 -136 -24 78 -26 -69 63 45 34 97 -55 -56 3 3 -96 -104 130 128 -12 69 -39 -12 70 28 -1 -36 57 76
6633G6r2J28j74P8O7j25J1N5jl9J06m9l9O3j52M3J73n5j72M02l03O9j21L05j47
$$ 76 -16 112 -62 16 83 -42 -31 24 23 -16 90 41 2 65 -87 -44 129 74 -98 304 1 70 -51 254 107
6658A07j70N0l1l8j5J60j45j11J13J32j22M4K7r5K22k81J82q3m0R5o6o7L3LK20
$$ 107 -63 -13 -44 -82 -97 63 -82 -193 -80 52 -70 -26 1 -94 128 -153 29 -54 -94 1 -65 -132 -99 -96 124
6683A24Q9j19l4j85J52q7m5K9J67j35J05l6J8R8k61P7N1M5q3J1K6m7J62n2j82
$$ 124 213 94 60 -125 27 -60 -105 -76 91 -44 61 25 43 141 -120 -43 8 53 -30 -19 7 -40 122 70 -112
6708a12J39l8R3p9j6K08k21J19l9q3Q3J53j77o1j20J89k6Q8q2oJ11j78K9L3L3
$$ -112 27 -11 82 3 -13 195 -26 93 54 -29 54 207 30 -31 -151 38 12 100 18 12 123 -55 -26 7 40
6733D0Nj10K03j56RQ6qq0j42K78o6o7j08R8j11J60L2Oj41N2o4J01L4K2l1J71k65
$$ 40 45 -65 138 -18 -9 77 69 -11 -153 125 59 -8 -116 -18 -129 31 63 69 -72 -20 -84 17 51 73 42 213 -52
6760e2J35j29J30j19r7N5JP0o3M8L0j64J23P0Oj54J04m7p2J05J16K9J4j34m7k9
$$ -52 83 -46 84 -35 -132 -77 -76 -6 -69 -21 9 -155 -32 38 44 -110 -6 -53 -125 -20 96 125 139 5 -42 -71
6786g1l9l8J10j06K33k25q8K94j03J31k73R0J38n9j43J3p3K95k16J80q0K5l0o0
$$ -71 -110 -148 -38 -144 89 -136 -224 70 -33 98 -175 -85 53 -6 -149 -136 -209 86 -130 50 -30 -5 -35 -95
6810i5J62j64K58l6o1m4r3O5R9j65J50l2k15J5K47L4k01K69k51K27j87N8P8j79
$$ -95 67 -97 161 125 64 20 -73 -8 91 -74 76 44 -171 -156 91 125 -76 193 -58 169 -18 40 118 -61
6834f1R7j31J53k9j12j7J7K78k95M7N5m9N8M8j07K9j75J68M2j48J23J7k5j4j0
$$ -61 36 -95 58 29 -83 -100 -83 195 -100 -53 2 -47 11 59 -48 -19 -194 -26 16 -132 -9 8 -17 -31 -41
6859d1O3o8P4l7n8J05J51k50J58j80l8J85j17l4J42k3k05J42j12J02O2j23J18
$$ -41 22 -46 28 -9 -67 38 189 -61 97 -83 -121 64 -53 -87 55 32 -173 -31 -143 -41 21 -102 16
6882A6j99K05J25k80J36j15J00O3P7q2r8J01j24J7K45k48N6j1P9l1j71N5J75q3
$$ 16 -183 22 147 -133 3 -112 -12 51 128 46 -52 49 -75 -58 187 -61 -5 -16 63 32 -139 -84 91 8
6906Hl0n0J53p1J25j69j26K11J8j82J00o6k6J5mJ66l1p5K18o0k76J8R5l3q1J45
$$ 8 -22 -72 81 10 135 -34 -160 51 69 -113 -13 -79 -105 -90 -94 72 41 -34 184 124 -152 -134 -39 -72 -153 -8
6932hM4q7R4J16k29L3l3o1Q4J86j43j84K96j71pk6P1P5j05L9M6r9J08j20kM7k1
$$ -8 36 -51 43 159 -70 -37 -70 -131 -47 139 -4 -188 108 -63 -70 -96 -25 50 -55 -16 30 -69 39 -81 -83 -36 -57
6959e7J0J1N4J01l14K66J35o0j17j02p2J53P4j90Q6Q6O4p6p1j6mO6Rj15o5J78
$$ -57 -47 -36 18 119 -195 71 206 146 29 -73 -145 8 82 -108 -22 64 128 52 -19 -35 -39 27 36 -79 -144 34
6985C4j4K2L8q8j75J99p3N4k6J1o2L6L6k0J20l31J78o1J54p4j10J35LO0j13k2
$$ 34 20 42 80 -8 -183 16 -57 -3 -29 -18 -80 -44 -8 -28 92 -239 -61 -122 32 -42 -152 -17 -14 46 -67 -89
7011h9J41j10N6j52j39K82j27L4J04M2q9o2J88R2j27n0J74j40p1M3n5Q6rN9o2
$$ -89 52 -58 -2 -154 -293 -11 -138 -104 0 42 -47 -109 79 171 44 -6 168 28 -43 0 -55 31 22 81 19
7036A9rn8K23k2j80R6l9k8n0M0J14j42O8nj36P3k6J12l0q1LJ26j16o2N5n3J06
$$ 19 10 -48 175 153 -27 69 30 2 -48 -8 106 -36 32 27 -109 -36 -62 50 20 -61 -58 68 -48 -110 -55 -108 -2
7063bl6J3pl6J38r1m0PJ10Q6j72O9k6J29q9LL4rj80K0K47k46J32n7n9P2lJ77p5
$$ -2 -38 -25 -32 -68 70 -21 -61 -54 56 142 -30 39 13 142 53 56 90 81 -99 -79 168 -78 54 -3 -62 10 7 184 109
7092A09q4mq1N9R4k3p5m2J40j36R5j21N3l9J09j11Q5j8l4k02Q2L45j08k09R7m8
$$ 109 25 21 -60 -1 93 70 -5 -47 93 -43 52 -69 -16 -55 54 -57 28 10 -24 -226 -144 201 93 -116 -19 -67
7118f7Q7q9n7J27M2n4n7P3o6J63Nj43j5J53q4p8L1N5N8j29J12P1j28Nj10J75r9
$$ -67 20 -69 -126 1 43 -11 -68 5 -61 102 107 -36 -51 102 18 -60 -29 26 84 -45 67 138 10 15 -95 80 -19
7145a9L8po5k4J79r3k7J5O8P4j04K0q6jJ6N0%L9j00p1K5R8j95l9K18o1n8L1J30
$$ -19 19 12 -53 -77 102 9 -18 -3 65 139 35 55 -31 -32 -16 34 34 73 -27 -98 -73 25 -170 -209 9 -52 -110 -79 51
7174E1Q5j98Q5j66R7O5j10q9Q9J05o1O9j72K41p0o1J08n0o8J34j63J39R1o0j25
$$ 51 136 -62 23 -143 -46 19 -91 -180 -91 14 -47 22 -150 91 21 -40 68 18 -50 84 -79 60 151 91 -34
7199c4O2j7j1L6l3J28j17q9J7Q3j23J44j95Q8J33o0N9J9k4J5j88J88j70N6j08
$$ -34 28 11 0 36 3 131 14 -75 -58 25 -98 46 -149 -61 72 12 71 90 66 81 -107 81 -89 -33 -141
7224a41K05k35K51j61J40p4j13J31J80l37K8J94j71J44j64K9J12o2J15q8K1%j17
$$ -141 64 -171 80 -81 59 -15 -128 3 183 -154 -126 68 -103 41 -123 -94 18 -44 71 -17 4 4 -113
7247a13J51k2N7k3n3k3l1oK1l4P4r0p5J54nN8n3%K55k63J57l03K15k78J43J22
$$ -113 38 16 73 50 -3 -26 -57 -63 -42 -76 -2 -92 -167 -13 -18 40 -13 -13 242 -21 136 -167 48 -230 -87 35
7273C5j45R4k5J76k1l28K08J83k25J30j26k7J28J3n7j75L12pj13%r0P0j44L45
$$ 35 -110 -16 -41 135 114 -214 -6 177 -48 82 -44 -71 57 70 13 -162 150 143 30 30 -60 10 -134 211
7297B11j66k00L10k36m8O2N8Nj13R5j04R8L7mn5J00n1J58r9j65J46j55J23j13
$$ 211 45 -155 155 -81 -129 -67 -9 -4 -117 -22 -126 -28 9 5 -50 50 -1 157 58 -107 39 -116 7 -106
7321a06P4j06J57q8K26j51J5o0O7J02j63J50j08k3J30l59M11j73r0J89N2j83O
$$ -106 -32 -138 19 -69 157 6 21 -39 28 130 -33 117 9 -14 116 -243 168 -5 -95 94 146 -37 -31
7344c1K84j31K2j10K2k5O0p9RL8L1j55J13j27j3J33l7K4l6m1QQ1J00k74O8RJ58
$$ -31 253 122 144 34 56 31 91 12 21 59 90 -65 48 -79 -92 41 4 28 -8 -49 -41 40 140 -134 -66 -57 101
7371A01k6N1j39PJ74j68J20j61lpJ04j33J36j63j0Q5l9K9%R7j55Q0k2O7P1k7Q8
$$ 101 75 126 -13 -6 168 0 120 -41 -44 -51 53 -80 56 -107 -117 -32 -71 -42 -42 55 -100 -20 -42 25 96 69 157
7398A57j34q7J52j34r1J10O5J7q9Q1k5k7o3J50k76J45K02j78J2r9O6J86j06j07
$$ 157 23 -64 88 -46 -137 -27 38 55 -34 47 22 -5 -68 82 -194 -49 153 -25 -13 -112 -46 140 34 -73
7422g3P6j36K01j58n5J86o3J02r5m2K07j24m1J2R3j51K10j05n8J41k46J09j01
$$ -73 3 -133 68 -90 -145 41 -22 80 -15 -57 150 26 -15 -3 90 -61 149 44 -14 127 -119 -10 -111
7445a11m1K10L8L3j15m8L1j7K1n5J00O7k16K26J1p6q6lN2R9j43PQO7J81j89n3
$$ -111 -152 58 96 129 14 -34 -3 -20 1 -54 46 113 -103 123 134 58 -28 -31 21 120 -23 -16 -8 59 240 51 -2
7472bO9L8k16P2N9p8m1J16J55j69j70J44K5l9J16j49O7Qo1L8M6J00k93J53l5j0
$$ -2 67 105 -111 -39 20 -58 -99 17 172 3 -167 -23 2 -37 79 -70 -3 5 -56 -18 28 128 -165 -12 -47 -57
7498e7j78K87M4p4R3n2K8lj6m5j40K11j12j09L8K28j34L6oo7j5j9L6j0J89q7J17
$$ -57 -235 52 96 22 115 63 91 88 72 27 -113 98 -14 -123 -85 143 9 45 39 -28 -43 -62 -26 -36 153 66 183
7525A83k02J26k11N4m0J07p0J7n8J31Q5j77j5P7rm5K0J4k4j16J85j89J51J7J6
$$ 183 -19 107 -104 -50 -90 17 -53 -36 -94 37 122 -55 -70 7 -2 -47 -27 -13 -37 -153 32 -157 -6 11 27
7550B7Q8K2k36K5q0J79L0J09j37o5J69k0k08J62o5j68J62q4o1J32o8J12O5k6N0
$$ 27 115 137 -99 -74 -154 25 55 164 27 -38 131 111 -97 65 0 -168 -6 -90 -151 -19 -87 25 90 64 114
7575A14o1j28N6l8J06%j02J32j35p3P9O8Kj14NL6RP5J5p9M8N6j03J34r5j11O8
$$ 114 53 -75 -19 -57 49 49 -53 79 -56 -129 -50 18 20 -94 -89 -53 -44 31 46 -33 15 71 -32 102 7 -104 -36
7602c6J07k07qJ20L5r0J3N8J17K7k12J62q5m2j54J01O7J0p4J15j29K32k77J83
$$ -36 71 -136 -144 -24 11 -79 -66 -8 109 136 -76 86 1 -41 -195 -94 -27 -17 -91 24 -105 127 -150 33
7626C3j26J19j8O6p0%J72j64N4j30J1k4l5j25J37KM5J84j47N4O9j02o2oL2P9q9
$$ 33 -93 26 8 74 4 4 176 12 66 -64 -53 -77 -112 -237 -100 -98 -53 131 -16 38 107 5 -57 -63 -31 48 -41
7653d1m9K13l35J52J7L4K1P2j58O4M5j26Q0K9p4J57j34J01n3q4m4J52k2k7j48
$$ -41 -90 123 -212 -60 -43 -9 12 84 -74 -10 35 -91 -11 18 -56 101 -33 68 15 -69 -113 39 17 -10 -158
7678a58J37N5o1J27p0LJ52l36J34J92j52OP3Oj05J71k28O6J0j39o5J42p5J55p8
$$ -158 -21 34 -27 100 30 33 185 -151 -17 175 23 29 102 108 3 174 -54 12 22 -117 -182 -40 -115 40 -38
7703c8R5r3o6O4np0J47Q9kj70J47p0L6mj31p0J61M9j5kl6p7R4rL7k0m6j90K57
$$ -38 57 -36 -102 -38 -43 -113 34 123 121 -49 98 28 64 60 -71 -141 20 69 54 52 16 -61 33 24 61 41 -5 -195 62
7732F2N6n5j06q0M6l7J4L9M4k29L27j35K2rJ2K03j73Po9J45j76L1L6J25j64J00
$$ 62 118 63 -43 -123 -77 -114 -100 -61 -17 -246 81 -54 -32 -41 -29 174 1 8 -61 84 -92 -61 -25 100 -64 36
7758C6r2J54Rj84qn0M7J02J3K4l3m1J17k7p7N0r1j18Q7K40j21n7M5Nj41M2R0M7
$$ 36 -56 98 107 -77 -85 -135 -88 14 27 51 18 -23 94 67 -10 40 -51 -169 -82 158 37 -20 25 30 -111 -69 21 68
7786F8j57k2P1Q6j0q4J16k9J8J0j04M4k3oK35k38J37j20o2J73r6j1r4J51q5J05
$$ 68 -89 -111 -40 46 36 -48 68 39 57 67 -37 7 -16 -22 213 -25 112 -8 -70 103 7 -4 -98 53 -32 73
7812G3P1j79j45K53k03K24o7m1p2J64j57J30j59K33l40L41r9j50K16p9m8L6P3
$$ 73 144 -35 -180 73 -130 94 27 -14 -86 78 -79 51 -108 125 -215 126 27 -123 93 14 -34 2 75
7835G5qn2j06J08J9L0r1J50Q2j06k7J09k52K9l2j42R8P1J82k10J37l6J24p4j6
$$ 75 67 15 -91 17 36 66 -25 125 207 101 74 183 -69 -40 -72 -214 -116 -45 137 -73 64 28 152 78 62
7860F2q6K3J31j4j95L4K31j87o2J50l1j01j4Q7Q0j93j6N2m2j4J52N2j24J72m2
$$ 62 -24 -1 130 116 -79 -45 186 -1 -63 87 56 -45 -59 28 108 -85 -101 -49 -91 -105 47 99 -25 147 105
7885A05j39J47o6k4R0p7K8l9j33J63j13J67o5n9M3j20L6J48j51P6r0n8J70j34
$$ 105 -34 113 47 23 113 36 64 25 -108 55 -58 109 44 -15 28 -92 -56 92 -59 17 -73 -131 39 -95
7909i5lJ1J88q9k05K45j01j78K55R3j43K4nL5j45o3K08j40O4P2o8K36l26K1J18
$$ -95 -98 -87 101 12 -193 52 -49 -227 28 121 -22 2 -3 32 -113 -176 32 -108 -44 28 -40 196 -130 -109 9
7934Ik1K09k48J2j6k6J0j35J38R1j33J54j3j69K06k8n5oj46M7J05m8J75M7k27
$$ 9 -12 197 -51 -39 -55 -81 -71 -206 -68 23 -110 44 31 -138 68 40 -15 -21 -167 -120 -15 -63 112 159 -68
7959f8P7j96K02L1k66K46N9j5j69J74l0J04J7j96J41K2q0j74Q1J31r8K12k90J25
$$ -68 9 -187 15 46 -220 26 85 70 -99 75 45 149 166 -30 111 133 53 -121 -40 91 -7 205 -85 40
7983D0K31m06K8J23J65k4j34k7o3K15j73J57j20R8l9j33J22o0k6k4j6J93r8P2
$$ 40 271 -135 -107 16 181 157 23 -4 -67 148 -25 132 12 110 71 -62 60 0 -26 -50 -66 127 29 101
8007A01p1r4N6J16m7L8j14q8J23p2N8J21j03K1j6j72L07j61Oj11K57j00k01J78
$$ 101 30 -64 -8 108 61 99 -15 -103 20 -52 6 127 24 45 29 -143 164 3 9 -102 155 55 -146 32
8031C2J53k30Q1Jp7j4P9P0r2P3j15jJ57j70J95j27m6j98K41J2l9m6L7J35n4nr2
$$ 32 185 -45 36 37 -40 -54 25 95 3 76 -39 -40 117 -53 142 15 -31 -229 12 24 -15 -61 -24 111 57 52 -40
8058d0P4j47J46K9p0M0j17Q4j14O9J33q9J15j8j75J84m6Lm5q0pO9m0k9N6K4ll5
$$ -40 34 -113 33 62 -8 32 -85 -1 -115 -46 87 -2 113 95 -80 104 58 61 16 -64 -71 -2 -42 -71 -15 9 6 -29
8086b9J0o9J62j34J0Nl4j2mQ4j19Q9J05j78J11M8k3J4J9j90K14j12N5J1K8o8N3
$$ -29 -19 -88 74 -60 -50 -45 -79 -91 -95 -11 -130 -41 64 -114 -3 45 22 36 55 -135 79 -33 22 33 61 -7 46
8113D6NL3q6j28O1p8K62l06K56j23r2R9J35J2n2k9M7Q4k61O9j90K28q5N9Jm0O9
$$ 46 51 84 -2 -130 -69 -147 115 -191 65 -58 -150 -51 84 96 44 15 62 146 -115 -46 -236 -8 -93 -34 -33 -73 -4
8140dk2n6PQ7jj01N5N7P9m9j01Q6j23j58K96k36L10l02K85J43k88L8r0R9k4P0
$$ -4 -26 -82 -75 12 11 -90 -35 22 101 52 -49 37 -86 -244 52 -184 126 -176 109 252 -36 2 -88 11 -13 57
8166E7Ok11J75j27P0J03N9k36J33k4P9j37j0J7j23J44L4J53j46k02J89ml9M0j8
$$ 57 63 -148 27 -100 -30 73 132 -104 29 5 84 -53 -63 -46 -169 -25 9 162 16 -186 3 -1 -40 0 -18
8191a8
$$ Imaginary data points
##PAGE= N=2
##DATA TABLE= (X++(I..I)), XYDATA
0@%%%%%%%%%%%%%%%qJ6j6J6j6J6k4L2l2M0m8N6o4P2q4R3j05J20j37J57j76J95
$$ 0 0 0 0 0 0 0 0 0 0 0 0 0 0 0 0 -8 8 -8 8 -8 8 -16 16 -16 24 -24 32 -32 40 -44 49 -56 64 -73 84 -92 103
37A03k19K47k76L06l40L74m14M61n08N59o16O78p47Q23r06J002j107J221j354
$$ 103 -116 131 -145 161 -179 195 -219 242 -266 293 -323 355 -392 431 -475 527 -580 641 -713
56g13J507j680J884k127K421k787L254l871M728o001Q083j2045K2069r0601j79697
$$ -713 794 -886 998 -1129 1292 -1495 1759 -2112 2616 -3385 4698 -7347 14722 -75879 -255576
71b55576K18776P4309q1239R2752N6521j35320j1496N3473n0471L5815Q8568r8963
$$ -255576 -36800 37509 -43730 49022 105543 -29777 -41273 12200 -38271 -2456 86112 -12851
83a2851o3883J14025J6240q4300L0823K7890l7303J7491l971m2209P3835L9026
$$ -12851 -76734 37291 53531 -30769 54 27944 -9359 8132 4161 -38048 35787 74813
95G4813j18723o055J16125n1229p7008R4963K8471q8373J6954K5805n3915M9747
$$ 74813 -43910 -49965 66160 14931 -62077 32886 61357 -27016 -10062 15743 -38172 11575
107A1575O7466r5847m0332R7174k0493p5286P4200M7901q0794k1829L5409o360
$$ 11575 79041 -16806 -57138 40036 19543 -55743 18457 66358 -14436 -36265 -856 -7216
119g216K3312K1700n6741r868N2132k7423l0190N9271P821n6811Q044J6693j8458
$$ -7216 16096 37796 -18945 -28813 23319 -4104 -34294 24977 32798 -24013 -15969 724 -17734
132a7734L0820J5235n7087P757N3742m3236l3297O6261R430n8634J2657K4604
$$ -17734 13086 28321 -28766 -21009 32733 -10503 -43800 22461 31891 -26743 -14086 10518
144A0518k7611J2404K5841l1601l412L3022k8321k4632M7697J3093l9531Q37J3658
$$ 10518 -17093 -4689 21152 -10449 -13861 19161 -9160 -33792 13905 26998 -12533 -11696 1962
157A962j2758J1069J3023j9611M368J4918k7734o464M0418j597k9691R246N883
$$ 1962 -10796 273 13296 -6315 -1947 12971 -14763 -21227 19191 17594 -12097 -2851 3032
170C032j4252J4748J0272k0969O282J5600k5211o583L3350j893k3897Q902M994
$$ 3032 -11220 3528 13800 -7169 -887 14713 -10498 -17081 16269 14376 -9521 -619 4375
183D375j1471R733N650j3365Q063R242k1667k532K4307l383j4825P688R3p567
$$ 4375 -7096 2637 8287 -5078 2985 12227 -9440 -11972 12335 8952 -5873 1815 1908 -5659
197e659Q770M00q789J0966L971k0427J556J9587n194r747O477j690m152P368l399
$$ -5659 3111 3511 -5278 5688 9659 -10768 -9212 10375 5181 -4566 1911 221 -3931 3437 38
212C8n764J3010L85j8880M329J6189o893p365O747j460k829M732m836k422J2874
$$ 38 -5726 7284 7669 -11211 -6882 9307 2414 -4951 1796 336 -2493 2239 -2597 -5019 7855
227G855k325j6326O134J2958p908n285O671j235j770K827n269o5J1694m245j3745
$$ 7855 5530 -10796 -4662 8296 388 -4897 1774 539 -1231 1596 -3673 -3738 7956 3711 -10034
242a0034P697J0312q438m427O534o3j639Q10m765K115R443n886j0361Q599P554
$$ -10034 -2337 7975 -463 -4890 1644 1581 -58 752 -4013 -1898 7545 1659 -8702 -103 7451
257G451q858l880P191P81k829m51k330K682N826n536o712P457N057p756k680N998
$$ 7451 -1407 -5287 1904 2685 -144 -595 -2925 -243 5583 47 -6665 792 5849 -1907 -4587 1411
273A411J344k633j614j422L500M301n757m799P292L823p816k306O490J746m072
$$ 1411 2755 122 -1492 -2914 586 4887 -870 -5669 1623 5446 -2370 -4676 1814 3560 -512
288e12k060J215L489P42n184j335N911J488n970r98M767J232l171k174J740L467
$$ -512 -2572 -1357 2132 2874 -2310 -3645 2266 3754 -2216 -3214 1553 2785 -386 -2560 -820 2647
304B647o92m783K12N617J09n730k9M531P02l303j615K316K432j211l724Q06M567
$$ 2647 1955 -2828 -2616 3001 3110 -2620 -2649 1882 2584 -719 -2334 -18 2414 1203 -2521 -1715 2852
321B852l35n087J19M775O39m389j416L797K269l269l102K994L129k054l576J515
$$ 2852 2517 -2570 -2451 2324 2963 -1426 -2842 955 3224 -45 -3147 -153 2976 922 -2654 -1139
337a139L586n52l748k15L416J408l441k149L054K479k475k392J556K557q38l020
$$ -1139 2447 1895 -1853 -2068 1348 2756 -685 -2834 220 2699 224 -2168 -612 1945 1107 -1913
353a913m3L203J200l781j674L759K005l448j674K496J709j516k310M17K971O20
$$ -1913 -1956 1247 2447 -1334 -3008 751 2756 -692 -2366 130 1839 323 -1987 -1570 1401 2021
369B021l674j314M531J150m527p81M291O6k827o57J591J225Lk390p98L409O66
$$ 2021 -1653 -2967 1564 2714 -1813 -2594 1697 1763 -1064 -1721 -130 1095 1098 -1292 -2090 1319 1985
386A985l942K25L899p95k977P07R23M39J220k222j973L433J524m641O8N426j727
$$ 1985 -1957 -1732 2167 1372 -1605 -898 25 464 1684 -538 -2511 922 2446 -2195 -2127 3299 1572
403A572m759K311K505j537M31k5k507K116K217m013%N104k312m422L146K043k361
$$ 1572 -3187 -876 1629 92 523 498 -2009 107 2324 -1689 -1689 3415 1103 -3319 -173 1870 -491
420d91P43P23k420J791J677m269N84N330k596m457L812J165l274K202J697l860
$$ -491 252 975 -1445 346 2023 -2246 -1662 3668 1072 -3385 427 1592 -1682 520 2217 -1643
436a643J180K332m255N25O246k922n395L805J800l887K688K361m438L16K797l615
$$ -1643 -463 1869 -2386 -1861 4385 1463 -3932 -127 1673 -2214 474 2835 -1603 -1287 1510 -2105
452b105M47O002k967n448M217J342l751L040K127m676P35K881m277P52O041l409
$$ -2105 -1658 4344 1377 -4071 146 1488 -2263 777 2904 -1772 -1037 1844 -2433 -1681 4360 951
468I51m836M689P56m786L719K719n066R97L180n077K21O971l004m885M441K20
$$ 951 -3885 804 1560 -3226 493 3212 -1854 -857 2323 -2754 -2533 4438 1434 -3451 990 1210
484A210m810M120K997m627O87K126n119J306P091l319n132M426r5m745M532L137
$$ 1210 -3600 520 3517 -1110 -423 1703 -3416 -2110 4981 1662 -3470 956 861 -3884 648 3785
500C785m795R2K231m530J348O758l663m337M382q07m494M868K776m633P33J956
$$ 3785 -1010 -918 1313 -3217 -1869 4889 1226 -3111 1271 464 -4030 838 3614 -1019 -286 1670
516A670n097J682O413m299l045M879j836m883N017K949m302J343J032n454J817
$$ 1670 -3427 -1745 4668 369 -2676 2203 367 -4516 501 3450 -852 491 1523 -3931 -2114
531b114O156l376k509M541k743m830N261L021l605J042J90m935K384M923l338
$$ -2114 4042 666 -1843 2698 -45 -4875 386 3407 -198 844 1034 -3901 -1517 3406 68
546F8p52L707m047l874N836J948l420J986l24n059K539M303l538M36L809m902
$$ 68 -684 3023 -1024 -4898 938 2886 -534 1452 1128 -3931 -1392 2911 -627 -191 3618 -1284
562a284l459O001Q18l225L266m46n614K515L704l246J263L675n182l235N086O96
$$ -1284 -4743 1258 2076 -1149 2117 1671 -3943 -1428 2276 -970 293 3968 -1214 -4449 637 1333
578A333k176L422r48n196K417K511k981K603L386o093k192N166p40j853M313r13
$$ 1333 -843 2579 1631 -3565 -1148 1363 -1618 985 4371 -1722 -3914 1252 512 -1341 2972 2059
594B059n375K324K122k855K723K939n247j994M535j422j148M419j465m586K445
$$ 2059 -3316 -992 1130 -1725 998 3937 -1310 -3304 1231 -191 -1339 3080 1615 -2971 -526
609e26J395k969L125K691m903j585L918j675r43M486j324m408K670N59k824L331
$$ -526 869 -2100 1025 3716 -1187 -2772 1146 -529 -1472 3014 1690 -2718 -48 511 -2313 1018
625A018K508m939m74L287k351p27M735j521l931K466K34k497L156K209m480k45
$$ 1018 3526 -1413 -1887 1400 -951 -1678 3057 1536 -2395 71 305 -2192 964 3173 -1307 -1552
641a552K989k874j33M508j740l286K489N4k794L216J753l804J9K447k443k59L807
$$ -1552 1437 -1437 -1570 2938 1198 -2088 401 455 -2339 877 2630 -1174 -1155 1292 -1151 -1410 2397
658B397j595k555K404n52k448L377J489l708M03K155k720N0L394j187k285K053
$$ 2397 802 -1753 651 99 -2349 1028 2517 -1191 -788 1367 -1353 -1303 2091 904 -1381 672
674F72o08j946K729J078l046Q67J626k981M75L287j721j936K309n68k241K644
$$ 672 64 -1882 847 1925 -1121 -254 1372 -1609 -1134 2153 432 -1504 805 237 -2004 640
690F40J079k548M18J403k173J59K495j173j157J640q04j594K295N38k056Q49J155
$$ 640 1719 -829 -411 992 -1181 -1022 1473 300 -857 783 -21 -1615 680 1218 -838 11 1166
707A166k157J67K179j117r52J562p50j552J760P06j654P56O10j761M17J864j348
$$ 1166 -991 -824 1355 238 -714 848 98 -1454 306 1012 -642 114 724 -1037 -620 1244 -104
724a04m65J491q76j252J475L75j289Q65L22j357K97J222q70j84J111p84p49J087
$$ -104 -569 922 46 -1206 269 644 -645 220 542 -815 -518 704 -166 -350 761 -23 -772 315
742C15J56q78O03K42j117L41Q33o57m7Q77p32m69Q29j2o41O03J30r42M07P17q44
$$ 315 471 -407 196 438 -679 -338 495 -162 -209 668 -64 -533 296 284 -357 246 376 -566 -159 558 -286
763b86j2Q56m39o10Q25j34m98L82K92o24J39K58m07L07J90m44n9M58r9l66K86
$$ -286 -298 558 119 -491 334 200 -298 84 376 -248 -109 149 -258 49 239 -205 -264 194 95 -271 15
784A5L01l97j19M86k53j76M46l87p2L23l63J00L91l16j70J95J12j81J21Nj53r6
$$ 15 316 -81 -200 286 33 -143 303 -84 -156 167 -196 -96 295 -21 -191 4 116 -65 56 61 -92 -188
806a88M44k42j58K17jj39j2J57j2q4Q2r7L7ok1j56J90J08l12M57m5o18L54K04
$$ -188 256 14 -144 73 72 -67 -79 78 66 -18 64 -33 4 -2 -23 -179 11 119 -193 264 219 -399 -45 159
830A59l36J44J01k7k65L58J7k96J54P2k40J09J70q1q8K5M6j40J56k6n2J65R6m28
$$ 159 -177 -33 68 41 -224 134 151 -145 9 81 -159 -50 120 39 -49 -24 22 -118 38 12 -40 125 221 -207
854b07J85J85j46k28N86k76l94L84q7j82K58R0l36K15J03k65J57J7nk20L34j77
$$ -207 -22 163 17 -211 375 99 -295 89 2 -180 78 168 -168 47 150 -115 42 59 54 -166 168 -9
876ik17K57K20m45K4N61n76L0M62l32j34K78k27l1K94J39n15L55k4n26M36L88
$$ -9 -226 31 251 -194 -170 391 -185 -155 307 -25 -159 119 -108 -139 155 294 -221 134 110 -416 20 408
898D08n50o1N10k11m08M34J41l96K18J17m66J7N51m47J01K93l08l25O35j00k99
$$ 408 -142 -203 307 96 -312 122 263 -133 85 202 -264 -247 304 -143 -42 251 -57 -382 253 153 -146
919a46M19M8p88K50O69o85J39L53l61l28O07l4l64N38j18p32K66N70l99q0N14
$$ -146 273 321 -467 -217 452 -233 -94 259 -102 -430 177 143 -221 317 199 -533 -267 303 -96 -176 338
940C38k30n24O41j30n02P56k4p81L93L76o38K37N65o02k26P20l28m72P78M9r62
$$ 338 108 -416 225 95 -407 349 325 -456 -63 313 -325 -88 477 -125 -351 369 41 -431 347 396 -566
961e66M22O13p55J58O62p13k52O10j52l62Q84j69j102P72L48q75N36O82q74l25
$$ -566 -144 469 -286 -128 534 -179 -431 179 27 -335 549 380 -722 50 398 -477 59 741 -133 -458
981d58P91l95l47R30l11p87O71K65q67N92N94j068j1R14o13l89J151m52j224J158
$$ -458 333 -62 -409 521 210 -577 94 359 -508 84 678 -390 -401 513 -100 -489 662 210 -1014 144
1001A44K02j071Q20M73p78n4P86o51o1J005o38q61J132j73p84O74P04j291Q3P03
$$ 144 346 -725 95 568 -210 -264 522 -129 -190 815 177 -684 448 275 -509 165 869 -422 -339 364
1021C64p19J2R79l90q05Q84j10j051J173N55j395L7J012j108M22R65p88n60Q97
$$ 364 -355 -343 636 246 -559 325 215 -836 337 892 -503 -466 546 -562 -140 825 37 -523 374
1040C74k33r41R22O32j137K66O54j102J94J169p55n85J152o50r12J259O33j378
$$ 374 141 -800 122 754 -383 -117 537 -565 -371 798 43 -542 610 -40 -952 307 940 -438
1058d38L59N64j321L57J199p86l21J115p23j069J460J68j267J117K50j423M15
$$ -438 -79 485 -836 -479 720 -66 -387 728 5 -1064 396 564 -703 414 664 -759 -344
1075c44J187r38l26R47l76j033J066L25p25N14K32j375N62J103j205J29J024p32
$$ -344 843 -95 -421 526 150 -883 183 508 -217 297 529 -846 -284 819 -386 -257 767 35
1093C5r72J137K71r52P10L87j151K60P74o87N9R13r68m44J028j26q14R84L09j355
$$ 35 -937 200 471 -481 229 616 -535 -275 499 -188 -129 784 -184 -628 400 274 -540 444 753 -602
1113f02L22P21r01K64R83q29o27J122m17n41Q73p8p59K91M62o61L51R41j250k54
$$ -602 -280 441 -460 -196 787 -42 -669 453 36 -505 368 290 -469 -178 284 -377 -26 915 -335 -589
1133e89R43j54p78J000J5r31L74O05q99L91O76r27k57R52m37n03Q87L9r63M59
$$ -589 354 200 -578 422 437 -494 -120 485 -414 -23 653 -274 -531 421 -16 -519 368 407 -556 -97
1153i7M85p08K83O93r89mJ032r77j45R34j02r23O19J61p75N92L87p55k09R38m58
$$ -97 388 -320 -37 656 -333 -337 695 -282 -427 507 405 -518 101 262 -513 79 466 -289 -498 440 -18
1174a8l29Q60j17p86M45Nl59M16L54p89Q7O09m75l61Q85j75o89N17K23p99O70
$$ -18 -347 513 396 -390 55 60 -299 117 471 -318 -231 378 -97 -458 427 252 -437 80 303 -496 174
1195A74K44o29R3M58m37j83R95n79l81N86k85m38N72K38p14J42M20o26K41O78
$$ 174 418 -211 -118 340 -97 -280 715 136 -245 341 56 -382 190 428 -286 -144 276 -350 -109 569
1215E69n97k91M63k70l91O35L73p81L98J17m66p0O42j89l37L07m2l82K42K86k17
$$ 569 -28 -319 144 -126 -517 118 491 -290 108 225 -241 -311 331 142 -195 112 70 -312 -70 216 -1
1236aM9K45l35j16L31k78NK16o7n00N25N3k41L9J77l24J00K90j30j70J80n3j43
$$ -1 48 293 -42 -158 173 -105 -100 116 49 -451 74 127 -114 -75 102 -222 -122 168 38 -132 48 -5 -148
1259a48K07J19l93J22M30o95J53L92l58K03K3p7j59M21k10n9Q0j9O9j39K26k76
$$ -148 59 178 -215 -93 337 -358 -205 187 -171 32 55 -22 -181 240 30 -29 51 32 101 -38 188 -88
1281h8m9M81l05n3O3K9k80J16L15j66rO6k54Q9L54k56j52K04l4r7J14M5m77L56
$$ -88 -137 344 39 -14 49 78 -202 -86 229 63 54 120 -134 -45 309 53 -99 105 71 -26 88 133 -344 12
1305A2Q4J7k10oJ64j36P4j3J45m9o0N8o7J05j29o3N5o5O3P3J30l26K11j19M1q0
$$ 12 96 113 -97 -103 61 -75 -1 -14 131 82 22 80 13 118 -11 -74 -19 -84 -21 52 182 -144 67 -52 -11 -91
1331i1Q1k08L12j69l4J43o0kN8l9L0O0k8o8q4R6l7J10o9M4L4K2k03K22l56M08
$$ -91 -10 -218 94 -75 -109 34 -26 -28 30 -9 21 81 53 -15 -99 -3 -40 70 1 45 79 101 -102 120 -236 172
1357A72j93R6j76K34k07Q1l4J45j44j10J63L6R6j13j68J19j0q7L4P6q9NO4J50
$$ 172 -21 75 -101 133 -74 7 -27 118 -26 -136 27 63 159 46 -122 -3 -13 -100 -66 10 -79 -74 -10 140
1381A40l32J05J05K8j57Q1Q5r5K03k4j53R0j62J74j5j81j7K44J5k94J39o0J78
$$ 140 -192 -87 18 46 -111 -30 55 -40 163 139 -14 76 -86 88 73 -108 -125 119 134 -160 -21 -81 97
1404I7k91L74j00j50J11k0j05M3r1l7K12j18QJ04KJ4j76L93j00l46L01o2j34P4
$$ 97 -194 180 80 -70 41 21 -84 -41 -132 -169 43 -75 -67 37 39 53 -123 270 170 -176 125 63 -71 3
1428CQ1j73J58R7k46J0K1J02j31k0K12k23q4J70j02K0K36R2j52n8Nj6J11q9o6
$$ 3 84 -89 69 166 -80 -70 -49 53 -78 -98 114 -109 -193 -23 -125 -105 131 223 71 13 18 2 113 24 -42
1453d2J10R0Lk8j63o3k1J47J7p3K03p3j72N3K18k88j93N55k67k54M90k12j54L05
$$ -42 68 158 161 133 -30 -93 -114 33 50 -23 180 107 -65 -12 206 -82 -275 280 13 -241 249 37 -117 188
1477A88j27l25L35j33k28L36J03k42J49J68l14K68k09Q0l53K16J03j41J58l5p6
$$ 188 61 -264 71 -62 -290 46 149 -93 56 224 -90 178 -31 49 -304 -88 15 -126 32 -3 -79
1498g9J5L88m01l8L04m16nK28J24k34P6J37j03j13K68k28o5N53m91k51K74J10
$$ -79 -64 324 -77 -115 189 -227 -232 -4 120 -114 -38 99 -4 -117 151 -77 -142 411 -80 -331 -57 53
1520E3m2p2J20j53p6L43l95J80K34k42j65L59O9l89J31K41k92J33M1k83R9L48
$$ 53 11 -61 59 -94 -170 173 -222 -42 192 -50 -215 144 213 -176 -45 196 -96 37 78 -205 -106 242
1542B42k85R3Pl4j81K84p7j61Q7J23k19n3M96m17k01K82j1k93L11J59k01K5J60
$$ 242 -43 50 57 23 -158 126 49 -112 -25 98 -121 -174 322 -95 -296 -14 -25 -318 -7 152 -49 -24 136
1565A36k78K42K18m02M0L68k35l65L49Pj98l6J87k03K08n4j5r3J36K9k58L31L3
$$ 136 -142 100 318 -84 -44 324 89 -276 73 80 -118 -154 33 -170 38 -16 -31 -124 12 41 -217 114 147
1588A47k65L8J31j03J60O2k18k81N06l01M5R5J8j01NJ4j55J20K42l67K02J78l09
$$ 147 -118 -80 51 -52 108 170 -48 -329 177 -124 -79 16 34 -67 -62 -48 -203 -83 159 -208 -6 172 -137
1611a37k8K90N1l40K12K68m79J54J94k77K36l2l22J71J73j19q5N2mj78J39M4n0
$$ -137 -165 125 176 -164 48 316 -163 -9 185 -92 144 112 -210 -39 134 15 -70 -18 -22 -200 -61 -17 -67
1634f7O1J06j42n5K84L5l85J20J48j55K71j6m20J77K56m66O5L97l17j61J53K25
$$ -67 -6 100 -42 -97 187 222 -163 -43 105 -50 221 205 -215 -38 218 -248 -183 214 -103 -264 -111 114
1656A14m0k1j68P4J81O3k99N3K49l15l1L11k60n2J28J68j94P6J21j53j40L00j40
$$ 114 74 53 -115 -41 140 203 -96 -43 206 -109 -140 171 -89 -141 -13 155 -39 37 158 5 -135 165 25
1679B5k42L42n0j18J20k46j16L55J12j62k23J74qj80R4J95j55N3P7j06J26q1M4
$$ 25 -217 125 75 -43 77 -169 -285 70 182 20 -203 -29 -37 -217 -123 72 -83 -30 47 -59 67 -14 30
1702C0j7K13k05j13K44J00l83n7L01j63J49j81R2J5O0k01N4K35j28K5j70J8m6
$$ 30 13 226 21 -92 152 252 -131 -188 113 -50 99 -82 10 25 85 -116 -62 173 45 70 -100 -82 -128
1725a28L72k40j36R7J74l13J03N1J98l23l8L3P5k0J67j42K12j8j56r9L50o1l87
$$ -128 244 4 -132 -35 139 -174 -71 -20 178 -145 -183 -150 -75 -95 72 -70 142 124 -32 -131 219 158 -229
1748b29K61J29j21q3N0k9L00l07NM4J71l1j64J72j08j6J1j71Q8R4l3j48oL71j92
$$ -229 32 161 40 -43 7 -22 278 -29 -24 20 191 160 -4 168 60 44 55 -116 -28 66 33 -115 -121 250 58
1773E8j36n0N7J14k3l2l5J19K2k23P2K27k15j02OJ66J24k00k9Q7J18m1j53J57
$$ 58 -78 -128 -71 43 20 -12 -47 72 94 -129 -57 170 -45 -147 -141 25 149 -51 -80 7 125 84 -69 88
1797H8N0n9j45R9o6J49k28Q4nK06j54p6j23K00j9q4M5J05m6k57QK37O4k37j29
$$ 88 138 79 -66 33 -33 116 -112 -28 -33 173 19 -57 -180 20 1 -83 -38 67 21 -236 -228 9 73 -164 -293
1822b93K89L8k32kL29k2j40o0J5J66j32j86J15K53o4j17J25J8K2n8j56j2J52j00
$$ -293 -4 34 -198 -200 129 107 -33 -93 -78 88 -44 -230 -115 138 74 -43 82 100 122 64 -92 -104 48 -52
1846e2R9L3J35j08r4MQ9m9j45j58J84J33j18j1J26N3j26q7R1M5M7m9j07J83j0
$$ -52 47 80 215 107 13 17 106 57 -88 -246 -62 71 -47 -58 68 121 -5 -92 -1 44 91 42 -65 118 108
1871A08kk53J28K7q8K7R9O0j1j89m1J52N8k05K14o1k9R2r4q5J63r7j46J77J16
$$ 108 106 -147 -19 8 -80 -53 46 106 95 -94 -135 17 75 -130 84 23 -6 86 -8 -93 70 -27 -173 4 120
1896A20k5k41K4J77o7j28R2j3K15j2m72K37J78K2k79J10L7P2k17oK75J66k48j62
$$ 120 95 -146 -122 55 -12 -140 -48 -61 154 142 -330 -93 85 107 -172 -62 -25 47 -170 -176 99 265 17 -145
1920a45K84l1o2j15Ll4M4N8j19J00P9k07Q0qJ86j41j98K54N6J18l47J33mK8j41
$$ -145 139 108 46 -69 -66 -100 -56 2 -117 -17 62 -145 -65 -73 113 -28 -226 28 84 202 -145 -12 -16 12 -129
1945a29N9N0J72j88k7R3j59J17j77M7K06q4j9kJ15Q5k69L3J58p4p4p4J11K6J88
$$ -129 -70 -20 152 -36 -63 30 -129 -12 -189 -142 64 -20 -39 -41 74 159 -110 -77 81 7 -67 -141 -30 -4 184
1970A84k14m2K5R6q8N9j7J7J5k04J59qJ31j24K65j69K2m1j24R3p9J68l29J37L02
$$ 184 -30 -72 -47 49 -39 20 3 20 35 -169 -10 -18 113 -11 254 85 107 66 -58 35 -44 124 -205 -68 234
1995B34r8j98J94o5p2j88J47J79L0k20nO8J67j72j34P1J38j66J03K83l36j92K10
$$ 234 136 -62 132 67 -5 -193 -46 133 163 -57 -62 6 173 1 -133 -62 76 -90 13 296 -40 -232 -22
2018b2k16L20q9j3j48Q2K55k63l8J36k0o3Mn4J17J23k71J26J03J28k56l9Q8Q4
$$ -22 -238 82 -7 -20 -168 -86 169 -94 -132 4 -16 -79 -75 -129 -12 111 -160 -34 69 197 -59 -98 -10 74
2042G4M3k44P3J36n1pj65J47j58J57p0J91j74l7K2R2L4Ok6j49J52l6j75J8L59
$$ 74 117 -127 -54 82 31 24 -141 6 -152 5 -65 126 -48 -85 -63 29 63 69 43 -106 46 10 -165 -147 212
2067B12k64k6j14K08J77k01l3q6K45K4k20j9R2N6r7N6j7RJ49m13J81J50P2k72
$$ 212 -52 -78 -192 16 193 -8 -41 -127 118 142 -78 -97 -5 51 -46 10 -7 2 151 -262 -81 69 141 -131
2091a31l8K79p6j86M6K65j40K1j41J60N9m9k15M8J94j5k15L4L03j73M4k30J0K30
$$ -131 -169 110 34 -152 -106 159 19 40 -101 59 118 69 -146 -98 96 81 -134 -100 203 30 74 -156 -146 84
2115H4L2l00K41O6q6k94K34N7j04N6K1J46n6k15J49j81K89j66k0O7J65k04k7j4
$$ 84 116 -184 57 123 37 -257 -23 34 -70 -14 7 153 97 -118 31 -150 139 -27 -47 20 185 -19 -46 -60
2139f0K0R5j14O5n3K12k07N6m0J50j69n8J3K17oo4k64K18P5j39q1J08J88k49Q9
$$ -60 -40 55 -59 6 -47 165 -42 14 -26 124 -45 -103 -90 127 121 57 -207 11 86 -53 -134 -26 162 -87 2
2164Bq4J09K7r2N2Q9N3j24j30J94j30J12j80M2lJ72j66JJ32L8k40J64r5P1k7q
$$ 2 -82 27 54 -38 14 103 156 32 -98 96 -34 78 -102 -60 -63 109 -57 -56 76 114 -126 38 -57 14 -13 -21
2190b1M5l8J07j38J19O4j4l73K26P5kk32J52N5K9Np4NP1k49K60j53J55j66J16
$$ -21 24 -14 93 -45 74 138 124 -249 -23 52 50 -182 -30 25 54 59 -15 -10 61 -188 72 -81 74 -92 24
2215B4j18Q9p4J84q2J47L0j28n1q2L9m2P1o8O0M6JM4k23K20j37LJ08JP3j73J40
$$ 24 -94 -5 -79 105 23 170 200 72 21 -61 -22 -64 7 -61 -1 45 46 90 -133 87 -50 -47 61 62 135 -38 102
2242A02q0J49j11o8L2J24k02m0K7J77r4l1Q4K4L9p7O3J2j55o7J60j88L31k11O4
$$ 102 22 171 60 -8 24 148 -54 -94 -67 110 16 -15 69 93 132 55 118 130 -25 -92 68 -120 211 0 64
2267F4j93N9J16j52J21J05k07J23j58M1Jj09M2O0M8J05n6m1N0J4q4O6N8N2j26
$$ 64 -129 -70 46 -106 15 120 -87 36 -122 -81 -80 -189 -147 -87 -39 66 10 -31 19 33 -51 15 73 125 -1
2292aN2j17n2M0P8q3N2k1j98Q0K19J9j3m4r1k5J14m2L1N5j28P3L4l9qlo4J62O
$$ -1 51 -66 -118 -78 0 -83 -31 -52 -250 -170 49 68 55 11 -80 -105 9 -33 -2 53 -75 -2 32 -7 -15 -18 -82 80 86
2321H6j53j26L13n0l3N7m3q7N8o6J14j32J40j38P3K4m4N3k36J97J50j38N5l8j3
$$ 86 -67 -193 120 70 37 94 51 -36 22 -44 70 -62 78 -60 13 37 -7 46 -190 7 157 19 74 36 23
2346B3L6r0K06j29kr2J18k14J78l5J05j30J10J45k6j31K4l5q0J65r4j38J86j19
$$ 23 59 -31 175 46 44 -48 70 -144 34 -1 104 -26 84 229 203 72 96 61 -19 146 52 -86 100 -19
2370a9K12j78j68K40L7j33j3P5r2R2J21j66p4J83j96J11j78K20j0j52J79j76j14
$$ -19 193 15 -153 87 124 -9 -22 53 -39 53 174 8 -66 117 -79 32 -146 74 64 -88 91 -85 -199
2393a99K51N3p7J09n5j29M7N4OM3k84J85O4n0N2p6O0P8j0l50J60mM7Q2j74J51
$$ -199 52 105 28 137 82 -47 0 54 60 103 -181 4 68 18 70 -6 54 132 122 -228 -68 -72 -25 57 -117 34
2419C4j55J02J05Nj61J11K7j46M4J39j5j12J32J23l50K54k34J81j73J19r5M4k3
$$ 34 -121 -19 86 91 -70 41 68 -78 -34 105 90 -22 110 233 -117 137 -97 84 -89 30 -65 -21 -44
2442d4l9J23r9P5O4l4K01k95J00rKk12Q4k4m4R0J51j08L9pj25j54J13J11j29J06
$$ -44 -83 40 -59 16 80 46 247 -48 52 43 45 -167 -83 -107 -151 -61 90 -18 21 14 -111 -265 -152 -41 -170 -64
2468f4JK11j45q6K00m3j38J47k82K38qo3R5j40L0P9l8J29k50Q5J08%j5j3m5L0
$$ -64 -63 148 3 -83 117 74 -64 83 -199 39 31 -32 63 -77 -47 32 -6 123 -127 -42 66 66 51 38 -7 23
2494B3j54R1k4P7j5k9O2K0l1j24K97k66O6l8R1N8op9k9J21j04j97L47k32j39K41
$$ 23 -131 -40 -64 13 -2 -31 31 51 20 -104 193 -73 -7 -45 46 104 98 19 -10 111 7 -190 157 -75 -214 27
2520B7J17k12Q4j58J70r1L21l41Q7N4j02J49j7j48K2K0q1j7K77j61J0K4j6o7p9
$$ 27 144 -68 16 -142 28 -63 258 -83 4 58 -44 105 88 -60 -38 -18 -99 -116 161 0 10 34 18 -49 -128
2545a28K87k75K53j28r7O0M7N1r9K4lK6P1j28Ro4J80R0j24q1l2Pk0k7J47l5J5
$$ -128 159 -116 137 9 -88 -28 19 70 -29 -5 -8 18 89 -39 -30 -94 86 176 52 -29 -61 -54 -74 -101 46 11 26
2572B6J77k02J89r1j09Q9j09M9l2lN0l4Q5p3j19J44j18PKQ2q2M3N3j66J13r8L34
$$ 26 203 1 190 99 -10 79 -30 19 -13 -16 34 0 85 12 -107 37 -81 -74 -72 10 -72 -29 24 -142 -29 -127 207
2599B07l03J04q6l5J05j8Kl6J05o9R5Q8J0j21r4kJ05j33j7J8o3J54J21j28J17
$$ 207 -96 8 -78 -113 -8 -26 -24 -60 45 -24 71 159 169 48 -46 -48 57 -76 -93 -75 -138 16 137 9 126
2624A26j74j12K09Kq6J42n4j5k09K68j37O0j35R1KM4om9P5k05L5K12j87L9J43
$$ 126 -48 -160 49 51 -35 107 53 38 -171 97 -40 20 -115 -24 -22 22 16 -33 42 -163 -128 84 -103 -64 79
2649G9q5q0J42l0j15K16j14J07j92P7P8m4j53L11k12n0Plj1J40j52MJ91k21P2
$$ 79 -6 -86 56 26 -89 127 13 120 -72 5 83 39 -114 197 -15 -65 -58 -61 -72 68 -84 -80 111 -110 -38
2674c8K9N5m8r5p0P3J60k48K34o4J12j25m9M4J9j03K18p8q3N5m1K85k65K2n1K5
$$ -38 -9 46 -2 -97 -167 -94 66 -182 52 -12 100 -25 -74 -30 -11 -114 104 26 -57 -2 -43 242 -23 -1 -52 -27
2700b7L3r0j8J62K6m1j33J58j46L8P6qn8l6J18k5m1O6l19K37J3Pm3J19j22J37
$$ -27 6 -84 -102 60 86 45 -88 70 -76 -38 38 30 -28 -64 54 29 -12 54 -265 -28 -15 -8 -51 68 -54 83
2726H3J15k64kP1k0k20L75j50J1M4k7o1q0J24o5k9K37Qj33l4O1J26o1j57J51j1
$$ 83 198 -66 -68 3 -17 -237 138 -12 -1 43 16 -45 -125 -1 -66 -95 142 150 17 -17 44 170 109 -48 103 92
2752I2j29p4J79p0NO3LL3l3j40P0o1L1J58k05J44j34J10k02K36j42L9N9M4j91
$$ 92 -37 -111 68 -2 3 66 69 102 69 -71 -1 -62 -31 127 -78 66 -68 42 -160 76 -66 -27 32 76 -115
2777a15j2K02j00J34m2k15J26N9l7n0k24L11qL2m8O5M1j10J1Q9p1K14k22lk0L2
$$ -115 -127 75 -25 109 67 -148 -22 37 0 -50 -274 37 29 61 13 78 119 9 20 109 38 252 30 27 7 39
2803C9j7k5J2p1J48j14L3M5m9q5J97k51L58k31P8K9Jj28kJ16k1m9k6p5J13j06
$$ 39 22 -3 9 -62 86 -28 5 50 1 -84 113 -138 220 -11 67 96 97 -31 -33 83 62 13 -13 -88 25 -81
2829h1J38J66o6q3k54K55q2Rk1N1n9%oJ22k22P6J19n8kJ88r8k52K04O4j14j06
$$ -81 57 223 157 74 -180 75 -7 2 -19 32 -27 -27 -33 89 -133 -57 62 4 2 190 92 -160 44 108 -6 -112
2855a12j9K98k30J49m0p2Mj41J77J06j48lJ53k18R7L6K14l76M9K42j15j59n9K41
$$ -112 -131 167 -63 86 46 -26 -22 -163 14 120 -28 -31 122 -96 1 37 251 -125 -76 166 51 -108 -167 74
2879G4m0J2k22J33m6K8M0QJ5nl1M1R4k11J69m7j6n5Q6O1J6j99P4J63j01q7R9K7
$$ 74 34 46 -176 -43 -89 -61 -21 -13 2 -3 -34 7 101 -110 59 12 -4 -59 27 88 104 -95 -21 142 41 -46 53 80
2907H0j46j36M02j05m7N7r9j0J19k5k35J80r4J43j36j7m7O0J22j66J48O1k66K34
$$ 80 -66 -202 200 95 48 105 6 -4 115 90 -145 35 -59 84 -52 -69 -116 -56 66 -100 48 109 -157 77
2931G7r1k6l7J01r0k2R1R6k79J33R2n8L3j9j9M2O4n3j07Q3p3R6L0q4mM2J76j41
$$ 77 -14 -40 -77 24 -66 -88 3 99 -180 -47 45 -13 20 1 -18 24 88 35 -72 11 -62 34 64 -20 -24 18 194 53
2959E3L6j59k8K37n0j27j9J04Jj11J61j81P2Q3j46J86j19R7JJ7q4k2o7P7p1L7
$$ 53 89 -70 -98 139 89 -38 -57 47 48 -63 98 -83 -11 72 -74 112 -7 90 91 108 24 2 -65 12 -59 -22
2985b2P8l5r1J54j37Q4Nl6j16J54j01J58k29Q4Q8j54j11J95M1j60K47p7p7M1M6
$$ -22 56 21 -70 84 -53 31 36 0 -116 38 -63 95 -134 -50 38 -116 -227 -32 9 -151 96 19 -58 -17 29
3010B9N8j02J4p8J58m8j07J16k5J3j65K10k04%J87j9j25Q3o6P8q7Q1O5kj14N4
$$ 29 87 -15 -1 -79 79 31 -76 40 15 28 -137 73 -131 -131 56 37 -88 -5 -71 7 -80 1 66 64 -50 4
3036Dl0O6rlJ19k61P5j8nm7K12p6j42L3K45j06j06J37j76J21k3N5k38K40J1L2
$$ 4 -26 40 31 28 147 -114 -39 -57 -62 -109 103 27 -115 -82 163 57 -49 88 -88 33 10 65 -173 67 78 110
3062A10pk22P5r5J52m7j2L3K08k06JPJ25j68j6K65k41J07n1j9J25q0J9K7j14k3
$$ 110 103 -119 -44 -139 13 -34 -46 -13 195 -11 -10 -3 122 -46 -62 203 -38 69 18 -1 124 44 63 90 -24 -47
3088d7P2M3Rj34J59l0k07j2J17j3l8L1q1J43j60R5K7m0M1R9j17Lj62K18J31j70
$$ -47 25 68 77 -57 102 72 -135 -147 -30 -43 -81 -50 -131 12 -148 -53 -26 -66 -25 74 -43 -40 -202 16 147 -23
3114b3R4j2j32K35j02j8r9N7m6K5R7j80J55m5j9L8q6K21j68K31k66J06q0J48j25
$$ -23 71 59 -73 162 60 42 -57 0 -46 -21 76 -104 51 6 -13 25 -61 160 -8 223 -43 63 -17 131 6
3139Fl5J71k49J63Q6j61L5j0J40q7j93J68j31J15n2K20j60r0J81j05J12q2O2K2
$$ 6 -29 142 -107 56 142 -19 16 6 146 59 -134 34 -97 18 -34 186 26 -64 117 12 124 42 104 126
3163A26k63J41l9P9O8p5j86k3K20p3K55l15Q6J78l41J75O9j04j05J53k3J2J41
$$ 126 -137 4 -35 44 112 37 -149 -172 48 -25 230 -85 1 179 -162 13 82 -22 -127 26 3 15 156
3186A56k55k4K3J35k9J40j85j6k2j45K24l6J34Pj64J23o4N6o3p6R9J3L4j88K04
$$ 156 -99 -123 -100 35 6 146 -39 -55 -77 -222 2 -34 100 107 -57 66 2 58 -5 -81 18 31 65 -123 81
3211H1p5k5P1k51J98rQ8k18P1R2qJ22N2l52K47o5k3R9lj22P3J6L13n07p1K33q7
$$ 81 6 -19 52 -199 -1 -10 78 -140 -69 23 15 137 189 -163 84 19 -4 95 92 -30 43 59 372 -135 -206 27 -60
3238f0k01K41J1M0pn6%n9M5J07q5L7N2l62L31j13Q3J52j74j21P0J63j32L2l2K4
$$ -60 -261 -20 -9 31 24 -32 -32 -91 -46 61 -24 13 65 -297 34 -79 4 156 -18 -139 -69 94 -38 -6 -38 -14
3264a4j21J79j00N4j04J03l8J02n0j8K4l6K4J25k12M1N6j24K04l3p3pj52J66r5
$$ -14 -135 44 -56 -2 -106 -3 -41 61 11 -7 17 -19 5 130 -82 -41 15 -109 95 62 -11 -18 -170 -4 -99
3289i9L08k31R5q7J44r7N4p9j40J65M1o1OP7l9p5j31L68k08j27O0PJ76k20J42
$$ -99 209 -22 73 -14 130 33 87 8 -132 33 74 13 19 96 57 -18 -149 219 11 -116 -56 -49 127 -93 49
3314D9J87j37j39O6o9R7j49J38K8o4r4N2N5j54K29m0k41L02k03J12lkj29J08p4
$$ 49 236 99 -40 26 -43 54 -95 43 71 7 -87 -35 20 -134 95 55 -186 116 -87 25 22 20 -109 -1 -75
3339g5J94m6o2L7kj8m4N5j27R8L8r4J93r8kn1P2n0L4j75R1L2j04K21j76N3QJ45
$$ -75 119 73 11 48 46 28 -16 39 -88 10 48 -46 147 49 47 -4 68 18 52 -123 -32 0 -104 117 -59 -6 2 147
3367A47k24J36j9l3j27K12n4PM0j01J15k02j1K9Q2K2R1m5j15O6K5p4R3j21J52
$$ 147 -77 59 40 7 -120 92 38 45 85 -16 99 -103 -114 -85 -3 19 110 65 -50 16 41 -33 60 -61 91
3392I1qm3p4K1l0o3J63p2J66j85M0N1r2Pn2J05j59k2J42o4J05k91L02j6n0j02
$$ 91 83 40 -34 -13 -43 -106 57 -15 151 -34 6 57 -35 -28 -80 25 -134 -156 -14 -78 27 -264 38 22 -28 -130
3418a30K55j38Q7nl2l3J66j37k04P9K88j65j18P6q4R0J19n7r3P6R4k02j9QN0K3
$$ -130 125 -13 74 69 37 4 170 33 -171 -92 196 31 -87 -11 -95 -5 114 57 -36 40 134 -68 -87 -79 -29 -6
3444fm1n9J5K19j06k1J1M3m4n8k6K41j21r1r7k0P3J37l6n6P7P7j03r1J39j6j17
$$ -6 -47 -106 -91 128 22 1 12 55 11 -47 -73 168 47 -44 -141 -161 -88 49 13 -43 34 111 8 -83 56 40 -77
3471g7J92j96kQ2m2M4k1r9o0J66n4N0o7J35J2J3q2O6L5j00J85j18o3rQ8j48k5
$$ -77 115 -81 -83 -1 -43 1 -20 -119 -179 -13 -67 -17 -84 51 63 76 -6 60 95 -5 180 62 -1 -10 78 -70 -95
3498i5J84no5l4K22k18K7o0j22J22J58k21L3J31L9j17k61K70M6o2K1j33J37%K7
$$ -95 89 84 19 -15 207 -11 16 -44 -166 -44 114 -107 -74 57 96 -21 -282 -12 34 -28 -7 -140 -3 -3 24
3523B4q2K46j08j37K7j3M4j04L0J25j08J31j38N2p9K2O6q3m1J21q6LK07k09K14
$$ 24 -58 188 80 -57 -30 -43 1 -103 -73 52 -56 75 -63 -11 -90 -68 -2 -85 -126 -5 -91 -88 119 -90 124
3548A24p1k00J11J08p3J01o0O2p8q6k8J71j14m1m3j47M35j43KPJ6k1RL8r2P9K7
$$ 124 53 -147 -36 72 -1 100 40 102 24 -62 -90 81 -33 -74 -117 -264 171 28 30 37 53 32 41 79 -13 66 93
3575I3k09N8j30J42k6J91p2r8J1L0q8J83mR4ok72J90p0lq2K7J13k27J92o2M9J26
$$ 93 -116 -58 -188 -46 -72 119 47 -51 -40 -10 -98 85 81 175 169 -103 87 17 14 -68 -41 72 -155 37 -25 24 150
3602A50j98kj44L65j20j86K06O4l46R9K00j05O7j86N9J03j01N5j75O6J70j02k1
$$ 150 -48 -50 -194 171 51 -135 71 135 -211 -112 88 -17 50 -136 -77 26 -75 -20 -195 -129 41 -61 -82
3625h2L13k93J73n1p3l9L3P1Q8N3k10J55K9j61o4K1j76J34Mp0J38j3J12j16j04
$$ -82 231 -62 111 60 -13 -52 -19 52 140 193 -17 138 167 6 -58 -37 -213 -79 -75 -145 -7 -20 92 -24 -128
3650a28P7Q2L0J58k40m2R4q5R0J9r6Q9j34J6R0Nq3J83q1j03j18J28M9O7j49J93
$$ -128 -51 31 61 219 -21 -63 31 -54 36 55 -41 48 -86 -70 20 25 -58 125 44 -59 -177 -49 0 67 -82 111
3676A11j67J9r7J4J16j07L02k37Q9j13L7oJ97o3r3m2j6J92q6R8j23p9l9L7J56
$$ 111 -56 -37 -134 -120 -4 -111 191 -46 43 -70 -33 -39 158 95 2 -40 -56 136 50 148 25 -54 -93 -56 100
3701A00k33J33J2k6l7P7oj05J02J05P8k21J54l6j34k5j2J79k04K0j8J06q8kJ13
$$ 100 -133 0 12 -14 -51 26 20 -85 17 122 200 -21 133 97 -37 -62 -74 105 -99 -79 -97 9 -79 -81 32
3726C2o0Q5q8J49j58J0pJ1J9l5j7J3O9M5NP4j79J27p2j40J24j76J81kL3P6k08
$$ 32 -28 57 -31 118 -40 -30 -37 -26 -7 -42 -59 -46 23 68 73 147 -32 95 23 -117 7 -169 12 10 43 119 -89
3753h9P0j34L8J71j58N9j44J91R8r0J54k05O5nM7j12J33k25l6J34n1K9M5J67j92
$$ -89 -19 -153 -115 56 -102 -43 -187 4 102 12 166 -39 26 21 68 -44 89 -136 -172 -38 -89 -60 -15 152 -40
3778d0NQ2q0m7J89j25j77L18m5k53J25j58J22L4J72r5p6j5J6M9p1J28l5J07l9
$$ -40 -35 47 -33 -80 109 -16 -193 125 80 -173 -48 -206 -84 -50 122 27 -49 -64 -48 1 -70 58 23 130 91
3803I1J31k30R0r3qP4Pk59K87r0k7N5N6j30n6J10l4K21r8j49L1j08J08N7N8k13
$$ 91 222 -8 82 -11 -19 55 62 -197 90 0 -27 28 84 -46 -102 8 -26 195 97 -52 -21 -129 -21 36 94 -119
3829a19nL17j26j41J29pj11K95j87Q6j68J02M3J1p8j08K49l18O7o1J34J66k72
$$ -119 -124 193 67 -74 55 48 -63 232 45 131 -37 65 108 119 41 -67 182 -136 -69 -130 4 170 -102
3852a02Q4J2N2J44j90k6k1J14q9Lj6J34m5kn7Kj40R0J80k18rK25k06O9lr2nJ57
$$ -102 -18 -6 46 190 0 -26 -47 67 -22 -19 -35 99 54 52 -5 -3 -143 -53 127 -91 -100 125 -81 -12 -15 -107 -112 45
3880D5l2m6N7k7M3l9O5L0m1j38K78k82l6K08o3J2j37K9ko4J37J37Rn2r5L6R0r1
$$ 45 13 -33 24 -3 40 1 66 96 55 -83 195 -87 -123 85 22 34 -103 -74 -76 -140 -3 134 143 91 -4 32 122 31
3908C1j01O6Q1j23pP9Q9k9l6r9M1L2j25O5J10j59O7r1P6q0k8J63l0l0J60N3j14
$$ 31 -70 -4 77 -46 -53 26 115 86 50 -49 -8 24 -101 -36 74 -85 -18 -109 -33 -113 -141 22 -8 -38 122 175 61
3935F1q9J17j52m9R0m6pJ99O2j73k8M0Q9rp9j14P6r0J60O0l0Nj28J33J13k28j58
$$ 61 -28 89 -63 -112 -22 -68 -75 124 186 13 -15 25 114 105 26 -88 -12 -102 58 118 88 93 -35 98 211 -17 -175
3962a75K45r2o0K01j76rq0J11J7j9O8j12Q3J4jq4L1O0r4j6L4J4l4n2J49r7K12
$$ -175 70 -22 -82 119 -57 -66 -146 -35 -18 -37 31 -81 2 16 15 -69 -38 22 -72 -88 -54 -40 -74 -126 23 -74 138
3989A38mk07M0QjK4M1m5R4j01l3N6r0J77N1j96M4j6K7Q3r0K8j17O1K0R0j4R9p4
$$ 138 134 -73 -33 -25 -26 -2 39 -6 88 -13 -46 10 -80 97 148 -48 -4 -20 7 90 0 28 -89 -28 -8 82 68 167 93
4018I3j71J5o3J46nmj5j8L8j6j50J75J1nj02m0J4j9J68j63J73mk5j1j3r2J38L4
$$ 93 -78 -63 -126 20 15 11 -4 -22 16 0 -150 25 36 31 -71 -111 -97 -116 52 -111 62 58 33 22 9 -83 55 89
4046H9q3J41r5p9nM6q2J20P4o2m6l4k6N8n7p0R5J12n9r0JJ34m0j64R7J30q8j21
$$ 89 6 147 52 -27 -32 14 -68 52 126 64 18 -16 -42 16 -41 -111 -16 96 37 -53 -52 82 42 -122 -25 105 17 -104
4074a04M9J63j41R0kmq5J6M8K4j43J15n4n9QJ57kk08J76o4P3K3j02o3P4N5j2n
$$ -104 -55 108 -33 57 55 51 -34 -18 30 54 -89 26 -28 -87 -79 78 76 -132 44 -20 53 76 -26 -89 -15 40 28 23
4102B3m9kj5K4rl4N2J88k94K42j81J60r6j1N7m4M7j09J7KJ38o4p9lL6J01k3l2
$$ 23 -26 -28 -43 -19 -28 -62 -10 178 -116 126 -55 105 9 -2 55 11 58 -51 -34 -32 106 42 -37 -40 -4 97 74 42
4130D2L9j53N0k5l2k2J12k1OM2j03N7Q2r7O5k29K45j95J12q4OP3J03m9j4l3J42
$$ 42 81 -72 -22 -47 -79 -101 11 -10 -4 38 -65 -8 74 -23 42 -187 58 -137 -25 -109 -103 -30 73 24 10 -23 119
4157A19r6j04Q0J40j89j3k4N1P5m1N3J5q2k7J24j23J9L5K21j93R0o4oj05O1O1
$$ 119 23 -81 -1 139 -50 -63 -87 -36 39 -2 51 66 -16 -43 81 -42 -23 12 233 40 130 66 60 -45 16 77
4183G7j54q2J50N3k7k6k9J3J5Ql3K3p5J87j78mJ62r6j56K84j7r0j1P5q1R8j56
$$ 77 -77 -159 -9 44 17 -9 -38 -25 -10 -2 -35 -12 -87 100 -78 -82 80 -16 -172 112 95 5 -6 69 -12 86 -70
4210g0O3L1j44O5J96j91p0N7O3J75k71K34j68rrK16q5or4m6J51j09J11M9j62J90
$$ -70 -7 24 -120 -55 141 -50 -120 -63 0 175 -96 138 -30 -39 -48 168 83 77 -17 -63 88 -21 90 139 -23 167
4236A67j24j34k9Q2j7L4Q3j82J40O1k6j5J16k44P6r7K7J91j76m0l2R4O0r2J9j0
$$ 167 43 -91 -120 -38 -55 -21 62 -120 20 81 55 40 156 -88 -12 -109 -82 109 -67 -107 -139 -45 15 -77 -58 -68
4262f8j03J03Q8o1L3J9q0K7q3J25l6K3P2J28j47Jm9N4j11P8p5j2M6L5Mr6J85j10
$$ -68 -171 -68 20 -41 -8 11 -69 -42 -125 0 -36 -13 59 187 40 41 -8 46 -65 13 -62 -74 -28 7 11 -85 100 -10
4290a0RK4p4M0m5L3K1j5j21M8O9j06J89M1q7J06k95J76J14o7m0M5k5M9j62J16
$$ -10 -1 23 -51 -11 -56 -23 -2 -17 -138 -90 -21 -127 62 103 16 122 -173 3 117 50 10 55 30 79 -83 33
4316C3J43k12JK2k0J76k16j09Q1K5J06r9K62k13j41J55j50O3K10l6q9R0R0k81
$$ 33 176 -36 -35 -13 -33 143 -73 -182 -101 -76 30 -69 193 -20 -161 -6 -156 -93 117 81 -8 82 172 -109
4340a09K5M7K3p7K5R9oM0j9q5Q6p5K7q7J56k7j73L38k66j4m2J84k6k32J13J00
$$ -109 -84 -37 -14 -91 -66 33 27 67 48 -37 49 -26 1 -86 70 43 -130 208 -58 -72 -114 70 44 -188 -75 25
4366B5K9j43K36k04J61o8m5L0P1j76K0P9j02L16j04j85n0K4J37J41j73l5P5J07
$$ 25 54 -89 147 -57 104 36 -9 21 92 -84 -64 15 -87 229 125 -60 -110 -86 51 192 19 -16 59 166
4390A66r1k3o4N0N7qr8J7Mj01R7k0N8M6r3O8Mq4J72k37K15j68N6p3q8M6J06L6
$$ 166 75 52 -12 38 95 87 -11 6 10 -91 6 -14 44 90 -3 65 69 -15 157 -80 135 -33 23 -50 -138 -92 14 50
4418E0j58mJ52J18M8l16m1J25q5M7J36j5j06n1J50K0j89O0JQ1j93J44o3L1N5J9
$$ 50 -108 -112 40 158 206 -110 -151 -26 -111 -64 72 57 -49 -100 50 70 -119 -59 -58 23 -170 -26 -89 -58 -3 16
4444A6J25k69J97q7J35K4j03j9lj8m2M6P6L4N7p0k34J39k9K8Q0j21%K01k37L4
$$ 16 141 -128 69 -18 117 141 38 19 16 -2 -44 2 78 112 169 99 -135 4 -25 3 83 -38 -38 163 -74 -40
4470d0l2j36L23k73J88M0l0J7n7j82K87l8J0o8j33J8J30j78M7K6R4J68j14r7K7
$$ -40 -72 -208 115 -158 30 70 40 57 0 -182 105 67 77 9 -124 -106 24 -154 -107 -81 13 181 67 -30 -3
4495cJ78j71j8j5L7L6q5J92k55N9K0M4Q2p5j08o5J87j3k13J83o4K3O4J13j00n8
$$ -3 175 4 -14 -29 8 44 -41 151 -104 -45 -25 19 101 26 -82 -147 40 27 -186 -3 -67 -44 20 133 33 -25
4521b5Qo5k1J46j91K59J0q3n7P9m4q1J43P3j69J21j60P6k3J31j22j35O2J84q5
$$ -25 -17 -82 -103 43 -148 111 121 38 -19 60 16 -65 78 151 -18 103 -57 19 -4 127 5 -130 -68 116 31
4546C1J75r4k26J61o7j3R6m1K0Q0k88J49k4J77p4O6j29J60m5j00rJ34k35R4j4
$$ 31 206 112 -114 47 -20 -33 63 22 42 122 -166 -17 -41 136 62 128 -1 159 114 14 5 139 -96 -2 -16
4571a6K6j8k6q2j1J19m7K53l09m6K96p7n5J33j4j10k3J8m2j05J98O3J31k16j99
$$ -16 10 -8 -34 -116 -127 -8 -55 198 -111 -157 139 62 7 140 126 16 -7 11 -31 -136 62 125 256 40 -159
4596a59J42O1P0j10J%j32R9K5k4N9p1j30J16m0J13O5j39J37j73J32p5L8j38R5
$$ -159 -17 44 114 4 5 5 -127 -28 -3 -27 32 -39 -169 -53 -93 20 85 -54 83 -90 42 -33 5 -133 -38
4621c8M4jl0l3R7l6%L3Lr9j3J4J02j74J49Q7j44N5n5J72k26P9J48j19j05L0J13
$$ -38 6 5 -25 -58 39 3 3 36 39 -60 -73 -59 43 -131 18 105 -39 16 -39 133 -93 -14 134 15 -90 -60 53
4648E3j93J46p1n2J99l6j94K31N0j86O9qkj4P1L4k9q3J3p7N6N8j7j4k2J9j20N1
$$ 53 -140 6 -65 -117 82 46 -148 83 133 -53 16 8 6 -8 63 97 68 -15 -2 -79 -23 35 18 4 -18 1 -119 -68
4676f8l2n5J36k3J19j03p6J88j08K3Q3O6j93J1jRK0j39K79j96J4O5K0j11KO3n1
$$ -68 -100 -155 -19 -42 77 -26 -102 86 -22 1 84 150 -43 -32 -33 -24 -4 -143 136 -60 -46 19 39 -72 -70 -7 -58
4703e8r0P2KQ4Q7j39L2jr2J49J9O5k27J36k06M00k29m4J6%R%L8Pk03L4K38j56
$$ -58 -148 -76 -74 10 97 -42 -10 -11 -103 46 65 130 -97 39 -167 233 4 -40 -24 -24 -15 -15 23 30 -173 -139 99 -57
4731e7lJ27n4n0Q8Rj31R7M2j92J32k6P0P2o7j36N5oR7o9L4J3J47k64j2J6J59j35
$$ -57 -60 67 13 -37 51 60 -71 26 68 -124 8 -18 52 124 57 -79 -24 -30 67 -2 32 45 192 -72 -84 -68 91 -44
4759d4n1K47j43l5P6L4l4o3P4j57J8R8Q0j22M7p4LR3r0J01q2p7O0l5M0J54L1j42
$$ -44 -95 152 9 -26 50 84 50 -13 61 -96 -78 20 100 -22 25 -49 -46 47 -43 58 -24 -101 -41 -76 -36 118 149 7
4787Gl6p7K32k56L3o4J09m6R5l1R0J09k28kJ63j13J6l2LJ0l4o1j9L03j93O0j16
$$ 7 -29 -106 126 -130 -97 -161 -52 -98 -3 -34 56 165 -63 -65 98 -15 1 -31 -28 -18 -52 -113 -132 171 -22 38 -78
4814g8P0n0J25j87M5K42j58jJ83j54m2j8l8L1J39p8m0j2j20N1K56J2j30j27N9
$$ -78 -8 -58 67 -120 -75 167 9 8 191 37 -5 -23 -61 -30 109 31 -9 -21 -141 -90 166 178 48 -79 -20
4839b0M9qp7k0j7K13j89K31j47M4n2kN3j00o7K28j63J69j57J4P1O0j7j67J03j49
$$ -20 29 21 -56 -76 -93 120 -69 162 15 59 7 5 58 -42 -109 119 -44 125 -32 -18 53 113 96 -71 32 -117
4865a17J18j25m9O5J14j4Q5k0j13J92k23K4N9lJ33n5m7J30k35J06mP0j58PO1K3
$$ -117 1 -124 -173 -108 6 -8 77 57 -56 136 -87 -63 -4 -7 126 71 24 154 -81 25 21 91 -67 -60 1 24
4891B4j21R1M7n8R9k04J23p2J65m6J9q3k2j0m0n0J48j29J20J55j24R7j56K4l4
$$ 24 -97 -6 41 -17 82 -122 1 -71 94 48 67 -16 -38 -48 -88 -138 10 -119 1 156 32 129 -27 -3 -37
4916c7m6k7K26l7J5j30l9O0L3p9J37j45J29j38J26q9J9J68k13J86k63J13l6R5
$$ -37 -83 -110 116 79 94 -36 -75 -15 18 -61 76 -69 60 -78 48 -41 -22 146 -67 119 -144 -31 -67 28
4940B8r3Q0K9N4L6J10j03k30m6J38j15L2J77M3j03J0j8j36L5k2L01k00q5K03l29
$$ 28 -65 15 44 98 134 244 141 -89 -135 3 -112 -80 97 140 37 47 29 -107 -72 -94 207 7 -78 125 -204
4965b04K43K2r0M0j07RJ41q6M9M5r1J83k74K87k12n1j8R2J14k23N3J73k07P7J07
$$ -204 39 61 -29 11 -96 -87 54 -32 17 62 -29 154 -120 167 -45 -96 -114 -22 92 -131 -78 95 -112 -35 72
4990G2k3P4j46R7r9J0N2j11P0k0N1J53q8rj45J96j33J33j38J6j72L06j51k12K17
$$ 72 49 123 -23 74 -25 -15 37 -74 -4 -24 27 180 92 83 -62 134 1 134 -4 12 -160 146 -5 -217 0
5015@J35j43N7j26j24O5J74j26P4M0O2n3m8J0l3Q0K8q6j54K77k68K7J09J9j79
$$ 0 135 -8 49 -77 -201 -136 38 -88 -14 26 88 35 -13 -3 -36 44 72 -14 -168 109 -159 -132 -23 -4 -183
5040a83K74p4k11J00J8N7j3q8L60k36q6K8K47j71J6j92P5J47Pj64M3J05p2J36
$$ -183 91 17 -194 -94 -76 -19 -32 -120 240 4 -82 -54 193 22 38 -154 -79 68 75 -89 -46 59 -13 123
5064A23j67K8n6J38p0j1k4J43N9j42l3q1O3J22j55j9P7P5k4o5j01J61J64Pk96
$$ 123 -44 -16 -72 66 -4 -15 -39 104 163 21 -12 -93 -30 92 -63 -82 -5 70 46 -19 -120 41 205 212 -84
5089h4R6L2p5L5n5J1q9J25K6R8j46K6r0J0N8K25j13j39J81q3k1M6j87J76j26J6
$$ -84 12 44 -31 4 -51 -40 -129 -4 22 120 -26 0 -90 -80 -22 203 90 -49 132 49 28 74 -113 63 -63 -47
5115d7J9m1J1OK13j85j08N4R4O0pM9j44k23K91J17j77j6P3k32M8J68J39j22l9
$$ -47 -28 -69 -58 -52 161 -24 -132 -78 16 76 69 118 -26 -249 42 159 -18 -34 39 -193 -145 23 162 40 1
5140Aq8J96m5l4O6j28jj26J06O2O8n6p7j37J27L1n8J17j15k3J82j59P4m7L2J06
$$ 1 -87 109 64 30 96 -32 -33 -159 -53 9 77 21 -56 -193 -66 -35 -93 24 -91 -114 68 -91 -17 -64 -32 74
5166G4j53P4J67j56J41j85r7K2R4Q3r9m8O4R7j59PJ98j43O2j91L05k04l9J29j4
$$ 74 -79 -5 162 6 147 -38 -135 -113 -19 64 -35 -83 -19 78 -81 -74 124 -19 43 -148 157 -47 -86 43 29
5191B9Lj19P0Q1k27K47Kk29J73p1J23j07N6O6m6J6q7l0M0n1J08j71J55q2RN7O2
$$ 29 32 -87 -17 64 -163 84 86 -143 30 -41 82 -25 31 97 51 67 -20 -50 -10 -61 47 -124 31 -51 -42 15 77
5218G7m6O7j48M4Pl6J81k17R9j83J46l6J36j81L5k5K7M8l3Jq5K22l4j85J5Q2j4
$$ 77 31 98 -50 -6 1 -35 146 -71 28 -155 -9 -45 91 -90 -55 -80 -53 -5 -38 -37 -122 100 66 -119 -104 -22 -36
5245c6R5j90J62O1l6j58P8pj0J69r1m1lkm7m7J39J14j57J55r1k1kl4J51M5o0k00
$$ -36 59 -131 31 92 56 -102 -24 -31 -41 128 37 -4 -7 -9 -56 -103 36 150 -7 148 57 36 34 0 151 196 136 -64
5273f4R6l3k02K00N4M5j51n7J41Jol9m7J30j25N5Q5N3N0j11J19l33M0K8K2P5J01
$$ -64 32 -1 -203 -3 51 96 -55 -112 29 30 24 -15 -62 68 -57 -2 83 136 186 75 194 -139 -99 -71 -49 26 127
5300A27N0k49J52J5j68Q7j5j08K8l5J77j50K23j36N3l2m7lj4J51j27p0O2R3j03
$$ 127 177 -72 80 95 -73 14 -1 -109 -81 -116 61 -89 134 -2 51 19 -28 -31 -45 106 -21 -91 -29 64 -39
5325c9o6P8L3J23j40j05J28J01k01Q2J9j70K00L2j12J6K51j34k17P4O0J07p6j81
$$ -39 -105 -27 6 129 -11 -116 12 113 -88 -6 13 -157 43 75 -37 -21 230 96 -121 -47 13 120 44 -137
5349a37K76k04L0L1r6K42k30K00k0j16j62K05M6j26L1J28j34J11k65J50J4J08
$$ -137 139 -65 -35 -4 -100 142 -88 112 92 -24 -186 19 65 -61 -30 98 -36 75 -190 -40 -26 82
5371H2Qj27P4j29O6J2J44j12J34Pl9k26K2J27O1r1Pm3j05J40q2l4J9J6J59r4J15
$$ 82 90 -37 37 -92 -26 -14 130 18 152 159 120 -106 -84 43 104 13 20 -23 -128 12 -70 -104 -85 -69 90 -4 111
5398A11j85j17J18P7J25k78N0J79K9j57m6p7K8n1K68K6n1j71K12j15L4Q1j33n
$$ 111 -74 -191 -73 4 129 -149 -99 80 109 -48 -94 -171 -143 -194 74 100 49 -122 90 -25 9 90 -43 -48
5422d8R0k8n2m5KO9N5o6J4j47l4L26j01m4K4n5J05k9Q4j71N8K5n4J17m4l1o8l3
$$ -48 42 14 -38 -83 -81 -12 43 -23 -9 -156 -190 136 35 -9 15 -40 65 36 120 -51 7 32 -22 95 51 20 -48 -81
5450h1n3J89p3l5l1J65k3j70J79r0K53j38r2L5q6p7R0p6J1K15r0K9K3j55J07l8
$$ -81 -134 55 -18 -53 -84 81 58 -112 67 -23 230 92 0 35 -51 -128 -38 -114 -103 112 22 51 74 -81 26 -12
5476a2J18k27P3M1q4o7N0K16j07J9k08M14k17j45K80k69J67m3J6O5o0k01K16j21
$$ -12 106 -121 -48 -7 -91 -158 -108 108 1 20 -188 226 9 -136 144 -125 42 -1 15 80 20 -181 35 -86
5500h6K92k24m7O9J30k42K26k56Q8l4J16j00J43j4j55P3m6J80j4M6k7j17l1J02
$$ -86 206 -18 -65 4 134 -108 118 -138 -50 -84 32 -68 75 61 -94 -21 -67 113 99 145 118 1 -30 72
5524G2j97j3R1O6O1j70J46J06k00O6lj87J66p7L33k72J74q4j83J76l6n7o9J74
$$ 72 -125 -138 -47 19 80 -90 56 162 -38 28 25 -162 4 -73 260 -12 162 78 -105 71 35 -22 -91 83
5548H3kj16M2r0N1p3J85o1Q3o8R4q3k56J86L0J78m32K79p4J14k53K72r8k0J81
$$ 83 81 -35 7 -83 -32 -105 80 19 102 34 128 45 -211 -25 5 183 -249 30 -44 70 -183 89 -9 -29 152
5573A52j92R5l1j03R2M9m6J5m7mQ0jj31J40M8M6j76J6M5j17J63j33K9Q7j37Q7
$$ 152 -40 55 24 -79 13 62 16 31 -16 -20 60 59 -72 68 116 162 -14 2 47 -70 93 -40 -11 76 -61 26
5599B6JJ11j62p2K1k4J80j33O8J63k14Q6j30O5o0P4k7m2J30Rk20J50QL9n5k8m1
$$ 26 27 138 -24 -96 -75 -99 81 -52 16 179 -35 51 -79 -14 -74 0 -27 -69 61 70 -150 0 8 47 -8 -36 -77
5626g7q3J21P7o3J2o4P6j04jJ37J20j41P6k41K26j25J26k42J70q1L0N0j1o2k1
$$ -77 -160 -39 38 -25 -13 -77 -1 -105 -106 31 151 10 86 -155 71 -54 72 -170 0 -81 -51 -1 -12 -74 -95
5651i5J89L2K9k22K03j91j20R5N7qR8q1J02r8q6N3LJ36p0j34K31o7p9J30j28J16
$$ -95 94 126 155 -67 136 -55 -175 -80 -23 -31 67 -14 88 -10 -96 -43 -40 96 26 -108 123 56 -23 107 -21 95
5677I5j42J11L1o6LmK0p7o1K41p3j07K0K1j2j21J9J75J0j11O6j17N3J22j65n4
$$ 95 -47 64 95 29 32 28 48 -29 -90 151 78 -29 -9 12 0 -121 -102 73 83 -28 38 -79 -26 96 -69 -123
5703a23Q9j76J98J44k26J81l0K26l26j0Q7j39O9P6j15J14j47R7K7M7j11mN5N9
$$ -123 -34 -210 -12 132 -94 87 57 283 -43 -53 34 -105 -36 40 -75 39 -108 -11 16 63 -48 -52 3 62
5727F2k20J85J3j30K40j92J5J49j70J7k8OJ26m6P0n2J9m2q0J29o8J32j11M3j23
$$ 62 -158 27 40 -90 150 -42 -27 122 -48 -31 -59 -53 73 27 97 45 64 22 -58 71 3 135 24 67 -56
5752e6N5Mk7j16P5Kp3K86j2Jk62K35j82J73n8nk2K8O6r6K36j83k21N7O8L6K8n2
$$ -56 -1 3 -24 -140 -65 -63 -136 150 138 139 -123 112 -70 103 45 40 18 46 112 16 252 69 -152 -95 -27 9 37 -15
5780a5k07P6J24p3Q3j1l3J54j37j0K20k68J27R7kj73J51r2j85J73R1j54l8K00
$$ -15 -222 -146 -22 -95 -12 -23 -56 98 -39 -49 171 -97 30 127 125 -48 103 11 -174 -1 90 -64 -102 98
5804I8o3M6j45L3j44J50R4Rj24J18M8j11N7r6O6m1J13j56k6J07Rj62J33R4k05
$$ 98 35 81 -64 -31 -175 -25 69 78 -46 72 120 9 66 -30 36 -5 108 -48 -74 33 42 -120 13 107 -98
5829i8J68r8l7m4J18N3j35J51j75J95l5j72K8n9K00j12j48R0J58r7QQ0r8RK6l9
$$ -98 70 -28 -65 -109 9 62 -73 78 -97 98 63 -109 -81 -140 60 -52 -200 -110 48 -49 -41 39 -59 -50 -24 -63
5855f3J05J00j32J50k06R3j36%N5rJ05J9j33J30Qk45J44o0R0L7O5j13O3q5J68
$$ -63 42 142 10 160 -46 47 -89 -89 -34 -43 62 81 -52 78 86 -159 -15 -75 15 52 117 4 67 -18 150
5880A50j52K7j03R2j8j8m5m2J08O5M0j11J28j36K00j12j13K6r8K74p9k02K19j11
$$ 150 -2 25 -78 14 -4 -22 -67 -109 -1 64 104 -7 121 -15 185 73 -40 -14 -112 162 83 -119 100 -11
5904a1J2l9N9m8qM0k3l9K49k64J62p6Kj4n0R1N6j08qk6n7j0J01J21j58J0N4j5
$$ -11 1 -38 21 -27 -35 5 -18 -57 192 -72 90 14 16 2 -48 43 99 -9 -17 -43 -100 -110 -9 112 -46 -36 18 3
5932Cl3P7j01k8J61k8j0j73J72k0j4j6N3J19l04M9oJ56j79J51r7Q2p6n0L9J17
$$ 3 -30 47 -54 -82 79 51 41 -132 40 20 6 -10 43 162 -142 -93 -99 57 -122 29 -68 14 -62 -112 -73 44
5958D4J52l18J75l4j75K57j60O3l9jP2J46n7j82J59o2p2l0N1P4%Ko8k6R5k00J80
$$ 44 196 -122 53 19 -156 101 -59 4 -35 -36 36 182 125 -57 102 40 -32 -62 -11 63 63 65 -3 -29 66 -134 46
5985D6o3K5J66k09l9J46n3n0N5j11J16j9J0k9Q1o0q4N2K26j85n8J11j21N2J09
$$ 46 -17 8 174 -35 -74 72 19 -31 24 -87 29 10 20 -9 72 12 -72 -20 206 21 -37 74 -47 5 114
6010A14k59K12k38J61j53J35J54q7j87P2J54j94K53k27L16k03r4J05k33J34O3
$$ 114 -145 67 -171 -10 -163 -28 126 39 -148 -76 78 -116 137 -90 226 23 -71 34 -199 -65 -2
6031bp2J25L7M9j11j36J72r2%K5l8J04o0m1j09K50J2j12o4J22q7L7o1n8J07J22
$$ -2 -74 51 88 137 26 -110 62 -30 -30 -5 -43 61 1 -40 -149 101 113 1 -63 59 -28 9 -52 -110 -3 119
6057A19p0J10k02Q1j63J94o6R1q3K6J5j90R1L8J28k09R9pm4K2k3L1n4J26r9j31
$$ 119 49 159 -43 38 -125 69 3 94 11 37 52 -138 -47 -9 119 -90 9 2 -42 -20 -43 -12 -66 60 -39 -170
6083a70J82Rl4nj33R0J65J5j1k8q5J11j5j95J12J87o1j26K04k61K0Q3k31K64j64
$$ -170 12 21 -13 -18 -151 -61 104 119 108 80 -5 106 91 -104 8 195 134 8 212 -49 -29 54 -177 87 -77
6108g7J50j95J28K1l4M2j40J79j65M5R8pk03J58L1j70J61m7M7k4q4N7N6M1j32
$$ -77 73 -122 6 27 -7 35 -105 74 -91 -46 52 45 -158 0 31 -139 22 -25 22 -2 -86 -29 27 68 -64
6133f4L8K26j96O8o9j27O7j14J89Q4L7j68L8J11k39NQ3k1mJ71j35O3j7m9j65L16
$$ -64 -26 200 4 72 3 -124 -57 -171 18 102 139 -29 9 120 -119 -114 -31 -52 -56 115 -20 43 26 -23 -188 128
6159A28k53K52k02K28j7j23J1J8Kk3k6N9KJ19j04N1m3k51J60N4l6K3J08l19J07
$$ 128 -125 127 -75 153 136 13 24 42 44 21 -5 54 56 175 71 122 79 -172 -12 42 6 29 137 -182 -75
6184g5o5J10o6j12J72J43j84J39k37Q1j6k9K12j21K2J00o2J79j88O3j55Q7l9k6
$$ -75 -140 -30 -96 -208 -36 107 -77 62 -175 -94 -110 -139 73 -48 -26 74 12 191 3 66 -89 -2 -41 -67
6208f7J27j32O3O0m4k47J41L3R0p0Q7j68J28mO3L6l7o4k9Q8Q4k6k96J93n9J69
$$ -67 60 -72 -9 51 7 -240 -99 -66 24 -46 41 -127 1 -3 60 96 59 -5 -34 54 138 112 -184 9 -50 119
6234A19k29J36j90Q6L6L9J77j99J49m9n3O8k33j8J87k16J83O2R9j38j09K49j97
$$ 119 -110 26 -164 -78 -42 -3 174 -25 124 75 22 90 -143 -161 26 -190 -7 55 154 16 -93 156 -41
6257d1M7o2N2J0n2O5k1Q1j15K5m9J39o3J15r0J5k9m7o5N0J2M8j40J26n7J8L9J17
$$ -41 6 -56 -4 6 -46 19 -2 79 -36 -11 -60 79 16 131 41 56 27 -20 -85 -35 -23 25 -115 11 -46 -28 11 128
6285A28Jl14J41P3po6J00L4K4k10Q2j9o5K0J09o5%J16k53K90l5j99J63K8k08K22
$$ 128 129 -185 -44 29 22 -44 56 90 114 -96 -14 -33 -98 -78 31 -34 -34 82 -171 119 84 -115 48 76 -132 90
6311I0K4k07j8J86j53J29j09r6R0O4N1j60J01j15K50j10j30Q0l4K1J8K0J49l6
$$ 90 114 -93 -111 75 -78 51 -58 -154 -64 0 51 -109 -8 -123 127 17 -113 -33 -67 -46 -28 -8 141 105
6335A05l01l6J64P9R2j88J45m2r7Q5J23l29K4J05k5R5J08qm7l40K52P5j06J84
$$ 105 -196 -232 -68 11 103 -85 60 18 -79 6 129 -200 -176 -71 -96 -1 107 99 52 -288 -36 39 -67 117
6359A17j82J75j03o8l0K47q1j1k55R5J06j10J41j69Q4j85J50O6K22j73q0N1j24
$$ 117 -65 110 7 -61 -91 156 75 64 -191 -96 10 -100 41 -128 -44 -229 -79 -13 209 36 -44 7 -117
6382a17j35J91P9j24K71j77J22k70J42l5J4j03K09n3p4J55k9m6l8M9k3l9O3j00
$$ -117 -252 -61 18 -106 165 -12 110 -160 -18 -53 -39 -142 67 14 -60 95 66 20 -18 31 8 -31 32 -68
6406f8K0J34j9o4J47j80N9J32j5k92P6K0j88L08j00J43k53R8j7Q0J3o2J94k72
$$ -68 -48 86 67 3 150 -30 29 161 146 -146 -70 -50 -238 70 -30 113 -140 -42 -59 21 34 -28 166 -106
6430a06N7j11J97J03k10J33M0j43J13q3Q1J12j30p2R0j64J0J51j94J07k3P4j20
$$ -106 -49 -160 37 140 -70 63 103 -40 73 -10 71 183 53 -19 71 -93 -83 68 -126 -19 -42 32 -88
6453h8R0J3R0j83K12j18N0M6q1L16k78j12L4j25M5O8JoJ00j93O6K0j6J33p0n4
$$ -88 2 15 105 -78 134 16 66 112 31 347 69 -43 -9 -134 -89 -21 -20 -26 74 -119 -53 -33 -49 84 14 -40
6479d0n8k2J09K6K9L0q0j04M1J51j96J09J26J26k35j12M0O3N5K7j19J1j61J86
$$ -40 -98 -120 -11 15 44 74 -6 -110 -69 82 -114 -5 121 247 12 -100 -60 3 58 85 -34 -23 -184 2
6503Bl2L2Q7r8Q7N8j09M8j67J00n4P9n4Mj04J45Q4m4j19K3O0R1j33O1m9n5J41
$$ 2 -30 2 89 -9 78 136 27 75 -92 8 -46 33 -21 -17 -121 24 108 64 -55 -32 28 119 -14 47 -2 -57 84
6530H4m8rl4n0jM9P4K9j77j16L27j06J4Oj72N2r8Q2J17J9J76k75k0J26k16L07
$$ 84 36 27 -7 -57 -58 -9 65 94 -83 -199 128 22 36 42 -130 -78 -176 -94 23 42 218 -57 -77 49 -167 140
6556A40p2k08J06J0J4Q4k07M1j39J66j%J01L3N3j18L4M3p2j11J12M6q9k5L4ol
$$ 140 68 -140 -34 -24 -10 74 -133 -92 -231 -65 -66 -66 35 68 121 3 37 80 8 -103 9 55 -34 -59 -25 -31 -34
6583c4j6J11j42O5O3R1j10l3oJ84j08K3l9J4K4N8o4j71K69k42J96n4k44L42k00
$$ -34 -50 61 -81 -16 47 138 28 -5 -11 173 65 88 49 63 87 145 81 -90 179 -63 133 79 -165 177 -23
6608b3Q9p4j61J10O1j8r6K01J1j16k1K04j57M5j78J20R2j72J25or9J86J4q4rm5
$$ -23 66 -8 -169 -59 2 -16 -112 89 100 -16 -37 167 10 55 -123 -3 89 -83 42 36 -63 123 137 53 44 -1
$$ [...]
8191I
##END NTUPLES=NMR FID
##END=
