##TITLE=1H_5A2003-05
 CDCl3
 8 sc, 
 21.3.2023
##JCAMPDX= 6.0         $$ Bruker NMR JCAMP-DX V2.0
##DATA TYPE= NMR FID
##DATA CLASS= NTUPLES
##ORIGIN= UXNMR, Bruker Analytische Messtechnik GmbH
##OWNER= root
$$ XWIN-NMR		Version 3.5
$$ Tue Mar 21 14:03:56 2023 Russian Standard Time (UT+4h)  she@DPX200
##.OBSERVE FREQUENCY= 200.13135
##.OBSERVE NUCLEUS= ^1H
##.DELAY= (6, 6)
##.ACQUISITION MODE= SIMULTANEOUS
##.ACQUISITION SCHEME= undefined
##.AVERAGES= 8
##.DIGITISER RES= 18
##SPECTROMETER/DATA SYSTEM= spect
##.PULSE SEQUENCE= zg30
##.SOLVENT NAME= CDCl3
##.SHIFT REFERENCE= (INTERNAL, CDCl3, 0, 15.7039)
##AUDIT TRAIL= $$ (NUMBER, WHEN, WHO, WHERE, WHAT)
$$ ##TITLE= Audit trail, XWIN-NMR		Version 3.5
$$ ##JCAMPDX= 5.01
$$ ##ORIGIN= Bruker BioSpin GmbH
$$ ##OWNER= she
$$ F:/spectra/data/she/nmr/H-F/1/audita.txt
$$ ##AUDIT TRAIL=  $$ (NUMBER, WHEN, WHO, WHERE, WHAT)
(   1,<2023-03-21 14:02:54.35 +0400>,<she>,<DPX200>,
      <created by zg, POWCHK disabled, PULCHK disabled
       configuration hash MD5:
       00 E9 B6 7A A2 85 ED C7 34 08 36 98 17 FE 4E 26
       data hash MD5: 16K
       A3 5B 8F 17 B4 28 85 20 86 87 C7 8C 42 63 6E AF>)
$$ ##END=
$$ 
$$ hash MD5
$$ A0 BC E8 5D 70 EF 89 11 A6 5C A2 E2 F3 47 71 63
##$RELAX= 
##$RELAX= 
##$RELAX= 
##$RELAX= 
##$RELAX= 
##$RELAX= 
$$ Bruker specific parameters
$$ --------------------------
##$DU= <F:/spectra>
##$EXPNO= 1
##$NAME= <H-F>
##$PROCNO= 1
##$TYPE= <nmr>
##$USER= <she>
##$AMP= (0..31)
100 100 100 100 100 100 100 100 100 100 100 100 100 100 100 100 100 100 
100 100 100 100 100 100 100 100 100 100 100 100 100 100 
##$AQSEQ= 0
##$AQ_mod= 1
##$AUNM= <au_zg>
##$AUTOPOS= <>
##$BF1= 200.13
##$BF2= 200.13
##$BF3= 200.13
##$BF4= 200.13
##$BF5= 200.13
##$BF6= 200.13
##$BF7= 200.13
##$BF8= 200.13
##$BYTORDA= 1
##$CFDGTYP= 0
##$CFRGTYP= 5
##$CHEMSTR= <none>
##$CNST= (0..31)
1 1 145 1 1 1 1 1 1 1 1 1 1 1 1 1 1 1 1 1 1 1 1 1 1 1 1 1 1 1 1 1 
##$CPDPRG= <>
##$CPDPRG1= <>
##$CPDPRG2= <>
##$CPDPRG3= <>
##$CPDPRG4= <mlev>
##$CPDPRG5= <mlev>
##$CPDPRG6= <mlev>
##$CPDPRG7= <mlev>
##$CPDPRG8= <mlev>
##$CPDPRGB= <>
##$CPDPRGT= <>
##$D= (0..31)
0 1.2 0 0 0 0 0 0 0 0.06 0 0.03 0 0 0 0 0.0002 0 0 0 0 0 0 0 0 0 0 0 0 
0 0 0 
##$DATE= 1679392973
##$DBL= (0..7)
120 120 120 120 120 120 120 120 
##$DBP= (0..7)
150 150 150 150 150 150 150 150 
##$DBP07= 0
##$DBPNAM0= <>
##$DBPNAM1= <>
##$DBPNAM2= <>
##$DBPNAM3= <>
##$DBPNAM4= <>
##$DBPNAM5= <>
##$DBPNAM6= <>
##$DBPNAM7= <>
##$DBPOAL= (0..7)
0.5 0.5 0.5 0.5 0.5 0.5 0.5 0.5 
##$DBPOFFS= (0..7)
0 0 0 0 0 0 0 0 
##$DE= 6
##$DECBNUC= <off>
##$DECIM= 32
##$DECNUC= <off>
##$DECSTAT= 4
##$DIGMOD= 1
##$DIGTYP= 9
##$DL= (0..7)
0 120 120 120 120 120 120 120 
##$DP= (0..7)
150 150 150 150 150 150 150 150 
##$DP07= 0
##$DPNAME0= <>
##$DPNAME1= <>
##$DPNAME2= <>
##$DPNAME3= <>
##$DPNAME4= <>
##$DPNAME5= <>
##$DPNAME6= <>
##$DPNAME7= <>
##$DPOAL= (0..7)
0.5 0.5 0.5 0.5 0.5 0.5 0.5 0.5 
##$DPOFFS= (0..7)
0 0 0 0 0 0 0 0 
##$DQDMODE= 0
##$DR= 18
##$DS= 0
##$DSLIST= <SSSSSSSSSSSSSSS>
$$ [...]
##$SUBNAM2= <"">
##$SUBNAM3= <"">
##$SUBNAM4= <"">
##$SUBNAM5= <"">
##$SUBNAM6= <"">
##$SUBNAM7= <"">
##$SUBNAM8= <"">
##$SUBNAM9= <"">
##$SW= 18.05172834244
##$SWIBOX= (0..15)
0 0 2 0 0 0 0 0 0 0 0 0 0 0 0 0 
##$SW_h= 3612.71676300578
##$TD= 16384
##$TD0= 1
##$TE= 0
##$TE2= 300
##$TE3= 300
##$TEG= 300
##$TL= (0..7)
0 120 120 120 120 120 120 120 
##$TP= (0..7)
150 150 150 150 150 150 150 150 
##$TP07= 0
##$TPNAME0= <>
##$TPNAME1= <>
##$TPNAME2= <>
##$TPNAME3= <>
##$TPNAME4= <>
##$TPNAME5= <>
##$TPNAME6= <>
##$TPNAME7= <>
##$TPOAL= (0..7)
0.5 0.5 0.5 0.5 0.5 0.5 0.5 0.5 
##$TPOFFS= (0..7)
0 0 0 0 0 0 0 0 
##$TUNHIN= 0
##$TUNHOUT= 0
##$TUNXOUT= 0
##$USERA1= <user>
##$USERA2= <user>
##$USERA3= <user>
##$USERA4= <user>
##$USERA5= <user>
##$V9= 5
##$VALIST= <valist>
##$VCLIST= <CCCCCCCCCCCCCCC>
##$VD= 0
##$VDLIST= <DDDDDDDDDDDDDDD>
##$VPLIST= <PPPPPPPPPPPPPPP>
##$VTLIST= <TTTTTTTTTTTTTTT>
##$WBST= 1024
##$WBSW= 4
##$XGAIN= (0..3)
0 0 0 0 
##$XL= 0
##$YL= 0
##$YMAX_a= 588657
##$YMIN_a= -638414
##$ZGOPTNS= <>
##$ZL1= 120
##$ZL2= 120
##$ZL3= 120
##$ZL4= 120
##$ABSF1= 10
##$ABSF2= 0
##$ABSG= 5
##$ABSL= 3
##$ALPHA= 0
##$AQORDER= 0
##$ASSFAC= 0
##$ASSFACI= 0
##$ASSFACX= 0
##$ASSWID= 0
##$AUNMP= <proc_1d>
##$AZFE= 0.1
##$AZFW= 0.1
##$BCFW= 1
##$BC_mod= 2
##$BYTORDP= 1
##$COROFFS= 0
##$CY= 11.3945322036743
##$DATMOD= 1
##$DC= 2
##$DFILT= <>
##$DTYPP= 0
##$F1P= 2.36226072786647
##$F2P= -0.459571619588291
##$FCOR= 0.5
##$FTSIZE= 0
##$FT_mod= 4
##$GAMMA= 1
##$GB= 0.15
##$INTBC= 1
##$INTSCL= 1
##$ISEN= 128
##$LB= 0.24
##$LEV0= 0
##$LPBIN= 0
##$MAXI= 10000
##$MC2= 0
##$MEAN= 0
##$ME_mod= 0
##$MI= 1.114404
##$NCOEF= 0
##$NC_proc= 0
##$NLEV= 6
##$NOISF1= 3.799351
##$NOISF2= 2.8
##$NSP= 1
##$NTH_PI= 0
##$NZP= 0
##$OFFSET= 15.70392
##$PC= 1
##$PHC0= -19104.77
##$PHC1= 15.40075
##$PH_mod= 1
##$PKNL= yes
##$PPARMOD= 0
##$PSCAL= 0
##$PSIGN= 0
##$REVERSE= no
##$SF= 200.130013532006
##$SI= 16384
##$SIGF1= 3
##$SIGF2= 2
##$SINO= 400
##$SIOLD= 16384
##$SREGLST= <1H.CDCl3>
##$SSB= 0
##$STSI= 0
##$STSR= 0
##$SW_p= 3612.71676300578
##$SYMM= 0
##$S_DEV= 0
##$TDeff= 0
##$TDoff= 0
##$TI= <>
##$TILT= no
##$TM1= 0
##$TM2= 0
##$TOPLEV= 0
##$USERP1= <user>
##$USERP2= <user>
##$USERP3= <user>
##$USERP4= <user>
##$USERP5= <user>
##$WDW= 1
##$XDIM= 8192
##$YMAX_p= 0
##$YMIN_p= 0
$$ End of Bruker specific parameters
$$ ---------------------------------
##NTUPLES= NMR FID
##VAR_NAME=  TIME,          FID/REAL,        FID/IMAG
##SYMBOL=    X,             R,               I
##VAR_TYPE=  INDEPENDENT,   DEPENDENT,       DEPENDENT
##VAR_FORM=  AFFN,          ASDF,            ASDF
##VAR_DIM=   8192,          8192,            8192
##UNITS=     SECONDS,       ARBITRARY UNITS, ARBITRARY UNITS
##FACTOR=    0.0002768,     1,               1
##FIRST=     0,             0,               0
##LAST=      2.2672688,     0,               0
##MIN=       0,             -638414,         0
##MAX=       2.2672688,     588657,          0
$$ Real data points
##PAGE= N=1
##DATA TABLE= (X++(R..R)), XYDATA
0@%%%%%%%QrRj6K4l2L2m0N6p2Q0r1J15j44J72j99K35k80L29l79M37n08N87o70
$$ 0 0 0 0 0 0 0 0 8 -1 8 -8 16 -16 16 -24 32 -40 40 -51 64 -80 92 -107 128 -152 177 -202 235 -273 314 -356
31c56P63q70R88j116J256j412J585j774J978k202K450k720L012l333L686m072
$$ -356 407 -463 525 -591 665 -747 838 -936 1042 -1160 1290 -1430 1582 -1751 1935 -2137
47b137M490m944N445n999O611p284Q031q872R820j0890J2112j3531J5200j7190
$$ -2137 2353 -2591 2854 -3145 3466 -3818 4213 -4659 5161 -5729 6383 -7148 8052 -9138
61i138J9607k2625K6521l1760L9212n0720P0954j16526L92654j06168q50425P22717
$$ -9138 10469 -12156 14365 -17395 21817 -28903 42051 -74475 318179 212011 -638414 84303
73H4303N03406p61869l61461Q92524O7336q65963J12861Q31200l66002o95897
$$ 84303 587709 -174160 -535621 356903 424239 -441724 -328863 502337 136335 -559562
83e59562N35703N70414p04341l76274P81297J85894q25821O0052Q15279k55476
$$ -559562 -23859 546555 -157786 -534060 247237 433131 -392690 -332638 482641 227165
93B27165p44219M62332O07651o17588m31978P43336K13392q10578n554Q00449
$$ 227165 -517054 -54722 552929 -64659 -496637 246699 460091 -350487 -356041 444408
103D44408k26429p37781M22632O20607n86796m60822O90934K68898p45257n8952
$$ 444408 217979 -519802 -97170 523437 -63359 -524181 166753 435651 -309606 -368558
113c68558P51670j33540o95380L19866O02556m69080m63110N97419L10083o73978
$$ -368558 383112 249572 -445808 -125942 476614 7534 -455576 141843 451926 -222052
123b22052j38584O98928n3547o88327K30647O22540l98584n18657N28137L65023
$$ -222052 -360636 338292 284745 -403582 -172935 449605 51021 -467636 60501 425524
133D25524o27456j86747O82978K328o78990J83179O22876l50088n16028M95661
$$ 425524 -201932 -388679 294299 296627 -382363 -199184 423692 73604 -442424 53237
143E3237L86011n88524k24681O35386N0307o37767J21779N96122k81734n21545
$$ 53237 439248 -149276 -373957 261429 311736 -326031 -204252 391870 110136 -411409
153d11409M06281M00609n11211k61374N79034J08386o06898M9093N90724k01877
$$ -411409 -5128 395481 -115730 -377104 201930 310316 -296582 -247489 343235 141358
163A41358n28773L48638M38098m63418l11808N46533J63803n84312k20N82105
$$ 141358 -387415 -38777 399321 -64097 -375905 170628 334431 -249881 -250101 332004
173C32004j60603n38149L01703M49280m22258l32379N04769J90119n53172m2456
$$ 332004 171401 -366748 -65045 384235 -38023 -370402 134367 324486 -228686 -271142
183b71142N57251j04615n21275K42949M52984l58058l52258M50046K33783n06635
$$ -271142 286109 181494 -339781 -96832 356152 -1906 -354164 95882 329665 -176970
193a76970r8052N30316m1130n16572J77696M66839l03152l86886M04058K75703
$$ -176970 -275022 255294 214164 -302408 -124712 342127 38975 -347911 56147 331850
203C31850m77258j47352N13309O139n14262J32666M76486k58048m01988L64737
$$ 331850 -145408 -292760 220549 226688 -287574 -154908 321578 63530 -338458 26279
213B6279L00206m41782j77566M87640M8079m95248Q3895M66592k08509m08261
$$ 26279 326485 -115297 -292863 194777 242856 -252392 -168497 298095 89586 -318675
223c18675L15534L22457l99177k16989M51483R5104m74260L2560M64446j55198
$$ -318675 -3141 319316 -79861 -296850 154633 249737 -224523 -191963 272483 117285
233A17285m22043K66186L49818l57064k50422M25238J36211m60976j2990M62207
$$ 117285 -304758 -38572 311246 -45818 -296240 128998 265209 -195767 -208757 253450
243B53450j10356m29485K24939L65118l23728k78368L94790J70699m36720n3304
$$ 253450 143094 -286391 -61452 303666 -20062 -298430 96360 267059 -169661 -222965
253b22965M46890o7597m26306J81277L77742k78719k99762L57023K03400m08635
$$ -222965 223925 156328 -269978 -88701 289041 10322 -289440 67583 270983 -137652
263a37652r2433M33111k1560m25365J33868L85952k37113l21201L22129K33148
$$ -137652 -230085 203026 181466 -243899 -110031 275921 38808 -282393 39736 272884
273B72884l84949j31592M16594J8273m19359R5012L92156k00402l37196K89790
$$ 272884 -112065 -243657 172937 191210 -228149 -133137 259019 58617 -278579 11211
283A1211K58815l55434j59812L97725N2338m09373N7723L92674j61190l46298
$$ 11211 270026 -85408 -245220 152505 204843 -204530 -146807 245867 84677 -261621
293b61621K52752K75051l26739j87261L75120Q5945l96404J9003L87717j24257
$$ -261621 -8869 266182 -60557 -247818 127302 213247 -183157 -164154 223563 99306
303I9306l52780K18916K93656k95741k13221L50805J18181l79457j4282L83202
$$ 99306 -253474 -34558 259098 -36643 -249864 100941 219122 -160335 -174617 208585
313B08585q7758l58343J82480L07536k63517k34515L25124J45760l63922m9624
$$ 208585 120827 -237516 -55036 252500 -11017 -245532 79592 225352 -138570 -188194
323a88194L74408n0167l58655J45948L16920k30712k54419K97779J75015l41247
$$ -188194 186214 136047 -222608 -76660 240260 9548 -244871 52908 227923 -113324
333a13324q2458L61601j5112l55735J10577L25635j95583k71948K66515J97787
$$ -113324 -195782 165819 150707 -205028 -94451 231184 35601 -236347 30168 227955
343B27955l18647j11843L47540J8662l51674P3799L28947j61738k83594K37562
$$ 227955 -90692 -202535 145005 163667 -188007 -114208 214739 53001 -230593 6969
353F969K19192k95231j39823L30965N1478l41495M2098L29161j30071k93276K07728
$$ 6969 226161 -69070 -208893 122072 173550 -167945 -125847 203314 73243 -220033 -12305
364a2305K36495k68802j62869L10839P7382l31431J0612L26860r7618k99059J76673
$$ -12305 224190 -44612 -207481 103358 180740 -150691 -140079 186781 89163 -209896 -33223
375c3223K48895k43754j82781K92221J04633l18417j8726L21744o8073l01176
$$ -33223 215672 -28082 -210863 81358 185991 -132426 -151152 170592 102519 -198657
385a98657J50436K60778k19179k00627K71442J26239l03859m2990L14248m1791
$$ -198657 -48221 212557 -6622 -207249 64193 190432 -113427 -156417 157831 116040
395A16040l02282J21059K67597j92244k14227K48588J46185k87287o9999L04205
$$ 116040 -186242 -65183 202414 10170 -204057 44531 190716 -96571 -166570 137635
405A37635j0702k98843R0624K73462j63637k29196K24570J69692k67972r7168
$$ 137635 126933 -171910 -81286 192176 28539 -200657 23913 193605 -74367 -171535
415a71535K92834J7982k97259O2493K79889j36750k42497K00533J86602k50311
$$ -171535 121299 139281 -157978 -95485 184404 47654 -194843 5690 192292 -58019
425e8019j18067K81255M2148k91451L5293K79422j09419k47720J75564K00024
$$ -58019 -176086 105169 147317 -144134 -108841 170581 61162 -186558 -10994 189030
435A89030k28431j38649K63598O8710k79559O701K76838q1303k55409J48417K15564
$$ 189030 -39401 -178050 85548 154258 -125301 -118600 158238 76935 -178474 -30057 185507
446A85507k04597j59866K46694R2491k72462j9484K77629n4172k61580J24401
$$ 185507 -19090 -178956 67738 160229 -112233 -131717 145912 91740 -169840 -45439
456d5439K26501j85845j75431K33559J12551k61651m1801K70377l1888k59847
$$ -45439 181062 -4783 -180214 53345 165896 -95755 -137556 132821 100933 -158914
466a58914J02141K31550j62959j87399K10343J29583k43734o4054K60134n039
$$ -158914 -56773 174777 11818 -175581 34762 164345 -79389 -143443 116691 111652
476A11652k58353P2240K38028j34931k00894J88851J50965k29734q9191K53369
$$ 111652 -146701 -74461 163567 28636 -172258 16593 167558 -62176 -151367 102002
486A02002K2080k58387M8545K44985j15291k13292J72863J66260k16941j06887
$$ 102002 124082 -134305 -85760 159225 43934 -169358 3505 169765 -47176 -154063
496a54063K43820L9425k53512K9114K43641r4146k16939J50636J74465j95979
$$ -154063 89757 129182 -124330 -95216 148425 54279 -162660 -12024 162441 -33538
506c3538j20921K27353O0731k42283K929K40493o5526k21587J25013J88463j75024
$$ -33538 -154459 72894 133625 -108658 -105729 134764 69238 -152349 -27336 161127 -13897
517a3897j42619K12931Q6208k35378k2361K41098m4190k29997J05898K01410j59719
$$ -13897 -156516 56415 142623 -92755 -115116 125982 81792 -148205 -42307 159103 -616
528f16j57194K01107J00893k28286l8820K37722k4299k28485Q5092K02958j38948
$$ -616 -157810 43297 144190 -84096 -122916 114806 90507 -137978 -52886 150072 11124
539A1124j64360J82620J16075k11243o0155K24895K65k24232N9393K08808j13896
$$ 11124 -153236 29384 145459 -65784 -125939 98956 99221 -125011 -65618 143190 29294
550B9294j79468J60341J36105j96125q3452K19515K4489k26771L5945K16658r4269
$$ 29294 -150174 10167 146272 -49853 -133305 86210 110699 -116072 -80127 136531 42262
561D2262j89792J46539J49579j87207r8628K12585M0765k21481J9616K14079p7553
$$ 42262 -147530 -991 148588 -38619 -137247 75338 116103 -105378 -85762 128317 50764
572E0764j91995J27713J56584j68005j10656J95597N7996k10068k631K10668n2220
$$ 50764 -141231 -13518 143066 -24939 -135595 60002 117998 -92070 -94701 115967 63747
583F3747j96158J03590J68623j47951j28872J82927Q0407k04583k5965K11402
$$ 63747 -132411 -28821 139802 -8149 -137021 45906 126313 -78270 -104235 107167
593A07167l1066k02682Q6116J78853j35241j42451J72617R5413j97320m1340K06849
$$ 107167 76101 -126581 -40465 138388 3147 -139304 33313 128726 -68594 -109934 96915
604I6915j5267k01381O9091J81840j16226j48782J54137J06751j81445n7734J96484
$$ 96915 81648 -119733 -50642 131198 14972 -133810 20327 127078 -54367 -112101 84383
615H4383O743j97284M4842J84302r3624j59255J36112J23532j69020p9564J89340
$$ 84383 91126 -106158 -61316 122986 29362 -129893 6219 129751 -39269 -118833 70507
626G0507K8207j96824K5332J90375p7177j69637J22308J35866j58393r1216J82839
$$ 70507 98714 -98110 -72778 117597 40420 -129217 -6909 128957 -29436 -120652 62187
637F2187M1196j93127J0621J88801o0527j70132J05900J40561j43250j02068J68945
$$ 62187 103383 -89744 -79123 109678 49151 -120981 -15081 125480 -17770 -119838 49107
648D9107N7451j82517q871J83487m0244j72773Q5632J50280j24902j16812J55602
$$ 49107 106558 -75959 -84830 98657 58413 -114360 -28728 121552 -3350 -120162 35440
659C5440P4760j75679k7445J83493k1342j77664O8743J58536j12041j27094J46253
$$ 35440 110200 -65479 -92924 90569 69227 -108437 -39694 118842 6801 -120293 25960
670B5960Q7118j69336m1402J78927o855j75563N4464J59743r6739j33550J31418
$$ 25960 113078 -56258 -97660 81267 74412 -101151 -46687 113056 16317 -117233 14185
681A4185R8287j55873n5885J69619J0504j72066L4935J62502p7183j41430J14182
$$ 14185 112472 -43401 -99286 70333 80837 -91229 -56294 106208 29025 -112405 1777
692A777J10038j43594p1742J62945K8352j70280J6734J64860o1816j47647J02101
$$ 1777 111815 -31779 -103521 59424 87776 -82504 -65770 99090 37274 -110373 -8272
703h272J19992j33789q3861J55233M1659j64990L717J63652m7588j50233Q7378
$$ -8272 111720 -22069 -105930 49303 90962 -74028 -70311 93341 45753 -104480 -17102
714a7102J25565j19546r2717J43909N3660j57982j2248J60356l0108j51111P0230
$$ -17102 108463 -11083 -103800 40109 93769 -64213 -76461 83895 53787 -97324 -27094
725b7094J31400j05663j03461J32868O8142j50258k7610J56995j5030j52552N6288
$$ -27094 104306 -1357 -104818 28050 96192 -54066 -81676 75319 60289 -92263 -35975
736c5975J37866r2662j12393J21908P8826j42611l9764J52993r43j52068M1063
$$ -35975 101891 9229 -103164 18744 97570 -45041 -84805 68188 67245 -84823 -43760
747d3760J39851p8330j17763J09515Q8154j32768n3005J46035J3762j48377K5768
$$ -43760 96091 17761 -100002 9513 97667 -35101 -88106 57929 71691 -76686 -50918
758e0918J41230o3722j24260R6385R8341j21634o5271J38569K7696j46099J1477
$$ -50918 90312 26590 -97670 -1285 97056 -24578 -89849 48720 76416 -69683 -58206
769e8206J42805m9060j28689Q3235J05399j11661p5013J31864L9855j41672k094
$$ -58206 84599 35539 -93150 -9915 95484 -16177 -91190 40674 80529 -61143 -63237
780f3237J41053l5958j30589P1032J11741j00964q4208J22276N0942j35318j4260
$$ -63237 77816 41858 -88731 -17699 94042 -6922 -91130 31146 82088 -53230 -67490
791f7490J38808k3028j32500N7981J16292q8537r1724J12675O1406j29314k6950
$$ -67490 71318 48290 -84210 -26229 90063 1526 -90198 22477 83883 -45431 -72381
802g2381J36292r122j32721M4667J19953p6763r9225J03326P1790j21719l8976
$$ -72381 63911 54789 -77932 -33265 86688 9925 -89300 14026 85816 -35903 -74879
813g4879J31238L242j31592L2110J22809o4495j05464R2026P9947j12971m9410
$$ -74879 56359 59601 -71991 -39881 82928 18433 -87031 4995 84942 -28029 -77439
824g7439J26181J5474j30068J8863J23846n1480j09452Q1181Q7450j04372n9591
$$ -77439 48742 64216 -65852 -46989 76857 25377 -84075 -2894 84556 -19816 -79407
835g9407J19785K7707j26337O630J24074l9905j13146O9745R4505r4590o8414
$$ -79407 40378 68085 -58252 -51622 72452 32547 -80599 -10854 83651 -10939 -79353
846g9353J11992L8125j22369n139J23335k7466j15607N8123R8702q4330p5722
$$ -79353 32639 70764 -51605 -56744 66591 39125 -76482 -18359 80343 -3987 -79709
857g9709J04487M8169j16955j6895J20363j5503j15555M6678J03127p4075q3153
$$ -79709 24778 72947 -44008 -60903 59460 43957 -71598 -24920 78207 4132 -79021
868g9021R5727N7229j10414k7019J17521m594j16191L5234J06395o3456q8484
$$ -79021 16706 73935 -36479 -63498 54023 49429 -66762 -31528 74867 11411 -77073
879g7073Q7112O4417j04280l6852J13930O551j14762K4254J07188n2841r3061
$$ -77073 10039 74456 -29824 -66676 47254 53805 -60957 -36703 70485 17644 -75417
890g5417P7687P2242r6359m6326J08031J6931j12037J3092J08340m1467r7115
$$ -75417 2270 74512 -21847 -68173 39858 56789 -55248 -42156 66184 24717 -72398
901g2398O6966P8398q7535n4400J02139K7427j09508J701J08393l0691r9302N7750
$$ -72398 -5432 72966 -14569 -68969 33170 60597 -48911 -47210 61183 30492 -68810 -11060
913a1060Q3696q0250o2233R6272L6263j05414p574J06646k1352j00884M7915Q7887
$$ -11060 72636 -7614 -69847 26425 62688 -42726 -50300 56346 34994 -65890 -17975 69912
925F9912p0958o8210Q8425M4088j00011j7238J04524j0244j00976L6822R0658
$$ 69912 -1046 -69256 19169 63257 -36754 -53992 50532 40288 -60688 -23866 66792
936F6792o0856p3950Q0691N2525r4083k7846J01085N81j01012K6786R3707n1837
$$ 66792 5936 -68014 12677 65202 -28881 -56727 44358 44939 -56073 -29287 64420 12583
948A2583q0081P2545O0358q8473l5944R7726R512j00338J7260R5153m2438q2859
$$ 12583 -67498 5047 65405 -23068 -59012 38714 48226 -52112 -34852 60301 17863 -64996
960f4996O4493O5034q1314m3388R2831J8664r7053P368R4325l2402q5702N5312
$$ -64996 -503 64531 -16783 -60171 32660 51324 -45729 -38361 55964 23562 -62140 -6828
972f828P0973p3754n1335Q6912K7834r4344k503R5069k2778q9088M6445P5990
$$ -6828 64145 -9609 -60944 25968 53802 -40542 -43045 52024 29246 -59842 -13397 62593
984F2593o6665n7405Q2048L5635r1784j1006R4028j4233q9296L8149P8524n8950
$$ 62593 -4072 -61477 20571 56206 -35578 -46584 47444 33211 -56085 -17936 60588 1638
996A638o2669P5319M2240q5535j9379R0307n076q8725K8531Q1264m9446o7731
$$ 1638 -61031 14288 56528 -29007 -48386 41921 36845 -51880 -23349 57915 8469 -59262
1008e9262O7079M9471q0489k7996Q8355M687q9516J9013Q3821m1858p2279O1626
$$ -59262 7817 57288 -23201 -51197 37158 41845 -47671 -28658 55163 13305 -58974 2652
1020B652N5630p6615l5010Q5495J1526q8159J2680Q4334l5144p4575N4625N9661
$$ 2652 58282 -18333 -53343 32152 43678 -44481 -31801 52533 17389 -57186 -2561 57100
1032E7100o9981m0016Q0148J8780q4808L661Q3398k5438p6205M5592O3591o2622
$$ 57100 -12881 -52897 27251 46031 -38777 -35116 48282 22844 -53361 -7769 55822 -6800
1044f800m7344P5208K7531q2338n519Q3247j7062p9108L8576O8948n6777n3361
$$ -6800 -54144 21064 48595 -33743 -39262 43985 26923 -52185 -13609 55339 -1438 -54799
1056e4799P0572L3940p9625j1689Q2757j0337p9667L1386P0709m9946n6599O5089
$$ -54799 15773 49713 -29912 -41601 41156 30819 -48848 -17462 53247 3301 -53298 11791
1068A1791L8719p5198j8649P9385k238p8136K2826P1581m1749o0795N7564M5445
$$ 11791 50510 -24688 -43337 36048 33810 -44326 -21500 50081 8332 -52463 5101 50546
1080E0546o9328k6779P6390O198p8341J4965P4333l4297o5120N1864N0514o5412
$$ 50546 -18782 -45561 30829 37027 -41314 -26349 47984 13687 -51433 431 50945 -14467
1092a4467l2522P4563J2441p7673Q305P4643k8387o6484M6122N3873o0144l7741
$$ -14467 -46989 27574 40015 -37658 -29353 45290 16903 -49581 -3459 50414 -9730 -47471
1104d7471O9532J9110p3955R99P3291k0313o7850L7789N7686n2759m3458O4442
$$ -47471 22061 41171 -32784 -31785 41506 21193 -46657 -8868 48818 -3941 -47399 17043
1116A7043K5901p1462p156P3387j2376o9635L0946O0900m7579m8250O0694L2065
$$ 17043 42944 -28518 -35674 37713 25337 -44298 -13352 47548 -31 -48281 12413 44478
1128D4478o8983j2974P2045o672o9835K5546O2665m1805n1116N5098L5876o4472
$$ 44478 -24505 -37479 34566 27894 -41941 -16395 46270 4465 -46651 8447 44323 -20149
1140b0149j8115O8858j79o8527J7635O3597l4550n4001M8717M1055n9745k5368
$$ -20149 -38264 30594 30415 -38112 -20477 43120 8570 -45431 3286 44341 -15404 -40772
1152d0772O6194P862o8155J0896O4939k8318n7432M3927M5698n5584l0416O3659
$$ -40772 25422 33284 -34871 -23975 40964 12646 -44786 -859 44839 -10745 -41161 22498
1164B2498J2913o6967N227O5288k2502n9035L8033M7841n0579l4231N9830J8108
$$ 22498 35411 -31556 -26329 38959 16457 -42578 -4545 43296 -7283 -41514 18316 36424
1176C6424o4291j182O4045j5952n9236L1725N0772m5158l9057N5423K4084o1254
$$ 36424 -27867 -29049 34996 19044 -40192 -8467 42305 -2853 -41910 13513 37597 -23657
1188b3657p477O3477r831o0831K5921N3779m0014m2755N1402K8744n9217j2789
$$ -23657 -31134 32343 22512 -38319 -12398 41381 1367 -41388 10014 38758 -20459 -33248
1200c3248O2401m012o0654K0347N4757l5178m5157M7164L2521n5448j7567N9457
$$ -33248 29153 25141 -35513 -15166 39591 4413 -40744 6420 38941 -16507 -34074 25383
1212B5383J430n9701J4628N5945k9227m8160M1729L6440n1204k2486N7058P528
$$ 25383 26813 -32888 -18260 37685 8458 -39702 2027 38467 -12737 -35223 21835 29363
1224B9363n9160Q192N6809k3362m9899L6831M0308m7906k7295N4851J2561n7727
$$ 29363 -29797 -21605 35204 11842 -38057 -1226 39082 -8824 -36119 18732 31293 -26434
1236b6434L176N6440j8647n1564L2344M2660m3270l0922N1025J7017n5734j802
$$ -26434 -23258 33182 14535 -37029 -4685 37975 -5295 -36217 14808 31825 -23909 -25711
1248b5711N5931j2796n2328K6415M4967l8102l4709M7504K2207n3086q123N5097
$$ -25711 30220 17424 -34904 -8489 36478 -1624 -36333 11171 33378 -19708 -27831 27266
1260B7266o975n2815K1247M7113l3802l8237M4061K6052n0460j2505N3557k060
$$ 27266 20291 -32524 -11277 35836 2034 -36203 7858 33910 -16550 -29055 24502 22442
1272B2442n3085J6220M8475k9003m0363L9689K9496m7644j6552N1840K877n2214
$$ 22442 -30643 -14423 34052 5049 -35314 4375 33871 -13773 -30325 21515 24392 -27822
1284b7822J1120M8928k4221m2064L5260L2869m4035k1037M9145P885n1209O052
$$ -27822 -16702 32226 8005 -34059 1201 34070 -9965 -31002 18143 26028 -25181 -19129
1296a9129M9495j9147m4391L0827L5795m0151k4669M6619J2229m9883Q94M9432
$$ -19129 30366 11219 -33172 -2345 33450 -6701 -31370 15249 27478 -22405 -21511 27921
1308B7921j4257m5196K6449L7963l6609k8388M3918J6484m7718l608M8505r340
$$ 27921 13664 -31532 -5083 32880 -3729 -32117 11801 28285 -19433 -23041 25464 16124
1320A6124m5978K1471M0138l1757l1497M0164K0539m5566q260M7691m200m6431
$$ 16124 -29854 -8383 31755 -2 -31499 8665 29204 -16362 -24622 23069 18869 -27562
1332b7562J6476M1646k7507l4123L6568K4302m3094j3062M6200O37m6066J1997
$$ -27562 -11086 30560 3053 -31070 5498 29800 -13294 -26356 19844 20481 -25585 -13588
1344a3588M2668k3310l6326L2522K7515l9693j6666M4196M787m5363P290M3368
$$ -13588 29080 5770 -30556 1966 29481 -10212 -26878 17318 22105 -23258 -15968 27400
1356B7400j8823l7743K8792K9904l6851k0102M2104R102m4435K854M3255j4539
$$ 27400 8577 -29166 -374 29530 -7321 -27423 14681 23783 -20652 -17798 25457 10918
1368A0918l9454K5186L2507l3408k3568L9433J2722m2777j297M3314j0408m0262
$$ 10918 -28536 -3350 29157 -4251 -27819 11614 24336 -18441 -19738 23576 13168 -27094
1380b7094K1037L4208k9911k5993L7055J5944m1179n060M2122n972m0205J6925
$$ -27094 -6057 28151 -1760 -27753 9302 25246 -15933 -20993 21129 15157 -25048 -8123
1392h123L5704k6686k8467L3888J9402l8792q952M0923j968m0522J2997L6717
$$ -8123 27581 895 -27572 6316 25718 -13074 -22026 18897 16929 -23593 -10596 26121
1404B6121k2354l0671L0314K2349l6614j2112L9735J759m0376R180L7386j9030
$$ 26121 3767 -26904 3410 25759 -10855 -22967 16768 18527 -21849 -12669 24717 5687
1416E687l2052K7659K4588l4048j5416L7904N209l8930N092L7656j5079l3540
$$ 5687 -26365 1294 25882 -8166 -23582 14322 19531 -19399 -14307 23349 8270 -25270
1428b5270K3856K7058l0937j8657L5778Q928l8242J349L7641j1244l4419K0290
$$ -25270 -1414 25644 -5293 -23950 11828 20756 -17486 -16137 21504 10260 -24159 -3869
1440c869K8932k8187k1286L3706J2300l6784k413L7321p820l4978J7656K9985
$$ -3869 25063 -3124 -24410 9296 21596 -15188 -17601 19720 11900 -23078 -5422 24563
1452B4563k5353k3345L1510J4564l5029n170L6185m270l5014J3418L1386k1891
$$ 24563 -790 -24135 7375 21939 -13090 -18260 17925 13655 -21359 -7941 23445 1554
1464A554k4998K8519J7180l3058q774L5435n88l5070J0054L1973j8815k7041K6039
$$ 1554 -23444 5075 22255 -10803 -19577 15858 15270 -19800 -9746 22227 3412 -23629 2410
1477B410K0170l1209j1442L4106J973l4455P342L2570j5908k8163K3419K1396
$$ 2410 22580 -8629 -20071 14035 16008 -18447 -11105 21465 5557 -22606 813 22209
1489B2209k8851j3618L2457N028l3596L696L2486j2630k8727K0099K3335k6312
$$ 22209 -6642 -20260 12197 17225 -16371 -12675 19811 7181 -21546 -1447 21888 -4424
1501d424j6389L0465Q139l2359N38L2451r304l0025J7099K5565k3934j8708K8757
$$ -4424 -20813 9652 17791 -14568 -14030 18421 9117 -20908 -3809 21756 -2178 -20886 7871
1514G871J0667l1501k348L2301o286l0306J4390K6035k1310k0227K6599J3282
$$ 7871 18538 -12963 -15311 16990 10704 -19602 -5212 20823 -487 -20714 5885 19167
1526A9167l0063n118L1039l268k9949J1208K6825j8316k1726K3758J5448k8006
$$ 19167 -10896 -16014 15025 11757 -18192 -6984 19841 1525 -20201 3557 19005 -9001
1538i001p762L0165k14k9991P999K7857j5502k3525K1930J7502k6473j0446K9066
$$ -9001 -16763 13402 13188 -16803 -8804 19053 3551 -19974 1956 19458 -7015 -17461 11605
1551A1605K779k9699N585K7862j2927k4552J9701J8969k4657j2158K7517M749
$$ 11605 14384 -15315 -9730 18132 5205 -19347 354 19323 -5334 -17492 10025 14774
1563A4774k8665K880K7737j0154k5047J6757K0314k1864j4529K5982P258k7479
$$ 14774 -13891 -11011 16726 6572 -18475 -1718 18596 -3268 -17797 8185 15443 -12036
1575a2036m83K7820p044k5852J4348K1968k0214j6569K4439R916k6851k546K7477
$$ -12036 -12519 15301 8257 -17595 -3247 18721 -1493 -18062 6377 16293 -10558 -13104 14373
1588A4373n040k6046J1801K2928j8028j7685K2537J1314k5546m372K6598k552
$$ 14373 9333 -16713 -4912 18016 -12 -17697 4840 16154 -9392 -13764 12834 10282
1600A0282k5724R204K3092j5406j8839K0424J3340k3528p501K5624M78k5671O595
$$ 10282 -15442 -6238 16854 1448 -17391 3033 16373 -7155 -14656 10968 11446 -14225 -7630
1613g630K3810j2710k0502J8246J5364k2358r345K4991K522k5448M414K3914j0776
$$ -7630 16180 3470 -17032 1214 16578 -5780 -15125 9866 12388 -13060 -8646 15268 4492
1626D492k1102J6556J6576k0896j0835K3658M500k4802K195K3850q459k1594J4065
$$ 4492 -16610 -54 16522 -4374 -15209 8449 12949 -11853 -9658 14192 5733 -15861 -1796
1639a796J7742j8464j2632K1777O721k3619k83K3758o012k2159J1700J8986j6784
$$ -1796 15946 -2518 -15150 6627 13348 -10271 -10554 13204 7192 -14967 -3267 15719 -1065
1652a065j4222K0640Q482k2526k892K3356l620k2302R944J9512j5194j5166J8758
$$ -1065 -15287 5353 13835 -8691 -11583 11773 8153 -14149 -4205 15307 113 -15053 3705
1665C705J0328k1655m160K2499j951k1942P739J9854j2870j6186J6822J1719j9918
$$ 3705 14033 -7622 -11782 10717 8766 -13176 -5437 14417 1547 -14639 2183 13902 -6016
1678f016o183K1705L79k1599N307K0093j0896j6999J5288J3196j9124p746K0652
$$ -6016 -12199 9506 9885 -11714 -6407 13686 2790 -14209 1079 14275 -4849 -12595 8057
1691H057K208k1157L521K0330r095j7784J3788J3895j7632q814J9805L532k0573
$$ 8057 10265 -10892 -7371 12959 3864 -13920 -132 13763 -3869 -12683 7122 10654 -9919
1704i919J723K0137p247j7868J2027J4743j5901j0436J8432N552j9780p4J9559
$$ -9919 -8196 11941 4694 -13174 -1147 13596 -2305 -12741 5691 11243 -8537 -8611 10948
1717A0948n185j8472J0185J5742j4219j1878J7230P066j8955k019J9630l327j8522
$$ 10948 5763 -12709 -2524 13218 -1001 -12879 4351 11417 -7538 -9557 10073 6746 -11776
1730a1776Q215J6182j2658j2708J6366Q010j8095l307J8931j911j8343O961J6166
$$ -11776 -3561 12621 -37 -12745 3621 11631 -6464 -9771 9160 7249 -11094 -4133 12033
1743A2033j1043j3433J4630R529j7015m751J8252l19j8153N131J6597r420j4065
$$ 12033 990 -12443 2187 11716 -5299 -10050 8202 7883 -10270 -5139 11458 2038 -12027
1756a2027J3212J0537j6015o297J7617J661j8116L327J6874p890j4761J2009J1640
$$ -12027 1185 11722 -4293 -10590 7027 8688 -9428 -6101 10773 2883 -11878 131 11771
1769A1771j5084p297J6705K864j7383J690J7086o479j5019J0262J2177j3570q195
$$ 11771 -3313 -10610 6095 8959 -8424 -6734 10352 3873 -11146 -884 11293 -2277 -10472
1782a0472J5621M187j6882K48J6728m659j5359Q735J2917j2098r853J4753N819
$$ -10472 5149 9336 -7546 -7298 9430 4771 -10588 -1853 11064 -1034 -10887 3866 9685
1795I685j6342j302J6510k874j5813P367J3559j0757j0682J3784O549j5238k522
$$ 9685 -6657 -7959 8551 5677 -10136 -2769 10790 33 -10649 3135 9684 -5554 -8076
1808h076J5912j690j5524N876J3835r456j1334J2655P786j4521m167J5506j05
$$ -8076 7836 6146 -9378 -3502 10333 877 -10457 2198 9984 -4537 -8704 6802 6697
1821F697j5194M159J3949p959j1832J1234Q818j3551n080J4725J113j4983K785
$$ 6697 -8497 -4338 9611 1652 -10180 1054 9872 -3679 -8759 5966 7079 -7904 -5119
1834e119J4366o586j2482R996R504j2611o146J4195K590j4774J387J4340n444
$$ -5119 9247 2661 -9821 175 9679 -2932 -9078 5117 7707 -7067 -5680 8660 3216
1847C216j2531Q540J0362j1258p391J3336L506j4186K76J3982l958j2831P364
$$ 3216 -9315 -775 9587 -1671 -9062 4274 7780 -6406 -6130 7852 3894 -8937 -1573
1860a573J0743j0284p984J2571M421j3697q88J3893k631j2960O269J1221r137
$$ -1573 9170 -1114 -9098 3473 7894 -5803 -6691 7202 4571 -8389 -2120 9101 -36
1873c6q932J1494N780j3141k248J3692j591j2803M857J1621q129r216J0579O123
$$ -36 -8968 2526 8306 -4835 -7083 6609 5018 -7785 -2928 8693 564 -8652 1927 8050
1887H050j2142l101J3027l06j2800L688J1744o797r786R348P352j1358m415J2472
$$ 8050 -4092 -7193 5834 5528 -7272 -3584 8160 1363 -8423 925 8277 -3081 -7496 4976
1901D976R96j2666K602J2002n782j0334Q422P948j0389n344J2021J951j2620J760
$$ 4976 5972 -6694 -4092 7910 2128 -8206 216 8164 -2225 -7569 4452 6403 -6217 -4457
1915d457J1772m474j0695P328Q478r646n836J1148K934j1935M08J1427l240j0605
$$ -4457 7315 2841 -7854 -526 7952 -1694 -7530 3618 6552 -5383 -4975 6452 3212 -7393
1929g393O119R222q645o965J0384M101j1528o99J1412k148j0926N318R472p797
$$ -7393 -1274 7948 -697 -7662 2722 6823 -4705 -5404 6008 3860 -7066 -1748 7724 -73
1943g3p384R695M630j0732k047J1550j360j0869M158R626o824p809Q953N457j0266
$$ -73 -7457 2238 6868 -3864 -5911 5639 4279 -6590 -2432 7194 370 -7439 1514 6971 -3295
1958c295k805J0720L6j0715L076R776n575q383P824O207r516l634J0556P33j0603
$$ -3295 -6100 4620 4656 -6059 -2983 6793 1218 -7165 659 6866 -2650 -6284 4272 5005 -5598
1973e598K087R927m672q734P274O583q759m309R794J723j0425J231R872l901q683
$$ -5598 -3511 6416 1744 -6990 284 6867 -1892 -6201 3593 5316 -5109 -3878 5994 2093 -6590
1988f590O033P193p867m934R050K508r879J47R863k617r106N079P615p122n529
$$ -6590 -557 6636 -1231 -6165 2885 5393 -4486 -4339 5524 2907 -6199 -1120 6495 -627 -6156
2003f156Q519L214r577o98R582j727r125M437P964o584n995P935M168r278j594
$$ -6156 2363 5577 -4000 -4698 4884 3157 -5968 -1531 6433 -151 -6146 1789 5957 -3321 -4915
2018d915R609j140r118L451Q128n571o427P148M436q328k344R075k45q696K524
$$ -4915 4694 3554 -5564 -2113 6015 444 -5983 1165 5601 -2727 -5071 4004 3759 -4937 -2413
2033b413P998m640o706O559M864p863k948Q643O30q759J819Q342l955p421O018
$$ -2413 5585 945 -5761 798 5662 -2201 -5149 3494 4124 -4635 -2816 5526 1571 -5850 168
2048A68N717p712l474Q339J208q522J107Q102l120p210M965N958o812m014P789
$$ 168 5885 -1827 -5301 3038 4246 -4276 -3169 4933 1813 -5397 -432 5526 -1286 -5300 2489
2063B489J888q035K66Q088k478p308M331O191o070m443P145K582p865n65P958
$$ 2489 4377 -3658 -3392 4696 2218 -5090 -759 5432 -638 -5081 2064 4646 -3219 -3784 4174
2078D174j510p608L367O582n262m991O643L411p536j394P871r31p450K961O632
$$ 4174 2664 -4944 -1577 5005 -257 -5248 1395 4806 -2730 -4124 3747 2816 -4634 -1673 4959
2093D959m699n280O091L519o852j792P513k07p221K049O736l905n808N600L974
$$ 4959 260 -5020 1071 4590 -2262 -4054 3459 3252 -3969 -1920 4816 911 -4897 703 4677
2108D677o471k479P194N54p262J264O878l136o005M863M512n942k912O737J037
$$ 4677 -1794 -4273 2921 3475 -3787 -2523 4355 1219 -4786 77 4589 -1353 -4265 2472 3509
2123C509o949O97O795k618n980M273M754n423l261O342J729o735j38O835j787
$$ 3509 -3440 -2743 4052 1434 -4546 -273 4481 -942 -4203 2139 3868 -2867 -3005 3830 2043
2138B043o212L577N188m939l987N882K412o645m07O500j231o302K984N504m439
$$ 2043 -4169 -592 4596 -343 -4330 1552 3964 -2681 -3088 3412 2181 -4121 -1137 4367 -72
2153g2m249N450K668o021j042O350n41o315K462N184l705m292N009K957n696j378
$$ -72 -4321 1129 3797 -2224 -3266 3084 2543 -3772 -1310 3874 169 -4123 886 3843 -1853 -3231
2169c231O158k80o043J754N488l278m586M396L432n232j913N740K73n741J051
$$ -3231 2927 2647 -3396 -1642 3846 568 -4018 378 3810 -1422 -3335 2405 2678 -3063 -2012
2184b012N799k856m761L985L757n185k315N691R33o051R51N328k082m997L708
$$ -2012 3787 931 -3830 155 3912 -1273 -3588 2103 3036 -3015 -2064 3264 1182 -3815 -107
2199a07M009m772k503N129J110n508L61N449j819m720K896M016m051k995M835
$$ -107 3902 -870 -3373 1756 2866 -2642 -2281 3168 1349 -3371 -475 3541 -510 -3505 1330
2214A330J589n126k52N325j214m922K500M042l411l245M544J934m986n95N163
$$ 1330 2919 -2207 -2459 2866 1652 -3270 -770 3272 -139 -3384 1160 3094 -1892 -2487 2676
2229B676p89m955J998M390l161l428L967K417m646j131N048l96m870J696M351
$$ 2676 1887 -3068 -1070 3320 159 -3269 698 3115 -1531 -2662 2386 1990 -2880 -1184 3167
2244C167k954l531L837K562m414j346M600N8m582J299M259k429l557L208K702
$$ 3167 213 -3318 519 3081 -1333 -2679 1921 1979 -2603 -1304 2955 526 -3031 177 2879
2259B879m032j358M348N45m782Q78M168j792l860L025K970l900j792M389O95m608
$$ 2879 -1153 -2511 1837 2382 -2400 -1522 2646 854 -3006 19 2989 -911 -2703 1686 2381 -2227
2275b227N37M186j621l575K682K920l264k488M151Q76m065m0M354j176m111K329
$$ -2227 -1690 2496 875 -2700 -18 2902 -362 -2850 1301 2177 -1888 -1928 2426 1250 -2861 -532
2291e32L272l012k420L830J289m084l68M135o65l822J613L536k871k548L426J653
$$ -532 2740 -272 -2692 1138 2427 -1657 -2025 2110 1445 -2377 -764 2772 -99 -2647 779 2432
2307B432l555r42M007m60l621J199L526k304k941L061J860l558p49L793P1l927
$$ 2432 -1123 -2065 1942 1482 -2139 -940 2586 282 -2659 402 2262 -1296 -2045 1748 1819 -2108
2323b108J048L432j912k831K730K025l313j234L663J37l494P17L466j670l181
$$ -2108 -1060 2372 460 -2371 359 2384 -929 -2163 1500 1637 -1857 -1140 2326 656 -2525
2338b525K602K147k883j609L476N60l517L41L484j078l229K117K453k908j568
$$ -2525 77 2224 -659 -2268 1208 1768 -1749 -1408 2076 998 -2231 -114 2339 -569 -2137
2353b137L208P39l393J94L314r69l148J947K467k506j719K707J250l378P3L223
$$ -2137 1071 1810 -1583 -1389 1925 956 -2192 -245 2222 -284 -2003 704 1954 -1424 -1351 1872
2369A872r38k989J535K669k295j876K746J210l254k83L179m72l171J395K726k114
$$ 1872 934 -2055 -520 2149 -146 -2022 724 1934 -1320 -1603 1576 1104 -2067 -672 2054 -60
2385f0j971K622J291k801o20K980l81k828J046K566j800k009K430J459k734r11
$$ -60 -2031 591 1882 -919 -1539 1441 1060 -1768 -722 1844 44 -1965 465 1924 -810 -1721
2401a721L000J2k905Q24K526j341k287K058J660k561r47K915N8k781N95K646j319
$$ -1721 1279 1291 -1614 -790 1736 395 -1892 166 1826 -735 -1682 1233 1291 -1490 -895 1751 432
2418D32k338K073J626k270j165K531N77k934M54K831j274k298J647J937k270j120
$$ 432 -1906 167 1793 -477 -1642 889 1466 -1468 -1014 1817 543 -1755 -108 1829 -441 -1561
2434a561K430M62k603K99K480j086k130J510J990k174j196K478N02k560r0K770
$$ -1561 869 1331 -1272 -973 1507 421 -1709 -199 1791 -383 -1579 899 1401 -1159 -1249 1521
2450A521q49k373J489J958j891j441K206R36k492j61K502o71k140J139J927j427
$$ 1521 672 -1701 -212 1746 -145 -1586 620 1556 -936 -1097 1405 734 -1406 -267 1660 233
2466B33j749K065J000k473l63K510k95k340Q58K183j559j859K167R40k070m78
$$ 233 -1516 549 1549 -924 -1287 1223 928 -1412 -554 1629 70 -1789 378 1318 -752 -1230
2482a230K383k86k121O74K036j292j602J762J097k104m79K263j33k182O49J834
$$ -1230 1153 867 -1254 -580 1456 164 -1438 324 1421 -683 -1162 1101 968 -1214 -565 1269
2498A269j095j612J546J385j944r61K266J51k287M76K163j018j847J638J158j680
$$ 1269 174 -1438 108 1493 -451 -1412 854 1005 -1282 -806 1357 339 -1508 130 1288 -392
2514c92q05K113K01k132L23J997r03j838J576J222j875p05J822N10j971o6K146
$$ -392 -1197 916 1117 -1015 -692 1305 402 -1436 140 1362 -513 -1218 604 1114 -857 -923 1223
2531A223o98j737J150J329j451j048J806L14j826n0J966n33j770J178J372j079
$$ 1223 525 -1212 -62 1267 -184 -1232 574 888 -938 -988 978 445 -1325 -147 1225 146
2547A46j359J778N89j761m36K040l08j807Q28J664j421j059J450O10j450l85J859
$$ 146 -1213 565 1154 -607 -1043 997 689 -1118 -290 1374 -47 -1106 344 954 -496 -881 978
2564I78l87j796R08J510j225j088J449P97j830n08K036k45j690P28J571j269j210
$$ 978 591 -1205 -297 1213 -12 -1100 349 1146 -684 -1192 844 599 -1091 -363 1208 -61 -1271
2581a271J328R96j449o07J688J6j762N71J562r29j176J215P42j327m15J465O0
$$ -1271 57 1053 -396 -1003 685 701 -1061 -490 1072 143 -1033 182 924 -403 -818 647 707
2598G07j611N14J426p24j395J215J006j681m80J595L01j764L30J525p52j268J024
$$ 707 -904 -390 1036 312 -1083 132 1138 -543 -1023 572 873 -891 -561 964 212 -1056 -32
2615c2J073j404n32J388J53j332J94J439m61j503J037R33j218n82J142M89j378
$$ -32 1041 -363 -895 493 646 -686 -492 947 486 -1017 20 953 -265 -847 295 784 -594
2632e94K0J552p65j151Q05J027j148o99J324L13j370K93J177n50j229R41R42r74
$$ -594 -574 978 213 -938 -133 894 -254 -953 371 684 -686 -393 784 234 -995 -54 888 -86
2650h6p77J211M72j252N9J089j79j425P12R67r10o77R86L82j089J9J132k35j144
$$ -86 -863 348 820 -432 -373 716 537 -888 -176 791 -119 -796 190 572 -517 -498 634 399 -745
2669g45N36R33q52o09J003L19j102o8J195k71j125O28J011r25o73J128L62j033
$$ -745 -209 724 -128 -737 266 585 -517 -585 610 339 -786 -158 853 -72 -745 383 745 -288
2687b88m19J267k19q87K13R71p23o49R62M06j105pJ101o0j142K09J021o21p74
$$ -288 -707 560 341 -546 -333 638 -85 -734 228 634 -471 -478 623 563 -579 -370 651 30 -744
2706g44J067L43j044j08R72p5r62K30J102p45o53P61N15j062j71J221l54p54K61
$$ -744 323 666 -378 -486 486 411 -551 -321 781 36 -617 144 659 -403 -574 647 293 -461 -200
2725b00Q39o68o57Q67N00j068j28J047J58j323M63Q63o02q61Q18O12j076k57J101
$$ -200 639 -29 -686 181 681 -387 -515 532 690 -633 -170 693 91 -770 48 660 -416 -673 428
2744D28R3r64J31R76n40q82O89P00r26l70J217j77r35J72J045m48p85N74O47q90
$$ 428 521 -443 -312 664 124 -758 -69 631 -295 -665 552 375 -560 -388 657 209 -576 -2 645 -245
2764b45m51J179M0j084J90J094n14p00N09N77p77m08J083J11r41j18J104m57q63
$$ -245 -696 483 523 -561 -371 723 209 -491 18 595 -182 -590 493 604 -337 -455 649 192 -671
2783f71O42P43q37n15J061Pr06O6J049l66q62N02O79q03m00J021J15r58J43P02
$$ -671 -29 714 -123 -638 423 430 -476 -410 639 273 -589 -87 592 -211 -611 410 525 -433 -290 412
2803D12j32r26N89O64n51q75J056K55r98J54P77j33r54O37P61q21n01Q39J46o99
$$ 412 280 -646 -57 607 56 -819 237 492 -506 -352 425 292 -662 -25 736 -85 -586 253 399 -300
2823c00n6Q84k98o73J87Q68o21m40R48j04p00jQ15k09q39N98M76n88o05Q25L01
$$ -300 -356 528 230 -443 -256 612 -9 -449 499 395 -305 -306 509 300 -539 59 535 -53 -658 167 468
2844D68q23j4Q36k86o75L52P90p77n28P58K94p45l9Q41j98q94N06P21o60n96Q97
$$ 468 -355 -369 467 181 -494 -142 648 -129 -657 101 395 -350 -389 452 254 -640 -134 587 -73 -669 228
2865B28L41j022R4P37r6q15K68P09n80n76Q94L78p68j52O35J04q21K21O85n11
$$ 228 569 -453 -359 378 282 -533 -265 444 -136 -712 182 560 -208 -360 275 379 -442 -221 464 -47
2885d7n80O83N33j122O6P73J05r23M26O84m49n76N98L62q24j86Q10R2q52J52J025
$$ -47 -627 56 589 -533 -467 306 411 -512 -86 598 149 -427 171 533 -291 -477 333 425 -427 -275 750
2906G50m94q70O77N04r48j1P91P3j036M34O98n79m54M18N05p57n7O97N1r16L73
$$ 750 256 -614 63 567 -381 -392 399 472 -564 -130 568 -11 -465 -47 458 -299 -356 341 392 -524 -151
2927a51P17n37n48N49N23q67o8O87R0q33J73Q42m91o45O95L33o68l98R01K03j027
$$ -151 566 29 -519 30 553 -314 -382 305 395 -438 -265 577 86 -559 136 469 -199 -597 304 507 -520
2948e20K38R05m20q97Q15M43p63m40P46L15r11O8J089n14p50N73P35p68o79J085
$$ -520 -282 623 203 -694 121 564 -199 -639 107 422 -489 -421 668 154 -596 -23 712 -56 -735 350
2968C50J81r55N7R76k83q81N23O94q56k92P17L22j066%J006j82o97K76O96o46
$$ 350 531 -424 -367 609 326 -555 -32 662 -194 -486 231 553 -513 -513 493 311 -386 -110 586 -60
2988f0m76Q16L67j033q2J005l01p81N78O76p86m27N05O08j006k13J027j8r87M98
$$ -60 -536 280 647 -386 -468 537 236 -545 33 709 -77 -504 1 609 -397 -610 417 399 -588 -90
3008i0O07m72m92O13L96o95m37J166l34p99M69O01l91q01R51L40j001k58J125
$$ -90 517 45 -447 166 562 -133 -570 596 262 -537 -68 533 142 -659 292 632 -369 -627 498
3027D98k71r61M99Q70n38r98R99N01r36q6Q55J02j036L04P12l75r01Q43O54j096
$$ 498 227 -734 -235 635 97 -901 98 599 -337 -423 432 534 -502 -198 514 139 -762 81 735 -361
3047c61k30J028N0j004J78J002l42r42N71O01p00l44R11L3r55N0J111n81o90O21
$$ -361 -591 437 487 -517 -339 663 321 -621 -50 551 -149 -493 418 451 -504 -454 657 76 -614 7
3067GN09p93n41J200J29j145K02R27l62p74N16R32q84n46R31L23j072%R94k79
$$ 7 516 -277 -818 382 511 -634 -432 495 133 -641 -125 807 -77 -623 308 631 -441 -441 553 274
3087B74r59N26Q97q04p38R67N12j005l8R16k88q28N92O29p89m41R20K19j051p6
$$ 274 -685 -159 738 -66 -804 163 675 -330 -368 548 260 -568 24 653 -136 -577 343 562 -489 -565
3107e65J208k65j062N71P91o49o37Q32M02j083j76J081k17q71L85J132p93p99
$$ -565 643 378 -684 -113 678 29 -608 224 626 -457 -633 448 231 -640 -255 877 84 -715
3125g15R91L75j060j84J055K9j227M84R53r14o47R16O94j178j68J058j13r37M01
$$ -715 276 651 -409 -593 462 491 -736 -252 701 -213 -860 56 750 -428 -596 462 349 -588 -187
3144a87J008p82o63O69O64j062k29J090o3j135M04J039o12q67P85P46j010o38
$$ -187 821 39 -624 45 709 -353 -582 508 445 -690 -286 753 141 -726 59 805 -205 -843
3162h43J179L15j111J41J050p83n16O63N73r50k71R99O9j034nJ323o75o90N61
$$ -843 336 651 -460 -319 731 -52 -568 95 668 -282 -553 446 515 -519 -524 799 124 -566 -5
3181eQ30j077n09J037L94j097p1J156m37r80O55R09j026n06J154K71j106j06J157
$$ -5 825 -252 -761 276 670 -427 -498 658 221 -759 -104 805 -221 -727 427 698 -408 -514 643
3200F43l79r63O09J007q00p52Q48M41j209k9J288m77j055O25J215q69q13R88L50
$$ 643 264 -699 -90 917 117 -635 213 654 -555 -584 704 227 -828 -203 1012 143 -670 318 668
3219F68j028k58J240k98j026M15J069p70r62J225M58j037l41J323p7j276K72J162
$$ 668 -360 -618 622 324 -702 -287 782 12 -950 275 733 -304 -645 678 601 -675 -403 759
3237G59p35p87Q82O71j193l35J246q6j052L59J068o34q91Q47Q15j237n16J350
$$ 759 24 -763 119 790 -403 -738 508 422 -630 -271 797 163 -728 119 934 -303 -819 531
3255E31K12j176J5J000k75j065O59J056j181o66J283K98j510L82J151m87r38O93
$$ 531 743 -433 -418 582 307 -758 -99 957 -224 -890 393 691 -819 -437 714 227 -711 -18
3273a8Q26j010p40J320J39j143M5J450o56j142Q48R76j012o77J190L27j286j8
$$ -18 808 -202 -942 378 517 -626 -581 869 213 -929 -81 895 -117 -794 396 723 -563 -581
3291e81J368m20j191Q24P45q54o90J186K67j241r6J451k92j293N35J318j086p96
$$ -581 787 367 -824 0 745 -109 -799 387 654 -587 -683 768 476 -817 -282 1036 -50 -846
3309h46J119L08r50k05J283j55j203M39R30o80j019J077O64j126l01J306nj638
$$ -846 273 581 -369 -574 709 554 -649 -210 720 40 -979 98 762 -364 -665 641 636 -1002
3327a002O18J295p59j124J129Q60j207o14J282J24j326L18J269o63j099J065P28
$$ -1002 -384 911 152 -972 157 1017 -190 -804 478 602 -724 -406 863 200 -899 166 894
3344H94j170n41J283K1j110J87J254n38j151R10R86j280n90J473N7j365K42J287
$$ 894 -276 -817 466 487 -623 -436 818 280 -871 39 1025 -255 -845 628 685 -680 -438 849
3362H49m98j077O30J029j161o31J271K85j301pJ367l75j209O75J139j181o01J309
$$ 849 351 -726 -96 933 -228 -859 412 697 -604 -611 756 381 -828 -153 986 -195 -796 513
3380E13L94j379p3J298l40j305N40J358j135p28J076O64j278j41J300k91j489
$$ 513 907 -472 -545 753 413 -892 -352 1006 -129 -857 219 883 -395 -536 764 473 -1016
3397a016O20J266r64q25R70Q27j437l25J444J98j591M69J305p86j125J170P03
$$ -1016 -396 870 -94 -919 51 878 -559 -884 560 758 -833 -364 941 155 -970 200 903
3414I03j233m31J317J92j250kJ489r03j175J207J031j502n42J422J94j384J81
$$ 903 -330 -761 556 748 -502 -504 985 82 -1093 114 1145 -357 -899 523 717 -667 -486
3431d86J413o35j147Q42R87j258n66J361K80j436J2J392n42j248P91J271j316
$$ -486 927 292 -855 -13 974 -284 -850 511 791 -645 -633 759 217 -1031 -240 1031 -285
3448b85n83J241L88j388N7J249j86j350O43J075q69r80J492N03j605p7J332j34
$$ -285 -868 373 761 -627 -570 679 493 -857 -214 861 -8 -988 504 1007 -598 -675 657 523
3466E23j319O37J081j054p45R49Q88j357m33J392M9j482L93J410p94j142J140
$$ 523 -796 -159 922 -132 -877 72 960 -397 -830 562 611 -871 -478 932 138 -1004 136
3483A36P98j438m43J646J61j633L54J355q44r29Q39Q38j227n11J432K75j664K83
$$ 136 934 -504 -947 699 860 -773 -419 936 92 -837 2 840 -387 -898 534 809 -855 -572
3501e72J361n09j323J041J048j282p93J530L37j572J18J499m56j455J132J110
$$ -572 789 280 -1043 -2 1046 -236 -1029 501 838 -734 -616 883 427 -1028 104 1214
3517A214j512p06J426M38j474r3J500j65j536P19J251j216r11J433M78j371k41
$$ 1214 -298 -1004 422 860 -614 -707 793 628 -908 -189 1062 -154 -1065 368 846 -525 -766
3534g66J499k88j393O67J252j009r88J291N04j346q4J475k49j335L13J435q66
$$ -766 733 445 -948 -281 971 -38 -1026 265 769 -577 -661 814 565 -770 -457 978 112
3551A12j070R77R28j363k02J497j10j575M03J397p90j128R61P38j188p29J780
$$ 112 -958 19 947 -416 -618 879 769 -806 -403 994 204 -924 37 775 -413 -1142 638
3568F38J63j558K20J380o06j271R30J184j259q11J567K60j586J09J451m86j355
$$ 638 801 -757 -537 843 237 -1034 -104 1080 -179 -990 577 837 -749 -640 811 325 -1030
3585a030P77J224j217n50J242L74j553J36J527l82j516Q42J297j300r09J416O21
$$ -1030 -253 971 -246 -796 446 820 -733 -597 930 548 -968 -126 1171 -129 -1038 378 999
3602I99j635n8J658n06j567Q81J224j070q69J319N92j275n20J449P8j726O84J230
$$ 999 -636 -694 964 458 -1109 -228 996 -74 -943 376 968 -307 -827 622 700 -1026 -342 888
3620H88q80r91J230Q22j629m59J695L8j609M22J477p90j139Q52J114j309n36J358
$$ 888 8 -983 247 1069 -560 -1019 676 714 -895 -473 1004 214 -925 -73 1041 -268 -804 554
3638E54J86j556K41J455o06j485J192J027j280o18J455K65j839L52J542l69j666
$$ 554 740 -816 -575 880 274 -1211 -19 1008 -272 -890 565 830 -1009 -657 885 516 -1150
3655a150J126R95j101p42J292M21j518l1J730o53j443P76J424j209q70J481L31
$$ -1150 -24 971 -130 -872 420 841 -677 -708 1022 369 -1074 -298 1126 -83 -953 528 859
3672H59j619K6J564k27j645P48J365j091j119J382P67j590k80J647o5j723P25
$$ 859 -760 -734 830 603 -1042 -294 1071 -20 -1139 243 1010 -580 -860 787 722 -1001 -276
3689b76J378j112j223J613O43j397l47J439j3j613M25J550r02j115J030R61j465
$$ -276 1102 -10 -1233 380 1023 -374 -721 718 705 -908 -483 1067 165 -950 80 1041 -424
3706d24n91J655O5j569K03J599o56j338J076J113j357q09J542L17j706K60J602
$$ -424 -1015 640 705 -864 -661 938 282 -1056 20 1133 -224 -1033 509 826 -880 -620 982
3723I82n46j493R05J095j147p19J388M07j715J47J685m26j601Q86J372j167j045
$$ 982 436 -1057 -152 943 -204 -923 465 872 -843 -696 989 563 -1038 -152 1220 53 -992
3740i92J351N72j570j99J739k35j615P61J429j212j111J332Q14j595m39J556P7
$$ -992 359 931 -639 -838 901 666 -949 -188 1241 29 -1082 250 1064 -531 -970 586 663
3757F63j674O16J557j203j133J345Q35j472n50J646k7j386M25J490p54j420J085
$$ 663 -1011 -395 1162 -41 -1174 171 1006 -466 -1016 630 603 -783 -358 1132 378 -1042 43
3774D3R96j280q82J804L15j788J72J513n14j405J059J032j350q47J630M95j664
$$ 43 1039 -241 -1123 681 996 -792 -620 893 379 -1026 33 1065 -285 -1132 498 993 -671
3791f71l8J722o63j323Q52J218j323r62J685L52j546j56J882m81j689Q77J317
$$ -671 -709 1013 350 -973 -121 1097 -226 -1188 497 849 -697 -853 1029 548 -1141 -264 1053
3808A053j153r47J347O83j665j82J794l42j520P47J435j082j210J460O82j586
$$ 1053 -100 -1047 300 983 -682 -864 930 588 -932 -185 1250 168 -1042 418 1100 -486
3824d86l89J597kj664M76J539r76j186J209Q74j504m09J635o8j709O19J487p69
$$ -486 -875 722 720 -944 -468 1071 95 -1091 118 992 -512 -921 714 646 -1063 -444 1043 274
3842B74j415J341R10j492n46J498K94j757N14J415p47j401J090J256j518p79J630
$$ 274 -1141 200 1110 -382 -928 570 864 -893 -379 1036 289 -1112 -22 1234 -284 -1063 567
3859E67K38j681J83J685o25j699J230J252j435o81J249O27j697QJ738n27j547
$$ 567 805 -876 -693 992 367 -1332 -102 1150 -285 -966 283 910 -787 -779 959 432 -1115
3876a115P90J491j347r21J566O67j842l69K126n06j444N48J319r05j149J356P38
$$ -1115 -325 1166 -181 -1102 464 1131 -711 -1080 1046 540 -904 -356 963 58 -1091 265 1003
3893A003j548k81J708r3j707N83J557r64j370J170J043j493m13J577j39j616M54
$$ 1003 -545 -826 882 789 -918 -335 1222 258 -1112 58 1101 -392 -805 772 633 -983 -529
3910e29J804j133j469J561Q23j621m69J787R4j676K85J631p83j598J336J107j346
$$ -529 1275 142 -1327 234 1057 -564 -1033 754 848 -828 -543 1088 305 -1293 43 1150 -196
3927a96r99J792M01j938M35J405n59j572J112J240j246j093J701N03j662q6J651
$$ -196 -1195 597 998 -940 -505 900 341 -1231 -119 1121 -125 -1218 483 986 -676 -762 889
3944H89l30j567O79J260q50j180J359Q10j571l38J800l49j623O90J364r67j225
$$ 889 559 -1008 -329 931 81 -1099 260 1070 -501 -839 961 612 -1011 -321 1043 76 -1149
3961a149J402Q33j583l28J617k71j794P74J568j000j193J369Q63j585n24J623
$$ -1149 253 1086 -497 -825 792 521 -1273 -499 1069 69 -1124 245 1108 -477 -1001 622
3977F22J27j585L74J697j083j213J020J176j176j036J653K81j864L89J694p64
$$ 622 749 -836 -462 1235 152 -1061 -41 1135 -41 -1077 576 857 -1007 -618 1076 312
3993C12j506J130J235j425q85J705K33j553J17J561n96j303P07J391j233r89J697
$$ 312 -1194 -64 1171 -254 -1139 566 799 -754 -637 924 328 -975 -268 1123 -110 -1099 598
4010E98L01j650K2J592m08j404O85J348j110j108J396Q18j710k28J725k08j769
$$ 598 899 -751 -729 863 455 -949 -264 1084 -26 -1134 262 1080 -630 -858 867 659 -1110
4027a110Q81J332j072j045J310P55j630m45J763Pj789N50J699j036j210J267Q51
$$ -1110 -229 1103 31 -1014 296 1051 -579 -1024 739 746 -1043 -493 1206 170 -1040 227 1078
4044A078j592m74J660K46k031O05J599p60j610J369R84j440o98J643L89j778J87
$$ 1078 -514 -988 672 918 -1113 -508 1091 331 -1279 90 1074 -366 -1064 579 968 -810 -623
4061f23J748p48j443R01J331j489p47J566L65j495m2J375k14j505P90J231j272
$$ -623 1125 377 -1066 -165 1166 -323 -1070 496 861 -634 -676 699 485 -1020 -230 1001 -271
4078b71q13J348P80j671k83J825l66j707R07J607j421j093J440Q58j770l11J682
$$ -271 -1084 264 1044 -627 -910 915 549 -1158 -251 1356 -65 -1158 282 1140 -630 -941 741
4095G41j11j663O85J485j235r67J360Q70j770m24J878j6j881O12J703j169j194
$$ 741 630 -1033 -348 1137 -98 -1065 295 1165 -605 -1029 849 833 -1048 -436 1267 98 -1096
4112a096J274J009j687o06J762J34j701M69J541j014j209R90J416j681o63J671
$$ -1096 178 1187 -500 -1106 656 790 -911 -442 1099 85 -1124 -134 1282 -399 -1062 609
4128F09L02j877K02J812n46j445R22J350j518j003J744L79j716m1J719k97j575
$$ 609 911 -966 -764 1048 502 -943 -21 1329 -189 -1192 552 931 -785 -826 893 596 -979
4145i79Q53J252j272j009J660O16j901n2J819n33j445P87J404j302r29J388O76
$$ -979 -126 1126 -146 -1155 505 1121 -780 -832 987 454 -991 -204 1200 -102 -1031 357 1033
4162A033j461m14J762m24j597P77J367j044j238J299R62j603l25J571J62j864
$$ 1033 -428 -842 920 496 -1101 -324 1043 -1 -1239 60 1022 -581 -906 665 827 -1037
4178a037O90J490r81j288J375R11j479o48J619K73j657Q3J713p10j440J157R97
$$ -1037 -347 1143 162 -1126 249 1160 -319 -967 652 925 -732 -649 1064 354 -1086 71 1068
4195A068j283q48J533N19j869K32J825o36j575J076J028j146j050J754M73j983
$$ 1068 -215 -1063 470 989 -880 -648 1177 541 -1034 42 1070 -76 -1126 628 1101 -882
4211h82J6J618q7j795P95J608j319j239J663O52j833J05J626l59j713P42J386
$$ -882 -866 752 665 -1130 -335 1273 -46 -1285 378 1030 -803 -698 928 569 -1144 -402 984
4228I84r21j068J322Q02j540n17J630N4j652N12J457r80j079J212Q46j625m71
$$ 984 63 -1005 317 1119 -421 -938 692 746 -906 -394 1063 83 -996 216 1062 -563 -1034
4245a034J629J36j737N37J583p39j533J180J053j458n59J525K78j763L52J547
$$ -1034 595 731 -1006 -469 1114 375 -1158 22 1075 -383 -942 583 861 -902 -550 997
4261I97o10j607J020J255j369q39J537M88j546j30J686l41j569R06J383j395q01
$$ 997 387 -1220 -200 1055 -314 -1153 384 872 -674 -804 882 541 -1028 -122 1261 -134 -935
4278i35J222O94j673k25J796l69j619Q49J322j203j124J620O45j546k22J634k76
$$ -935 287 981 -692 -917 879 510 -1109 -260 1062 -141 -1265 355 1000 -546 -768 866 590
4295E90j565O27J536j254j013J388P58j461m03J453P9j678N47J485r25j254J174
$$ 590 -975 -348 1188 -66 -1079 309 1067 -394 -797 656 735 -943 -396 1089 164 -1090 84
4312H4R86j304o46J553J48j594K29J539o77j323J075R40j406o97J883Nj678K85
$$ 84 1070 -234 -880 673 821 -773 -544 995 318 -1005 70 1010 -396 -1093 790 795 -883 -598
4330e98J504o71j288J121J174j475p49J393M56j625k8J544k97j625R72J190j051
$$ -598 906 235 -1053 68 1242 -233 -982 411 867 -758 -786 758 461 -1164 -192 998 -53
4347e3r46J463L91j532r7J677l06j563P94J260j047j118J511O41j830j14J686
$$ -53 -999 464 855 -677 -774 903 597 -966 -172 1088 41 -1077 434 1075 -755 -869 817
4364H17l16j424O40J271r15j034J321N98j199n97J566O0j558L37J482r50j365
$$ 817 501 -923 -283 988 73 -961 360 958 -241 -838 728 788 -770 -433 1049 99 -1266
4381a266J253R64j394n13J517J22j316L9J559p06j335R03J106j235o31J482M21
$$ -1266 -13 951 -443 -956 561 683 -633 -594 965 259 -1076 -173 933 -302 -933 549 970
4398I70j758J05J743o91j388R26J193j260q41J507K98j472j44J715m56j381P12
$$ 970 -788 -683 1060 369 -1019 -93 1100 -160 -1001 506 804 -668 -812 903 447 -934 -222
4415b22J267j048j131J462N05j336k31J609l94j461O21J441j150r90J382O42j350
$$ -222 1045 -3 -1134 328 833 -503 -734 875 481 -980 -359 1082 -68 -1058 324 966 -384
4432c84m05J576j02j778N21J505r04r97R87R58j410n77J631J27j724L88J554o71
$$ -384 -789 787 685 -1093 -572 933 29 -968 19 977 -433 -1010 621 748 -976 -588 966 295
4450B95j347J107R06j358l02J266J61j349N7J514m23j492R88R82j407o08J620
$$ 295 -1052 55 961 -397 -699 567 728 -621 -564 950 527 -965 23 1005 -402 -1010 610
4467F10K08j365j11J503m82j377Q71J141j053r84J415L40j427NJ484k54j550Q27
$$ 610 818 -547 -658 845 363 -1014 -143 998 -55 -1039 376 716 -711 -706 778 524 -1026 -199
4485a99J142r80r66J309N59j449k12J462j83j374N21J429r97j027J288O23j474
$$ -199 943 -37 -1003 306 865 -584 -796 666 483 -891 -370 1059 62 -965 323 946 -528
4502e28k32J426J4j437L56J147n91j120J084Q58j447m41J687j72j521M05J483
$$ -528 -760 666 680 -757 -401 746 155 -965 119 977 -470 -911 776 604 -917 -512 971
4519I71o14j237J056R12j485m99J438K08j361N3J518p10j249Q55J241j215q08
$$ 971 357 -880 176 1088 -397 -896 542 750 -611 -558 960 250 -999 -144 1097 -118 -926
4536i26J358N00j524r3J523m89j156O36J396j244p82J136M38j382l0J437l60j291
$$ -926 432 932 -592 -685 838 349 -807 -171 1225 -19 -801 335 773 -609 -639 798 438 -853
4554h53P26R66q33r71J266O59j346m03J646l21j488O29J277p19j242J081O54j163
$$ -853 -127 839 6 -965 301 960 -386 -789 857 536 -952 -323 954 235 -1007 74 728 -435
4572d35m80J466K47j720N38J191o09j199J106P78j239m96J366L15j484K32J399
$$ -435 -915 551 798 -922 -384 807 198 -1001 105 883 -356 -852 514 829 -655 -423 976
4589I76p50j135R48Q51j061o75J390J65j502L42J271m48j410R66J054j198o98
$$ 976 226 -909 39 890 -171 -846 544 709 -793 -451 820 372 -1038 -72 982 -216 -914
4606i14J218L98j224o4J005j96j146O99J056q77q77J076P47j523j05J408k16j180
$$ -914 304 702 -522 -586 419 223 -923 -224 832 -45 -922 154 901 -622 -727 681 465 -715
4624g15M67J219p89j149J171M76j062k87J210J88j467L99J313r38r87J135O12
$$ -715 -248 971 182 -967 204 680 -382 -669 541 729 -738 -339 974 36 -951 184 796
4641G96j206m24J371j8j233J92J418p99r13Q32Q41j046n02J151K32j365K40J160
$$ 796 -410 -834 537 519 -714 -522 896 97 -816 16 857 -189 -691 460 692 -673 -433 727
4659G27m84j131R68R16j311m07J248J74j225J6J223l48j246Q95R66j017r09J234
$$ 727 243 -888 80 996 -315 -722 526 700 -525 -509 714 366 -880 15 981 -36 -945 289
4677B89L16j130m7J302m07j155P85R15p91r08J071N30j442l1J318j70j220L28
$$ 289 605 -525 -572 730 323 -832 -47 868 77 -831 240 770 -672 -703 615 445 -775 -447
4695d47J358q18r46R20N82r27m29J446p4j535N96J156p03j007Q78Q50j182l71
$$ -447 911 93 -853 67 649 -278 -707 739 665 -870 -274 882 179 -828 50 900 -282 -653
4713f53J132K13j429K62J350o03j185Q80Q65j028o56J170K95j232P4J370m82j274
$$ -653 479 692 -737 -475 875 272 -913 -33 832 -196 -852 318 613 -619 -545 825 343 -931
4731i31P98J004r69p19J317J47j300K72J178m13j242O51J035q47q76J154N34j316
$$ -931 -133 871 -98 -817 500 647 -653 -381 797 384 -858 -207 828 -19 -895 259 793 -523
4749e23j61J422j98j353N11J168q96q19J066N81j181j57J069o6j274N98J061o39
$$ -523 -684 738 540 -813 -302 866 -30 -849 217 798 -383 -540 529 463 -811 -213 848 209
4767B09j080J016N03r87k52J137J28j281K45J078n19r73Q82O35j023m60J251J67
$$ 209 -871 145 648 -339 -591 546 674 -607 -362 716 197 -776 106 741 -282 -742 509 676
4785F76j250K54J058n39j091O46J042j061m92J239L33j373OJ378n39j132O58R51
$$ 676 -574 -320 738 199 -892 -246 796 -265 -757 482 815 -558 -552 826 287 -845 -187 764
4803G64r56m14Q91L29j080o1J078k42q97M83R56q70q58J121M27j082k07J359j87
$$ 764 -192 -606 285 614 -466 -527 551 309 -588 -105 851 -19 -877 244 671 -411 -618 741 554
4822E54j238M76Q23n64q85J015M83r95k84J310k84j331M87J127o12q64Q19Q75
$$ 554 -684 -208 615 51 -834 181 664 -331 -615 695 411 -920 -433 694 82 -782 37 912
4840I12j225m83J204J36j091M4J067m90p72P00Q11r63o27J131J92j045M8J129
$$ 912 -313 -796 408 544 -547 -503 564 74 -698 2 813 -150 -777 354 546 -499 -451 678
4858F78l02j232P77R42j107m03R37L61j094r1J326n55j090P70P60o48p76Q99N39
$$ 678 376 -856 -79 863 -244 -647 290 651 -443 -534 792 237 -853 -83 677 29 -747 152 691
4877F91j127J4R66l10r63N96R24o85q66R91M17r49k69R93K08j336K46J202p50
$$ 691 -436 -422 544 234 -729 -133 791 106 -760 231 648 -301 -570 423 631 -705 -459 743 -7
4896gr41R99M52q29k90J107J31j085P0R67n22r80J055O71r17n60J036M6q40m0
$$ -7 -948 51 503 -326 -616 491 622 -463 -393 574 52 -928 127 798 -119 -679 357 403 -437 -477
4916d77J289n95r50O62Q52q63n53J045K29j035n6J008k55r59M92Q62q04m22P68
$$ -477 812 217 -733 -71 781 -82 -635 410 639 -396 -452 556 301 -658 -166 696 -108 -530 238
4935B38K18q81k61J270l05q86M51P88m66r58J025L92p50m50J020Q6j115L31R86
$$ 238 456 -425 -686 584 279 -607 -156 632 166 -792 233 625 -125 -575 445 531 -584 -253 733
4954G33n25q78P63M41q59l10J031L9r06J11R41m02j018R14O20q68l75R63J72j222
$$ 733 208 -670 93 534 -325 -635 396 435 -471 -360 581 179 -839 75 695 -173 -548 415 587 -635
4974f35L09R97n78q59Q20O00p15p85J177L46j282K80Q91k90q82N72O86o51o77
$$ -635 -326 671 93 -766 54 654 -61 -846 331 677 -605 -325 566 276 -606 -34 652 1 -676
4993f76J000J32r46J37Q81j59r08K64J086q44p19Q98N15r36j29J023k95q67M59
$$ -676 324 456 -490 -353 528 369 -539 -275 811 -33 -752 146 661 -275 -404 619 324 -543 -84
5012h4N82k74r26Q04N10q31k81R78j24r31K09J133p02q87Q63K96o48l84J084J5
$$ -84 498 224 -702 102 612 -219 -500 478 354 -577 -368 765 63 -824 39 335 -313 -697 387 402
5032D02r59N2J129n02q86O74O71p29l29R50J8j013J84J000k99j017N82P19o27
$$ 402 -557 -505 624 122 -764 -90 581 -148 -477 473 491 -522 -338 662 363 -654 -72 647 20
5051B0n43P42L39j086J91R70k64q74K99R77n76q16P68L32q77p7Q22o1q10M05Q19
$$ 20 -523 219 558 -528 -337 633 369 -505 -206 771 195 -621 147 479 -398 -475 347 286 -524 -119 700
5072G00o32p32Q45L23q83p7Q01L5q74K17R09o37n01O58N37p93m16J038k15q84
$$ 700 68 -664 181 504 -379 -456 345 380 -494 -277 632 -5 -506 152 689 -104 -520 518 303 -581
5092e81L16P29l70p30Q14L80p42m05J009q1r73K12R94k58r16O38O20p71n43Q68
$$ -581 -265 464 94 -636 178 558 -184 -589 420 339 -634 -422 572 314 -602 36 656 -115 -658 210
5112B10M60j138L5R82l79p96N16N98n17o16Q84L54j040o0R27M6j134M18R55o19
$$ 210 670 -468 -433 549 170 -626 -110 488 -29 -645 239 593 -447 -507 420 466 -668 -250 705 86
5132H6o05N86L86q40k2P43j85p11M94P99o84o78J007J76p58k58J000j28r77K61
$$ 86 -519 67 453 -387 -409 334 149 -562 -68 731 47 -631 376 552 -206 -464 536 408 -569 -308
5152c08O95k43r21Q68L46n84m29R37P4r92J76R38n19o64O59O52r62k10Q72Q2q85
$$ -308 387 144 -777 91 437 -147 -576 361 435 -557 -381 557 38 -626 33 685 -277 -487 385 467 -418
5173d18J15R51n24p81P12P01r05l67Q16K63j093k8R91j54q72N62O39n74p86R82
$$ -418 -303 648 124 -657 55 756 -149 -516 300 563 -530 -558 433 279 -593 -31 608 34 -752 230
5193B30L25r26P4O10J4j038N54O91m79p69Q25L97q09p0P43j39p92L40P80m28o46
$$ 230 555 -371 -297 313 327 -711 -157 534 55 -714 111 508 -301 -371 372 233 -559 -219 561 133 -513
5214e13O73L38p14l34P82K09q04K17N55l24o68N34N81o49l67Q17J87q83J63P67
$$ -513 160 498 -216 -550 232 441 -363 -146 409 85 -583 -49 532 -117 -484 333 520 -363 -200 567
5234E67m91q24N06P68o11n10P98L52q15k14R78l33p02L23Q64j015o9N60L73q43
$$ 567 76 -748 -242 526 -85 -595 203 555 -260 -474 504 171 -531 -208 656 -359 -428 132 505 -338
5254c38n9P74k64n87L71P08n60o03O41M52p26k33Q85j88p62L64P50m31p26N69
$$ -338 -397 377 113 -474 -103 605 45 -558 83 535 -191 -424 461 273 -489 -125 625 194 -532 37
5274C7M61p23k89Q13J3p09K63O31l97o42N98N56p84l29O93J61o60n2J047n22o21
$$ 37 498 -225 -514 299 312 -397 -134 497 100 -542 56 612 -172 -501 192 353 -307 -359 688 166 -455
5295d55K74Q82p50l46P14J56q68J03O30l25n09M40P03p37m66Q31P1q01nQ24k57
$$ -455 -181 701 -49 -395 319 475 -393 -290 340 15 -494 -54 649 -88 -554 277 348 -453 -458 366 109
5316A09o90M95O51m50o51O41L62p75p8Q26k79o00J87P36m63l96M74L98o14l07
$$ 109 -581 -86 565 115 -536 105 467 -308 -386 440 161 -439 -252 484 21 -375 99 497 -117 -424
5336d24Q07k6q31J73Q90n69m54M75M06n81l47Q21J44r02L0Q53l26o89O19L92n31
$$ -424 383 357 -474 -301 589 20 -434 41 447 -134 -481 340 484 -418 -388 465 139 -550 69 461 -70
5357g0l99P16J78r14K29P20l01o86M69M92o07l13P31R5n64k39P75Op88L15O25
$$ -70 -469 247 425 -489 -260 460 159 -527 -58 434 -173 -486 245 340 -224 -463 312 318 -470 -155 470
5378D70n38l34N49K49n84k73R54j33p67K35P18o24m38O22L28q43k5Q38j05o38
$$ 470 -68 -402 147 396 -188 -461 493 360 -407 -172 546 -78 -516 106 434 -409 -434 404 299 -339
5398c39M14M22n12m71N77L36p08o7O88j91k51p1N66l40m86L68M52n46l61P32J86
$$ -339 75 497 -15 -486 91 427 -281 -348 340 149 -102 -173 393 53 -433 -65 387 -159 -520 212 398
5419C98p60J24N90l01m33L07O03m90n91Q97K97j011J19N26L7p37L50N65m09m32
$$ 398 -362 -238 352 51 -382 -75 528 38 -553 344 641 -370 -251 275 312 -425 -75 490 81 -351
5439c51M76N7m81l6P34m08k69K91N85n99n71P38L4l11j83N08J12q38L52O06k88
$$ -351 125 182 -299 -335 399 -9 -278 13 598 -1 -572 166 200 -111 -294 214 326 -512 -160 446 158
5460A58o83N26L91o38j13O31J92q85K67N62m34m59N46K07m71j99O90J16o19k6
$$ 158 -525 1 392 -246 -359 272 464 -421 -154 408 -26 -485 61 268 -203 -402 288 404 -215 -241
5480b41Q02m15o39N01M33m67l26O24K16o06j73O04j75n96L82N52m37n39O57L20
$$ -241 561 146 -493 8 441 -26 -352 272 488 -118 -291 313 138 -458 -76 476 39 -500 157 477
5500D77p99N8O11q8n76K19N58n60j75L56L72o57p0N40R4o53J74O20l38o27N25
$$ 477 -322 -264 347 259 -317 -98 460 -100 -275 81 453 -204 -274 266 360 -293 -119 501 163 -464 61
5521F1M13p10o5O22Q3o62J01P15m15o59O61K82o68j81P29Q9o32L0N73p7p53M50
$$ 61 474 -236 -301 321 404 -258 -157 558 143 -516 145 427 -241 -422 307 396 -236 -206 367 290 -463 -13
5543a3O47o94l62O73J46p12R4O18k29n82M27L58m30m78Q32j64m10n1O05j11o34
$$ -13 634 -60 -422 251 397 -315 -221 397 168 -414 13 371 -59 -537 295 131 -279 -330 275 164 -470
5564d70L50N14m95l25N90J85p22K0O09N5p19L25M88m15m51N86L28o26o7M53Nm71
$$ -470 -120 394 -101 -426 164 349 -373 -353 256 311 -408 -83 405 -10 -461 125 453 -173 -240 213 218 -253
5586b53L04K68k47n39N47L00l77m91P03J68o49K0O02j44p06N10L34n54j98N66
$$ -253 51 319 72 -467 80 380 3 -488 215 383 -266 -246 356 212 -494 16 350 -204 -402 164
5606A64L88q98j38P18P8o64J75O25m57m09M87K32n47J7O06j40o63K89O08m31n44
$$ 164 552 -346 -484 234 312 -352 -177 448 -9 -418 69 301 -246 -229 377 237 -426 -137 471 40 -504
5627e04N15L18m71k12P15j80m58K54M00m37l36M12L60o26kN81o1o33J92O65m97
$$ -504 11 329 -142 -354 361 181 -277 -23 377 -60 -396 16 376 -250 -252 329 268 -365 -173 492 -5
5648ek38L67K85n18j7M71N1o32J99L14l09k79K65L80m27j99M91J2n93J74N66o0
$$ -5 -243 124 409 -109 -126 345 396 -236 -37 277 -32 -311 -46 334 -93 -292 199 211 -382 -208 358 298
5670B98p69M70K66m07k77O05J42n64p1P13k07n23K09M70l72l37O38R0o09k4N72
$$ 298 -471 -1 265 -142 -419 186 328 -236 -307 406 199 -324 -115 355 -17 -354 284 374 -235 -259 313
5691C13k08m59K82M88m01l66N00J26m35mM97j45m91J7N66k17k43K29R5l55K4L32
$$ 313 105 -354 -72 416 15 -351 149 275 -160 -164 333 188 -303 -286 280 63 -180 49 144 -211 -187 145
5713A45J00n88K15O27n00l16K15M63l18m23N26J58o11K28L60Ko71K30O73o25k43
$$ 145 245 -343 -128 499 -1 -317 -102 361 43 -380 146 304 -307 -79 281 283 -388 -158 515 -110 -353
5734c53N09K27o04o5O06j68m27J22O30l90l94N54J02n41nO29k68m05K23L21l17
$$ -353 156 383 -221 -286 320 152 -275 -153 477 87 -307 247 349 -192 -197 432 164 -241 -18 303 -14
5755a4k89N01R1n23M3N65p9n60J71K56j92l85N45L18o29PL68Q4o20n9O35j86m27
$$ -14 -303 198 289 -234 -191 374 295 -265 -94 162 -30 -415 130 448 -181 -174 194 278 -342 -401 234 48 -379
5778c79K53M61n10j58N38n9n13K86M53j84p51N07M49m95l09O22q2m22K01L15m1
$$ -379 -126 335 -175 -333 205 146 -367 -81 372 188 -563 -56 393 -102 -411 211 129 -293 -92 223 182
5799A82n43L95J62j92k53L19K65n41O7L36Jo25L82M11l40l02M80kl73rN25J8n75
$$ 182 -361 34 196 4 -249 70 335 -206 -139 197 198 -427 -45 366 26 -276 204 202 -171 -180 345 363 -212
5822b12Q6M78k97n42O46R8m28k41P15j17m15o2M66j94n5J16M01n41k00L75K15
$$ -212 -126 352 55 -487 159 257 -171 -412 303 186 -229 -291 175 -19 -74 42 443 -98 -298 77 292
5843B92n77J33L93j98l45K54K46k49j79M47K55p93J30N93k36m05K49K64l54j30
$$ 292 -285 -152 241 43 -302 -48 198 -51 -230 217 472 -321 -191 402 166 -239 10 274 -80 -210
5863b10M75K9m74j97P26n5m79MO05m10l92M54J95n17pN40j90m88K78L90k96j89
$$ -210 265 294 -180 -377 349 294 -185 -181 424 14 -378 76 271 -246 -253 287 97 -391 -113 277 -19 -208
5885b08K89K27l84k88M06J19l72K9M73j64l74L12L00m73p2M02M0n39J51M51l22
$$ -208 81 308 -76 -364 42 161 -211 -182 291 127 -247 65 365 -108 -180 222 262 -277 -126 325 3
5906Cm39M68J57m49K2K79K12n20OO64k07n23L67K91n09n3M55O6m15q7N70j86l46
$$ 3 -436 32 189 -260 -238 41 253 -267 -261 403 196 -327 40 331 -178 -231 224 290 -125 -212 358 172 -174
5929a74K00J92k47k61N14p6k75m5M34j70n16L86J87k07k15M46J20l64l9J58J68
$$ -174 26 218 -29 -290 224 148 -127 -172 262 92 -424 -38 149 -58 -273 173 293 -71 -110 48 216
5950B16l55j9N93m13k81J99K94l36j84N18p0l96J85L07j69l87K88M33m59k81M29
$$ 216 -139 -158 435 22 -259 -60 234 -102 -286 232 162 -234 -49 258 89 -298 -10 423 -36 -317 112
5971A12L4l76p8N69l05m63L73L36m21r9N08n4k66j12N13l92k41J79M45k42k03
$$ 112 146 -230 -308 261 -44 -507 -134 202 -219 -318 190 136 -130 -242 271 -121 -362 -183 262 20 -183
5992a83K18J16k56K1K93j81l81K76L26m03j53N01J42o09K0K68J93l93J58L28j83
$$ -183 35 151 -105 -84 209 28 -353 -77 249 -154 -307 194 336 -273 -253 15 208 -185 -27 301 118
6013A18l10K76K71m59j35N12p0m91J45N81k86m80L30K23k78k85M92K2j20l37P19
$$ 118 -192 84 355 -104 -239 273 203 -288 -143 438 152 -328 2 225 -53 -338 154 176 56 -281 438
6034D38l74m01L95K67l84k81N24l7k80j5K59qm20K52K38k43j79L70Om19N4N48
$$ 438 64 -337 58 325 -59 -340 184 147 -133 -148 111 103 -317 -65 173 -70 -249 121 127 -292 -238 310
6056C10r0l28J03K84j76n05N61J14m92L8L24n4k24M4M99l67k77K42J84k34l94
$$ 310 220 -108 -5 279 103 -402 159 273 -219 -181 143 89 -135 -91 408 41 -236 6 190 -44 -438
6077d38P30j47n87K30N88k81l92L05K71n01n6M70N3n89K46L26p8n56N13J70l28
$$ -438 292 145 -442 -212 376 95 -297 8 279 -222 -278 192 245 -344 -98 228 150 -406 107 277 -51
6098e1k91N74q5m20J22M55j75l99L58K92n53LL28J27m95k8M62k37l66J77M58j95
$$ -51 -342 232 147 -273 -151 304 129 -270 88 380 -173 -170 158 285 -210 -238 224 -13 -379 -202 256 61
6120F1l32M39J46m79jL98j98k70J40K98k30k97K93K99l98k80N46P5l92K04R6q7
$$ 61 -271 168 314 -165 -166 232 34 -236 -96 202 -28 -325 -32 267 -131 -411 135 210 -182 22 118 31
6142C1r0K7J73j73k49M45M2n41K90M55k52o90N65K82l64j44K57N8l81j0N79j09
$$ 31 -59 -32 141 -32 -281 164 206 -335 -45 410 158 -532 33 315 -49 -193 64 122 -259 -269 310 201
6164B01n99L35L59l16o2J61P8m13l0N40j73k74J59L41k44k96J94N08o80j34M11
$$ 201 -398 -63 296 -20 -82 79 157 -256 -286 254 81 -193 -34 307 63 -233 -39 469 -211 -345 66
6185F6K40n62K37K70k30l41L85J59m57J12M81l35m00M47K09l94j00L38j1l81R
$$ 66 306 -256 -19 251 21 -320 65 224 -233 -121 360 25 -375 72 281 -113 -213 125 114 -267 -258
6206b58O24j97k72K4L36m01j02M26J26m54k01O50j96l16J24L35j48m07K63K59
$$ -258 366 169 -103 -79 257 -144 -246 180 306 -148 -349 301 105 -211 -87 248 100 -307 -44 215
6226B15l71j71N73P4m93J6M58k65k37K87K71n75J10J34K59m85P2L48j28j51rJ66
$$ 215 -156 -327 246 320 -173 -157 301 36 -201 86 357 -218 -108 26 285 -200 -128 220 92 -59 -68 98
6248I8j02l34K51L17l85q7M10m2n27L40L53k87l08L34J68l30k5L63j02l83K67
$$ 98 -4 -338 -87 230 -155 -242 168 126 -401 -61 292 5 -303 31 199 -131 -156 207 105 -278 -11
6269a1K25r4l21K34J76n13J85L16j94j95J49K89j58n55N20L11l71k47M82j38l32
$$ -11 214 120 -201 33 209 -304 -119 197 3 -192 -43 246 88 -467 53 364 -7 -254 228 90 -242
6290b42K02K08j02l27L22J39j81k74L73K37m79J7L54k47r7N8J93l31j79N69n0
$$ -242 -40 168 66 -261 61 200 19 -255 118 355 -124 -107 247 0 -97 -39 154 -177 -356 213 163
6311A63k94j2N24j29l79J6M04l17l47M26K87m55J32P1j15j84O3L80k48k49K48
$$ 163 -131 -143 381 252 -127 -111 293 -24 -371 55 342 -113 19 90 -25 -209 -146 234 -14 -263 -15
6332a5L01k70j60K36J52l94M8L45k09k76L70J88m33k79M53K7k15l5M50j07o71
$$ -15 286 16 -144 92 244 -150 -102 243 34 -242 128 316 -117 -396 57 84 -131 -166 284 177 -494
6353d94O38J92n59J33J16K86m35j29N30m01k53L86K97l71j91N13p6j86j70M15
$$ -494 144 336 -223 -90 26 312 -123 -252 278 -123 -376 10 307 -64 -255 258 182 -4 -174 241
6373B41j23l82M32Q0k88j81L73P5l50j9L32j04l72K50K77k57j50LL53l17L2L25
$$ 241 118 -264 168 248 -40 -221 152 227 -123 -142 190 86 -286 -36 241 -16 -166 -163 190 -127 -95 230
6395B30j86k30N8K57j43l67L09L35l68M4L21o2m63J84M27k08k85K16n4o0j32L64
$$ 230 44 -186 -128 129 -14 -381 -72 263 -105 -61 260 198 -265 -81 346 138 -147 69 15 -45 -177 187
6417A87O8m67M8M05k02j86J57R5M8l98L18R5m23J56K96j12k41K12L48k00l88L60
$$ 187 255 -212 -164 241 39 -147 10 105 153 -245 73 168 -255 -99 197 85 -156 56 404 204 -184 176
6439A76q2l65MO11m77J4J62K07l83l4K07Q1l22L6K74J6k87J4L97j62m04L63J74
$$ 176 94 -271 -267 344 -133 -119 43 250 -133 -167 40 121 -201 -165 109 125 -162 -148 249 87 -317 46 220
6462B20l27k15N10K3l18J4L04j29l88L65K63l99n5K75R4m69K4M24k74k3J43M7
$$ 220 -107 -322 188 211 -107 -93 211 82 -306 59 322 -77 -132 143 237 -232 -208 216 -58 -81 62 109
6484A09k23k13L70K22l86O2M30j73m48J24M25l62j62L34Q0l85p8N33J9n29K99
$$ 109 -114 -327 43 265 -121 -59 371 198 -250 -126 299 -63 -225 109 189 -196 -274 259 278 -251 48
6505D8J45k98M1J78K31l85j24L52k1k84M9K81j72j88L20j7j92k22K65J26n30L08
$$ 48 193 -105 -64 114 345 -40 -164 188 167 -117 -68 213 41 -147 173 156 -36 -258 7 133 -397 -89
6527h9L43k32k13R7K19k71L0Q2J87l21O6L69l26j69K55K67k24j89K36J85l49n
$$ -89 254 22 -191 -94 125 -146 -116 -34 153 -168 -102 267 -59 -228 27 294 70 -119 117 302 -47 -52
6549e2L79k40j42J43P0k51j18L03R8m02R7K65j31l30J79L03k54j46K76O6j65k19
$$ -52 327 87 -55 88 158 -93 -211 92 190 -212 -115 150 19 -311 -132 171 -83 -229 47 113 -52 -271
6571b71L80J47n61K62K71j73k59K76K15l58RL23k59k62L7N83m12j91J76R0k49
$$ -271 109 256 -305 -43 228 55 -204 72 287 -71 -62 261 2 -260 -223 360 -52 -243 -67 23 -226
6592b26q9N03J12n27J64K2K02m50L43Q1k30l7J75J44m92K42M62l30l70J96J30
$$ -226 -315 188 300 -227 -63 -41 161 -289 54 135 -95 -132 43 187 -305 -63 399 69 -301 -105 25
6613B5k3k96L13Rj44j40M60l3m33J74K68k14k2K04j66R6j38J95j5j54J19J4Nl50
$$ 25 2 -294 19 28 -116 -256 204 171 -262 -88 180 -34 -56 148 -18 78 -60 135 120 -34 85 99 104 -246
6637b46M22j66q6j44L95k1k78k8M43j89l17K88N3j39o8K23j98o7o8K85n7k50K49
$$ -246 176 10 -76 -220 175 154 -124 -152 291 102 -215 73 126 -13 -81 142 -56 -123 -191 94 37 -213 36
6660C6M5l75J60K00J44l47J2L59q5l78K82K13k58k39L96n8k57k0K46R6l18Q6J68
$$ 36 81 -294 -134 66 210 -137 -125 234 149 -229 53 266 8 -231 165 107 -150 -170 76 172 -146 -60 108
6683A08k7m48K25K09k37M3M64l74o3J37L1j9k86L77ok06j69L23m7j21J34m9l2
$$ 108 81 -367 -142 67 -170 -127 337 -37 -100 37 68 49 -237 140 134 -72 -241 82 35 -86 48 -1 -33
6706c3j03J10K22l43j25M33Mj99k6K89k41k09K65m8L3k89M05O2l53n4O15k44l05
$$ -33 -136 -26 196 -147 -272 161 165 -34 -60 229 -12 -221 44 -4 29 -260 145 207 -146 -200 415 171 -134
6729a34P5K58k52j32L51K4m17J9M34k22j20J26L00l66r3K44P6l00n3L66j28l02
$$ -134 -59 199 -53 -185 166 190 -227 -208 226 4 -116 10 310 -56 -149 95 171 -129 -182 184 56 -246
6751b46J73L35k02j10OL42m47n5L88j21k38J11L32k01m19L72K53k95r5K22m9j74
$$ -246 -73 262 60 -50 -44 298 -149 -204 184 63 -175 -64 268 67 -352 20 273 -22 -117 105 56 -118
6773a18M4J62j87j42K43R8k23j7K12N8j06k19L52j01k61K54J98l48JL48l26r2
$$ -118 -74 88 -99 -241 2 100 -123 -140 72 130 24 -195 157 56 -205 49 247 -101 -100 248 -78 -170
6795a70J55J34j53L3P5J87l70q6L47P2k72m4J44j28o0J56J91k46q3L26j23k86
$$ -170 -15 119 -34 -1 74 261 -109 -195 152 224 -48 -92 52 -76 -136 20 211 -35 -118 208 85 -201
6817b01J30K38k1m02J45K08M3k49J27K87n13L2K05Q9k19J37M0n3k13N5L21k07
$$ -201 -71 167 146 -256 -111 97 140 -109 18 305 -208 -176 29 118 -101 36 76 23 -190 -135 186 -21
6839b1j24K60K04n11Q5K36kk06j0K50k61m8L45j40k71J26J71j30k18K13K65l55
$$ -21 -145 115 319 -192 -107 129 127 -79 -89 161 -100 -148 197 57 -214 -88 83 -47 -265 -52 213 -142
6861a42K14N5K27o53K33K29j57k7J14P6l35jK00K33l10o9J59L0k96J57L49j40
$$ -142 72 127 354 -299 -66 163 6 -21 93 169 -166 -167 33 266 -44 -113 46 76 -220 -63 286 146
6883A46l52K05Q2k16n4M47j13l84K20K32j47l86L90J06l23j15M69j53p0P2K21
$$ 146 -206 -1 81 -135 -189 258 145 -239 -19 213 66 -320 70 176 -147 -262 207 54 -16 56 277
6904B77l28j86M40J04l37k1N5P1n43K94L14j56j68%L95k75j93M17j2l51O2L13
$$ 277 -51 -237 203 307 -30 -51 4 75 -468 -174 140 -16 -184 -184 211 -64 -257 160 148 -203 -141 172
6926A72j61k44K48Q4j89m9K93j69j45J23J71j54q8J22o7O9j65R5K06k81L6L47
$$ 172 11 -233 15 99 -90 -139 154 -15 -160 -37 134 -20 -108 14 -53 16 -149 -54 152 -129 -93 254
6948B54j75j97O1J81ol27L07L9n7p0K9P7j81J47J28l29r2J94Ok35J62L7K7j06
$$ 254 79 -118 -57 124 118 -209 98 137 80 10 39 116 -65 82 210 -119 -211 -17 -11 -246 -84 -47 -20 -126
6972a26J15J69k9k33J93K54l35qJ74p8j12j46L21p9k64J32K05j11k89K61L1k94
$$ -126 -11 158 129 -104 89 343 8 0 174 96 -16 -162 159 80 -184 -52 153 42 -247 14 45 -249
6994b49J92J65L0l19J41J48k35j28L73N1k16Q2K45k42k85L08K42k37k87K25J11
$$ -249 -57 108 138 -181 -40 108 -127 -255 118 169 -47 35 280 38 -247 61 303 66 -221 4 115
7015A15k72P6K33r4k46J40K95k76o8J50N1j97k02L92p4r2J7K42k28j85K70o2j09
$$ 115 -157 -81 152 58 -188 -48 247 -29 -97 53 104 -93 -295 97 23 -69 -52 190 -38 -223 47 -15 -124
7038a24PJ06n8L4o3L14j08k84L39m6Ml92L66Q6l19K3J12k3j15O0K33j61j37J66
$$ -124 -117 -11 -69 -35 -98 216 108 -176 163 117 121 -271 95 181 -138 -115 -3 -26 -141 -81 152 -9 -146 20
7062B0J26k24J7K65j32j48J19R9l5l34L19q9j39Q7K35q3j80K13J16l31j27K88
$$ 20 146 -78 -61 204 72 -76 43 142 107 -227 92 3 -136 -49 186 103 -77 136 252 -79 -206 82
7084H2J4q3j93L15m4k33N4K20j16j70K57J07k23r1J72J16k39J70P3k37j98K9L46
$$ 82 96 13 -180 135 91 -142 -88 132 16 -154 103 210 -13 -104 68 184 -55 115 188 -49 -247 -218 128
7107A28k69L2J96j26j48J71J60k48K3M40l13j56j6Q5J96j07j56P6N6l14L94J51
$$ 128 -141 -109 87 -39 -187 -16 144 -104 -81 359 46 -110 -126 -41 155 48 -108 -32 24 -290 104 255
7129B55k87j52K57L5k79J29J54J09m04K73nj82j40J93J71j59j07K74q0k89K10
$$ 255 -32 -184 73 108 -171 -42 112 221 -183 90 85 -97 -237 -44 127 -32 -139 135 55 -234 -24
7150b4K62k58j94K25K23m49J74J43L0k56J16J61k00m7J35J03l61K27P3Ol15J03
$$ -24 238 -20 -214 11 234 -215 -41 102 132 -124 -8 153 -47 -94 41 144 -217 10 83 89 -226 -123
7172a23K36j93M8J54J80m14j23N25r6l36K6M18j68m06K81J60j54k23K49Q2k77
$$ -123 113 -80 -32 122 302 -112 -235 290 194 -142 -116 302 134 -272 9 169 15 -208 41 123 -154
7193a54J37J37j2k11Q7J53j64j07J33Rk40R9J31J24l21MM63k41j16l9K28p9k16
$$ -154 -17 120 108 -103 -16 137 -27 -134 -1 8 -232 -133 -2 122 -199 -195 268 27 -89 -128 100 21 -195
7216a95K73J20l15L5L47k14Q2p8pj64q8K71j14j78J59K96j58k33J66K16l95N6
$$ -195 78 198 -117 -82 265 51 133 55 48 -116 -204 67 -47 -225 -66 230 72 -161 5 221 -174 -118
7238a18J10J26k37J49q6O7j36J20Q6r8k03L58J7k33J45J00j00k30K74O7l91l3
$$ -118 -8 118 -119 30 -56 11 -125 -5 81 -17 -220 138 155 -78 67 167 67 -163 111 178 -213 -246
7260b46K44L51m35n3L03k81j05K42Lj10O6K43j36k06j09L59%j17J57j06j33q4
$$ -246 -2 349 -86 -139 164 -117 -222 20 23 -87 -21 222 86 -120 -229 130 130 13 170 64 -69 -153
7282a53J65p1L6q8K28P6m83J21K52r5k34L74Lj93pkJ49k26l0L76j08l23K83J13
$$ -153 12 -59 -23 -111 117 193 -290 -169 83 -12 -246 128 131 -62 -69 -71 78 -148 -178 198 90 -233 50 163
7306A63l04J31J11m7k73nL09p7j62O6K68k99n7L71j12j45rL09j64l70L90k7l5
$$ 163 -141 -10 101 54 -219 -224 85 8 -154 -88 180 -119 -176 195 83 -62 -71 238 74 -296 94 67 32
7329C2n1l9O5m5q7J85Jj82J46K30j61j77J11K61k74k12L38j09j62R2J95m1k93
$$ 32 -19 -58 7 -38 -125 60 61 -121 25 255 94 -83 28 289 15 -197 141 32 -130 -38 157 116 -177
7352a77J99kj10L9J35J08m76K60J42j14k74J47K52k76J62j1J06k69J75K91k97
$$ -177 22 20 -90 -51 84 192 -284 -24 118 4 -270 -123 129 -147 15 4 110 -159 16 307 10
7373A0k95L62M1k72J0P8P9j68J35K11j43j27K68o1k38L6K50q7k55J70J55m5k54
$$ 10 -285 77 118 -154 -144 -66 13 -155 -20 191 48 -79 189 128 -110 -74 176 89 -166 4 159 114 -140
7396a40m4M41m62J9L67L6l88J42J52l08Q7J59J55k68q7J10J79k42R0K10l8k38
$$ -140 -184 257 -205 -186 181 217 -171 -29 123 -185 -98 61 216 -52 -139 -29 150 -92 -2 208 170 -68
7418f8N7J38j91q6J58K04k90j88L38r2n6O7J69l7k11J19J77k82l1J37Q1j60k0
$$ -68 -11 127 -64 -150 8 212 -78 -266 72 -20 -76 -9 160 123 -88 31 208 -74 -105 32 113 -47 -67
7441f7J94pl01L48j65j00j4J63k5j34p2M06j03k96L42r9K5k26J27J84k50n6L00
$$ -67 127 120 -181 167 2 -98 -112 51 26 -108 -180 226 123 -173 169 70 95 -131 -4 180 -70 -126 174
7464A74l48O9O3K03l3m59L47J95l13r3L09k6q9P4J92k44j40K29o8j38k2J79J20
$$ 174 -174 -105 -42 161 128 -331 16 211 -102 -195 114 88 -1 73 265 21 -119 110 42 -96 -118 61 181
7487A81l34J08K17r6k16R9J94k49L6rJ04k24J26O7j56OK50j5k52JL92j36l14J35
$$ 181 -153 -45 172 76 -140 -41 153 -96 -60 -69 35 -189 -63 4 -152 -146 104 89 -163 -162 230 94 -220 -85
7511h5P9R5l07J06M66m68l9J90p4j94L74j43Rj04Q7L2k12J90J24Ok68kK18m3k12
$$ -85 -6 89 -218 -112 354 -114 -153 37 -37 -231 143 0 9 -95 -8 24 -188 2 126 132 -136 -138 80 37 -175
7536a75J46J89j73l8K35r1j02j57P9O4j57P9J88l7l44K80K7N3j75L76l9l42Q3
$$ -175 -29 160 -13 -51 184 93 -9 -166 -87 -23 -180 -101 87 50 -294 -14 13 66 -109 267 228 -114 -31
7559c1J68k15J9P5mk54J6M74k56j69J76Q0L6j42J72j5j50k4J07J52l93K28Kq2
$$ -31 137 -78 -59 16 12 -242 -226 248 -8 -177 -1 79 115 -27 145 130 -20 -44 63 215 -178 50 52 -30
7583c0J4o4J60o8l19M25n0k80J67J42j19k18K63K33k87o9K34j2l71K18K3M3p9
$$ -30 -16 -80 80 12 -307 118 68 -212 -45 97 -22 -240 23 256 -31 -100 134 122 -249 -31 -8 35 -44
7606d4R0J14k50j98L81K9k74Q6M7Q1k58L21J1j72j74J97J65k43J11J71n4k60K04
$$ -44 46 160 -90 -288 93 122 -152 -66 -19 62 -196 125 136 -36 -210 -13 152 -91 20 191 137 -123 81
7629H1J9p3j34J20O5k43J38R5J27k32lJ55j74j45J61J35r9j58K23J6j93kK99j65
$$ 81 100 27 -107 13 78 -165 -27 68 195 -37 -40 115 -59 -204 -43 92 -7 -165 58 74 -119 -121 178 13
7653A3j5J24l0o5K6R4J4j56j50L65p3j31j03O9n0p9K74q6j80K4K28P7l89J57J00
$$ 13 -2 122 92 27 53 147 161 5 -145 220 147 16 -87 -18 -68 -147 127 41 -139 -115 113 190 -199 -42 58
7678E8r3k6J38K8j62j17L75j24m04L01Ql0n5J66jj73N0N1J48j63K1K13j48j84
$$ 58 -35 -61 77 105 -57 -174 201 77 -327 -26 -18 -48 -103 63 62 -111 -61 -10 138 -25 -4 209 61 -123
7702a23lN01m58j18L82j61j91J16K28j81M4J1J17k04k69N36j94j44J40rO1j55
$$ -123 -126 375 -83 -201 181 20 -171 -55 173 -8 36 47 164 -40 -309 227 33 -111 29 20 81 -74
7724g4N6K91k74o8L1l8J2n1K99mk30Q1K29l28o3J23J15j59j34L24Mj37j79L61
$$ -74 -18 273 -1 -69 -38 -76 -64 -115 184 180 -50 31 260 -68 -131 -8 107 -52 -186 138 142 5 -174 187
7748A87j64n1J62mk63n2L54n3l08J61J69j72j96K78P9j89l6J39J12l10K29LL5
$$ 187 23 -28 134 130 -133 -185 169 116 -192 -31 138 -34 -230 48 127 -62 -98 41 153 -157 72 75 110
7771A10k13P6L8L2o9K1J06j79J79p9j12pQ7L27k93r2K48k6k28m6J49P5k16j4K28
$$ 110 -103 -27 11 43 -26 -5 101 -78 101 22 -90 -97 -10 317 24 -68 180 154 -74 -120 29 104 -112 -126 102
7796A02j40J68j47N7r4o7K30j0k13K4K66l7l38K27J22k89l6L14q6j52J12K6j38
$$ 102 -38 130 -17 40 -54 -121 109 99 -114 -90 176 139 -199 28 150 -139 -175 139 53 -99 13 39 -99
7819i9q4J91K24k46j41K28m6L6P2j31K03j74n3P1j98J21M5J51j47N9q6M8j07Q6
$$ -99 -183 8 232 -14 -155 73 27 63 135 4 207 33 -20 51 -147 -26 19 170 23 82 -4 44 -63 23
7843B3J75k36j13K29p2j99J26K04j14j8O6Q7j92j9L5K4p3l9K15l4k17J45J39k38
$$ 23 198 -38 -151 78 6 -193 -67 137 23 5 71 158 -34 -53 -18 6 -67 -106 109 75 -142 3 142 -96
7867i6N0L1J12p9j48K71k14k7R0O2qj32J40j1q6ml0pL3k5J15j65L6J17J42l33
$$ -96 -46 -15 97 18 -130 141 -73 -100 -10 52 44 -88 52 41 -45 -49 -79 -86 -53 -78 37 -128 -92 25 167 -166
7893a66j34K88J22j24r6K42k42J54j5O5j94M3N0R9k27m7J36K5Q6K3J45k55N1o8
$$ -166 -300 -12 110 -14 -110 132 -110 44 29 94 -100 -57 -7 92 -135 -182 -46 -21 65 88 233 -22 29 -39
7917c9j4M5j08P6K3m8K04o9mj37K26k34L7j43K03o4o5J69J0J33k17J00j93o2J66
$$ -39 -53 -8 -116 -40 -17 -65 139 70 66 -71 155 -79 -42 -185 18 -46 -111 58 68 201 -16 84 -109 -171 -5
7942eJ43K0k52J3J41j85N2K74k52l0J14j68K16j17q5K88l14J06J71k01J38J6J0
$$ -5 138 158 -94 -81 60 -125 -73 201 -51 -81 33 -135 81 -36 -121 167 -147 -41 130 -71 67 83 93
7965I3j69K27p0J07k46N3n7J51j04m1O1j9j12N9J69r5j23M4J49j33O2N0nm3J2
$$ 93 -76 151 81 188 -58 -5 -62 89 -15 -56 5 -14 -126 -67 102 7 -116 -72 77 -56 6 56 51 8 20
7990B0j43J88r7J10mj09rK46j08ok48L96l3k68j5J88j30J21n2m5K2n8m7Q4q4q5
$$ 20 -123 65 -32 78 74 -35 -44 202 94 88 -160 236 203 -65 -80 108 -22 99 47 2 24 -34 -81 3 -81 -166
8016a66L09j60J6m8J80j15j42J95J81m22P9J89r1k29M03k5l48J34l9J76j96K0
$$ -166 143 -17 -1 -49 131 16 -126 69 250 -172 -93 96 5 -224 179 154 -194 -60 -99 77 -119 -99
8038i9P8J90j13j26J71j15o8K16N1k46J63j50J89j01j1K1j65j41L27J9n2r1L1
$$ -99 -21 169 56 -70 101 -14 -82 134 185 -61 102 -48 141 40 29 50 -115 -256 71 90 38 -53 -22
8061b2n7j0K56l3k86J42Q7J76l02j51L98j86P8q1m5N3j46J34n2K2J32k8J12k64
$$ -22 -79 -89 167 134 -152 -10 77 253 -49 -200 198 12 90 9 -36 17 -129 5 -47 -25 107 79 191 -73
8085g3K3J27j07j60K15m9rp3L25j14l68P6J59J23j09r1J19j05J81l6j90K47r6
$$ -73 -50 77 -30 -190 25 -24 -33 -106 219 105 -263 -187 -28 95 -14 -105 14 -91 90 54 -136 111 15
8108A5N7j91O7l4K05j46m9J04n5j77J77J10j28j47Q4K01j39m2P8l9J30j84J30
$$ 15 72 -119 -52 -86 119 -27 -76 28 -27 -204 -27 83 -45 -192 -108 93 -46 -88 -10 -49 81 -103 27
8131B7k6j57K64J74l74J7M7K55p9q9j2Mj5j10J11J24j83J4R4j19P6O0Qj90l4J91
$$ 27 1 -156 108 282 -92 -75 -28 227 148 59 47 51 36 -74 37 161 -22 -8 86 -33 43 103 111 -79 -113 78
8157G8ll06K00L5J01k71L62j90J16j41p8J22o3o8J97j50J33L7j9m0j99J25J32
$$ 78 75 -231 -31 4 105 -166 196 6 122 -19 -97 25 -38 -106 91 -59 74 111 92 52 -147 -22 110
8180A10k72P7N7K3p3K30o8j15l1K34J0
$$ 110 -162 -85 -28 -5 -78 152 84 -31 -62 172 182
8191A82
$$ Imaginary data points
##PAGE= N=2
##DATA TABLE= (X++(I..I)), XYDATA
0@%%%%%%%%%%%%Qj6J4j4J6k4L2l2M0m8N6o4P2r3J14j30J46j70K01k26K53k92L36
$$ 0 0 0 0 0 0 0 0 0 0 0 0 0 8 -8 6 -8 8 -16 16 -16 24 -24 32 -32 40 -53 61 -69 77 -93 108 -118 135 -157 179
35A79l80M26m77N38o05O72p48Q34r28J030j137J256j392J536j687J858k051K261
$$ 179 -201 225 -252 286 -319 353 -395 439 -489 541 -596 660 -732 804 -883 975 -1076 1185
53A185k487K736l020L340l698M101m565N108n744O500p419Q564j0014J1869j4173
$$ 1185 -1302 1434 -1586 1754 -1944 2157 -2408 2700 -3044 3456 -3963 4601 -5413 6456 -7717
68g717J6053n967M98562m37011o48509P16681M33233p96913k38029Q86394k6563
$$ -7717 8336 2369 500931 63920 -584589 132092 565325 -231588 -469617 416777 390214
79C90214q77628K52293Q23778m87423o93176O41380M94627p88996k67810Q52230
$$ 390214 -487414 -235121 588657 101234 -591942 49438 544065 -244931 -512741 339489
89C39489M0212q52172J96188P81002m01909o60283N86635N10015o97158l19959
$$ 339489 379701 -472471 -276283 504719 102810 -557473 29162 539177 -157981 -477940
99d77940P69817J17399p78215R2723P50043k83865o64843M49025N25750o02579
$$ -477940 291877 409276 -368939 -276216 473827 189962 -474881 -25856 499894 -102685
109a02685l69661O97513J76963p53810K1705P43830k26243o82627M15207N75586
$$ -102685 -472346 225167 402130 -351680 -329975 413855 187612 -495015 -79808 495778
119D95778n57764m12235O65594K25254p16857k1398P19754j66832o59020L43133
$$ 495778 -61986 -474221 191373 416627 -300230 -321628 398126 231294 -427726 -84593
129h4593N53836m92592m22020N95052K60941o57040r3961O62134q9209o37199
$$ -84593 469243 -23349 -445369 149683 410624 -246416 -340377 321757 232548 -404651
139d04651K53588N68237l94987m54882N14295L13743n96275j47398O44403j8031
$$ -404651 -151063 417174 22187 -432695 81600 395343 -200932 -348330 296073 278042
149B78042o34348J90026N78428l48840m80589M80221L50105n71636j95157O10545
$$ 278042 -356306 -166280 412148 63308 -417281 62940 413045 -158591 -353748 256797
159B56797J9144o12961J47033N65851k98679m81209M20437L61132n09829k17691
$$ 256797 275941 -337020 -189987 375864 77185 -404024 16413 377545 -132284 -349975
169c49975N67521P2050n77784Q0571N52103k22419m86199L51357L92265m53997
$$ -349975 217546 289596 -288188 -207617 344486 122067 -364132 -12775 379490 -74507
179g4507k72760N22050J30455n56513J7573N48342j68250n04088L01059M19302
$$ -74507 -347267 174783 305238 -251275 -233702 314640 146390 -357698 -56639 362663
189C62663m13376l05109M93418J70019n34244k1875N37775j20595m98314K54170
$$ 362663 -50713 -355822 137596 307615 -226629 -248504 289271 168676 -329638 -75468
199g5468M26456l64152l23640M46756K01660m97531p0702N09955o4966m88969
$$ -75468 350988 -13164 -336804 109952 311612 -185919 -256621 253334 188368 -300601
209c00601J92691M33886l08324l52282L99686K45907m61737j21098M92833j1269
$$ -300601 -107910 325976 17652 -334630 65056 310963 -150774 -271872 220961 209692
219B09692m88566J43178M50576k61198l76628L60927K76189m34806j57593M75116
$$ 209692 -278874 -135696 314880 53682 -322946 37981 314170 -120636 -278229 196887
229A96887K9048m80153R8130M47895k18916l86616L21442K99178l97868j91618
$$ 196887 225935 -254218 -156088 291807 72891 -313725 7717 306895 -90973 -282591
239b82591M44756P2430m59101N2268M44382j68703l97658K72674L23201l56456
$$ -282591 162165 234595 -224506 -172238 272144 103441 -294217 -21543 301658 -54798
249e4798k26177M15670J13588m46619L044M43030j21664m08572K29956L43767
$$ -54798 -280975 134695 248283 -198336 -195292 247738 126074 -282498 -52542 291225
259B91225l22722k56627L90461J51998m27041l5379M34604q1436m09551J92072
$$ 291225 -31497 -288124 102337 254335 -172706 -208085 226519 145083 -264468 -72396
269g2396L58037k84596k79298L56702J81393m03436p2836M20967m0530m09004
$$ -72396 285641 1045 -278253 78449 259842 -143594 -216430 204537 164007 -244997
279b44997J47067L65372k45276k98052L24186K09730l79411j08503M06661k2m02972
$$ -244997 -97930 267442 22166 -275886 48300 258030 -121381 -229884 176777 176755 -226217
290b26217J09940L72883k09211l14979K93279K36016l53670j38572L89165L1947
$$ -226217 -116277 256606 47395 -267584 25695 261711 -91959 -230531 158634 190581
300A90581l97067P3800L75345j73975l26752K59068K53995l27403j65337L70157
$$ 190581 -206486 -132686 242659 68684 -258068 1000 254995 -72408 -237745 132412
310A32412O6639l85701L6560L73066j36258l33734K26408K73147k97226j92726
$$ 132412 199051 -186650 -150090 222976 86718 -247016 -20608 252539 -44687 -237413
320b37413L46352R9227l70675R86L69313r9949l42218J89123K89097k64805k16883
$$ -237413 108939 208166 -162509 -161523 207790 107841 -234377 -45254 243843 -20962 -237845
331b37845L22007J28751l55998l3766L63190o1904l43753J54730L00387k34577
$$ -237845 84162 212913 -143085 -176851 186339 124435 -219318 -64588 235799 1222
341A222k36363K97419J56913l36355o6137L51520k9101l42670J20184L09344k02124
$$ 1222 -235141 62278 219191 -117164 -183301 168219 139118 -203552 -83368 225976 23852
352B3852k54446K67353J80330l14763r5228L39370M609l39482Q5547L14577j68637
$$ 23852 -230594 36759 217089 -97674 -192902 146468 151077 -188405 -102858 211719 43082
363D3082k66599K40883K01699k93715j22302L25159L5050l31707N5163L15291
$$ 43082 -223517 17366 219065 -74650 -196952 128207 163257 -168450 -113287 202004
373B02004j40913k77105K13878K17913k70904j43934L07209N9620l22887K6663
$$ 202004 61091 -216014 -2136 215777 -55127 -199061 108148 167768 -155119 -128456
383a28456L14393j09836k82808J84649K31278k46277j63713K90348Q6831l11395
$$ -128456 185937 76101 -206707 -22058 209220 -37057 -200770 89578 176409 -134986
393a34986l096L10482q0372k87251J57905K44932k23080j84923K70652J10623
$$ -134986 -138082 172400 92028 -195223 -37318 207614 -15466 -200389 70263 180886
403A80886k99071k9570L05965n3335k91382J30324K54424j97249j99358K49780
$$ 180886 -118185 -147755 158210 104875 -186507 -56183 198241 992 -198366 51414
413E1414J31261k83976n5213K97563k3569k88451J00421K60100j69461k14103
$$ 51414 182675 -101301 -156514 141049 117480 -170971 -70550 189550 20089 -194014
423a94014K25948J54324k65499q3503K86023O007k87115P0961K68015j42293k29836
$$ -194014 31934 186258 -79241 -162744 123279 129286 -157829 -86868 181147 38854 -190982
434a90982K02739J74171k49002j05849K77717L0640k85151M5406K71320j18091
$$ -190982 11757 185928 -63074 -168923 108794 139434 -145717 -100311 171009 52918
444E2918k36599J82002J86592k31774j24290K62803N3544k74620K0447K67286
$$ 52918 -183681 -1679 184913 -46861 -171151 91652 145196 -129424 -108977 158309
454A58309r2199k42574J55026K01138k06762j44670K44438P8638k65727p943K68328
$$ 158309 66110 -176464 -21438 179700 -27062 -171732 72706 151344 -114383 -122326 146002
465A46002o2151k50393J29252K14804j87663j63993K32606J01495k59052l1475
$$ 146002 83851 -166542 -37290 177514 -10149 -174142 58464 159959 -99093 -130568
475a30568K65393m1331k53330J09856K22745j69462j76435K14694J16922k44362
$$ -130568 134825 93494 -159836 -49980 172765 3303 -173132 41562 158484 -85878
485h5878n0375K56291j7695k50039Q3547K26590j42397j86861J91691J35957k27264
$$ -85878 -136253 120038 102343 -147696 -64149 162441 20044 -166817 24874 160831 -66433
496f6433p5553K47498J0252k49749N6269K34086j19712k02378J74298J55162k16043
$$ -66433 -141986 105512 115764 -133985 -77716 156370 36658 -165720 8578 163740 -52303
507e2303r7072K40954L0670k48973L7777K37822j01740k09201J56992J65402j99738
$$ -52303 -149375 91579 122249 -126724 -88947 148875 47135 -162066 -5074 160328 -39410
518c9410j09294K28406M7963k39800J5352K33633p5991k10941J31578J74944j77724
$$ -39410 -148704 79702 127665 -112135 -96783 136850 60859 -150082 -18504 156440 -21284
529b1284j29055K10863P3508k29268j2393K32212n0553k20028J08853J91841j59609
$$ -21284 -150339 60524 134032 -95236 -107629 124583 74030 -145998 -37145 154696 -4913
540d913j48031J99410R2919k24688l1838K33681l0825k23568R1104J96754j44475
$$ -4913 -152944 46466 139385 -85303 -117141 116540 85715 -137853 -46749 150005 5530
551E530j56328J86119J06091k12734m9157K22923j0858k18204O8642J99400j20491
$$ 5530 -150798 35321 141412 -71322 -120479 102444 91586 -126618 -57976 141424 20933
562B0933j67244J63263J23187j94674p0863K14008J4420k18340M3263K06702r8298
$$ 20933 -146311 16952 140139 -54535 -125398 88610 103030 -115310 -72047 134655 36357
573C6357j80156J47164J40446j85794r0525K09727L3505k17826K5622K09569q3217
$$ 36357 -143799 3365 143811 -41983 -132508 77219 110724 -107102 -81480 128089 44872
584D4872j85868J33338J48985j72231j01418J97716M7762k08356Q389K05088o1564
$$ 44872 -140996 -7658 141327 -30904 -132322 65394 113156 -95200 -86811 118277 56713
595E6713j87642J09847J57495j50485j16890J80994O9066j99678j7409K03854
$$ 56713 -130929 -21082 136413 -14072 -130962 50032 119098 -80580 -97989 105865
605A05865l6579j93937Q8477J69980j34974j34460J71255Q8578j94098l5325K03016
$$ 105865 69286 -124651 -36174 133806 -1168 -135628 35627 124205 -69893 -105218 97798
616I7798k0525j96744P4014J76566j20319j42302J57564R8173j82880m8598J95037
$$ 97798 77273 -119471 -45457 131109 10790 -131512 26052 124225 -58655 -107253 87784
627H7784k993j92571N2950J76259r9650j49007J38922J12340j68091o8581J85280
$$ 87784 84791 -107780 -54830 121429 21779 -127228 11694 124034 -44057 -112638 72642
638G2642J8955j89667L2130J81654q0790j60458J23503J27076j56969q4042J80223
$$ 72642 91597 -98070 -65940 115714 34924 -125534 -2031 125045 -31924 -115966 64257
649F4257L4948j89547J6007J84164o5423j65068J10081J33991j45917r4479J70017
$$ 64257 99205 -90342 -74335 109829 44406 -120662 -10581 123410 -22507 -116986 53031
660E3031M8703j81195o5J79563m7950j65650R1575J41158j28029j06702J55212
$$ 53031 101734 -79461 -79526 100037 52087 -113563 -21988 119170 -8859 -115561 39651
671C9651O4893j72269j8798J77119k7761j69901P2502J50105j12702j19209J44821
$$ 39651 104544 -67725 -86523 90596 62835 -107066 -34564 115541 2839 -116370 28451
682B8451Q0159j66520l5485J75450j1590j70963N8098J54485r9894j26913J33183
$$ 28451 108610 -57910 -93395 82055 70465 -100498 -42400 112085 12191 -114722 18461
693A8461R1072j56224m8276J67869K485j67768M1834J56003q2557j33144J16903
$$ 18461 109533 -46691 -94967 72902 75387 -92381 -50547 105456 22899 -110245 6658
704F658J00615j43482o2304J59992K0030j64966K3494J57887o5683j39489J03569
$$ 6658 107273 -36209 -98513 61479 81509 -83457 -59963 97924 32241 -107248 -3679
715c679J12069j33107p6644J53207L4834j61377R610J58439n2279j44178R0088
$$ -3679 108390 -24717 -101361 51846 86680 -74697 -65087 93352 41073 -103105 -13017
726a3017J19258j21506q5595J43957M5988j55779m749J55936l6345j45154P4903
$$ -13017 106241 -15265 -100860 43097 89085 -66694 -71443 84493 48148 -97006 -22103
737b2103J24180j07886r5310J32954O0089j47932k0504J52443k0194j46827N9750
$$ -22103 102077 -5809 -101119 31835 91924 -56008 -76512 75931 55737 -91090 -31340
748c1340J30957r4202j05648J21984P2013j40596l3765J49629o298j47592M5160
$$ -31340 99617 5415 -100233 21751 93764 -46832 -80597 69032 62734 -84858 -39698
759c9698J34819q1410j11758J10981Q1649j32505m6418J43942Q044j45128L1305
$$ -39698 95121 13711 -98047 12934 94583 -37922 -84340 59602 67646 -77482 -46177
770d6177J35643o7470j17915R8792R1291j22220n7777J36866K0678j42245J7265
$$ -46177 89466 21996 -95919 2873 94164 -28056 -85833 51033 71711 -70534 -53269
781e3269J37681n3515j22743Q5999R8657j12053o8142J30438L3389j39083L795
$$ -53269 84412 30897 -91846 -5847 92810 -19243 -87385 43053 76442 -62641 -58846
792e8846J37105m0662j25397P4444J05205j02523p7680J22058M4638j33248q484
$$ -58846 78259 37597 -87800 -13356 91849 -10674 -88354 33704 78342 -54906 -63390
803f3390J35243k7983j27776O1509J10831r0381q5683J13054N5015j27530k1136
$$ -63390 71853 43870 -83906 -22397 88434 -1947 -87630 25424 80439 -47091 -68227
814f8227J32933j3907j28151M8148J14664p8972r3353J03844O5662j20651l3496
$$ -68227 64706 50799 -77352 -29204 85460 6488 -86865 16979 82641 -38010 -71506
825g1506J28735j571j28054L6047J18235o7282j00086R3234P4522j12938m3360
$$ -71506 57229 55658 -72396 -36349 81886 14604 -85482 7752 82274 -30664 -74024
836g4024J24287R970j26577K3364J19783n5164j04134Q3084Q1825j04843n3513
$$ -74024 50263 60233 -66344 -42980 76803 21639 -82495 589 82414 -22429 -75942
847g5942J18268K2316j23446J1083J19863m3458j08197P2142Q8669r5161o2765
$$ -75942 42326 64642 -58804 -47721 72142 28684 -79513 -7371 81298 -13863 -76628
858g6628J11421L2305j20056k82J19959l1497j10991O0829R3860q5945p0238J04721
$$ -76628 34793 67098 -52958 -53240 66719 35222 -75769 -14940 78920 -7025 -77263 27458
870B7458M2265j15471j1450J17673k0165j11542N0324R7714p6100p7571R6487
$$ 27458 69723 -45748 -57198 60475 40310 -71232 -20908 76806 706 -76865 19622
881A9622N1294j09206k1633J14684r087j12409L8879J01330o4965q3679Q7252
$$ 19622 70916 -38290 -59923 54761 45674 -66735 -27856 73474 8509 -75170 12082
892A2082N9865j03487l2012J11737K429j11638K7202J03767n5526q8430P8996
$$ 12082 71947 -31540 -63552 48185 50614 -61024 -33822 69945 14419 -74011 4985
903D985O7229r6508m1300J06744J2367j09470J7426J04675m5151r2122O8936P3144
$$ 4985 72214 -24294 -65594 41150 53517 -55953 -38527 66148 20997 -71125 -2189 70955
915G0955q7887m8909J01046K2020j06944O270J04694l3969r5107N9488P8623q0457
$$ 70955 -16932 -65841 35205 57225 -49719 -43449 61245 27276 -67831 -8343 70280 -10177
927a0177n7451R5318L2091j03418m257J04095k4302r7340N0193Q3932p2202o3728
$$ -10177 -67628 27690 59781 -43637 -47894 56201 31899 -65441 -15248 68684 -3518 -67246
939f7246Q8548L9696r8980j2789J02235j3968r7702L9432Q6786o2661o9595Q1039
$$ -67246 21302 60998 -37982 -50771 51464 37496 -60206 -20774 66012 3351 -66244 14795
951A4795M8232r3695k3430R8745k852r7805K9342Q9700n3397p5554P3153N5933
$$ 14795 63027 -30668 -54098 44647 41795 -56010 -26668 63032 9635 -65919 7234 63167
963F3167q7843l1866R6312N825r7781K0266R2329m4944p9400O6036O1101q2346
$$ 63167 -24676 -56542 39770 45595 -52186 -31920 60409 15465 -63935 2101 63202 -19144
975a9144l8956R2487J4487r5525J1311R1463l5742q1863N7346O6537p4436m6688
$$ -19144 -58100 34387 48874 -46651 -35340 56123 20381 -61482 -4136 62401 -12035 -58723
987e8723Q6189K3571r2147J069R1994k5452q5159M7718P2173o6689n4114Q1341
$$ -58723 27466 51037 -41110 -40041 51953 26501 -58658 -10940 61233 -5456 -59570 21771
999B1771L2057r0179q041R1970j6628q6844M0238P5707o0769n9177P6023L8876
$$ 21771 53828 -36351 -44392 47578 30950 -55894 -15656 60051 -718 -59895 16128 55004
1011E5004q5649j5079Q8809q782q6467L2141P7542n2230o3106O8476M4423q0222
$$ 55004 -30645 -45724 43085 34303 -52164 -20023 57519 5289 -57817 10659 55082 -25140
1023b5140k3108Q6246O13q6459K2376P9680m3801o8134O2141N1797p6110l1433
$$ -25140 -48248 37998 38611 -47848 -25472 54208 10407 -57727 4414 56211 -19899 -51332
1035e1332Q4177Q710q6060J4654Q2471l7200p1754N6076N6479p0631l6791Q0193
$$ -51332 32845 41555 -44505 -29851 52620 15420 -56334 -258 56221 -14410 -51201 28992
1047B8992J5025q4198P387Q1592k8886p3235M8149N9543o3951m2474P4714K3026
$$ 28992 44017 -40181 -32794 48798 19912 -53323 -5174 54369 -9582 -52056 22658 45684
1059D5684q0519j788Q0510j9719p5137L9919O4850n7059m9577P0297L0404p8118
$$ 45684 -34835 -36623 43887 24168 -50969 -11050 53800 -3259 -52836 17461 47865 -30253
1071c0253r328Q1018j2546p7552L3236O7864n1217n3485O5562L5513p5017j5534
$$ -30253 -39581 41437 28891 -48661 -15425 52439 1222 -52263 13299 48812 -26205 -41739
1083d1739P8538n594p6168K6066O8538m4170n6793N8953M1098o9114k2646P4809
$$ -41739 36799 31205 -44963 -18897 49641 5471 -51322 7631 48729 -20385 -43031 31778
1095C1778K673p5536J7246P1284l5998o1612N2335M7030o4971k9589P3244J0018
$$ 31778 34451 -41085 -23839 47445 11447 -50165 2170 49200 -15771 -45360 27884 37902
1107C7902p5650J0084P2516k9739o4070M7377N1070o0785l4486O9345J5655p3039
$$ 37902 -37748 -27664 44852 15113 -48957 -1580 49490 -11295 -45781 23564 39219 -33820
1119c3820M045P1703k3268o5253M0240N4010n4050l9122O3756K2308p0112l760
$$ -33820 -29775 41928 18660 -46593 -6353 47657 -6393 -45515 18241 40549 -29563 -33323
1131c3323P0956j4807o6458L2351N7761m8063m4746O0274K8858o7694j0618P0435
$$ -33323 37633 22826 -43632 -11281 46480 -1583 -46329 13945 42803 -24891 -35509 34926
1143C4926q850o7547K7159O0170m3310m8511N5857L3001o4463j5403O8023k727
$$ 34926 26076 -41471 -14312 45858 2548 -45963 9894 42895 -21568 -36971 31052 28325
$$ [...]
8191A74
##END NTUPLES=NMR FID
##END=
