##TITLE=1H_4xp
 CDCl3
 8 sc, 
 3.11.2023
##JCAMPDX= 6.0         $$ Bruker NMR JCAMP-DX V2.0
##DATA TYPE= NMR FID
##DATA CLASS= NTUPLES
##ORIGIN= UXNMR, Bruker Analytische Messtechnik GmbH
##OWNER= root
$$ XWIN-NMR		Version 3.5
$$ Fri Nov  3 15:46:46 2023 Russian Standard Time (UT+4h)  she@DPX200
##.OBSERVE FREQUENCY= 200.1313
##.OBSERVE NUCLEUS= ^1H
##.DELAY= (6, 6)
##.ACQUISITION MODE= SIMULTANEOUS
##.ACQUISITION SCHEME= undefined
##.AVERAGES= 8
##.DIGITISER RES= 18
##SPECTROMETER/DATA SYSTEM= spect
##.PULSE SEQUENCE= zg30
##.SOLVENT NAME= D2O
##.SHIFT REFERENCE= (INTERNAL, D2O, 0, 15.7039)
##AUDIT TRAIL= $$ (NUMBER, WHEN, WHO, WHERE, WHAT)
$$ ##TITLE= Audit trail, XWIN-NMR		Version 3.5
$$ ##JCAMPDX= 5.01
$$ ##ORIGIN= Bruker BioSpin GmbH
$$ ##OWNER= she
$$ F:/spectra/data/she/nmr/H-F/1/audita.txt
$$ ##AUDIT TRAIL=  $$ (NUMBER, WHEN, WHO, WHERE, WHAT)
(   1,<2023-11-03 15:46:04.45 +0400>,<she>,<DPX200>,
      <created by zg, POWCHK disabled, PULCHK disabled
       configuration hash MD5:
       00 E9 B6 7A A2 85 ED C7 34 08 36 98 17 FE 4E 26
       data hash MD5: 16K
       CE A6 2E 6D 98 5D 25 87 45 56 C5 34 17 3D EF FB>)
$$ ##END=
$$ 
$$ hash MD5
$$ 09 B7 5C F9 09 A3 EA 07 D1 EF 7A 78 58 35 CE 50
##$RELAX= 
##$RELAX= 
##$RELAX= 
##$RELAX= 
##$RELAX= 
##$RELAX= 
$$ Bruker specific parameters
$$ --------------------------
##$DU= <F:/spectra>
##$EXPNO= 1
##$NAME= <H-F>
##$PROCNO= 1
##$TYPE= <nmr>
##$USER= <she>
##$AMP= (0..31)
100 100 100 100 100 100 100 100 100 100 100 100 100 100 100 100 100 100 
100 100 100 100 100 100 100 100 100 100 100 100 100 100 
##$AQSEQ= 0
##$AQ_mod= 1
##$AUNM= <au_zg>
##$AUTOPOS= <>
##$BF1= 200.13
##$BF2= 200.13
##$BF3= 200.13
##$BF4= 200.13
##$BF5= 200.13
##$BF6= 200.13
##$BF7= 200.13
##$BF8= 200.13
##$BYTORDA= 1
##$CFDGTYP= 0
##$CFRGTYP= 5
##$CHEMSTR= <none>
##$CNST= (0..31)
1 1 145 1 1 1 1 1 1 1 1 1 1 1 1 1 1 1 1 1 1 1 1 1 1 1 1 1 1 1 1 1 
##$CPDPRG= <>
##$CPDPRG1= <>
##$CPDPRG2= <>
##$CPDPRG3= <>
##$CPDPRG4= <mlev>
##$CPDPRG5= <mlev>
##$CPDPRG6= <mlev>
##$CPDPRG7= <mlev>
##$CPDPRG8= <mlev>
##$CPDPRGB= <>
##$CPDPRGT= <>
##$D= (0..31)
0 1.2 0 0 0 0 0 0 0 0.06 0 0.03 0 0 0 0 0.0002 0 0 0 0 0 0 0 0 0 0 0 0 
0 0 0 
##$DATE= 1699011963
##$DBL= (0..7)
120 120 120 120 120 120 120 120 
##$DBP= (0..7)
150 150 150 150 150 150 150 150 
##$DBP07= 0
##$DBPNAM0= <>
##$DBPNAM1= <>
##$DBPNAM2= <>
##$DBPNAM3= <>
##$DBPNAM4= <>
##$DBPNAM5= <>
##$DBPNAM6= <>
##$DBPNAM7= <>
##$DBPOAL= (0..7)
0.5 0.5 0.5 0.5 0.5 0.5 0.5 0.5 
##$DBPOFFS= (0..7)
0 0 0 0 0 0 0 0 
##$DE= 6
##$DECBNUC= <off>
##$DECIM= 32
##$DECNUC= <off>
##$DECSTAT= 4
##$DIGMOD= 1
##$DIGTYP= 9
##$DL= (0..7)
0 120 120 120 120 120 120 120 
##$DP= (0..7)
150 150 150 150 150 150 150 150 
##$DP07= 0
##$DPNAME0= <>
##$DPNAME1= <>
##$DPNAME2= <>
##$DPNAME3= <>
##$DPNAME4= <>
##$DPNAME5= <>
##$DPNAME6= <>
##$DPNAME7= <>
##$DPOAL= (0..7)
0.5 0.5 0.5 0.5 0.5 0.5 0.5 0.5 
##$DPOFFS= (0..7)
0 0 0 0 0 0 0 0 
##$DQDMODE= 0
##$DR= 18
##$DS= 0
##$DSLIST= <SSSSSSSSSSSSSSS>
##$DSPFIRM= 0
$$ [...]
##$SUBNAM2= <"">
##$SUBNAM3= <"">
##$SUBNAM4= <"">
##$SUBNAM5= <"">
##$SUBNAM6= <"">
##$SUBNAM7= <"">
##$SUBNAM8= <"">
##$SUBNAM9= <"">
##$SW= 18.0517328524113
##$SWIBOX= (0..15)
0 0 2 0 0 0 0 0 0 0 0 0 0 0 0 0 
##$SW_h= 3612.71676300578
##$TD= 16384
##$TD0= 1
##$TE= 0
##$TE2= 300
##$TE3= 300
##$TEG= 300
##$TL= (0..7)
0 120 120 120 120 120 120 120 
##$TP= (0..7)
150 150 150 150 150 150 150 150 
##$TP07= 0
##$TPNAME0= <>
##$TPNAME1= <>
##$TPNAME2= <>
##$TPNAME3= <>
##$TPNAME4= <>
##$TPNAME5= <>
##$TPNAME6= <>
##$TPNAME7= <>
##$TPOAL= (0..7)
0.5 0.5 0.5 0.5 0.5 0.5 0.5 0.5 
##$TPOFFS= (0..7)
0 0 0 0 0 0 0 0 
##$TUNHIN= 0
##$TUNHOUT= 0
##$TUNXOUT= 0
##$USERA1= <user>
##$USERA2= <user>
##$USERA3= <user>
##$USERA4= <user>
##$USERA5= <user>
##$V9= 5
##$VALIST= <valist>
##$VCLIST= <CCCCCCCCCCCCCCC>
##$VD= 0
##$VDLIST= <DDDDDDDDDDDDDDD>
##$VPLIST= <PPPPPPPPPPPPPPP>
##$VTLIST= <TTTTTTTTTTTTTTT>
##$WBST= 1024
##$WBSW= 4
##$XGAIN= (0..3)
0 0 0 0 
##$XL= 0
##$YL= 0
##$YMAX_a= 278942
##$YMIN_a= -224973
##$ZGOPTNS= <>
##$ZL1= 120
##$ZL2= 120
##$ZL3= 120
##$ZL4= 120
##$ABSF1= 10
##$ABSF2= 0
##$ABSG= 5
##$ABSL= 3
##$ALPHA= 0
##$AQORDER= 0
##$ASSFAC= 0
##$ASSFACI= 0
##$ASSFACX= 0
##$ASSWID= 0
##$AUNMP= <proc_1d>
##$AZFE= 0.1
##$AZFW= 0.1
##$BCFW= 1
##$BC_mod= 2
##$BYTORDP= 1
##$COROFFS= 0
##$CY= 11.3945322036743
##$DATMOD= 1
##$DC= 2
##$DFILT= <>
##$DTYPP= 0
##$F1P= 15.7292609196834
##$F2P= 12.9074282941183
##$FCOR= 0.5
##$FTSIZE= 0
##$FT_mod= 4
##$GAMMA= 1
##$GB= 0.15
##$INTBC= 1
##$INTSCL= 1
##$ISEN= 128
##$LB= 0.24
##$LEV0= 0
##$LPBIN= 0
##$MAXI= 10000
##$MC2= 0
##$MEAN= 0
##$ME_mod= 0
##$MI= 1.114404
##$NCOEF= 0
##$NC_proc= 0
##$NLEV= 6
##$NOISF1= 3.799351
##$NOISF2= 2.8
##$NSP= 1
##$NTH_PI= 0
##$NZP= 0
##$OFFSET= 15.70392
##$PC= 1
##$PHC0= -23876.74
##$PHC1= 15.85269
##$PH_mod= 1
##$PKNL= yes
##$PPARMOD= 0
##$PSCAL= 0
##$PSIGN= 0
##$REVERSE= no
##$SF= 200.130013532006
##$SI= 16384
##$SIGF1= 3
##$SIGF2= 2
##$SINO= 400
##$SIOLD= 16384
##$SREGLST= <1H.CDCl3>
##$SSB= 0
##$STSI= 0
##$STSR= 0
##$SW_p= 3612.71676300578
##$SYMM= 0
##$S_DEV= 0
##$TDeff= 0
##$TDoff= 0
##$TI= <>
##$TILT= no
##$TM1= 0
##$TM2= 0
##$TOPLEV= 0
##$USERP1= <user>
##$USERP2= <user>
##$USERP3= <user>
##$USERP4= <user>
##$USERP5= <user>
##$WDW= 1
##$XDIM= 8192
##$YMAX_p= 0
##$YMIN_p= 0
$$ End of Bruker specific parameters
$$ ---------------------------------
##NTUPLES= NMR FID
##VAR_NAME=  TIME,          FID/REAL,        FID/IMAG
##SYMBOL=    X,             R,               I
##VAR_TYPE=  INDEPENDENT,   DEPENDENT,       DEPENDENT
##VAR_FORM=  AFFN,          ASDF,            ASDF
##VAR_DIM=   8192,          8192,            8192
##UNITS=     SECONDS,       ARBITRARY UNITS, ARBITRARY UNITS
##FACTOR=    0.0002768,     1,               1
##FIRST=     0,             0,               0
##LAST=      2.2672688,     0,               0
##MIN=       0,             -224973,         0
##MAX=       2.2672688,     278942,          0
$$ Real data points
##PAGE= N=1
##DATA TABLE= (X++(R..R)), XYDATA
0 0 0 0 0 0 0 0 0 0 0 0 0 0 0 0 0 -8 8 -8 8 -8 16 -16 16 -23 24 -29 32 -39 44 -49 57 -65 72 -82 92 -103 116
37 116 -131 144 -160 179 -196 219 -242 267 -295 324 -359 393 -433 479 -528 581 -643 711 -789
56 -789 879 -985 1108 -1256 1438 -1665 1960 -2361 2928 -3801 5288 -8275 16483 -81739 -217256
71 -217256 144953 174208 -38410 154466 278942 -14180 -61601 74976 -88024 -173602 6152
82 6152 -37674 -155539 -13046 38648 -68874 35755 144634 22355 -14529 68148 -3104
93 -3104 -66556 27956 58222 747 15199 22144 -31362 -43247 -28322 -36654 -30017 -26456 -42227
106 -42227 -28830 1869 19423 53956 87200 78974 57695 36698 3442 -20615 -37343 -58916
118 -58916 -65575 -70571 -83599 -53153 -433 16841 49252 101311 81090 36509 49061 32532
130 32532 -24405 -19075 -6870 -58069 -69087 -31500 -42048 -37682 24218 30983 3424 33163 37071
143 37071 -11356 6583 45776 4712 -15000 25164 4288 -39233 444 27512 -17748 -22286
155 -22286 5591 -31133 -58170 -11555 7212 -10473 24198 52900 15344 10514 45813 18237
167 18237 -16875 13696 5182 -55402 -40037 1006 -31867 -31129 31650 19817 -20713 20844 37785
180 37785 -11536 5925 43890 -4853 -30087 10705 -8798 -42934 3306 22106 -18235 -630
192 -630 29700 -6930 -14266 23429 5195 -20528 6935 6147 -23931 -4379 16372 -5239 -1409
205 -1409 18770 -392 -12574 6326 1699 -10208 5698 7927 -8444 -1521 6605 -6715 -3422
218 -3422 9253 -1138 -8388 3471 416 -8772 3211 9187 -2392 -10 8338 -2316 -7282 4513
232 4513 3251 -8313 -1388 5134 -6005 -6488 7663 4523 -4065 5235 8039 -5391 -3637 6246
246 6246 -2954 -8879 2809 1061 -10423 -1497 6761 -3624 -3185 9014 3670 -4520 5280 7600
260 7600 -2526 747 7721 -602 -6117 571 -1520 -9725 -6573 -1136 -6055 -5941 3262 4929 1555
275 1555 7199 12288 6219 2673 6716 2588 -6646 -5289 -2744 -9765 -10183 -2517 -3725 -6675 2295
290 2295 7263 2623 5602 11694 5323 42 4424 1519 -6033 -4358 -2074 -6433 -6363 -207 -695 -1808
306 -1808 2543 3469 641 1631 4117 2937 1202 2266 1868 -648 -2912 -3028 -2967 -4421 -4787 -2402 -1134
323 -1134 -1620 2142 5476 4018 3955 6589 3887 449 2082 1681 -4131 -4988 -2936 -6708 -8209 -3125
339 -3125 -1118 -3423 475 5231 3988 4756 8660 7286 2841 2906 2350 -2802 -4631 -2713 -4874 -8018
355 -8018 -5854 -2914 -3679 -2270 3778 4989 2390 5259 7550 2786 1310 3963 -240 -5762 -2539
370 -2539 -1444 -5869 -2957 2860 -1103 -2764 3276 2777 -1915 1467 3468 -2197 -2396 1406 -1269 -2769
386 -2769 2012 2108 -971 1086 2719 -448 -642 1477 473 -1129 -226 605 -58 -343 470 1150 -417
403 -417 -1975 -1299 -1245 -3227 -2703 -219 -434 170 3630 4374 2982 4355 4808 1885 397 -97 -3003 -6697
421 -6697 -6397 -4304 -4598 -2745 1447 3266 1357 2767 6032 3458 1271 3681 1075 -4983 -2907 435
437 435 -3549 -1340 4358 120 -3463 1390 992 -3447 1268 3434 -3320 -3200 1479 -1997 -1435 4804
453 4804 4208 20 1337 427 -2518 212 1154 -473 -231 -2585 -4577 -404 960 493 5434 4212
469 4212 -3194 -746 1349 -6022 -1903 5918 -3372 -5566 5220 71 -6070 8684 9334 -5514 1734
484 1734 6843 -9921 -7654 8447 -2986 -8397 7880 1465 -11358 4572 8599 -6777 2791
497 2791 10457 -7787 -7071 7821 -3426 -7294 10485 3442 -9682 4299 4749 -9515 2505 10431
511 10431 -6287 -3641 6946 -7788 -8757 9036 899 -7717 7437 4202 -10821 2320 9846
524 9846 -5096 -423 10431 -4218 -8063 5867 918 -5569 6079 4009 -8232 -2379 2327 -5665
538 -5665 -1950 5586 -896 -3765 1950 398 -613 5536 4982 1021 1281 -675 -3644 -1597 75 -432
554 -432 -197 -2636 -4754 -1644 -1714 -1197 4804 4712 -1693 612 3298 -2563 -62 6898 1540 -3600 1172
571 1172 -1921 -7215 48 3929 -2809 -582 3507 -4507 -4772 4885 3484 -1588 3810 4532 -5493
586 -5493 -4791 3334 -23 -2623 3836 2431 -5415 -2204 2738 -236 -25 5697 1429 -4258 -561 534
602 534 -3484 703 4646 -2032 -4448 929 -1924 -4133 4544 5520 -1940 1205 3459 -3486 -1162 6678
618 6678 723 -2647 3530 -1499 -8145 121 2235 -5305 -357 4431 -5225 -3922 6492 1266 -1942
633 -1942 7999 4525 -5734 1170 4857 -4941 -2170 5543 -2855 -7257 1654 130 -5540 1642 5086
648 5086 -2180 -1637 3114 -588 -1836 3556 2770 -1295 436 1338 -1768 -1381 1672 971 -1267 -873 372
665 372 -1456 -2343 1350 2328 -842 -752 1674 -1747 -3023 1597 1674 -1549 718 2332 -1916 -1459 2574
682 2574 722 -615 2529 1057 -2309 -412 1032 -1351 -313 617 -1951 -2893 -1041 -646 -192 1734
698 1734 2277 936 570 309 216 662 1119 768 516 -466 -1175 -826 -438 -986 -596 -728 -1936 -1026 -73 501
718 501 1306 1676 318 385 275 -377 206 1452 560 -365 1087 -307 -1642 388 256 -2054 -216 600
736 600 -1579 -652 1583 -643 -1002 1720 11 -1727 1373 1716 -1106 842 2606 -897 -1034 1472
752 1472 -537 -2462 883 608 -2354 110 1438 -1612 -1078 1381 -715 -1243 1425 1150 -674 703
768 703 1509 -157 -25 1189 132 -361 322 -68 -734 -453 -579 -911 -768 -854 -427 -31 34 774 1286 147
788 147 -371 787 343 -747 572 1160 -378 -149 1125 -213 -1108 596 -394 -1669 -730 499 -863
805 -863 -615 967 11 -1006 982 767 -462 757 1523 33 175 1049 71 -755 0 -354 -1425 -627
823 -627 -65 -285 -288 220 -315 -667 11 -190 -29 358 758 696 1002 552 356 429 72 -538 -37 -278 -863 -503
845 -503 -253 -801 -670 5 -50 -534 480 829 59 -87 1013 149 -184 925 675 -459 420 720 -552
864 -552 -511 498 -444 -645 -154 -460 -1142 -117 267 -358 209 642 450 153 580 288 662 658 119 228 150
885 150 -141 -274 317 -634 -778 44 -442 -1305 -203 248 -934 -142 987 -173 -188 1222 547 3 1204
904 1204 1140 -504 179 728 -833 -512 381 -761 -846 -318 -455 -614 -26 339 -101 57 -161 283 548 537
924 537 679 1177 23 -223 1015 68 -1069 392 506 -1981 -840 887 -1242 -1015 1765 -108 -1992
941 -1992 1432 1026 -1703 876 2580 -1125 -828 2347 -540 -1718 2119 924 -2170 547 1322 -2557
957 -2557 -943 1520 -1077 -1509 1591 -143 -1662 1288 1050 -927 1269 1984 -798 -309 1215 -954
973 -954 -233 1718 129 -998 540 -393 -1498 197 511 -1124 -490 380 -1522 -661 1239 213 71
990 71 1210 703 -464 42 311 153 346 427 -345 -1056 -967 -435 15 -172 253 149 -1132 -1010 416 324
1010 324 -253 1234 900 -978 -278 1072 -111 -30 1785 250 -1874 -317 240 -1676 8 1094 -935
1027 -935 -1513 259 -75 -1118 1223 1775 -353 -390 834 -485 -385 1455 1124 -562 -58 208 -1269
1044 -1269 -739 1324 90 -1248 301 -471 -1935 -322 1434 -153 77 1552 -196 -1567 927 1502
1060 1502 -156 883 1769 -1472 -1476 468 -522 -1271 1483 429 -2012 -714 66 -1120 331 2762 262
1077 262 -872 983 -291 -1356 1174 1674 -508 351 427 -1504 -1063 898 458 -512 361 -466 -1726
1094 -1726 -715 333 105 833 1463 -577 -1332 123 103 138 1304 1055 -611 -1123 -571 -434 134 518
1112 518 449 -596 -1026 -630 -438 -454 658 1067 -819 -746 64 -559 -408 2129 1283 -587 286 820 -1268
1131 -1268 -644 1362 97 -1589 344 -458 -2157 12 1247 -597 -143 1052 -609 -600 942 783 -5
1148 -5 1178 966 -746 -296 429 -624 258 818 -644 -968 -356 -616 -486 647 557 -119 -79 34 -445 449
1168 449 752 569 636 242 -332 -569 211 197 365 -22 -212 -672 -510 -407 64 509 -10 -149 -100 -590 -457
1189 -457 766 512 218 575 421 -258 21 576 122 -21 459 -549 -1028 172 -379 -1044 447 548 -937
1208 -937 -52 1017 -390 -349 1280 692 -258 848 478 -489 380 730 -623 -643 512 -911 -940 380
1226 380 -88 -1081 157 356 -866 -428 843 -49 -110 877 477 -369 280 339 -195 48 150 -177 -617 -298
1246 -298 -278 -686 -33 -114 -240 -40 98 51 71 473 242 122 222 161 258 60 277 18 -177 103 -436 -138
1268 -138 -29 -229 -504 -150 -354 -614 -41 49 -28 88 558 77 100 370 226 -43 326 227 -275 -267 39 -82
1290 -82 -484 -142 147 -261 -421 41 74 -322 81 124 -136 44 329 509 476 394 457 297 72 230 -152 -753
1312 -753 -182 -389 -435 -382 106 -114 -262 237 43 60 456 422 -145 222 346 -209 -152 133 -281 -103 35 347
1334 347 -251 -114 62 -253 -607 -263 -338 -332 302 109 208 315 358 477 522 178 285 265 -141 -249 17 -1 -281
1357 -281 -233 61 -26 -475 131 -282 -313 22 84 -49 289 311 127 351 386 260 82 426 491 66 -190 -183 -375
1380 -375 -411 -424 -369 -337 -52 -263 13 99 67 213 411 -8 96 132 150 106 295 531 32 86 -111 -334 -210
1403 -210 6 -567 -396 -336 -452 -587 236 192 236 325 577 -166 725 382 -16 -50 -29 -328 -398 53 -126 -160 -133
1426 -133 142 -168 30 -368 -241 -175 1 30 136 194 -145 413 595 144 279 498 -21 -203 80 -151 -485
1447 -485 -227 -242 -695 -196 262 -29 -41 309 -42 -87 102 -54 -213 158 498 363 179 373 90 179 88 70
1469 70 -276 -23 -340 -200 -227 -91 169 -4 203 255 99 134 169 296 338 241 -84 -73 -240 -164 -73 144 257
1492 257 -322 -381 -335 -16 -177 172 -12 -37 110 2 -70 88 548 235 305 269 -119 -214 106 -131 -300 302
1514 302 255 -473 -240 -219 -253 -57 526 -115 -48 -2 -36 -207 274 505 -57 12 253 -88 -110 -55 -133 -145 -135 -497
1538 -497 -194 -135 -346 146 97 -430 16 202 -86 -77 427 145 -256 179 128 -300 115 533 -33 -613 -66 -189
1560 -189 -675 -204 63 -24 -183 316 10 237 357 257 285 237 50 201 -57 -79 226 365 -7 -123 -97 -179
1582 -179 -498 -137 205 -239 -233 249 -290 52 202 172 15 186 231 -175 139 319 -305 68 -73 -281 -415
1603 -415 -46 -146 -392 495 188 -185 93 -17 -270 141 280 54 235 294 74 83 189 384 -106 209 -138
1624 -138 -296 -301 -179 -301 117 75 -342 -2 204 35 358 276 38 104 330 110 33 457 275 -96 116 1
1646 1 -298 -116 -55 -267 -447 0 -63 -265 276 244 40 225 106 -135 -20 232 -236 -13 170 -50 -107 144
1668 144 -218 -150 -99 -372 -343 -280 -172 -251 27 175 45 -72 626 -71 209 489 -11 -109 62 57 -152 -138 55
1691 55 -19 -465 -319 53 -85 -94 73 -321 -229 227 118 211 119 193 313 -17 208 42 157 157 77 -69 -293 -57
1715 -57 -123 -100 -223 -230 -243 -238 112 -27 170 341 119 246 257 302 116 76 -293 -60 -154 13 109 -105 -208 -291 -112
1740 -112 -146 -73 102 92 -62 180 -27 -80 19 417 126 -129 9 -199 117 229 -115 -110 133 -184 -114 -291 -106
1763 -106 -149 -226 -164 -131 -133 93 134 26 356 29 126 377 -87 340 -38 -23 -228 -24 -50 -74 -168 -63 -63 -193 -20
1788 -20 -274 -286 -138 -17 -64 214 179 123 156 362 54 293 -91 -47 -426 -68 -42 -89 -79 -206 -70 -107 225 -188
1812 -188 331 65 335 213 408 -79 -94 178 39 -145 44 39 -285 -321 -346 -206 -331 80 -165 32 228 -98
1834 -98 -26 -16 162 119 159 311 -74 198 20 35 176 332 -275 -8 -214 -295 -150 -251 -205 73 -230 59 56
1857 56 54 105 36 344 304 59 -45 150 427 146 -9 -49 -171 122 -327 -205 106 30 -119 -224 51 18 -73
1880 -73 211 329 -88 110 -5 -116 -13 222 372 -344 -67 -69 -147 -115 -491 -101 -113 -120 299 -52 52 310 150
1903 150 211 193 501 229 35 75 74 -129 76 -22 -324 193 -190 -261 49 -258 -230 -149 -241 -46 -133 141 -83 -48
1927 -48 165 260 424 -100 54 312 17 81 22 -206 -158 -200 -394 -193 -132 -39 -99 -142 -89 -25 256 249 -19 275 127
1952 127 -55 155 26 -80 24 82 229 -305 -239 -84 -220 -181 143 -225 -153 32 36 28 61 270 -30 91 362
1975 362 391 -124 -77 -52 -186 -277 231 -263 -228 -52 141 -386 56 138 -60 39 -156 -41 60 374 -39 199
1997 199 252 125 25 15 1 120 129 -177 -48 -29 -2 -93 64 8 -136 153 -88 298 222 128 73 275 278 65 31
2022 31 197 -106 -25 66 -144 -384 -64 -47 -239 39 184 -211 -25 176 62 -95 216 174 -169 476 179 -181
2044 -181 -142 392 -120 -310 390 -149 -336 66 84 -209 -112 63 -349 -395 280 68 -133 498 442 -76 224 116
2066 116 -126 302 436 14 -134 114 -95 -279 142 316 -135 -39 -64 2 -174 -18 422 -26 -49 158 138 -140
2088 -140 398 91 -233 197 187 -352 -38 277 134 -110 123 -148 -344 -139 251 111 -235 426 -50 -66 -9
2109 -9 146 2 198 418 -135 -51 95 -350 -221 -97 19 -261 67 -24 -203 17 341 11 -192 341 181
2130 181 -193 199 102 -116 -142 233 -154 -163 146 -153 -434 -109 104 -310 -191 62 -47 -173 122 319 -130
2151 -130 290 86 -71 46 250 197 -307 265 39 -401 -103 159 -91 -257 -64 -104 -216 123 -248 -66 -11
2172 -11 136 -36 -81 353 54 83 -42 -68 -85 -273 223 11 -112 -126 -26 -127 99 94 229 58 343 146 -52
2195 -52 311 143 -168 184 -97 -99 154 135 -224 -340 -152 -114 -432 -125 31 -7 -60 74 145 -88 -20 122 -141
2218 -141 -69 287 115 97 209 67 -163 -306 151 -172 -109 -54 -123 -196 212 15 -217 92 8 9 -1 284 93
2241 93 156 276 7 -10 112 66 -94 158 124 -94 100 -96 -168 -423 47 -26 85 67 135 117 344 188 -14
2264 -14 150 52 75 10 -143 379 16 -264 -52 52 -226 -16 -14 -76 -83 -221 -12 206 18 -100 -61 42 518
2287 518 278 -221 -4 134 -47 -2 -64 -25 -142 -142 -133 -209 -4 149 238 -21 172 -100 95 200 202 -153 22 154
2311 154 -95 122 29 -224 -55 -4 -134 -32 -187 80 -93 72 -45 -16 179 -79 175 -40 125 23 143
2332 143 203 191 -100 -44 61 -229 82 -95 43 10 -79 -84 -262 274 105 -82 85 213 -141 52 129 -81 -127
2355 -127 78 177 -44 -154 -143 208 -145 141 -104 51 -92 168 -59 97 -269 212 211 76 -130 206 -12
2376 -12 85 -19 35 -134 -73 87 -107 -125 11 -85 38 53 -106 -205 -157 59 -69 -89 46 176 115 -55 108 -6
2400 -6 -6 -28 -199 -16 -268 -290 -123 -7 -170 68 117 -248 -112 -137 -17 53 -17 -333 46 278 -217 -37 134
2423 134 64 112 21 73 34 -19 48 -325 68 -17 83 21 39 -74 -201 -13 122 -68 -38 302 -161 -176 143 196
2447 196 96 -11 171 80 -147 74 -420 -62 -23 -41 -42 -63 108 -34 -112 86 156 41 -276 46 74 254 -171
2470 -171 -43 40 -98 212 202 -165 157 -124 -95 -73 52 -53 76 60 -111 -62 38 300 -431 -27 224 -361
2492 -361 82 -46 169 -226 -17 -80 -437 111 -56 -11 -225 6 -29 57 199 208 -2 -41 29 -287 -71 413 187
2515 187 -226 62 -24 -92 -137 164 166 -34 -148 77 134 98 130 10 58 102 53 -130 194 250 193 -51 -72 -19 81
2540 81 -35 5 -277 15 374 56 117 71 207 -115 305 171 -68 17 264 -149 -66 68 211 -113 -90 -272
2562 -272 -250 -84 -52 -238 -258 -50 -137 -68 98 105 -142 240 98 -40 -208 -21 161 -222 -57 -33 -75 -167 170
2585 170 -214 -79 81 -101 -554 417 295 -95 -146 245 23 -52 163 -244 -328 68 113 145 -73 47 208 -62
2607 -62 76 33 11 50 2 -67 -164 290 -31 -84 138 -20 -163 40 35 -264 84 113 -223 -143 -3 50 -168 -292
2631 -292 53 65 -288 -15 -157 189 11 -71 -201 130 -141 -100 155 52 65 -219 327 -34 -411 70 21 -185
2653 -185 -144 -282 -356 -22 195 128 143 98 176 121 136 235 35 135 260 441 147 40 134 -256 67 -100 -100 51
2677 51 252 -118 -168 -108 85 206 -41 109 240 -118 -81 226 95 -43 11 -12 -10 2 -74 -169 73 81 -44 -203
2701 -203 121 16 -238 -191 152 173 -52 65 191 -1 256 87 -107 16 100 -242 -172 -207 -100 -280 84 52
2723 52 -49 -13 -100 56 -15 280 78 -144 -74 149 -224 169 221 -163 60 73 -309 29 148 -189 -219 -126 -220
2746 -220 14 157 51 -50 46 8 -68 -15 274 71 -88 -18 -291 -20 247 -48 141 -239 -189 -142 101 -154
2768 -154 -181 152 -49 328 92 -12 -144 -126 -6 52 29 110 -1 -213 -89 -47 -67 177 238 -54 -243 14 -120
2791 -120 -63 202 -94 29 -66 -270 114 -149 -135 -71 -88 -145 -233 15 -94 94 51 -135 -67 -289 164 55 65
2814 65 -122 284 21 93 136 16 61 65 -142 -312 134 -164 301 -13 46 24 70 -73 -149 -128 -63 -223 -68 243
2838 243 242 41 -21 210 108 -8 33 133 45 -119 116 166 -39 60 26 -204 -224 -38 -86 -69 53 79 -123 -22
2862 -22 2 -314 189 -22 114 -118 95 230 -104 -95 -24 -41 -185 2 -150 -158 -351 -76 30 -261 -80 227 169
2885 169 123 141 110 -40 110 -86 112 -42 -25 43 14 63 -86 7 -272 -308 -95 11 -93 33 -75 145 -67
2908 -67 166 41 182 -80 -237 -86 -237 -5 -40 -100 -2 50 352 -310 -214 -8 -195 -99 43 -205 -9 67 113
2931 113 205 22 56 12 -107 -161 162 39 30 -279 141 -135 -48 59 -65 138 26 -207 -198 37 123 -78 75
2954 75 -81 73 -173 -227 286 -147 27 -192 31 82 -85 21 -19 119 214 -45 -2 -34 -114 -90 157 132 249
2977 249 207 83 1 -180 90 -208 -59 24 -51 73 176 118 1 -100 263 -75 215 40 141 -49 2 -363
2999 -363 198 42 -4 455 143 -176 -21 67 26 205 -89 -85 -456 62 -73 221 -201 -79 -63 -165 -8 148
3021 148 -79 73 -62 77 259 97 86 -198 -119 92 -41 25 -43 -127 26 116 -261 -209 -122 65 4 -276 -27
3044 -27 -477 44 142 -69 -16 -246 -97 140 71 -234 161 -191 154 -326 -47 103 58 -112 230 -258 -322 23
3066 23 254 -33 206 42 61 -41 -454 -162 -2 63 1 -49 -348 -2 -47 -89 83 165 42 119 26 -138 -114 233
3090 233 150 -310 90 154 -211 -208 16 -16 -15 125 19 -28 71 -141 -176 -130 92 41 -116 5 -21 -41 43 45 146 139
3116 139 -3 -156 -183 118 -110 -56 -248 -144 -82 -228 -144 77 -40 302 -70 -212 -36 95 -6 -179 -70
3137 -70 127 -42 -226 28 35 -124 -5 -285 -197 51 163 -77 -135 135 -282 67 154 209 184 89 -187 155 53
3160 53 111 -102 195 -45 -102 72 87 71 -98 312 -11 -208 -14 33 -33 -129 -34 126 202 -233 -14 28 84 104
3184 104 83 -147 151 301 -68 -14 -231 -67 -139 29 171 -67 -33 210 71 -104 129 -26 103 228 36
3205 36 -30 251 -82 -19 -121 141 -63 -82 56 48 -47 69 168 -55 -230 60 155 11 168 -20 -25 50 -118 -259
3229 -259 51 -64 -254 -219 -124 -120 -118 -42 68 39 16 -99 109 51 105 12 -11 55 25 -52 51 293 -72 -280 121
3254 121 -107 31 -89 126 147 39 -167 -27 -49 -130 142 -229 178 -115 35 8 -160 108 70 -74 -103 170
3276 170 -188 -35 -72 -342 126 94 6 -147 139 4 -46 0 129 17 -164 27 85 -54 -260 264 -125 -109
3298 -109 -49 -155 11 -25 -32 -130 -34 83 24 -75 204 -105 128 118 1 20 -95 1 133 221 139 128 55 -13 13 -4
3324 -4 -256 16 -142 97 -12 57 228 -127 -80 -397 60 -72 170 12 -10 -81 -119 -112 -157 -55 -106 162 -18 -54
3348 -54 134 220 75 -11 70 -171 188 185 -218 -11 -209 -79 8 65 -50 -65 104 -108 -17 -53 -24 -212 154 170
3372 170 -159 -98 -153 -5 205 -17 155 -110 -196 24 -68 -229 187 48 -13 -31 82 96 13 -40 -46 10 174 35
3396 35 -93 10 73 155 -22 63 230 204 -139 -19 -187 67 46 -69 -65 -84 -43 -177 -132 -74 -146 114 129 -64 -118
3421 -118 -106 -112 -61 -23 7 -44 188 -180 -61 140 -83 201 -47 28 -140 221 -45 105 -244 -212 14 31 61 198
3445 198 74 -85 -11 256 184 106 -133 243 376 -44 -17 -121 -118 61 -243 -30 -235 -241 -76 133 11 51 117
3468 117 223 126 194 -60 -28 173 57 -107 -110 -67 -251 38 53 10 -22 -97 92 158 -114 -39 135 -168 -218 135
3492 135 32 97 -86 -154 282 81 78 78 -258 -8 114 -132 -83 -50 228 -94 101 -102 -86 -170 127 48 152 129
3516 129 -233 -13 19 54 -172 76 -4 50 -67 -99 31 -80 22 -175 -120 167 85 6 251 -247 -115 5 -47
3539 -47 179 274 -133 98 -132 -192 -74 151 -47 -215 -256 192 188 -275 -207 30 42 -78 149 89 57 90 97 2 225
3564 225 20 68 23 -126 107 101 -35 137 68 71 -249 293 46 121 -138 -256 7 -17 -270 -165 -128 -113 164 143
3588 143 36 -93 -3 -60 106 -125 64 -86 122 -64 -29 140 -97 32 182 -125 -71 145 37 145 294
3609 294 124 178 -222 41 11 37 -142 135 -25 -3 163 4 193 -161 -107 -37 89 -127 4 35 90 -204 84
3632 84 360 42 -7 49 12 20 -51 139 -122 -175 -47 -197 -105 -88 44 -263 -102 -87 32 68 -67 -84 203 80
3656 80 -179 234 -29 112 53 3 119 -374 -5 164 143 -340 -33 -16 43 190 -52 176 5 14 114 5 10
3679 10 -38 196 93 31 42 -24 -85 -152 -153 -102 33 -87 -83 7 -206 -63 130 -134 -242 -53 137 -28 -104 171 -157
3704 -157 -130 1 -87 -147 -96 85 -259 7 -125 199 -141 129 -99 61 45 75 -133 -30 94 55 186 -21
3726 -21 133 -30 163 -97 102 -48 98 -39 54 -110 67 -40 -12 33 139 5 22 0 3 104 -8 -77 124
3749 124 -58 -38 1 -54 29 90 9 100 156 200 81 -70 53 136 97 -302 -142 47 -119 1 -122 -104 -88 -164 -53
3774 -53 -215 76 92 99 116 84 -104 78 190 128 54 12 166 -40 -141 -54 66 -73 -157 236 -126 -46 73 -225
3798 -225 100 105 -28 -154 -47 -105 -124 -179 73 53 -35 6 367 23 -50 -114 -134 -30 66 -105 -81 21 -26 119 -33
3823 -33 -97 28 -33 114 47 -105 -197 -217 -76 49 -240 14 294 -220 -241 109 -64 43 -251 -101 32 -23 87
3846 87 15 57 56 164 119 42 39 -150 -198 -161 -202 -65 65 -8 -139 84 -5 -28 10 125 -87 29 -93 128 351
3871 351 -16 -179 -97 316 -104 128 -220 110 -106 -194 84 -34 -53 -71 100 175 -144 85 -196 139 116 129
3893 129 12 -30 -138 24 -8 -267 38 -95 -243 170 -128 17 35 20 -115 -250 -70 40 55 -161 388 74
3915 74 289 168 176 -47 172 -77 205 -6 -98 -273 -37 166 -62 -176 -11 3 187 -140 -173 -35 -169 119
3937 119 308 -226 -130 211 -2 19 78 136 68 -63 -74 -95 -162 -35 138 -56 -109 269 -177 -13 74 169 95 -160
3961 -160 145 17 -275 148 -16 -54 -184 -168 -34 -223 -19 -99 78 -20 151 -181 71 19 -55 50 72 41 -7
3984 -7 -133 -30 -97 25 -148 -17 323 -18 11 39 -81 136 37 -165 49 -235 61 -336 39 107 -18 211
4006 211 12 -187 -96 -276 -188 79 -221 263 -366 29 229 -137 -50 110 71 -5 -152 -139 71 -4 -128 -129 -58
4029 -58 120 -242 -58 -95 -18 207 9 -136 -203 -48 -130 30 123 -72 36 135 104 141 165 57 35 19 197 140
4053 140 -45 63 123 -281 40 -180 221 102 -118 163 60 178 -78 -73 -72 -40 11 -141 59 -3 15 83 -84
4076 -84 97 202 26 -33 -238 86 18 -193 223 37 -101 -58 86 3 154 199 93 249 228 -100 175 -2
4098 -2 -63 121 182 209 19 181 -196 -72 18 -23 -44 -27 -108 44 185 -6 -156 -104 63 -186 -97 -154 -213 -63 120
4123 120 279 -30 -32 214 -352 -253 49 88 -69 -23 100 -239 48 -115 -125 -9 -122 69 -58 68 -221 -20
4145 -20 64 -55 -55 247 -57 -254 -361 123 -9 -56 -108 120 60 144 -244 -68 43 95 232 100 49 -88 -5 -142
4169 -142 -87 -45 24 -43 21 205 307 73 -85 -222 -170 -247 34 72 -107 46 -106 -22 167 75 -133 -25 -70 -9
4193 -9 23 12 59 -52 15 -94 153 -22 -81 62 -177 44 -14 150 30 208 54 92 51 -120 -100 37 -70 34
4217 34 -44 40 -118 -111 -14 -15 161 -36 60 43 24 22 -79 -113 -39 48 227 6 -18 -279 24 -115 -59 47 -41 -72 101
4244 101 89 -120 -308 219 -21 -260 14 -269 91 79 85 113 -119 -71 -136 115 -8 -95 28 34 -124 146 -36
4267 -36 8 -70 -28 -237 -154 99 -199 -126 -184 -63 -155 160 79 -161 -7 -102 -74 -11 -146 -14 -84 -13 176 154 359
4292 359 -193 132 -9 -210 -376 -350 -74 157 154 -58 130 -42 24 -44 -124 141 -62 -76 -96 -16 51 -157 -93 -216
4316 -216 -17 114 -286 197 -27 337 243 220 -52 -113 109 -152 -183 40 -86 -126 44 191 90 -10 60 122
4338 122 105 -116 16 -59 -58 19 -194 -323 -204 179 78 160 -4 -5 264 3 43 118 114 -16 162 137 2 -82 206
4363 206 54 175 -5 260 -140 -76 -187 -21 -8 38 193 61 -283 -141 -20 51 74 274 250 -76 25 -22
4385 -22 -9 -49 24 188 -65 204 -155 -63 -22 -79 -14 -73 -131 -41 -205 88 -168 -115 275 -168 -92 -68 114 26 159
4410 159 -172 44 176 -24 -225 -265 53 380 38 79 -45 18 -178 5 -158 -238 -77 60 -134 19 90 25
4432 25 331 30 -21 -136 54 -129 -300 258 -104 -150 -14 66 174 -37 46 -173 -167 172 -28 -87 -14 52 64 -61
4456 -61 358 16 -121 20 -131 -62 -62 -179 3 -260 93 55 -79 114 106 130 -35 -50 -163 121 -76 118 -242
4479 -242 -118 -226 -59 116 88 -270 190 -92 -188 134 -8 -52 133 0 6 -170 113 -42 25 -61 -190 122
4501 122 -20 94 84 -1 161 78 -53 49 -58 -96 121 116 38 145 28 -8 -89 157 -231 90 -140 332 -328
4524 -328 -157 -11 -310 154 16 128 -49 -83 8 -79 80 -103 298 44 244 2 -282 55 -230 328 -102
4545 -102 -65 -306 -16 -108 -101 -1 126 -191 74 184 -128 -34 158 204 204 49 93 197 287 2 51 5 -268 -259 -131
4570 -131 -120 -133 -88 -138 -134 60 -98 245 -229 7 111 74 14 -160 195 202 32 -36 103 -136 47 -168 -220 -97
4594 -97 -23 -52 -193 -136 305 -188 71 -88 48 292 -43 -16 -34 -176 17 -128 40 124 -213 -161 170 7 -157
4617 -157 65 115 -521 -194 -10 -2 -120 219 123 -7 -166 -74 -26 250 34 1 -295 100 25 23 -81 -173 -340 12
4641 12 -143 -200 294 -59 -40 -26 -250 190 98 268 162 153 -47 129 -170 -163 146 128 4 49 183 -95 318 -29
4665 -29 15 -69 15 265 -96 -261 208 183 159 -214 -243 -61 59 76 200 95 113 -198 142 -46 19 183 1
4688 1 -138 -91 87 8 -131 -98 296 -40 -135 72 232 -161 93 -278 -255 -99 -200 51 -91 274 -215 -194 60
4711 60 62 176 -281 64 -83 22 147 19 74 48 253 -163 -38 -39 73 146 19 -132 -90 158 17 177 8
4734 8 -83 9 -93 -64 90 219 40 58 -34 141 -21 46 81 53 163 48 -54 -23 74 119 -194 78 45 86 -7
4759 -7 103 -43 85 -96 -169 -9 30 84 -33 314 -128 131 -54 150 166 -22 -122 272 167 -17 87 19
4781 19 320 331 -94 88 -15 14 -163 91 5 22 -51 68 -8 -57 -25 130 -100 -9 -73 -154 348 -243 122 108
4805 108 345 -93 4 207 254 108 1 -186 -57 -53 -33 -96 29 -41 2 10 -56 130 237 -240 -123 -172 -228 94
4829 94 103 9 95 258 -33 154 -117 8 126 284 -180 -7 31 -128 56 109 144 72 5 -36 -270 55 -50 104
4853 104 104 35 244 77 -91 -195 75 -43 -162 56 90 -89 59 -119 -45 58 -57 278 97 -91 -287 -2
4875 -2 -45 21 234 45 169 14 -3 83 -248 -155 -41 -283 17 190 -137 127 52 153 95 130 23 165 161 -45
4899 -45 -125 -254 -95 -144 -183 -267 -239 2 137 -81 48 44 86 -75 152 -139 262 -76 -36 -27 -268 104 108 -306 -49
4924 -49 211 -37 -122 -232 76 -232 -189 -7 -159 2 148 -56 -12 -171 119 -55 -133 -82 -46 -100 214 56 -22
4947 -22 122 -62 0 -88 46 312 -55 111 80 82 23 22 60 -212 -180 9 -120 158 231 -172 -212 -18 -32 89 -234
4972 -234 307 -51 -156 -86 52 -100 -20 153 72 208 233 82 94 -5 -200 66 94 -62 123 58 -63 -56 -187
4995 -187 527 -177 43 -232 26 -42 136 -112 -41 -39 -2 54 7 -173 79 91 103 130 276 -53 -27 7 -124 190
5019 190 -186 -150 -73 -64 -29 7 -176 96 112 -7 -6 -15 -190 -49 117 19 -42 225 -85 11 39 70 48 -67 -48 -63
5045 -63 -89 85 127 132 45 209 8 37 46 -166 80 -73 -77 25 74 40 170 -150 -159 -88 -129 319 88 74 -7 40 -166
5072 -166 76 39 -90 -34 21 216 92 159 -251 171 -7 -182 -3 3 231 -6 277 -32 134 113 -9 -107 -75
5095 -75 203 -90 -46 -198 13 46 142 123 -37 288 -94 56 -115 65 -89 -35 -349 141 57 -36 -148 138 5
5118 5 -224 -146 -71 -67 175 -120 77 96 80 -222 -161 -134 -27 168 -85 176 4 -88 297 117 -104 92 129 -143
5142 -143 -88 215 84 -4 -283 29 -146 -41 145 -85 32 -57 326 -105 53 14 167 -44 -49 -47 -97 255 -79
5165 -79 357 81 -86 -146 62 -52 -88 145 3 -261 -180 131 -74 -381 61 -139 35 52 -170 -154 -56 35 87
5188 87 39 -96 100 295 36 27 -29 25 -228 252 53 110 -271 -102 -46 91 32 214 211 73 -5 -317 115 336
5212 336 130 -40 60 -52 -29 -21 191 -2 -33 -38 133 186 135 -20 -139 -139 -190 270 4 100 -165 160 40 -45
5236 -45 488 -162 -114 29 -21 -56 -85 60 20 57 283 276 -142 -148 123 24 163 -48 47 222 -135 -32 -8 -15 -34 269
5262 269 125 36 63 69 33 99 -83 -19 -79 219 -260 -28 -182 -120 -42 -94 -213 -214 -116 -67 205 -29 80 -168 -52
5287 -52 46 146 -11 -78 -147 68 -147 -56 205 -19 12 -104 117 -175 37 -153 -12 -7 -90 -107 -72 -86 40 -126
5311 -126 -123 -142 -7 -217 96 100 -3 -59 163 134 74 23 -34 -167 61 -199 5 57 58 -90 65 -27 -70 -128 201
5336 201 -8 130 -46 112 -7 122 368 85 -135 -200 20 4 -50 -146 122 -88 80 141 -248 -1 110 64
5358 64 -169 193 161 22 402 -53 -68 127 -80 134 -42 175 -35 -96 89 1 60 -121 49 103 -172 -109 -162
5381 -162 -257 -144 165 71 -90 -174 15 -176 -65 152 -24 -2 -159 -11 -227 58 91 124 101 -85 -47 -90 378
5404 378 -52 -16 131 -164 230 -222 67 -188 60 78 6 137 138 -74 -146 -69 227 -174 -69 28 -94 -194 21
5427 21 147 -71 -68 97 68 159 -322 124 -181 63 -2 -129 -218 -88 51 415 -110 -98 -94 -115 -86 -2 302 -60
5451 -60 -166 -108 -159 32 -12 -92 78 53 255 -267 -118 -124 6 1 4 131 -151 23 -39 157 -59 -121 47 51 92 -34
5477 -34 185 -229 -226 -113 81 209 -32 196 -4 -121 121 37 -121 -20 -148 109 66 -52 -130 56 -54 -37
5499 -37 286 68 67 -31 68 -23 205 -56 -97 150 51 -85 -122 -65 32 8 14 -62 -60 300 60 -152 180 63 -142 14
5525 14 -178 110 -52 67 128 -9 -72 -93 -140 -66 -132 -168 -62 -60 89 -98 200 45 120 -241 -163 178 -24 132
5549 132 -119 120 41 143 -84 -6 -14 -69 -306 114 -286 -49 -57 -137 -57 210 -101 -45 -35 -170 -63 -150 74 155
5573 155 -316 120 -163 -25 -104 39 -45 -76 -386 -92 -81 -82 36 -159 -1 -235 -32 19 144 46 -59 -23 6
5596 6 310 -68 -138 187 159 254 -3 66 1 -222 -191 -2 -118 181 -38 -31 -294 112 148 -180 -139 5 57 263
5620 263 31 12 284 -23 -148 115 23 222 -75 67 28 89 189 -54 146 -88 -55 -103 -45 104 -91 -115 -250
5643 -250 12 -144 71 -75 173 -81 -101 -115 2 -90 24 -2 -119 68 43 -92 39 47 -12 -136 -4 -12 24 -75
5667 -75 154 196 -41 155 74 337 44 5 -74 -290 -247 3 152 135 -124 271 -165 -101 -195 -4 224 -198 -124
5690 -124 -126 -185 63 -95 226 76 116 0 -73 -81 208 -198 -281 298 -117 117 47 72 39 70 26 40 149 -101 -101
5715 -101 -188 90 312 113 141 -22 82 -107 -237 -175 -57 -207 233 -100 59 12 118 -127 -304 100 -39
5736 -39 159 20 79 28 154 -22 -201 -52 18 -149 117 -161 44 159 -71 102 -249 -26 141 -187 -26
5757 -26 -21 60 -68 150 -98 94 117 -14 96 -182 -76 47 108 -220 -45 -264 -42 -6 -17 167 -13 114 -147
5780 -147 0 -121 -78 242 50 -37 -91 -129 15 28 -135 -166 213 -29 66 128 95 138 -190 -180 -145 99 76 -75
5804 -75 124 62 -79 30 -27 12 175 -160 -45 351 27 178 -312 -12 -149 -51 -6 144 17 55 87 -82 -167
5827 -167 -59 38 -96 105 -63 67 -62 -76 94 -3 -94 -90 -82 232 98 259 181 -61 -235 -10 80 -6 -11 117
5851 117 10 -187 317 99 198 -223 -34 52 -57 -96 20 -22 -307 19 141 55 -127 -52 40 -102 -182 -16 -372
5874 -372 -185 119 -250 -258 318 -124 29 149 50 170 -51 245 44 -317 42 40 -161 -40 128 105 -13 6
5896 6 -120 44 -2 4 219 100 -209 110 -31 -260 164 11 -145 -39 178 -69 56 -145 13 230 -175 2
5918 2 77 11 -306 3 -1 -321 195 -123 -73 -85 -188 -86 239 76 -167 114 -75 -196 248 -8 -232 -46 -96
5941 -96 94 41 -6 -172 -86 115 -52 -136 62 -15 33 -237 -300 149 -11 -42 49 -55 4 -294 69 -161 17 -276
5965 -276 96 -233 223 -1 116 -173 -199 55 171 53 8 222 -20 49 27 -24 -59 29 -235 119 258 74
5987 74 46 77 -208 -60 -132 -87 83 -22 14 39 -11 58 -215 -26 144 -12 -360 75 132 102 312 324 4 -320
6011 -320 33 -137 128 88 78 -155 -216 -4 38 -125 39 -40 -99 -176 9 230 67 -79 80 94 -113 -78 164
6034 164 -7 -165 35 -45 88 -156 -47 12 -165 204 -61 -9 -182 -85 -414 -12 39 178 -106 86 208 548
6056 548 42 46 -206 6 -33 -54 -156 362 7 -83 139 -34 119 135 6 132 51 -151 78 77 251 -112 0
6079 0 -152 -17 -231 99 83 68 -268 68 -185 47 109 -37 71 -41 -141 -240 202 84 143 39 -224 78
6101 78 43 -140 -155 -168 -198 -39 -24 97 65 -124 240 27 6 46 -204 -131 -110 180 96 139 186 -154 -162 -72 168 -127
6127 -127 51 -133 -44 93 182 -295 -112 -64 -96 42 60 -132 48 -62 -149 -32 -48 -123 60 -200 -149 28 235
6150 235 -144 11 -91 38 26 -129 105 -149 219 166 -300 -231 31 -88 -35 15 -32 46 -73 -13 -17 59 -39 -118
6174 -118 114 135 -189 6 -35 -92 148 -116 4 -48 100 -23 243 -108 121 74 -101 149 -22 45 -93 -61
6196 -61 88 163 47 -285 169 293 -154 86 162 62 170 -124 -4 16 -70 4 -75 -102 45 -22 201 -2 68
6219 68 112 -108 185 -6 111 -258 26 -24 1 131 35 69 259 -28 -85 127 -46 -135 279 72 27 -100 -13
6242 -13 -141 47 -18 -176 121 -31 -142 120 -157 -171 69 -63 289 272 37 -88 -36 221 -46 -255 31 80
6264 80 -69 -61 327 155 -72 88 -104 -107 -191 69 33 187 -103 57 78 -55 34 178 68 -202 21 -83 -355
6287 -355 -206 24 -61 -224 -41 -145 138 30 183 -19 119 157 54 -82 131 -25 25 163 43 -189 -213
6308 -213 -51 -109 66 91 -162 100 30 -79 169 167 94 171 -125 46 45 -37 -14 186 -19 105 -84 -180 -64 91
6332 91 254 -379 163 206 -60 -111 -18 121 217 249 190 67 40 88 -15 -137 -185 -13 -10 151 115 -232 6 -81 -99
6357 -99 7 -39 262 -220 -116 -193 31 63 89 -115 -152 305 240 106 -17 -19 -184 38 -239 75 124 -71 183
6380 183 4 -93 143 -64 135 -50 148 75 -134 257 6 -81 37 80 -84 -19 -226 18 217 -149 45 84
6402 84 -42 -306 -125 -130 -19 52 194 -81 117 59 34 -196 -11 -176 -257 115 30 269 139 -111 -135 194 95
6425 95 44 46 212 32 -164 145 223 -94 51 31 -2 -110 87 -148 -141 -132 30 176 67 151 275 89 175 -86
6449 -86 285 20 -267 -22 -163 64 123 -151 -49 -142 131 33 149 19 115 56 -19 -249 370 46 45 130 -165
6472 -165 -126 196 15 -12 -183 -225 192 -97 124 -403 144 151 -137 -62 113 -54 219 100 99 -155 54 -219 -29
6495 -29 -69 -9 130 -98 85 6 115 -152 7 -92 -27 -220 194 -70 -37 101 -88 170 -275 -191 -173 -244 250
6518 250 -200 248 -271 217 -53 30 14 18 27 -137 289 -96 70 -174 -75 106 226 198 348 80 -32 100 78
6541 78 114 -35 49 26 -143 200 -146 137 59 227 -225 54 138 23 24 142 171 -184 435 46 -53 90 -308
6564 -308 43 290 -332 81 -251 17 -18 -184 123 -11 -246 44 54 -133 3 94 32 -9 61 4 37 -113 -166
6587 -166 229 -160 60 -186 165 71 -378 -116 -239 136 -8 -273 -7 2 15 137 105 -222 36 -156 -240 -63
6609 -63 -199 -200 201 94 21 81 2 212 -149 -47 154 -13 97 36 -138 29 34 79 67 -112 -194 311 240 53
6633 53 -42 -29 -50 -245 -32 -60 112 -265 -108 -73 68 -222 -201 4 -201 172 -17 171 -182 -48 -223 159
6655 159 90 -36 122 -74 162 40 256 -140 178 -165 -48 -198 118 -109 -57 54 16 89 -105 -9 112 124
6677 124 -46 105 135 -238 140 -113 -79 -113 -94 -128 81 68 2 102 -328 382 -42 -60 136 -51 113 -106 -177
6700 -177 -25 16 -94 -27 16 77 212 16 96 85 50 10 129 4 -64 -68 -136 -13 140 213 158 55 28 -5 -158
6725 -158 -18 52 -23 143 -8 -30 106 37 243 51 -239 -343 70 91 -90 112 -15 97 -132 -187 77 -30
6747 -30 -22 -133 216 -149 -304 37 -47 -58 -57 59 67 84 -106 58 -98 -34 100 -228 -162 23 -39 13 180 -41 -124
6772 -124 -183 171 9 46 -55 -137 -101 41 -186 -20 -14 -148 4 64 98 -45 109 -53 8 -152 -122 -200 -83 97
6796 97 45 52 57 -16 -106 -9 -178 348 -29 -43 -67 -139 187 -60 -89 19 -52 203 63 -109 189 -146 142 170 -24
6821 -24 -200 24 -122 -205 109 -42 305 -197 63 -73 -68 25 8 -44 -160 -110 306 -64 5 -46 -257 12 110 -187
6845 -187 30 -133 179 -31 -153 135 -112 74 -2 -15 -107 -330 -27 -248 -20 49 -59 -107 -78 -68 9 -253 -8
6868 -8 -120 78 -8 82 -115 -63 -18 -218 179 -89 -172 -118 110 6 171 286 -107 156 72 -109 -107 -98 -105 41 327
6893 327 -92 -200 182 -113 70 157 316 161 87 84 -56 56 -240 86 123 76 -53 -116 -97 -58 40 -215 32
6916 32 -247 26 20 72 -160 68 150 -229 3 -89 1 -232 -14 -85 28 96 47 -1 69 -27 86 -6 157 -10 49
6941 49 79 19 -224 -33 -72 115 52 138 -21 -83 14 151 -23 260 192 25 399 -16 -200 14 -69 -327 -78
6964 -78 224 -51 124 -130 425 57 -5 192 376 44 4 -31 -18 -82 -113 44 -226 -45 42 138 -130 -120 57
6987 57 115 11 -47 177 211 -124 82 -39 -180 269 88 -68 25 -81 -63 170 15 24 42 -30 63 178 -16 181
7011 181 45 141 -27 -218 242 -95 -130 -94 41 256 -15 139 113 -257 -235 16 18 65 -115 153 -13 -82 -22
7034 -22 37 212 10 -163 5 43 -163 78 54 -372 69 -124 -156 176 -81 72 -28 -196 -154 -172 144 212 -139
7057 -139 194 260 88 111 -94 -161 -171 33 94 110 -149 33 72 -247 -237 -145 22 -331 -64 -190 -62 39 180
7080 180 -27 35 102 -249 -227 -18 104 16 -136 160 -155 -87 276 -116 234 120 28 -14 -67 -136 -183 115 193 -102
7104 -102 60 -11 -39 61 47 -8 -71 -31 9 66 3 -82 -36 -72 -99 139 -3 105 -197 190 12 111 195 -47 -38 74
7130 74 37 22 13 113 78 -142 169 20 101 -287 304 10 -15 134 -30 161 -151 -122 90 -72 -37 -207 272
7153 272 93 184 4 -41 -89 -241 -61 251 139 233 227 174 -9 77 282 112 89 94 -55 -169 222 54 -117 36
7177 36 79 -124 -270 -188 -197 -59 59 -311 7 268 -250 -106 -165 -186 125 -63 -70 -79 -30 17 52 -14 109 -183 42
7202 42 84 -10 63 -343 28 11 -151 5 -505 94 -100 330 100 129 172 335 -238 71 -133 77 -44 -37 -29 24
7226 24 137 -46 -235 -92 128 -176 -107 95 144 53 278 177 124 15 -137 -154 -52 -102 -300 76 -146 -34
7248 -34 97 12 -55 211 -243 -275 -8 60 -56 96 202 197 -9 258 -122 115 -21 96 -63 -85 13 -88 24
7271 24 -40 -218 -358 -347 118 -162 -54 -94 -26 -106 -89 21 -126 -42 -399 55 -42 -109 206 212 -128 112 33 159
7295 159 86 216 252 -67 -53 -42 176 218 15 53 12 257 -157 -34 -14 -86 49 9 -83 -200 32 -72 -177 -71
7319 -71 -263 -227 186 212 -66 77 200 246 167 108 129 358 -73 93 14 128 84 -42 -57 161 -234 -105 191
7342 191 83 33 66 173 -63 6 -17 -64 -79 267 119 -80 -111 99 -49 -92 -91 -94 157 49 89 23 181 82 -156
7367 -156 156 -91 -20 -8 -56 -24 -39 102 219 7 -33 -21 133 119 -130 -267 1 140 -334 19 29 -11 -62 198
7391 198 246 48 163 95 4 18 24 -59 25 258 -72 -56 15 37 104 88 64 47 -102 72 -131 -175 81 90 -140 -200
7417 -200 323 -10 47 68 -105 89 61 -130 131 95 -72 -250 -27 -54 -239 167 -26 -106 -30 58 -16 171 3
7440 3 -106 -146 25 -83 97 136 -95 130 -75 -90 -57 -28 44 -17 157 96 -116 32 -185 -41 -23 48 -28 84
7464 84 202 77 30 79 -170 -110 -358 75 -99 -26 -25 -132 135 319 -171 140 -172 40 -32 -57 194 52 -290
7487 -290 -186 237 43 -43 -37 -6 282 -30 -153 -42 94 57 -36 -254 18 -203 27 -107 -27 -213 -23 131
7509 131 50 43 -53 -23 57 73 -22 175 -17 195 53 -259 216 223 -9 20 102 -11 -239 235 227 -81 35 174 -62
7534 -62 -202 -180 -165 253 199 75 -245 -7 -58 3 -52 112 13 -60 -113 -104 -207 -29 -115 31 176 -148 -53 -34 24
7559 24 -103 -90 -295 -148 -161 -138 45 42 -162 -203 171 -5 98 141 107 13 -386 18 178 125 -19 64 -209 -96
7583 -96 -4 -175 -77 -270 88 20 -155 -16 86 236 -58 -100 -83 -54 -43 -89 -176 -37 -174 -127 -399 231 46 -6
7607 -6 -157 -106 120 73 -174 -122 56 -54 -102 -24 28 166 120 -150 1 17 -89 210 -37 17 -199 -68 -18 101
7631 101 190 357 -27 193 367 1 101 -305 -90 11 21 -91 -1 160 65 -57 -235 -128 336 -4 94 -101
7653 -101 56 26 42 85 70 -88 -69 47 19 -18 -153 -86 -90 260 -20 51 178 -213 95 150 202 313 -316 154
7677 154 0 -187 8 308 188 68 246 126 -108 -66 149 -30 116 71 119 -133 -302 -98 -49 36 5 -91
7699 -91 -106 6 -103 138 -3 77 134 28 -38 94 52 72 119 -92 19 -21 -212 270 -107 -28 19 146 -69 -264
7723 -264 -52 -286 299 130 109 27 -238 -103 -384 -41 92 78 38 71 137 -21 -160 -29 318 -115 21 37
7745 37 123 -114 227 300 -118 111 -52 4 141 -168 194 -181 65 -109 -20 54 -87 66 15 110 9 106 -177
7768 -177 138 112 -64 314 -260 125 -98 -68 168 82 -64 -11 -105 -30 203 -147 -100 150 188 191 116 -53 -68 -67 -47
7793 -47 138 364 -217 -61 111 111 82 108 20 190 -201 -86 114 12 75 353 170 56 -9 13 75 85 56 280
7817 280 59 -89 -182 93 100 159 64 394 -65 -258 39 242 -82 -75 80 -20 39 107 52 -25 183 208 101 -17
7841 -17 34 -92 -78 59 -25 -40 -142 16 18 75 -25 -145 325 99 408 6 -105 -151 -129 -114 100 135 -15 29
7865 29 -55 93 -100 -201 -142 -42 267 150 209 -43 -229 91 -44 18 -55 100 138 -53 76 -176 295 37
7887 37 -34 -36 -24 -16 47 61 99 -101 6 -54 101 -218 98 340 -192 -258 -80 259 197 12 -44 -138 -116 245 -96
7912 -96 -17 33 131 232 26 -42 -94 -108 28 -45 -32 -16 107 -127 255 -122 58 73 46 274 241 99 -40 -47 -97
7937 -97 -236 -129 -196 -60 120 2 -151 247 -104 33 -227 72 -166 116 147 11 -237 -3 102 -181 8
7958 8 16 -324 -162 -162 76 265 -240 -108 -54 144 -137 -171 -143 3 178 174 249 63 91 -94 282 53 -74 5 -356
7983 -356 54 207 198 139 89 69 -154 124 161 211 9 -87 -222 79 2 43 -93 -32 -53 55 156 -73 159 -96
8007 -96 -200 -393 -154 8 171 -150 202 99 -51 63 285 -34 180 -73 160 317 86 -8 29 -151 -11
8028 -11 -70 -302 -119 185 82 -10 34 -17 149 -110 -69 105 -40 2 72 105 -216 40 115 64 -299 -263 12 -118
8052 -118 50 135 -120 170 33 114 34 -140 260 72 154 115 -28 154 -68 -152 150 -10 -26 6 -192 -31 241
8075 241 -180 -33 4 -38 -212 -27 -90 77 -240 193 -101 -84 -189 -94 -55 -173 -16 262 142 -109 253 -33
8097 -33 31 -200 285 151 -158 75 5 54 -46 91 -32 59 424 68 -17 5 26 166 -145 -38 110 -53 -38
8120 -38 -31 100 -173 34 -197 -125 126 -135 -165 -113 157 -44 275 -139 -234 -36 -4 -153 -33 -85 -37 15 -44 34
8144 34 -155 186 126 171 109 -77 -83 -107 82 -94 -278 -239 -81 -204 -36 230 139 259 87 64 -68 -135 19 -145
8168 -145 94 163 -163 -102 -128 85 -95 -70 18 -28 -12 -114 77 96 208 147 -40 -19 61 80 61 100 -60
8191f0
$$ Imaginary data points
##PAGE= N=2
##DATA TABLE= (X++(I..I)), XYDATA
0 0 0 0 0 0 0 0 0 0 0 0 6 -8 8 -8 16 -16 21 -24 32 -40 47 -55 64 -73 88 -103 120 -137 159 -182 208 -237
32 -237 270 -304 344 -389 435 -488 545 -608 678 -752 834 -925 1024 -1130 1247 -1376 1516
49 1516 -1671 1840 -2027 2233 -2465 2722 -3016 3345 -3725 4167 -4687 5310 -6075 7035 -8285
64 -8285 9986 -12453 16352 -23506 40962 -181042 -139327 50922 -224973 -29751 198057
75 198057 21451 -36460 224124 142584 7913 133752 101652 -119373 -54892 3241 -128714
86 -128714 -92019 46391 -56377 -105992 17585 14394 -53032 44478 90661 11477 4488 41392
98 41392 9842 12591 53627 50799 29986 10859 -36596 -63784 -63541 -73023 -68012 -39670 -30333 -17093
112 -17093 22433 56361 82778 101774 88951 60638 24162 -29301 -55798 -51042 -71122 -78547
124 -78547 -40315 -35180 -47007 9433 57835 42098 58215 84672 31540 -9517 9681 -12223
136 -12223 -43454 -9957 -5805 -45166 -22141 7428 -22586 -7865 41224 9250 -25615 13041
148 13041 11900 -28720 9119 52372 11889 -4584 28638 4250 -34174 -1441 12577 -28830
160 -28830 -25274 -846 -32042 -37042 17277 22511 -1783 35430 49453 -4728 -3903 35080 -3893
173 -3893 -37194 4211 -5583 -56867 -19590 22311 -12498 -1027 50970 16509 -20308 19684
185 19684 14795 -31580 -2352 21713 -24493 -22803 17858 -6130 -20164 23178 19113 -14486 7418
198 7418 17470 -16289 -7466 17455 -4890 -13507 8888 -2770 -18238 3892 8915 -6970 4255
211 4255 11041 -7200 -4739 8562 -1757 -3718 10083 3062 -8562 2212 3415 -8526 -1371
224 -1371 6742 -5795 -6930 5471 124 -5922 7099 9304 -3729 -960 6435 -4487 -9068 3438
238 3438 2631 -8379 -729 6859 -3436 -2539 10121 4786 -4648 4988 5715 -7833 -3457 6069 -4490
253 -4490 -8792 2918 -275 -9916 -1101 5575 -3202 -1769 8840 4381 -1097 7579 8691 -425 737
268 737 5129 -2921 -8708 -3736 -4570 -11385 -8053 -898 -2799 -2906 6514 9421 4956 8356 12405 5198
284 5198 -601 2428 -2300 -11014 -7302 -2653 -8372 -6773 2378 546 -2660 5100 7525 1088 2790
299 2790 6181 737 -2155 2294 268 -4293 -1931 -639 -3829 -2477 789 848 -60 1804 2778 886
315 886 326 1238 1847 -331 -1659 -867 -1015 -3160 -2341 -433 -2334 -2821 1319 1746 416 4440 6945
332 6945 2780 1891 4247 530 -3892 -1500 -2300 -7295 -6848 -2747 -4477 -4170 1299 2727 1017 3823
348 3823 7608 5665 4389 6438 3834 -1970 -2873 -2270 -5840 -8009 -4475 -3561 -6149 -2123 3242 2137
364 2137 2506 7568 6426 1183 3560 4279 -1838 -3033 697 -4064 -7732 -1776 118 -3790 285 5340
380 5340 698 -249 3984 1888 -1638 1021 1018 -2950 -1566 1066 -1075 -1863 1321 485 -1807 -904 116
397 116 -401 -622 982 2138 2201 1556 2849 3115 400 -1198 -748 -2912 -5628 -4244 -3500 -4344 -1718 2291
415 2291 2702 3640 6391 5567 3113 2396 2923 -412 -3076 -2700 -3572 -6646 -5541 -547 -160 -1172 3485
432 3485 3924 -884 791 4538 261 -1358 2624 -778 -5519 331 3286 -1153 2457 5321 -1620
447 -1620 -4078 890 -1926 -4170 762 315 -4440 -1446 1344 675 3542 5542 2327 60 -1296 -3675
463 -3675 -1165 703 -1188 1138 1857 -3929 -1218 4248 -1005 -301 6352 -2005 -9039 1182 362 -8054
479 -8054 3622 8944 -5872 -1614 9813 -2895 -4424 12332 3570 -9501 3537 2002 -13631
492 -13631 -1012 8945 -6449 -2625 10314 -4383 -7694 9868 3042 -7585 7221 4548 -12539
505 -12539 -877 6813 -6884 173 12534 -3104 -6234 7750 -1958 -8530 7987 4045 -10400
518 -10400 1683 4593 -11111 -1228 11291 -3338 -4966 8489 -1977 -9586 6099 5724 -4944
531 -4944 3951 6311 -7247 -2659 6523 -1601 -2452 4901 -1769 -7932 -1036 -526 -3473 2351 3460
546 3460 -1487 -745 1287 107 3057 4942 2844 1125 -1530 -4150 -1385 -478 -2016 1257 693 -5731
562 -5731 -3855 1968 -936 -439 6976 3068 -3999 1104 2084 -3037 2181 6589 -1847 -3525 1440 -3894
578 -3894 -6354 3600 4294 -3932 350 3481 -4668 -3608 5843 3786 -2254 2157 2038 -6206 -3910 3149
594 3149 692 -1402 3250 1542 -4897 -412 3905 -78 1178 5121 -1250 -5700 435 62 -3819
609 -3819 2425 3839 -4851 -3433 2012 -2819 -2071 7037 3162 -2674 3433 2442 -4558 2461 6827 -2853
625 -2853 -2817 2978 -5563 -7514 3467 617 -5983 2713 3812 -6439 -170 8098 -284 -1025 7701
640 7701 805 -6180 2130 3075 -4869 -402 4111 -3554 -4659 1653 -449 -2614 2271 2751 -1840 -538
656 -538 1869 -630 -476 2423 1620 -898 -761 739 -204 -1181 1524 2115 -1283 -1846 503 -804 -2164
673 -2164 1618 2548 -1373 -690 1046 -2251 -2789 1703 924 -1688 1396 1508 -1229 838 2985 1177
689 1177 331 1400 -1154 -2372 -428 -109 -1117 156 -142 -1921 -2058 -874 -233 872 1334 1069 1105
706 1105 951 285 1234 1398 291 -86 -620 -1276 -823 -222 -239 -23 -73 -1534 -1574 -222 -337 222 1964 1059
726 1059 -161 1163 229 -850 874 1336 -936 -395 1094 -766 -629 1481 -337 -2283 497 -170
742 -170 -2790 336 1513 -1201 -536 2010 -634 -1433 2222 1031 -1307 1579 1843 -1349 -36 1806
758 1806 -1040 -1535 954 -544 -1923 439 425 -1656 -624 999 -849 -832 1273 607 242 1096 1284
775 1284 392 389 372 -11 -514 -232 -442 -234 -600 -386 121 -704 -1151 -89 460 -451 861 1490 85 53
795 53 1167 267 -737 607 836 -997 200 1344 -363 -937 251 -574 -2001 -541 42 -1093 -59
812 -59 1090 126 -263 1276 377 -319 885 874 -108 -70 752 128 -284 -200 -478 -673 -789 -466 -534 -339 -54
833 -54 -278 -108 -68 99 441 509 226 776 922 354 201 543 -301 -1084 -456 -354 -1151 -306 593 -708 -326
854 -326 554 -143 -782 412 680 -447 276 1006 112 14 960 464 -518 673 372 -564 -372 -25 -571 -621
874 -621 -448 -566 -633 -245 37 195 297 50 235 675 252 147 889 456 -228 480 163 -679 -33 305 -749
895 -749 -734 188 -745 -1316 111 211 -839 489 954 -296 24 1556 221 135 839 181 -752 173 207
914 207 -346 -288 101 -654 -820 -701 -614 154 -155 -259 306 198 -285 1188 1146 -64 873 1283 -971 -615
934 -615 1651 -160 -1544 1296 -159 -2399 110 1303 -1901 -189 2089 -1449 -1824 2166 205 -1855
950 -1855 1846 1932 -1607 543 2191 -1019 -907 2201 -325 -2102 702 -275 -2354 172 1085 -1383
966 -1383 -56 1214 -1295 -1156 1512 7 -405 1809 698 -1171 680 624 -777 805 1398 -943
982 -943 -561 233 -1166 -1206 844 5 -1031 126 -67 -1097 -143 1582 1005 622 491 -63 -585 67 364
1001 364 721 -158 -377 -362 -1166 -1006 464 473 -790 -159 16 -1425 -857 1428 549 -132 1280 434 -1524
1020 -1524 139 1564 -228 179 1288 -655 -2212 -322 235 -1275 210 1187 -1116 -1470 699 156
1036 156 -308 1303 1355 -852 -328 986 -77 -116 1565 865 -885 -108 212 -1319 -173 1376 -342
1053 -342 -1188 405 -551 -2104 553 1605 -314 15 1478 -714 -1249 1759 1313 -511 1137 415 -2300
1070 -2300 -869 733 -994 -277 1707 -674 -2186 -15 418 -1332 1159 1950 -439 -580 829 -624
1086 -624 -480 1609 1214 -281 166 -303 -1676 33 844 102 -101 276 -1673 -1601 138 861 -19 900
1104 900 683 -697 -761 442 1012 512 817 618 -687 -1234 -13 369 154 471 504 -1150 -1696 -194 -139
1123 -139 -763 1149 886 -1135 -296 1211 -466 -39 2408 774 -876 469 217 -1412 78 1332
1139 1332 -713 -1399 198 -943 -1618 849 836 -465 626 640 -847 29 1064 455 530 939 -46 -631
1157 -631 -35 70 -280 406 428 -692 -668 -302 -548 -131 553 -16 -38 -88 -275 106 764 538 371 182 -195
1178 -195 -23 -208 123 475 470 -236 -466 -453 -387 -399 283 157 -330 -165 112 -536 123 873 202 69 858 -83
1200 -83 -551 908 734 -528 183 448 -1315 -922 439 -632 -760 717 -49 -1162 366 590 -598
1217 -598 232 1327 -42 -256 1102 425 -559 706 704 -746 -222 361 -965 -928 427 -143 -939 200
1235 200 89 -680 292 527 -4 141 723 371 -103 465 299 -14 278 215 -107 -374 64 -187 -75 113
1255 113 -78 -199 234 -282 -66 96 149 29 15 371 99 507 568 130 -76 104 64 -418 -346 -69 -477 -502
1277 -502 -130 -401 -295 -121 167 225 255 531 353 158 643 184 -192 -36 61 -128 -218 45 -71 -121 -207 -7
1299 -7 -285 -213 67 -7 -341 -198 95 -82 143 505 467 221 383 517 97 -61 65 -467 -730 78 -22 -462
1321 -462 -25 273 -237 -14 450 258 -251 217 109 -159 -34 437 492 199 346 219 28 155 -95 -559
1341 -559 -296 -241 -491 -203 -277 -417 -283 -131 249 173 388 528 405 491 -127 -218 88 -226 48 -137 79 -188
1363 -188 0 -58 -343 -109 -377 -440 -252 -170 -46 -106 336 396 100 218 369 305 182 56 38 -354 -111 -490
1385 -490 -182 -136 -177 -71 -91 -157 -45 -117 -223 -312 191 322 -198 550 271 -78 335 443 1 -257 249 -211
1407 -211 -260 -117 -200 -396 -511 -461 -377 342 660 469 159 444 447 66 45 183 74 24 120 5 -253 4 151
1430 151 109 -142 -125 -113 -149 -600 -387 -17 -51 -406 451 513 232 676 276 308 211 -38 -260 -413 -7 -135 -497
1453 -497 1 -102 -383 214 -8 -112 -117 366 153 -63 76 -2 -164 266 423 -52 154 112 321 -185 -94 -83
1475 -83 -440 -482 -18 -295 -312 101 336 -3 -23 195 42 518 101 227 200 20 -224 9 -231 229 -167 166
1497 166 -104 -198 -361 -426 -339 -59 134 19 65 269 -121 -210 485 412 74 173 145 17 -35 197 -98 -58 51
1520 51 -358 -445 -18 93 48 240 92 -236 -121 52 348 547 540 130 88 31 -162 -303 14 -174 -66 97
1542 97 -367 -351 -221 -259 -167 172 270 -422 -117 343 -264 275 645 308 -118 348 26 -271 -156 175 -288 -327
1564 -327 85 -373 -319 131 -47 -57 183 -67 -406 409 148 -21 510 182 -143 160 548 -119 259 259 -10
1585 -10 -182 103 -696 -803 122 -50 -687 -77 99 -145 19 609 254 -134 463 330 -104 323 81 -208
1605 -208 177 149 -348 -149 15 -111 -250 100 -147 -512 157 -351 -18 317 349 170 458 106 177 135 137 -157
1627 -157 -325 -445 -593 -89 -46 -224 112 288 -219 -354 81 -103 149 279 356 -198 -59 11 212 53 253
1648 253 101 -8 95 -71 -420 -185 -167 -109 -194 314 -157 -97 437 164 224 213 5 64 200 266 126 56 -34
1671 -34 -233 174 -20 -152 -272 4 -210 -273 -96 22 -259 -25 -54 -24 -9 347 -68 51 180 -7 37 365
1693 365 101 -279 161 -131 95 -274 -71 -18 -139 -238 -222 -172 -190 -89 430 82 75 497 123 162 150 208 -81
1716 -81 21 53 151 -296 -304 -240 -113 -296 -364 57 -75 351 215 -196 -7 218 124 116 162 -1 137 82 -1 16 -535
1741 -535 -62 135 -90 56 -237 60 11 94 95 3 54 -299 -101 204 0 -27 85 72 269 7 230 -220 42
1764 42 -45 -196 191 -49 128 52 -80 -286 -126 92 31 134 203 185 217 119 196 100 91 182 -136 -14 224 -13
1788 -13 -437 -292 -135 -357 -98 -48 254 161 145 44 195 269 201 75 152 57 -84 -150 -26 -86 58 -285 -447
1811 -447 -280 -112 -162 49 170 -348 -84 137 68 18 104 288 308 -92 388 -212 95 -59 -213 -367 -130 42
1833 42 -317 -84 90 -240 -10 65 -166 -5 86 -161 149 106 170 342 248 108 9 -162 -159 169 42 204 40
1856 40 -154 -159 -99 -148 59 -351 -239 28 176 162 188 140 -116 143 89 224 -158 309 198 -135 28 -162 -320
1879 -320 -417 144 -86 33 47 -142 -75 158 371 238 110 173 -33 136 114 -62 116 226 -110 -258 -190 -29
1901 -29 -368 -293 -177 -215 217 154 -56 1 98 295 210 57 54 111 90 -108 -52 -8 -60 -14 -216 -105 -56 92 125 -75
1927 -75 -158 -150 119 -82 359 16 115 108 299 29 246 75 124 -43 -14 -126 -291 -201 -207 -279 -86 -283 123 194 250
1952 250 -10 325 217 -84 145 418 234 -30 227 -20 -400 170 -80 -116 -329 173 -147 -209 112 50 13
1973 13 -77 238 -177 41 296 -256 92 240 121 -265 280 322 -377 2 218 -329 -76 158 -66 -228 -5
1994 -5 -82 -166 195 -88 -59 193 221 61 -8 -47 93 87 48 -87 -85 -244 -429 -86 -430 -122 -190 -231 62 -100 5
2019 5 -22 130 98 178 87 274 53 -207 -66 3 -399 -116 -185 -158 188 45 -18 -343 -27 9 -155 185 225 -123
2043 -123 214 326 -27 53 229 170 -408 309 191 -331 10 216 -384 76 9 23 -232 118 198 -203 122 329
2065 329 -70 297 375 287 -286 39 259 -160 328 79 -165 -133 -56 -239 -234 76 213 -462 -258 37 87 -33
2087 -33 598 225 -11 356 316 -1 -142 287 26 -398 -61 86 -370 21 21 -213 -206 -21 123 -338 46 316
2109 316 -103 196 239 140 8 223 186 -345 100 311 -246 -249 59 -109 -80 -124 146 -311 112 280 -425 -53
2131 -53 367 -118 153 572 422 -77 320 164 -338 -121 36 -261 -6 209 -108 -312 204 222 -337 100 300
2152 300 -87 -15 256 -173 -269 295 194 8 115 282 -155 -261 148 37 -61 113 71 -195 5 115 -217
2173 -217 -5 196 177 4 162 374 -19 134 143 36 131 236 118 -199 -196 -37 -263 3 70 -106 49 -213
2195 -213 8 142 -44 215 87 -82 47 382 205 -20 145 -120 -122 48 183 -377 -50 -330 -607 -63 45
2216 45 7 36 417 -3 -192 169 35 81 20 125 -171 -214 -51 -267 -140 146 -171 -106 -11 -172 -381 -57 -116
2239 -116 -317 -93 -70 224 89 29 296 18 141 102 -262 45 67 246 -108 -32 111 -198 -65 136 -230 -86
2261 -86 107 98 -3 -25 172 3 -58 374 62 7 98 314 -197 36 -205 -168 -78 -79 -174 -290 7 121 -15 -175
2285 -175 -129 41 -157 168 223 21 158 -34 154 -240 -59 -102 -143 36 -133 -211 -340 -296 -96 45 164 -82
2307 -82 143 93 224 24 219 298 41 18 39 -149 -29 41 -146 -31 -414 -86 156 -68 23 -326 -20 95
2329 95 11 16 -29 -26 241 40 -71 -123 174 192 -199 -99 47 -142 -73 60 119 70 -319 -96 -41 -278 -31 268
2353 268 284 111 3 117 119 61 31 -28 -17 5 6 -73 -43 -149 124 42 -11 -65 -288 -147 -49 -71 -323 93 152 277
2379 277 26 -130 235 125 93 -2 -219 105 -93 -352 -187 -168 -36 215 -11 262 -147 -286 -112 -111 -26 131
2401 131 271 -343 145 59 -68 -5 113 314 7 -14 -133 234 -256 -7 290 -112 -164 273 35 69 335 234
2423 234 294 -106 231 86 -18 87 167 37 47 -187 -63 -113 -235 101 38 -161 104 -129 -84 39 -20 -230
2445 -230 -159 -55 22 23 -21 -86 128 -99 164 0 -175 -361 -202 -144 -62 67 -72 -88 -193 68 -93 -2 -218
2468 -218 12 210 -64 -90 61 247 -109 -43 187 125 -56 46 27 -159 -97 30 -120 75 314 -92 45 240
2490 240 76 15 72 282 -220 164 -20 -228 -100 57 -111 -218 44 55 -356 5 -17 180 3 62 11 143
2512 143 295 123 -78 72 227 -163 45 64 149 -98 38 50 -56 -383 -74 -182 -312 52 154 -294 6
2533 6 81 64 -126 121 176 -98 93 102 -244 319 333 167 -270 12 -294 -58 23 -9 -101 27 -85 -151 183 184 271
2558 271 86 215 103 -138 121 463 -187 50 -225 142 -42 -16 -33 10 10 -30 8 -171 160 -65 353 51
2580 51 157 34 135 -144 56 12 412 45 -153 59 66 -137 -173 61 61 -242 153 8 -84 216 -58 -221 -283
2603 -283 202 -92 -8 240 34 39 -88 88 -22 -182 -62 -98 -182 -36 -177 -383 214 -160 -319 -77 -59 -183
2625 -183 -290 167 450 234 182 -21 42 -121 -21 68 169 -77 -28 -309 104 -123 -1 5 14 -132 -131 122 -169
2648 -169 44 -42 164 279 198 201 47 -180 27 -68 0 -70 32 -122 -86 179 -103 -222 -188 127 -148 -71 136
2671 136 -144 -67 49 189 -260 -146 26 -18 -185 54 -108 -42 -150 40 -152 183 254 -285 -48 -215 231
2692 231 -219 200 -8 323 -187 -193 -40 156 133 -70 -153 27 12 -200 -155 -81 38 -128 95 75 -44 82 245
2715 245 67 12 -29 320 49 123 197 -298 167 39 -113 -243 -9 -250 -246 -235 133 125 -77 -193 -250 99 300
2738 300 -122 116 25 -196 133 -19 9 159 -228 51 40 -199 -133 7 33 7 -8 46 81 113 131 -253 -16 261
2762 261 131 112 -253 166 -142 -83 -107 -56 -23 -179 -9 100 95 2 -134 -102 -127 -9 83 -146 135 63 251 -111
2786 -111 29 271 119 -384 43 84 -101 126 115 -43 -317 -64 -131 80 132 -100 53 -95 -44 -50 -33 274 -71
2809 -71 173 -39 -99 -174 -281 103 -191 -218 -33 72 -87 59 -131 144 83 -129 -37 -183 123 -39 -37 240 57
2832 57 294 -313 -2 -143 246 108 -373 48 -126 -20 51 -96 79 147 67 431 203 155 -2 -110 -328 -16
2854 -16 -228 -214 96 39 -63 121 136 -280 100 -58 -62 -120 19 -38 20 219 191 -133 -128 47 118 -12 -199 -156 -223
2879 -223 -187 -49 -80 32 -194 -152 32 -195 88 -31 197 111 62 70 -8 -83 142 -168 72 -42 40 -157 17
2902 17 -78 -215 -169 -289 59 -240 12 -159 -39 64 69 0 -126 -51 -76 -31 -113 -147 -157 38 -37 -89 42 -107 35
2927 35 -262 -166 213 9 164 -214 -154 3 -148 45 53 22 36 -156 -82 29 -238 86 202 -221 30 322 -32
2950 -32 155 -29 -75 -17 -114 153 53 -114 -61 -31 13 -69 96 21 34 95 189 -33 -66 182 11 -87 10 -33 -61 310
2976 310 21 34 109 259 -89 180 228 104 103 104 -114 -208 108 -154 -155 -29 -74 -167 -58 -43 135 247 125 54 -30
3001 -30 74 115 158 245 -19 189 -81 -143 -250 -194 101 285 104 -237 -55 -70 93 25 -104 94 -131 132 -13
3024 -13 20 184 148 48 -76 123 97 66 -133 -77 -14 161 -149 -401 153 -345 -133 -152 -149 132 -166 82 -191
3047 -191 264 131 168 40 207 111 -215 -111 39 -47 -71 58 101 -293 24 33 -113 -15 140 52 -166 -137 264
3070 264 145 114 3 -21 -297 7 -281 66 -112 226 -19 -21 162 75 81 34 96 27 37 95 75 -221 132 -35
3094 -35 146 140 -156 66 -95 -27 41 -144 47 47 -358 164 112 -180 -86 118 -162 -98 121 -294 -84 273 5
3117 5 119 -175 180 37 -42 -204 -203 -43 83 193 9 -130 -71 12 -108 -242 -215 -92 -111 53 -108 21 -11
3140 -11 -22 74 80 66 -7 -116 113 23 -103 -242 -38 -22 -143 171 -132 77 -29 70 155 -25 -139 176 76 -50
3164 -50 -98 -138 157 -112 -193 68 -277 -260 -182 -108 -236 -16 257 -192 -28 93 50 -278 180 1 115 105 30
3187 30 -7 -61 155 23 -73 128 -99 -164 -46 4 91 30 -99 129 -315 2 213 91 -91 33 28 -237 26
3210 26 131 126 3 43 -316 64 313 -162 -91 -32 -197 342 64 323 59 -155 -138 -168 58 -61 167 -169 -43
3233 -43 81 -499 -102 128 14 -346 -179 -132 -159 370 225 -300 127 334 92 15 358 -100 -143 215 101 24
3255 24 35 -53 196 -99 -127 -142 -83 -8 86 27 -65 169 139 -174 4 158 163 -65 78 -10 -16 155 -55 -175 -18
3280 -18 -193 68 129 0 -19 21 181 -218 194 305 142 -37 -132 -5 -3 -112 -156 -35 -196 90 -184 72 -28
3303 -28 137 69 6 39 -105 186 105 287 38 -24 98 164 37 -74 -266 171 60 -129 -142 -15 -22 173 -103
3326 -103 -199 -283 -221 -2 5 -20 49 -190 -115 -35 77 66 3 -72 27 -34 -115 18 272 170 -338 345 -52 52 -169
3351 -169 69 81 -82 -292 -144 321 152 -98 -278 133 95 58 162 -173 4 124 70 45 -111 -96 -144 127
3373 127 153 -108 133 -121 77 -193 144 -178 361 9 48 218 -188 161 -150 17 -10 121 -174 -105 67
3394 67 114 27 -150 111 92 93 63 -280 -45 149 101 86 -278 -61 -105 41 33 192 75 70 22 93 -41 -39 -59 -327
3420 -327 358 -88 -8 71 -125 208 207 -201 182 74 192 -56 54 120 -50 86 112 -68 171 55 155 146 56
3443 56 -185 -6 91 23 222 -150 79 -23 22 128 -197 36 19 -6 5 -215 -224 40 35 -24 -134 -76 -57 -59 109
3468 109 -138 -8 98 254 60 177 35 284 150 -32 43 -203 -40 -71 8 -7 44 62 99 42 10 138 55
3491 55 -120 22 -137 -111 147 -38 -95 45 -23 -110 -58 60 -90 148 93 -142 15 -29 97 -130 -56 -87 3 -133
3515 -133 118 41 -89 -8 10 47 328 -24 -12 85 132 198 -55 -49 190 -126 -173 -97 46 -2 -367 -296 4 -245 -74
3540 -74 213 90 -101 -242 188 -112 -85 44 162 -79 -207 7 -157 217 269 36 -68 68 -80 -117 -134 23
3562 23 49 106 -133 0 194 63 75 -327 19 -134 -23 -258 11 -222 115 229 126 -373 18 101 -77 327
3584 327 119 -59 85 218 120 -221 -207 -33 36 78 127 -84 34 32 -119 154 255 -30 37 8 -183 30 -105
3607 -105 -75 298 130 -12 -261 -83 -8 -250 -52 -121 -63 9 -232 -40 134 -328 59 95 188 -112 267 68
3629 68 -97 64 50 91 -138 213 -52 -143 -14 -86 -225 -64 -50 -195 87 -159 122 -80 230 -91 -78 -7 42
3652 42 -123 -250 181 73 109 389 18 306 -118 74 96 207 -47 211 108 100 -191 -309 -21 86 221 126
3674 126 34 238 -136 -143 275 -18 -24 39 182 -161 295 -23 -134 -4 56 -211 -105 245 40 46 -105 -4 -155
3697 -155 -6 44 -101 18 -53 10 -24 97 3 -31 -45 78 60 38 41 33 -12 24 -219 122 91 -150 -12 28 93 168
3723 168 47 24 -143 -1 -98 162 40 44 -114 -54 189 -22 53 212 -53 200 -40 -28 116 99 200 -81 -33
3746 -33 51 140 172 70 -244 -47 -292 248 18 229 -161 -68 -135 -13 -152 79 53 83 280 54 -125 109 -94
3769 -94 212 57 296 246 -19 188 -360 170 -172 -62 17 -63 127 -89 -125 281 -14 137 -104 -14 97 -163
3791 -163 183 162 -54 -152 147 135 -140 26 -213 -215 -70 -18 -32 -111 100 12 236 -119 -153 99 196 -271 62 -150
3815 -150 86 -109 7 263 -179 234 22 -139 41 -208 -116 99 -156 109 -33 11 74 -79 130 -189 -112
3836 -112 -78 -206 39 -108 -26 157 -243 37 1 160 160 -20 28 128 135 -189 115 99 197 -50 88 1 -310 -194
3860 -194 55 -114 14 66 30 247 54 -31 -318 -46 -165 99 66 -156 -34 -91 42 -127 -367 119 -58 -41
3882 -41 118 -23 -124 3 75 17 91 -186 -57 39 -30 55 106 -48 -183 -103 -48 6 -62 -111 98 105 -249 4 -51
3907 -51 38 -132 -152 32 88 -209 -141 92 130 138 106 -123 -8 -64 -101 -280 66 99 -355 55 -137 -12 -181 52
3931 52 149 -115 -52 -27 -29 154 277 -44 49 -85 -112 -38 225 142 -15 196 -20 -54 54 99 -76 284 107 357
3955 357 -146 -108 12 3 145 -15 -106 25 30 44 51 35 33 -289 -205 -124 -175 -221 -206 212 36 -64 157 47 -124 -7
3981 -7 -100 47 254 -118 68 12 1 -203 -20 -105 53 -65 -44 -76 -64 122 -28 8 342 127 -344 -151 -191 -71
4005 -71 -75 -46 199 9 293 -59 -204 9 -69 367 -121 122 -98 155 -162 -11 182 9 97 26 132 -6
4027 -6 70 210 168 38 39 -91 -61 106 -107 -106 71 -14 -51 36 108 -30 105 -143 -247 -119 162 -210 -143 -202 107
4052 107 62 -146 1 11 95 62 -2 161 47 -33 4 -31 35 -163 -10 -107 378 64 77 -140 148 240 350 10
4076 10 121 21 -64 64 119 69 -308 -4 -198 25 54 -215 49 36 147 -350 -207 -44 -151 -75 -299 9
4098 9 221 110 19 -163 -159 133 -245 -27 -46 -25 -170 -6 23 101 -12 -78 55 -107 -199 103 -181 72 86 -112
4122 -112 -56 -76 3 19 53 -83 -249 -121 55 144 -92 101 -24 -79 -114 -21 -126 -23 -108 46 5 9 -35 14 103
4147 103 -24 12 -55 237 97 -66 15 131 -10 50 100 159 35 -135 118 40 70 -158 -152 124 93 -205 187 5
4171 5 137 249 -50 -94 20 73 118 -184 -28 98 15 190 233 -88 -119 157 -135 84 41 -134 -267 -45 236
4194 236 84 116 -67 -67 10 288 89 156 102 -190 -34 -2 82 -256 -141 -9 -62 7 -134 89 60 -41 -88 229
4218 229 -16 -244 -78 55 272 113 124 25 34 18 -219 -363 -238 140 -101 0 115 178 -126 -149 28 3 -153
4241 -153 -91 -150 -145 113 188 164 -83 239 92 148 142 96 27 62 -155 191 -223 70 28 -37 -4 -183 -260 -275 128 -48
4267 -48 -60 -58 -128 57 -139 -140 168 -125 140 42 201 153 18 113 -110 167 -242 -85 -116 89 184 5 90 -71
4291 -71 -21 -115 157 105 -159 -242 108 129 79 -149 -56 -57 -4 -114 -195 -215 -195 169 89 85 114 134 -348 48 -64 -35 -4
4318 -4 -222 -98 126 -71 78 184 -18 113 124 -191 -418 165 54 -86 -132 208 96 79 -126 183 -25 -87
4340 -87 -3 -127 30 188 -128 -62 156 -16 -68 7 -32 4 169 80 -247 165 174 -36 38 30 -184 95 95 136 -94
4365 -94 145 -104 -101 -58 -185 45 46 104 -24 104 -137 14 31 55 146 3 -189 112 -33 32 -26 -21 91 -112 135
4390 135 -277 -194 -18 -13 -33 123 -75 -81 282 189 63 -205 -18 -119 210 140 -20 70 100 -136 -140 228 116 -291
4414 -291 -189 -67 291 -113 163 -131 -56 -64 -43 -175 -517 10 -21 -138 24 54 -61 10 -16 -154 -54 -76 -52
4437 -52 142 240 221 152 46 -55 33 -189 -30 -14 -236 16 -67 -162 -224 33 174 141 -272 -284 88 -18 8 26
4461 26 -1 -29 -35 125 -92 84 -138 -153 165 93 112 -276 119 141 223 -10 83 -48 155 -131 -22 -20 -11 115 -70
4486 -70 -56 195 -210 185 -33 -53 47 -66 267 -9 -74 -137 50 94 -100 -72 301 12 21 -95 29 9 117
4509 117 64 -61 -45 167 -26 -33 -85 96 -43 198 137 -86 -14 -50 114 -226 -30 -95 38 -163 -128 323 181
4532 181 55 -255 -157 150 -31 -28 -85 -223 -22 29 267 16 174 -60 -40 146 141 -2 129 172 -287 29 -62
4555 -62 -84 -90 100 -25 40 -468 -16 -1 -79 2 20 -120 149 -303 242 293 39 -21 -54 149 -282 -124 130 132 -214
4580 -214 -148 -37 -25 43 36 -7 91 130 15 -75 123 -190 234 -189 110 -243 174 -81 72 150 182 41 -178 66
4604 66 80 65 68 -23 -113 39 26 46 17 -59 -7 44 -41 -41 -33 -207 -75 157 57 193 80 153 -270 -26 -7 83 -220
4631 -220 70 246 104 65 -57 300 123 -3 141 185 176 -56 -17 62 4 -205 -313 -24 -194 136 145 -356 -97
4654 -97 -54 124 51 71 -204 -110 -6 -85 93 -49 249 37 87 -71 -57 -53 -167 38 -131 31 -56 127 68 64 166
4679 166 -65 -71 28 197 -4 6 -104 40 204 -260 -63 -36 146 -127 136 81 19 121 111 -59 152 -67 12
4702 12 175 152 209 -2 -30 -148 254 106 -138 -92 115 60 193 -59 180 18 253 -10 197 173 10 -4 144
4725 144 99 114 -82 -131 117 -29 127 -207 306 -95 -47 30 78 207 4 -22 38 24 150 -74 -158 -5 -125
4748 -125 144 30 50 -194 -151 -2 -56 -309 3 46 -22 -58 51 13 28 -158 -38 1 30 164 -58 2 -311 -130
4772 -130 49 -131 52 -194 -224 -29 38 248 -3 155 -48 46 -165 113 -53 -69 2 -56 140 -229 -15 -52
4794 -52 -116 38 -109 -295 45 225 -231 -60 88 -127 -73 -40 -88 -1 65 -215 -40 216 -31 204 -101 -165 132
4817 132 -89 150 -31 -140 -226 90 -63 17 125 -37 5 19 113 -71 211 -15 38 49 122 288 66 26 145
4840 145 -95 195 243 -231 265 -46 -144 -121 -55 60 100 102 -93 -36 -243 80 34 97 65 238 -40 21 -16 61 -223
4865 -223 115 44 236 -92 -306 -8 -206 -92 -54 7 -17 -40 99 177 -93 113 -70 98 335 -142 -114 12
4887 12 76 187 -20 253 47 -13 -66 -180 181 -34 168 -53 -95 273 -119 -15 161 -241 61 16 18 -75 188
4910 188 -195 -315 136 -59 -130 295 -116 9 32 25 171 95 125 -132 149 111 400 279 111 23 -130 -265 111
4933 111 -95 73 76 -174 -151 202 130 240 14 63 203 83 -282 36 83 33 358 175 108 -171 81 -11 297
4956 297 -120 103 -157 13 312 -209 -59 -159 -153 -18 -150 -41 -44 171 -85 107 218 78 -59 -254 -269 -10
4978 -10 192 154 29 8 -70 -39 -40 -84 -89 283 106 17 33 -120 36 147 135 -8 109 -160 -29 -3 -232 136 13
5003 13 19 -101 83 74 65 -37 101 272 -207 -343 -122 -76 111 127 248 40 -43 187 -248 259 97 3 28 -49
5027 -49 46 -156 -98 -9 159 78 -128 71 -84 -85 -93 -55 82 119 -40 74 149 2 117 99 290 -14 163 -134
5051 -134 50 -75 -162 91 8 -207 -111 4 -11 -255 67 129 108 13 -107 -59 120 58 -64 -287 -248 -12 93
5074 93 -36 149 210 216 -167 -50 -100 3 37 -288 -71 -38 16 60 -149 -66 -162 -16 14 157 41 291 -82 -54
5098 -54 46 -255 259 -25 40 57 -117 -92 -69 167 -27 -103 -124 -6 20 -55 -169 66 23 60 86 166 63 96 51
5123 51 -62 50 -58 -13 -171 83 -27 -52 -105 97 -40 -66 30 -94 140 114 124 198 99 -217 182 98 187 -111
5147 -111 -100 123 -54 -40 246 34 -55 -198 -165 190 154 -1 18 282 -99 -27 134 -48 25 -219 48 -52 107
5170 107 -68 -372 -204 -113 -135 171 6 -127 -124 141 -33 112 5 145 -212 21 -211 -71 152 -180 400
5191 400 -62 -236 3 -159 79 -50 -249 191 -8 159 -57 45 -363 -72 53 -70 -162 -41 70 111 -32
5212 -32 -17 10 2 165 -39 -105 110 206 210 -93 -196 3 -151 138 -6 -37 -96 110 -86 -28 138 177 14 -25 39
5237 39 -64 218 192 -132 -191 84 107 138 63 -244 232 -156 -241 149 -8 -132 173 -82 6 -97 -181 -107 329
5260 329 -139 -109 -27 122 -46 6 -134 -166 85 -135 288 40 207 -7 -71 -262 245 -71 159 -196 -165 247
5282 247 -82 355 102 -34 -28 -185 14 275 47 -144 -35 -64 -160 -64 60 -192 0 -300 -103 -196 140 54
5304 54 -19 -15 -31 -53 114 -217 -93 -104 -63 171 78 54 20 -40 -117 -383 -70 191 283 69 252 112 108 115 159 43
5330 43 -133 177 -5 -232 17 37 -172 37 -320 -111 130 -19 -349 -71 154 -54 136 -194 8 148 126
5351 126 152 -137 -96 45 -177 146 48 226 -152 -85 45 -56 11 -122 -41 161 35 73 19 -191 -285 -222 -50
5374 -50 8 109 -139 -88 -168 73 -188 124 252 135 -294 -161 159 182 18 -173 -138 -32 19 141 -147 49
5396 49 74 -1 239 29 41 -12 -340 94 69 -207 -109 3 -109 252 -70 252 -376 64 163 197 -197 96 -35
5419 -35 -114 -158 -138 -66 -11 91 -50 49 298 165 19 123 -17 174 -78 55 224 128 -190 233 -43 6 27
5442 27 -133 33 -128 2 136 78 -19 150 -2 -254 -13 82 196 3 33 -168 239 -48 66 -6 -56 -123 13
5465 13 289 -31 -46 -56 -177 114 -22 81 59 -63 26 -195 -57 59 -122 184 -131 -78 -21 -228 0 -14 131
5488 131 -110 -196 -111 44 169 -195 77 -2 -249 110 -96 -151 158 -199 222 90 169 -39 -124 -49 81 54 175
5511 175 -14 -73 -146 90 -121 -37 197 -79 72 91 54 170 65 -156 -55 -101 139 136 -38 95 -137 -95 -193
5534 -193 35 -3 -72 -171 -62 15 -54 32 213 42 82 97 -150 3 104 155 67 -39 -26 212 146 -127 -228 -136
5558 -136 244 149 -140 -33 9 44 -118 -160 -151 -87 144 -35 5 96 244 101 -75 -76 79 153 -188 45 108 -24
5582 -24 -143 134 -40 65 -365 -67 -9 240 -131 -36 16 130 68 -130 148 165 90 -161 -126 -107 -89 -83 45 -10
5606 -10 -339 122 -35 341 50 -217 76 -206 95 2 -70 -11 -1 61 114 263 126 -216 -27 121 -50 -92 -25
5629 -25 -43 -94 50 101 -49 63 -77 -169 -47 280 51 96 -87 35 -12 -85 -26 -233 74 -119 -56 66 9 239
5653 239 -96 98 -41 -122 -167 -234 76 -282 -374 49 -175 -228 -73 -320 -51 -184 21 21 -65 -190 -126 73 227
5676 227 32 36 -114 -230 300 -207 207 -19 222 110 105 -190 138 -49 -103 7 -178 -89 -92 287 104 277 -135
5699 -135 -126 17 -49 -41 98 -16 96 -75 34 22 -180 -280 41 171 -40 208 171 229 -57 -36 -264 -183 67
5722 67 -19 -147 65 -37 141 309 -10 -69 95 -159 -144 -110 -242 -198 -152 3 -31 84 -98 172 14 87 -49
5745 -49 17 -117 131 309 73 127 -53 82 5 -119 130 -153 -63 188 14 296 171 -60 26 -5 95 -25
5767 -25 0 69 -29 221 -148 199 -4 -14 49 99 50 197 280 -146 -139 167 -83 105 63 -218 42 -122 169 136
5791 136 -147 -59 152 225 121 -46 97 -147 -62 -108 147 -68 -180 -63 -54 -95 172 -82 -67 208 -234 -229 45
5814 45 31 12 -100 59 -128 -12 -24 37 42 -183 173 12 130 100 -151 116 85 9 -123 -109 65 -5 -185 372
5838 372 33 63 86 140 -25 -263 162 15 -165 47 15 147 -60 -44 93 78 -38 174 161 47 154 9
5860 9 57 -52 9 -283 34 157 -252 -57 12 -75 133 -120 -61 158 -101 -26 -118 -72 -145 -67 158 55 -297 160
5884 160 -94 -31 -153 61 -36 280 39 -31 -84 -119 -63 -39 -2 67 -166 146 131 -194 -44 83 128 11 194 90
5908 90 -232 -18 38 159 -306 -399 62 150 63 -51 -251 121 19 0 179 -138 -249 -32 33 -15 -235 193 249
5931 249 -166 -164 -53 27 78 -307 -8 -45 -309 157 -91 -32 151 -206 -159 102 -87 260 99 94 -211 -131 -155 -50
5955 -50 51 223 117 -100 32 -24 -50 190 -28 -85 48 -117 -63 97 -33 -216 176 170 251 -84 -44 -83 -68 80
5979 80 -212 41 45 10 237 115 129 320 -39 -69 63 149 133 249 -53 -278 179 -29 237 -43 -32 2 -213
6002 -213 -141 -84 -23 228 53 -153 55 -34 -14 -145 -84 -215 -19 -117 38 151 -96 -4 36 22 -224 121 -397
6025 -397 -62 107 159 -178 155 -188 -216 -82 107 -61 -157 -87 92 -103 132 -45 -68 143 225 -14 70 -188
6047 -188 212 -318 28 260 43 -128 -199 58 101 -71 -289 -31 75 78 -244 97 -206 48 101 -154 -104 24
6069 24 276 52 59 -11 -241 191 -14 59 68 198 -63 30 81 105 -116 -115 9 -110 133 393 13 -49 -135 -25 46
6094 46 -44 16 57 -9 16 243 -64 -65 -51 -299 64 -261 8 -75 -35 110 130 43 4 67 -140 -256 -53 150 250
6119 250 -23 176 -83 76 -118 -272 -211 50 54 27 65 -183 -157 94 332 31 -110 -51 -121 -132 -41 2 -16 -206
6143 -206 -35 -24 51 145 46 -59 169 -75 -205 -78 4 -214 -216 237 -28 -5 62 -55 79 -39 132 -94 302
6166 302 92 201 141 101 17 42 -39 -86 -110 -166 -79 39 -109 119 115 -75 139 -2 188 70 -324 230 83 -35
6190 -35 -323 54 -112 -94 -175 -174 117 17 -275 9 -35 61 60 -24 -285 40 38 -103 129 155 -5 105 104 -132 140
6215 140 -73 -29 -37 -30 -126 289 -87 73 312 -39 107 -236 26 -2 -174 126 -52 -114 -176 -77 -80 -30 85 198
6239 198 -38 67 -107 -14 -22 -1 -255 72 -109 137 -177 -24 0 -106 -172 9 -42 -272 -207 55 -47 26 -96
6262 -96 12 -56 -109 -11 196 -42 -114 102 -25 -95 -104 -129 -53 -27 130 -31 -54 -225 188 59 -127 -3 -39 -22 -96
6287 -96 223 -124 -91 -74 -203 -122 43 -91 -29 25 87 -222 178 33 371 -12 -188 32 396 -244 -372 202
6309 202 44 -7 51 -20 236 -43 130 -334 80 -37 29 38 -114 48 182 202 -112 183 114 -5 48 -3 -55 60
6333 60 -295 82 -73 191 21 79 73 -67 226 12 -101 -31 -79 103 34 41 149 -155 -110 -44 -110 70 47 157
6357 157 -211 78 46 204 120 114 42 378 -184 18 97 54 -249 147 119 -40 -80 -121 15 -84 -103 -21 -136 96
6381 96 92 39 28 163 -153 171 -122 -7 -174 -48 170 -220 116 99 -150 42 -355 18 163 -101 55 -238
6403 -238 130 54 373 18 36 38 0 16 33 -55 113 75 -126 -324 208 -46 329 -2 -32 18 -207 -30 2 84
6427 84 87 17 198 83 80 43 -215 175 145 55 164 49 160 -121 -158 -171 -220 -375 126 8 -81 57 25 -77 127
6452 127 -55 230 97 59 -176 -5 -77 -105 -198 43 113 48 -19 79 82 9 18 93 -7 -43 -197 54 77 -226 204
6477 204 57 -131 261 -74 -200 153 48 -88 -25 90 -37 256 -121 406 -69 -264 -26 86 360 -14
6497 -14 177 106 -205 -216 216 -106 16 -68 -40 -152 13 90 -160 74 167 -14 -19 20 237 -166 125 145 -7 -190
6521 -190 -129 116 73 89 -57 209 105 263 175 -208 250 68 -72 3 265 170 198 -108 186 51 35 85 -117
6544 -117 -52 -200 79 56 -141 -9 28 62 -96 150 -323 -219 -178 -185 2 227 -251 181 -143 -92 11 26 180
6567 180 85 -85 150 -28 -326 225 -109 8 -12 53 89 266 203 -273 -52 198 -115 5 -164 168 96 -152
6589 -152 44 -39 64 -166 -230 -155 -10 -59 -3 -67 38 -34 -36 -52 -233 -165 15 1 74 -54 -6 69 29 -128 6
6614 6 1 269 1 34 260 -54 -177 -95 -41 -70 -392 57 -1 -130 35 -266 -120 -30 -128 -165 -47 -219 136 28
6638 28 -65 9 155 -89 -54 -17 -70 168 -113 -6 174 3 -171 -90 -84 3 -226 -195 -302 18 -25 161 -53 25
6662 25 23 88 32 -120 56 -84 -250 -6 125 -31 -145 -48 136 -190 -251 -117 -50 136 -30 -121 -54 -52 119 99
6686 99 145 156 194 21 39 -29 212 7 -61 101 91 -179 12 43 3 100 -124 -110 106 36 -98 -32 -240 123 -218
6711 -218 160 52 72 -68 116 49 -450 -11 -22 -93 84 57 36 -93 -320 -320 -137 181 -105 -156 75 60 39 127
6735 127 -32 53 140 -15 89 -201 239 113 -222 -204 129 123 -84 -136 -3 -290 110 -89 88 -146 53 -8
6757 -8 13 100 237 -110 211 2 127 102 -108 14 -60 128 194 -293 -147 -5 -80 -83 -141 -110 48 -107 -22 -52 72
6782 72 0 -151 -62 -125 -108 -57 160 171 21 -75 56 84 41 219 -28 -26 269 -30 -231 -167 37 -59 40 334 -315
6807 -315 -67 27 26 148 36 39 61 14 58 276 -62 -109 77 169 4 -132 -61 -9 -120 -12 158 88 -225 -101
6831 -101 -235 -81 -143 41 47 282 0 182 255 -262 -61 -90 -241 36 -121 90 50 -78 90 57 115 201 39
6854 39 -72 -300 -218 -103 -1 211 -69 -95 -341 -185 -105 -121 -22 -27 125 -189 280 -19 56 12 -253 -91 153
6877 153 -113 -41 69 -269 134 87 2 20 188 -164 187 22 -61 187 -138 161 27 46 -259 -35 0 -164
6899 -164 123 -139 159 -319 -71 84 34 17 -2 -124 -60 195 117 36 60 -192 -33 -122 -47 -123 -203 128 36 166
6923 166 74 -3 48 -223 51 -103 -471 -60 -45 211 -1 87 85 108 -101 -258 -98 -65 -135 -107 57 -33 -187 -162
6947 -162 94 -193 196 -216 -13 330 96 258 -403 82 -89 -32 -302 -75 -100 -134 -164 77 -61 114 63 109
6969 109 -179 -100 169 -32 23 -21 105 200 342 -91 0 -18 69 -78 21 208 447 -95 69 99 -272 -147 -14
6992 -14 -220 -132 -345 -1 4 -57 197 -64 -63 -123 195 -221 -127 75 72 -148 -65 248 12 29 -99 -38 108 49 41 -51
7018 -51 -32 -110 47 207 -130 21 86 -158 -95 168 -25 166 -112 -126 -174 -28 -166 -167 -89 -141 108 67 48 71 -132
7043 -132 33 -43 68 -68 58 51 40 40 -77 13 -34 120 -31 91 153 -107 41 -85 99 -145 407 -143 138
7066 138 217 51 103 -198 99 13 448 -145 -31 46 -56 118 -152 116 -38 39 152 192 9 -133 151 -153
7088 -153 -15 -107 -131 -22 180 -14 -38 13 -177 25 -45 35 -123 184 196 33 59 137 115 2 131 43 -126 143
7112 143 -59 60 -62 40 -71 -152 80 111 24 23 274 -119 -87 -201 149 -242 -7 27 -204 152 -158 31
7134 31 -6 -80 222 142 -141 123 -202 -44 23 -86 -195 291 -45 57 -134 78 -33 99 -219 -283 65 -171
7156 -171 -139 -90 79 -92 -185 105 263 -115 12 -151 88 164 127 -96 133 6 341 274 184 -46 115 114 77
7179 77 134 87 69 -3 -82 147 -209 -63 56 -48 181 134 32 -221 -216 -69 105 -39 45 -178 295 -287 -87
7202 -87 -20 -109 295 -216 219 -152 -107 -49 -113 220 -221 -160 -72 230 42 -54 -195 -151 59 274 185 1 -5 68 156
7227 156 232 425 117 42 195 -65 -90 -29 48 128 3 -6 -95 266 69 -155 61 145 60 -145 -126 -94 24 76 -52
7252 -52 236 -30 307 -84 -225 0 -82 -76 86 -137 64 -151 -224 140 -182 14 36 -107 44 -184 -33 210
7274 210 -53 29 196 143 172 -148 -10 -181 117 -19 -9 302 72 48 -4 -162 -62 240 -133 -65 -62 71 12
7297 12 -74 -33 -30 56 -166 56 -262 -148 -83 -56 -186 69 -91 -29 -179 12 237 234 -178 -39 74 69 -156 -82 -66
7322 -66 49 17 126 233 126 -216 -116 27 -91 -20 31 -212 39 29 -348 -92 -52 149 68 76 17 -55 106 -116
7346 -116 -162 -11 9 78 95 -23 4 199 25 -30 -132 103 33 -243 136 169 -8 -233 -71 148 197 -123 -85
7369 -85 -44 14 -94 -32 -153 -16 -158 -138 174 18 200 109 -104 -44 87 26 -69 -74 -72 -82 65 -160 -79 -12 108
7394 108 192 -292 -76 -23 53 -114 89 123 -102 -156 -142 -67 178 6 416 12 77 274 240 13 166 19 -178
7417 -178 -110 -20 -130 60 -29 -42 41 24 -145 -102 -136 -190 175 -231 36 24 -116 -84 2 193 -258 32 163 251
7441 251 23 -122 -78 40 71 -30 -167 112 -32 72 10 163 1 4 87 91 -163 -229 99 -185 44 71 -82
7464 -82 79 155 -90 -79 -46 89 -104 -220 -32 -9 42 29 -196 216 -162 95 -3 -15 187 -12 123 -35 98
7487 98 309 19 -25 165 109 -40 316 -206 -296 -138 -110 28 -116 83 60 33 78 15 49 -132 79 -107 -123 180
7511 180 25 -133 104 1 106 -30 -145 -90 -132 -51 -6 -35 -78 88 96 -67 213 -14 88 -224 -111 -1 3
7534 3 9 -84 177 44 127 82 93 -124 30 -119 -235 53 82 106 341 69 -231 -171 57 118 80 129 -127 40 274
7559 274 4 -27 147 -50 5 -300 -108 -150 -170 -17 -91 -79 -56 -152 80 -288 253 114 191 -35 -26 -127 35 113
7583 113 -44 -182 -24 171 -5 115 -68 -5 -105 -253 -180 -17 98 -19 17 -257 -128 335 4 -7 -122
7604 -122 144 69 -26 53 257 -145 127 169 349 -211 168 73 318 -261 -36 -235 -37 20 16 156 71 109 -95
7627 -95 -1 -253 -233 -6 -248 304 317 214 -7 -15 29 -73 149 -54 -100 -31 -22 67 -41 -75 53 -28 -1 -246 -156
7652 -156 51 173 -75 73 -20 -22 -47 110 -211 -120 260 -6 -20 246 21 -69 -75 -11 180 -123 294 -67 79
7675 79 3 -112 -164 -39 -119 132 -73 276 -55 -267 218 -25 -98 -7 72 -180 277 -217 39 1 15 -10 -185
7698 -185 167 -217 125 66 -55 -46 -113 148 232 -189 111 -145 -175 -151 164 102 61 40 -149 105 100 -104 -65 -21 -14
7723 -14 -29 -160 100 -163 81 -288 11 66 84 187 -214 202 -181 -145 166 24 -75 -36 -182 35 -84 120
7745 120 -17 51 -155 -203 -174 143 4 134 -257 23 -29 59 277 42 68 130 140 228 91 -37 229 65 160
7768 160 -169 -116 -62 -79 -119 -57 -20 -33 14 -69 146 -206 169 35 55 -32 34 -45 17 -10 97 167 -30 -107 80 123
7794 123 -10 -69 141 -102 149 -164 -220 156 221 106 90 -170 -310 -309 26 110 85 216 195 182 -162 -222 24 -39
7818 -39 6 40 46 155 -235 -89 -256 13 -146 -14 -14 -5 4 44 70 -38 273 -58 -28 -5 -9 14 -89 -14 -39 -164 158
7845 158 -127 -72 152 82 -42 4 57 123 183 -222 -56 -220 -143 -63 -312 -262 120 -132 -160 -48 -267 -95 -48 -167
7869 -167 176 57 -42 -35 -29 -173 68 163 -49 38 -262 -2 -60 -124 123 -21 80 18 -51 -60 121 -29 -6 107 -135
7894 -135 -125 -76 -63 -111 -56 -160 137 -153 -70 -178 92 -26 191 -274 184 95 16 -94 -168 64 75 46 -74 112
7918 112 -183 109 -8 8 92 -15 -36 78 -158 -133 -105 325 155 11 96 8 104 177 -64 215 -56 -377 136
7941 136 67 -98 -187 23 3 -122 -108 -94 -35 -164 244 -29 -131 17 105 -88 133 -120 -134 33 -63 -45 -36 -111
7965 -111 -45 -275 57 -94 -63 -83 9 -91 119 6 -63 9 -68 201 -38 93 31 -341 -70 -11 -279 59 -39
7988 -39 210 69 33 31 93 -112 40 8 -269 -156 -23 -215 -87 -20 41 113 0 113 -30 -136 5 217 165
8011 165 -82 -112 126 93 -42 -110 -22 -11 32 99 11 -242 58 150 -38 -113 154 -115 -134 72 -130 103 144 78
8035 78 77 26 166 94 -213 -139 -292 -102 -57 -14 144 73 -53 -50 -59 -5 210 -296 -31 -52 133 -289 -9 -6 102 1
8061 1 115 222 183 72 -264 430 42 -10 -143 116 -342 74 139 199 -99 -219 81 95 -11 -59 -263 64 -8
8084 -8 226 -104 -17 52 -39 -70 -72 143 -215 -47 39 107 26 -169 -186 114 144 -22 86 -139 -159 -17 -15 300 226 213
8110 213 -152 -12 132 -23 243 34 -27 73 -21 153 -166 63 -13 -99 325 304 -305 -5 -47 26 -105 -6 210
8133 210 -238 -25 26 75 -301 90 -45 91 -18 -33 23 -94 -73 -215 240 186 43 3 108 -56 -19 2 -8
8156 -8 37 -27 -59 -81 69 7 116 186 -155 -285 150 38 -12 -213 101 -187 -11 -136 50 181 426 157 -98
8179 -98 -2 -74 -58 -17 -92 -141 -55 -85 4 85 2 -37
8191c7
##END NTUPLES=NMR FID
##END=
