##TITLE=1H_4e1303
 DMSO-d6
 8 sc, 
 14.3.2023
##JCAMPDX= 6.0         $$ Bruker NMR JCAMP-DX V2.0
##DATA TYPE= NMR FID
##DATA CLASS= NTUPLES
##ORIGIN= UXNMR, Bruker Analytische Messtechnik GmbH
##OWNER= root
$$ XWIN-NMR		Version 3.5
$$ Tue Mar 14 14:15:37 2023 Russian Standard Time (UT+4h)  she@DPX200
##.OBSERVE FREQUENCY= 200.13135
##.OBSERVE NUCLEUS= ^1H
##.DELAY= (6, 6)
##.ACQUISITION MODE= SIMULTANEOUS
##.ACQUISITION SCHEME= undefined
##.AVERAGES= 8
##.DIGITISER RES= 18
##SPECTROMETER/DATA SYSTEM= spect
##.PULSE SEQUENCE= zg30
##.SOLVENT NAME= CDCl3
##.SHIFT REFERENCE= (INTERNAL, CDCl3, 0, 15.7039)
##AUDIT TRAIL= $$ (NUMBER, WHEN, WHO, WHERE, WHAT)
$$ ##TITLE= Audit trail, XWIN-NMR		Version 3.5
$$ ##JCAMPDX= 5.01
$$ ##ORIGIN= Bruker BioSpin GmbH
$$ ##OWNER= she
$$ F:/spectra/data/she/nmr/H-F/1/audita.txt
$$ ##AUDIT TRAIL=  $$ (NUMBER, WHEN, WHO, WHERE, WHAT)
(   1,<2023-03-14 14:14:30.40 +0400>,<she>,<DPX200>,
      <created by zg, POWCHK disabled, PULCHK disabled
       configuration hash MD5:
       00 E9 B6 7A A2 85 ED C7 34 08 36 98 17 FE 4E 26
       data hash MD5: 16K
       31 7A FE 1C 2B 68 A3 DF 20 D4 9D 51 66 3A 13 B5>)
$$ ##END=
$$ 
$$ hash MD5
$$ 95 FA FA F9 E5 3D 13 0E 85 E4 BC 6B 43 84 E1 20
##$RELAX= 
##$RELAX= 
##$RELAX= 
##$RELAX= 
##$RELAX= 
##$RELAX= 
$$ Bruker specific parameters
$$ --------------------------
##$DU= <F:/spectra>
##$EXPNO= 1
##$NAME= <H-F>
##$PROCNO= 1
##$TYPE= <nmr>
##$USER= <she>
##$AMP= (0..31)
100 100 100 100 100 100 100 100 100 100 100 100 100 100 100 100 100 100 
100 100 100 100 100 100 100 100 100 100 100 100 100 100 
##$AQSEQ= 0
##$AQ_mod= 1
##$AUNM= <au_zg>
##$AUTOPOS= <>
##$BF1= 200.13
##$BF2= 200.13
##$BF3= 200.13
##$BF4= 200.13
##$BF5= 200.13
##$BF6= 200.13
##$BF7= 200.13
##$BF8= 200.13
##$BYTORDA= 1
##$CFDGTYP= 0
##$CFRGTYP= 5
##$CHEMSTR= <none>
##$CNST= (0..31)
1 1 145 1 1 1 1 1 1 1 1 1 1 1 1 1 1 1 1 1 1 1 1 1 1 1 1 1 1 1 1 1 
##$CPDPRG= <>
##$CPDPRG1= <>
##$CPDPRG2= <>
##$CPDPRG3= <>
##$CPDPRG4= <mlev>
##$CPDPRG5= <mlev>
##$CPDPRG6= <mlev>
##$CPDPRG7= <mlev>
##$CPDPRG8= <mlev>
##$CPDPRGB= <>
##$CPDPRGT= <>
##$D= (0..31)
0 1.2 0 0 0 0 0 0 0 0.06 0 0.03 0 0 0 0 0.0002 0 0 0 0 0 0 0 0 0 0 0 0 
0 0 0 
##$DATE= 1678788869
##$DBL= (0..7)
120 120 120 120 120 120 120 120 
##$DBP= (0..7)
150 150 150 150 150 150 150 150 
##$DBP07= 0
##$DBPNAM0= <>
##$DBPNAM1= <>
##$DBPNAM2= <>
##$DBPNAM3= <>
##$DBPNAM4= <>
##$DBPNAM5= <>
##$DBPNAM6= <>
##$DBPNAM7= <>
##$DBPOAL= (0..7)
0.5 0.5 0.5 0.5 0.5 0.5 0.5 0.5 
##$DBPOFFS= (0..7)
0 0 0 0 0 0 0 0 
##$DE= 6
##$DECBNUC= <off>
##$DECIM= 32
##$DECNUC= <off>
##$DECSTAT= 4
##$DIGMOD= 1
##$DIGTYP= 9
##$DL= (0..7)
0 120 120 120 120 120 120 120 
##$DP= (0..7)
150 150 150 150 150 150 150 150 
##$DP07= 0
##$DPNAME0= <>
##$DPNAME1= <>
##$DPNAME2= <>
##$DPNAME3= <>
##$DPNAME4= <>
##$DPNAME5= <>
##$DPNAME6= <>
##$DPNAME7= <>
##$DPOAL= (0..7)
0.5 0.5 0.5 0.5 0.5 0.5 0.5 0.5 
##$DPOFFS= (0..7)
0 0 0 0 0 0 0 0 
##$DQDMODE= 0
##$DR= 18
##$DS= 0
##$DSLIST= <SSSSSSSSSSSSSSS>
$$ [...]
##$SUBNAM2= <"">
##$SUBNAM3= <"">
##$SUBNAM4= <"">
##$SUBNAM5= <"">
##$SUBNAM6= <"">
##$SUBNAM7= <"">
##$SUBNAM8= <"">
##$SUBNAM9= <"">
##$SW= 18.05172834244
##$SWIBOX= (0..15)
0 0 2 0 0 0 0 0 0 0 0 0 0 0 0 0 
##$SW_h= 3612.71676300578
##$TD= 16384
##$TD0= 1
##$TE= 0
##$TE2= 300
##$TE3= 300
##$TEG= 300
##$TL= (0..7)
0 120 120 120 120 120 120 120 
##$TP= (0..7)
150 150 150 150 150 150 150 150 
##$TP07= 0
##$TPNAME0= <>
##$TPNAME1= <>
##$TPNAME2= <>
##$TPNAME3= <>
##$TPNAME4= <>
##$TPNAME5= <>
##$TPNAME6= <>
##$TPNAME7= <>
##$TPOAL= (0..7)
0.5 0.5 0.5 0.5 0.5 0.5 0.5 0.5 
##$TPOFFS= (0..7)
0 0 0 0 0 0 0 0 
##$TUNHIN= 0
##$TUNHOUT= 0
##$TUNXOUT= 0
##$USERA1= <user>
##$USERA2= <user>
##$USERA3= <user>
##$USERA4= <user>
##$USERA5= <user>
##$V9= 5
##$VALIST= <valist>
##$VCLIST= <CCCCCCCCCCCCCCC>
##$VD= 0
##$VDLIST= <DDDDDDDDDDDDDDD>
##$VPLIST= <PPPPPPPPPPPPPPP>
##$VTLIST= <TTTTTTTTTTTTTTT>
##$WBST= 1024
##$WBSW= 4
##$XGAIN= (0..3)
0 0 0 0 
##$XL= 0
##$YL= 0
##$YMAX_a= 162650
##$YMIN_a= -151012
##$ZGOPTNS= <>
##$ZL1= 120
##$ZL2= 120
##$ZL3= 120
##$ZL4= 120
##$ABSF1= 10
##$ABSF2= 0
##$ABSG= 5
##$ABSL= 3
##$ALPHA= 0
##$AQORDER= 0
##$ASSFAC= 0
##$ASSFACI= 0
##$ASSFACX= 0
##$ASSWID= 0
##$AUNMP= <proc_1d>
##$AZFE= 0.1
##$AZFW= 0.1
##$BCFW= 1
##$BC_mod= 2
##$BYTORDP= 1
##$COROFFS= 0
##$CY= 11.3945322036743
##$DATMOD= 1
##$DC= 2
##$DFILT= <>
##$DTYPP= 0
##$F1P= 2.36226072786647
##$F2P= -0.459571619588291
##$FCOR= 0.5
##$FTSIZE= 0
##$FT_mod= 4
##$GAMMA= 1
##$GB= 0.15
##$INTBC= 1
##$INTSCL= 1
##$ISEN= 128
##$LB= 0.24
##$LEV0= 0
##$LPBIN= 0
##$MAXI= 10000
##$MC2= 0
##$MEAN= 0
##$ME_mod= 0
##$MI= 1.114404
##$NCOEF= 0
##$NC_proc= 0
##$NLEV= 6
##$NOISF1= 3.799351
##$NOISF2= 2.8
##$NSP= 1
##$NTH_PI= 0
##$NZP= 0
##$OFFSET= 15.70392
##$PC= 1
##$PHC0= -19265.72
##$PHC1= 10.00074
##$PH_mod= 1
##$PKNL= yes
##$PPARMOD= 0
##$PSCAL= 0
##$PSIGN= 0
##$REVERSE= no
##$SF= 200.130013532006
##$SI= 16384
##$SIGF1= 3
##$SIGF2= 2
##$SINO= 400
##$SIOLD= 16384
##$SREGLST= <1H.CDCl3>
##$SSB= 0
##$STSI= 0
##$STSR= 0
##$SW_p= 3612.71676300578
##$SYMM= 0
##$S_DEV= 0
##$TDeff= 0
##$TDoff= 0
##$TI= <>
##$TILT= no
##$TM1= 0
##$TM2= 0
##$TOPLEV= 0
##$USERP1= <user>
##$USERP2= <user>
##$USERP3= <user>
##$USERP4= <user>
##$USERP5= <user>
##$WDW= 1
##$XDIM= 8192
##$YMAX_p= 0
##$YMIN_p= 0
$$ End of Bruker specific parameters
$$ ---------------------------------
##NTUPLES= NMR FID
##VAR_NAME=  TIME,          FID/REAL,        FID/IMAG
##SYMBOL=    X,             R,               I
##VAR_TYPE=  INDEPENDENT,   DEPENDENT,       DEPENDENT
##VAR_FORM=  AFFN,          ASDF,            ASDF
##VAR_DIM=   8192,          8192,            8192
##UNITS=     SECONDS,       ARBITRARY UNITS, ARBITRARY UNITS
##FACTOR=    0.0002768,     1,               1
##FIRST=     0,             0,               0
##LAST=      2.2672688,     0,               0
##MIN=       0,             -151012,         0
##MAX=       2.2672688,     162650,          0
$$ Real data points
##PAGE= N=1
##DATA TABLE= (X++(R..R)), XYDATA
0 0 0 0 0 0 0 0 0 0 0 0 0 0 8 -8 8 -8 16 -16 16 -24 24 -32 40 -48 56 -64 72 -87 96 -112 128 -144 168 -189
34 -189 213 -240 269 -301 336 -375 417 -464 514 -568 630 -694 766 -846 933 -1029 1133 -1246
52 -1246 1375 -1517 1675 -1856 2060 -2294 2567 -2889 3275 -3750 4348 -5129 6195 -7748 10218
67 10218 -14778 26034 -114226 -116172 55387 -60657 8117 23728 -73702 24130 162650 56656
79 56656 41393 64203 -11697 34781 115570 -10978 -66676 -24975 -60005 -29160 40516 -55416
91 -55416 -92750 7681 20335 -14846 1798 -29596 -36677 32259 49473 10639 -9085 -21604
103 -21604 9657 69172 64434 12579 -15908 -7775 37892 63433 13091 -60805 -79951 -36885
115 -36885 6505 -11951 -50975 -59986 -53283 -4365 64527 44677 -9998 5462 32122 54099
127 54099 84306 30884 -42314 -8994 21531 -6042 -10806 -41898 -78562 -16212 26302 -16652
139 -16652 -17958 -9503 -29434 24598 66339 4544 -20251 7297 7454 37793 46991 -34055 -54090
152 -54090 11382 24095 17013 14998 -37958 -45980 19433 27628 -1783 -7275 -35416 -32642 34805
165 34805 41748 -11950 -24906 -18714 1449 48436 34182 -26785 -22851 9361 12236 19299 3538
178 3538 -40319 -29206 15178 17607 3790 -11125 -32970 -10115 38159 30728 -7838 -19877 -10559
191 -10559 17195 37239 5792 -33315 -24045 1488 14650 16098 -9316 -35521 -18168 17786
203 17786 27967 10410 -18704 -25746 7262 37461 24593 -10226 -26278 -8791 20407 23923
215 23923 -1906 -26201 -25466 -624 20501 11277 -15153 -27848 -14075 17733 31056 3812 -23097
228 -23097 -13532 14126 31759 20639 -14464 -25761 1612 20527 14081 -3428 -26305 -26581 4734
241 4734 20288 3908 -16377 -26632 -10018 26580 28366 -6279 -20471 -5760 16038 31030
253 31030 14309 -18541 -18865 4304 16202 14175 -6195 -30901 -21276 9001 16868 1535 -19441
266 -19441 -26232 -132 29241 20002 -7662 -17025 -2766 21348 28720 6056 -17336 -15245 2221
279 2221 16368 11135 -13616 -29940 -15780 10686 18603 -939 -23972 -18937 9460 26549 15080
292 15080 -8731 -16599 738 21398 21134 1737 -17173 -16585 5076 20248 7762 -16492 -25424
305 -25424 -9669 14910 17277 -7068 -24586 -13017 11089 22796 10317 -12080 -15187 4401
317 4401 21198 18617 321 -16893 -12625 9664 20137 4273 -19767 -24929 -4775 16387 11556
330 11556 -11757 -22564 -8634 13512 20377 6483 -11376 -12159 5889 22356 16931 -5026 -18677
343 -18677 -9498 11498 18173 -761 -22483 -19942 1133 15706 8632 -12068 -20393 -3897 16099
356 16099 17578 3483 -11980 -11623 7988 22054 11907 -8727 -18274 -6570 14465 16420 -5703
369 -5703 -21621 -13736 5597 15988 5695 -13477 -16497 -748 15168 16362 122 -15640 -9793
382 -9793 10137 19348 7847 -12947 -18153 277 16586 11739 -5963 -19000 -11565 9941 15344
395 15344 344 -12768 -14579 -1740 16761 13585 -7215 -14637 -5612 9689 20667 6217 -17310
408 -17310 -12538 6434 12909 9107 -7122 -21166 -6172 13425 9770 -430 -10855 -16228 3223
421 3223 21738 8436 -8629 -10690 -5160 12427 19677 -3425 -19062 -8022 4063 11700 9853
434 9853 -10899 -18863 509 13168 9796 1153 -12618 -12884 8593 17808 3709 -10621 -14049 -3705
448 -3705 13860 13254 -6324 -15551 -5837 7922 13337 5033 -10833 -14395 658 14625 10229 -5004
462 -5004 -14201 -8892 8000 17010 2680 -13981 -9741 3777 12434 11551 -5364 -18009 -4898 10693
476 10693 8890 1316 -10259 -15585 2730 17355 5446 -6810 -8930 -5584 11410 19384 -1840
489 -1840 -15784 -5521 3103 9572 9711 -10379 -19141 -10 10258 6434 2455 -11616 -14956 9197
503 9197 18601 2086 -6487 -8788 -6317 12855 15967 -7577 -13506 -2740 1332 10381 10066 -12977
517 -12977 -15614 5739 9129 4405 1972 -13286 -12451 12772 14021 -3069 -6613 -8641 -3402 16459
531 16459 12052 -10786 -10185 -520 3861 13321 5750 -16682 -12072 5953 8438 6795 -2200 -17130
545 -17130 -7044 13397 10469 -681 -7054 -10499 1793 16128 6303 -7773 -8559 -4535 6433
558 6433 13586 -832 -14045 -6259 4230 7986 6058 -6288 -13745 -984 12406 8221 -3201
571 -3201 -9630 -6904 5332 13971 4109 -10673 -9564 1060 8593 10284 -973 -15629 -7880 10139
585 10139 9766 1085 -5349 -12996 -3204 15723 8546 -7444 -6798 -5079 1717 15082 4556 -13916
599 -13916 -6706 3175 4736 9323 -1656 -15978 -2356 10589 4300 1523 -5334 -12902 3780 15534
613 15534 1109 -6524 -5581 -6143 7906 14541 -4679 -12223 -3364 739 9520 10432 -10073 -13957 3354
628 3354 7970 6957 3370 -11713 -11359 7717 10675 1650 -3770 -10433 -5144 11096 9218 -4393
642 -4393 -7581 -5142 2336 11749 4774 -9019 -7849 627 6672 7269 -2586 -11261 -4329 6514 7764
657 7764 1449 -7406 -8511 2547 11219 6307 -4378 -9917 -4360 7102 10350 248 -10092 -8473
671 -8473 1855 9050 6155 -4146 -10597 -3422 8764 9954 612 -7892 -8137 1432 10329 5179 -6090
686 -6090 -8375 -3213 4961 8812 -12 -9700 -4703 5085 8089 4864 -4644 -10267 -773 8825 5389
701 5389 -1977 -7776 -7233 4072 10637 1184 -7500 -6405 -323 8758 9434 -3224 -10374 -3602 4309
716 4309 8030 4176 -7642 -10128 1255 8296 4937 -2042 -8347 -5229 6427 9494 616 -6592
730 -6592 -6756 -528 8423 6628 -4905 -8775 -1796 4978 7238 1766 -7652 -6900 3520 8376 3588
745 3588 -4007 -8801 -3504 7316 7748 -1798 -7316 -5316 1631 8800 5350 -5808 -7844 45 6383
760 6383 7004 21 -9213 -6411 4545 7564 2354 -4217 -8162 -2247 7928 6443 -2824 -6660 -4039
775 -4039 3300 8812 2527 -7480 -6809 651 6144 6508 -1014 -8476 -3653 5742 6752 1318 -5618
790 -5618 -7201 705 8045 4289 -3940 -7358 -3870 4528 8463 1221 -6706 -5101 2154 7433 5099
805 5099 -3420 -7789 -2140 5626 6203 -83 -7131 -6468 1806 7499 3487 -4346 -6732 -1447 6032 6716
821 6716 -481 -6812 -4926 2763 7101 3047 -4922 -7295 -953 6320 5720 -1364 -6551 -4363 3105
836 3105 7213 2427 -5219 -6443 -348 6137 5253 -2301 -7242 -3492 4161 6882 2004 -4919 -5923
851 -5923 616 6720 4884 -2642 -6893 -3135 4090 6145 613 -6048 -5661 1106 6465 4484 -2588
866 -2588 -6605 -2311 5148 6170 168 -5708 -5063 1551 6495 3219 -3829 -6402 -2063 4632 6111
881 6111 -228 -6198 -4174 2600 6080 3190 -3747 -6279 -697 5256 4864 -740 -6092 -4544 3122
896 3122 6590 1767 -4371 -5622 -767 5492 4911 -2192 -5964 -3293 2812 6600 2188 -5245 -5181 888
912 888 5236 4762 -1438 -6603 -2806 4095 5055 1335 -4398 -6106 562 6293 3018 -2675 -4895 -2813
928 -2813 3868 6322 74 -4989 -3528 779 5465 4182 -3597 -6015 -688 4028 4490 397 -5629
943 -5629 -4519 2533 5273 2180 -3034 -5971 -1410 5516 4736 -1112 -4852 -3751 2118 6422 2415
958 2415 -3859 -4990 -979 4764 5101 -1243 -5618 -2874 2297 5104 2065 -4299 -4913 177 4218 3898
974 3898 -960 -5685 -2572 3614 4639 993 -3387 -4584 885 5680 2652 -2303 -4321 -2492 3494
989 3494 5798 -365 -5221 -3586 643 4607 3768 -3160 -5574 -909 3714 4769 1037 -5220 -4600 2356
1005 2356 4938 2477 -2032 -5107 -1806 4373 4227 -417 -3965 -3701 1428 5487 2150 -3343 -4131 -1031
1021 -1031 3503 4061 -1354 -4745 -2249 1876 4342 1981 -3672 -4401 692 4489 3711 -723 -4748 -2243
1037 -2243 3330 4143 578 -3718 -4862 -70 5252 3001 -2594 -4492 -2334 2804 5179 677 -3886
1052 -3886 -3133 634 4580 3928 -2314 -5272 -1128 3116 4105 1284 -4005 -4292 1449 4309 1700 -1870
1068 -1870 -4363 -2321 3420 4174 -876 -3939 -2733 829 4154 2872 -2358 -3534 440 3615 3200
1083 3200 -194 -4034 -3110 2421 4254 278 -3411 -3755 -961 3317 3340 -1891 -4688 -1420 2770 4532
1099 4532 2293 -3504 -4543 1324 4480 2670 -501 -4073 -3130 2955 4598 -107 -3375 -3720 -1237
1114 -1237 4084 3583 -2620 -3922 -1182 941 3525 2013 -3777 -2975 2569 3274 1732 -256 -3821 -1636
1130 -1636 4142 2998 -1538 -2437 -2627 -131 4415 1485 -4629 -3501 380 2230 4004 469 -5128
1145 -5128 -2162 3501 3304 1645 -1047 -4630 -912 5247 3033 -1578 -2795 -3081 330 4757 1434
1160 1434 -3911 -2743 -133 1658 3424 -392 -4929 -1400 3135 2434 1118 -1242 -3759 204 4551
1175 4551 1560 -1828 -2026 -1735 1770 4493 -298 -4656 -2094 895 2243 2840 -1445 -4738 -630 3417
1191 3417 2256 217 -2513 -3707 1189 4970 1251 -2388 -2362 -1533 2093 4468 -207 -4248 -1496 1254
1207 1254 2316 2225 -1970 -4533 39 3348 1460 -140 -2435 -3098 1457 4318 267 -2506 -1787 -605
1223 -605 2831 3773 -1394 -3838 -319 1601 2226 1891 -2585 -4062 1127 3477 1008 -879 -2920 -2683
1239 -2683 2360 3639 -591 -2535 -1918 -367 3352 3140 -2174 -3287 68 1849 2805 1251 -3095 -2939
1255 -2939 1455 2748 1149 -1048 -3389 -1675 2909 2727 -1025 -2522 -1966 555 3407 1739 -2135
1270 -2135 -2527 -53 2289 2852 -44 -3364 -1888 1740 2690 739 -1946 -2988 -616 2728 2236 -1044
1286 -1044 -3000 -1605 1486 3078 1074 -2250 -2503 471 2706 2000 -680 -2902 -1666 1884 2829 92
1302 92 -2491 -2479 85 3004 2007 -1509 -2687 -772 1730 2814 758 -2667 -2212 1050 2590 1479
1318 1479 -1225 -3092 -1121 2294 2166 -319 -2342 -2312 629 3161 1275 -1967 -2312 -385 2213 2777
1334 2777 45 -2626 -1286 1335 2519 1257 -1981 -3084 -263 2221 1769 -746 -2853 -1952 1236
1349 1236 2619 598 -1818 -2057 164 2920 2516 -673 -2344 -853 1662 2802 606 -2300 -2390 26
1365 26 1907 1305 -1336 -3158 -1256 1638 2299 235 -2117 -1939 802 2855 1926 -798 -2180 -552
1381 -552 2086 2513 37 -2462 -2054 578 2212 930 -1658 -2619 -863 1805 2119 -304 -2293 -1596
1397 -1596 1026 2554 1201 -1519 -2088 140 2176 2160 -106 -2346 -1562 1370 2375 441 -1707 -2539
1413 -2539 -459 2116 1517 -1113 -2223 -1420 1025 2776 915 -2031 -1659 592 2280 2085 -367 -2549
1429 -2549 -1100 1559 1712 215 -1817 -2489 -85 2487 1115 -1286 -1651 -772 1429 2563 288 -2028
1445 -2028 -1206 684 1690 1386 -1271 -2805 -388 1813 1380 -294 -1922 -1761 1006 2716 830 -1283
1461 -1283 -1695 -557 1919 2269 -586 -2530 -1139 799 1974 1093 -1728 -2584 -155 1862 1475 -55
1477 -55 -1916 -1516 1234 2410 566 -1161 -1333 -136 1755 1794 -736 -2035 -783 937 1616 348 -1917
1494 -1917 -2039 446 1880 777 -1029 -1823 -958 1691 2406 -108 -1843 -1133 622 2251 1748 -1062
1510 -1062 -2360 -336 1363 1332 203 -2256 -2597 575 2051 433 -1034 -1689 -955 1839 2333 -206
1526 -206 -1203 -553 412 2209 1613 -1478 -1784 112 904 908 -388 -2419 -1564 1081 1320 9 -1214 -1790
1544 -1790 18 2436 1596 -730 -1307 -459 1326 2523 627 -1813 -1751 73 1581 1256 -1130 -2579
1560 -2579 -1181 943 1594 210 -1618 -1661 239 1948 1604 -215 -1492 -291 1633 1864 437 -1170
1576 -1170 -1467 432 1555 234 -1202 -1698 -927 1109 1457 -749 -1745 -581 566 1736 1229 -1437
1592 -1437 -1511 678 1748 1528 199 -1949 -1483 1404 1766 113 -1303 -1918 -706 1753 1309 -896 -1392
1609 -1392 -1166 474 2155 932 -1343 -1119 551 1509 1532 -155 -1573 -519 1087 1058 34 -1390 -1728
1626 -1728 -22 1279 561 -1099 -1409 -429 1330 1673 225 -1347 -905 968 1918 1011 -959 -1706 -483
1643 -483 1378 1399 -494 -1640 -1354 85 1589 1050 -1118 -1626 26 1293 1640 327 -1514 -983 1223
1660 1223 1326 498 -642 -1480 -592 1523 954 -808 -1152 -941 254 1716 526 -1551 -975 267 1117
1677 1117 1495 -217 -1988 -425 1428 1003 233 -901 -1626 80 1787 597 -775 -1216 -1129 733 1969
1694 1969 -50 -1592 -784 338 1303 1340 -575 -1550 -31 1141 1011 221 -1150 -1440 508 1444 346
1711 346 -905 -1279 -760 1056 1471 -491 -1518 -666 610 1479 852 -806 -1322 126 1186 972 -182
1728 -182 -1285 -1159 513 1421 206 -1163 -1381 -163 1206 1106 -311 -1258 -239 819 1299 598 -930
1745 -930 -1271 144 1234 651 -590 -1387 -912 785 1316 -113 -1155 -943 228 1228 994 -749 -1231
1762 -1231 -72 957 1105 239 -982 -1154 442 1162 705 -548 -1491 -707 1084 1201 -384 -1240 -751
1779 -751 399 1393 620 -738 -901 13 974 1238 169 -1224 -778 650 1033 344 -970 -1426 -166 1101
1797 1101 800 -523 -1205 -733 684 1343 387 -798 -767 127 1122 1140 -178 -1299 -604 670 1111 93
1815 93 -1147 -1341 244 1051 490 -651 -1037 -373 825 1157 92 -748 -791 331 1321 931 -638 -1161
1833 -1161 -331 746 1002 -192 -1294 -992 320 999 399 -716 -1053 -164 864 1016 53 -933 -769 490
1851 490 1173 525 -872 -1179 -65 1032 658 -434 -1086 -613 537 931 179 -697 -861 -112 1006 1084
1869 1084 -238 -1084 -447 704 1178 400 -980 -1013 375 911 479 -294 -1230 -646 722 831 -2 -728
1887 -728 -786 79 1254 723 -492 -973 -253 750 1142 -10 -1189 -722 344 786 348 -517 -1126 -327
1905 -327 801 807 86 -765 -782 431 1223 457 -714 -837 -19 931 793 -252 -978 -547 464 826 234
1924 234 -599 -951 -170 827 665 -263 -924 -530 496 1114 303 -848 -701 375 855 666 -320 -995 -357
1943 -357 687 623 150 -660 -1005 25 1130 638 -581 -731 -385 663 1153 -34 -923 -391 213 597
1961 597 707 -423 -1062 -192 641 571 14 -776 -953 385 980 133 -568 -819 -357 869 979 -409 -700
1980 -700 -148 200 749 532 -638 -993 150 496 594 19 -996 -736 663 1000 82 -513 -852 -54 899
1999 899 747 -342 -653 -364 167 918 422 -781 -771 191 678 523 -126 -884 -340 878 730 -158 -684
2018 -684 -674 139 910 484 -619 -646 -194 397 762 270 -875 -632 378 761 447 -481 -1157 -282 869
2037 869 670 -180 -497 -501 148 939 452 -537 -594 -206 346 775 -4 -986 -521 435 465 243 -313 -816 207
2058 207 970 402 -401 -537 -349 231 784 67 -941 -708 -44 586 836 -342 -1187 -186 671 514 194
2077 194 -457 -757 182 844 277 -184 -474 -469 424 949 -11 -616 -453 5 634 601 -458 -935 71 477
2097 477 418 -74 -647 -516 384 619 293 -243 -557 -197 669 784 -319 -696 -437 209 844 202 -808 -705
2117 -705 87 549 492 -28 -756 -479 442 710 358 -266 -686 -50 773 460 -282 -613 -286 377 613 43
2137 43 -573 -482 137 526 308 -266 -678 -329 518 667 -37 -481 -420 137 698 444 -510 -641 -92 407 566
2158 566 -9 -649 -514 224 407 298 -162 -630 -358 672 633 -130 -532 -440 172 704 320 -547 -379 -99
2178 -99 337 513 -106 -679 -395 326 528 113 -406 -790 102 684 421 -128 -536 -345 465 668 70 -439
2198 -439 -457 53 490 450 -114 -765 -390 249 568 219 -483 -474 98 653 382 -308 -568 -5 533 663 75
2219 75 -428 -514 133 519 240 -266 -685 -119 513 475 -50 -523 -503 230 621 243 -491 -490 -25 536 510 4
2241 4 -576 -419 303 528 310 -326 -616 -69 618 388 -175 -514 -357 238 531 72 -365 -280 -1 445 407
2262 407 -120 -413 -219 348 437 -11 -394 -445 163 570 219 -327 -460 -174 437 492 -28 -511 -342 93 435
2283 435 363 -258 -654 -135 376 482 31 -470 -414 278 578 220 -227 -424 -109 335 412 -164 -568 -304 142
2304 142 356 281 -261 -376 88 475 325 -107 -413 -252 142 504 100 -468 -308 -17 311 386 -188 -493 -96
2325 -96 254 375 231 -332 -485 124 428 195 -310 -488 -206 282 425 35 -394 -376 108 514 368 -248 -462
2346 -462 -144 241 398 -141 -448 -384 123 432 124 -218 -501 -132 468 514 -70 -401 -225 207 342 187 -360
2367 -360 -444 19 243 392 -16 -618 -220 338 547 271 -234 -310 -187 497 378 -126 -500 -91 306 411 174
2388 174 -347 -354 281 421 416 -39 -363 -179 278 357 3 -397 -448 51 363 248 -325 -422 -38 343 422 122 -431
2411 -431 -266 146 350 147 -210 -473 -105 319 215 -9 -310 -294 269 536 250 -359 -261 -15 257 255 -79
2432 -79 -471 -177 146 358 192 -316 -352 79 463 234 47 -407 -369 181 362 -31 -435 -426 -14 419 341 -226
2454 -226 -467 -61 256 249 244 -267 -380 -41 340 205 -166 -331 -103 368 362 -16 -246 -192 131 333 277 -154 -321
2477 -321 -33 305 245 -1 -420 -319 90 306 44 -131 -262 -200 369 368 -92 -368 -122 -16 325 310 -313 -347
2499 -347 151 146 270 57 -414 -342 298 367 79 -167 -318 -48 481 300 -267 -305 -13 22 446 287 -381 -204
2521 -204 193 266 276 -86 -408 -163 348 201 53 -188 -330 14 415 -64 -483 -323 -120 198 408 -38 -437
2542 -437 -241 108 226 300 -174 -480 -31 360 199 -11 -240 -319 127 375 103 -257 -222 -165 185 364 -87
2563 -87 -389 -86 93 153 187 -127 -433 47 277 110 -2 -270 -156 256 455 -81 -298 -107 -76 160 333
2584 333 -236 -383 -63 167 102 102 -260 -310 64 357 56 15 -133 -243 352 358 -36 -175 -204 56 290 323 -309
2607 -309 -380 -75 63 155 179 -286 -319 220 298 109 -118 -263 -189 279 114 -219 -134 -103 -50 308 243 -382 -236
2630 -236 221 90 304 114 -360 -283 324 181 47 -53 -313 -48 381 346 -192 -299 -101 66 373 86 -259
2651 -259 -213 39 127 227 18 -348 -118 258 113 32 -166 -198 50 348 85 -279 -248 -64 52 257 -35 -388
2673 -388 -104 148 191 106 -72 -381 107 216 125 -20 -249 -115 67 475 57 -263 -187 -137 150 338 -35 -345
2695 -345 -204 132 181 87 -105 -274 8 264 124 -45 -128 -143 147 373 16 -239 -156 45 203 148 -56 -357
2717 -357 -110 189 222 121 -259 -283 14 218 108 -141 -210 -43 307 331 10 -161 -129 -27 177 168 -162 -204 73
2740 73 113 166 132 -283 -192 145 230 175 -218 -321 27 204 222 -83 -202 -188 247 165 58 -191 -300 -95 212
2763 212 78 -117 -214 -129 192 188 86 -111 -184 8 229 178 -53 -202 -15 164 229 -110 -172 -244 61 198 134
2786 134 -37 -234 -93 82 213 -40 -318 -159 93 129 135 -149 -215 -40 262 248 53 -286 -221 160 177 165 -143
2809 -143 -133 -113 227 172 24 -263 -302 209 211 80 -131 -306 -117 246 248 -74 -205 -184 93 230 114 -100 -253
2832 -253 -13 165 160 -74 -162 -135 37 207 -19 -157 -208 44 139 183 -154 -155 -100 76 271 65 -68 -109 21 281
2856 281 118 -38 -255 -218 23 265 84 -239 -128 132 223 124 -18 -202 48 65 117 -66 -168 -231 -4 97
2878 97 69 -157 -187 -136 113 138 15 -207 -134 85 158 65 -241 -34 -48 183 118 -26 -175 -53 70 278 173
2901 173 -48 -91 -82 175 149 -36 -212 -38 118 138 61 -32 -113 -76 124 157 -123 -112 -18 102 232 21 -166 -37
2925 -37 50 221 142 -52 -228 6 216 138 -47 -177 -183 109 237 58 -91 -192 -144 147 224 -3 -240 -133 77
2948 77 145 161 -164 -226 -62 164 97 -1 -258 -97 57 146 -49 -161 -90 -56 165 145 -127 -236 25 93 134 92
2972 92 -225 -213 41 151 143 -36 -32 -156 227 182 -123 -91 -78 13 168 167 -66 -65 -42 30 249 8 -327 -242 150 128
2998 128 99 -34 -154 -93 149 181 -30 -143 -133 113 177 -16 -213 -44 -10 33 151 81 -197 -31 167 115 60
3021 60 10 -214 41 206 147 -39 -104 -100 20 303 113 -295 -95 51 239 164 3 -257 -48 154 18 -4 -103
3044 -103 -294 2 183 44 -113 -106 -96 42 195 -65 -167 -15 -4 67 128 -9 -226 -4 242 117 97 -104
3066 -104 -195 56 167 113 -51 -91 -102 169 266 -167 -186 -74 36 109 206 -92 -232 53 181 64 29 -238 -204
3089 -204 109 229 -124 -98 25 -49 98 208 -50 -136 -39 60 39 114 -158 -131 76 -11 -22 53 -213 -108 148 149
3113 149 -53 -171 -85 -109 227 181 -95 -164 -10 98 180 53 -139 -166 77 154 78 -1 -186 -115 142 61 -120 -46
3137 -46 -65 -116 238 131 -178 -112 52 91 89 4 -260 -12 66 32 -70 61 -163 -3 229 91 -104 35 -94
3160 -94 -79 152 39 -117 -139 63 58 84 -64 -212 -71 81 98 -61 -128 -106 -1 153 3 -214 -179 -141 53 270
3184 270 -44 -109 -138 110 89 80 -12 -193 -22 139 90 15 -48 -204 186 175 -79 14 -6 -66 114 131 60 -68 49
3209 49 15 114 57 -161 -168 82 119 58 -25 -230 -161 14 151 -6 -152 -108 -43 102 121 -136 -224 -69 48 148 53
3234 53 -193 -81 111 107 83 -34 -146 -13 118 183 -97 -115 -45 -113 156 76 -37 -237 47 153 162 43 -155 -14
3258 -14 49 90 16 -36 -106 68 138 -41 -84 -180 -88 -87 198 5 -67 -77 -30 -40 144 -34 -200 -42 -20 -11 48 -96 -98
3285 -98 38 53 126 -116 -225 -6 63 162 28 -210 -34 78 48 138 9 -200 -5 71 47 -49 -82 -193 -43 86
3309 86 35 -188 -54 1 61 139 -17 -137 -62 80 158 75 -38 -76 -18 116 101 -22 -16 -136 -15 158 160 -144 -90
3334 -90 -56 51 52 16 -99 -96 -17 43 69 -45 -62 -18 125 81 -103 -112 -90 7 36 32 -70 -163 36 96 103 -95 -105 -65 82
3363 82 122 40 -25 -152 -29 89 8 -99 -218 6 41 99 3 -50 -10 105 172 102 -48 -179 -116 144 56 -68 -119
3388 -119 -149 -37 107 142 2 -135 76 173 101 27 -169 -97 48 186 38 -288 -196 -44 14 -18 74 -46 -113 30
3412 30 120 -45 -78 -80 10 178 77 64 -32 -10 8 114 17 25 -48 1 157 68 -84 -64 -83 35 -3 -57 -129 -34 36 71
3440 71 -54 -29 -146 12 78 47 60 -105 -118 8 129 85 -37 -47 -96 86 82 15 -104 -38 10 113 -5 -107 -29
3465 -29 3 64 27 -14 -105 -36 127 149 -38 -82 -180 -9 -34 32 -41 -88 83 106 73 106 12 -21 -85 22 47 33 -74
3492 -74 -21 69 104 -11 -23 -31 32 125 59 -71 -88 20 167 94 41 -64 -11 19 24 89 9 -59 -51 14 17 -4 -57 -88 -39 178
3522 178 37 -4 -77 15 63 46 96 -91 -103 93 114 111 -88 -126 -56 21 79 23 -122 -83 34 140 80 2 -36 -62 140
3549 140 112 34 -73 71 50 18 -114 -171 -68 67 93 -8 -54 -31 50 17 78 -46 12 -30 7 120 101 45 -133
3574 -133 42 69 19 44 -27 -93 87 65 -133 -91 4 -47 128 118 -24 -53 6 -8 78 45 -157 -166 62 16 66 -23 -53
3601 -53 -21 -30 135 -20 -64 -133 -99 69 52 10 -9 -144 72 57 145 -117 22 58 -50 -42 -69 -119 -29 63 167 10
3627 10 -11 -115 19 29 138 -112 -55 -75 37 88 -7 -36 -13 13 43 79 -55 -47 -118 1 24 -54 -39 -84 -97 99 25
3654 25 -69 -44 -24 29 135 -43 -102 -76 139 97 -8 -36 10 -36 162 -41 -17 -45 -32 71 80 65 27 -32 31 116 125 -88
3682 -88 -141 -39 1 87 40 -52 -152 -41 193 -3 -8 -32 -152 -110 62 4 -115 -34 -33 43 172 -16 -71 33 -16 -7
3708 -7 12 -65 -54 -16 89 6 -85 16 -59 73 142 -36 -17 10 -6 72 43 -45 -95 27 36 101 128 -44 24 -40 175 -45
3736 -45 -45 -35 19 133 65 0 -71 -32 -100 9 16 -95 -37 70 47 -18 -69 -175 65 206 148 31 -57 -80 21 64 73
3763 73 -50 -118 -89 36 99 24 -97 -33 39 86 66 -24 -109 -159 104 94 36 -83 -22 -4 -3 90 -98 -39 -62 52 44 17
3791 17 53 -28 150 -2 5 5 -148 -29 62 -107 -17 -54 84 126 48 -12 -72 97 13 -20 120 -53 -25 -61 102 101 -39
3818 -39 -52 -117 8 54 -70 -23 -89 -29 99 -111 -35 -145 28 62 83 14 5 -80 2 -71 82 -69 18 -70 114 27
3844 27 19 -28 -17 3 81 187 72 -26 -42 -7 52 36 -109 -57 3 36 40 114 -133 21 -34 35 34 8 -76 7 51 -44 -34
3873 -34 -125 22 -8 48 74 -150 -64 30 -7 81 -38 16 -60 69 6 44 110 -21 74 31 62 3 -78 -29 163 19 -18
3900 -18 -89 -24 42 -9 -33 3 -87 -34 97 52 87 -92 -39 -38 32 22 -148 -54 -28 -3 38 35 -50 47 29 -62 77 -33 -104
3929 -104 29 112 7 -106 -23 13 49 62 72 41 57 2 122 94 10 -43 -87 -65 9 -54 -87 -2 -24 50 8 -2 -69 6
3957 6 69 51 -15 -32 10 -12 75 -21 20 -10 -31 62 4 5 -42 -19 72 234 97 -54 -56 8 -19 7 3 -80 -57 3 12 -27 -75
3988 -75 -116 -109 54 20 13 -44 -116 96 38 60 -69 -6 85 72 26 -60 -102 -78 -17 -14 53 11 -48 -2 72 11 25 -62 53 155
4018 155 -8 136 -33 5 28 49 -7 -95 -34 32 53 96 102 -39 -3 67 -24 85 -62 61 49 90 53 84 8 -54 -6
4045 -6 0 -35 9 -129 54 87 22 106 -12 -7 -2 -8 50 -77 -21 -68 92 16 12 -139 -58 -59 90 72 -33 -38 -72 10 0 -95
4075 -95 -61 34 130 108 -81 -122 -109 -53 72 104 -43 20 -39 37 93 -9 -75 -53 -28 10 -13 -108 19 -61 -49 47 -20 56
4103 56 52 34 88 36 -11 -13 -33 24 6 31 -90 -34 52 54 31 -110 -148 -55 15 14 -115 8 117 14 104 -40 19 -30 18
4132 18 37 69 56 -31 71 48 23 -25 38 -102 88 11 -62 -46 4 42 65 70 -79 -106 17 80 136 -35 -23 -148 -11
4159 -11 -13 27 36 -5 -48 -48 35 -52 4 23 2 36 19 -24 16 -31 4 20 80 23 44 70 0 14 62 -95 -97 74 185 65
4189 65 -64 -21 -49 -6 91 -93 -74 60 71 -9 -68 -155 -95 131 15 -48 44 -153 -139 -35 40 -34 -74 -29 114 81
4215 81 -13 -24 -27 16 97 7 46 -38 -121 147 60 31 12 -35 -97 42 -39 27 70 3 90 91 32 -73 92 58 -35 93 -90
4244 -90 -17 -62 -8 84 85 -41 -3 -64 25 -25 45 29 -60 27 16 104 4 17 26 85 9 24 58 -13 49 -131 3 -40 -18
4273 -18 31 83 20 16 69 44 3 4 -87 -68 -106 -4 119 36 -63 -36 56 3 62 34 46 -109 52 34 73 -48 -4 8 113
4302 113 -11 34 -75 0 15 80 25 -21 32 20 108 28 46 64 132 24 112 54 60 -73 101 129 -4 -118 -130 2
4328 2 62 36 85 -18 -36 3 -95 79 -54 -12 -91 136 105 -66 -28 47 0 -45 137 15 -61 10 -18 -1 23 -40 -77
4355 -77 16 101 19 -41 -33 -49 -44 19 -76 36 124 -25 49 -62 63 -64 12 23 -93 38 -43 -65 56 -26 -43 -45 -25 -63
4383 -63 -52 19 -69 49 -47 17 41 56 -4 -7 -21 35 41 -106 -5 -95 97 48 -49 -105 -38 -33 72 84 -52 98 -39 -27
4411 -27 -13 -66 26 -42 104 51 44 -2 -79 1 57 39 -27 -32 -114 60 7 -33 -56 3 -67 21 44 24 41 -56 -111 95 113 -2
4441 -2 21 53 -10 -10 38 33 1 -14 2 -55 -1 53 94 151 51 -19 -68 -18 -74 144 -65 -72 -142 -12 17 -35 103 -77 18
4470 18 12 -8 -27 61 67 -109 116 -26 21 -12 64 -5 105 159 -18 67 49 -93 32 33 -22 -34 -82 82 19 50 -37 55
4498 55 8 -13 76 29 18 66 56 -50 66 -137 -15 18 -102 -50 114 139 24 4 -67 -35 -99 -42 53 -37 -47 55
4524 55 43 99 -34 50 -1 3 62 21 -11 -30 -38 57 -37 33 -31 -103 -13 30 41 83 30 -1 15 84 -5 14 -41 -49 -30 20 63
4555 63 65 51 7 129 84 -9 -26 -22 19 -38 85 -13 -81 7 89 -45 -23 41 -53 48 -31 7 11 4 -8 41 22 16 -152 -23
4585 -23 -34 74 -9 -17 43 32 -25 96 -132 -11 105 -12 25 -59 -147 -64 56 -65 26 10 -54 -30 34 58 76 3 65
4612 65 75 137 4 -104 -20 -83 68 19 -17 -6 -21 -2 -49 -2 -9 -28 -40 32 36 29 30 -10 3 -5 -108 -7 10 10 2 -10 17
4643 17 -101 44 55 -24 -11 -11 -5 -63 91 -73 -112 -47 -114 62 23 -58 36 22 -16 109 40 -95 -89 -32 82 120 0
4670 0 26 7 -16 36 -26 -58 -1 -11 -11 -33 -7 53 -39 105 40 -26 -81 -34 -7 -53 4 -4 16 -36 46 74 3 -71 59 7 31
4701 31 -24 -63 -41 49 -23 58 51 -50 -38 34 64 -11 38 -8 15 -4 -16 6 -5 -25 39 -86 -26 -189 -21 -121 -59 -36
4729 -36 58 63 32 36 -39 -13 -58 -105 -63 18 -20 36 35 -22 -71 103 79 79 -74 -69 53 15 -21 -24 35 6 43 36 -52 -39 63 40
4761 40 -31 -18 -52 30 -64 7 -99 34 -2 87 21 -43 -11 -56 -10 67 -2 25 -99 39 26 -36 -17 56 11 -23 -3 -16
4789 -16 64 28 12 -5 37 -1 -17 46 97 10 13 -7 14 10 -35 40 -18 67 -17 -86 74 -43 -21 -57 -114 5 -133 -63 50
4818 50 -22 -127 13 -74 -59 -26 -28 -16 23 46 -25 37 21 17 -23 6 110 56 58 -34 14 3 -71 -30 158 30 17 -94 21
4847 21 60 22 20 -31 -2 -1 19 115 -56 -30 -58 40 42 -149 -96 -21 -151 -69 41 16 -26 -48 -9 29 151 57 39 75 93
4876 93 -45 -11 20 -17 -30 -67 6 105 -95 -27 -62 -18 51 -25 -12 20 -39 1 -59 25 -28 -35 -42 94 -47 44 36 90 -22
4905 -22 93 71 16 55 43 6 182 -19 41 64 64 47 -23 -39 64 42 158 36 89 26 -32 64 100 -11 43 -76 80
4932 80 -85 32 -19 -11 46 45 95 -80 -51 -18 -115 -92 15 33 94 -89 25 -47 -44 -85 -72 138 -53 -38 2 8 21 28 8
4961 8 -31 -22 -47 33 -1 53 6 7 -33 34 8 -57 41 37 72 -24 41 -65 -57 -10 -76 58 -57 61 -115 -57 71 25 47 -47
4991 -47 75 60 -6 83 -8 -74 79 -8 -31 -20 92 -79 8 75 58 103 49 -17 -16 30 -27 1 -31 -85 -66 81 -23 -20
5019 -20 -4 13 11 26 -27 3 -69 -12 24 -90 -75 -30 13 13 -94 -47 18 24 16 -121 41 4 -48 19 6 -44 7 37 -79 -36
5049 -36 -146 38 -23 -58 -38 84 56 -122 -38 26 -1 -43 34 64 -57 94 26 -39 -8 -123 3 48 -54 37 57 -51
5075 -51 -55 -22 4 6 -47 -17 -2 -9 -100 87 56 48 -21 -28 89 29 -30 2 -21 0 35 46 -68 122 -29 -28 -38 -22 -8 -8 42
5106 42 -99 14 7 16 15 -70 -78 53 -109 -116 41 -48 -57 -20 7 53 -2 104 98 -10 91 52 -65 -29 -5 -14 -66 6 -53 6
5136 6 -26 -10 91 72 75 53 57 31 -5 62 14 -28 -19 124 34 69 -29 -3 54 -30 3 -17 -26 76 19 28 -67 29 25 54 99 -78
5168 -78 -122 43 -85 32 10 -54 -78 69 90 -4 31 40 -53 6 70 -2 2 -7 -29 -63 6 -53 -52 -8 -70 -49 19 3 46 39 -30
5199 -30 7 -1 -16 36 129 -50 -10 80 9 101 -116 82 0 88 47 -84 164 -34 36 -53 59 21 12 26 -137 -12 -10
5226 -10 21 95 33 41 -22 -48 -68 16 -49 39 -135 45 -35 -22 -82 6 2 4 9 -62 -16 -53 -74 29 40 11 -38 83 -139 34
5256 34 38 -37 -58 33 38 -98 48 -78 -13 6 13 83 14 83 42 75 -47 1 4 -29 5 -80 7 -11 0 -68 -82 30 40 -17
5286 -17 -9 -35 6 75 91 16 7 16 -21 -133 -4 22 9 77 30 84 -27 30 -3 -18 -46 -98 -19 -20 -102 32 93 -40 39 -77
5316 -77 22 -8 17 29 77 -39 -71 40 -98 23 -111 33 -10 9 34 -55 1 78 -33 -4 1 60 97 -69 17 -81 39
5343 39 25 -46 109 37 25 84 -29 43 13 134 86 65 104 -79 23 12 -108 94 -50 -41 39 77 -41 -114 -4 90
5369 90 49 -46 72 -67 43 16 -21 -76 -43 68 -51 17 -59 18 119 9 -51 -35 -25 45 -57 -2 -6 -44 -16 98
5395 98 40 128 -37 -67 33 -69 13 72 27 18 -27 -6 -28 -27 33 87 -117 -72 47 -70 6 100 -19 -69 35 -36 -76
5422 -76 -15 42 -45 -14 -6 52 33 -31 28 94 50 -23 -10 -81 21 17 6 -125 -81 -26 20 -52 3 23 -13 -24 -69 41 -85
5451 -85 32 -51 32 6 10 -77 -41 -121 19 -18 53 43 133 15 4 51 -6 -5 -43 -23 -22 143 -16 24 25 95 -42 -6 -17
5480 -17 -52 123 99 69 -29 103 -140 -7 -4 -17 9 -24 -14 11 -61 19 -16 -64 -85 -45 37 50 -24 12 -78 59 27 -24
5508 -24 -47 30 59 30 27 -33 42 -36 28 5 22 54 -21 84 97 -75 57 26 20 24 47 -45 -12 -29 -5 -50 -78 78 82 -26
5538 -26 -52 42 24 36 -72 -114 -70 -28 -39 77 3 61 -111 -23 15 25 -32 -1 71 -80 83 -47 131 -69 -158 39
5564 39 103 -57 64 -96 33 27 -13 64 -68 108 91 -54 -42 -102 -152 -91 13 -25 23 -36 24 -22 53 -70 -54 79
5590 79 -79 87 16 69 13 -16 -5 15 31 27 66 -66 39 62 -7 39 -114 52 62 -35 -48 82 15 -32 -40 -50 -62 23
5618 23 -95 -28 -72 -60 -11 -12 -96 34 59 -86 -32 11 4 53 -99 -12 17 -21 -95 65 107 59 -31 28 -12 -29 15 94 -62
5647 -62 30 99 59 55 -14 59 50 16 -14 25 -45 -40 51 -19 39 -24 -64 100 -48 -25 -50 -77 68 62 5 -83 -21 -57 -136 11
5677 11 7 -30 -60 -57 -12 44 49 26 -14 57 -64 6 1 9 13 29 29 87 11 36 61 40 14 -100 -28 -156 -1 -90 -26 -20 -38 -50
5709 -50 34 26 -34 58 -22 58 22 -38 -34 -37 33 12 -6 -94 92 -5 90 10 25 -48 12 33 87 80 98 29 38 36 13 -41 7 1 -27
5742 -27 23 -16 4 68 -81 33 41 36 1 6 60 -13 11 1 -3 -51 -122 108 -3 21 -42 24 93 33 -85 -7 -18 26 19 41
5772 41 -26 -20 83 78 21 27 -33 19 22 25 -19 -105 -8 -46 2 -43 -44 22 28 38 10 -105 -126 -96 32 -37 -20 -54 -75 -80 -7 25 -40
5805 -40 72 11 15 -32 35 23 3 -58 -17 -24 36 -30 -10 -9 1 15 -59 -52 86 -83 123 -42 71 49 4 -39 62 -21 -41
5834 -41 80 13 11 37 -60 -34 -107 -11 13 39 110 -1 5 -12 44 -55 17 -79 41 -26 -93 50 76 90 -37 -47 -4 -2 21
5863 21 5 -4 -24 38 131 -26 9 31 77 56 -64 -63 -102 48 -85 0 63 -2 -56 -12 -64 -29 12 31 -8 -106 -3 -62 38
5892 38 44 14 58 23 75 62 16 -8 -11 39 -67 73 -2 16 -44 61 -68 28 18 14 14 -74 78 -12 -158 32 48 45 -84
5921 -84 5 65 -107 7 -5 -40 48 5 -55 -12 13 -57 21 12 -11 12 60 64 -121 -14 -76 26 -18 -51 26 22 -16 44 -67
5950 -67 -33 35 -9 123 88 -102 -31 39 38 -53 73 75 -9 -22 -51 16 40 10 11 12 -22 42 -18 134 -48 -36 -57 28 104 -33
5980 -33 -47 -18 41 12 -36 -12 13 109 -62 77 20 -53 -36 13 -46 60 27 -22 -3 93 -23 -120 59 88 -16 -52 -10
6007 -10 33 45 85 -108 34 67 -45 -30 -51 -27 -60 -1 38 56 105 9 55 12 74 -62 102 5 109 13 21 95 -35
6034 -35 92 -116 102 -24 1 54 82 -12 -23 83 136 123 5 132 38 -62 -18 -6 27 -115 -40 24 14 33 -104
6059 -104 43 -51 -10 14 -28 -29 96 2 -29 -77 -45 41 -41 1 10 -29 53 58 58 0 -81 4 -8 -26 105 101 47 29 -67 63
6089 63 24 -15 78 20 -90 23 -40 34 -42 -50 -14 -58 -20 -55 144 -35 -76 -29 -3 -32 -17 -92 49 -29 -70 54 -9 32
6117 32 37 -8 2 -38 76 98 -48 21 114 30 7 -24 -9 6 75 -8 57 21 0 34 -53 -23 -5 -71 -132 7 -56 61 -61
6146 -61 16 -21 -142 -46 1 54 -72 14 37 -10 48 86 -104 -95 72 25 -66 -7 -6 -49 33 -21 -57 59 -8 -13 42 16 64
6175 64 131 73 -52 53 -58 -34 -57 -74 12 26 -158 120 88 -156 6 41 22 -29 60 -88 -17 46 76 110 102 -21
6201 -21 -49 -43 -123 94 -9 6 56 68 24 32 -56 -75 26 116 17 -75 12 -51 58 26 -6 -93 -7 160 -17 16 19 -120
6229 -120 -42 46 -12 -42 -30 -99 52 11 -16 20 33 26 74 -55 11 -29 20 11 27 45 -38 -45 19 -7 -31 -17 -46 -21 -61 53
6259 53 -62 24 38 -9 108 -41 -25 5 -41 -7 3 -44 71 69 -169 65 -23 2 -47 69 97 -35 19 -15 -37 -46 -4
6286 -4 107 -48 36 -32 55 36 51 -10 76 -19 152 -94 -73 -2 -28 -2 -12 -66 -32 24 51 6 21 -56 -35 -3 -48 95
6314 95 -51 29 -69 57 109 60 21 -84 40 -56 30 -33 23 7 -6 -12 13 52 -15 57 8 19 31 112 189 94 65 1 92
6343 92 -25 61 69 -29 -111 27 30 -59 -29 109 37 -102 -3 -58 -14 21 36 -36 -7 15 10 41 32 83 -83 34 26 117 -95
6372 -95 14 -109 16 11 -54 -55 -18 58 29 -63 51 -63 6 18 -146 19 90 -37 -1 -92 -8 49 -75 -6 -50 -47 111
6399 111 8 -57 35 30 15 -30 -31 29 -68 -76 -24 -16 3 68 49 -12 30 -20 -15 -9 22 -17 10 11 46 -10 -5 -31 92 -32 2 -31
6431 -31 59 -20 31 42 53 -34 -8 48 10 40 -57 -69 -34 -25 10 41 -41 69 -50 93 87 -148 -16 -89 59 -21 -38 35
6459 35 -6 59 42 62 -40 -19 48 51 -38 8 -52 53 -34 -16 89 0 -48 126 -19 -28 120 13 0 105 -72 -34 14
6486 14 -43 -34 -11 -16 88 80 84 75 153 69 32 -34 -16 -5 -24 2 -34 26 2 -21 85 -3 35 122 36 9 -52 20 7 -3 -12 -27
6518 -27 16 -17 59 51 -42 76 0 29 -69 36 -27 -20 -43 -81 -25 49 -14 86 66 -38 -68 -13 14 11 20 62 -131 11 -35
6547 -35 17 80 -47 50 82 -86 -93 -92 -28 67 -10 -3 40 43 68 38 -76 -60 42 -98 72 7 26 64 42 34 -61 69 -110
6576 -110 -43 -9 -35 35 44 -58 -40 39 -48 -40 -12 36 112 -102 -14 27 57 -34 -12 13 -52 68 92 -55 3 17 -50 36 -40
6605 -40 -79 -33 -63 -72 73 -29 -18 -43 101 15 -61 -26 33 6 -25 -13 -86 3 71 -50 10 21 22 -10 -96 42 -54 -13 -37
6634 -37 26 17 -55 106 15 -109 24 29 -21 55 53 -92 28 2 -42 13 -7 -2 4 45 42 -113 44 71 3 -75 22 28 25 58 -29
6665 -29 -122 9 -20 -16 37 -132 78 21 -30 123 -35 19 17 26 5 29 17 -61 90 21 43 -10 46 -2 -6 -98 88 42 -16
6694 -16 45 63 15 29 119 51 -46 -20 -15 40 -71 7 -104 -3 73 27 -9 13 22 96 39 43 12 -23 -9 58 8 52 9 -28
6724 -28 43 51 -10 20 1 8 100 30 -46 -16 63 -82 61 41 -53 -49 79 22 -61 46 33 -46 25 16 -45 82 11 -28 3 16
6754 16 9 -84 16 61 -58 -66 76 -27 -24 -76 4 77 32 10 -3 -37 -39 46 15 -72 -10 -16 -9 13 116 47 -72 -36 -170 0
6784 0 -54 -65 17 -57 -51 60 -19 -25 27 -58 -41 -87 -28 97 -108 0 -99 -22 -51 108 -68 49 50 82 71 -20 10 34 -20
6813 -20 9 -50 -81 -49 -129 36 -34 75 -26 -75 47 46 74 -40 -44 75 8 35 -43 10 74 -20 -11 18 -40 -4 -46 -11 5
6842 5 56 10 1 88 2 -35 30 31 23 104 10 -24 54 8 -1 -48 -47 -29 -69 -2 -107 3 84 25 77 -17 -69 44 -89 5 29
6873 29 -32 33 1 -2 -40 -48 -19 -73 -44 133 147 -14 -22 -94 38 -74 -11 53 -30 57 -47 16 -15 12 -9 79 27 54 -20
6902 -20 -11 31 11 65 -44 -17 50 76 -118 1 55 61 -11 1 12 46 -8 -79 72 -17 32 65 -74 63 -6 -107 -61 33
6930 33 -40 35 90 43 11 35 -49 30 67 -23 61 15 60 58 -30 24 28 151 -22 29 33 7 -92 36 19 -106 -23 18 -101
6959 -101 43 -44 -24 -73 32 -11 6 -6 -38 -40 -53 85 -80 10 39 61 23 -78 5 -5 58 68 105 15 -28 -73 95
6986 95 17 34 -10 33 -22 -61 -118 64 18 17 -18 -79 -38 -61 13 -74 45 -93 -48 60 10 -20 56 74 69 27 -36 5 74
7015 74 -23 -102 -15 54 5 79 31 -30 -46 122 31 46 -25 -38 65 28 -71 -26 23 5 25 -6 92 -43 -63 -62 -14 -67 -4
7044 -4 -15 -106 -183 -38 13 52 -46 5 -3 -42 44 -61 21 -3 -132 -33 58 -62 -15 36 -98 -124 76 63 20 50 24 -81
7072 -81 26 132 -76 3 7 -4 -7 130 26 14 82 -46 -41 -134 -2 -93 2 9 -172 -24 -24 22 29 60 -30 -20 -15 35 -71
7101 -71 0 101 69 -6 -16 47 70 111 -52 65 26 62 -68 24 -42 -62 73 -17 -72 -38 -19 104 -48 -11 -72 -64 -153
7128 -153 -103 47 10 -73 18 40 -22 105 -22 -6 62 13 -73 44 -62 21 -34 -24 -17 -71 89 29 26 70 132 -27 42
7155 42 29 28 -39 40 -39 -32 85 50 -67 7 48 -73 17 -24 -40 49 -40 -37 -81 17 85 42 53 -61 -25 100 49 -27 56
7184 56 -54 52 131 -25 -102 -4 -17 -10 42 -70 -38 34 91 -66 40 16 -53 -31 -16 -23 24 28 -49 22 -58 38 60 72 -22
7213 -22 -37 -15 24 6 -46 -142 21 62 -68 45 -59 -15 19 0 28 64 39 97 -44 -40 21 -7 44 -63 56 -83 -84
7240 -84 106 -50 29 77 -34 154 45 134 -66 30 -23 -21 -5 -30 35 -37 64 49 16 42 -44 -4 15 -23 101 0
7266 0 123 26 64 75 -93 -38 111 -121 4 -73 -137 85 92 -14 -1 -24 90 19 34 -18 -34 16 -1 2 78 49 85 29
7294 29 -41 -84 21 -38 -15 95 -1 47 -28 53 82 9 -110 -28 32 45 -58 -29 -22 33 -56 -39 120 17 -12 65 14 15
7322 15 -27 13 61 12 44 59 -8 38 -21 88 70 -56 -7 20 19 -6 -13 -5 -97 -30 -7 -29 60 -27 -43 -1 -5 -40 35 20 -71
7353 -71 90 -22 36 -29 27 94 -1 -10 -108 14 22 71 76 -21 69 49 -34 61 -49 -56 59 13 13 29 88 -45 -44 7 -16 3
7383 3 -13 18 63 -44 37 44 25 -24 -63 64 72 23 2 -43 17 -123 -21 -66 1 -85 -102 27 25 -16 -53 23 57 33 44 56
7413 56 -43 -20 95 11 6 -22 14 -128 -66 53 -145 32 -17 -12 -40 44 -127 -21 -76 -141 -70 26 16 -22 88 72 -21
7440 -21 19 48 -88 -91 59 -82 1 48 37 65 36 12 48 108 1 -16 39 -51 -37 -7 -65 -24 9 43 -112 16 163
7467 163 -68 -40 -7 36 -1 -25 116 58 -24 4 -13 -114 -8 -51 24 -74 22 -11 14 33 -12 31 29 39 17 29 32 -57 -11
7496 -11 -8 -24 -81 -88 -88 53 36 98 53 36 -36 13 -16 -38 43 39 -41 -92 -44 -21 -61 29 60 -53 -45 24 16 -35 83 -12 -12 51
7528 51 -8 -15 -28 -60 2 -15 57 -9 13 -14 -57 29 50 -8 52 1 -54 54 14 -41 -58 38 -102 4 96 40 40 -28 -81 9
7558 9 -31 -10 -3 -13 57 -102 -22 -19 -57 -44 -129 44 -68 -109 107 -50 6 -39 -98 0 84 5 97 -55 -2 -73 47 92
7586 92 -63 32 -88 -3 28 -14 -19 7 -56 -140 43 -38 -108 89 62 3 -52 31 -40 -85 -24 7 29 -77 -52 -61 36 -21 -78
7615 -78 13 -69 -52 -1 86 -22 -64 15 -29 6 -24 70 -60 19 -31 12 2 -53 -66 68 20 95 98 63 -116 -46 85 -132
7643 -132 3 55 -56 -44 -108 -76 0 53 -5 91 -5 -112 -66 -39 130 11 66 154 -40 -26 44 -16 0 -32 145 66
7669 66 54 17 78 27 85 -31 -79 6 21 -3 -31 -55 -34 16 -6 16 106 29 39 -57 -16 -19 -85 51 23 39 105 33 -21 44
7699 44 -16 -23 -37 -52 -45 10 32 33 -25 -4 65 117 102 6 5 4 68 -9 -32 49 41 64 70 0 -62 0 -57 -48 -7 -18 -61 -7 -43 4
7733 4 83 -113 6 18 -40 -67 -9 -111 42 2 -49 52 -31 -45 32 -13 98 73 9 -21 13 -21 -47 19 39 5 57 -14
7761 -14 105 52 32 6 10 -57 -71 -30 -42 -26 13 -37 8 -36 -21 29 -118 -66 -82 52 -11 -67 44 52 70 -2 63 35 -48
7790 -48 3 -42 60 8 -6 86 -43 48 51 -15 28 -27 106 54 -35 119 -40 -45 15 -37 31 -48 23 23 57 127 -15 -3 -19
7819 -19 -96 -74 27 -48 -148 -47 -33 -54 68 -10 30 18 66 40 55 -11 11 -10 25 -43 -47 23 86 137 44 38 -66 -42 -46
7848 -46 127 22 -48 -83 -17 -3 -42 -15 -65 -9 21 94 -40 -19 31 -3 51 -37 82 -52 45 10 58 -77 -43 -41 59
7875 59 7 -23 11 -11 -23 22 -22 -69 -34 -9 4 -63 67 32 83 -21 95 -10 -19 -43 -89 14 0 14 29 -41 -43 88
7903 88 27 62 -40 -52 87 -23 13 -43 77 -117 -17 -11 -120 -41 -9 13 -60 -15 68 74 117 77 10 114 94 -62 22
7930 22 80 25 13 20 38 -20 -82 20 -52 40 87 20 -11 -28 -21 3 -7 -58 -20 -28 36 17 -14 -58 -16 18 28 -103 4 -26
7960 -26 37 -86 38 19 -36 -21 -57 -21 16 142 -9 60 -11 0 -21 39 -21 28 33 43 18 5 3 57 23 -31 51 49 -58
7989 -58 26 7 34 -5 -28 -72 6 -55 23 -48 23 -22 113 67 -42 46 -3 115 -54 -2 -47 -21 -23 37 -37 60 56 -67 64
8018 64 29 43 42 104 -26 54 -42 -43 -104 -14 33 -59 -70 -91 -81 38 -1 -47 17 -23 45 -120 32 -11 112 58 37 -1 -108
8047 -108 58 -80 43 -88 -55 -72 -81 52 18 15 -73 -42 34 -69 29 -110 -58 -9 83 -31 49 -45 -108 -33 -103 2
8073 2 -31 72 25 40 -45 5 -21 -13 -96 38 -109 29 40 1 72 60 -77 11 33 -55 -67 12 -15 69 37 -24 -94 56
8101 56 28 -37 19 -21 5 -49 -88 -23 -14 82 -57 37 -47 43 -67 -18 -65 28 23 70 -2 36 44 29 19 86 -42 -64 -8 -1 10
8132 10 -9 21 -3 48 -51 36 17 -12 26 -53 -30 54 -82 6 14 20 29 -81 -34 45 -33 5 -62 10 -69 -48 11 -45 30 -160
8162 -160 -148 -25 39 30 -4 12 -63 -46 -39 49 -69 -61 27 52 -77 0 38 -49 9 -91 74 -37 9 -13 -6 5 48 2 -54
8191e4
$$ Imaginary data points
##PAGE= N=2
##DATA TABLE= (X++(I..I)), XYDATA
0 0 0 0 0 0 0 0 0 0 0 0 0 0 0 0 0 0 0 0 0 0 0 0 0 0 0 0 0 0 2 -3 4 -4 6 -7 7 -10 11 -12 12 -16 18 -20 22 -23 28 -31 34 -39
48 -39 42 -47 52 -58 62 -68 74 -80 87 -95 102 -107 113 -114 112 -98 64 15 -205 721 -2552 17399
70 17399 116218 -39764 -109647 -54835 -151012 -95279 55530 -34034 -88073 13233 2246 35942
82 35942 136874 43735 -34154 51435 48011 27352 72143 -11965 -82539 16029 35016 -39387
94 -39387 -33346 -31268 -42026 16873 28169 -32725 -51864 -38332 -9796 33997 18725 -34143 -34975
107 -34975 9817 61829 81118 33893 -17890 -3075 51420 74308 26212 -39076 -52779 -41540
119 -41540 -21194 6930 -29864 -92298 -61304 -307 20234 40375 15784 -30172 23446 82610
131 82610 45683 19870 8305 -23410 14501 46765 -21491 -52569 -26643 -36838 -7941 32286
143 32286 -24849 -53391 3137 20348 24432 32079 -28414 -44790 35125 51289 9907 856 -26755
156 -26755 -31532 34025 42434 -10878 -18843 -19792 -17174 33763 33705 -34349 -44885 -11469 7476 33002
170 33002 17560 -39211 -26779 26244 27406 15036 4634 -25233 -12590 33188 24612 -10601
182 -10601 -22530 -28687 -8376 30524 15307 -29283 -28445 17 24041 32474 1282 -31106 -9389
195 -9389 24710 25312 9883 -14374 -31721 -9560 23162 17994 -11039 -31790 -24764 10842 33153
208 33153 10051 -23346 -23469 5894 31822 24849 -5649 -21780 -8582 16682 26337 5668 -22827
221 -22827 -26052 -5037 18168 17461 -14217 -35412 -13946 17601 23755 5073 -21414 -19988 15416
234 15416 33184 14803 -5760 -16176 -8557 19249 25626 -3182 -24721 -22321 -3493 21302 13529
247 13529 -24738 -32101 -3611 17818 20411 1904 -22645 -12317 19929 27207 13354 -5337 -19230
260 -19230 -4451 23610 20003 -7431 -25004 -21896 2591 21927 3020 -26919 -25291 -607 20172
273 20172 19357 -3956 -19096 -4250 18926 25726 12376 -10693 -18657 537 21302 15503 -11411
286 -11411 -29649 -17232 10814 18055 -2505 -23222 -19877 4474 22232 14169 -6708 -16147 -4512
299 -4512 18068 25716 6093 -16203 -15464 4923 21591 13036 -14969 -26887 -8105 14050 14372
312 14372 -5213 -23230 -17343 6988 19633 9132 -8650 -15405 -1817 20567 23948 2499 -16909
325 -16909 -12052 10204 22724 7410 -18468 -23469 -4231 13703 9985 -9130 -21623 -12983 8441
338 8441 19688 8503 -11295 -14809 3001 21996 20215 -2349 -18793 -8474 13371 18328 1563
351 1563 -18777 -20463 -631 15072 7369 -10493 -18841 -9578 11119 19934 4560 -13651 -12480
364 -12480 5364 21786 16069 -8305 -18905 -3609 14449 14988 -1902 -19060 -15317 3791 14535
377 14535 7049 -9846 -18629 -5547 14689 16991 278 -15682 -12031 9231 20834 7927 -10743
390 -10743 -15639 -2437 16329 14989 -5615 -16450 -9451 4318 15157 6260 -15426 -17393 -295
403 -295 12544 14018 -1361 -19609 -8678 14941 16039 3763 -8669 -14887 1304 19205 8140
416 8140 -9117 -13265 -11067 5197 18691 1046 -17799 -10548 2419 13724 15472 -6461 -19192
429 -19192 -633 13973 11460 3476 -12886 -16803 5001 16324 3935 -7307 -12515 -7628 12086
442 12086 17438 -2025 -14622 -8922 4212 15545 9396 -11235 -16144 -399 11983 10042 -2148
455 -2148 -13616 -10496 6734 16362 5611 -10650 -13605 -2360 11584 13338 -3526 -17451 -7214
468 -7214 9667 12477 4849 -8614 -14883 1507 16994 8385 -4772 -10758 -10240 5454 16234 -397
482 -397 -15123 -9053 102 10700 14200 -6109 -17749 48 12686 10421 5559 -9474 -15195 5683
496 5683 15431 2072 -6274 -11933 -11434 9579 17244 -4738 -14037 -5652 723 12758 13393 -10051
510 -10051 -15188 3448 8645 7342 4989 -12590 -14058 10160 13281 -965 -4057 -9999 -8243 13750
524 13750 13877 -9493 -11874 -3613 992 13351 8404 -15092 -11927 6419 8525 8600 2269 -15458
538 -15458 -8666 13332 11727 527 -6061 -13924 -3765 15734 8371 -8786 -10303 -6115 4494
551 4494 14650 2692 -12544 -7350 2564 9021 10762 -3310 -14522 -2573 10205 7874 937
564 937 -8223 -11394 2337 13619 4264 -9110 -10186 -2302 8170 11394 -590 -13183 -7284 6856
578 6856 10450 5389 -4953 -13674 -3380 14360 9868 -4982 -8590 -8079 636 15180 6022 -13162
592 -13162 -8954 1158 4667 11232 1969 -15525 -5765 9861 6495 3708 -3100 -13971 -485 14556
606 14556 3244 -5406 -5260 -8262 4635 15447 -1770 -12098 -3259 438 7708 11945 -6698 -14535
620 -14535 1119 6993 6753 5148 -11130 -13706 7171 11935 1905 -2317 -10067 -7987 11053 12446
634 12446 -3165 -7820 -6772 -1010 11518 7525 -8970 -9449 -725 5088 9310 1328 -11191 -6314
648 -6314 5825 8410 4181 -4519 -10030 -882 9313 5978 -3447 -9017 -6156 5050 10459 1952
662 1952 -8090 -8329 778 10182 8888 -3236 -10733 -4719 6218 9259 1755 -8067 -9944 -251 10007
677 10007 7211 -4496 -9594 -4300 5681 10906 2916 -8366 -7388 1552 6834 5850 -3408 -10797 -3268
692 -3268 7479 6673 -74 -6540 -7643 2932 11382 4153 -5281 -6908 -3066 6103 9263 -2373 -10581
707 -10581 -4733 3337 7950 5381 -6496 -10505 367 8759 7034 416 -8252 -7715 4655 9739
721 9739 1568 -6022 -7631 -2226 7835 7987 -3259 -8683 -3824 3592 8579 4198 -7278 -8520 1373
736 1373 7154 4666 -1941 -8258 -4671 6253 8691 492 -6392 -6338 446 8957 6217 -5162 -8600
751 -8600 -2484 4405 7244 1688 -8219 -7222 3318 7938 4191 -3106 -8450 -3035 7949 8000 -1103
766 -1103 -6590 -6049 751 8343 4409 -6069 -7362 -760 5491 7218 -348 -8864 -5229 4414 7018
781 7018 3071 -4095 -8449 -1440 7778 5846 -2013 -6256 -4196 3900 8801 2078 -6705 -6674 -383 5960
797 5960 6303 -2382 -8846 -3930 4429 6703 1763 -5532 -6499 1497 8070 5147 -2702 -6940 -3446 4581
813 4581 7361 492 -6921 -6190 1100 6793 4257 -3470 -7124 -2074 5628 6782 318 -6382 -5682 2148
829 2148 7385 3428 -4395 -6882 -1692 5443 6271 -332 -6613 -4680 2817 6924 3084 -4673 -6987
844 -6987 -983 5931 5330 -1362 -6633 -4454 3114 7096 2709 -4650 -5915 84 6284 5166 -1870
859 -1870 -6849 -3755 3526 6241 1470 -5189 -6251 222 6537 4939 -2587 -6159 -2604 4149 6616
874 6616 1126 -5747 -5389 1000 5983 4333 -2773 -7035 -2459 4606 5541 257 -5337 -5107 1816 6380
890 6380 3091 -3282 -5848 -2073 4985 6041 -820 -5949 -3971 2015 6202 3125 -4300 -5924 -768
905 -768 4583 5127 -563 -6663 -4086 3352 5651 2176 -3374 -6022 -618 6063 4477 -1347 -5000 -4064
921 -4064 2791 6750 1283 -5103 -4559 -404 4594 4756 -2342 -6272 -2019 3182 4882 1964 -4792 -5394
937 -5394 1661 5617 2937 -1849 -5505 -2631 4686 5447 -228 -4550 -4556 743 6229 3206 -3851 -5278
953 -5278 -1564 3753 5559 209 -5586 -3834 1734 5402 3518 -3067 -5854 -766 4339 4449 19
968 19 -5017 -3774 2309 4806 1994 -2794 -5259 -1145 4887 3811 -1563 -4493 -3210 2281 5640 987
984 987 -4292 -3591 156 4508 4711 -1817 -5930 -1583 3315 4463 1574 -4439 -5435 1104 4899 2943
1000 2943 -1489 -5618 -3099 4068 5424 109 -3810 -4104 64 5202 3326 -2705 -4507 -1821 2894
1015 2894 5207 587 -4587 -3429 1257 4260 2939 -2524 -4941 -660 3526 3242 -430 -4820 -3861
1030 -3861 2194 4662 1604 -2669 -4311 -545 4863 3981 -1155 -3802 -2610 2222 5528 1465 -4429
1045 -4429 -4394 -336 3694 3823 -1548 -5192 -2219 2365 4172 1849 -3670 -5013 918 4765 3102 -837
1061 -837 -4271 -2880 3035 4864 291 -3089 -3034 -84 4313 3489 -2695 -4720 -1466 1902 3287 658
1077 658 -3857 -3670 1519 4067 1825 -1690 -3516 -889 4076 4617 -621 -3858 -2086 1274 3651 1893
1093 1893 -3325 -5130 -240 3480 2724 -767 -4820 -3779 2663 5213 1175 -2402 -3298 -1140 4247
1108 4247 4634 -1438 -4062 -1738 1409 4312 2615 -3817 -4423 413 2234 2057 197 -4343 -3175 3200
1124 3200 3367 -573 -1785 -2777 -337 4827 3142 -2508 -2350 -84 1505 3970 949 -5073 -2982 2390
1140 2390 2615 1477 -1480 -5463 -1864 4421 2847 -1047 -2333 -3228 371 5753 2480 -3360 -2967 -461
1156 -461 2100 4554 841 -4665 -2291 1979 2150 1640 -1438 -5028 -899 4103 1800 -1243 -2075 -2813
1172 -2813 708 4648 821 -3179 -1574 463 2247 3552 -963 -4789 -811 3078 2289 810 -2181
1187 -2181 -4314 275 4234 1346 -1831 -2782 -2229 2137 4696 -47 -4081 -1990 527 2536 3439 -1088
1203 -1088 -4588 -442 3133 2263 635 -2179 -3603 1135 4275 866 -2070 -2296 -1689 2053 4013 -829
1219 -829 -3989 -1299 930 2255 2294 -2261 -4208 682 3141 1674 287 -2531 -3123 2156 4218 -27
1235 -27 -2323 -2169 -1037 2843 3277 -1888 -3528 -936 945 2506 1740 -3110 -3438 1243 2886 1598
1251 1598 -213 -3116 -2067 2931 3332 12 -1895 -2278 -157 3401 2325 -2327 -2993 -810 1408 2712
1267 2712 498 -3253 -2543 1117 2633 1746 -1155 -2998 -911 2877 2868 -345 -2507 -1922 878 3029
1283 3029 1477 -2077 -3032 -546 2303 2394 -391 -3003 -2058 1600 2964 979 -1647 -2615 -410 2836
1299 2836 2551 -1024 -2813 -1451 1206 2821 911 -2643 -2735 360 2239 1876 -582 -3053 -1565 2305
1315 2305 2902 459 -1855 -2335 126 3006 1799 -1425 -2556 -1252 1373 2696 168 -3067 -2208 632
1331 632 2302 1649 -1245 -3040 -528 2335 2380 201 -2008 -2077 1215 3170 1218 -1356 -2557 -873
1347 -873 1970 2290 -784 -2773 -1918 516 2358 1075 -2089 -2579 -65 2468 2474 122 -2155 -1067 1728
1364 1728 2697 990 -1705 -2537 -194 2419 1486 -1255 -2868 -1690 1005 2377 416 -2111 -1999 356
1380 356 2585 2067 -543 -2148 -538 2074 2626 411 -1994 -2038 142 2170 1339 -1497 -2643 -990
1396 -990 1601 2070 -46 -2484 -1998 837 2257 1173 -1099 -2121 -546 2405 2427 -209 -2095 -1439
1412 -1439 770 2550 982 -1901 -2315 -366 1596 1816 -492 -2922 -1604 1327 2157 976 -1144 -2258
1428 -2258 -67 2651 1913 -488 -1704 -1473 821 2510 391 -2333 -1892 -94 1638 1672 -583 -2484
1444 -2484 -703 1540 1797 686 -1363 -2041 603 2468 934 -1279 -1969 -1096 1213 2230 -319 -2325
1460 -2325 -1438 502 2144 1724 -1186 -2445 -124 1995 1788 281 -2009 -1989 700 2282 792 -1303
1476 -1303 -2163 -961 1596 1968 -537 -1968 -874 515 1863 1193 -1245 -1898 272 1849 1418 -219
1492 -219 -1770 -1323 1243 1988 -14 -1773 -1644 -264 1612 1446 -1233 -2451 -627 1436 1851 798
1508 798 -1566 -1839 1041 2670 1382 -300 -1786 -1361 1529 2327 -300 -1962 -1705 -592 1510 1493 -1446
1525 -1446 -2138 -295 865 1809 1044 -1439 -1329 1408 2064 728 -386 -1616 -597 1823 1266 -1092
1541 -1092 -1799 -1512 113 1878 329 -2166 -1741 107 1557 1764 -49 -1847 -819 1502 2353 1046
1557 1046 -1183 -1972 -19 1854 1419 -697 -2166 -1537 550 1524 331 -1348 -1861 -175 1647 1458
1573 1458 -240 -1134 -532 1391 2123 264 -1206 -882 97 1378 1026 -1250 -2057 -408 979 948 37
1590 37 -1870 -1707 971 1862 759 -550 -1652 -540 2285 2022 -378 -1381 -906 348 2083 965
1606 965 -1580 -1827 -458 697 1440 81 -2214 -1330 826 1328 763 -591 -1405 25 1856 1295 -206
1623 -206 -1042 -846 743 1641 206 -1587 -1498 -24 1095 886 -891 -1849 -767 1268 1824 292 -1183
1640 -1183 -1131 537 2034 1254 -715 -1579 -521 812 1378 234 -1816 -1790 378 1349 641 -609 -1742
1657 -1742 -734 1542 1385 -235 -772 -883 241 1835 1009 -1228 -1095 -154 681 1305 -112 -2105 -965
1674 -965 893 979 398 -728 -1808 -85 1952 946 -540 -820 -887 713 2066 475 -1278 -954 -284
1691 -284 1029 1457 -542 -1964 -519 858 1038 344 -1117 -1560 362 1525 716 -378 -1082 -799 1050
1708 1050 1773 9 -1199 -819 134 1208 1074 -1045 -1797 -285 954 1164 42 -1184 -1034 659 1588
1725 1588 674 -504 -1081 -394 1043 1490 -180 -1426 -914 316 1214 534 -1216 -1464 -124 1073 774
1742 774 -33 -1061 -778 802 1620 612 -729 -1032 -305 1177 1118 -661 -1573 -763 686 1181 384 -1232
1760 -1232 -1351 168 1268 737 -216 -1038 -713 1000 1453 220 -999 -1060 -55 1419 932 -840 -1483
1777 -1483 -363 713 941 38 -1352 -969 314 952 632 -359 -1279 -380 1240 1285 13 -929 -924 379
1795 379 1450 569 -1019 -1224 -290 742 949 -395 -1319 -699 459 966 695 -663 -1136 113 1264
1812 1264 1161 -112 -1131 -663 822 1240 15 -933 -1011 -164 966 681 -510 -1139 -665 525 1220 436
1830 436 -890 -1019 316 1192 924 -375 -1139 -447 774 950 -69 -1005 -1022 95 914 585 -450 -1028
1848 -1028 -393 782 1114 142 -896 -865 411 1278 575 -740 -1062 -147 818 916 -270 -1027 -768 223 961
1867 961 509 -742 -1208 -39 880 811 -188 -1047 -640 804 1072 224 -649 -875 -105 1087 729 -341 -927
1886 -927 -535 238 940 340 -1012 -1010 84 914 718 -332 -1175 -215 916 800 54 -611 -753 119 937
1905 937 478 -586 -1061 -519 669 1091 84 -1138 -761 291 1060 639 -553 -973 -160 873 741 -120
1923 -120 -785 -767 209 950 382 -643 -960 -207 748 928 -108 -1047 -478 644 1049 284 -597 -772 114
1942 114 852 514 -225 -671 -657 360 1098 285 -961 -803 -35 772 811 -425 -1139 -282 647 662 283 -625
1962 -625 -918 233 932 371 -329 -771 -620 592 1071 -201 -857 -581 62 770 676 -718 -1027 167 570
1981 570 604 280 -768 -720 512 833 350 -372 -938 -448 786 883 -360 -864 -377 286 880 468 -701
2000 -701 -689 181 512 568 85 -906 -695 448 776 169 -479 -816 -98 906 663 -451 -774 -263 424 787
2020 787 71 -856 -595 198 567 535 -129 -971 -422 768 884 238 -637 -846 94 966 433 -559 -701 -207
2040 -207 348 858 268 -824 -567 271 671 551 -135 -930 -223 758 443 -238 -667 -600 233 868 132 -706
2060 -706 -373 -26 470 781 34 -875 -297 516 729 421 -493 -1100 8 966 463 -318 -635 -556 435 1050
2080 1050 81 -553 -369 -81 397 883 -309 -883 -218 438 659 244 -515 -765 311 636 140 -303 -516
2099 -516 -455 451 612 -289 -571 -371 34 699 527 -455 -676 94 649 733 23 -785 -506 416 600 138 -416
2120 -416 -668 -282 492 544 -82 -521 -466 142 798 394 -474 -609 1 496 495 -147 -735 -298 378 612 0
2141 0 -524 -639 -64 493 373 -330 -774 -359 294 726 364 -641 -537 259 659 427 -122 -722 -326 433
2161 433 553 6 -418 -646 -84 599 460 -457 -528 -46 447 536 -23 -571 -341 325 499 265 -221 -651 -122
2182 -122 609 352 -49 -538 -581 212 709 177 -434 -572 -124 493 649 -228 -625 -212 500 555 308 -351 -581
2203 -581 -56 527 548 -88 -622 -340 340 545 53 -460 -546 35 490 491 -174 -478 -229 402 556 32 -433
2224 -433 -464 131 602 394 -322 -601 -172 438 521 -51 -594 -468 173 530 203 -374 -532 -51 461 512 75
2245 75 -399 -407 224 644 386 -432 -495 -27 347 389 -118 -468 -331 218 397 221 -345 -455 -49 446 401 -173
2267 -173 -495 -334 303 579 100 -521 -376 51 430 413 -308 -592 -249 417 539 186 -336 -510 43 513
2287 513 366 -344 -567 -199 427 583 -21 -439 -286 192 323 300 -164 -434 -102 401 446 7 -409 -497 175
2308 175 521 190 -358 -438 -84 388 469 -133 -461 -148 88 534 188 -349 -509 -86 411 432 -107 -390 -326
2329 -326 336 508 217 -444 -260 -151 378 314 -218 -415 -327 246 483 218 -460 -463 155 508 423 -78 -519 -205
2351 -205 332 303 -117 -455 -464 51 448 308 -333 -452 -92 248 497 144 -394 -316 206 423 251 -249 -551
2372 -551 -66 427 301 -151 -365 -217 309 493 318 -239 -525 26 368 398 -100 -408 -293 190 351 17
2392 17 -229 -335 143 460 397 17 -308 -174 176 380 91 -388 -404 6 320 348 -150 -471 -157 423 487 38
2414 38 -303 -260 53 408 116 -202 -218 -243 109 443 41 -406 -342 130 369 293 -136 -368 -53 323 244 57
2436 57 -345 -503 200 441 86 -223 -338 -61 397 470 -84 -434 -238 103 339 146 -353 -415 53 389 308
2457 308 30 -300 -181 180 332 76 -283 -311 -66 391 304 -245 -303 -90 221 296 116 -375 -346 43 384 197
2479 197 -158 -348 -126 411 378 -36 -256 -288 91 317 317 -277 -371 5 172 331 47 -418 -275 256 338 189
2501 189 -106 -353 -197 407 362 -93 -309 -273 88 385 273 -393 -289 28 68 254 105 -518 -166 259 252 -58
2523 -58 -122 -271 -69 453 154 -145 -147 -149 101 487 95 -380 -199 133 126 267 -101 -425 -171 263 187 26 -168
2546 -168 -397 135 482 113 -144 -241 -147 207 495 -30 -319 -81 152 191 239 -146 -343 81 176 134 62 -266
2568 -266 -217 66 372 -32 -148 -217 -43 356 317 -184 -316 -26 88 202 181 -242 -415 144 420 155 64 -377
2590 -377 -320 297 383 -57 -234 -233 -144 264 352 -145 -329 -32 136 256 156 -269 -401 143 297 27 -24 -316
2612 -316 -317 355 347 -225 -230 -191 -108 235 253 -350 -207 77 204 279 45 -380 -273 367 257 12 -131 -210 -224 435
2636 435 209 -108 -342 -143 -8 322 140 -395 -169 12 237 249 144 -357 -154 187 198 117 -85 -334 -44
2657 -44 395 161 -222 -177 -171 45 371 -43 -317 -289 93 216 232 -16 -481 -58 327 233 20 -142 -219 -43 392
2680 392 183 -230 -218 -34 75 311 43 -290 -139 133 235 188 -123 -358 -44 193 93 -37 -158 -145 83
2701 83 150 56 -154 -195 -99 110 298 -12 -254 -23 86 183 179 -143 -309 -48 277 153 -121 -283 -212 259 204
2724 204 94 -223 -217 4 233 234 -232 -327 -26 31 214 46 -313 -246 131 257 89 -79 -212 -137 256 187 -81
2747 -81 -263 -313 23 223 130 -122 -259 -12 154 147 90 -157 -237 49 223 133 -148 -284 -113 150 187 -69 -143
2770 -143 -62 -54 160 143 -249 -238 -93 247 28 -118 -226 -203 148 151 60 -170 -190 33 155 202 -69 -215 -103 201
2794 201 233 17 -139 -253 -58 183 143 -125 -384 -112 288 143 104 -166 -254 49 255 76 -80 -247 -50
2815 -50 82 110 -87 -245 -201 85 271 75 -72 -177 -100 185 297 52 -240 -65 138 217 20 -23 -216 -18
2837 -18 92 120 27 -237 -189 113 264 104 -223 -168 6 204 118 -16 -119 -102 177 175 107 -256 -148 -26 210
2860 210 85 -84 -152 -138 182 159 -15 -158 -122 19 228 151 -103 -170 -79 159 159 27 -156 -205 71 142 111 -102
2884 -102 -144 -71 221 186 -9 -179 -207 70 175 110 -161 -226 -68 117 131 -67 -155 -156 66 247 31 -131 -182 12
2908 12 177 121 -113 -250 -232 149 206 7 -154 -135 77 92 217 -108 -220 -115 66 144 48 -195 -143 132 216
2931 216 53 -23 -93 -143 152 284 73 -167 -122 -5 158 87 -204 -110 62 103 75 -94 -78 -182 26 273 24
2954 24 -70 -165 -61 127 179 -47 -159 -110 156 169 176 -122 -250 -54 233 68 -11 -130 -124 70 152 106 -143 -99 -21
2979 -21 105 105 -217 -70 -87 0 237 28 -148 -149 -14 249 186 -11 -218 -151 176 196 18 -93 -149 -15 196 138
3003 138 -195 -237 -82 165 230 128 -225 -81 119 85 153 -111 -95 -89 187 105 44 -80 -98 85 253 51 -172
3026 -172 -55 71 116 185 -69 -127 -89 61 209 76 -91 -250 -5 298 -24 -114 -81 -144 10 177 -9 -246
3048 -246 -108 -14 62 137 75 -115 13 120 44 105 -102 -65 33 146 27 0 -98 -42 148 185 27 -124 -76 107
3072 107 99 82 -137 -310 53 137 -40 120 -84 -65 172 175 -77 -54 -91 -64 181 148 8 -127 80 88 109 170 -70
3097 -70 -39 84 65 70 -19 -207 -82 33 235 -19 -102 -20 -97 115 185 -157 -190 -59 42 115 146 -203 -198 14 157
3122 157 148 -12 -222 -231 117 238 41 -108 -20 -96 115 99 -69 -182 60 94 196 82 -188 -210 140 99 21 91
3146 91 -220 -90 259 54 -68 44 0 1 225 154 -146 -33 25 27 128 -4 -373 -116 -91 61 108 -45 -264
3169 -264 5 282 41 -174 -30 -68 -25 290 77 -221 -119 34 158 102 -18 -321 47 138 17 -20 -145 -97
3191 -97 69 166 15 -9 -91 -160 19 135 -99 -70 -81 34 4 179 -57 -159 31 78 34 54 -36 -176 8 58
3215 58 -4 -95 -110 -134 68 223 33 -244 -77 -7 73 98 -43 -45 82 132 77 -11 -124 -37 73 175 -68 -147 -80
3240 -80 -77 100 80 -42 -99 -40 7 279 -9 -19 -124 -15 133 173 -55 -135 -63 159 103 -29 -163 -137 7 157
3264 157 153 -40 -36 81 44 144 -28 -147 53 4 167 105 -84 -96 -140 51 164 0 -118 -79 37 61 105 -131
3288 -131 -128 22 16 126 -6 -223 -139 104 159 81 -87 -46 -75 107 157 -29 -145 -78 130 162 39 -214 -69 35
3312 35 -48 47 -13 -50 -31 134 31 12 -15 -144 51 44 13 -93 -89 -152 97 90 -56 -64 -26 -7 33 76 -66 -59 -31 47 132
3341 132 76 -142 -154 1 176 121 -34 -141 -62 155 129 15 -29 -79 9 86 -23 -117 -117 -11 85 2 -15 -14 29 57
3367 57 65 -92 -66 -76 -104 66 6 -160 -122 -99 30 104 22 -75 -22 40 52 56 -51 -188 -68 54 -28 11 -10 -229 14
3394 14 140 57 -76 -106 -82 122 83 66 -103 0 53 48 72 -11 -64 -63 88 112 46 -82 -71 64 139 34 -103 -90
3420 -90 -108 31 14 57 -118 1 170 131 37 -17 -32 17 76 203 -133 -47 -112 -14 49 28 -176 -187 48 107 107 -77
3446 -77 -191 45 -12 -10 -8 -251 -107 -51 79 -51 -95 -107 80 -114 181 -3 -119 -107 29 103 50 -26 -70 -28 95
3471 95 42 -75 -85 -29 129 34 44 -91 -46 -4 97 47 -9 -207 33 79 87 -2 -35 -149 -56 37 37 6 -71 -54 -25 57
3499 57 114 -164 -134 -29 234 49 -39 -58 -48 80 41 91 9 -163 -21 84 150 -38 -32 -16 19 94 53 -55 -109 24
3525 24 -1 106 -37 -145 -47 72 66 47 10 -23 25 87 46 -102 -12 30 153 80 -104 -123 34 39 155 188 3 3 36
3552 36 101 -6 -69 -85 -19 118 53 -58 -60 -57 93 -42 104 46 -7 -53 21 9 157 -37 51 62 88 147 -66 -95 -9
3579 -9 85 49 -134 -90 8 26 66 67 -57 -93 67 83 24 32 18 -62 12 86 -55 -95 -57 -92 137 56 -27 -136 -208 -2
3607 -2 117 17 -90 -230 -7 -26 80 7 -91 -26 117 89 26 -41 9 -21 70 131 -79 -51 -34 -7 67 26 -161 -208
3633 -208 48 32 5 -25 -99 -68 0 71 81 -98 -118 -69 167 -38 -9 -8 -64 45 4 -22 -11 -108 13 17 104 1 -86
3660 -86 52 36 32 5 -21 18 73 143 60 -172 7 -34 60 98 -103 -71 38 -21 48 110 32 -128 14 66 -116 -78 -42
3687 -42 -194 103 126 -28 45 -80 16 -16 38 -55 -27 -31 -56 72 83 -62 -106 28 93 -11 1 15 -104 13 89 72
3713 72 18 -27 -73 120 14 -22 45 19 -9 96 -37 10 -73 -43 80 37 105 -119 -122 28 49 123 -102 -78 -45 102
3739 102 72 -104 -51 -45 -27 80 5 -8 -171 17 -35 -4 -65 -133 -8 33 114 -54 -85 -46 144 69 37 -14 -70 -10 44
3766 44 34 -20 -193 -8 71 56 -11 53 20 108 105 -98 -19 -67 -86 64 80 -18 -90 -54 58 141 131 102 -60 -3 -64 13
3794 13 52 -7 -95 -4 40 37 -53 -63 9 70 127 -131 -31 83 85 26 -32 -25 -109 17 -21 163 19 11 3 27 150 -93 -74
3823 -74 -102 70 53 126 12 -110 -59 13 101 25 -58 -59 116 75 59 -85 -126 52 9 16 6 -42 1 71 5 154 -29
3850 -29 10 -10 50 -23 -91 84 -82 -40 50 -78 -149 63 33 86 75 -43 -38 -104 -70 81 -93 -46 55 72 56 -39 24
3877 24 -12 -24 53 157 59 -48 -127 32 19 -43 -18 11 -14 -24 -5 -55 -158 -62 -7 99 -28 -48 -81 62 51 93 24
3904 24 -31 -60 10 51 -50 73 -3 -35 0 110 17 -129 1 50 81 48 8 -38 13 33 83 -60 -47 -34 3 59 59 8
3932 8 -94 -51 131 99 -17 -143 -30 42 68 72 -74 34 24 2 23 -5 -115 41 25 -11 46 -106 -13 -48 71 1
3958 1 -40 20 -18 -4 56 -13 -91 22 10 -6 58 -26 0 -132 1 10 -59 -47 -25 0 -55 107 26 -102 16 68 -36 71
3986 71 42 -68 8 58 52 -25 -105 0 92 66 -25 -5 -48 142 -29 52 -75 -17 80 122 29 31 -62 -52 60 -12 17 -123
4014 -123 -18 -71 1 32 -60 13 71 18 57 -91 -102 -1 -59 19 -9 -128 18 -111 17 119 -40 20 -96 0 78
4039 78 30 -4 -17 -87 -20 81 22 -6 -68 -47 112 44 -62 -17 -20 68 -36 -24 -121 -87 -74 125 42 -22 -40 103 88 -16
4067 -16 -46 -58 -25 83 155 18 -22 -105 -39 66 3 84 -83 -29 89 -60 79 -64 -31 -23 36 31 32 -38 -113 8 36
4094 36 26 -148 48 -25 87 60 -83 -190 -12 -19 -4 -50 -98 -66 38 -36 44 -9 -81 -26 -57 52 -63 -142 -70 -44
4120 -44 13 9 38 102 11 53 -5 77 -123 -45 18 74 -42 -71 -70 -127 125 53 -90 -21 -117 -58 222 33 -20 -74 88 103
4148 103 -45 61 -39 5 23 26 -51 -71 -84 27 85 50 -131 -65 -52 -89 33 -4 -107 24 -82 -62 73 9 -68
4173 -68 -35 -3 -17 -22 19 21 -1 -57 51 -31 111 -48 97 124 -17 -90 7 103 44 62 -59 -6 92 14 15 47 -11 -18 -116
4202 -116 -32 42 -138 -44 -18 70 51 46 -72 30 37 91 41 -56 -20 85 -20 -80 55 -55 -72 134 140 -14 -88 -64 29
4229 29 68 10 28 -97 39 95 -25 63 -5 -27 39 -8 -6 -95 -67 -109 -36 -58 -33 -79 -7 9 -8 36 -81 -20 -102 0
4257 0 120 -43 -87 -109 24 51 -14 28 -88 6 147 75 -24 -94 16 -78 123 -35 -40 -60 4 19 -28 23 -73 -117 78
4284 78 33 -29 -74 -73 -33 62 -7 86 50 -21 39 95 -53 -79 3 -16 -51 5 81 -30 55 155 63 60 -107 69 12 55 -34
4313 -34 -30 4 -49 -16 36 -23 -73 109 -63 49 -25 23 -80 -47 -43 131 -63 89 -25 43 -40 19 -171 30 -122 0
4339 0 76 -126 -6 -24 85 -26 49 -70 -46 -31 65 136 91 51 -13 57 16 -46 26 -24 22 73 15 -63 -51 -20 -48 -32
4367 -32 1 -69 15 -34 117 -100 -55 -27 -4 -34 18 -44 -99 -8 -1 35 10 -135 -27 39 124 10 63 -86 36 -71 82
4394 82 63 10 14 27 -57 44 81 -4 16 -3 -2 -23 12 -47 -58 38 19 -32 -51 33 22 4 16 24 -184 -34 -56 -73 -39 -1
4424 -1 30 57 50 -12 2 -72 25 43 -1 31 32 48 71 -90 88 -17 2 -19 48 57 -47 -47 43 56 37 -100 -57 39 -18 100
4454 100 -108 -3 -34 32 9 108 -41 -58 128 49 50 -82 -18 -59 2 121 56 20 -102 -8 -3 46 90 -22 -59 -7 11
4481 11 -36 26 -100 -140 1 44 -34 18 -60 36 62 23 18 -31 3 -40 -59 2 -44 52 16 46 64 -6 -34 -46 21 28 -7 30
4511 30 51 27 10 68 -46 -78 -10 -55 71 46 50 53 30 -66 -68 -44 16 -8 59 17 -44 -12 23 20 8 9 -183 -74 -18 6 -41
4542 -41 1 28 62 -81 -10 -7 12 -33 -28 -7 73 -48 -62 92 55 -15 19 -86 -20 67 26 -10 51 -3 -65 22 13 -38 -67 6
4572 6 98 31 -34 -50 -17 0 95 91 -61 -114 -105 40 78 -72 2 64 27 27 -119 -155 -69 -61 -31 -43 19 68 -114 24 149
4601 149 -4 -50 -78 -68 -43 47 -14 -95 89 80 101 41 13 -80 -72 5 7 26 -46 -6 -54 -4 54 25 -5 26 38 19 10 -16 98
4632 98 0 12 -77 82 -97 32 8 -51 -13 9 -16 -23 109 102 13 -6 15 100 -13 -2 51 39 109 -30 89 9 -41 -37
4660 -37 92 -33 -110 -36 49 59 12 55 -28 -13 -30 0 44 -37 45 26 91 17 13 -7 90 49 -29 -20 40 -50 -31 77 -31
4689 -31 -110 -16 11 -38 64 -61 -7 -1 -30 111 38 29 12 -7 60 85 80 24 -127 16 0 2 10 -49 -88 75 6 81 -23
4718 -23 18 -34 11 22 -87 -7 -7 -7 -102 9 -45 89 -41 53 124 71 -68 -94 94 35 70 43 -68 -74 96 71 -100
4745 -100 48 -18 67 67 -72 -17 -79 141 119 -89 2 -3 54 36 19 12 -55 26 66 -22 -3 -56 104 -19 30 141 17
4772 17 -13 -61 -28 2 52 -11 -60 61 41 86 -1 55 -111 -9 75 -87 57 -20 66 -131 7 -50 -16 -63 -1 38 -30
4799 -30 22 15 -74 28 -109 -32 -61 -55 10 19 -49 -105 -16 -57 57 -24 -45 -15 -28 -73 71 113 109 3 -8 -134 -74 -15 45
4828 45 -83 19 1 50 -22 9 56 78 106 -73 -14 21 33 -5 -36 -29 -49 37 -6 103 -32 6 83 -7 -46 -45 50 6 -16
4857 -16 93 -15 27 -94 19 122 -66 23 -132 -33 -2 34 -66 23 49 17 -23 -90 51 -51 18 -115 -15 -35
4881 -35 71 14 103 41 22 -62 -74 2 53 148 1 -4 3 -26 -124 59 -70 -127 59 -10 72 30 -27 64 14 36 -88 27
4909 27 26 135 -30 15 -27 29 -11 29 110 31 56 99 19 -104 42 78 -45 57 25 13 26 -16 -91 43 50 22 -22 -17
4937 -17 -8 -10 -41 -73 74 14 128 -29 56 32 5 74 -5 2 17 28 -46 -40 -17 -20 -1 67 22 -27 -35 -23 -51 -37 15 12 -8 36
4969 36 67 14 -22 35 -66 7 -46 74 -22 -4 76 -45 1 161 47 -55 -2 28 88 2 -27 15 5 -90 106 22 79
4996 79 67 7 -53 17 -108 35 25 28 28 -8 -18 -21 114 -20 154 -8 -48 -54 -15 13 -79 30 12 28 -87 -97 -55 39
5024 39 35 -60 40 -43 -65 43 -10 34 1 -11 -63 -38 4 72 18 11 -51 34 27 5 -68 -34 -66 28 42 -38 -165 -21 -34 -15
5054 -15 78 2 -65 36 44 -40 78 -19 56 16 14 59 -72 40 28 17 53 35 3 2 18 23 49 48 -47 6 -21 -4 -21 -41 36
5085 36 9 14 -118 -56 -100 -17 23 24 -85 -29 23 -6 -103 -54 -62 -27 50 43 -27 -137 -10 75 17 57 129 -2 70 70 44 -65
5115 -65 11 120 16 -67 -42 2 -86 55 152 74 4 29 33 87 26 21 -6 4 -52 -1 -3 -58 -93 89 -28 -109 68 -13 3
5144 3 -130 29 8 -56 -5 -75 56 44 -177 22 -57 -51 23 61 -14 -10 70 142 -11 37 0 31 112 75 3 -27 -12 -48 -20
5173 -20 54 53 -19 39 21 72 32 47 -41 -58 -46 -5 74 -30 51 61 -12 40 -4 -56 16 -61 -1 56 42 -35 20 172 45
5202 45 -47 -21 8 -58 2 22 -69 -115 36 -198 -35 -8 62 27 -47 -14 -48 -27 39 -29 47 19 -62 -1 -10 10 -10 9 -119
5231 -119 -64 -40 39 40 -49 24 72 89 -24 -115 -21 -69 -55 -18 -14 21 -32 -103 46 121 -30 46 -45 -20 34 44 42 -59 21
5260 21 -49 -24 2 30 0 31 -7 54 -50 -23 103 69 55 -5 -99 5 47 -44 32 -38 65 114 94 -52 -16 -33 49 37
5288 37 98 71 -28 4 -71 86 -7 98 -39 -49 60 -49 74 -45 23 4 13 -90 -52 58 -65 -65 -2 34 2 120
5314 120 -35 -43 14 -43 -8 48 1 160 -81 -26 -97 -49 86 -11 -29 -12 16 88 -6 -26 23 -42 -56 -3 -57 0 41 47 26
5343 26 16 -25 61 -25 44 63 76 65 42 -66 -40 17 -4 -42 -46 12 -8 24 -71 -106 -71 -51 -1 -48 -12 -33 -5 -21 84 35
5373 35 -29 -5 -65 -27 -76 104 126 27 40 -12 -38 -43 61 -1 -18 -69 -27 -6 0 -31 -25 -39 -46 -87 114 10 -14 -42 -18 -22 -9
5404 -9 87 -62 -13 42 65 -33 -95 36 59 38 -33 -39 21 83 117 -20 24 -95 35 -19 113 -5 38 53 -5 -31 -13 -72
5432 -72 -43 -28 -83 -27 -93 -78 6 43 43 101 38 -3 131 -24 -100 2 24 -86 -43 18 -67 -27 -71 52 12 35 -83 -62
5460 -62 1 -55 162 6 -1 -35 -118 -61 52 -17 -3 -38 -27 24 -11 -27 7 -22 32 52 28 37 -101 -1 93 -17 -42 -75
5488 -75 -73 -4 -2 -75 -24 -43 -71 80 28 16 46 10 36 -3 -25 -44 14 47 62 45 126 39 25 34 -146 2 -27 -60 12 -87
5518 -87 46 -22 -35 -77 7 -66 -115 64 21 7 2 58 -40 -6 -34 16 51 -56 -11 -27 -103 39 -34 20 71 22 4 -64 41
5547 41 -65 86 53 -21 -40 -29 -17 -22 -88 26 -11 -7 -17 -39 75 54 -23 35 -12 -45 -7 -28 -40 6 -22 -4 -16 -52 12
5576 12 -24 35 -5 81 -3 -37 70 28 -3 -57 1 32 -70 13 -85 -29 133 24 1 14 -16 35 10 -13 -23 24 28 -7 -9
5605 -9 87 39 -34 -12 49 43 84 -59 -24 -38 -34 30 16 46 13 29 38 -32 -56 -88 12 45 -75 57 27 66 4 53 -49 25
5635 25 -24 45 51 -20 26 18 24 -52 18 82 -81 43 -14 -58 13 -2 21 -27 -169 76 -8 7 -4 -20 -48 -85 -57 -65 -8 -8 37
5666 37 -24 -45 29 -60 12 73 2 42 -3 17 18 -116 61 59 20 22 18 44 58 -3 79 134 108 -55 -67 -46 -16 1 -89 -67 6
5697 6 -19 -71 2 -63 -68 18 -62 -63 -41 49 24 65 -8 -57 59 -12 7 6 -37 -12 67 -27 -14 70 -47 -1 32 10 27 23 25 -29
5729 -29 3 -11 -77 -80 62 -37 56 32 71 -75 98 -26 -74 -36 -41 78 -26 -126 -38 61 63 -27 -2 -84 -68 -83 -55 85
5757 85 79 -86 139 -71 45 23 42 -22 57 29 -52 -8 -41 -21 41 16 63 107 -40 -26 78 72 35 -61 -9 12 -34 23
5785 23 101 -13 6 -48 -116 -81 65 -31 -69 12 -60 -27 -49 -3 -26 102 124 23 67 86 65 -51 97 115 -129 83
5811 83 23 60 -103 45 37 7 21 -10 30 -3 5 33 -1 29 1 32 -141 -17 -155 44 -22 -79 68 -89 -16 -19 44 118
5839 118 -44 15 165 -97 -45 -111 91 38 -36 7 -30 -4 -18 61 15 -17 -67 64 51 -20 -54 -7 8 27 -27 -54 90
5866 90 7 40 45 -56 -75 67 -48 -22 15 -10 -52 -53 -4 -35 4 57 -46 37 44 -48 21 59 -49 46 47 6 -29 -10 13 -84
5896 -84 -65 26 17 29 63 4 43 -101 15 31 47 10 -87 -93 -68 -65 -75 -82 36 27 13 83 -57 -22 11 50 106 -56 -84 -64
5926 -64 -10 55 48 -3 -115 50 46 32 127 -34 -20 -7 -49 47 33 -3 34 55 71 -62 4 -34 -8 12 -2 -20 -35 29 13
5955 13 66 -71 75 2 57 23 55 -74 -44 47 -98 -28 -5 -66 -83 41 -3 -3 22 -133 -6 47 -136 42 -93 -85
5981 -85 -25 119 -10 26 -48 61 65 99 76 -19 -39 52 -6 2 89 37 -51 -59 -14 -68 68 -52 -69 -65 1 -30 2 0 -103 -22
6011 -22 -72 18 23 1 18 5 115 19 -11 23 59 2 -73 80 -51 -10 -22 -97 14 4 -13 -17 79 -21 -2 23 -11 -78 138
6040 138 22 -5 -23 -100 -22 -112 -62 -2 121 74 -13 -9 6 -29 -45 79 -61 -40 34 102 -49 16 45 30 0 96 -8
6067 -8 -8 -3 79 59 -21 -35 8 -55 2 20 72 -57 24 -49 19 11 4 42 10 76 8 2 32 11 -51 47 -66 62 74 62 49 -55
6099 -55 17 92 -21 -38 -16 -22 -37 -6 99 91 -39 17 -60 -48 65 -41 -18 -34 16 -11 -58 -1 -69 -129 -25 -70 -68 -54 -39
6128 -39 60 -114 30 40 108 -39 -101 -23 27 -157 -39 21 -5 -48 -69 27 44 -35 -103 -51 46 -65 -30 16 -25 -29 -73 22
6156 22 70 129 27 -6 -30 64 -27 -6 -17 6 48 31 -50 42 -131 -7 83 15 -49 -66 0 130 -214 -119 -37 23 11 -37
6184 -37 -79 -2 9 -76 83 7 68 -51 -55 -32 -14 34 26 49 58 -4 -22 -14 -27 41 -54 54 36 -27 -40 -70 -18 -64 -34 -108 4
6215 4 27 58 42 5 62 -74 -52 -48 -23 40 -80 16 25 30 -88 127 32 27 -97 -48 -2 95 71 -63 -13 -23 -24 61 45 -3
6245 -3 -39 -34 125 103 6 30 -55 43 48 -33 90 31 24 -16 23 27 65 -88 -77 -38 8 36 -11 19 -34 58 57 -52 91 -7 -5
6276 -5 17 -22 64 64 -60 70 35 72 -121 57 22 86 -34 32 -61 3 8 -25 81 41 -87 -90 -65 2 -23 40 -47 4 -3
6305 -3 -80 7 -38 34 53 -10 -58 -78 -65 43 59 7 -21 52 3 88 -26 54 -25 1 -11 -59 15 -14 5 18 47 41 -15 -43
6335 -43 117 21 -124 -47 43 -79 10 -35 -45 4 -24 13 -54 16 -10 -17 7 51 -18 -93 -7 -66 -24 19 24 27 -3 8 28 39
6365 39 -12 -25 -63 46 -50 17 37 -20 34 -11 -138 55 100 60 25 15 -4 -62 -50 110 -23 -39 -96 -42 12 -23 -2 69
6393 69 -55 -37 3 96 -13 11 80 -14 -37 -39 0 -36 76 83 30 124 39 -35 101 7 -23 -17 -31 -78 13 -55 52 -48 -24
6422 -24 -12 18 -12 -43 49 -64 -52 -93 -62 50 6 23 52 -61 70 -67 -41 -27 -41 43 -86 -1 50 9 31 -38 14
6449 14 -45 47 5 16 62 -7 -11 -42 5 74 10 -92 55 51 63 -46 33 -43 -69 -65 -52 37 -17 -45 -91 23 9 13 10 46 -3
6480 -3 30 44 69 64 -3 -64 -35 15 120 -16 41 -25 -27 -51 -77 -72 26 -72 -32 -35 8 -34 -56 -30 -29 114 36 22 -9 41 50 16
6512 16 -83 27 24 -43 12 -29 -52 -19 -10 -42 -100 31 12 -104 7 9 125 24 -101 -132 24 -85 59 -85 53 14
6538 14 -62 -22 -25 36 -13 3 -98 61 83 -52 36 54 4 27 -2 -108 38 -17 -28 -42 36 -113 -8 79 -99 -34 81
6565 81 38 13 -44 2 -100 44 58 -70 -94 8 64 9 -81 25 19 -21 -47 32 8 18 77 50 -45 -67 64 -23 58 -20
6593 -20 77 8 -58 -125 -71 -27 -2 -63 68 -22 -90 3 52 36 -36 26 -8 29 -12 63 25 35 -67 35 -42 68 58 18
6621 18 -57 -14 -101 -101 -29 -103 -44 31 -4 54 -90 22 79 14 -73 -98 -2 -48 -1 72 34 -21 -39 -104 20 -4 -21 -51 -87
6650 -87 1 14 38 29 -41 139 -29 -20 107 -12 -31 -38 24 83 -59 -57 -23 -24 66 8 2 -18 17 62 64 37 41 -70 84 9 -53
6681 -53 -55 -13 -87 -20 54 8 -24 -120 -41 -144 15 29 -115 3 -73 -6 35 -18 25 -47 -43 71 -8 48 35 72 18 -5 6
6710 6 22 14 24 -15 -8 -90 -37 -55 -37 -6 76 -15 -14 -102 -10 104 44 35 -81 9 -118 -105 -13 74 14 -25 114 -46 72 -50
6740 -50 49 55 -13 27 66 20 -18 1 13 -15 3 -37 -24 -44 32 -46 -63 24 14 63 20 52 -22 65 -51 38 -7 35 25 -16
6770 -16 -66 23 44 -1 44 -102 -17 33 -39 74 25 65 -56 -61 -90 3 -53 15 37 28 -40 -35 40 -7 43 99 -120 -70 1 -6
6800 -6 57 -22 -18 -77 -21 82 2 83 -19 -39 -8 -43 -8 -30 25 13 -15 -59 12 -45 -66 -43 -7 -18 -113 12 86 -132 -33
6829 -33 -45 -88 -19 -12 89 4 -122 -14 -28 -40 122 36 -9 -24 -32 125 28 4 67 -50 115 -17 -16 105 13 39 -38
6856 -38 28 31 8 4 -39 -26 -42 -60 10 -26 14 39 -46 -36 -80 68 1 -31 43 9 59 16 -6 -20 58 -105 -26 31 56 30
6886 30 31 -1 -13 88 -51 1 -6 54 43 27 24 22 12 -29 -40 -42 -18 64 13 -74 24 10 48 -15 -44 57 38 0 89 48 -33
6917 -33 -39 77 69 -4 -30 53 -19 -38 -15 25 -30 115 59 0 15 -83 26 -39 27 7 -30 56 109 -86 14 5 34 -27 -22 -61
6947 -61 -51 -85 48 75 -30 9 1 75 -33 80 -4 -54 -59 44 -47 -49 61 -64 -26 34 -20 -61 -2 35 92 -15 14 17
6975 17 81 -49 48 21 33 58 -32 94 53 -10 16 61 20 -58 25 48 -28 67 57 -39 -38 -46 -37 -4 -43 -36 -26 -33 5 26 53 61
7007 61 21 -135 18 50 120 -21 72 11 -23 -2 30 -27 -13 -89 -29 8 22 -74 -67 -87 22 15 84 -112 -40 77 -33 -32
7035 -32 29 -16 100 108 111 65 63 33 61 -113 15 -52 -79 -42 127 25 -22 -29 -6 95 5 -9 48 -75 -75 -1 25 -83 47
7064 47 -122 13 10 40 31 13 120 69 200 4 -3 -75 136 27 -106 47 -17 7 -39 66 4 -54 60 -53 -3 63
7090 63 -10 -97 -49 48 134 -13 12 -1 -1 46 19 44 -50 -16 43 130 -7 -12 38 -19 12 4 7 32 -70 -3 -54 -12 86 -58
7120 -58 -82 30 -49 45 -120 -65 74 -78 -26 63 23 62 46 14 -8 0 33 -45 20 3 -73 77 44 93 -49 17 -18 -27
7148 -27 72 -75 -80 -87 -12 -19 48 132 43 -43 -78 25 -89 -91 -84 26 -16 -28 36 93 -36 45 17 2 29 11 67 14 -19 -26 -66
7179 -66 26 -25 -72 -12 69 88 44 -108 14 8 -81 11 71 42 -107 107 -26 -19 -41 29 -89 -36 -2 -3 -24 -92 -82 -67 -155
7208 -155 -45 76 6 -24 15 -133 0 -35 56 43 13 5 54 81 -69 54 -80 38 22 -33 4 -85 -117 14 -4 -20
7234 -20 39 133 17 53 31 45 -78 -13 69 68 23 117 -23 31 69 87 22 3 -147 -144 -7 141 -13 -2 9 90 -31
7261 -31 -24 36 -8 57 -87 -49 -79 34 21 116 -28 59 23 -45 18 -15 38 -41 -10 -94 2 34 -36 -61 14 73 24 -51 33
7290 33 12 -30 -10 -43 -87 52 1 28 -49 -68 -85 -15 77 -59 -16 -31 68 40 32 -89 0 -48 35 -18 16 -43 19 24 -23 -47
7320 -47 -53 23 78 -49 -56 -8 -62 57 -165 -63 -51 -36 -4 -106 6 -107 -22 -23 34 -23 140 -97 -36 5 53 19 67
7347 67 -143 10 17 3 -82 -87 9 39 -47 -42 26 124 48 -10 -4 30 3 -40 95 -76 -30 0 -15 46 41 59 -62 106 -3
7376 -3 -7 -58 -55 -111 -130 -70 -55 -48 -13 -49 -56 58 7 -2 11 72 -27 48 29 40 -64 64 24 25 5 -44 -4 -11 25 -32 111 -58
7408 -58 2 33 -32 73 56 65 -72 14 -13 47 -17 42 -48 -24 25 14 -33 -42 -37 -50 -69 -60 18 25 107 16 -35 -2 -13 57 -6 88
7440 88 26 10 -58 -111 37 40 53 -78 -50 94 38 32 86 -69 61 9 -12 -6 -13 -4 76 24 -73 -29 -35 14 -47 -44 69 15 -3
7471 -3 -28 43 -15 -6 13 -71 19 1 58 -47 -69 -39 -21 53 -51 29 54 -68 -79 -2 -33 25 79 -65 -9 -11 86 -32 100
7500 100 5 -13 -48 129 58 34 28 -10 89 -20 85 -71 -94 -38 34 57 -23 22 -6 -59 31 8 -39 87 -23 8 -6
7527 -6 84 32 28 33 16 83 120 27 -13 85 112 -51 -1 -24 -81 -24 3 21 -61 -4 -23 -78 -2 -40 33 12 -51 -40 -2 -37 -42 77
7559 77 38 8 -22 106 -48 102 -7 11 30 53 11 -73 42 -29 37 -52 82 77 -36 73 11 35 17 100 -88 36
7585 36 -80 43 -45 -126 -11 17 8 -185 -84 -66 26 48 -86 37 26 -6 4 -3 -32 -115 16 3 -40 -33 -73 -53 -83 38
7613 38 -68 -47 -69 7 67 -1 -61 15 19 -80 67 74 58 -73 -56 -70 8 -101 -69 -37 -86 -37 32 -23 -25 100 112 5 12
7642 12 71 29 2 -103 -62 100 23 49 84 84 13 21 -79 -9 -19 13 -12 -67 26 5 119 24 -62 -28 -9 125 83 37 63
7671 63 13 -26 2 -19 -32 -133 -61 -90 28 149 -76 -3 -143 33 -25 -108 60 70 6 16 -11 -44 -15 132 16 58
7697 58 -117 40 12 -16 74 -44 -41 -17 142 -53 67 3 18 29 -17 6 101 46 -15 -34 67 52 -84 -17 -70 43
7723 43 -42 -64 16 -11 -57 16 37 -48 60 -86 63 -3 -69 84 19 -10 26 45 -39 37 107 44 22 40 31 32 12 -30 22
7752 22 -5 24 -65 -19 -37 -93 35 73 -167 -41 87 9 -44 -46 -77 27 115 32 -34 32 57 -18 -15 35 79 27 66 15 -19
7781 -19 23 13 -63 53 -14 47 -34 -4 -6 61 32 -12 -56 36 4 -3 -56 -122 4 32 -41 -14 -19 9 -9 17 -38 3 140 21
7811 21 49 -65 37 -38 24 -106 60 -37 45 -40 -77 69 -54 -96 11 5 15 -108 -8 20 -16 95 52 -25 -4 30
7837 30 22 83 -11 32 32 19 -84 -56 18 7 -37 49 4 -99 -37 -6 92 -62 52 -86 -91 -76 12 8 31 -63 7 4 -26 -37
7867 -37 -77 89 104 2 21 21 -86 17 -13 97 2 -47 48 9 -26 -18 60 -118 84 -35 18 -45 -86 -13 -30 35 -72
7894 -72 -49 -65 106 78 27 -50 -13 -22 59 -17 -46 36 -14 -26 23 -37 4 -80 -91 -4 20 -7 38 8 2 83 -67 7 22 -77
7924 -77 57 19 79 1 -33 -83 14 2 -3 -44 20 12 62 -73 34 37 61 16 59 38 -8 34 22 31 -16 -37 105 42 7 89
7954 89 36 -52 119 37 -9 -21 6 76 -26 102 10 46 -6 43 -52 79 -51 -46 30 -64 88 -26 -64 52 23 -27 -53
7981 -53 34 -24 69 47 -56 38 9 48 5 -12 -91 -5 -63 28 -51 30 -81 86 46 10 -56 104 38 -49 -79 -116 -40 38
8009 38 13 -56 -27 -14 -43 75 41 -17 53 65 4 48 75 26 -96 -88 8 -25 55 -111 -13 -97 -61 -49 -32 12 -2 121 -44
8038 -44 33 21 -41 11 147 -30 131 -34 88 28 -62 31 -5 -47 5 111 43 7 -44 -15 -45 59 -79 -6 -35 -27 -13
8065 -13 16 -85 -51 -13 -13 19 17 -35 -50 29 -8 -95 67 12 -37 -48 -45 56 44 11 -28 0 51 56 33 68 -32 -43 56 3
8095 3 28 -82 55 36 -9 12 8 -2 -10 -55 26 68 70 -24 -23 -17 -66 -25 -44 45 -131 -110 -1 -26 43 39 66 -31 -88 -74 63
8126 63 6 -32 26 -44 -116 99 85 -3 7 75 23 -51 42 -53 -78 15 57 -27 -52 -25 60 -87 -43 17 46 0 -8 25 -65 74
8156 74 -20 0 -24 -73 -59 23 79 -50 -1 -62 -31 -74 61 -8 -21 7 -1 12 58 -1 52 2 152 78 -84 -83 3 119 -108
8185 -108 12 -62 -1 -6 29 -23
8191b3
##END NTUPLES=NMR FID
##END=
